##TITLE=1H_Pr 37-20g
 200.13Hz, CDCl3.
 8 sc
 
19.3.2026
##JCAMPDX= 6.0         $$ Bruker NMR JCAMP-DX V2.0
##DATA TYPE= NMR FID
##DATA CLASS= NTUPLES
##ORIGIN= UXNMR, Bruker Analytische Messtechnik GmbH
##OWNER= pz
$$ XWIN-NMR		Version 3.5
$$ Thu Mar 19 15:34:35 2026 Russian Standard Time (UT+4h)  she@DPX200
##.OBSERVE FREQUENCY= 200.1313
##.OBSERVE NUCLEUS= ^1H
##.DELAY= (6, 6)
##.ACQUISITION MODE= SIMULTANEOUS
##.ACQUISITION SCHEME= undefined
##.AVERAGES= 8
##.DIGITISER RES= 18
##SPECTROMETER/DATA SYSTEM= spect
##.PULSE SEQUENCE= zg30
##.SOLVENT NAME= CDCl3
##.SHIFT REFERENCE= (INTERNAL, CDCl3, 0, 14.3821)
##AUDIT TRAIL= $$ (NUMBER, WHEN, WHO, WHERE, WHAT)
$$ ##TITLE= Audit trail, XWIN-NMR		Version 3.5
$$ ##JCAMPDX= 5.01
$$ ##ORIGIN= Bruker BioSpin GmbH
$$ ##OWNER= she
$$ F:/spectra/data/she/nmr/H-C/1/audita.txt
$$ ##AUDIT TRAIL=  $$ (NUMBER, WHEN, WHO, WHERE, WHAT)
(   1,<2026-03-19 15:33:16.90 +0400>,<she>,<DPX200>,
      <created by zg, POWCHK disabled, PULCHK disabled
       configuration hash MD5:
       00 E9 B6 7A A2 85 ED C7 34 08 36 98 17 FE 4E 26
       data hash MD5: 16K
       7F F6 6F 46 DA FC F6 EC A6 54 1A 4F E0 05 55 54>)
$$ ##END=
$$ 
$$ hash MD5
$$ AC F3 7B 25 39 34 6F 14 32 49 7A DD 0B 68 D3 4C
##$RELAX= 
##$RELAX= 
##$RELAX= 
##$RELAX= 
##$RELAX= 
##$RELAX= 
$$ Bruker specific parameters
$$ --------------------------
##$DU= <F:/spectra>
##$EXPNO= 1
##$NAME= <H-C>
##$PROCNO= 1
##$TYPE= <nmr>
##$USER= <she>
##$AMP= (0..31)
100 100 100 100 100 100 100 100 100 100 100 100 100 100 100 100 100 100 
100 100 100 100 100 100 100 100 100 100 100 100 100 100 
##$AQSEQ= 0
##$AQ_mod= 1
##$AUNM= <au_zg>
##$AUTOPOS= <>
##$BF1= 200.13
##$BF2= 200.13
##$BF3= 200.13
##$BF4= 200.13
##$BF5= 200.13
##$BF6= 200.13
##$BF7= 200.13
##$BF8= 200.13
##$BYTORDA= 1
##$CFDGTYP= 0
##$CFRGTYP= 5
##$CHEMSTR= <none>
##$CNST= (0..31)
1 1 145 1 1 1 1 1 1 1 1 1 1 1 1 1 1 1 1 1 1 1 1 1 1 1 1 1 1 1 1 1 
##$CPDPRG= <>
##$CPDPRG1= <>
##$CPDPRG2= <>
##$CPDPRG3= <>
##$CPDPRG4= <mlev>
##$CPDPRG5= <mlev>
##$CPDPRG6= <mlev>
##$CPDPRG7= <mlev>
##$CPDPRG8= <mlev>
##$CPDPRGB= <>
##$CPDPRGT= <>
##$D= (0..31)
0 0.7 0 0 0 0 0 0 0 0 0 0.03 0 0 0 0 0 0 0 0 0 0 0 0 0 0 0 0 0 0 0 0 
##$DATE= 1773919996
##$DBL= (0..7)
120 120 120 120 120 120 120 120 
##$DBP= (0..7)
150 150 150 150 150 150 150 150 
##$DBP07= 0
##$DBPNAM0= <>
##$DBPNAM1= <>
##$DBPNAM2= <>
##$DBPNAM3= <>
##$DBPNAM4= <>
##$DBPNAM5= <>
##$DBPNAM6= <>
##$DBPNAM7= <>
##$DBPOAL= (0..7)
0.5 0.5 0.5 0.5 0.5 0.5 0.5 0.5 
##$DBPOFFS= (0..7)
0 0 0 0 0 0 0 0 
##$DE= 6
##$DECBNUC= <off>
##$DECIM= 32
##$DECNUC= <off>
##$DECSTAT= 4
##$DIGMOD= 1
##$DIGTYP= 9
##$DL= (0..7)
0 120 120 120 120 120 120 120 
##$DP= (0..7)
150 150 150 150 150 150 150 150 
##$DP07= 0
##$DPNAME0= <>
##$DPNAME1= <>
##$DPNAME2= <>
##$DPNAME3= <>
##$DPNAME4= <>
##$DPNAME5= <>
##$DPNAME6= <>
##$DPNAME7= <>
##$DPOAL= (0..7)
0.5 0.5 0.5 0.5 0.5 0.5 0.5 0.5 
##$DPOFFS= (0..7)
0 0 0 0 0 0 0 0 
##$DQDMODE= 0
##$DR= 18
##$DS= 0
##$DSLIST= <SSSSSSSSSSSSSSS>
$$ [...]
##$SUBNAM0= <"">
##$SUBNAM1= <"">
##$SUBNAM2= <"">
##$SUBNAM3= <"">
##$SUBNAM4= <"">
##$SUBNAM5= <"">
##$SUBNAM6= <"">
##$SUBNAM7= <"">
##$SUBNAM8= <"">
##$SUBNAM9= <"">
##$SW= 18.0517328524113
##$SWIBOX= (0..15)
0 0 2 0 0 0 0 0 0 0 0 0 0 0 0 0 
##$SW_h= 3612.71676300578
##$TD= 16384
##$TD0= 1
##$TE= 0
##$TE2= 300
##$TE3= 300
##$TEG= 300
##$TL= (0..7)
0 120 120 120 120 120 120 120 
##$TP= (0..7)
150 150 150 150 150 150 150 150 
##$TP07= 0
##$TPNAME0= <>
##$TPNAME1= <>
##$TPNAME2= <>
##$TPNAME3= <>
##$TPNAME4= <>
##$TPNAME5= <>
##$TPNAME6= <>
##$TPNAME7= <>
##$TPOAL= (0..7)
0.5 0.5 0.5 0.5 0.5 0.5 0.5 0.5 
##$TPOFFS= (0..7)
0 0 0 0 0 0 0 0 
##$TUNHIN= 0
##$TUNHOUT= 0
##$TUNXOUT= 0
##$USERA1= <user>
##$USERA2= <user>
##$USERA3= <user>
##$USERA4= <user>
##$USERA5= <user>
##$V9= 5
##$VALIST= <valist>
##$VCLIST= <CCCCCCCCCCCCCCC>
##$VD= 0
##$VDLIST= <DDDDDDDDDDDDDDD>
##$VPLIST= <PPPPPPPPPPPPPPP>
##$VTLIST= <TTTTTTTTTTTTTTT>
##$WBST= 1024
##$WBSW= 4
##$XGAIN= (0..3)
0 0 0 0 
##$XL= 0
##$YL= 0
##$YMAX_a= 95413
##$YMIN_a= -83589
##$ZGOPTNS= <>
##$ZL1= 120
##$ZL2= 120
##$ZL3= 120
##$ZL4= 120
##$ABSF1= 10
##$ABSF2= 0
##$ABSG= 5
##$ABSL= 3
##$ALPHA= 0
##$AQORDER= 0
##$ASSFAC= 0
##$ASSFACI= 0
##$ASSFACX= 0
##$ASSWID= 0
##$AUNMP= <proc_1d>
##$AZFE= 0.1
##$AZFW= 0.1
##$BCFW= 1
##$BC_mod= 2
##$BYTORDP= 1
##$COROFFS= 0
##$CY= -3
##$DATMOD= 1
##$DC= 2
##$DFILT= <>
##$DTYPP= 0
##$F1P= 0
##$F2P= 0
##$FCOR= 0.5
##$FTSIZE= 0
##$FT_mod= 4
##$GAMMA= 1
##$GB= 0.15
##$INTBC= 1
##$INTSCL= 1
##$ISEN= 128
##$LB= 0.25
##$LEV0= 0
##$LPBIN= 0
##$MAXI= 10000
##$MC2= 0
##$MEAN= 0
##$ME_mod= 0
##$MI= 1.114404
##$NCOEF= 0
##$NC_proc= 0
##$NLEV= 6
##$NOISF1= 3.799351
##$NOISF2= 2.8
##$NSP= 1
##$NTH_PI= 0
##$NZP= 0
##$OFFSET= 14.38212
##$PC= 1
##$PHC0= -3864.438
##$PHC1= 11.5923
##$PH_mod= 1
##$PKNL= yes
##$PPARMOD= 0
##$PSCAL= 0
##$PSIGN= 0
##$REVERSE= no
##$SF= 200.129724274929
##$SI= 16384
##$SIGF1= 3
##$SIGF2= 2
##$SINO= 400
##$SIOLD= 16384
##$SREGLST= <1H.CDCl3>
##$SSB= 0
##$STSI= 0
##$STSR= 0
##$SW_p= 3205.1282051282
##$SYMM= 0
##$S_DEV= 0
##$TDeff= 0
##$TDoff= 0
##$TI= <>
##$TILT= no
##$TM1= 0
##$TM2= 0
##$TOPLEV= 0
##$USERP1= <user>
##$USERP2= <user>
##$USERP3= <user>
##$USERP4= <user>
##$USERP5= <user>
##$WDW= 1
##$XDIM= 8192
##$YMAX_p= 0
##$YMIN_p= 0
$$ End of Bruker specific parameters
$$ ---------------------------------
##NTUPLES= NMR FID
##VAR_NAME=  TIME,          FID/REAL,        FID/IMAG
##SYMBOL=    X,             R,               I
##VAR_TYPE=  INDEPENDENT,   DEPENDENT,       DEPENDENT
##VAR_FORM=  AFFN,          ASDF,            ASDF
##VAR_DIM=   8192,          8192,            8192
##UNITS=     SECONDS,       ARBITRARY UNITS, ARBITRARY UNITS
##FACTOR=    0.0002768,     1,               1
##FIRST=     0,             0,               0
##LAST=      2.2672688,     0,               0
##MIN=       0,             -83589,          0
##MAX=       2.2672688,     95413,           0
$$ Real data points
##PAGE= N=1
##DATA TABLE= (X++(R..R)), XYDATA
$$ [...]
1346a031q36R57N56q78O07J169j92J23J42P32M42j179p6J148p62r40j54L4J85
1365D7j130n09J083l15j045R14P44M7j66p1J341L82p43L48L20j66Ml88l68P4p33
1386c30n5m2q91Q0K63j53L91j03L0P15K71L30M72m36J77Q37k42m12n07p5O51r31
1408D0j045L50l1k71m4l53M62K27m12R29N55k41K36K17O06L33r77r3Q75n17n31
1429C15n23l10M32n49q17M10J23k49K70J55O66O5l66R19P68m44j74R9N24L69j197
1450D86o49N60k07m96n27l78M56j70m50P13o5M6N06J99O21J92n63N14R55l74o43
1471G26o14M06N54j087j269Q24M5k01p70j51J062J10q88Q74R39k65j6K67Q47L67
1491A760j484J24J074l56j138n44L29O68j404r89J443M8q62J06O27Q83l02o54
$$ plain form
1346 -1031 -1867 -910 -354 -1232 -625 544 352 475 617 1349 1791 612 536 1684 922 -18 -172 -138 47
1365 47 -1083 -1592 -509 -824 -1869 -955 -211 -164 -330 -401 940 1322 579 927 1247 1081 1085 697 329 403 -330
1386 -330 -385 -427 -1318 -1238 -975 -1128 -737 -840 -810 -95 176 506 978 542 719 1556 1314 902 395 320 971 40
1408 40 -1005 -655 -686 -957 -1001 -1354 -892 -665 -1077 -148 407 166 402 619 1225 1558 581 488 1363 846 315
1429 315 -208 -518 -86 -635 -1452 -1042 -919 -1168 -898 -743 -77 -12 -378 541 1309 865 691 790 1314 1683 486
1450 486 -163 397 190 -306 -833 -1211 -755 -925 -1375 -662 -727 -681 -175 24 645 837 274 788 1743 1369 726
1471 726 112 518 1072 -15 -1284 -460 -415 -616 -1386 -1537 -475 -365 -1253 -379 560 295 279 546 1393 1760
1491 1760 276 400 1474 1118 -20 -564 -235 433 -971 -1960 -517 -469 -1331 -1225 -598 285 -17 -671
1509f71J491Q89j149j69O35L52l3j178j01M37n68n58o7m07M50l96n23J093J72
1528c01m64L60O43O05J2o45P85P79p58n15j51L39K67j297q23Q29O5r48l29N07
1548a040Q21n58n53J442P24j029K39J140M54m45r95Q16N95j417o24M42J88m82
1566b82j087J64R20o28o51P85P49r8j92K60J167k05o42P78K70l55j98k18r5j27
1586C15p47k11J37m25mr0j56P75p2j15O04N9O91K35o46M56P15n77l76k53L74p5
1608F14j198j97Q05p15o76M40K42K13n99K13J374j96o19Q57O02l1m52k75Q62n6
1628A208j495L80M41p23o59l1L02R3j052N26R17n04M2N85L23L43m3R0N93n13l16
1649E07L26l14k10k02l84n8k34n17N03j97n19P41L56j11N8K44Q26N2p11P48O33
$$ plain form
1509 -671 820 1709 560 391 1026 1378 1345 167 66 503 -65 -623 -690 -1097 -647 -1043 -1566 -473 -301
1528 -301 -765 -405 238 843 855 210 995 1774 1016 501 350 689 956 -341 -1164 -335 -270 -1218 -1547 -1040
1548 -1040 -219 -777 -1330 112 836 -193 46 1186 1640 1195 200 1016 1611 194 -430 12 200 -282
1566 -282 -1369 -1205 -285 -913 -1564 -779 -30 -128 -320 -60 1107 902 260 1038 1308 953 755 537 442 315
1586 315 -432 -643 -506 -931 -935 -1025 -1181 -406 -478 -593 11 70 761 996 350 806 1521 944 568 315 689 614
1608 614 -584 -781 24 -691 -1367 -927 -685 -472 -1071 -858 516 320 -299 558 1160 1129 677 402 1264 1208
1628 1208 -287 93 534 -189 -848 -879 -577 -484 -1536 -1010 -93 -597 -555 30 353 696 653 743 1336 823 507
1649 507 833 519 309 107 -277 -335 -569 -1086 -583 -780 -1299 -558 -202 -313 -255 -11 815 867 156 904 1537
1670A537q82k58L12N4p26o78M15K90j088k28P03k1l03j21M89R12l69k46R48L12
1690A052m92K19K18J87n13o81M08N4j159p7K63k31j39k63M08L83m78M90O57j85
1710A21K40L50J26R8l34K16K30o80k91J87m60m13j68L4J08m51m5Q55k6m17N44
1731a76O57L49l85L5Q04j04r03M28L9l91k79m40K81k23r77J77P45m70n4K17M05
1752b65M95l45L29R33m90n7M38j32j49k98l50L25m57o37K94k31m30J62q8K26J97
1773e30j52P54J64k86N33N04k28m9p1L15or14ML67p12m76K82j29n3l56J69P55
1795a15l58k14Q63K75M7R6J4N36k02n86M58j40o66o0l12j10q4m16J88J13m60N46
1817e87L62k25L23L08K77L13l34M09L60n91k04L02k44m33n04J18K60q09m33Q22
$$ plain form
1670 1537 655 397 709 763 37 -641 -226 64 -1024 -1252 -549 -570 -873 -994 -505 407 38 -208 740 1052
1690 1052 560 779 997 1184 671 -10 398 452 -707 -784 -521 -752 -891 -1154 -746 -363 -841 -351 306 121
1710 121 361 711 837 935 601 817 1047 367 76 263 -197 -610 -778 -744 -636 -1087 -1132 -277 -303 -720 -176
1731 -176 481 830 445 480 1284 1180 277 705 744 353 74 -366 -85 -308 -1285 -1108 -363 -833 -887 -670 -265
1752 -265 230 -115 214 1147 657 600 1038 906 757 459 109 434 -23 -660 -366 -597 -1027 -865 -953 -727 -530
1773 -530 -682 72 236 -50 483 987 759 710 639 954 948 34 38 405 -307 -783 -501 -630 -683 -1039 -870 -115
1795 -115 -473 -687 176 451 498 594 608 1144 942 356 814 674 8 -52 -364 -474 -558 -974 -786 -673 -1133 -587
1817 -587 -225 -450 -127 181 458 771 437 846 1206 615 411 713 469 36 -468 -350 -90 -899 -1332 -510
1837e10J40n74K05L50P50l19j70Q79M25o73K0L31J42n01o05L27J31r03j31K63
1857d23k47j41k38K97M56k44M4P51j61K99K16J03J95o1l68K29l52l37K85n72m46
1878g15K51lk07l67P1Q81j95m82P96M96j81J13n0Q53k23q47M16M12q04n44qJ97
1900a40l5q72m8R83n40l80N69L25K85j30o4J009M4p61P19k08q4j35m33R2po23
1922d34j86M5l35K19k1k14O05M3Q4K40J01N08J85l75K44L04m23j00l30O7J57j067
1944f83j57P01l52n34R0K30M44k63j12J002J34k73K66K98J65j80m68M85n3o20
1964A20k73K7k81J16n82%M53k83j7R4L42M54o5M5P16Q1m72J59O3Jjp58oK42o32
1989d57k40k4O7K26m72J03O09O5j38K75M11J64jj54M53k5m27m2o3j40j75m82J21
$$ plain form
1837 -510 -370 -944 -739 -389 361 42 -128 751 1176 503 523 854 996 495 -110 217 348 -555 -686 -423
1857 -423 -670 -811 -1049 -752 -296 -540 -496 255 94 393 609 712 907 846 478 707 355 18 303 -269 -715
1878 -715 -464 -467 -674 -1041 -970 -89 -284 -766 30 526 345 458 408 1261 1038 191 607 1019 215 -329 -337 -140
1900 -140 -175 -1047 -1095 -112 -652 -1032 -463 -138 147 17 -47 962 1006 245 964 756 672 537 104 196 189 -434
1922 -434 -620 -575 -910 -691 -712 -926 -321 -278 -194 46 147 655 840 465 709 1013 590 490 160 227 384 -683
1944 -683 -840 -139 -491 -1025 -935 -705 -261 -524 -636 366 500 227 493 791 956 776 308 793 740 120
1964 120 -153 -126 -407 -291 -873 -873 -420 -703 -720 -626 -284 170 105 150 866 947 475 634 697 698 697 -61 -67 175 -457
1989 -457 -697 -721 -654 -428 -900 -797 -188 -123 -261 14 425 589 588 434 887 862 435 393 330 190 15 -467 -346
2012c46k9n15J54j8M5L67l2j56Q20q6R7M29j62K70k8n88K51O5l48k49r7k20J24
2035b52o52M4O24l15j98K39L74N36l00p4Q22j90l79L68K19j64k98n06L24j48p70
2056f96K23J61m96L6j8L13K18j45K49M63o0R4K67j9K11j70k25K59m51l13L41o84
2078d42k26J87l9j42P%N23q3k82P72K92k74K34O3L43r7o74M71J33o77l35K8J1
2101b07k41n72L54M41n46j33R30j2j65J77L86N03m94PM81k84l29J21j08j54k74
2122a19l63K36k42m32K71Q7K0J71RM28J40j51O51J94m48O9L42k28l00m10M23j29
2144B19q75N4M77n12k91J83L88J28m78L77Q15j60j50L84K67kl18j80M37l12p92
2165c41L81Nm12j06k45L31L6p57O32O20n17K72N31o4J84j82M10J88n93m0K70n56
$$ plain form
2012 -346 -375 -890 -736 -754 -709 -342 -374 -530 290 204 301 730 568 838 810 222 473 538 190 -59 -156 -376 -252
2035 -252 -904 -860 -236 -551 -749 -510 -136 400 100 26 848 658 279 647 866 702 404 -102 222 74 -696
2056 -696 -473 -312 -808 -772 -790 -477 -259 -404 -155 308 248 342 609 590 801 631 406 665 214 -99 242 -442
2078 -442 -668 -481 -520 -662 -655 -655 -132 -215 -497 275 567 293 527 590 933 836 162 633 766 89 -246 -218 -207
2101 -207 -448 -1020 -666 -225 -771 -904 26 14 -151 26 412 915 421 428 909 625 296 417 309 155 -119
2122 -119 -482 -246 -488 -920 -649 -562 -542 -371 -362 66 206 55 706 900 452 521 863 635 335 -75 348 219
2144 219 -656 -602 -125 -637 -928 -745 -357 -229 -707 -330 485 325 175 559 826 824 506 326 763 451 -341
2165 -341 40 45 -367 -473 -718 -387 -351 -1108 -476 144 -373 -101 430 366 550 368 778 966 373 333 603 47
2187D7k55L8j16N1n49K4N27l83k46P88n3p9K17J86O36k75m04O66K22q99j1L17
2209D49k61l16n74L72J52o31n5O10r6j06r6O11M12n19J80Q25k64l23K00P9n5n31
2231F3j93L78n62l87L53j39o1k37J85L95j8k51O05L11l66L93L23j06j30l52L69
2252E73J59r22J0L48m07m09rK13Q2m48K56O88k60j45M96K26P8k09Q2O00m52n29
2274B1M89j37m08k01k0J47l13l97M53P0l33J60L72J71Q4q6L78K44n00K61L17k97
2296D75l48J36j1j10o43j8L80m82l22N12J68j18m1J34P19l16k37P89N6l23q8J49
2318D61J34k89n70M08r8p42J47K15p7r9l69N66M59m96K04N61k1j19O1K48M6k77
2340C53j24L07l45m29K50j81k24k8j84L59l01j32N50N5n7K30L22j18K66k59N20
$$ plain form
2187 47 -208 -170 -286 -235 -784 -760 -233 -616 -862 -74 -127 -206 11 197 833 558 154 820 1042 143 132 449
2209 449 188 -128 -702 -330 -178 -809 -864 -254 -350 -456 -552 59 471 -48 132 957 693 370 570 649 594 63
2231 63 -130 248 -314 -701 -348 -487 -548 -785 -600 -205 -223 -474 131 442 76 469 792 686 556 204 573
2252 573 732 -190 -180 168 -239 -648 -657 -444 -362 -810 -554 134 -126 -271 225 451 529 320 402 1002 550 21
2274 21 510 373 -35 -236 -256 -109 -422 -819 -366 -296 -629 -469 -97 74 158 72 450 694 194 455 772 475
2296 475 127 263 252 142 -501 -519 -139 -621 -943 -431 -263 -381 -422 -288 431 115 -122 667 723 400 312 461
2318 461 595 306 -264 144 46 -696 -549 -334 -411 -510 -879 -313 146 -350 -146 415 394 275 336 584 630 353
2340 353 229 536 191 -238 12 -169 -393 -421 -605 -246 -547 -679 -129 -74 -131 99 421 303 569 310 830
2361H30q7o64L15nl97k18k04J93r6n26K25L78k61m0K85J68L89k27N5N78q3l41
2383B67K68P4j64j90k31J49q2o69K24m2k89J68k2J94K29m5J77M05r4J78J56k52
2405D09J50o1j92Ok18j62Q7m47j07K44k34j10P1J36K97j13m6P14j16JJ00N9J86
2428F54j83k71J52o2m38j10O3j22j09l02K67K88l89O6L87J47J76p6J13L72l30
2449B93LL62k67r1j56j18J9k75j52M4j33k9J18j14Q2N65m32L81L08j33J66rn0
2472C82K26l18n3J53k96j31j25k88P7K3k84K45j11J70J76j09J65M76r7O3O2n0
2494C56J02j05j86K79k72l50J06j43Qk73j62J41K35k40J44L79j13J96J77j4L64
2515F29l51J63Q4j63n4p9j30j09k37k96K67n7j63K09k57L30PK0L62J60j18K65
$$ plain form
2361 830 743 79 394 389 -8 -226 -430 -237 -333 -859 -634 -256 -517 -557 -272 -104 285 58 113 691 608 267
2383 267 535 609 445 255 24 173 91 -578 -354 -396 -685 -517 -539 -345 -116 -161 16 421 327 505 661 409
2405 409 559 498 306 312 94 -68 19 -428 -535 -291 -525 -635 -564 -428 -131 -244 -290 424 308 309 409 468 654
2428 654 471 200 352 290 -148 -258 -195 -317 -426 -728 -461 -173 -562 -496 -109 38 214 138 251 623 293
2449 293 296 658 391 300 144 26 45 -230 -382 -338 -471 -500 -382 -496 -414 151 -281 100 408 275 441 432 382
2472 382 608 290 237 390 94 -37 -162 -450 -373 -350 -634 -389 -500 -330 -154 -263 -98 378 281 344 406 356
2494 356 458 353 167 446 174 -176 -70 -213 -205 -478 -640 -499 -264 -504 -360 19 -94 102 279 265 629
2515 629 278 441 525 362 308 229 99 -10 -247 -543 -276 -333 -496 -287 -544 -214 -207 -187 175 335 217 482
2537D82L8j38K58l81pP9j92k97R6l63r5Q1K2O1k7j67M06J82o2K83J6J31Qk4K49
2562F39j72m78K99o7l97J20k38l2n6l23K33J39j23R0K77O4J58N8J57K10k14J19
2584D63P8j84j24O4l25n0k01M3J6k55j52K70Q7O3JJ46L44j33l9M01J26l09R5N1
2608D76k32k3m35J65J31m69p9J71j20qj55K33L40j00o5M79J3j0J60p5K07j80k51
2631A73J97q4m38Kq9p9Ql34L08K67m38L64J49k37L00L04r0J42j56K96k1m33R5
2654B06N9k99j59j5j15P8k00o3L51j32k3RL35J88r6l6M44J1m79L90J01l26k5j92
2678A2Q8j42n06J56K12j55k51L15J32J3j11L16J87Oj32L22o3r5q8oO0j84j91J08
2702Ck04j99O2n9P7M2r4K72J16r4L43O6j55M8J50J19r3l28J29J61n76q9J14M3
$$ plain form
2537 482 520 382 640 259 252 331 139 -158 -62 -425 -520 -439 -417 -356 -383 -550 -144 38 -24 259 275 406 414 390 639
2562 639 467 -11 288 221 -176 -56 -294 -326 -382 -705 -472 -333 -456 -366 -89 -25 133 191 348 558 344 463
2584 463 541 357 233 297 -28 -78 -279 -236 -220 -475 -627 -357 -270 -207 -206 -60 284 151 112 513 639 330 425 476
2608 476 244 221 -214 -49 82 -387 -466 -295 -415 -423 -578 -345 -5 -105 -170 309 322 312 472 397 604 424 173
2631 173 370 286 -152 -150 -239 -318 -310 -644 -336 -69 -507 -143 6 -231 69 373 283 425 269 565 544 111 206
2654 206 265 -34 -193 -208 -323 -245 -445 -508 -157 -289 -312 -303 32 220 124 88 532 543 64 454 555 229 204 12
2678 12 100 -42 -548 -392 -180 -335 -586 -271 -139 -126 -237 79 266 272 140 462 399 304 216 210 270 86 -105 3
2702 3 -201 -400 -338 -397 -320 -278 -372 -100 16 -78 265 331 176 224 374 493 400 72 201 362 -214 -303 -189 -146
2726a46j72k30J44L41n02P2M59J04K0L8K10K89l58l70O44q7l13j17n4K07m46k03
2748d70K14L9l07J30J84k7R9QK51K05k93L53R6j66J73j38J1k00j93n1J66l52j7
2771b85O3j29j48J40J61J20j47R1M69k32l3K04J99j22Nk95L76l50l90K42J21m18
2793c58j29J46J35j8k87K40N04k20j39L23J68P5k85J44K33k96j14P3j0k50j04
2814a69j85M9j33K0J07J44k15L08K00p5R3J10J10j13NJ01j9k17n3o8r4q8j29Q
2838c03J83k81j25M50n8r1P6J38L85j65l1K33j0r6k19K77q1k77j57K56j45m70
2860e11J36J70j4j23lK97R4j07j8L24N0J24j77P6J83k78o3O7k50o0l8j70lo4L1
2885c27J08j14J5M10m1L4L33k02J04Jj90L04j94k33K51j51j57k14n5J63j01k53
$$ plain form
2726 -146 -318 -548 -404 -63 -565 -493 -34 70 90 128 338 627 269 -101 543 456 143 26 -28 179 -267 -470
2748 -470 -256 -217 -524 -394 -210 -237 -138 -130 121 326 33 386 482 316 489 351 362 162 -31 -82 84 -268 -285
2771 -285 -222 -351 -499 -359 -198 -78 -225 -134 335 103 70 274 473 351 356 61 437 87 -303 -61 60 -358
2793 -358 -487 -341 -206 -224 -511 -271 233 13 -126 197 365 440 155 299 532 236 122 195 185 -65 -169
2814 -169 -354 -305 -438 -418 -311 -167 -382 -74 126 51 144 254 364 251 256 357 338 121 68 0 -94 -182 -311 -303
2838 -303 -120 -401 -526 -76 -134 -225 -149 -11 374 209 178 411 401 305 86 363 282 5 -152 104 -41 -511
2860 -511 -375 -205 -219 -342 -345 -48 46 -61 -79 245 295 419 242 318 501 223 160 227 -23 -83 -121 -291 -294 -358 -327
2885 -327 -219 -333 -318 92 51 85 418 216 320 321 131 435 241 8 259 108 -49 -263 -318 -155 -256 -509
2907e09J92K56k68J05J34K78J2j77J92L38l24m9J91r7p2k65N3R5k79k82K49l3
2929b60p3R7q8J27J42nP7K46p0J22Q3j45J21j89mK1j94k6o6j82m7M7j00J60j8
2954b24J2L08l18J77K43n9K0K08j9j6k33P1J15k08j78o1N6j49j81k6J63O8r4K60
2978f5R3K8J0P5K08L4j38J37m5j15j62j22Q1j3k49j25R5j2o6L7K4J58J5k4J93
3003E2J31q0K30p3J4J34k12q4n0j11q3J15l04J30j66P9J11j7o3K16m8K20P9j37
3027H3K41N3k07J39j09j52J63k33j45J91l54N0m6j08K33m6k3J80M5nK43K8J07
3050C28n3j20J12K4k12K3m8j83J8j12oqj12J51o3RJ26J84m7J98k0mL4P1p3O5j30
3077A52m2K2k50J6n3j18J46j91N1K4L6OR7MJ21J77r4K30K7j80R7j6k44P5p9Rj19
$$ plain form
2907 -509 -317 -61 -329 -224 -90 188 200 23 215 553 229 180 371 274 202 -63 -10 85 -194 -476 -227 -260
2929 -260 -333 -236 -324 -197 -55 -60 17 263 193 315 398 253 374 185 181 202 8 -18 -84 -266 -313 -266 -366 -206 -224
2954 -224 -212 96 -222 -45 198 139 159 367 348 332 99 170 285 77 -101 -162 -106 -255 -436 -462 -299 -231 -325 -65
2978 -65 28 56 66 141 349 383 245 382 337 222 60 -62 19 6 -243 -368 -273 -285 -351 -314 -290 -132 -117 -141 52
3003 52 183 103 333 260 274 408 196 112 62 -49 -132 -17 -321 -191 -357 -278 -167 -184 -247 -31 -79 141 220 83
3027 83 324 377 170 309 200 48 211 -22 -167 24 -330 -280 -326 -434 -201 -247 -270 -90 -45 -50 193 221 328
3050 328 275 155 267 291 79 102 54 -129 -111 -223 -229 -237 -349 -198 -261 -252 -126 58 11 209 189 185 219 290 217 282 152
3077 152 110 132 -118 -102 -155 -273 -127 -318 -267 -243 -207 -201 -104 -100 21 198 104 334 361 181 278 262 18 93 14 23 -96
3104i6j35p0Q0j09J01P7oJ05j2J8J86j24J76J37k13K17r6j95J92j79k21O1m7p3
3128b26m2n9O7O4o8J88o2J82P1J49k35J49P6Nm3o2jr5j13l2j3k04J78j03j8O5
3154a82L8K2J67j30Q0J54K6P6K0r0K33k31k00K14j70q6q6r6Q1j19j42L21j43K5
3178b18K47m7R9N1O6Q7kj02J48r0j60q7P7k94J79j02J4lk58M7L15k47J19J45J15
3203I9K24k68J70K11q5k02L8p9J04k20o8J6j55m3J30j20m8R4m0J44J19j30J71
3226F2J39p1J15K1Nk7q7nk7j28m5Mj62o2J07p1R5L7j39K46M2j00J30M0k4J68L
3253B66M1j44k20K52r1l08J28p9n4l2j37J81J27j69P5K10r3P6R2P5O2k27K33L7
3277C01l43O9J17r6j34m5q9Q5n8j10J05P1n4J21OJ51J25j76J69N2j69j7J63j16
$$ plain form
3104 -96 -231 -301 -221 -330 -229 -152 -158 -53 -65 -47 139 15 191 328 115 332 236 41 233 54 -167 -106 -153 -226
3128 -226 -268 -327 -260 -196 -264 -76 -138 44 115 264 29 178 254 259 216 154 153 58 -55 -87 -100 -304 -126 -229 -247 -182
3154 -182 -144 -122 45 -85 -5 149 175 251 271 181 414 183 -17 197 27 -59 -145 -241 -160 -279 -421 -100 -243 -218
3178 -218 29 -18 81 132 198 285 283 181 329 239 79 -8 69 -225 -46 -148 -134 -137 -395 -348 -33 -280 -161 -16 99
3203 99 323 55 225 436 351 149 187 108 212 -8 -76 -60 -215 -258 -128 -248 -296 -202 -242 -98 21 -109 62
3226 62 201 130 245 266 271 244 157 152 125 -3 -48 -44 -206 -268 -161 -232 -137 -100 -239 7 49 -51 79 119 95 263 266
3253 266 307 163 -57 195 104 -204 -76 -155 -209 -241 -378 -197 -70 -239 -164 46 -47 29 121 196 258 31 264 301
3277 301 -42 27 144 48 -86 -131 -220 -135 -193 -303 -198 -127 -181 -60 -54 97 222 46 215 267 98 81 244 128
3301A28K6k32q3J19j90j11J34p5P7J28l3Q0J8J13%O2Q4NJ8o1nq5J75m68m8K14
3327a0j11j47N4j8J20n8r4J32J08j49J46J86n9J14k09J98O0j64r5P7r8p3o3m0
3351a93k0n7k7J61n0O2R9K9J24K3L4k6k9n3J14L2j45J15k61O8p6j85J05Oj70J60
3377a60R7p2R4K2J86n9j11K89n8n5o0L6m7p5k2jm8q7j51N3JJ00n1kJ50oPJ37J38
3406B45r6n7Q3l8J01j18q9K6j17J44k63L1mq9J8R7p9J46k6OK05p2KK08j31J29
3432B62J4j90j16J29q4j82P2J4M4j99L5k0J95k14K57J0J5j1J42j8J79k86J06j9
3456A35O1k8l14J18j4j12l1R2N1M3k03Q0L8J1k3L18r7R9n6n5m5K4O9L1q6j17n9
3483g0j49K2P8r9%R4O2%M6r7K05M6RM0M4n2j6Ok7k3j83ln3n2K1r1jJ59j8L5J65
$$ plain form
3301 128 154 -78 -161 -42 -232 -343 -209 -284 -207 -79 -112 -32 -14 99 99 161 245 250 268 207 202 117 292 -176 -224 -10
3327 -10 -121 -268 -214 -232 -112 -170 -264 -132 -24 -173 -27 159 100 214 5 203 263 99 4 81 -17 -90 -153 -193
3351 -193 -213 -270 -297 -136 -186 -124 -25 4 128 151 185 159 130 77 191 223 78 193 -68 0 -76 -261 -156 -150 -320 -160
3377 -160 -63 -135 -41 -19 167 108 -3 286 228 173 113 149 102 27 5 4 -44 -131 -282 -229 -228 -128 -179 -181 -31 -37 -30 107 245
3406 245 149 92 175 137 238 120 31 57 -60 84 -179 -148 -152 -241 -223 -126 -205 -59 -85 -79 126 54 56 264 133 262
3432 262 276 86 -30 99 15 -167 -95 -81 -37 -236 -201 -221 -26 -240 17 27 42 31 173 155 334 48 154 135
3456 135 196 168 -146 -28 -42 -154 -185 -93 -42 1 -202 -122 -84 -73 -96 222 125 224 168 113 68 92 161 192 106 -11 -70
3483 -70 -219 -197 -119 -218 -218 -124 -62 -62 -16 -113 92 138 147 187 231 179 163 169 142 119 -64 -67 -120 -172 -151 -242 -243 -84 -102 -67 98
3514I8j43R2R6j21K12m7o9J41q7m6n6q1m8P4j53n2L7L0p4kM0J9J08J7RJ81L1L6
3542B42n4L0qn5K5o6k03k5j3l9M8p7l6J80j97J70RO5N4M8r1J53J0r4J60q9O1j07
3570A01k27Q9o9RPr3m3J68j16m1K12l4R5M9R9j31J05j34J46n0q1n1N5j15N2k53
3596b51Q3k7KN2n0J19L1kJ26J1n7K9R1K8n3O7q1Rj05j33J09j14k8Q9j16n1J75
3623d7o0P5J11j19J68j32J28J2N0k5r4J48k77J94j69J14k09q4J07j97R4J68j25
3646a69M3J30j80K10Q0J07k4p3q1J04P9k78J15q8M4M4j34r0M7k6j9K3J01j8k4
3671g7R3K05j65K3J72j41R4j28l8o9Q8l6p3j48R5m7j11O8J25M5k7O8j15J74J8
3696I3k6J60k7m2k6o4R9l6j87q8J67j14J6l8M5j08rK1N0M0P7K01mj23J30o3j2
$$ plain form
3514 98 -45 47 143 22 234 187 118 259 172 126 70 -11 -59 15 -138 -190 -153 -123 -197 -199 -159 -140 -32 -15 -6 175 206 242
3542 242 188 218 210 155 180 114 -89 -114 -127 -166 -118 -195 -231 -51 -248 -78 -69 -4 50 98 7 160 170 76 236 147 208 101
3570 101 -126 -37 -106 -97 -90 -183 -226 -58 -174 -215 -3 -37 58 107 206 75 180 46 192 142 61 10 65 -50 2 -251
3596 -251 -168 -195 -193 -141 -191 -72 -41 -43 83 94 37 66 157 185 132 199 118 127 22 -111 -2 -116 -144 -55 -171 -222 -47
3623 -47 -107 -32 79 -40 128 -4 124 136 186 161 67 215 -62 132 -37 77 -132 -216 -109 -306 -212 -44 -169
3646 -169 -126 4 -176 34 114 221 197 124 43 147 226 -52 63 -25 19 63 -71 -161 -114 -140 -159 -136 -35 -53 -77
3671 -77 16 221 56 79 251 110 204 76 38 -31 57 21 -52 -200 -105 -152 -263 -195 -70 -25 -52 16 -99 75 93
3696 93 67 227 200 158 132 68 167 131 -56 -144 23 -91 -75 -113 -68 -176 -185 -164 -114 -74 3 204 200 77 207 144 132
3723A32j25P9N0j41j3Lj59N6Nm9J4J94j62J48l7j1J20rL4J55j54RN9n4j49N5j51
3750a01R8l7m1J90k99J16m8K2O7m3l7J82pKQ7J07j52J0q8J35j50j05J02K8j64
3775a26j3n6J3O4O4m2P2mM3Q5r2K55j89QJ05q9p8J25j31mj88R5jp5MJ00r6K3J57
3804B9o4k6J71q8P0n8O7m7J06r7o3J06j55Q8k09J4oo3J00L4kJ0J7R7P7l5l7KJ13
3833A51l6%J9j80O0j12Q9j99R0l8R2j59J76p5P0k8Q1O5m4J61m1K1KJ02j84N8K4
3860A65k23o1K10j22K7p6r0J07j51J90r0O9N4J31O4Rq8oL9on5r1r9J3j1kN6j56
3888a93j6R3J18o3LJ12l2N8J7O2j15J04J1N4j51m5K4R8j97qRj51J39j19J00l8
3914a26R8M5j00J44M8j51K34l6j0J1j47J8pl3L6l9j57P4K2%o2k7P4N8P2o5K8k1
$$ plain form
3723 132 7 86 136 -5 -18 -15 -174 -118 -113 -162 -148 46 -116 32 -5 -16 104 95 129 284 130 139 198 144 -5 50 -101
3750 -101 -3 -40 -81 109 -190 -74 -122 -100 -33 -76 -113 69 62 64 151 258 106 116 28 163 13 -92 10 38 -126
3775 -126 -139 -195 -182 -118 -54 -96 -24 -28 15 100 8 263 74 82 187 98 20 145 14 10 -178 -83 -84 -159 -155 -55 -151 -128 29
3804 29 -35 -61 110 22 92 34 101 54 160 63 0 106 -49 39 -170 -156 -162 -225 -125 -91 -93 -83 -66 31 108 73 36 38 151
3833 151 115 115 134 -46 14 -98 -9 -208 -118 -156 -64 -223 -47 -122 -52 -80 1 66 22 183 142 163 165 267 83 141 165
3860 165 -58 -119 91 -31 -4 -80 -170 -63 -214 -24 -114 -45 9 140 204 213 125 119 158 152 97 6 -93 -80 -91 -93 -37 -193
3888 -193 -209 -116 2 -61 -58 54 22 80 97 159 44 148 159 213 62 17 41 139 -58 -66 -57 -208 -69 -188 -88 -126
3914 -126 -28 17 -83 61 109 -42 192 156 146 157 10 28 21 -12 24 -15 -172 -98 -76 -76 -138 -165 -91 -33 39 -26 2 -19
3942a9O7R5o2J14j38om0j23J85q3r5m3N1J5lO8L8j63J22Rk3K23r9J15j21j40J54
3969I8j39J45l0q5n6N7p8j0j32M2J17q9M1N4k3J76Ojo6P9j02J20Mp1L0k02J61
3996D6o0m5o5J27p2k3o3j5J96m5K3O2OO9j48R2L8l9On9n9j3n9MNJ09j95K3L4J5
4026a05J66Pj10K61j97p6J00p3J88n3l2L7j42k2qj23M1N4M0j18J14n6L0J60j03
4051b0K2L1l9J32p5J9qj10R0M5M7j70jRJj25m2l0J99m5P0j03J88L9l4L5j3M4j12
4080D4J27j68Q8K0j44l0m5N4l6l3K8k0J22n1%p3M4J32p0K12p9j3L1n2m4l4q6L0
4108d6K7p8Jl9O6k6r4J57J8KJ21n6jM2q8O7R8m2l7N6r8J2j07j39R3k9L2j05J65
4137b8k2P5n8k2N5M5N0j01lJ24n9j4J25j92j2M5j83Q0%r6J51N5n5k0l6O4J62j86
$$ plain form
3942 -19 48 143 81 195 57 51 11 -112 73 -10 -105 -148 -97 -82 -85 -17 21 -142 -20 -11 -34 189 90 205 84 -56 98
3969 98 -41 104 74 -11 -67 -10 -88 -98 -230 -188 -71 -160 -119 -65 -88 88 94 93 27 106 4 124 128 57 87 -115 46
3996 46 -14 -59 -124 3 -69 -92 -155 -170 26 -19 4 66 72 141 -7 85 123 84 90 31 -28 -41 -100 -96 -91 18 -177 -154 -120 -105
4026 -105 61 68 -42 219 22 -54 46 -27 161 108 76 113 -29 -51 -59 -182 -141 -87 -47 -165 -51 -107 -77 83 -20
4051 -20 2 33 -6 126 51 70 62 -48 42 87 134 -36 -37 -28 -27 -152 -194 -224 -25 -70 0 -103 85 124 90 125 112 156 44
4080 44 171 3 91 111 -33 -63 -108 -54 -90 -123 -95 -115 7 -44 -44 -117 -73 59 -11 201 122 109 140 88 44 10 -76 -46
4108 -46 -19 -97 -96 -135 -69 -95 -189 -32 -14 -12 109 53 52 94 6 73 171 129 92 148 50 62 -45 -184 -91 -120 -88 -193 -28
4137 -28 -50 25 -33 -55 0 45 95 -6 -9 115 56 42 167 -25 -37 8 -175 -95 -95 -191 -40 15 -40 -60 -96 -32 130 -56
4165e6O7J56j35J7n2R7p4O6j03J38j49r8O7k1pR1j29Q6JO7J45j37Mk3LN1J42j76
4193C8O5n3j35J4lq3J17m7n7J33j4p0K3q4J73j6j4J00j5J29Jm6r1n7pN8q0q3L9
4222f5j22J0L1K5L9J13q7O9J5L4j4Q2j00N1N4j19J10j36R1m5m9M7r2L2j21J55
4248Hp3k5J06r2K9Q1K1R7jr4J07j27J21q6r7j7m4j04J11J5n8K3N6j26J54j04Q4
4275c5J15n0j5L4M8n2jr5P5k7o4M8l7m8kk1O4M8o2P4J2j3N6p7PJ13rm0J05j14
4305C7P8p4j20K64j72j31K9m7N9K1o3J30p6l7K4K4J11jL2j24P0k6O5qk24J50q5
4332i4q5L1R6JR9n0j8K4p3R5K1jl9J2J25j05J49j78J8N2j60P4k42J66n2KP4L8
4360b0M9j01LK4J23r5k5K38j94J55o3k6j8r9L9J05j70K6j9n4J18r0m7J47j00N5
$$ plain form
4165 -56 11 167 32 49 -3 94 20 86 -17 121 -28 -126 -59 -80 -87 4 -125 -39 -38 29 174 37 41 18 21 72 214 38
4193 38 103 50 -85 -71 -74 -157 -40 -87 -144 -11 -25 -95 -72 -156 17 1 -13 87 72 201 202 156 65 8 1 59 -21 -104 -65
4222 -65 -187 -177 -146 -121 -82 31 -56 13 28 62 48 130 30 81 135 16 126 -10 81 36 -13 34 -58 -26 -147 8
4248 8 -65 -90 16 -76 -47 34 55 152 151 57 164 37 158 72 -25 -42 -86 -190 -79 -64 -122 -99 -43 -169 -15 -119 -35
4275 -35 80 30 15 49 97 45 44 -51 24 -3 -67 -19 -56 -104 -106 -127 -63 -15 -77 -3 9 -4 52 -25 -18 95 86 46 151 37
4305 37 115 41 -79 185 13 -118 -89 -136 -77 -56 -119 11 -65 -102 -78 -54 57 56 88 -36 34 8 73 65 -159 -9 -94
4332 -94 -179 -148 -52 -51 48 -2 -20 4 -69 26 47 46 7 19 144 39 188 10 28 80 -80 -6 -248 -82 -134 -132 -58 -20
4360 -20 29 -72 -69 -45 78 -17 -42 196 2 157 94 68 50 -49 -10 95 -75 -49 -68 -122 -4 -94 -141 6 -94 -39
4386c9J9L5N9P5l7k6L7p9M1k6j93R5Qk7O3n9q3o3N6N4K2O6K2o0N3P7K2j14J30
4415A28l2j47K7J59j23M6j46l8N7n0J6j25K71j47PJ11J23m0N8j56O4Mm8P0O4j38
4441A5J0l4k2j0r1L2K8L5j8j3M2O2K2q3N9n5R9q5N8Q8M7j09k6m4o4L0M0Ql5M5
4471C1j78L5O2jmR3o1J57j6m0r0O6j9k9l2m9P0j15k1P6m2L1J8l0n8J13m6J56m
4500G3J0q4j03K29j0k9j27L0J72j45l9q2P0q3j3RJ86k16J39P5j5qL1Rm0p8J44
4527A05p6J35j02p1qPj05kM6k3N8Q1q2n0mmp7J71J38j02P8J13p8r1m9Pn8l3K1
4556e5K3o6O2p9j1O9rp6J57P0J4rm5L4o7J24j30J2r6J20J1k6n8O0m5j03N8m3J09
4585EMn8j7R8k1P5j7kQ9j67R6j46J37q6J1q8pM1j71K52n7o2J3j2K00L2j91L8j6
$$ plain form
4386 -39 -20 15 74 149 112 86 123 44 85 59 -134 -39 -31 -58 5 -54 -137 -200 -144 -90 -68 -2 20 -40 13 90 112 -2 128
4415 128 96 -51 -24 135 12 58 -88 -126 -69 -119 -103 -228 43 -104 -97 14 137 97 155 -1 63 67 19 89 153 15
4441 15 25 -9 -31 -41 -132 -100 -72 -37 -55 -68 -26 36 58 -25 34 -21 78 -7 51 139 186 77 51 7 -57 -27 13 21 -14 31
4471 31 -147 -112 -50 -51 -55 38 -23 134 118 78 -12 54 35 6 -26 -75 -5 -120 -141 -65 -107 -76 -58 -88 -146 -33 -79 77 73
4500 73 83 -1 -104 125 115 86 -41 -11 161 16 -23 -105 -35 -118 -131 -122 64 -152 -13 62 47 39 70 79 39 -39 105
4527 105 29 164 62 -9 -17 -10 -115 -117 -71 -94 -36 45 -37 -87 -91 -95 -172 -1 137 35 113 226 148 57 8 15 -43 -76 -55
4556 -55 -32 -98 -36 -115 -126 -57 -66 -142 15 85 99 90 45 79 12 136 6 18 -78 42 53 27 -31 29 -16 -119 -61 -104 5
4585 5 9 -49 -66 32 11 86 69 67 156 -11 85 -61 76 -10 1 -87 -94 -53 -224 28 -29 -91 -78 -90 110 142 -49 -11 -27
4614b7j3R7L5j49L2j0n0N5Q9n3lL5k0j73K9L7n6J44K2M4j4O2rMm0L3q7O2m4j09
4644g7J32j17k0j2jkl2O4N1mJ25p8j1k0J8N3J16q2j08LpJ08j12M8j53J26j45J25
4672a2l9J16m7j9L1J18o3j1J9O2j18N5k4q1L1mRj33Q4Ql9o2K0J1N2l2J01k3Jk1
4702a0J34l6J1j10r4J75o8K0p5Q3J0j32P5l4l2J1N7K6j9J7M2M7k4l6k2J24r3n8
4730a1L2p6Rk6J1O6j07J11j25K8K2Q9j34J02J22j06J67k19J7Q9k5m1Q9q6Po4L0
4757b9o8L9m9J47j48N4O1q1R9PJ23P5j29%n1L0J6k4Jn5p1j7l2j85J36J23j21P0
4785g9J51p1j15M1Q5j0P0j3L2Mm5m1J01J1j40K2L1j03M5j50J46L8m5Qr5N5J24
4812E7j01J15p7mJ60l6j41N7r5J30n5j33L1Mo9NJ03j8M9o8P1R8oN7Rj15Q3j01
$$ plain form
4614 -27 -40 57 92 -57 -25 -35 -85 -30 59 6 3 38 18 -155 -126 -89 -145 -1 21 65 51 113 104 108 68 101 14 76 32 -77
4644 -77 55 -62 -82 -94 -95 -97 -129 -65 -14 -18 107 29 18 -2 16 69 185 103 -5 -2 -9 99 -13 35 -118 8 -137 -12
4672 -12 -51 65 18 -1 30 148 85 74 93 155 37 92 68 -13 18 14 23 -110 -26 -18 -57 -119 -99 -88 -36 -68 33 10 11 -10
4702 -10 124 88 99 -11 -105 70 2 22 -53 30 40 -92 -17 -51 -83 -72 -15 11 -8 9 51 98 74 38 16 140 47 -11
4730 -11 21 -55 -46 -72 -61 5 -102 9 -116 -88 -66 23 -111 -9 113 7 174 -45 -28 61 36 -5 84 -2 5 -59 -29
4757 -29 -97 -58 -107 40 -108 -54 7 -74 25 32 155 230 101 101 50 80 96 72 73 18 -53 -70 -102 -287 -151 -28 -149 -79
4785 -79 72 1 -114 -73 12 2 72 59 91 95 50 9 110 121 -19 3 34 -69 -24 -174 -28 10 -35 -27 -122 -67 57
4812 57 -44 71 -6 -10 150 114 -27 30 -65 65 10 -123 -92 -88 -157 -152 -49 -67 -18 -86 -15 83 77 134 143 28 111 10
4840A0m5Q4q2J0L0j1j79J16L6j63Q9M9o5o7J59J16l7r9J05J60j25qn7M4Jn5j0
4867FL5j44L7o4jqR1K7j5J27l2j53J34K9N2K1j23J4J37q4jn1r6o9J24l9p8P2L4
4896a8J3K2j00Q8N7j90K16%MJ9n6J6o8o6K18k25N7p0O7m8K6k9L2J00n4J26Kj9
4924A20kjn5P4J7O5k16R3m8n0p8mn0J9M3mrJ37j13j8J09k0m5J30J7L9j67M7J24
4953A54k15M0K17j96l0L9j02q2J02K4q6J34l0m5J63l4JJ06n7P9j09o6Q8j21J21
4978I5q2Kj10n6J38o4M6j04L2J56n1o6j7K25m3r2n5J19L9Mj23M8n6O7n4n7k7R7
5006A1j28L6N5O8OJ7j8j9l2Q9n0L1n3L2O2J8q6jk02K20j05j07J38LJo4J9R5oj9
5036A1J09j29mJ63o3L0N2j91J76j74n9J52j24%R5k82K39mm6m2L2J05JP5J0k9l6
$$ plain form
4840 10 -35 49 -33 -23 7 -4 -183 -67 -31 -194 -105 -56 -121 -188 -29 87 50 -49 56 216 91 83 26 70 71 16 6
4867 6 41 -103 -66 -130 -131 -139 -48 -21 -36 91 59 -94 40 69 121 142 19 33 170 86 85 34 -62 -131 -7 -46 -124 -52 -18
4896 -18 -5 17 -83 5 62 -128 88 88 92 111 55 71 3 -63 155 -70 -13 -83 -16 -64 -38 -67 -35 65 11 137 139 120
4924 120 118 117 62 136 153 218 2 95 47 -3 -81 -85 -135 -116 -73 -77 -86 51 -62 -80 29 9 -36 94 111 150 -17 30 154
4953 154 -61 -21 196 0 -30 9 -93 -175 -73 -49 -135 -1 -31 -76 87 53 54 160 103 182 73 7 95 -26 95
4978 95 13 15 -95 -151 -13 -77 -31 -135 -103 53 2 -64 -81 144 101 9 -46 73 112 116 -7 41 -15 52 -2 -59 -86 11
5006 11 -117 -81 -26 42 48 65 47 28 -4 85 35 66 13 45 107 125 39 38 -164 56 -49 -156 -18 -15 -14 -78 -59 36 30 11
5036 11 120 -9 -13 150 87 117 169 -22 154 -20 -79 73 -51 -51 44 -238 1 -3 -49 -91 -59 46 47 122 132 103 67
5063F7l7j04RJ14q8j73K04J1p0J00n2q7K4k1K9M9J26m4L2L3r5O0j8pjpkOj18J05
5093D5j29N3j5o9R7m0l8J17k3Po1J34j16R7m7j4JN3P0k8k00N4j0Knq3J33Q0j62
5122i7R4P6L3j67N6J83j09L8r1p9J07o3L9j87J74j3k6l2on5R1p5J70k7L1j9l3
5149A3K4jJ14k20M6J3J04j17K4j7m8N3j34Q7q8J17r9J44N1m7lPN6J0j4Q5j3j32
5177A5J26q5k2k2l6Q3k40J78l8o0P6l2L1OJ44j45J31l2J00j80J30o3j19R5j4q0
5203e3m2m7J46o8k1k2N9m6M8Om4J37K3q2o0J63q3J6n5K5p5O7m3K9p5J02mq0K5
5232e4PO5P0r3n9J42o9J22j42r8J00Rj15K07Qj64P8K5j16P7n2j9KL2j4J24k8k7
5260A8oJ2P0L9J0Jk6r9p1qk0Q5m9%J4jm5O3r0J87J1m4J4J9Nk4l3L1r3K1Q6o6n9
$$ plain form
5063 67 30 -74 -65 49 -39 -212 -8 3 -67 33 -19 -106 -82 -103 -74 -25 101 57 89 122 27 87 69 62 61 54 52 58 -60 45
5093 45 -84 -31 -46 -115 -18 -58 -96 21 -2 5 -56 78 -38 59 12 -2 -1 52 122 94 -106 -52 -62 -60 -65 -148 -15 65 -97
5122 -97 -3 73 106 -61 -5 178 69 107 16 -63 44 -19 20 -167 7 -6 -32 -64 -70 -125 -34 -109 61 34 65 46 13
5149 13 37 36 150 -70 -24 -11 93 -24 0 -17 -65 -12 -146 -59 -147 -30 -129 15 66 19 16 23 79 89 75 160 147 15
5177 15 141 56 34 12 -24 59 -181 -3 -41 -101 -25 -57 -26 -20 124 -21 110 78 178 -2 128 65 -54 41 27 -53
5203 -53 -95 -142 4 -64 -85 -107 -48 -94 -46 -40 -84 53 76 -6 -66 97 14 30 -25 0 -75 -8 -51 -22 -97 5 1 -79 -54
5232 -54 -47 18 88 -5 -64 78 9 131 -11 -109 -9 0 -115 92 100 -64 14 39 -77 0 -52 -71 -69 -37 -51 73 45 18
5260 18 12 24 94 133 143 144 118 19 -52 -60 -80 5 -44 -44 -30 -31 -76 -13 -103 84 95 51 65 84 89 65 32 63 -30 -9 77 11 -48
5293d8N5O3q0j5N7r9O0N3o6M2o4L5O4M6p1K4N1Pr7O1kj36%P4k7r6O1kP9j46J28
5324A1j11O5J56j6k07J99o8J9K9m8J9j08p4J28j86N9O0J7P9j61J13L4k3j07K13
5349I2o2K2J7o1J33n8j34M9R4j17J21j45n0J23j42P1N1j10J20M3LK6j22K3O1J6
5375F4j0q5NKJ0q5P4O7j35N3Oj9L5K8q8M7R1q6o2J87J2j19J2Q0j25L7o5J03j17
5404h3M9l4K9N9j01p3Q7L5k7M9j5P7mnJ25j97P7j3j1j9k5p4K6J1n5j7P1R1q8m1
5434i6n1J34N4p2J20J1q9P6j6m2j38J29L3j58J27j2j47L6M7%qP0j9j45J63MJ9
5461C0J5j14J54nr0OR9j08Q6j23L6r8j1J08oL9N5Mm1n5J19j04J13j82J13P7k4
5488I3J0o3j25J3L2o9K4o4J85m9p0pJ06L7J4p9j3J19k9n2R4j99N0J00Oo7r0J7
$$ plain form
5293 -48 7 70 -10 -25 32 -67 -7 46 -20 22 -42 -7 57 103 32 56 107 114 17 78 76 -60 -60 14 -13 -109 -48 -50 29 -117 11
5324 11 -100 -35 121 105 -102 97 29 48 77 29 48 -60 -134 -6 -192 -133 -73 -56 23 -138 -25 9 -14 -121 92
5349 92 30 52 69 8 141 83 -51 -2 92 -25 96 -49 -99 24 -118 -47 4 -106 14 57 60 86 -36 -13 48 64
5375 64 54 -31 -26 -24 -14 -99 -25 42 -93 -40 -34 -53 -18 10 -78 -31 60 -26 -88 99 111 -8 4 84 -41 -4 -69 34 -83
5404 -83 -34 -68 -39 20 -81 -154 -67 -32 -59 -10 -25 52 48 43 168 -29 48 35 24 5 -20 -94 -68 -57 -112 -129 -58 33 -55 -96
5434 -96 -147 -13 41 -31 89 100 11 87 71 29 -109 20 53 -105 22 10 -137 -101 -54 -54 -62 8 -11 -156 7 11 30
5461 30 45 -69 85 80 -10 -4 95 -13 73 -50 -14 -112 -123 -15 -21 18 73 77 36 -19 100 -4 109 -73 40 117 93
5488 93 103 40 -85 -72 -40 -109 -85 -149 36 -13 -83 -90 16 53 67 -12 -25 94 65 13 107 -92 -42 58 64 -3 -93 -76
5516g6P8k17J66Oq3P3O8j1k3K9l8R2R6r6K2m7o6J36j51j12J76j50J0J15o9N9p1
5543h4N1j04J59rJr3J95q1K8m2P2qJ4j46J54q4k9n5p5M4m0J45r1R4k8L6m0k5O7
5572B6P7o7k8L8j39J72q1k0o0M0L7l3%L9j08qO1R4Q1j27Q3j12Q8l1j3J43n3l9
5600F0m4M4P5j51J6m3Q5p5j1qJ7Q0r4Q3n8O2R2r7O0j08J11j56J35j29L6j0p5l9
5628a42P0Q9k0j11Q3k8qQ8jJ62j77OO9j15J49k0j19l2O3l8j7L7J4m1m2o6J95J7
5656F5j17L5P5n3j5O3m5QQ7o1l2n4l2Q0q1L1PK8No6mm0N9J27m6o7Q0O6k9p2L6
5687C8k4M7om1P6j92ON0k2O4l1N6j77J00J9nJ43r6L5k3M5q1P3m2J08j15K8p0o3
5716a00J51r9oJ09n0j36J10O5k3o2KJ93j69J01OL0j59J92o1m4j9jl9j01k9J50
$$ plain form
5516 -76 2 -215 -49 -43 -126 -53 15 4 -19 10 -28 64 160 64 86 39 -27 109 -42 -154 22 -128 -118 -3 -72 -13 -84
5543 -84 -33 -137 22 13 14 -79 116 35 63 21 93 85 99 -47 107 23 -6 -61 -136 -92 -132 13 -78 16 -12 24 -16 -41 26
5572 26 103 36 8 46 -93 79 -2 -22 -82 -42 -5 -38 -38 1 -107 -115 -54 40 121 -6 77 -35 53 22 9 152 99 60
5600 60 16 60 135 -16 0 -43 42 -33 -44 -52 -35 45 -49 34 -24 38 130 33 93 -15 96 -60 75 -54 -18 -28 -103 -142
5628 -142 -72 17 -3 -114 -31 -59 -67 21 20 182 5 11 80 -35 114 94 -25 -57 6 -32 -49 -12 2 -39 -81 -147 48 65
5656 65 -52 -17 58 5 -10 53 8 16 103 42 10 -44 -76 4 -77 -46 -39 -11 -6 -72 -76 -116 -57 70 24 -43 37 103 74 2 38
5687 38 14 61 55 14 90 -102 -96 -46 -68 -4 -35 21 -156 -56 -37 -42 101 5 40 17 62 -19 54 12 120 5 33 -37 -100
5716 -100 51 -48 -54 55 5 -131 -21 44 21 -41 -39 154 -15 86 92 122 -37 155 94 50 31 30 -9 -110 -139 11
5742A1m0m9J9P1j00Q4J1M8L2r7P4q6j8J52j64M2N6J6o5P5q7pm5KN7k2J26j55J5
5771d4J23L6j00M3R4j12k0O2k9j21J16n9J2k2n8P7j5p3N3RN2n8R5J1lJ57j91O5
5799A00j36Q8l3Lj0j16J73n8Pj06P0j03J00O0Jj48K08m7m5j01J11O1M6k9J5l7
5825G4j98J11m5K8p3o5K14j15N3L0l6J04q6J01j31J13n1k4J16Lq6l2M3m3m5L2
5851ho8m5J14lo3J2J03N1j60L0R6o1P3p1J05j13P3M9j07m2N3k6M6l3o9P9m1l8
5879f4m3O5kR1m1J13K2p5Rl8p2J55j27l4k0N6qk5l3l0Q7p7R4m8K10j59J04L7M4
5908A91k32J68j06J45k15J00J9j2nj57M5J7k9nJ6R6N2j31M5Q8Qj54J03L9j32J24
5934G8k7j28P7M4L0j11Q5p0P7j18LRJ05r6J08O2j47K43k11RR4j64o1L2O1M9r9
$$ plain form
5742 11 -29 -78 -59 12 -88 -4 7 55 87 -10 64 -22 -40 112 -52 -10 46 62 -3 72 -15 -22 -67 -65 -8 -30 96 -59 -44
5771 -44 79 115 15 58 152 40 20 82 53 -68 48 -11 1 -21 -79 -2 -17 -90 -37 -28 24 -34 61 72 69 226 35 100
5799 100 -36 52 19 22 12 -104 69 11 18 -88 -18 -121 -21 39 40 -108 100 53 8 -93 18 79 125 96 111 74
5825 74 -124 -13 -58 -30 -103 -168 46 -69 -16 14 -22 82 -4 97 -34 79 28 4 120 123 37 5 48 5 -40 -8
5851 -8 -76 -121 -7 -10 -73 -61 42 93 -67 -37 59 -2 71 0 105 -8 65 114 7 -35 18 -8 38 5 -64 15 -26 -64
5879 -64 -107 -42 -44 47 6 119 141 66 75 37 -35 120 -7 -41 -61 -5 -13 -38 -71 -101 -14 -91 3 -45 165 6 110 147 191
5908 191 -41 127 21 166 -49 51 70 58 53 -104 -59 -42 -71 -76 -60 36 88 -43 2 90 98 -56 47 86 -46 78
5934 78 51 -77 0 44 74 -37 48 -22 55 -63 -60 -51 54 -42 66 128 -19 224 13 22 116 -48 -109 -77 -16 33 -66
5961f6p1J69j02K9p4L5MOJ07k0n4J2J47l8m3n6J29o2J8j63J47j8m5J0l4K7o1j6
5989h3L7Q2j2j9qJ30k05J60K9n3K2p5k0pO2n7k8p4R8m0qQ2LK5p5R9m0m3mO6K9
6020G3K9J2j54J09K7p8k7QR5j00L5j26N8R7j57M4O1j4P6j0j19K6O5j1j21J23K9
6047E0j5n1N1m2o1N9q5J01m0mJ5r1P3L7k7O7m4O7p9J24r3r2M8J27jm2j12J07j94
6076a47K4J27q9J08O2k05O3O2K3q4M0pK7N1q3M4k3P0j03o7J70j61Q6j24J06m3
6102g3J6JK5M2j3k9J10k9l2R6j11L3k4J6j07m8L5N3l2R6p5k4N5J17j08J4J4J46
6130A64q2k8m3j3J49j42j34J42m0RK5l9o5P7j7o9J73o3oJ4r5P1R4j49M2qJ54j18
6158CK2m3O1p9R4K7j74K1O6M1j03O2l9nk0Q2R0r3Q8nJ0r5Nj3j41J66j91J31n1
$$ plain form
5961 -66 -137 32 -70 -41 -115 -80 -76 -70 37 17 -37 -25 122 84 41 -15 114 52 70 -93 54 36 -9 1 -33 -6 -67 -83
5989 -83 -46 36 24 5 -3 127 -78 82 111 58 80 5 -15 -22 40 -17 -45 -119 -21 -61 -69 13 16 41 -34 65 25 -18 -22 44 73
6020 73 102 114 -40 69 96 18 -9 -1 94 -6 29 -97 -39 58 -99 -55 6 -8 68 58 -61 -35 30 19 -102 21 50
6047 50 35 -16 35 -7 -68 -9 -94 7 -33 -37 -22 -113 -40 -3 -30 37 -7 60 -19 105 12 -80 -32 95 94 52 -60 47 -147
6076 -147 -123 4 -85 23 85 -120 -57 5 28 -56 -16 -23 4 55 -28 16 -7 63 -40 -107 63 -98 -12 -136 -30 -73
6102 -73 -57 -56 -31 11 -2 -31 79 50 18 114 3 36 12 28 -79 -127 -92 -39 -71 25 -50 -74 -19 98 -10 4 18 164
6130 164 82 54 11 -2 147 5 -129 13 -27 -18 7 -32 -97 -20 -37 -106 67 4 -2 12 -83 -12 82 -67 -25 -33 121 3
6158 3 25 -18 43 -36 58 85 -89 -68 -2 39 -64 -2 -41 -46 -66 16 106 13 101 96 106 11 16 3 -138 28 -163 -32 -83
6187h3N2jj6m9N6Q4j15J37l7Q5rr2k7J6nO6k3n5J17J2j79j00J59j31J86j72J32
6214Hn0N1N8j21P3M1k3J2m3J5K2qj49P1O6q4J1L5q9P9K6K1L8j33J27l9J7j4R3
6243A11k7j21n3K13p7l7m9M8K9qJ2l7o9J8R5j37J05m6MN8n8J0J06k0K6r6L1p3
6271d2P2p2J25o0l8p2J01j3o1M6K1N6M0j16R2m0R0j39O4L1p9K6L5l7m1K2j5K9
6299B5k09J26m3J36m2p3O2k1o4J92j31K2N9p2P0j16J33O0q8l7N9p0kj10J29j00
6325a05Q6R5l5lN5n7k7M4k9LQ7r9rM4q1K9j32R5m1MN2%p8R3J8m2l7J44j15J86
6355A45r7n1M3j2m0k1m1P5q0J04q3J7O2p9J7lP5mL4j13R0p0N0J65j04n8l6n8J20
6384D7pj45Q5M6j2M8j53M9r4K45j55J09j17J46n5l4M3j4N0r4R3j14J24j27m3M
$$ plain form
6187 -83 -31 -32 -48 -97 -41 43 -72 65 28 113 104 12 -15 1 -4 62 39 -16 101 113 -66 -166 -7 -138 48 -124 8
6214 8 -42 9 67 -54 19 60 37 49 6 21 43 35 -114 -43 23 -61 -50 -15 -104 -25 1 22 60 -73 54 15 32 18 111
6243 111 84 -37 -90 123 46 9 -40 8 37 29 41 4 -65 -47 48 -89 16 -30 -26 32 -26 -16 90 70 96 0 31 -42
6271 -42 30 -42 83 23 -15 -87 14 1 -60 -14 7 63 103 -13 79 39 129 -10 54 85 6 32 67 30 -11 11 -4 25
6299 25 -184 -58 -101 35 -7 -80 -18 -39 -103 89 -42 -20 39 -33 37 -79 54 114 26 -11 48 -22 -24 -134 -5 -105
6325 -105 -19 76 41 38 93 36 9 53 24 27 114 15 6 50 -31 -2 -134 -39 -80 -76 -24 -24 -102 -9 9 -33 -70 74 -41 145
6355 145 48 -3 40 28 -12 -33 -74 1 -79 25 -58 -41 21 -58 -41 -44 31 27 61 -52 38 -32 18 183 79 21 -15 -73 47
6384 47 40 -105 -20 26 14 62 -91 -42 -136 109 -46 63 -54 92 37 3 46 32 82 -12 81 -33 91 -36 -79 -75
6410g5Q3o3O7J0j1J4n0NN8k7L7p1O5q5K13j08K2j53m4J30j61P1o2N6R4Pp7K6l2
6439f1N7P3J9k6q2P4P7o0k9l6OrP3m9l1m1l1O2j01M2k6J08j3k7Q6j1N4q2O8q9
6469eN5nL5l6j6k2n9O2J2j21Q1K5l2LJ5J28q2N3q7m5P0K5j28J16J9J8n8j18J88
6498I1n0n6q3O8N2P2j08K8K9O6j21L8O1r4q6J22r7J17K5m1m8l6R3j04L0n1K7M5
6526a1k6O3M3k8N3j56J66j08K5j50J47k4mMO3j17kl2J44l3q2J9J20k4k6j03M6
6553c3l6J16M2j27M4M3k3kn4P1jj75J7J32q4p8K05r9J0N5N1n7j57K28q7J4J18
6580A33k03J21k0r7MJ76q3j9R3j69J0J0N3P1r8N4k1oj3L3p0J16M4k12O9N6Mm0
6608dk3J29j30L4k0j16J4P7k0L9N7K5q1j4Q8k3l5J3n2j9M8J0oJ4j22J2J27q6R4
$$ plain form
6410 -75 8 -55 12 22 11 25 -25 -20 38 11 48 -23 42 -43 170 62 84 -69 -113 17 -144 -73 -135 -79 15 22 -55 -29 -61
6439 -61 -4 69 88 62 -20 54 131 71 42 6 12 3 76 27 -4 -45 -76 -14 -115 -73 -99 9 -4 -31 55 44 98 16 84 -5
6469 -5 50 45 80 44 28 6 -53 9 21 -100 -19 6 -26 -23 -8 120 38 91 4 -41 29 54 -74 42 61 79 21 -97 91
6498 91 41 -15 -98 -30 22 94 -14 14 43 109 -12 26 87 -7 -93 29 -68 49 74 33 -15 -51 42 -62 -32 -83 -56 -11
6526 -11 -37 26 69 41 94 -62 104 -4 21 -129 18 -6 -10 -6 57 -60 -62 -94 50 17 -65 -46 74 50 24 -79 -33
6553 -33 -69 47 89 -38 6 49 26 24 -30 41 40 -135 -118 14 -70 -148 57 -42 -32 23 74 17 -140 88 1 15 133
6580 133 -70 51 31 -66 -62 114 31 12 105 -64 -54 -44 9 80 -18 36 15 9 -4 29 -41 75 119 -93 -24 32 36 -4
6608 -4 -27 102 -28 6 -14 -130 -116 -39 -59 -20 37 62 -19 -33 55 32 -3 10 -42 -61 -13 -3 -9 5 -117 -105 22 -64 30
6637C0n3KM7Lj9k6R8j20j37R0P3P0p5j5O8o9J9L0o2K8r7J44pj8N5k9j7N3k9n8
6667b1L3M4K1k9O5j09m2O7k6L7j00n8R0q5J07L6N7l6j0j15J35p6J72j47O1j1q7
6694b7J37j20K8j46N5J4K3q1P6L3J8p3O6l5P1k2O1j8m5O3r2N6n1P2K1k1j61J4
6722h4j4P9J2r2J00%q2J03J0K5j6j09R3L2q0K4Q8lo6kn3k5J23p5J7PJ0j35J55
6751D2o7p2J52n6M6l9LR2k4K1j9j55NK15j32Lk9j7J02j55Q2j2L2M1np4kj3mO8
6781B9p1J56j22K3m6M7j4j02o9J90q6qL8M0K4P0p4NM7K4o5K2j06J05J9k6r2JM7
6810Fn9Q6o1m8O4J85j37m1K7l5n2K8J9j09P6n2J20L6o7J3n6LoQ4l6O2j79K11P3
6839A55j40o8M8L2m5K1QJ4J4K2l6k2M7r4Q3p1NN9o8m8J31kM7o9j02J26q9J14k0
$$ plain form
6637 30 -23 -21 26 29 10 -16 82 -38 -175 -85 -12 58 -17 -32 36 -33 -14 16 -46 -18 -115 29 22 4 59 30 13 66 37 -21
6667 -21 12 56 77 48 113 4 -38 29 3 40 -60 -118 -28 -113 -6 30 87 51 41 -74 61 -15 157 10 71 60 -27
6694 -27 110 -10 18 -128 -73 -59 -36 -117 -41 -8 10 -63 3 -32 39 17 78 60 15 78 -14 42 -9 63 84 63 -98 -84
6722 -84 -98 -19 -7 -99 1 1 -81 22 32 57 41 -68 25 57 -23 1 89 86 20 18 -35 -60 63 -12 5 12 22 -113 42
6751 42 -25 -97 55 -1 45 6 9 101 77 98 79 -76 -71 144 12 15 -14 -31 71 -84 -2 -14 18 59 54 -20 -22 -35 -39 29
6781 29 -42 114 -8 15 -31 16 2 -100 -169 21 -65 -73 -35 5 29 99 25 30 77 101 36 58 -48 57 76 50 -42 -41 6
6810 6 -53 33 -28 -76 -12 173 36 -5 22 -13 -65 -37 -18 -127 -51 -103 17 53 -14 -1 -57 -54 -60 24 -12 50 -129 82 155
6839 155 15 -53 -5 27 -18 3 11 25 39 61 25 3 50 -44 39 -32 -27 32 -36 -84 47 45 92 23 -79 47 -42 72 52
6868E2j7J7N1q7L6j24p0K33k03J33m3q2R4LqRLj7J14q6mM6lJ2p7k5R0k7L7m9q
6899@Q9k23J89j35m3N9J7J9m3R3j02R4Om1O2m5kO3L3j47M7K1ml2K4r1P4l5q7J72
6929C2j70J92J5j64J15j43M6M2Q1L0k09K36k5j13k7R7j00m5J22o6J21n8OO4L4
6954A13o0R3j91J61m8N1j08j10P5J1p9J57L3k02k8M5k1R0L6JL3j4%m3K0J5L8J7
6982H5r6Q4m1o0p4J27J5QJ0j09J7K0J0o0J18oJ0q3M0j1M3r5J33j03O2q8R1q9o0
7011a02J64o0K8l1m1K3pJ7l2J46j08P9O3p5j7n0N2m3O2m6l4k8J3j2J3m5J14o9
7039b6KJ08q9k5K4K5r2J08m6J20k17J34l3nj9n5J33o6o8K3L2R4q4Q6Mj25J2n0
7067i5J18QQ5k44R2N4p4k0O8JM9j27j2J36Jm7l7J52j30M4q9L1M4N0m0L0O2Q0j44
$$ plain form
6868 52 35 52 103 16 52 -72 -142 91 -112 21 -22 -104 -10 -7 -15 -6 -3 -20 94 8 4 50 47 59 -18 -43 47 20 57 8 0
6899 0 89 -134 55 -80 -123 -64 -47 -28 -71 22 -80 14 20 -21 41 -4 -6 57 90 -57 -10 11 7 -25 -1 -92 -18 -53 -140 32
6929 32 -138 54 69 -95 20 -123 -77 -35 46 76 -133 103 78 -35 -62 35 -65 -110 12 -54 67 9 15 79 113
6954 113 53 146 -45 116 68 119 11 -99 -24 -13 -92 65 98 -104 -132 -87 -108 -18 18 19 52 38 38 -5 15 30 68 85
6982 85 -11 73 32 -28 -102 25 40 48 58 -51 -34 -14 -4 -64 54 48 58 -25 15 4 47 -48 85 -18 44 -44 47 -42 -102
7011 -102 62 2 30 -1 -42 -19 -26 -9 -41 105 -3 76 139 64 47 -3 49 6 68 22 -12 -40 -27 -39 -26 -71 43 -26
7039 -26 -24 84 -5 -30 -6 19 -73 35 -11 109 -108 26 -7 -12 -31 -86 47 -19 -87 -64 -32 62 -22 64 68 -57 -45 -95
7067 -95 23 31 116 -128 -36 18 -56 -76 -8 -7 42 -85 -97 39 40 -7 -44 108 -22 22 -67 -36 8 58 18 48 110 190 46
7096D6J06j28m1m2n2O7l2J35l3j4o1L8j11J48Q8j81J00p9K11j53j10N1J60p5r8
7121f0N0P4m9n2Q8j22J01O1j36J22n2l7k8K2Q3KL8m1r1N4o9N5%m8O1l3M1l7j0
7150a3m4J07M5l6R0j92rQ7r4O1K5n2L5j00Q6N8o2J0L5l1L6r4M2M1M5l7M1o6J0
7179B4r5J5nJ30om1K3n6Q9j84Q1J4pq4N7m2m1K9J71l5K9j36P8n1j2M0KJ4r1J22
7209C2k9K8p8P4q8O5j4RjJ9o6j3L7O9j9QJ08l4o1m3J07j72L9J34k06K08j45K7
7237eNr0J24J0J16k04R2j12K8J18R8j27M7q2M2q2J2J16j9m7j1km7O3j06j6j7m
7265a00K03j20J30j19MO4k4q9M5P4j48J00L0l7K0L5q5k8m8J43j16l1J24l0L1K5
7291E3OjJ2j20J26j32Q5K3n6k4Q8j01K9O8n4J55j49Rm0P1r6K8n3l0O7kN9J5J2
$$ plain form
7096 46 152 24 -17 -59 -111 -44 -76 59 26 12 -49 -11 -122 26 114 -67 33 -46 165 12 -98 -47 113 38 -60
7121 -60 -10 64 15 -37 51 -71 30 91 -45 77 25 -12 -40 -18 65 67 105 64 -27 27 -42 13 13 -35 26 -7 34 -3 -13
7150 -13 -57 50 95 59 149 -43 -52 35 -59 2 27 -25 10 -90 -4 54 -8 2 37 6 42 -52 -10 31 76 39 80 14 24
7179 24 -71 -56 -61 69 63 22 45 -11 78 -106 -25 -11 -18 -102 -45 -87 -128 -99 72 37 66 -70 8 -43 -55 -15 -13 1 -90 32
7209 32 3 31 -47 27 -61 4 -10 -1 -2 17 -49 -62 -25 44 25 33 141 107 46 3 110 -62 -23 111 -95 113 -32 -5
7237 -5 0 -90 34 44 160 -44 48 -64 -36 82 180 53 100 18 60 -22 -10 106 87 40 29 27 -20 43 -63 -79 -96 -100
7265 -100 103 -17 113 -6 -2 62 38 -51 -6 68 -80 20 50 13 33 68 -17 -45 -93 50 -66 -97 27 -3 28 53
7291 53 59 58 70 -50 76 -56 29 52 -4 -28 60 -41 -12 56 2 157 8 17 -23 48 -48 -20 -73 -103 -36 -38 21 36 48
7320D8j85K32j24M7r8P2p3N5j4J4k9N6Q0j12R0N6kj04J18p7j15J86j42J8jl1k0
7347e5N9n3j0j11K12K9q9l0Q4k07K21o8Q4o4k1oL1N8m0P3j14O4j17J5J15p2R7
7374H5j12m7L6J39l9j9k0p7Q9j2m8M8N4j61J32O1k10L5lrN1J06j61P6Oj07Q2J49
7402A24r1m6Rl0J84p2j58P7K8r1J49J2j00k4K7P0p8j3j6k9R8n9P0qo7k4J6N2l2
7431b2J53k0j42O3q7L3j4r9J10j35K04J2j6r6L0PKQ5MJ33j77r5P3J0m9qJ2Q9m5
7460A5r7N4jJ29j14l9P7O8K7m5PL1j47j7J04q3J42j72J3m0J42j38n9J62q7L5p3
7487a06J78j02K8m9QJ32j72J29J2m1K0jNo6Q6j14j4O9L5M5o6j9N3l6k1m3R4n5
7515a1K5O6j27J94j17r0l7J14m9N3O3j18M2R9j29N3j48Q8m7nJ55p4l2J8M7P3j9
$$ plain form
7320 48 -137 95 -29 18 -80 -8 -81 -26 -40 -26 -55 1 81 -31 59 115 113 9 127 50 -65 121 -21 -3 -4 -35 -55
7347 -55 4 -49 -59 -170 42 71 -18 -48 36 -171 50 -18 66 2 -19 -25 6 64 24 97 -17 47 -70 -55 60 -12 85
7374 85 -27 -74 -38 101 62 43 23 -54 35 23 -25 23 77 -84 48 109 -101 -66 -69 -78 -27 79 -82 -6 0 -107 -25 124
7402 124 33 -13 -4 -34 150 78 -80 -3 25 -66 83 95 -5 -29 -2 68 -10 -23 -39 -68 30 -29 41 33 -34 -58 -42 10 -22
7431 -22 131 111 -31 32 -55 -22 -36 -135 -25 -160 44 56 40 -56 -26 -19 -17 68 72 205 28 -67 6 16 -33 -41 -29 60 15
7460 15 -82 -28 -29 100 -14 -53 24 92 119 74 81 112 -35 -52 52 -31 111 -61 -48 -88 54 -84 -143 19 -68 -33 -106
7487 -106 72 -30 -2 -51 -43 89 -83 46 58 17 37 36 41 -25 61 -53 -67 2 37 82 16 -3 50 14 -7 -50 44 -11
7515 -11 14 80 -47 147 30 -60 -97 17 -32 21 84 -34 8 107 -22 31 -117 -29 -76 -81 74 0 -32 -14 33 106 87
7542H7j8j16k0J14j40m7J75j15Q3K7N3j53J9O9m5O0J9K3o6m3M1p9J39j43R8J2
7568C4j07J33j05K8J44j68l8R9o8P9m4O7%p5J4q3J13o8p2R5M9R3j20n3K9Pj03
7595a20J52q3Kl0J16k4rL3J1r2J19K4j3o4O2j03M4P3j2l9k3L0j21J5o9P4J7r5
7623a25J69m6J24j77P8R6o2j3o6J14N4j66O0k0J1j11J16q8O5N2r6K5l9M0j30P5
7649f0j3Q2j32O8J7l4O7j7n5J11j57K4P1n6Q0m2m4J71j41K9J09m0k0l1N7pn2M1
7677B6N5Kj41R8q3O6M7m3j45J17rm8R5J3r2O1N0k6J6j36J00k1k0Q6lj55J22p1
7705c9k2l0J20k2k7J69j64M5rr0O7J91p3l4KJ3m6m8K8n0N2ln8Ko7M0J7O2o8q6
7735a28J75j8J23o4o8J9o3RR1m7j89J27j6nl5n3J34j14M4R4j13K12j81j4J81p3
$$ plain form
7542 87 69 -47 -67 47 -93 -140 35 -80 3 30 83 -70 -51 18 -27 33 52 75 9 -34 7 -72 67 -76 22 34
7568 34 -73 60 -45 -17 127 -41 -79 20 -48 31 -13 54 54 -21 -7 -90 23 -45 -117 -22 27 120 0 -53 -24 -17 -120
7595 -120 32 -51 -49 -79 37 13 4 37 48 -44 75 99 86 22 84 -19 25 98 86 47 24 54 -67 -52 -121 -47 -30 -125
7623 -125 44 -2 122 -55 23 119 57 44 -22 92 146 -20 40 20 31 -80 36 -52 13 65 -31 -6 -45 -5 -135 -60
7649 -60 -73 9 -123 -55 -38 -72 -5 -22 -77 34 -123 -99 -28 -84 -4 -46 -90 81 -60 -31 78 38 18 -13 44 37 -15 26
7677 26 81 83 -58 40 -43 23 70 27 -118 -1 -10 -58 37 50 -42 19 69 43 59 -77 23 2 -18 68 65 -90 32 -39
7705 -39 -61 -91 29 7 -20 149 -15 30 21 -69 -2 189 116 82 84 97 51 3 31 -19 33 30 -28 -26 -93 -53 -36 26 -42 -128
7735 -128 47 29 152 88 20 39 -24 -15 76 29 -160 -33 -49 -54 -89 -142 -8 -122 -78 16 -97 115 -66 -80 101 28
7761B8o9j0Q6pl5P1j59J41lj01R5j07O8P1m8j19J67r7P2l3j3J07j73L2J5K0kP6
7789G3k3P1j33L5l2j01N4p1OJ24Ko7J64j06N2nj38J04O5n4k3P3j20J37j16PL3
7816A1K3k9j6l1P1k8M5Pj05RK0m3Q6J45j22l3o5Q0mn3%l4N0Q6m3n2N7K4n9j5J35
7847A17q4l1m5J7p4J58r5o7R9j13R3J26k07N1K7J8N8j3q6j04J02O0J42j85j8Q
7873d6OP2P3o8j10O9O2j09L0n3N3O5P1j18n5J0J33q9K3k6L0L2L3p3j01K5M9j2
7901b4J03j03j1p4P5R9q0N6r3K9Pl1j1R6L7m6p6M0N6n9nL8J02j28P2o8j3M5Lk1
7931A5p7P4M5K8j32j3L6Q0p4j7k7LJ2K05k55J67K5j55L3m5qN1m5M7R0j45L8J02
7959E8o3J0P5j20O2qn4k9k7J63m9n7j7M3l0nR2kj53O6P6p9R5p2K1N7J0p6m6p9
$$ plain form
7761 28 -41 -51 35 28 -7 64 -95 46 43 -58 37 -70 -2 69 21 -98 69 -28 44 11 -2 105 -68 -36 -21 -1 -3 73
7789 73 50 121 -12 23 -9 -110 -56 -127 -121 3 5 -62 102 -4 48 43 -95 9 74 20 -3 70 -50 87 -29 -22 11
7816 11 34 5 -11 -42 29 1 46 53 -52 -43 -23 -66 20 165 43 10 -55 25 21 -32 -32 -66 -16 70 27 -25 32 56 -3 -18 117
7847 117 33 2 -43 -26 -100 58 -37 -104 -5 -118 -25 101 -106 -55 -28 -10 48 35 -51 -155 -53 7 149 -36 -54 -46
7873 -46 -40 32 105 37 -73 -4 58 -51 -21 -74 -21 44 115 -3 -58 -48 85 -4 19 -7 23 55 88 15 -86 -61 -12 -24
7901 -24 79 -24 -35 -109 -34 65 -15 41 -52 -23 -16 -47 -58 38 75 29 -47 -7 49 -10 -15 23 125 -3 69 1 -12 33 36 15
7931 15 -62 12 57 85 -47 -60 -24 56 -18 -35 -62 -59 -47 158 -97 70 95 -60 -27 -72 -80 -29 -74 -27 63 -82 -44 58
7959 58 -5 5 80 -40 22 14 -40 -69 -96 67 18 -39 -56 -13 -43 -48 44 42 -111 -45 31 -48 47 -25 -4 53 63 -13 -59 -138
7989a38J24j2O6j20O6j1N1L4j86Q5j03J41o5J45L5j22l4k1K9M7j01O5p6J18j6
8014Aj02k4Q1P5m9L3J0Q1j36K6kOQ8j35O1kL3P0j67N8l5oN9N2j72J36J3r8Qp0
8044a07J3P3m8L8m6J91j84J12m8j3N0L6j24L8J74k28M4Qkj18J23LL8l6J8j3o2
8071g0N6rJ2Q2j7J3q7J31j00K3m1j65J82o1O2j06J03mK9kj01M9nJ0P0J8l6J1P0
8100A17j61O0l0j10J54n0k9J36r5j9r5Q9J40j24N0o2Q3p3j7J23j74J12m4J07k4
8125F4j07R9j33M3M6m4J0q8R1l9N7j5J02j11Jm0K5P4l7k8l3R9m8k4J56j58n0R7
8153IP4n5om5M3M5p8pM1l6N2j60J20O6mo4m1J02m8N8j83J37N5j73QN7K4K4Q5j49
8183d9n4J29m8Q5j18J22o6J4
$$ plain form
7989 -138 -14 -26 40 -80 -14 -25 26 60 -126 -41 -144 -3 -68 77 112 -10 -44 -65 -36 11 -90 -25 -101 17 1
8014 1 -101 -125 -44 31 -18 15 25 106 -30 -4 -6 0 88 -47 14 12 45 115 -52 6 -29 -35 24 76 -96 40 53 -45 -37 -107
8044 -107 -94 -21 -69 -31 -77 114 -70 42 -6 -19 31 67 -57 -19 155 -73 -29 -21 -23 -141 -18 -15 23 -13 5 -8 -70
8071 -70 -14 -23 -11 71 54 67 -20 111 11 34 -7 -172 10 -51 11 -95 8 4 33 31 -70 -21 -26 -16 54 72 36 47 117
8100 117 -44 16 -14 -124 30 -20 -49 87 -8 -27 -122 -33 107 -17 33 -29 54 -19 -36 87 -87 25 -19 88 64
8125 64 -43 56 -77 -34 12 -32 -22 -110 -19 -58 -1 -16 86 -25 -24 -64 -39 35 -2 -30 -63 36 -12 -36 120 -38 -88 9
8153 9 83 28 22 -23 20 65 -13 -20 21 -15 37 -123 -3 63 59 -5 -46 56 8 66 -117 20 75 -98 -90 -33 -9 15 100 -49
8183 -49 -103 26 -22 63 -55 67 1 15
8191A5
$$ Imaginary data points
##PAGE= N=2
##DATA TABLE= (X++(I..I)), XYDATA
0@%%%%%%%%%%%%%%qJ6j6J6j6J6k4L2l3M1m8N6p2Q0q8J04j20J36j55J79k01K25
36A20k56K88l20L57l98M42m90N44o03O65p34Q10q94R86j085J196j320J456j608
55h44J777j970K193k451K753l111L548m097M805n758P120r238J3002k1686P9314
70F5357J5005j63951K0024J00514J8247q8431j7534N4794L0834k5785r553j4085
82a4564k3219J0031N5586J5970m7870l0244M7639L0010m5109m0109K8350L6639
94B3110l34j3872j658j6091k1186J9450L2767k0947l2581K5985M3259j8656n1402
107c2156j28L9003P580j1717P721L367j5980k075J4551p467k7288J1342M4843
120C1596l710m9204m175L9215m543m4729R117O0418j04o0505j450N7233q97o0509
$$ plain form
0 0 0 0 0 0 0 0 0 0 0 0 0 0 0 0 -8 8 -8 8 -8 8 -16 16 -17 24 -24 32 -40 40 -48 56 -64 72 -83 96 -105 120
36 120 -136 152 -168 189 -209 233 -257 287 -316 349 -385 425 -469 517 -568 628 -692 764 -844
55 -844 933 -1037 1156 -1295 1458 -1653 1895 -2202 2603 -3155 3965 -5273 7729 -13957 65357
70 65357 80362 -83589 -63565 36949 55196 -33235 -50769 4025 34859 9074 -479 -14564
82 -14564 -37783 -27752 27834 43804 -4066 -34310 13329 43339 -1770 -41879 -13529 23110
94 23110 22776 8904 7246 -8845 -30031 -10581 22186 1239 -31342 -5357 37902 19246 -32156
107 -32156 -32284 6719 14299 2582 10303 13670 -2310 -4385 10166 2699 -24589 -13247 31596
120 31596 27886 -21318 -25493 13722 9179 -35550 -26433 33985 33881 -26624 -28074 29159 28262 -32247
134c2247n506O5031K3080n1578k6869L1432J3713k5015j0637J7362Q318o961M591
147D714L963k2622j3935K6182K1254j7268j6029K0683J9430k4089k5757J8898
159d576K1069j2904r717J6088O286k2510j3550J6503P680j4314K174J8759j638
172I350j7413k328J2072r75j0239J1594J7091r881j4021O785M644j3919n908K1055
186G907J1015k4896j1845K6755P694l4667j6563L5328L1052k4637l1465J8044
198f278K6317j1884k1684L036J7756P821m251n640j0794q524J3564J3299j4409
211a671j5795J2879K2094p815k8961j123K4610M622j0952K567P957m312p959N425
225A566O730j2101o632J9243J0965j7373j7118N410J2854k670r306L832O722j035
$$ plain form
134 -32247 -37753 27278 50358 -1220 -28089 3343 17056 -7959 -18596 -1234 7084 123 4714
147 4714 8677 -13945 -27880 -1698 19556 2288 -13741 6942 26372 2283 -23474 -4576
159 -4576 16493 3589 -6128 9960 16246 -6264 -19814 -3311 4369 -9945 -7771 10988 9350
172 9350 -8063 -10391 1681 706 -9533 2061 19152 9271 -4750 2035 6679 -7240 -13148 7907
186 7907 18922 -5974 -17819 8936 16630 -18037 -34600 728 31780 7143 -24322 -6278
198 -6278 20039 8155 -13529 -10493 7263 15084 10833 5193 -5601 -14125 -561 12738 -1671
211 -1671 -17466 -4587 17507 9692 -19269 -20392 4218 8840 -2112 455 8412 4100 -3859 1566
225 1566 8296 -3805 -10437 8806 19771 2398 -14720 -9310 3544 874 -8432 -4600 2122 1087
239A087J122q27r164l575J2633J4871o544j7438N601J6853p199j9071J451J7377
253G177L749j3459l500P730l994q302M753P730j449l469N089N454p319p217O519
268e08N934j756l49K873j216o916k182N825k150q573N266J1595l307j3872k263
283a1599J2610L990j0684k18J2321L256p066m468J635J934j006K318K649n094
297E78k641M074j509p433k364P190O783m860n228M913K511m936r48N267M218k286
313C329j767N014j190r096m62O838J199m600k509L999N73o586j444L661O82J465
329h94L006K78j983k164K420L652l776j455O334K074m725n329L1L703k534l922
345e284M292K656l450j525K96M57m26M68N096J970l726P63K121j907j472j92J884
$$ plain form
239 1087 2209 1382 -7782 -11357 1276 16147 9603 -7835 -2234 14619 7420 -11651 -10200 7177
253 7177 10926 -2533 -6033 1697 -2297 -10599 -5846 1884 435 -3034 2055 7509 190 -7027 -508
268 -508 5426 3670 3321 6194 4978 -1938 -4120 1705 -445 -9018 -3752 7843 4536 -9336 -11599
283 -11599 1011 5001 -5683 -5901 6420 9676 2610 -1858 -223 1711 705 3023 5672 578
297 578 -2063 2011 502 -6931 -9295 -2105 4678 -182 -5410 -497 2014 -2922 -3870 1397 5615 3329
313 3329 1562 6576 5386 -3710 -4172 2666 3865 -735 -3244 755 1328 -5258 -6702 -3041 -2359 -894
329 -894 2112 2390 407 -1757 663 4315 539 -916 5418 7492 2767 -2562 -2531 1172 -1362 -5284
345 -5284 -992 1664 -1786 -3311 -3015 -2558 -2984 -2516 2580 4550 824 1587 3708 1801 329 137 2021
362B021J811k283j144l36l794r91K828O94r84j303K357M331l256n125L062N098
378B986J736j219k430J152J337j394j196k909j065M768J995m350m793n24M468
393a438K116m092q34M074L224K32l292j773K577J596J357R68k747j983J086L61
409A432j455l326j098L850J619k008j912j714J485L287j3j06R81Q59J516m03j361
426A633j94j383L74L221ql438m008o82M527J371n367k511L859N410M24o059k369
443e200M327M303K218j780n135J09N805K819n210r517J193J1647K572j0613r049
458a1511M650J1664P9j1545k406Q959O953k216o802j381M699L086J301j586n325
473a381m07M542K005l788p776o27R405L362p190o604K697Q656O73p635m6P335
$$ plain form
362 2021 3832 1549 405 69 -3725 -4716 -1888 -1194 -2178 -3481 -1124 3207 -49 -5174 -2112 2986
378 2986 4722 3503 1073 2225 3562 2168 972 -1937 -3002 1766 3761 -589 -5382 -5906 -1438
393 -1438 678 -3414 -4248 -174 3050 3282 -10 -1783 794 2390 3747 4715 1968 -15 1071 1432
409 1432 -23 -3349 -4447 -597 1022 -986 -2898 -4612 -3127 160 147 41 1022 1881 3397 2994 1633
426 1633 1439 56 430 3651 3643 205 -3803 -4485 42 1413 -3954 -6465 -2606 2804 3228 -2831 -5200
443 -5200 -873 3430 5648 3868 -1267 -1158 4647 7466 2256 -7261 -6068 5579 8151 -2462 -11511
458 -11511 -6861 4803 4882 -6663 -9069 -110 6843 4627 -2175 -3556 1143 4229 5530 3944 -1381
473 -1381 -1788 2754 4759 971 -6805 -7432 1973 5335 -1855 -8459 -5762 2894 3567 -4068 -4114 3221
489C221K218l043k755J909K666l763j885M776J313n323m434K036N464k567o746
504f913K261N357J37j339l08J8j267R67P691J824j0568m260J0676Q214q677j5433
520a1620L123J7348J709j5920q097Q866J1206l202j0520j42P052L973P65l007
534A534m169K3M976O575k065j1259k451J0619O191q228j2882J814J4439L314j1979
549c548q053O149J0875m46r478q26P659L082k401k280O36K55j993K606L482n567
565A52n510L595N167k824p143O88P516m94n326K046M852j957m959K858R459j124
581F996j1610l62J2042L411j1173r051P647J0457m905r957o98N587L829k046l635
596c468l30J394L722M209k969n954L48O686N658m770r995Q35R667L040q102r617
$$ plain form
489 3221 5439 2396 -359 1550 4216 453 -1432 3344 4657 -666 -5100 -3064 2400 -167 -6913
504 -6913 -4652 705 842 -497 -805 -787 -2054 -1087 6604 8428 -2140 -6400 4276 12490 3813 -11620
520 -11620 -8497 8851 10560 -5360 -13457 -4591 6615 3413 -7107 -7249 -197 3776 4541 1534
534 1534 -2635 -2612 2364 8939 6874 -4385 -6836 3783 9974 1746 -11136 -9322 5117 8431 -3548
549 -3548 -11601 -5452 5423 4977 -4501 -5327 2332 5414 3013 733 1369 1624 -369 2237 5719 152
565 152 -5358 -1763 3404 580 -6563 -5875 1641 1147 -4179 -2133 2719 762 -4197 -1339 8120 6996
581 6996 -4614 -4976 7066 10477 -696 -9747 -2100 8357 3452 -6505 -7203 -1616 2213 167 -3468
596 -3468 -3798 -2404 1318 5527 2558 -3396 -3048 3638 9296 4526 -5469 -4634 5033 8073 -29 -9646
612i646L023J1504Q83r952n633N543R270p17q008r53N187L920R93l621l874J272
628h09M483K849m489p686K504P681j353p759k834N509N477m329m807L902L575
643A914j039j872J330L096j041k786K873K030l449k141R58J682p87l166N1J636
659g11j277m21O39m96J424N50q0J457K42k94K95j56J527J025k706j403J052P91
677A458o45l275j249L251O97k312j201M42K417R56j419M15J026J040J963j279
693B285k298J099J579p6k093k007J955P25l243j180J316J003k64j769P78K987
709G97m52j385P78J746J039n28r77J039K26q39k24j507n98R58n97j064p24r1J011
728a392j35p42J448P41j31Q26O50L03J16o84J197O33j654o05m36O2L13j976j080
$$ plain form
612 -9646 -6623 4881 5764 -4188 -9821 -4278 4992 4275 -3733 -4686 501 4421 5414 1793 -2081 -809
628 -809 3674 6523 2034 -5652 -3148 4533 3180 -4579 -7413 -1904 3573 -756 -5563 -1661 1914
643 1914 875 -997 333 3429 2388 -398 2475 4505 1056 -1085 -127 1555 768 -2398 -2347 -711
659 -711 -1988 -2409 -1770 -2266 -842 -292 -372 1085 1327 1033 1328 1172 2699 3724 1018 -385 667 1458
677 1458 813 -2462 -3711 -460 237 -2075 -3276 -2834 -417 539 -880 -465 561 1601 3564 2285
693 2285 -13 1086 2665 2589 496 -1511 444 1169 -2074 -3254 -1938 -935 -1199 -2968 -2190 797
709 797 345 -1040 -262 1484 2523 1995 1018 2057 2283 1444 1220 -287 -885 73 -524 -1588 -2312 -2403 -1392
728 -1392 -1527 -2269 -821 -80 -211 615 1265 1568 1684 1000 2197 2830 1176 571 135 197 510 -1466 -2546
747b546J055q1J46j60r56J165J493k34M51l8J023J679j307q48J191j79o15n01
765G38r62O77p85k131P78N61o95M2n22J175J648j149q4J564L67Q14l78r67J330
784B021L04j130m26j251K97J071k169j288R34K33J93o98o14J934R47m28N69j32
802C67R83J242j067j93M58p79O38n70j825k7J12m96Q3j267J86J178m40K05O58
821e54k40J225Q73J20K76o35L92J185j078j167J16q8r9r92j488R26J06r12K78
840a756J72L98Q31r0N76M47K07J127J48j333P39Q92o25j286j199R57P75k344j278
859b642J073L66J47r41j94J695M31o9J066l69M1J186M84o7j289o45J642m15j951
878d51m02j23k76R7n45J06l62k67K157N36j615N73J567J116l1j519N93J174j040
$$ plain form
747 -2546 -1491 -1572 -1426 -1586 -2542 -1377 116 -118 333 295 1318 2997 1690 842 2033 1854 1239 738
765 738 -224 453 -332 -2463 -1685 -1124 -1819 -1777 -2299 -1124 524 -625 -709 855 1222 2036 1658 691 2021
784 2021 2325 1195 769 -482 -185 886 -1283 -2571 -1637 -1404 -1211 -1909 -2523 -589 358 -70 499 367
802 367 1350 2592 1525 1332 1790 1011 1649 1079 -746 -773 -661 -1157 -1074 -2341 -2155 -977 -1417 -1212 -554
821 -554 -794 431 1304 1424 1700 1065 1457 2642 1564 397 513 425 326 -666 -2154 -1228 -1122 -2034 -1756
840 -1756 -1584 -1186 -355 -445 131 578 785 1912 2060 727 1466 2358 1733 447 -752 205 980 -1364 -2642
859 -2642 -1569 -1203 -1056 -1997 -2191 -496 -65 -134 932 563 604 1790 2274 2207 918 273 1915 1500 -451
878 -451 -853 -976 -1252 -1155 -1700 -1594 -1956 -2223 -66 470 -1145 -572 995 2111 2080 561 1154 2328 1288
897A288k13M40j630q57J08O21P8k869p54L490N56j632n23O22K413P68j377M76
915A005R9n1K104l87k699q32Q68J587p59l830k13K388L36o17j218q18K222J947
933A132Rr38j700K387L545k148k806O13K048P70k864j479J707r63j530J490J48
950e79j717r64K070L007j836l264K797L988j401k395N26K810k92l144Q88K297
966B791k609k656J346K266j223l802L17M075K33k772k15J620K143Q3j121L23K42
983A041K48J757r38k342k98O87J203o40k610j108J160J747Q23l173k340L926M109
1000C252j484m434L43N746J720n113j452L506R20k270j419J516n38l146J124L696
1016A967k419m525J587N337L84n540o43O482J564m733j082L692K011l210k220
$$ plain form
897 1288 1075 1515 -115 -972 -864 -243 -165 -3034 -3788 -298 258 -1374 -1897 -1275 1138 1906 529 1005
915 1005 1104 1053 3157 2770 71 -761 107 1694 935 -2895 -3108 -720 -384 -1001 -2219 -3037 -815 1132
933 1132 1141 203 -1497 890 4435 2287 -519 94 2142 2912 48 -1431 276 -687 -2217 -727 -579
950 -579 -2296 -3260 -1190 1817 -19 -3283 -486 3502 2101 -294 232 3042 2750 -394 494 2791
966 2791 182 -2474 -1128 1138 -85 -3887 -3570 505 738 -2034 -2249 -629 1514 1597 476 799 1041
983 1041 1289 3046 2108 -234 -532 155 1358 718 -1892 -3000 -1840 -93 730 -2443 -4783 -857 3252
1000 3252 1768 -2666 -2323 3423 5143 30 -1422 2084 3004 734 -685 831 293 -2853 -1729 1967
1016 1967 -452 -4977 -3390 1947 2331 -3209 -3852 2630 4194 -539 -1621 2071 4082 872 -1348
1031a348L535P49m511o31L003K12k807j905K429J974k172q57J835L21L71P42K4
1048I64L07l04K77J270r05j066j0r86P67J002k633j936Q41K759R78m182j993N139
1066B89K988l201k679K263M161r55l641J713J935k480o06J815k52l397j440M049
1082E62K008n845k353N434K898l417l199L065M420k102k945K771J677j865p04
1097D05J314M72k521j367K798L0l556m38K180K52j272n17J814Q04j391R15J466
1114A388q08O9J023K25o32p28P61M37k730j26K011r88k474K16K383K09l190K4
1132b930L951%k246Q86K301j01j754N89K440j646k675K212J537k844k333J535
1148a078K290j744l327K004K813j938j444J933J896p90j607K156J970k594p72
$$ plain form
1031 -1348 2187 2936 -1575 -2206 797 1009 -1798 -3703 -1274 700 -1472 -2329 -494 -173 198 940 964
1048 964 1271 967 1244 2514 1609 543 533 -453 314 1316 -1317 -3253 -2412 347 1325 -2857 -4850 289
1066 289 3277 76 -2603 -340 3821 2866 -775 938 2873 393 -213 1602 1350 -2047 -3487 562
1082 562 2570 -3275 -5628 -194 2704 -713 -3912 -847 3573 1471 -1474 1297 2974 1109 405
1097 405 1719 2191 -330 -1697 1101 1131 -2425 -2863 -683 -431 -1703 -2220 -406 398 -993 -78 1388
1114 1388 580 649 1672 1897 1265 537 1298 1735 -995 -1121 890 -98 -2572 -2356 27 236 -2954 -2930
1132 -2930 1021 1021 -1225 -339 1962 1861 107 696 3136 1490 -1185 1027 2564 -280 -2613 -1078
1148 -1078 1212 -532 -3859 -1855 958 -980 -2424 -491 1405 615 -992 1164 3134 540 -232
1163b32K624Ok333j187J884P82l242j006K712k99k138L82J729L83j332L10K370
1180A413k47j730J806J464j612r68P39J443j233k919J324J832k394j304J311O02
1196d73r63q06J762J320k037P9L085k84j842N41J731M83k431n80K361r36k548
1213a538Q79J056j173j651M06K349r22k335J975K484j392j123J365J670k46j796
1229HJ007J628k080j098J477R9j716j255J239J302k334j112K445N05j474K09J490
1246C40Q88j270j1K477n56k064J048J297r65j570j51J401q83k123R33J154j456
1263a511m28R37Q96l28j026J695J608j508m73J818L77j100q89J131N94k216p52
1280a175J787p17j777J13J118K13j515n7K299P8j350J163J258k02n66K22J213
$$ plain form
1163 -232 2392 2398 65 -1122 762 1544 -1698 -2704 8 -291 -2429 -2047 -318 65 -1267 -957 1413
1180 1413 1166 -564 1242 2706 1094 126 865 2308 1075 -1844 -520 1312 -1082 -2386 -1075 -473
1196 -473 -1436 -2242 -480 840 -1197 -1118 1967 1683 -159 382 2113 2596 165 -415 1946 1010 -1538
1213 -1538 -659 397 -776 -2427 -2021 328 -594 -2929 -954 1530 138 -985 380 2050 1804 8
1229 8 1015 2643 563 -535 942 1041 -675 -1930 -691 611 -1723 -2835 -390 115 -1359 -1150 340
1246 340 1228 -42 -53 2424 1868 -196 852 2149 1184 -386 -537 864 -19 -2142 -1209 -55 -1511
1263 -1511 -1939 -1002 -106 -434 -1460 235 1843 335 -138 1680 2057 957 68 1199 1793 -423 -1175
1280 -1175 612 -105 -1882 -1769 -651 -438 -1953 -2010 289 367 -983 180 1438 1236 670 892 2105
1297B105p79j543J033P31j882j020P49O78q66j609J018J472j288l81J560M41j74
1314B45j91R74J067j455k44J522m09j338j72K92J56j146j104J143j41r35N61M51
1332g24R0J09K74Q43J54p21J301O19j086j73N10j57l48j001M9N69j490l41R38
1351e85n03m13K96M66P49o10Q8J885k31q24N81N39O6o13o76P70j85j596L03L52
1371a41o00n43m09Q44M54q71K55J083n0M80M8J07P13k95p6L33o20l49L11o55k82
1392b63j81q06M25p4m51M35j36lJ238j38p3M84K09Q27k03p22M45K35n00k94n41
1413h7j39Q7q17N3K09o04J0M30K67L93m22K27J299K40m73J18J90M89l62q65J64
1434D07J31q19j61j87j20q2p32L48Q78m66k68O84O86O90p89j21J279J94n80j18
$$ plain form
1297 2105 1326 -217 816 1547 -335 -1355 -606 72 -794 -2403 -1385 87 -1201 -1582 -22 419 245
1314 245 54 1028 2095 640 396 1918 1509 171 -1 291 447 -699 -1803 -660 -801 -1736 -1175 -724
1332 -724 -634 -525 -251 592 746 25 1326 1945 859 686 1196 1039 691 -310 -261 308 -1182 -1523 -585
1351 -585 -1088 -1501 -1205 -739 10 -600 -512 1373 1142 318 899 1438 1504 891 215 985 800 -796 -493 -141
1371 -141 -741 -1284 -1693 -849 -395 -1266 -1011 72 22 502 550 657 1370 1075 999 1332 712 363 674 19 -263
1392 -263 -444 -1250 -825 -899 -1350 -915 -1051 -1054 184 46 -27 457 666 1493 1290 568 1013 1248 748 454 -87
1413 -87 -226 -139 -956 -903 -694 -1298 -1288 -858 -591 -198 -620 -393 906 1146 673 791 981 1470 1108 243 407
1434 407 538 -281 -442 -629 -749 -831 -1563 -1215 -337 -803 -1071 -387 299 989 200 79 1358 1552 972 854
1454H54l70M61m08r28J71k57p38K47k7l4R6m66O28J264l22m28N30M98Q95m99j026
1475A41J032L26p54p07k97K93P1j447J39Q00q51j37M37N64M02p49K80J739J1j010
1495B83L61P59L28r49j052J044K15j631k96N98p2o81p93J024P50r68j13J174M86
1514D67R2l44J73R84q4o12K72k54J40m06r32L20N7j043q5L99J5N1l97O37R88n29
1536i1j83P05O91N35o77p83J066K69j192m10K45K84r52j135Q55N61j313j14J277
1555c62K44l40l92J077J297j070l28R23N63n19p56jO52p29j248M93M41q37l91
1574a283k0O68J59q23Q88O00q2J95K66L14K63l40P5J58l39k72k44m70Q7k74o53
1595a127K07j0J6L23o36N00J013l24J3M40N15K65n54j96J009l70j036K39J34n29
$$ plain form
1454 854 484 945 537 -391 -220 -477 -1215 -968 -995 -1029 -933 -1399 -771 493 171 -257 273 771 1666 1167 141
1475 141 1173 1499 745 38 -259 34 105 -1342 -1203 -403 -1254 -1391 -954 -390 12 -737 -457 1282 1293 283
1495 283 644 1403 1731 782 -270 774 989 -642 -938 -340 -412 -1093 -1886 -862 -112 -1080 -1193 -19 467
1514 467 559 215 388 1372 1288 676 948 694 834 428 -504 -184 -127 -1170 -1255 -856 -841 -790 -1187 -550 438 -91
1536 -91 -274 431 1122 1657 980 197 1263 1532 340 -70 175 459 -493 -1628 -773 -212 -1525 -1639 -362
1555 -362 -118 -458 -850 227 1524 454 126 1049 1612 1093 337 336 988 259 -989 -496 -55 -892 -1283
1574 -1283 -1303 -635 -476 -1299 -411 189 107 302 568 882 1145 805 880 1038 699 427 183 -287 -200 -474 -1127
1595 -1127 -920 -930 -914 -591 -1227 -727 286 -38 -25 415 930 1195 641 445 1454 1084 48 287 421 -108
1615a08p25k41Q19j62j181N11Q37k26o5K74P78N23p82J26J150m16o29K77J10j79
1635F91r90k68Q68q11p32M43L0j38J86k0O10j2k49Q97K80j42L34J1o6m7n79K16
1657E12m3p99JJ49p34k26J99K35K43q04N74J248n36l19R72K59j03l68M60O03r19
1678F04o12N14j91q61j77j7M56n80n64P63L79m09J64O67K95m9k69P56N97q97o2
1699E07N87m06l88l99no0o50j62L52k27k10N06M4RL05K33P74j75j15O80k29l39
1721F32jN6k6o89m65N59k35j001K13L69j33k08p7Q12M08n48N86O50k47n9J61L45
1743A102Q0q18k94N72o11m90j89R4n5l80j25Q74m39k71Q67K83q5L43J16M53R2
1764A119p06N18lp74J66j04o17M1l41KJ14p02M20P05m11N4M66M58L98l25q6R20
$$ plain form
1615 -108 -833 -1074 -255 -417 -1598 -1087 -250 -476 -541 -267 511 1034 252 378 1528 1112 483 760 870 691
1635 691 -299 -567 301 -510 -1242 -799 -769 -907 -721 -741 -131 -143 -392 505 785 643 977 988 922 875 296 512
1657 512 469 -330 -329 -180 -914 -1140 -941 -706 -463 -1267 -693 555 19 -300 672 931 828 460 920 1523 604
1678 604 -8 506 315 -546 -723 -740 -284 -864 -1428 -665 -286 -695 -531 136 431 382 113 869 1466 569 507
1699 507 1094 688 300 -99 -104 -164 -814 -976 -624 -851 -1061 -555 -511 -502 -197 36 810 635 520 1200 971 632
1721 632 631 687 661 -28 -493 66 -169 -1170 -957 -588 -721 -929 -1006 -194 214 -334 252 902 655 596 757 1102
1743 1102 1182 364 70 642 31 -459 -648 -554 -609 -989 -1114 -240 -679 -950 -83 200 115 458 574 1027 1119
1764 1119 413 931 928 154 320 216 -401 -360 -701 -699 -585 -1287 -867 -162 -573 -519 -53 405 803 478 392 1312
1786A312m68m98N68k05k83n59k08M42n05p73N68J70o17K46P6M95L29k89N76M91
1806H68k52J59J13j35Ok81j69M3n90k76K68m57j83J18o9R3pJ84Q20l06r1Q15J65
1829H36l78K53P0L60n82o98O64j50r53j49J73K22o07l09P05M26m93K8P53K20k9
1850C62j63M48O33p65k15N92k94l68m65N2p9l53l82L83p5k16M40j58M03L44J2
1871A36K96J11k2M50j46l80L22j59l69l37j34K74l52p99M14M19o05QK24N75J54
1892H0n80O80R37n57k70O05M2M5p39k09O52m80j010L58N6k81k69k04P68J71o45
1913h50O00N50NJ37M9K12L07l45k05L27m44r0j56n53J06J7l97%MJ25K47k85K41
1936c98O90j40JL07K76L56n04k64P16k06q35J31j85q4n33l37N50J21o85K59N08
$$ plain form
1786 1312 844 346 914 709 426 -133 -341 101 -404 -1177 -609 -439 -1056 -810 -734 -239 90 -199 377 868
1806 868 616 775 888 753 759 478 309 352 -238 -514 -246 -703 -886 -768 -837 -744 -751 -567 253 -53 -144 671 836
1829 836 458 711 781 1141 559 -139 525 375 -578 -727 -554 -332 -939 -1248 -543 -117 -610 -582 171 391 362
1850 362 199 647 1280 515 300 892 598 230 -235 -183 -262 -615 -997 -614 -689 -905 -465 -623 -220 124 136
1871 136 432 543 521 971 825 445 767 608 239 -98 -232 42 -310 -1109 -695 -276 -881 -873 -649 -74 80
1892 80 -500 180 1117 560 290 895 937 982 243 34 686 206 -804 -446 -390 -671 -940 -1144 -376 -205 -850
1913 -850 -250 300 305 442 491 703 1010 665 460 787 343 253 97 -456 -350 -333 -730 -730 -726 -601 -354 -639 -398
1936 -398 292 152 153 460 736 1092 588 324 1040 834 -1 130 -55 -139 -672 -1009 -459 -338 -1023 -764 -256
1957b56J8J90j42L96O31l85n4N28Jj57m22j01J34m07n24J64n0j90l0m21M59L47
1979b71k66K30M77J98K60l57K37O20m31k89J20q4r3n41m22N15k28o04K22J35Q6
2000d86r5j37P49K53l43K49N01K9P6k73J79K01o86j34J14m15N5k75n25K08K22
2021e33l22K87Q2L61J93l00N65N11l43R2R5o6R8n08k18N52n72o70J33L0O8l21
2043g86k46O42J69n29N49O48m7j14N9K93L11n46K2M81n95k66o2k11O4m44k30M47
2065c91l38j36M24O5Q9N15j02K39K07k68O11k20l41L70j97m32n5k98J04l29n73
2086a056N24J48l39J01L10J72J96k30N64O52n34m0M06k14j25l99j1M24o84o69
2106h04O89j33n67j9K04K64j21j75Q91j19k22N63J10M8J27j90R4j00m96R6J16
$$ plain form
1957 -256 -238 -48 -190 206 837 452 398 926 927 770 348 247 381 -26 -550 -386 -436 -626 -656 -1077 -618 -271
1979 -271 -537 -307 170 368 628 271 508 1128 697 408 528 444 351 -190 -612 -97 -325 -929 -707 -572 -486
2000 -486 -581 -718 31 284 -59 190 691 720 796 523 702 903 217 83 197 -218 -163 -438 -963 -755 -533
2021 -533 -855 -568 -486 -125 68 -232 333 844 501 593 688 622 720 212 -6 546 -26 -696 -563 -533 -465 -786
2043 -786 -1032 -390 -221 -750 -201 447 400 286 345 638 949 403 425 906 311 45 -17 -228 -164 -608 -838 -391
2065 -391 -729 -865 -441 -376 -287 228 126 365 572 304 915 695 354 724 527 95 40 -258 -154 -483 -1056
2086 -1056 -532 -384 -723 -622 -312 -140 56 -174 390 1042 508 468 874 660 535 136 125 549 -135 -804
2106 -804 -115 -248 -815 -834 -630 -366 -487 -662 229 110 -112 451 561 609 736 546 640 540 44 140 256
2127B56o81k0M0j54j4l28M16L27l24P5O89K1j13J59M81J46n25Q1M00n30o49L33
2149H6Mj73n50k76O47j54o44M99L11J54m1L9P49L6n20M95L37m03k66l5J76k97
2171A74p26L22K69o74k47M94k09j09K42K95M31l08L1Q49k83j52M01r8k34j80k05
2192H3L21l58p46M66j0o39J20K72K17j17k98P12L47l85J22N42J31k68l28L83M16
2213I83r81k48M60k35o01N3k8L19m79j70P47O2k97L68L83J55j34l5O25j12o51
2234A84L13R7n72j48j19O9j95m48L15K44m75K38M38k38K20m7M10M30m47pO52l67
2256E47l16K1J70j90o07j66N05k83o61L98L54j26k55N5Q01K4n11O35N38n31p6
2277C26K48J38k90n13J06K43o38j34K38j23l0k94K71L08m00K07O03Nk01K51K22
$$ plain form
2127 256 -425 -445 -405 -559 -573 -901 -485 -158 -482 -407 282 303 190 349 830 976 451 532 932 402 -247 86
2149 86 90 -83 -633 -909 -262 -416 -1060 -561 -250 -96 -137 -98 651 687 167 662 999 596 330 295 471 174
2171 174 -552 -230 39 -635 -882 -388 -597 -706 -464 -169 262 -46 -15 834 551 399 800 702 468 288 83
2192 83 404 46 -700 -234 -244 -883 -763 -491 -274 -391 -689 23 370 -15 107 649 780 512 184 567 983
2213 983 2 -246 214 -21 -622 -569 -597 -278 -757 -927 -180 -118 -415 -47 336 491 357 322 947 835 184
2234 184 497 594 22 -126 -245 -176 -371 -819 -504 -260 -735 -497 -59 -297 -77 -124 286 716 269 262 914 547
2256 547 231 252 422 232 -375 -541 -36 -319 -980 -582 -228 -354 -609 -554 247 271 -240 395 933 402 326
2277 326 574 712 422 -91 15 258 -380 -514 -276 -399 -429 -723 -452 -144 -544 -337 266 271 70 321 543
2298E43J37l32LM31m95m57K84p0l90j6k18K61l17l35P03J60l35K49L76K84N7m46
2320G7M49M88o95m8M37l89l49j67p0K10m97k53N15j73j81K48P8K71J52j08N60
2341E55r1k33L97K1k60N1j85P4l44m17K23j41m21J47K65j77K84k95N69L99m77
2362e6L23N65k49j51oQ7n4l68j93L95m06m38J76O0j31k90J7O08p5l54O20J64j1
2385B33J94o2K08K12n11J56J43m13j58o8o9k52j58n2K28j06N3M43k09P3L28r1
2407A22L26r9M9L50k74k84K95k33k94q7j6M9l82k57L86N5k59J91J22K62m5rM48
2430D16K62m52J67J52o1j53l17L6O4n12r3J53j17j03N4J31K50l7p6L93J15j51
2452A21K28M8K54J3m99J77j07j70nk82j83K14l86Q5K33k14O0K30k11L99Q6m1L99
$$ plain form
2298 543 680 348 351 782 287 -170 114 44 -346 -362 -580 -319 -636 -971 -268 -108 -443 -194 182 466 523 77
2320 77 526 1014 319 271 708 319 -30 -197 -267 -57 -554 -807 -292 -465 -646 -398 -320 -49 103 -5 555
2341 555 464 231 628 649 389 440 255 329 -15 -432 -209 -350 -771 -624 -359 -536 -252 -547 22 421 -56
2362 -56 267 832 583 432 426 513 459 91 -102 293 -113 -551 -375 -315 -446 -736 -719 -111 -186 -540 80 244 233
2385 233 427 365 573 785 274 430 573 160 2 -66 -135 -387 -545 -597 -369 -475 -422 21 -188 -115 213 122
2407 122 448 349 398 748 474 190 485 252 -42 -129 -145 -96 -478 -735 -349 -294 -553 -362 -240 22 -23 -32 416
2430 416 678 226 393 545 484 331 14 50 114 -398 -491 -338 -455 -558 -504 -373 -123 -160 -236 157 272 121
2452 121 349 397 651 664 165 342 235 65 60 -222 -405 -191 -577 -492 -259 -473 -413 -183 -394 5 91 50 449
2475D49R1o2M4j04j59K66m70m1r3j17j7l60M5J42n1p5K88J04J1K49j91L39J53
2498D41k04L23O7k40Nk20j61J04m32j12K09k98M1J22j27K37M1r2M27K41j93K51
2520D30j26J07J19l16J24ml84Rn2k68k2ln7J78k85K19J86j5J96J06Q1K59m5k03
2544B34K99m8l15K03k38k1j71k61M3J0l47K3J76JK24r8L40K5l5K79L06k91J51
2567D89l4k2r2k36p3r1k39l8oj04K1m6J44J20j61J70M28j10K4L32mnl9j09R3j55
2593B57m61K83j98k10j01KK0L2j66K87J88j33J87L43k5Q6k86L05L99m71k06L07
2615D39k33k07k33q2J73l14j50K59J22k70K53J47K3K37k12N32J26k89NK37k09
2636C54j3l17LN5l57p3J00l24R5J29N1r6J20K27J97jJ1L89k08m8J57q3J40l69
$$ plain form
2475 449 540 478 522 418 259 525 55 14 -79 -196 -213 -573 -528 -386 -437 -512 -224 -120 -109 140 -51 288 441
2498 441 237 560 627 387 392 172 11 115 -317 -429 -220 -518 -477 -355 -482 -245 -204 -296 131 372 179 430
2520 430 304 411 530 214 338 334 -50 -41 -93 -361 -383 -386 -443 -265 -550 -331 -145 -160 36 142 223 482 437 234
2544 234 533 485 170 373 135 114 -57 -318 -275 -265 -612 -589 -413 -412 -188 -286 54 79 44 323 629 338 489
2567 489 455 433 341 105 32 -59 -298 -336 -342 -446 -425 -471 -327 -207 -368 -198 230 120 144 476 472 467 428 319 412 257
2593 257 -204 79 -119 -329 -430 -428 -408 -376 -542 -255 -67 -200 -13 330 305 391 105 410 809 338 132 439
2615 439 206 -1 -234 -316 -143 -457 -607 -348 -226 -496 -243 -96 -73 164 -48 484 610 321 326 563 354
2636 354 341 24 27 82 -275 -348 -248 -572 -477 -348 -297 -393 -273 -46 151 150 161 550 342 294 451 368 508 139
2660A39k68K90k28l83R2P2N2k45l1M52J19m34L04M85j19q3K64K9N2m58J95K26
2682E22l71l44J38o8j73j79l6L36k27o1L01J05Q0L5K2K98m3j82K93p7j56m3n3
2705A17p0j45l10L34o0l74J06J52j37P0J63J07J10j69L72K40j45q9J48r4j45n4
2727A27j1J47m37k22K67r0j88M3J08J93k19j29O47K4k53K40K14J35k21k26J64
2748C13P4l70Mmk88q3o0L6K14k40K2L52l03L10K65p7J33J04nJ40k90j13K91k66
2772A59j56n7j32j32m6j34L25Lm64M98K05j63P6R8L34K40n71L00K17k69k16M1
2794A56k11P9l32p6M49m05l20L40J29N9q4L8N23j91J9J93L3j26J26j46O2k6m04
2817a15J34o8l10J13j04J2m7k3J28K18m3J40K08k23J20K50np7l7O9O2k92k62K48
$$ plain form
2660 139 -129 161 -67 -450 -358 -286 -234 -479 -510 -58 61 -373 -69 416 297 214 478 507 559 101 296 522
2682 522 151 -193 -55 -123 -296 -475 -511 -175 -402 -463 -162 -57 23 58 80 378 335 153 446 369 213 170 117
2705 117 47 -98 -408 -74 -134 -508 -402 -250 -387 -317 -154 -47 63 -106 266 506 361 272 420 326 181 127
2727 127 116 263 -174 -396 -129 -219 -407 -364 -256 -63 -282 -411 236 260 7 247 461 596 375 149 313
2748 313 387 17 21 17 -271 -354 -414 -378 -164 -404 -382 -30 -333 -23 242 165 298 402 397 537 247 134 425 159
2772 159 3 -54 -186 -318 -364 -498 -173 -170 -634 -136 69 -94 -18 80 414 654 83 383 600 331 115 156
2794 156 -55 24 -308 -384 65 -340 -660 -320 -191 -132 -216 -178 345 154 173 366 399 273 399 253 315 289 -115
2817 -115 19 -49 -359 -246 -350 -338 -385 -408 -280 -62 -105 35 243 20 140 390 385 308 271 340 402 110 -152 96
2841I6l09l7k05J51J66k65j49M34J78k24J79J99J1R2r1L01j07l15q6K74j74k55
2863a36p5q9K70l86QK37l3q2L4J46L19l9j09K53JK1J40k47K09k88j56O6k56j42
2887c34Pj15l2Q7M8K0R5J08K73n4o4K34J81k39N2o7J64p3m54R1P4l17qQ9j07m0
2913c81m0J19L53k09j08L70K19m4j71J45K41k04k75K39Qk67j77r9J34o4j51L6
2935c26J99j79J37j0R4J46JP6K58q3n4J50k32N5o5j43j15M5j24o3j97M2J59p3
2959c02J8J79J06l1J66K0K79j2k84J48J57r2k17o2r8p9k32O6J92k38j44P5K22
2982a63J49j18J23K83q7J3k6J98M8j69l6O8j91j53jj39P4j6k44J40j0q0J71J34
3006c2J21n1J15j18L25J5r7K4j89Q5o1j85Q1j21j56r5L9K5l1LJ6J99kJ04O1Q9
$$ plain form
2841 96 -213 -250 -455 -304 -138 -403 -552 -118 60 -164 15 214 225 317 226 527 420 105 19 293 119 -136
2863 -136 -211 -300 -30 -416 -408 -171 -204 -286 -252 -106 213 174 65 318 319 340 480 233 442 154 -2 64 -192 -334
2887 -334 -327 -442 -474 -387 -339 -319 -224 -116 157 103 39 273 454 215 267 200 364 291 -163 -72 2 -315 -323 -234 -341 -381
2913 -381 -421 -302 51 -158 -266 104 323 279 108 253 494 290 15 254 262 -5 -182 -281 -147 -211 -362 -326
2935 -326 -127 -306 -169 -179 -85 61 62 138 396 313 259 409 177 232 167 24 -91 -46 -170 -233 -430 -388 -229 -302
2959 -302 -284 -105 1 -30 136 156 435 423 139 287 444 352 135 73 -25 -104 -336 -270 -78 -316 -460 -385 -163
2982 -163 -14 -132 -9 274 187 200 174 372 420 251 215 283 92 -61 -62 -201 -127 -143 -387 -247 -257 -337 -166 -32
3006 -32 89 38 153 35 360 375 278 302 113 198 137 -48 33 -88 -244 -339 -300 -275 -306 -303 -287 -88 -90 14 75 164
3032A64K54j85m5L59k91j30L9k15Q4j79j06J88j39l10J82J20m5J62qJ44J45j10
3054G8J27K18k12J44j59o2J03j54k29R2l5j96Q0j16l2J50l7J61Q1j29K06P9k0
3077A38K31p7lP6j95K8Ol07Q0o2k15Q6r3Q1J6Pm5K46r6J64J92q5L8K0L9L7j28
3104A79n6J71m68J47o7r9L3M9k17J12L6o6R4j5P7L64j68J54K3j06J14N6o4r1j29
3129F3p0n3j40l9P8j44J35R8k36J21J78L3P2J18j02K35k01J14kk19K19j70q5r6
3153i3PL1q9p1k19K28oP4n4J05J87J0l9J59J43k28J02l3j58J39j54m1l1j53K6
3178a58m9o5K8M0rJ15M4K4K26j67J55Q9J8j4k3p3j52m2J6O0k26k11K23k05P6l8
3204c18J10K15j52m3K39O8q7K10p8J29R9l80Q6J04j32j04k0j56J15k12P3jj8R3
$$ plain form
3032 164 418 233 188 547 256 126 165 -50 34 -145 -251 -63 -202 -512 -330 -210 -255 -93 -101 43 188 78
3054 78 205 423 211 355 196 134 237 83 -146 -54 -89 -285 -205 -321 -353 -203 -240 -79 2 -127 79 158 138
3077 138 369 292 289 365 170 198 204 -103 -23 -85 -300 -214 -307 -226 -210 -203 -248 -2 -98 66 258 173 211 231 270 307 179
3104 179 123 294 -174 -27 -94 -193 -160 -111 -328 -216 -180 -246 -152 -167 -90 274 106 260 283 177 291 347 283 192 63
3129 63 -7 -60 -200 -239 -161 -305 -170 -72 -308 -187 -9 24 96 214 112 347 146 260 258 39 258 88 3 -93
3153 -93 -86 -55 -144 -215 -434 -206 -212 -138 -192 -87 100 110 71 230 373 145 247 214 56 195 41 0 -31 -184 -158
3178 -158 -207 -272 -244 -204 -213 -98 -54 -30 196 29 184 273 291 277 254 181 29 -13 3 63 -163 -374 -151 -356 -280 -318
3204 -318 -208 7 -145 -188 51 119 32 242 164 293 392 12 98 202 70 -34 -54 -210 -95 -307 -234 -235 -253 -160
3228a60P1mK64o6j2J20p3KJ06n7j34J3j7n3j64o3M2Q4j64M4J53j60J20j9J24P2
3254F9k9J77rj97J60O5q1m8j36K1K4k01K7L9j46l3L8Q4R7n0N4K04j27J15J31M9
3280B97m0J4j21L2o8k48J55q9j23J5L0j5Ql1N6J57j17Q6J05l7P2N5P6R7k88%P8
3307A56j54J9j01o4J4m0j67K19j54rJ67L2J66q9N0J83j15o3J66K0l3m6j39q9n7
3332a28n2J10o8j88J23m8J31k1OJ36J59l9p7K27p4rN1k6J7j69j72K26j49p4N4
3357e4l8k4m2q1K38l1p7J92Qp3K16j26K1J17l5N9l0l15n4J81k31kj11L8J46j21
3383b29MK61j17pK13k2J57j45K5J98j08j93L0J3j1k06J4J42j76j20R8P1ML0o0
3408a34J39Q3q5l8K85j10L5L2j27lN7o0q2q9N3j23p6O4J43j55j4J14J12j31N5
$$ plain form
3228 -160 -89 -93 171 105 93 213 140 142 248 191 57 70 53 0 -164 -227 -185 -101 -265 -221 -68 -228 -108 -127 -3 69
3254 69 40 217 208 11 171 236 155 107 -29 -8 16 -185 -158 -119 -265 -298 -260 -176 -79 -129 -75 129 2 117 248 297
3280 297 257 271 150 182 114 -134 21 -68 -191 -176 -146 -161 -153 -184 -128 29 -88 -2 103 66 138 193 269 366 78 78 156
3307 156 2 21 -80 -144 -130 -170 -337 -118 -272 -281 -114 -82 84 -5 45 228 113 50 216 236 203 157 18 -71 -128
3332 -128 -180 -70 -138 -326 -203 -251 -120 -141 -135 1 160 121 44 271 197 188 239 213 230 61 -111 115 -34 -108 -54
3357 -54 -92 -116 -158 -239 -1 -32 -109 83 91 18 234 108 129 246 211 270 240 -75 -129 52 -179 -181 -292 -254 -108 -229
3383 -229 -225 36 -81 -88 125 103 260 115 140 338 230 37 67 80 69 -137 -123 19 -157 -277 -179 -108 -104 -74 -134
3408 -134 5 88 3 -35 250 140 175 207 80 77 134 74 -8 -97 -44 -167 -243 -179 -36 -191 -205 -91 21 -110 -55
3433e5K13R6j30R3O1n6p1j23j19J74j30k20J33q2M8M6l9J34k0j86K78J95j58m
3457G8J17k4Kr8p6P0P7l02K8qp8R8j81RR2P3J24j33N4K57j15q3K16M5j8j58N1
3484A17p5m4L1K7j79k8q2m4Q9Lq8K21J61j85K27j24O3J51p5m9K31k16p6M6j37
3509c5M1J16l43J94j28K6N6Mk1LQ6o5K18k8L2j5j9O2m4j87K69j98r7n0K4qk8j18
3537b53L4J96q1J5j9J32M6K5J4J29q5k6n3l4J9n8o8J14r1J5j64K7K7l1o3K13L0
3564A0l3K07p1l7J39p2N9O7j28L6M0o7o7k83J15p8j4r1J16rO3m0Q0J09Mk6N3J18
3592B00p1P5j05JM3j26mo0l9j7K8o9L3j37K6J88j00J66pN4O2Q3j00L2l8Pj3Mj69
3621e3K7p7J3N7j23mK0O1N6PM6p3J34m7J66j35l4K50k48J21lk09O1m2r1J26j96
$$ plain form
3433 -55 158 254 124 217 278 222 151 28 -91 83 -47 -267 -134 -216 -168 -122 -161 -27 -47 -233 45 240 82 78
3457 78 195 171 173 75 -1 69 146 -156 -128 -136 -214 -116 -297 -288 -196 -123 1 -132 -78 179 64 -19 197 242 224 66 117
3484 117 42 -2 29 56 -123 -151 -233 -277 -188 -185 -273 -52 109 -76 151 27 90 241 166 117 348 132 56 102 -35
3509 -35 6 122 -221 -27 -155 -129 -73 -69 -90 -87 -1 -66 152 124 156 141 122 184 140 -47 222 24 -73 -123 -99 -107 -135 -253
3537 -253 -219 -23 -104 -89 -108 24 70 95 109 238 153 127 74 40 59 1 -67 47 -44 -29 -193 -166 -139 -170 -233 -20 10
3564 10 -23 184 113 76 215 143 202 269 141 177 217 150 83 -200 -85 -163 -177 -268 -152 -161 -98 -138 -58 51 55 29 82 200
3592 200 129 204 99 100 143 17 13 -47 -86 -103 -75 -144 -111 -248 -222 -34 -134 32 25 79 141 224 124 156 118 125 112 116 -53
3621 -53 -26 -103 -90 -33 -156 -160 -140 -79 -23 -16 30 -43 91 44 210 75 41 291 43 164 161 -48 13 -29 -120 6 -190
3648a90o1Q0O5PO7o4J46J08l1J30j32R2o6J2j48J78j77j39R5j21K3O8r6m8j5J89
3674b8N9j1p9P3K1J07k4m9O1K0m6Pl8j48K6o3K8j4p8J53j38l1M1J49p0K46j33
3701D1p4L34k65R8L6K3j80J69k04Q3n0j45n2J6Q7o3j4O1K3J81j81J50MJ01j05
3726G4J35j3j06P7k6k05J45r7j4k49K06l2l5n8J06J42n8J13O9j83J23N2NP9n7
3751A93k01J42Lj42N1p5n2j16JK0M5K3Q1p4M1J73n3RO0lM4o3n0n7J41j61o2m6
3779a28P0l7j01P9R2j10P5K0j2J49p2O7L8L8j48K06r5n6N6j05k7j38J05n1l5o5
3805a85J37Pq2R9L2j17R7P9j1J8J21p9O7qq3j70MJ35j67M1K7Nj80M7O3R5m5M8
3833eL0P3n8J04o5Q0j08J1M1j37J25q9r7r9Q8k4j1K7Q7j8j3n1P4p7K58K7p1K2
$$ plain form
3648 -190 -251 -171 -106 -99 -32 -96 50 158 127 257 125 217 151 163 15 193 16 -123 -28 -149 -126 -58 -154 -202 -217 -28
3674 -28 31 20 -59 14 35 142 118 69 130 150 104 111 73 -75 -49 -112 -84 -98 -176 -23 -161 -192 -151 -2 -72 174 41
3701 41 -33 301 36 134 170 193 13 182 -22 61 11 -134 -186 -170 -83 -146 -160 -99 -76 105 -76 74 78 179 74
3726 74 209 196 90 167 141 -64 81 -16 -30 -279 -73 -105 -140 -198 -92 50 -8 105 174 -9 114 166 171 250 193
3751 193 -8 134 137 -5 46 -29 -81 -197 -196 -176 -131 -108 -27 -101 -60 113 60 69 129 126 170 107 57 0 141 -20 -82 -128
3779 -128 -58 -95 -196 -117 -25 -135 -60 -40 -52 97 25 92 130 168 20 226 131 75 131 26 -1 -139 -34 -85 -120 -185
3805 -185 -48 -41 -123 -24 8 -109 -12 67 56 74 195 116 183 175 92 -78 -74 61 -106 -65 -38 -33 -213 -166 -103 -8 -53 -5
3833 -5 25 98 40 144 79 159 51 62 103 -34 91 2 -95 -194 -106 -130 -141 -114 -27 -45 -58 -109 -35 -112 146 173 102 124
3861A24m3Q3q4o2j14R2n6j25L6N0Oj2m8J6P2rJ42J03j97J24J59j57P3o6k7Km9
3888C3n4P3p0p9k6k1L7r2LN7M5R6P6j30J66L3l3R5r2q2k4M7q2k2M6r7P5j52lJ69
3918ho9P8M2K3l1j31J80K1j00R4J22o8k6r4M7m2n5r8N1p5LP6qO0j51J63o6J20
3946E8qJ5O8K9M2r7o8QJ1L0n7j15J21q2j23lR9m6l0J85o1l3O8R2P9p1j0l7J20
3975A84j0m1k3j25j04kJ02m7P3j96M3P7l4%J06Q2o9P6K4P4k3o7N7p1q2Q4k20J0
4003a22J9J56k07J8L3K1pM6N2J0pJ25n6p5K70j83m7pJ9r7LL2j28J10j10J07r7
4030a22j1J8M4k8J58j8J8O6j29J19pj5r3o7L3Q0j65R0m1j35R2M4o7L6JN4K5LK19
4059B02m4o5o7J74j62N0l5N8o7oj30L8Kr0J10kr5KL3Q4l2K19r2J2l8J15j7n0J5
$$ plain form
3861 124 81 164 80 18 -96 -4 -60 -185 -149 -99 -93 -105 -153 -137 -65 -74 68 171 -26 98 257 100 173 107 80 82 33
3888 33 -21 52 -18 -97 -123 -144 -107 -199 -196 -139 -94 2 78 -52 114 147 114 209 117 35 11 58 -24 -46 0 -97 -22 -174 -177 -8
3918 -8 -77 1 43 66 35 -96 84 105 5 99 221 153 127 33 80 38 -17 -115 -64 -139 -136 -60 -68 -8 -159 4 -62 58
3946 58 50 65 133 162 204 107 39 47 58 88 31 -84 37 -45 -168 -171 -72 -118 -148 37 -24 -57 11 103 182 111 101 64 184
3975 184 174 133 110 -15 -119 -121 -19 -66 7 -189 -146 -69 -103 -103 3 85 16 92 116 190 167 100 157 86 4 88 -132 -122
4003 -122 -103 53 -154 -136 -103 -82 -89 -43 9 19 12 137 81 6 276 93 46 39 58 -39 -36 -4 -132 -22 -132 -25 -122
4030 -122 -133 -115 -71 -99 59 41 59 125 -4 115 108 93 0 -67 -34 46 -119 -29 -70 -205 -113 -69 -136 -100 -99 -45 -20 -17 202
4059 202 158 93 26 200 38 88 53 111 44 38 -92 -54 -52 -142 -32 -34 -129 -127 -94 -10 -42 177 85 97 59 174 157 107 122
4088A22p3qP4r2m3q6mPOl2J01j33P7J60k1J36m1p9O9J25j02j01jj33j06J98j56
4115a36J60lp3j4j4o2J40q2J73Jr7J87o9m2M6Q3r8J4j61J60k22L0O6p7o1n4J54
4142e1q9M1O0M3K5n2J52N9p9j9R2r0L3r5k2N4j56RL9k4k4o0Q9Q3J6n6J41j20o
4171gN2L2l1N5N3l7q3l3J5q2j5J0q9lJ44m9o3Q6N1R5j9j34R4K0L5P3nL1j43j02
4201d9L6j8j16L1J14r7k3N4l1J46L9o1L2l3J65m5q5k9J0k3J18j03j9K9j21Q7j37
4228a29J18k2n3k8N2o6K07m6j1K6L8J06j21J09n7p5M0l3j9m7Rj05O9k00K77j27
4254h8k1L9P0J37j64O4J01j24M8P2o5j9J0l1N0j31j4M7k9O2r0PL5o9P6M6O0p4
4282EN2Q4q0Jj07J6R2k7K6j79KN2M4p1k1R0l0N9j14J05qP0K3O6j36J36j85J64
$$ plain form
4088 122 49 41 115 23 -20 -106 -110 -103 -97 -129 -28 -161 -84 76 55 191 150 71 140 265 163 62 61 -72 -178 20 -136
4115 -136 24 21 -52 -66 -80 -142 -2 -84 89 90 -7 180 111 69 115 198 100 114 -47 113 -109 -79 -13 -90 -151 -205 -51
4142 -51 -140 -99 -39 4 29 -23 129 188 109 90 182 92 125 30 8 62 -94 -85 -46 -70 -94 -154 -65 18 34 -22 119 -1 -7
4171 -7 45 77 46 101 154 117 34 1 16 -66 -81 -71 -160 -163 -19 -68 -131 -45 6 101 82 -52 42 62 97 170 165 196 53 -49
4201 -49 -13 -31 -147 -116 -2 -99 -122 -68 -99 47 86 25 57 24 189 144 59 30 40 17 135 32 13 42 -79 8 -129
4228 -129 -11 -33 -86 -114 -62 -128 79 33 22 48 86 192 71 180 123 48 88 55 36 -11 -2 -107 -38 -238 39 -88
4254 -88 -109 -70 0 137 -27 37 138 14 62 134 69 50 60 29 79 -52 -66 -19 -48 14 -76 -69 -34 -103 -27 19 79 5
4282 5 57 141 61 62 -45 -29 63 36 62 -117 -115 -63 -19 -90 -111 -21 -51 8 -106 -1 -9 61 84 150 14 150 -35 129
4310A29r5n8K5R3q6j8p2j14N4J29m2K9p5KK16j64Q8p7J48J3j50J67j35J54j92
4335c1Q3r3n9J05q8J3l8J74p1p9o0J96P9j11N6l9p6J85l8o0l3m4Lo7jr1K9P5M
4364g7o2Q8Q4j28KK06k4L2l5k2l3q9J00J9j2q5J09j91R1o3q4J07lJ4j0n0J01R4
4392G9j3q4M7oO1Q8j27P8j20j5J6R1k19N1J76k31J19j50J85J8q2N5o1J10k7Q4
4418A23P0j57L4J34j44Q9lk16N9j9P3p9j27N6K3m3J08oNL1R2N0nJ6k15J27p6M7
4446D7K5p5rq1P3j22P7R0j57J64j54J10J33l9o5l1J31kj8j27J48q8K5l9NKq1l7
4474i5JO6L5j3j3J9%NK4oJ7n5J28L8j06N6j70R4m4p6N8k0k2q9R9MM2m0M1MM3K6
4506E1k1M0n6Kl1J23k9n0M1j02N3j3q8QJ4K3K4Nj11J51k2J0K4J7J7J00j59m6J80
$$ plain form
4310 129 34 -24 1 94 8 -10 -82 -196 -142 -13 -55 -26 -101 -99 117 -47 41 -36 112 125 -25 142 7 161 -31
4335 -31 52 -41 -100 5 -83 -70 -108 66 -5 -84 -144 52 131 20 76 37 -39 146 108 48 15 -29 -26 -93 -94 -185 -156 -81 -77
4364 -77 -139 -51 33 -95 -93 113 89 121 86 64 31 -58 42 61 49 -36 73 -118 -27 -90 -174 -67 -70 -56 -66 -116 -15 79
4392 79 66 -18 29 23 84 172 45 123 3 -12 4 95 -124 -73 103 -128 -9 -159 26 44 -38 17 -44 66 39 123
4418 123 193 36 70 204 60 149 146 -70 -11 -30 43 -36 -163 -107 -84 -127 -19 -25 -20 11 103 153 148 164 -51 76 0 47
4446 47 72 -3 -12 -93 -20 -142 -65 25 -132 32 -122 -12 121 82 17 -14 117 115 97 -30 118 30 55 16 21 23 -58 -95
4474 -95 -94 -28 7 -6 -19 0 0 5 29 23 40 -15 113 151 45 101 -69 25 -19 -95 -37 -57 -79 -168 -69 -65 -23 -63 -22 -18 25 51
4506 51 30 70 14 16 -15 108 79 29 70 -32 21 8 -80 -72 -58 -35 -11 -6 -117 34 12 22 46 63 80 180 21 -25 155
4535A55j28J3lK3j14l6J48j52j1K5k8k7J92q2J11o3oO6m5l1OP3j08P6m7l6k5o8
4563a22P5O1j88J61%J4J7M2P7n2l8RNl1J62j72N0Q7k3j37kq4q0J18J6o1Q6R5r4
4592imJ68k12P6OJ7J5q3J00p1o1K15l05O4L2P4j22J6M3j6L9m4P7R4j3j02r0J61
4620F5Q4p3l6N8j03q2OLP7m8NK1j66J02l9J4P0J4K6J8J16j56K12j11M9j09L9p7
4648b1O4m4j89J46k3j15K9M5mJ67r5J14qo5N2j9j8R9jj07k0l5K0J29j63K6p6N7
4676e5Q4j55J31O9j44Q8N5J7P3j48J12m8l0O4l9K2j57qp7K36j27nm8o4J31J7j3
4703a9P1j29J10jNj00Q3N6J8r8j3M5p7o0L5QJ15j49M2q3J03J0N2m0M8M7n9K8N8
4732A06j15J32j02%j3p2k3J46n1p8P1j15l9L5J34N3j73Q8K1k4m4P0J02j11J9L3
$$ plain form
4535 155 27 40 37 60 -54 -90 58 -94 -105 -80 -108 -135 57 -25 86 23 17 83 38 7 13 86 -22 54 7 -29 -54 -122
4563 -122 -47 14 -174 -13 -13 1 18 60 137 85 47 56 61 30 192 20 70 157 134 -3 -5 -89 -169 -51 -35 -96 -10 85 -9
4592 -9 -13 155 -57 19 25 42 57 -26 74 3 -58 157 -148 -84 -52 22 -100 -84 -41 -57 -18 -62 15 109 96 -6 -96 65
4620 65 149 76 40 98 -5 -87 -81 -78 -1 -49 -44 -23 -189 -87 -126 -112 -42 -28 -2 16 132 -24 188 77 126 17 56 -21
4648 -21 43 -1 -190 -44 -67 -182 -153 -108 -112 55 -40 74 66 1 53 34 16 115 114 7 -13 -48 -28 101 -62 -36 -112 -55
4676 -55 29 -126 5 74 -70 18 73 90 163 15 127 79 49 113 74 96 -61 -69 -146 90 -37 -42 -90 -154 -23 -6 -19
4703 -19 52 -77 33 32 37 -63 20 76 94 -4 -17 28 -49 -109 -74 -66 49 -100 -58 -141 -38 -28 24 -16 32 79 20 48 106
4732 106 -9 123 21 21 8 -64 -87 59 8 -70 1 -114 -153 -118 16 69 -104 -16 5 -19 -63 7 109 -2 17 50
4758E0rR3j39k7j28l3J48l1k1M7L0j1j8K6P0J25k2J2J7j19j11R4P4j03m0J8l0
4785c8l7J5JO1r1J33j26J01o9L7%j5J39j1n9m7R3j31N4Nmoj13K0M4k6n0K16k88
4814a92J12J62o1o3P3P8q2QJ7Q4j71O3j49Q4N7r1K3j06P8O2p8PM9KoJL9J24k5
4843I9m7o0J2O0m7Q9j88M7k6Kj5N0o3Q0m6N5J2OM1n0mJ04QQr4O6j64PJ35j7j35
4874g5N8J5m5J7j20R3J6M1J15j24p5K05j14L5P4j1p7l5j5P8L5j81Q2K4o4pJ0m
4902d9p9Q7K9N9j16J39qn4NP6n1rn2K02q8p9o7J9J3j36L8O0J04j74Q0J04k5M4
4930G2N5mRj24R4o0J8Nr2m8J06j7j83O0j1QJ84j83Q1Q6q1J71n4m4l4%RM6J2j8
4960F3k8l3L1p8Mo3o5J94m5j26J0J55NM0m1N7M4j8p4O7j11K01j28q9P4j86J26
$$ plain form
4758 50 41 134 -5 -32 -160 -193 -45 -76 -97 -50 -20 -31 -49 -23 47 172 150 162 179 60 -51 43 117 14 -26 -8 -38
4785 -38 -75 -60 -59 2 -89 44 -82 19 -50 -13 -13 -28 111 100 41 -6 87 -44 10 15 11 5 -108 -88 -44 -70 -120 96 -192
4814 -192 -80 82 21 -42 31 109 27 35 52 136 -35 28 -121 -37 20 -71 -48 -154 -76 -14 -92 -85 -36 -34 -40 -39 0 124 99
4843 99 52 -8 4 64 17 106 -82 -35 -61 -59 -74 -24 -87 -7 -53 2 14 20 61 11 7 111 119 127 33 99 -65 -58 77 60 -75
4874 -75 -17 -2 -47 -30 -150 -57 -41 0 115 -9 -84 121 7 42 116 105 28 -7 -22 56 91 -90 -8 16 -48 -55 -45 -49
4902 -49 -128 -41 -12 47 -69 70 62 8 13 89 38 29 -23 179 91 12 -55 -36 -23 -159 -121 -61 43 -131 -51 53 28 72
4930 72 127 123 132 8 102 42 60 65 -27 -75 31 14 -169 -109 -120 -112 72 -111 -30 56 -25 146 92 48 14 14 23 69 81 63
4960 63 35 2 33 -45 -41 -104 -169 25 -20 -146 -136 19 24 64 23 80 124 106 32 99 -12 189 61 -28 46 -140 -14
4987a4J4op5lK6L2l2%J03j06P4R9q5N3L5N0j56O4o2q1R6o3%K5o9p1L2K8J06j52
5017a38O4K4J27n0N6Q1o9m6jp5M0j39Q3l0k0J0M3n9Q1Oj4ON7k8N8j28J39M5j98
5046g5L3O0nM2j00k0O3k3j5J1k6n6J99j80J18%j02J31J15j63R6J9o4J1o5M6k2
5073B8n3L0L4k7n2j6k5N1j1oQ8n0J7l6J09pq9L5J06m1n6nL0r2J1O1p2l4N2k1J40
5104I9k87J62J5N5O3l4o5K2R4k03J84r7q4K9k5Q9J81k21o7N4p5k0J16K0o2L1J5
5131a1J12j23j3N7O1o6M7q8r2J79j30L4rq2j1O4J01o9P8K0j73J32j3q3K33p5m2
5158C8R4p0%r2n2J38j08o5Q9R0j62J03o1o4J96j48Q7j18J83K5j8l5lN9j48J75
5184A33j17r6L2J30j23Km4j02K20j23K4O5MQ3j53J10l4J8k8J68j79j2m3O3n2M9
$$ plain form
4987 -14 0 -6 -81 -84 -58 -26 -58 -58 45 -61 13 112 27 80 115 165 9 73 11 -70 26 -37 -37 -12 -81 -152 -120 -92 14 -138
5017 -138 -74 -50 77 27 83 164 95 49 48 -27 13 -126 -43 -73 -93 -83 -40 -99 -18 -12 -26 -20 37 9 67 -61 78 123 -75
5046 -75 -42 18 13 55 -45 -65 -2 -25 -40 -29 -55 -111 88 -92 26 26 -76 55 170 7 103 122 58 69 4 50 28
5073 28 -25 5 39 12 -40 -56 -81 -30 -41 -47 41 -9 8 -28 81 74 -15 20 126 85 29 24 54 -38 -27 34 -38 -72 -20 -41 99
5104 99 -188 -26 -11 44 107 73 8 30 124 -79 105 8 -76 -47 -72 17 198 -23 -90 -36 -111 -131 -15 5 -57 -26 -11
5131 -11 101 -22 -35 22 83 17 64 -24 -116 63 -67 -33 -42 -124 -135 -71 30 -39 39 59 -114 18 5 -78 155 80 38
5158 38 132 62 62 -30 -82 56 -52 -117 -28 62 -100 3 -58 -122 74 -74 13 -105 78 103 85 50 47 106 -42 133
5184 133 16 -80 -48 82 -41 -39 -83 -185 35 -88 -64 1 5 88 -65 45 11 29 1 169 -10 -22 -65 -2 -54 -5
5210eM7j45OL2j5PM6J35k04J36j06O3K0J60j05l7j8J03q3N6j3j38k3j42K07p1
5236h7L3N4RM6p6K4Q1p1R2l9n5Jk7J30j11K0q5J45j69O9k2n9p3K56j22r1J04M3
5264B0L8j17K08j23K8j5P8o0n2K6p3J92k11l5J09q8J01r8L6m2J56k4Q6m9n3N6
5290I4%K5n6j70R7L3N1n3j7j59O1m1J92q5P4j57J74l0r7Q3J3k0j0J29q2P1p5j08
5318f3M9p7J1j0R8r3L7r0J34L1j2n5L1J85j43l4R0o0kk7J6L2LNj80J56j00Q2j29
5347a15K6J28o3l5J50j28N1mj8J28r9N5j11J62j35Nm9L6J7r1K9J8m8L5R5j2k5
5374BJ2p7Q4n3J95q6n0P5n2jn4l6n0P8M6j63Q7M3N0j20P6J5n5J10j07J5K8Q0j14
5403b2J22j61J48J7L7j64M7j08O0K5l5P3p9r5J25L8o0L7J29n3m5Q7j28N8j34J24
$$ plain form
5210 -5 42 -103 -97 -65 -80 -73 -27 108 -96 40 -66 -3 17 177 72 35 17 120 37 93 80 -58 -81 -223 -16 -87
5236 -87 -54 0 9 55 -21 3 84 13 105 66 11 12 -15 115 4 24 -61 84 -85 -16 -38 -97 -170 86 -36 -127 -23 20
5264 20 58 -59 149 26 54 39 117 57 5 31 -42 150 -61 -96 13 -75 26 -72 -36 -78 78 54 140 91 38 94
5290 94 94 119 63 -107 -10 23 74 21 4 -155 -94 -135 57 -28 46 -111 63 33 -64 19 32 12 2 131 49 120 45 -63
5318 -63 -14 -91 -80 -90 8 -85 -48 -138 -4 27 15 -40 -9 176 33 -1 89 29 27 0 16 48 51 56 -124 32 -68 14 -115
5347 -115 -89 39 -24 -59 91 -37 14 10 -8 120 21 76 -35 127 -8 -3 -52 -16 1 -90 -61 -43 -91 -56 39 27 2
5374 2 14 -63 21 -32 163 77 27 102 50 49 -5 -41 -91 -13 33 -130 -43 0 50 -70 6 21 -34 76 -31 -16 12 92 -22
5403 -22 100 -61 87 104 141 -23 24 -84 -24 1 -34 39 -40 -135 -10 28 -32 5 134 81 36 123 -5 53 -81 43
5429D3j12N0j06R2K3j0r8J27q8m1M3O6l9L1J9j6m9J91l8O%j11L3O5o9j1r3J8M5
5458b9Qn0MJ22j37K09j31P7n3O6N0j97J08p9j3q4J54k5p5K2r1K34j29m1N3k1J4
5485c4pL1J06K2n5M1l6j79J83N1k40J23P2j04O7k6p6Oj1K7L0k5M0n2R3k0J1rj07
5514g8Q7J21j69M3Q0J0j37J2N7r2J41j71M3O2Pm1N8p6P5l1RK7j8Oko3N7j45J62
5543C4M8j01j07J20j1p2J01N2j0Kq3k5R3J16n7j32J1J12o2K3p8k3K6M8o5m6l6
5570a22P6o4O0L8M3k9O0Nk4kN7q9P0qj36J43r8M4q5o5J7M8K7M8O6j35m4J43j36
5599i2N2J18P6p2jL4o7M6K4j23q0P2m1J01L8j60l1Jj6L1L8L9O7P2M5q6l7j43J55
5628F0j22J19K9j63j7O8j32J37jr2J19r9O0l0J62j38N6p5N5K2j5K28k16k7o8M8
$$ plain form
5429 43 -69 -19 -125 -33 -10 -20 -118 9 -79 -120 -77 -11 -50 -19 0 -16 -65 126 88 94 94 -17 16 81 12 1 -92 -74 -29
5458 -29 -21 -71 -67 55 -82 127 -4 73 20 86 136 -61 47 -32 -45 -129 25 0 -75 -53 -144 90 -39 -80 -27 -48 -34
5485 -34 -41 -10 96 118 63 104 68 -111 72 123 -117 6 78 -26 41 15 -61 -55 -66 -39 -9 -34 6 -46 47 27 38 29 -78
5514 -78 9 130 -39 4 84 94 -43 -31 26 -66 75 -96 -53 9 16 -25 33 -43 32 1 10 37 19 25 23 -40 17 -128 34
5543 34 82 -19 -126 -6 -17 -89 12 64 54 56 -27 -52 41 157 100 -32 -21 91 29 52 -26 -49 -23 25 -40 -86 -122
5570 -122 -46 -110 -50 -12 31 2 62 67 43 41 98 9 79 71 -65 78 -20 24 -61 -126 -109 -61 -34 14 80 -55 -99 44 -92
5599 -92 -40 78 154 82 81 115 48 94 118 -5 -85 -13 -54 47 85 -75 -106 -105 -121 -90 -52 -13 54 126 171 85 48 -95 60
5628 60 -62 57 86 -77 -94 -26 -158 -21 -22 -114 5 -94 -34 -64 98 -40 16 -59 -4 18 3 231 15 -12 -80 -32
5654c2K0n8n8J16Q6k04K4Q1J56j17o6J14Kqj5mo4N7LL8q3rL3p9j0L1Q2r4J32o6
5684Hm7O1n6j00J79j0q1P5L3O9j21%M2K1j32J3l6kN8J14m8j47J58k49K59k9J8
5711E0O8q9p5J11NoK3k9k6m1Lm4O5m6n0p8J56K9k09K53j85J09M4J7oM6M8l7j40
5740c4K7Q1q8p1O7J3m0j7J29j27L3L1l2k2m2J28r4P6J2O1J6j45N3n9j4nR6j11
5768g8k1K5nK9jM1J06o8n1L3J18j63R0J07j64L4Lm7r9K3J0Q0j15L1K6J0l5P5M2
5797C6jo6l0k2J01M5J9q3M6K4o8j6l2q9K30j08j37K11j53J35n1j0p6J34l2p0J99
5824A36j49K6K3R5j01L3K3q4l1r4O4P2R6j40j6J32p1k9K4n8J9J7J59p2Oj40M9
5851a1J61l4j13q8M9m1K0Nm7M9J7M9J3q1K6l0J28l3n8M5k3M2l4N0j42J01mp3J1
$$ plain form
5654 -32 -12 -70 -128 -12 74 -130 -106 -25 131 14 -52 62 64 56 41 37 -27 30 33 71 -12 -21 12 -67 -77 -46 36 -58 74 8
5684 8 -39 22 -34 -134 45 35 -46 29 62 131 10 10 52 73 -59 -46 -82 -84 -26 88 40 -107 51 -198 61 32 50
5711 50 118 29 -46 65 70 64 87 58 32 -9 -6 -50 15 -31 -81 -159 -3 26 -183 70 -115 -6 38 55 49 95 143 106 -34
5740 -34 -7 74 -14 -85 -18 -5 -45 -62 67 -60 -27 4 -28 -50 -92 36 -58 18 30 91 107 -38 15 -44 -58 -63 33 -78
5768 -78 -99 -74 -79 -50 -51 -10 96 28 -23 10 128 -35 55 162 -2 32 35 -12 -111 -88 -78 2 -113 -82 -56 -46 -81 -6 36
5797 36 35 -31 -61 -83 18 63 82 -1 45 69 1 -15 -47 -136 94 -14 -151 60 -93 42 -9 -19 -95 39 7 -63 136
5824 136 -13 13 36 131 30 63 86 2 -29 -123 -59 13 109 -31 -47 85 14 -15 9 -49 -30 -13 146 74 80 -60 -11
5851 -11 150 116 3 -85 -36 -77 -57 -52 -99 -50 -33 16 29 -52 -26 -56 72 39 -19 26 3 45 11 61 -81 20 16 -57 -46
5880d6lN6j44M5J42k9q1j8J39po4M0N8l3J20j15l7J44r0j67M9M0RO4j40P2J7o0
5908c9k8LP1p4J5J9J31m9K9p7l0Q1j36J09K2Pj11L9J7n3N8Nl9K5L9j10O6jlQ3
5938F9J3k07J10R8j03O5r4J0R5K9j71L8j30J85N9p5L9Rj1r6J15P7j45M1M7m7K0
5965D0m1j21J99o7r4L7M6K4j02J9J00J3o0J18p0p1J19J5q2R9l8j47P2q4O1L4m8
5992b9l4j8k4K0M6o5J5R1L1k9j1J09j22O2kL0j10K5n7R6l1n8o9J74J1j01M6j18
6020a22J56m3n1O1m0R2K1j31O8J12j8r3Qj73K07l8j23J49j28P3l6O9n2O8r7J97
6046A36q1m1q3J10O4l7p8%l5R2j7J22q2j26K0o7R6j01J4J68j15J15Kj50N5N6N4
6073I1j77P6J8l5J68q4m1q6K2m8M9J06m0q5P5L8q0J34q2j0K7K8K2q9jN7j11M1
$$ plain form
5880 -46 -49 7 -137 -92 50 21 -60 -78 61 54 -10 30 88 55 175 60 23 167 77 -90 -41 -1 8 72 -68 4 21 -39
5908 -39 -67 -64 7 -67 -52 -33 98 49 78 1 -29 52 -84 25 47 54 -57 -18 -1 -54 4 9 -30 -5 34 -76 -10 -11 -14 69
5938 69 82 -125 -15 83 -20 45 -49 -39 56 85 -86 -48 -178 7 66 -9 30 39 28 -68 47 124 -21 20 67 20 40
5965 40 -1 -122 77 10 -84 -47 -1 23 -79 -60 40 53 -7 111 41 -30 89 104 22 121 83 -64 8 -76 -15 19 -29
5992 -29 -63 -81 -105 -85 -39 -104 -89 2 33 4 -7 102 -20 42 40 70 -40 -15 -72 24 -7 -65 -134 40 51 -50 -4 -122
6020 -122 34 -9 -60 1 -39 53 74 -57 11 123 105 12 20 -153 54 16 -107 42 -86 -13 -49 20 -32 36 -61 136
6046 136 55 14 -69 41 105 68 -10 -10 -45 47 30 152 70 -56 -36 -103 -7 -108 -94 74 -41 74 76 -74 -19 37 91
6073 91 -86 -10 8 -27 141 57 16 -70 -48 -96 -47 59 19 -66 9 47 -33 101 19 9 36 64 86 -3 -4 53 -58 -17
6101a7Q9n3j05Q0l3q8J43k03J19Q4L4nR2j16O6q4Q0j1on5O5m3r7o8J13j1p5J18
6129A3j1Q5j89N7P3Q3o6Ql3M6j11n0J90j24K0N2j23j0L3o3O2j18Q5M5O1L5l4L7
6157E3M0m9j2n3M0O6Oj21O1k3j32P3J32q9m4m1O6M1l7kk5R2%pQ2n0l7m0J73j44
$$ plain form
6101 -17 72 19 -86 -6 -39 -127 16 -187 -68 16 50 45 137 21 87 3 83 72 66 11 76 33 -64 -132 -19 -30 -105 13
6129 13 2 87 -102 -45 28 111 45 53 20 66 -45 -95 95 -29 -9 43 -80 -90 -57 -120 -58 -176 -91 -46 15 50 16 53
6157 53 93 44 32 -21 19 85 91 -30 31 8 -124 -51 81 -8 -52 -93 -27 14 -23 -25 -50 42 42 35 117 67 30 -10 163 19
$$ [...]
8191H4
##END NTUPLES=NMR FID
##END=
