##TITLE=1H_Pr 37-2
 CDCl3
 8 sc, 
 4.10.2023
##JCAMPDX= 6.0         $$ Bruker NMR JCAMP-DX V2.0
##DATA TYPE= NMR FID
##DATA CLASS= NTUPLES
##ORIGIN= UXNMR, Bruker Analytische Messtechnik GmbH
##OWNER= root
$$ XWIN-NMR		Version 3.5
$$ Wed Oct  4 16:08:34 2023 Russian Standard Time (UT+4h)  she@DPX200
##.OBSERVE FREQUENCY= 200.13135
##.OBSERVE NUCLEUS= ^1H
##.DELAY= (6, 6)
##.ACQUISITION MODE= SIMULTANEOUS
##.ACQUISITION SCHEME= undefined
##.AVERAGES= 8
##.DIGITISER RES= 18
##SPECTROMETER/DATA SYSTEM= spect
##.PULSE SEQUENCE= zg30
##.SOLVENT NAME= D2O
##.SHIFT REFERENCE= (INTERNAL, D2O, 0, 15.7039)
##AUDIT TRAIL= $$ (NUMBER, WHEN, WHO, WHERE, WHAT)
$$ ##TITLE= Audit trail, XWIN-NMR		Version 3.5
$$ ##JCAMPDX= 5.01
$$ ##ORIGIN= Bruker BioSpin GmbH
$$ ##OWNER= she
$$ F:/spectra/data/she/nmr/H-F/1/audita.txt
$$ ##AUDIT TRAIL=  $$ (NUMBER, WHEN, WHO, WHERE, WHAT)
(   1,<2023-10-04 16:07:23.59 +0400>,<she>,<DPX200>,
      <created by zg, POWCHK disabled, PULCHK disabled
       configuration hash MD5:
       00 E9 B6 7A A2 85 ED C7 34 08 36 98 17 FE 4E 26
       data hash MD5: 16K
       C5 2E 90 3C B6 D9 96 BB 3C A4 32 1C E2 86 78 F1>)
$$ ##END=
$$ 
$$ hash MD5
$$ A7 96 DF D9 4C C6 ED 71 00 2F 05 BB DB 47 FC BC
##$RELAX= 
##$RELAX= 
##$RELAX= 
##$RELAX= 
##$RELAX= 
##$RELAX= 
$$ Bruker specific parameters
$$ --------------------------
##$DU= <F:/spectra>
##$EXPNO= 1
##$NAME= <H-F>
##$PROCNO= 1
##$TYPE= <nmr>
##$USER= <she>
##$AMP= (0..31)
100 100 100 100 100 100 100 100 100 100 100 100 100 100 100 100 100 100 
100 100 100 100 100 100 100 100 100 100 100 100 100 100 
##$AQSEQ= 0
##$AQ_mod= 1
##$AUNM= <au_zg>
##$AUTOPOS= <>
##$BF1= 200.13
##$BF2= 200.13
##$BF3= 200.13
##$BF4= 200.13
##$BF5= 200.13
##$BF6= 200.13
##$BF7= 200.13
##$BF8= 200.13
##$BYTORDA= 1
##$CFDGTYP= 0
##$CFRGTYP= 5
##$CHEMSTR= <none>
##$CNST= (0..31)
1 1 145 1 1 1 1 1 1 1 1 1 1 1 1 1 1 1 1 1 1 1 1 1 1 1 1 1 1 1 1 1 
##$CPDPRG= <>
##$CPDPRG1= <>
##$CPDPRG2= <>
##$CPDPRG3= <>
##$CPDPRG4= <mlev>
##$CPDPRG5= <mlev>
##$CPDPRG6= <mlev>
##$CPDPRG7= <mlev>
##$CPDPRG8= <mlev>
##$CPDPRGB= <>
##$CPDPRGT= <>
##$D= (0..31)
0 1.2 0 0 0 0 0 0 0 0.06 0 0.03 0 0 0 0 0.0002 0 0 0 0 0 0 0 0 0 0 0 0 
0 0 0 
##$DATE= 1696421243
##$DBL= (0..7)
120 120 120 120 120 120 120 120 
##$DBP= (0..7)
150 150 150 150 150 150 150 150 
##$DBP07= 0
##$DBPNAM0= <>
##$DBPNAM1= <>
##$DBPNAM2= <>
##$DBPNAM3= <>
##$DBPNAM4= <>
##$DBPNAM5= <>
##$DBPNAM6= <>
##$DBPNAM7= <>
##$DBPOAL= (0..7)
0.5 0.5 0.5 0.5 0.5 0.5 0.5 0.5 
##$DBPOFFS= (0..7)
0 0 0 0 0 0 0 0 
##$DE= 6
##$DECBNUC= <off>
##$DECIM= 32
##$DECNUC= <off>
##$DECSTAT= 4
##$DIGMOD= 1
##$DIGTYP= 9
##$DL= (0..7)
0 120 120 120 120 120 120 120 
##$DP= (0..7)
150 150 150 150 150 150 150 150 
##$DP07= 0
##$DPNAME0= <>
##$DPNAME1= <>
##$DPNAME2= <>
##$DPNAME3= <>
##$DPNAME4= <>
##$DPNAME5= <>
##$DPNAME6= <>
##$DPNAME7= <>
##$DPOAL= (0..7)
0.5 0.5 0.5 0.5 0.5 0.5 0.5 0.5 
##$DPOFFS= (0..7)
0 0 0 0 0 0 0 0 
##$DQDMODE= 0
##$DR= 18
##$DS= 0
##$DSLIST= <SSSSSSSSSSSSSSS>
##$DSPFIRM= 0
$$ [...]
##$SUBNAM2= <"">
##$SUBNAM3= <"">
##$SUBNAM4= <"">
##$SUBNAM5= <"">
##$SUBNAM6= <"">
##$SUBNAM7= <"">
##$SUBNAM8= <"">
##$SUBNAM9= <"">
##$SW= 18.05172834244
##$SWIBOX= (0..15)
0 0 2 0 0 0 0 0 0 0 0 0 0 0 0 0 
##$SW_h= 3612.71676300578
##$TD= 16384
##$TD0= 1
##$TE= 0
##$TE2= 300
##$TE3= 300
##$TEG= 300
##$TL= (0..7)
0 120 120 120 120 120 120 120 
##$TP= (0..7)
150 150 150 150 150 150 150 150 
##$TP07= 0
##$TPNAME0= <>
##$TPNAME1= <>
##$TPNAME2= <>
##$TPNAME3= <>
##$TPNAME4= <>
##$TPNAME5= <>
##$TPNAME6= <>
##$TPNAME7= <>
##$TPOAL= (0..7)
0.5 0.5 0.5 0.5 0.5 0.5 0.5 0.5 
##$TPOFFS= (0..7)
0 0 0 0 0 0 0 0 
##$TUNHIN= 0
##$TUNHOUT= 0
##$TUNXOUT= 0
##$USERA1= <user>
##$USERA2= <user>
##$USERA3= <user>
##$USERA4= <user>
##$USERA5= <user>
##$V9= 5
##$VALIST= <valist>
##$VCLIST= <CCCCCCCCCCCCCCC>
##$VD= 0
##$VDLIST= <DDDDDDDDDDDDDDD>
##$VPLIST= <PPPPPPPPPPPPPPP>
##$VTLIST= <TTTTTTTTTTTTTTT>
##$WBST= 1024
##$WBSW= 4
##$XGAIN= (0..3)
0 0 0 0 
##$XL= 0
##$YL= 0
##$YMAX_a= 257856
##$YMIN_a= -268315
##$ZGOPTNS= <>
##$ZL1= 120
##$ZL2= 120
##$ZL3= 120
##$ZL4= 120
##$ABSF1= 10
##$ABSF2= 0
##$ABSG= 5
##$ABSL= 3
##$ALPHA= 0
##$AQORDER= 0
##$ASSFAC= 0
##$ASSFACI= 0
##$ASSFACX= 0
##$ASSWID= 0
##$AUNMP= <proc_1d>
##$AZFE= 0.1
##$AZFW= 0.1
##$BCFW= 1
##$BC_mod= 2
##$BYTORDP= 1
##$COROFFS= 0
##$CY= 11.3945322036743
##$DATMOD= 1
##$DC= 2
##$DFILT= <>
##$DTYPP= 0
##$F1P= 15.7292609196834
##$F2P= 12.9074282941183
##$FCOR= 0.5
##$FTSIZE= 0
##$FT_mod= 4
##$GAMMA= 1
##$GB= 0.15
##$INTBC= 1
##$INTSCL= 1
##$ISEN= 128
##$LB= 0.24
##$LEV0= 0
##$LPBIN= 0
##$MAXI= 10000
##$MC2= 0
##$MEAN= 0
##$ME_mod= 0
##$MI= 1.114404
##$NCOEF= 0
##$NC_proc= 0
##$NLEV= 6
##$NOISF1= 3.799351
##$NOISF2= 2.8
##$NSP= 1
##$NTH_PI= 0
##$NZP= 0
##$OFFSET= 15.70392
##$PC= 1
##$PHC0= -21710.56
##$PHC1= 11.25271
##$PH_mod= 1
##$PKNL= yes
##$PPARMOD= 0
##$PSCAL= 0
##$PSIGN= 0
##$REVERSE= no
##$SF= 200.130013532006
##$SI= 16384
##$SIGF1= 3
##$SIGF2= 2
##$SINO= 400
##$SIOLD= 16384
##$SREGLST= <1H.CDCl3>
##$SSB= 0
##$STSI= 0
##$STSR= 0
##$SW_p= 3612.71676300578
##$SYMM= 0
##$S_DEV= 0
##$TDeff= 0
##$TDoff= 0
##$TI= <>
##$TILT= no
##$TM1= 0
##$TM2= 0
##$TOPLEV= 0
##$USERP1= <user>
##$USERP2= <user>
##$USERP3= <user>
##$USERP4= <user>
##$USERP5= <user>
##$WDW= 1
##$XDIM= 8192
##$YMAX_p= 0
##$YMIN_p= 0
$$ End of Bruker specific parameters
$$ ---------------------------------
##NTUPLES= NMR FID
##VAR_NAME=  TIME,          FID/REAL,        FID/IMAG
##SYMBOL=    X,             R,               I
##VAR_TYPE=  INDEPENDENT,   DEPENDENT,       DEPENDENT
##VAR_FORM=  AFFN,          ASDF,            ASDF
##VAR_DIM=   8192,          8192,            8192
##UNITS=     SECONDS,       ARBITRARY UNITS, ARBITRARY UNITS
##FACTOR=    0.0002768,     1,               1
##FIRST=     0,             0,               0
##LAST=      2.2672688,     0,               0
##MIN=       0,             -268315,         0
##MAX=       2.2672688,     257856,          0
$$ Real data points
##PAGE= N=1
##DATA TABLE= (X++(R..R)), XYDATA
0 0 0 0 0 0 0 0 0 0 0 0 0 0 0 0 0 0 0 -8 8 -8 8 -8 8 -10 16 -16 16 -21 24 -26 31 -34 39 -43 50 -56 61 -68 76
39 76 -84 94 -103 115 -128 141 -155 170 -186 205 -227 251 -277 303 -336 374 -415 462 -521 586 -669
60 -669 769 -897 1066 -1297 1636 -2169 3117 -5118 11034 -62977 -268315 -17589 217392 42333
74 42333 -144217 -15204 113775 16111 -78089 -12382 52133 37819 18833 -8032 -61762 -35739
86 -35739 69823 75656 -42003 -77860 7382 36782 -17050 -21458 13971 1392 -17230 -3070
98 -3070 -20913 -39665 31609 81108 -22255 -106970 -3784 99985 22904 -61041 -1858 51064
110 51064 -3700 -35080 14395 38129 9785 -3201 -6858 -26832 -8028 44593 29003 -42413
122 -42413 -36385 25629 5928 -42586 7330 53205 -26395 -76527 15998 62174 -29858 -52194
134 -52194 47603 48362 -63261 -53868 64054 63965 -34842 -38113 27718 19807 -16734 10138 31031
147 31031 -7244 -21297 14325 9122 -26830 582 43959 -1039 -60559 -17085 44156 9332
159 9332 -36633 -6110 17774 -16646 -23640 12856 15932 -7085 -2528 2507 -13789 -2646 28437
172 28437 16630 -16153 -4920 18326 1024 -11372 18699 27172 -13989 -26643 12235 20335
184 20335 -14402 -10199 21546 -1808 -39341 -6111 33639 -3296 -37265 4434 26203 -23538
196 -23538 -36240 23457 38834 -17693 -35726 7991 27262 3463 -8725 2433 10149 8975
208 8975 1040 -9923 -996 26313 21853 -23441 -33566 18145 38929 -12415 -38401 7677 27969
221 27969 -18579 -33416 12037 22785 -14879 -21636 3962 1866 -10000 6164 15123 -8340 -17853
234 -17853 6574 19260 2352 -6624 4970 10540 2203 -3156 427 7314 12288 5791 -13454 -15687
248 -15687 11435 22226 -9221 -27333 2849 19607 -12716 -27127 8186 20868 -13211 -24789
260 -24789 4021 12743 -5667 -5907 8197 2261 -9071 401 13076 6516 -2817 2186 7473 1598
274 1598 -1284 5561 7660 1324 -1575 -2531 -4205 1211 8474 -1805 -15485 -4723 8759 -4398
288 -4398 -16048 1184 11300 -8186 -17469 1738 11525 -1466 -5908 3157 3865 -2616 1961 9561
302 9561 4543 -2019 2874 7022 351 -2626 7711 9664 -3774 -8632 2138 5469 -2484 -4050
316 -4050 -875 -3622 -5496 -1918 -3177 -4838 484 1340 -8186 -8047 4173 6639 -3497 -3903 4505
331 4505 4257 -2237 949 9156 6456 -2518 -598 7302 4327 -2345 2320 7469 -1510 -8395 400
346 400 6273 -1960 -7117 -1584 -513 -5060 -5159 -1734 -97 -1395 -4007 -5228 -1202 4268 1233 -3207
362 -3207 -53 5187 2364 -1765 2439 8342 5345 -2141 -1188 6623 6200 -1453 -936 4314 378 -5458
378 -5458 -1084 3729 -2476 -6525 -1464 419 -5293 -6733 -553 2684 -2450 -7409 -4541 4627 5964
393 5964 -2912 -5707 3502 9026 1365 -4818 1778 10475 6770 -4070 -4603 6479 10102 -182 -6274
408 -6274 303 4258 -568 -3369 -2039 -2212 -2615 -1066 -2819 -6522 -4219 2345 1994 -5603 -7768 152
424 152 7472 2126 -6446 -2498 8109 6241 -2965 -1732 6808 7053 611 -1441 1753 4302 2602
439 2602 199 -185 -636 -2368 -1354 1978 -970 -7189 -4973 2312 109 -7588 -5709 926 1906 -2283
455 -2283 -4560 -2499 2908 5543 1326 -3966 -2146 7043 9680 636 -6714 1071 12766 7028 -8759
470 -8759 -6654 9932 11053 -5638 -11734 -165 7809 2235 -7795 -9536 -1996 5176 1617 -9124
484 -9124 -10347 2052 9567 -882 -13743 -5423 13636 11151 -9746 -12345 9233 17097 -548
497 -548 -10786 2023 12755 5119 -5405 -2933 4852 4572 -544 -2907 -2589 -2290 705 2821 -3810
512 -3810 -10448 -3280 7231 -142 -12547 -5454 8785 3375 -10129 -5038 8387 5381 -5881 -2379
526 -2379 9154 4710 -6074 692 12924 4059 -10338 -476 14591 4441 -12376 -4324 11068
539 11068 4736 -9771 -7651 2969 3722 -3237 -6754 -4928 -1162 2052 790 -6380 -8454 2447
553 2447 10097 -256 -11888 -1221 14349 7569 -9311 -6121 10415 12125 -1075 -7566 463
566 463 9349 5717 -3681 -6017 700 5359 1895 -5159 -7517 -1622 5805 1273 -10746 -9940 5528
581 5528 8878 -6833 -13848 1715 12383 43 -11523 -685 12509 4006 -7530 -258 10575
594 10575 3610 -5068 2809 8270 -1135 -5207 4885 7129 -4301 -6900 2545 4523 -4030 -6554
608 -6554 -465 1291 -3160 -3711 -1325 -2061 -2990 463 2241 -3820 -5020 3973 7514 -1638 -5730 2876
624 2876 9152 3106 -3890 -1167 5787 7014 69 -4730 -360 6524 3483 -5016 -5884 1018 4010
639 4010 -884 -6270 -5744 420 3485 -2425 -8530 -4141 5020 4057 -5059 -7085 2935 9433 1404
654 1404 -7042 -431 9527 5097 -3553 -1177 5476 5009 695 -745 -523 1428 3174 657 -4069 -2908
670 -2908 1893 1064 -4377 -5077 -345 1123 -2837 -4750 -812 366 -1470 -1844 261 652 -699 1544
686 1544 3190 572 -265 3315 4281 906 -15 2829 3073 1043 67 343 809 805 -884 -2073 -1088 -13
704 -13 -1871 -3315 -1981 -697 -2009 -2914 -1513 -224 -750 -2400 -538 2042 494 -1127 1092 3680
720 3680 1312 -204 2513 4105 1332 40 2349 2832 909 -382 348 1121 459 -1644 -2461 -1025
736 -1025 -75 -2098 -3798 -2039 69 -1344 -3312 -2178 753 921 -1852 -2159 1516 2942 -244 -463
752 -463 2364 3207 1019 1146 2432 2258 1474 1249 1407 611 150 67 -63 -447 -1632 -1922 -1238 -889 -2380
771 -2380 -2964 -1647 -842 -1502 -2162 -1534 -353 386 -532 -868 1229 1995 721 476 2228 2467 1242 1670
789 1670 2475 1067 297 1474 1439 -54 -729 261 217 -1250 -1803 -2120 -672 -1340 -2394 -2357 -1232 -1171 -1306
808 -1306 -1577 -1223 -251 690 124 -545 1238 2623 1434 189 1632 2461 2021 1118 1460 1580 1420 1032
826 1032 495 -752 -21 531 -745 -2292 -1825 -291 -720 -2979 -2876 -470 -74 -2569 -2660 30 1031
843 1031 -868 -1011 427 1034 1331 1353 568 1105 2492 2537 827 451 2101 2144 525 -23 420 195 -239
862 -239 -664 -1186 -1630 -1451 -1057 -1064 -2500 -2506 -520 -150 -2133 -2407 548 755 -818 -423 992 992 734 1913
882 1913 1607 484 1412 3209 1947 101 713 2307 1624 -203 -648 -300 -62 -209 -1298 -2169 -2375 -472
900 -472 63 -2614 -3774 -895 1569 -1397 -3354 -570 2211 430 -895 395 1114 1692 2378 1032
916 1032 -47 1635 3474 1469 -1088 369 2770 1300 -1474 -665 713 -641 -1796 -984 -1007 -2597
932 -2597 -2015 620 -1003 -4201 -2002 2182 -124 -3591 -923 3107 574 -1645 1287 2490 339
947 339 602 3185 1995 -1159 810 4053 1914 -2452 -1079 3127 2088 -2862 -3000 195 930 -1406
963 -1406 -3085 -2480 -676 481 -1367 -3730 -1917 1541 1036 -1856 -1428 1158 1624 1681 711 -362 625
980 625 3966 3797 -1741 -1975 4395 5429 -2036 -4375 2414 4926 -1817 -5119 196 2409 -2351 -3422
996 -3422 114 -800 -3590 -387 1845 -3041 -4493 2423 3878 -2918 -4136 3470 4981 -1947 -2150 3687
1012 3687 3982 -987 -429 3641 1995 -1662 663 3421 -43 -2849 537 2433 -1338 -3415 -858
1027 -858 871 -1267 -2225 -1794 -1135 -906 -166 -1360 -1712 347 1296 -292 -114 1197 580 836 2390 1904
1045 1904 -1256 518 4758 2433 -3109 -1472 5306 3311 -4929 -3561 4254 2586 -5235 -3921 2458
1060 2458 45 -4467 -1932 1413 -2484 -3219 1790 1341 -4410 -2027 4826 2157 -4488 -898 6072
1075 6072 2699 -3339 595 5096 2106 -1675 855 2916 -53 -1242 1320 605 -2246 -955 1444
1090 1444 -1095 -3582 -999 614 -2095 -2758 101 -147 -2068 -1068 734 -591 -741 1068 833 -242
1106 -242 839 2353 903 104 2294 2499 -450 -423 2973 1992 -2208 -1156 3060 578 -4081 -1322
1122 -1322 2401 -1171 -4088 -526 963 -2786 -2920 1226 197 -3459 -1158 2858 -122 -3333 1154
1137 1154 4491 -222 -2464 2235 3979 -218 -1086 3101 2926 -1256 -243 2501 39 -2056 407
1152 407 1805 -2241 -2869 859 428 -3391 -2251 1099 -929 -3019 -783 1215 -1293 -1788 1147 1053
1168 1053 -1154 102 2460 1153 -663 1644 3221 -102 -927 2207 2206 -1218 -929 2407 1088 -2221
1184 -2221 -794 1451 -983 -2952 -598 354 -2289 -2214 613 -425 -2803 -868 1657 -626 -1980 912
1200 912 2361 -585 -758 2446 2180 -808 436 3155 1184 -1088 875 2677 -327 -2068 1503 1927
1216 1927 -2079 -2091 1289 272 -3153 -1534 608 -1448 -3038 -83 475 -1867 -1461 1365 489 -1531
1232 -1531 56 2333 663 -872 1482 2582 583 -246 2153 1751 -551 15 2475 407 -2059 167
1248 167 1418 -1312 -2435 300 445 -2359 -2028 294 -983 -2808 -498 536 -863 -1640 699 1094
1264 1094 -904 -520 1884 1339 -496 599 2599 1076 -417 1444 2291 28 -636 1427 1334 -1735
1280 -1735 -891 1282 -420 -2382 -839 527 -1606 -2302 -240 -386 -1995 -1243 737 -381 -1474 34
1296 34 1519 -7 -1040 1304 1969 272 41 2021 1659 -23 640 2113 519 -701 613 1486 -704
1313 -704 -1314 560 120 -2012 -1339 181 -768 -2130 -791 -86 -1043 -1621 156 397 -685 -429 1105
1330 1105 797 -154 452 1759 653 228 1480 1510 72 171 1681 630 -549 190 933 -634 -1584 -364
1348 -364 -132 -1486 -1221 69 -706 -1731 -768 464 -784 -1280 152 805 -400 -549 898 1319 116
1365 116 332 1762 1519 209 612 1923 722 -519 633 1247 101 -884 0 102 -874 -646 -716 -1050
1383 -1050 -1403 -778 -621 -1125 -1166 -430 -270 -490 -223 297 344 425 641 810 691 695 1274 1085 356 788 1442
1404 1442 602 -219 501 1152 21 -506 -260 -250 -882 -1036 -921 -909 -1428 -853 -464 -1074 -884 -440 329 156
1424 156 -547 201 1038 683 37 667 1279 845 632 841 1007 554 412 736 579 81 -274 182 -88 -540
1444 -540 -1188 -630 -425 -973 -1388 -764 -339 -758 -1261 -563 -189 -381 -477 189 485 638 515 796 1082 405
1464 405 807 1240 1312 397 46 1063 850 -323 -524 522 327 -757 -1187 -379 -326 -1195 -1597 -716 -329
1483 -329 -1153 -1096 -160 263 -807 -535 741 398 -668 229 1477 909 -197 496 1967 1094 72 627
1501 627 1592 583 -690 -80 1031 -514 -1323 -457 60 -1260 -1428 -615 32 -1346 -1349 -295 -125 -1193
1519 -1193 -1015 279 485 -122 -242 734 1017 494 445 1379 1169 404 416 1110 797 -259 -10 707 472 -730
1539 -730 -739 152 -394 -1093 -1270 -518 -391 -1169 -957 -167 -401 -1374 -457 449 11 -363 474 1025 331 -180 925
1560 925 1803 690 110 955 1753 17 -431 783 923 -444 -586 -38 195 -1101 -1273 38 -400 -1520
1578 -1520 -961 114 -514 -1143 -538 162 -200 -751 144 604 485 273 637 1245 760 662 599 1000 975 171
1598 171 372 550 379 -83 -263 -76 -596 -840 -792 -551 -497 -998 -1040 -316 -439 -1149 -545 221 -131 -354 176
1619 176 500 432 83 676 870 684 266 914 1109 302 298 696 521 -68 -252 377 -16 -978 -809 -247 -606
1640 -606 -1076 -726 -213 -873 -963 -288 -151 -647 -415 474 186 -45 80 553 498 357 525 912 1038 269 685
1661 685 824 424 199 456 206 -104 -67 -238 -302 -586 -484 -645 -911 -532 -388 -927 -838 -501 -134 -495 -328
1682 -328 351 287 -27 215 891 518 111 1091 1098 573 163 827 964 -133 -172 567 457 -576 -386 -45 -341
1703 -341 -729 -474 -265 -757 -1086 -659 -159 -709 -576 121 -36 -293 -140 313 555 437 622 831 268 618
1723 618 677 780 171 382 764 310 3 167 166 -373 -315 -154 -658 -968 -746 -727 -657 -769 -513 -285 -615 -756
1745 -756 -17 -101 30 159 506 432 503 669 594 698 331 917 639 359 323 572 458 -243 -176 93 -85 -801
1767 -801 -309 -364 -693 -1025 -613 -378 -642 -746 -210 -131 -333 -357 103 43 407 555 512 506 285 351 579 682 618
1790 618 805 393 475 302 112 82 -271 -156 -177 -822 -650 -472 -550 -759 -512 -488 -612 -424 -330 -12 28 -204
1812 -204 81 572 -85 252 764 822 377 452 662 634 346 552 455 253 -172 -334 -38 -155 -265 -573 -523 -714
1834 -714 -631 -521 -702 -605 -665 -222 -299 -143 -348 -13 375 575 254 578 566 607 543 825 902 707 302 598 429
1857 429 467 -53 76 120 -69 -467 -369 -267 -391 -731 -553 -329 -658 -771 -435 119 -398 -581 4 544 -54
1878 -54 134 553 728 303 308 864 885 464 301 340 298 265 74 533 138 -439 -442 -232 -393 -926 -711 -297 -475
1901 -475 -960 -632 -324 -363 -322 -272 -92 197 -96 54 402 504 84 519 921 813 339 383 756 440 -106
1922 -106 138 136 276 -563 -286 -181 -436 -841 -840 -184 -622 -796 -496 -75 -401 -612 -26 409 -26 -392 206
1943 206 497 155 83 822 929 486 377 629 692 117 71 694 178 -42 -376 -127 -352 -432 -696 -364 -285 -688
1965 -688 -707 -298 -380 -722 -518 -158 -124 -113 -20 365 349 212 167 611 553 389 321 732 699 220 332 561 343
1988 343 33 -317 144 -115 -608 -395 -382 -314 -1025 -273 -99 -360 -988 -463 95 -215 -618 355 436 130 -239
2009 -239 458 745 355 205 586 1036 238 448 510 729 -81 -172 368 214 -427 -487 -59 -510 -715 -450 -176
2030 -176 -237 -759 -466 -127 -212 -527 -39 191 38 22 399 456 702 389 399 404 597 393 303 412 354 110 -23
2053 -23 -76 -11 -263 -468 -260 -234 -526 -513 -327 -435 -967 -532 -31 -282 -573 -228 397 60 63 336 497 253
2075 253 -28 690 565 243 349 707 675 118 -112 463 141 -389 -200 55 -340 -639 -146 -373 -907 -631
2095 -631 -134 -284 -649 -179 38 -250 118 277 110 29 334 359 79 351 660 723 210 520 764 361 265
2116 265 -205 529 -45 -240 -17 167 -460 -712 -32 -409 -730 -513 -128 -440 -614 -147 97 184 -480 129
2136 129 514 -413 128 1011 696 110 238 760 327 40 -131 520 44 -353 -11 -232 -473 -611 -264 -433
2156 -433 -496 -532 -106 -339 -614 -75 -201 -467 -245 7 -130 -336 285 210 189 173 949 419 46 457 897 608
2178 608 -338 153 568 -199 -452 269 -77 -557 -624 -21 -176 -926 -603 -92 -498 -1002 -298 287 -436 -353 452
2199 452 605 -169 -2 700 615 378 535 774 307 79 537 668 -60 -64 360 -72 -235 -124 114 -219 -346
2220 -346 -130 -385 -780 -232 -227 -263 -487 -182 186 -405 -450 221 343 -132 91 761 467 -31 321 812 130
2241 130 -88 454 659 4 -70 463 91 -486 -383 369 -477 -938 -519 122 -464 -752 -386 -157 -386 -411 8
2262 8 -146 -109 -27 608 217 41 470 688 333 173 835 493 113 30 432 238 -139 477 -35 -470 -634 -18
2284 -18 -440 -710 -341 -30 -380 -639 -86 -205 -352 -739 378 4 -255 144 526 288 240 310 905 401 -120
2305 -120 338 843 41 169 568 32 -188 -61 147 -387 -519 -349 -293 -607 -970 -361 -51 -669 -319 -190
2325 -190 -197 -222 7 93 -39 -23 354 371 -6 178 657 345 166 511 528 -172 -141 151 -23 -431 -131 107 -505
2348 -505 -609 -189 64 -732 -719 0 -55 -603 -434 13 -177 -446 -271 312 186 257 227 718 36 364 564
2369 564 310 30 2 483 222 -159 178 188 -162 -339 -112 -135 -407 -415 -277 -292 -329 -276 -303 -124 -265 -37 53
2392 53 57 10 103 123 129 267 500 141 230 436 651 45 18 506 207 -225 149 158 -310 -426 -156 125 -450 -577
2416 -577 -20 -253 -633 -184 -113 -71 -400 -38 229 -29 -263 215 514 118 145 626 325 245 402 437 541 159
2438 159 242 241 40 183 -129 -194 -163 -175 -358 -398 -657 -364 -553 -298 -217 -54 -243 -250 -113 -119 83 243 410 175
2462 175 183 412 564 7 330 485 306 164 -180 218 239 -142 -299 230 -252 -382 -339 -313 -530 -492 -156 -228
2484 -228 -366 -430 -24 7 -17 -32 181 99 -59 67 595 321 81 427 564 417 96 225 241 138 21 -129
2506 -129 -1 3 -135 -179 -253 -270 -321 -176 -388 -503 -163 -350 -121 -130 -35 -102 106 170 -217 236 305 256 429 217
2530 217 384 366 376 52 205 218 -19 383 46 54 -336 -130 -340 -188 -366 -270 -208 -137 -120 -183 -191 -196 -46 50 -52
2555 -52 -114 420 279 343 277 416 336 383 147 122 173 238 245 115 147 41 -269 -77 -170 -171 -311 -399 -170 -251 -356 -284
2581 -284 -194 -521 -195 -133 90 141 226 198 177 379 465 394 296 -41 212 431 121 204 383 308 -43 239 59 -116
2605 -116 -83 28 -354 -157 -339 61 -59 -442 -175 -24 -162 5 98 157 -116 14 39 220 162 152 420 176
2627 176 542 159 271 170 -34 6 19 299 101 -236 -105 -196 -269 -250 -160 -264 -120 -154 -439 -110 -69 -49 -74
2650 -74 115 136 265 311 190 387 396 302 297 163 124 235 330 134 -183 90 214 -177 -465 -60 -46 -385 -179 -88
2674 -88 -270 -271 -210 38 19 -224 -356 7 140 -202 166 240 138 -227 262 219 278 -99 385 217 407 327 468
2697 468 113 -65 -137 -57 -98 -359 -226 -347 -195 -113 -223 -144 -134 -329 -147 -136 -63 -71 -99 -182 211 35 118 155 181
2722 181 558 167 235 321 -16 -142 460 39 15 -336 43 152 -366 -437 -171 -346 -375 -468 -158 -149 -353 -114 212
2745 212 -64 -287 235 212 56 76 288 236 255 269 321 356 235 358 239 104 7 -342 29 -107 -187 0 -82
2768 -82 -316 -125 -481 -235 -373 -33 -311 -199 -99 -181 -210 -144 310 30 195 -30 131 -104 -51 207 264 37
2790 37 -191 460 245 -8 -156 69 191 -195 50 -63 186 -256 -263 -108 201 -167 -396 201 -73 -295 83
2811 83 203 -204 -175 164 385 -56 140 319 303 348 242 91 151 -46 100 95 107 -76 -32 -91 -131 -272 -272 -79
2835 -79 -317 -245 -157 -415 -51 121 -87 -44 153 254 69 142 293 173 115 387 325 193 14 291 287 46 59
2858 59 296 305 117 -111 211 -184 -280 81 -148 -149 -508 -301 93 -383 -288 -104 90 -493 -247 111 285 73
2880 73 327 326 171 96 161 509 232 154 121 100 94 27 294 79 -47 -325 -155 -108 -59 -343 -189 -98 -146 -152 -339 -189
2906 -189 -84 -2 -59 -76 1 64 75 291 160 29 60 454 362 -47 -78 154 253 -63 19 208 -50 -252 -147 -141
2930 -141 -138 -421 -186 -184 -84 -284 -264 1 -319 -102 -4 -65 70 79 321 273 73 371 194 325 254 249 362 176
2954 176 34 235 52 -284 -147 -123 -108 -236 -49 -364 -93 -199 -417 51 -240 -78 -233 -80 278 115 -64
2975 -64 60 155 195 -153 109 265 299 193 82 -11 -48 -51 13 51 19 -77 8 81 -281 -543 -265 35 -476 -143 121
3000 121 54 -174 -130 147 78 19 -22 168 5 -277 -9 134 154 -105 187 272 92 -127 74 34 112 -95 196
3023 196 -40 -281 -197 -148 -212 -258 -173 -196 -31 -387 -207 -394 30 -85 -85 37 18 70 273 222 339 216 71 192
3047 192 266 408 157 65 49 114 -77 -22 -166 -144 -122 -309 -243 31 -396 -331 -62 -279 -150 -218 -329 5 -48 4
3071 4 32 101 306 212 53 100 120 239 -49 -41 163 256 -89 -86 -238 118 -51 -96 66 -122 -190 -149 20 -293 -154
3096 -154 -163 -94 -286 -155 -258 -19 -57 137 180 21 28 251 81 248 112 233 218 42 -14 39 236 5 -200
3119 -200 60 68 -201 -140 -71 -167 -256 -305 -170 44 -212 -118 -368 198 65 -73 19 267 170 179 77 173 65 186
3143 186 217 116 -65 64 -55 286 -161 -6 -74 -125 -299 -308 -293 -139 -236 -210 -116 -297 -94 -88 47 -126 -351 -270
3167 -270 -120 196 -85 235 276 -53 -155 310 287 -6 206 315 90 194 -18 15 -35 -58 -246 71 -18 27
3189 27 107 -97 -221 -117 -275 22 -75 -262 1 -41 -107 -29 -85 100 218 228 -142 217 316 178 177 181 59 36 -27
3214 -27 -120 -127 81 -70 -193 -118 -322 -423 -115 -255 -64 -130 -13 101 -319 -7 41 13 -256 -21 175 -34 192
3237 192 139 119 -89 56 163 112 -55 62 131 215 62 -137 95 -124 -304 -144 -200 -109 -168 -426 85 -317 -79
3260 -79 -130 -80 -296 159 92 12 3 140 106 212 213 285 202 -286 112 195 -238 217 308 -111 -35 151 -37 -177 -149
3285 -149 -222 -39 -136 -285 -46 -44 -323 -227 -215 -36 -256 -22 121 -52 -27 204 21 -50 75 277 -227 40 206
3308 206 126 -288 125 121 108 -297 -291 153 15 -110 -116 104 -88 -163 154 -265 -272 -206 -124 -5 -50 378 81 -144 153
3333 153 66 201 -39 -66 263 107 129 93 335 117 10 67 -41 -17 112 -79 166 -323 -379 -230 -88 70
3355 70 -40 214 -92 43 -21 2 -127 49 -36 230 189 210 239 355 123 -69 275 174 -161 18 -106 25
3377 25 -12 -64 -143 -281 43 -219 48 -114 -272 -172 -149 -295 147 -1 -147 81 13 232 -131 98 174 -49
3399 -49 95 96 109 47 153 213 69 -4 290 -352 63 125 185 -115 -167 131 -102 -38 -151 257 21 -26 -159 -60
3423 -60 93 -12 263 244 102 -227 25 215 -50 5 -65 266 -118 -92 28 88 -131 -241 136 -153 -69 -19 128
3446 128 -230 -193 -90 -81 -140 15 -412 -53 31 28 154 173 -24 -21 62 86 141 -71 239 111 55 70 53 61 306 -13
3472 -13 10 -46 35 -26 170 8 -133 -143 -287 -7 45 -417 -34 -60 93 -94 -122 -60 2 -72 70 -176 90 118
3496 118 417 -29 177 30 152 198 151 91 -86 -9 -140 -96 66 -162 -84 29 -181 35 -160 151 82 45 -54
3519 -54 59 97 263 -108 -90 255 244 218 254 235 -332 -286 -25 22 289 39 -128 88 80 -35 128 107 42 -316
3543 -316 -32 84 -346 -234 -86 125 209 -98 20 65 -154 33 -25 153 36 23 98 257 178 -115 257 137
3565 137 166 -29 166 210 353 111 164 -23 6 -140 62 -34 -167 -141 -177 17 130 29 1 117 -216 -88 -96
3588 -96 -68 59 296 136 27 123 121 -89 147 -273 162 287 -214 -115 34 32 -5 -10 -180 -83 -88 -110 -102 -163 -118 48
3614 48 -158 4 -101 -275 73 29 150 103 52 51 107 -169 163 59 222 -40 181 22 44 5 -77 -126 181 -189
3638 -189 -178 -77 -258 -161 -305 -293 -201 -8 -93 175 -186 -42 16 -89 32 -44 84 252 -37 94 300 75
3660 75 198 3 1 -204 88 107 -347 2 139 -55 -55 128 -104 -97 -182 -397 -29 -301 -89 -43 155 4 21 -164
3684 -164 68 96 105 306 549 71 89 163 218 -12 -11 -129 -46 161 31 -83 55 152 134 -234 101 202 -84 -158
3708 -158 -52 -83 -32 -248 91 37 154 84 -10 203 -38 131 91 267 -63 46 377 60 -136 324 165 60
3730 60 62 -173 -30 9 -103 -117 -160 -276 -2 -18 -237 -236 30 -114 -42 -63 99 -61 247 -2 43 -19 254 -103
3754 -103 -24 1 99 85 243 144 12 -41 48 163 -343 -124 33 130 -270 -13 130 -106 -100 -232 -43 -19 -93 -187
3778 -187 207 -29 -47 295 -7 104 54 -8 85 95 96 239 125 30 -105 27 143 81 -293 -30 -101 -44 -149 -75
3802 -75 -21 -108 5 -259 -112 -189 -123 -233 6 7 210 -42 139 -55 272 -102 51 308 352 23 79 333 67
3825 67 -22 -124 129 123 149 -212 -64 237 68 -215 -148 -125 -352 -91 135 156 -61 52 -29 124 -89 -39 333
3848 333 -13 58 -75 -30 73 2 61 374 -38 -149 -72 94 -125 1 -2 -439 -98 -23 -213 -86 -78 35 -127
3871 -127 -32 80 -200 22 -110 204 80 17 34 95 246 30 11 63 -51 145 83 290 191 150 52 -105 61
3894 61 -225 -64 -15 -48 12 24 -1 40 -101 -357 62 -89 134 -240 -159 117 -52 -15 63 224 -73 39 362
3917 362 96 -80 136 91 196 47 94 141 -136 -154 -94 243 -30 -264 37 -286 -262 -156 135 -212 36 -42
3939 -42 -94 197 -93 -128 -73 103 354 -62 16 219 46 3 296 59 -23 43 186 -27 37 5 77 58 -67 -67 -112
3964 -112 -163 -123 -67 32 185 -60 -77 204 -79 -119 51 -42 1 -238 104 50 -63 19 -56 71 104 266 150 130
3988 130 52 170 -115 -19 133 -38 36 139 -216 -233 56 -142 30 -240 -129 -108 39 -59 -52 174 -18 -55 72
4011 72 -133 380 228 -31 18 38 43 145 190 -48 -147 -14 -10 -73 -58 179 -290 56 -19 -329 120 -5 -128 258
4035 258 -200 108 3 -145 19 25 47 2 182 107 329 16 198 -9 351 -110 103 -104 24 250 11 -24
4057 -24 -209 -163 -134 -43 22 -141 -226 74 -399 -172 116 20 164 -83 170 80 13 -173 -11 364 165 176 196 -107
4081 -107 202 87 -33 28 34 -105 1 -75 22 -26 194 117 -251 -66 -30 109 11 36 -247 129 232 -82 -272
4104 -272 51 188 174 233 -67 161 136 27 109 110 -71 137 -37 -34 -129 155 -57 27 -316 -52 60 -226 -101
4127 -101 96 -71 -102 72 -52 109 -104 26 -78 7 73 15 42 -92 -135 129 -79 118 -119 254 112 -55
4149 -55 19 79 206 -155 -134 -45 97 -51 -174 37 37 -15 -230 -54 -136 -17 -70 107 156 -88 -140 45 91 -98
4173 -98 139 117 303 98 76 133 -36 130 248 -30 -6 370 267 -309 -27 111 -53 -49 67 -45 -67 -13 16
4196 16 -279 -210 -234 17 -20 95 -70 52 164 32 29 -61 161 -225 -96 16 39 62 225 60 -20 39 49 -46
4220 -46 45 -158 -91 -237 -22 -148 -102 -181 129 126 -106 149 78 65 -172 111 -122 81 -233 220 140 128 175 15
4244 15 -47 26 -104 57 -154 2 8 -334 -297 -258 -88 84 -85 22 -40 -56 -151 -54 -8 80 -15 98 139 -27 48
4269 48 -195 -129 -4 -50 -94 103 44 48 245 198 -10 -24 -230 74 186 280 -126 -159 1 -41 52 -229 41 160
4293 160 89 -125 52 -98 -23 120 10 -18 65 12 139 176 134 -41 -87 25 9 -49 41 -274 -46 -147 174 9
4317 9 -220 -1 -97 -138 -139 -143 -46 -69 94 194 -56 113 69 53 158 32 -25 -86 170 104 29 -146 200 -54 -27 13
4343 13 248 399 16 86 123 145 -75 63 -31 153 -173 83 -118 -251 -44 0 -146 2 27 -7 -93 -145 134
4366 134 -194 137 -27 -185 168 -51 176 68 -89 302 50 83 -19 -2 -27 118 -134 -82 23 82 -71 -236
4388 -236 -81 -187 -97 -77 85 158 229 -28 146 23 -59 192 186 99 -1 -37 236 11 240 105 196 115 86 252
4412 252 -129 -74 36 -13 -115 -117 -50 -129 -214 120 161 -324 -20 21 -168 -53 49 -232 -54 -140 75 -93 10
4435 10 -141 -142 -14 -77 -14 -111 26 -73 -110 -44 -179 157 64 -83 -167 65 -25 -160 342 87 15 52 -103 -20 -229
4460 -229 -173 209 -43 91 188 -20 30 180 218 65 36 -244 198 78 -43 33 -271 -130 170 -319 -124 -162
4482 -162 -57 85 -288 -71 54 121 -243 143 -49 106 -18 -11 335 117 104 9 -36 253 -14 89 -75 -164
4504 -164 -23 -44 -115 -262 -16 43 73 -43 -187 -89 37 -330 -41 -101 -50 -164 -36 277 -53 -50 -87 234 -72
4527 -72 -80 -178 -177 97 241 -48 -177 -11 -59 -33 -111 -10 -134 95 -113 -88 193 -16 50 -56 22 -79 -220 -144
4551 -144 17 -110 -193 138 -244 -7 6 -125 38 -17 -86 149 -4 38 -93 -89 197 -2 129 121 116 -124 -141 -32
4575 -32 90 36 164 -136 2 -113 -81 -9 81 -67 -192 -12 105 -44 -199 225 -124 -403 17 -355 26 -181
4597 -181 -87 -41 90 -80 -230 209 84 193 -166 -80 83 -138 -163 -144 -66 -144 23 1 -33 -184 105 120 107 143
4621 143 220 49 -7 158 28 47 54 6 -220 223 43 -82 152 125 -110 -110 -169 114 92 21 -120 -205 -60 18 276
4646 276 153 -86 -44 54 -168 -221 -113 -94 247 154 -94 159 79 -131 -10 -1 159 81 133 53 39 -168 134 -236
4670 -236 -51 171 153 -99 -115 -72 177 -21 -74 -238 31 -87 33 -162 183 86 -84 325 198 151 91 -119
4692 -119 -204 22 9 -176 143 -1 -73 -190 -135 37 112 -121 206 40 -89 -144 -30 -134 -129 -19 -36 51 -16 -271
4716 -271 -36 21 -316 -114 -49 -3 89 65 120 -253 93 -8 104 145 9 -55 -228 28 -10 -131 -60 -8 -13 11 -153
4741 -153 106 21 -65 -31 -32 -12 50 91 -65 137 -113 97 161 40 -121 5 137 64 -60 476 398 157 39 -145
4765 -145 134 108 -307 -60 -74 132 44 -99 16 24 -137 -181 -121 49 -192 67 -65 -72 219 40 -56 97 214
4788 214 -106 -169 112 -60 197 -110 -38 -83 6 -18 80 -52 125 -69 -45 267 -253 52 110 -58 61 -7 -113
4811 -113 100 -119 -117 -209 -138 -185 -112 136 91 210 -24 -107 37 -51 -40 8 66 85 -45 18 55 36 -163 9 -111
4836 -111 -388 111 -14 -226 -96 -216 95 22 -48 151 230 113 130 81 90 100 -117 10 -74 107 -107 -119 155
4859 155 174 -69 55 40 156 -11 215 -77 -57 36 127 -12 231 -67 -296 -61 -72 -181 -95 12 -16 180 255
4882 255 188 -23 328 75 -31 79 181 -20 366 61 272 231 -243 -150 -224 141 -77 -308 45 -48 -212 -40
4904 -40 -84 -294 80 -14 167 -127 60 12 -119 -148 36 -78 -65 -125 321 97 216 -13 -44 -11 13 -69 118 145
4928 145 -144 107 90 -1 71 39 17 68 -165 -188 -225 67 48 -30 -174 -80 -35 112 -70 194 -25 235 136 11
4952 11 -15 24 -115 196 -3 192 52 -18 35 -21 -44 -50 49 60 85 -197 -186 -88 -75 -131 13 -25 -23 123 156 -131 -136
4979 -136 -185 -155 175 9 -120 -113 -186 10 -55 38 -8 178 -29 -28 84 129 -160 184 102 311 -110 -133 -46 -3 -9 43
5005 43 -96 112 84 128 194 136 -79 -64 87 -66 148 14 151 -116 -74 -24 275 -220 -28 31 -138 -389 -48
5028 -48 -248 168 -378 -11 39 -6 -59 -284 60 -50 129 -74 -44 113 274 2 -195 30 256 -66 270 -80
5050 -80 -246 126 212 -29 -110 33 124 0 -136 105 42 4 44 -172 101 -301 -142 12 15 -105 -215 2 54
5073 54 89 -130 183 192 -10 320 -37 -60 -174 416 -29 -31 9 -79 9 30 145 27 -38 -170 -93 -147 54 -182 189
5098 189 -69 -75 -193 105 118 -101 43 224 36 2 98 -59 136 77 -99 23 361 -38 192 40 -25 232
5120 232 -35 -17 -221 87 105 -48 -48 79 118 -37 16 -83 -239 34 139 -384 -278 42 -58 228 61 76 144
5143 144 -80 129 -103 -53 -168 -154 19 34 -92 -52 -62 -65 59 64 129 -40 67 -64 -187 -16 -168 -57 -80 -90
5167 -90 92 -163 -33 -37 -69 44 -20 -16 21 47 -121 147 65 248 -144 -15 -4 179 -22 128 -41 138 284 83
5191 83 12 -15 89 -134 -242 -113 -24 -5 -185 114 35 -149 -143 34 207 119 -149 -109 153 -153 39 -89 49
5214 49 104 -44 193 -30 264 -44 228 13 -225 -227 -123 47 -237 -180 36 -64 -9 22 -113 73 -45 -81 60
5237 60 -266 151 1 155 132 185 -173 -14 119 -148 -110 12 44 -114 -286 130 -124 63 200 -78 25 28
5259 28 5 -187 -22 -87 -111 -106 -146 22 110 21 -56 -49 17 202 -21 84 206 -7 112 2 45 55 -74 -90 -72 60
5285 60 -154 163 -19 130 29 -141 -8 -156 70 67 147 -27 235 -94 -185 -44 -137 -86 101 82 -116 100 25
5308 25 79 72 -57 -4 -16 -44 -116 -240 98 44 76 61 -56 23 -2 -263 18 143 -98 36 -46 110 374 -156 74
5333 74 36 -290 -133 19 98 -126 -48 141 29 -247 101 -59 272 5 82 -305 -304 -125 29 30 -19 64 169 194
5357 194 131 -218 102 -77 102 -134 129 -80 96 70 -8 159 38 -122 -119 81 -187 109 -78 73 6 -4
5379 -4 141 65 101 -155 -189 -6 -88 -188 -335 -258 88 -1 -76 -136 -80 83 48 -43 2 -107 -2 178 81 70 54 108
5405 108 -140 -71 138 -4 -98 161 34 95 386 -404 -101 -106 -148 -145 135 -63 -54 -207 -43 32 18 -70 49 199
5429 199 -219 80 -104 35 135 209 67 56 164 4 -140 -75 178 36 -157 -74 86 -62 -88 157 140 -221
5451 -221 18 38 -121 -152 -14 -87 68 162 90 -107 466 -84 -136 -226 21 151 46 125 20 281 -270 69 17
5474 17 -59 -192 72 -195 -3 -244 -148 -214 19 -67 98 -196 116 30 128 105 35 -389 -212 -283 -181 274 -64
5497 -64 -35 290 -36 -61 25 104 75 151 -40 85 -129 -3 -182 135 64 -125 1 -56 -18 -158 105 -150 255
5520 255 133 152 26 322 84 78 92 -183 -132 -113 -153 -61 -50 -223 -64 11 117 -161 -242 204 160 -111 5 35
5544 35 -122 59 357 -125 -243 -178 -15 13 174 -86 -157 127 105 -213 81 72 226 174 184 81 -117 276 43
5567 43 15 -15 45 165 329 57 -119 -129 -48 160 -9 -113 -51 -85 -45 73 -115 127 18 -29 164 28 -74
5590 -74 155 -10 103 164 -35 79 119 -19 161 -107 -22 -43 -92 -128 -54 104 -153 5 74 -206 -85 210 212 33
5614 33 1 120 103 49 -146 -95 -128 -91 -96 162 -205 43 -34 70 132 290 -115 -111 225 86 -154 95 68 35 46
5639 46 -53 30 -62 61 17 -45 139 -118 -157 -1 123 234 85 219 133 173 148 -82 87 -25 -28 183 -126 -108
5663 -108 -212 176 79 12 67 273 -286 127 -60 -357 26 -130 -181 42 182 82 220 68 220 -27 -269
5684 -269 -91 9 383 0 -188 -43 149 -45 -41 -197 45 12 33 103 182 -167 -13 8 44 -167 -136 -212 -161 -142
5708 -142 79 -31 -165 -56 -146 252 -29 -13 121 11 -92 -31 105 190 -328 78 -22 165 132 -218 -31 -42
5730 -42 -211 138 -77 278 270 -279 -1 57 -203 -7 108 334 -171 40 -143 246 -119 -52 332 -96 -34 -89
5752 -89 -90 -240 31 134 -11 -201 107 13 184 -102 -89 186 264 77 -177 221 -78 75 25 -80 -11 -46 -79
5775 -79 40 133 61 -86 -275 -173 26 -201 -109 115 -222 -9 -141 114 -11 -201 72 -115 -119 -235 -59 -250
5797 -250 123 -19 -108 -57 -121 260 181 -17 64 33 92 -25 -169 99 182 243 -175 107 48 207 43 -174 59
5820 59 -197 -125 85 -112 63 -35 -6 149 -195 -128 -229 119 -129 -113 -151 84 -2 -41 56 -105 -238 30 -252
5843 -252 37 -11 -60 279 -28 -299 -100 -143 135 202 175 63 134 -8 -88 -7 -207 -73 52 -147 216 192 59
5866 59 197 71 94 95 -79 -27 -20 140 -35 -125 -39 46 103 71 51 -28 38 264 143 90 -103 25 -58 257 -127 22
5892 22 -167 153 -14 39 -151 -120 16 -11 37 -174 54 47 29 -162 -161 -41 -71 -142 125 39 67 308 15 21 -16 25
5918 25 -115 160 304 108 24 -56 151 -28 346 55 -206 -160 -128 184 -156 -89 -15 -79 -82 -82 119 -31 -205 -76
5942 -76 -6 -204 -30 -181 8 104 116 90 121 170 -171 -131 -25 -6 102 -133 9 -191 27 -148 -42 25 -171
5965 -171 119 -114 -341 -62 168 134 -184 6 -120 -41 39 -100 96 -138 -57 -171 -69 82 41 12 150 -71
5987 -71 -124 94 3 -195 57 -214 70 55 -39 -142 137 295 11 -236 -83 -34 132 164 -8 -186 439 -246
6009 -246 -5 208 212 -36 10 157 80 -107 -161 -68 -108 -142 -149 276 71 105 90 -47 -51 55 51 -14 -365 -97 -55 -38
6035 -38 -314 -8 -358 -73 103 -70 63 50 -54 199 -169 -142 147 -206 -84 197 81 352 -266 134 62
6056 62 -24 149 -178 -87 -89 -186 258 -44 -17 36 49 -261 67 -131 6 -156 20 271 100 -288 -20 -101 -323
6079 -323 8 -72 175 -110 60 247 124 -62 411 135 -69 27 113 38 -154 111 -137 -131 -59 284 94 -41
6101 -41 -20 -225 105 -40 -82 -262 -45 -363 162 165 -40 -27 107 -202 314 -178 -118 63 291 219 27 41 424
6124 424 -131 -174 -40 260 166 70 -13 74 -81 -108 -265 50 -30 309 36 -155 85 -107 6 188 -130 129
6146 129 120 -299 -132 -30 -19 142 204 242 26 178 -67 56 31 128 -84 60 119 126 138 -34 15 -101 174 -79
6170 -79 -73 12 -140 -282 418 -7 69 40 -161 -23 103 -67 267 -29 167 258 34 91 20 -72 -47 6 -88 -45 116
6195 116 -109 -94 113 44 9 -4 58 -10 -199 -180 -137 57 122 40 168 62 -107 112 11 -72 51 108 167 71 40
6220 40 -43 60 -153 1 -142 -22 -229 311 -67 44 -77 60 300 130 -59 73 209 116 170 158 -82 176
6242 176 117 102 -54 -105 325 -111 -257 -10 109 -46 28 195 -85 -15 -123 117 -292 -213 5 -54 211 153 2
6265 2 -252 14 95 -119 137 82 66 90 -253 443 -55 2 103 13 128 60 258 4 -3 -189 -95 -130 84 -76
6289 -76 103 196 156 74 35 -246 150 -200 -210 134 52 -139 -139 108 25 97 -86 -171 110 -161 -207 17 28 101 199
6314 199 165 37 221 16 225 39 43 -152 -323 -179 -6 302 -113 -35 -72 -163 231 132 -184 129 276 -54
6336 -54 38 65 -64 -92 37 103 17 -210 129 -7 29 -60 -35 100 -143 167 -63 91 -106 65 104 -55 25 -102
6360 -102 -50 191 -48 29 -287 -17 -130 17 -166 -44 42 111 -128 25 -242 -136 -113 128 -36 55 -84 121
6382 121 76 -94 89 -131 -211 -276 50 -261 238 -59 -59 -87 92 169 -93 -204 40 181 226 145 93 -21 6 49
6406 49 -57 -90 19 76 -143 95 -300 209 207 -17 121 -92 33 228 198 -121 -154 -77 -130 -26 3 53 -45 70
6430 70 -138 -56 144 124 96 -224 -158 -2 -319 180 221 121 -131 -53 -127 -86 324 273 -6 127 117 249 -41 -211
6454 -211 97 -196 -72 -1 -2 -238 -153 108 -144 -80 132 84 50 -78 115 117 71 60 183 -303 -265 -63 -25 -190
6478 -190 39 33 -153 176 -123 154 33 182 101 -41 -106 134 -27 37 302 -150 178 119 133 -317 56 73 171
6501 171 -181 50 -65 -90 -49 47 -6 -213 72 -43 88 52 -5 -153 -158 38 0 -145 -30 256 -114 162 40
6524 40 142 31 329 -63 -22 296 -127 -63 -62 -68 -144 142 276 222 35 28 -214 188 -155 187 7 -54 -51 -61 22
6549 22 -16 -3 -323 -37 215 -200 17 0 21 -179 10 266 89 -7 133 -313 385 -12 223 44 122 -20
6571 -20 -66 196 16 -22 -129 97 -64 -78 127 -14 -42 106 -48 43 89 69 -287 48 -79 77 -51 58 166
6594 166 87 32 -102 -154 -150 -8 -140 -36 49 -60 135 19 -89 -136 -43 -127 -95 7 -257 190 -115 -15 -82 -25
6618 -25 -6 -212 30 -109 249 -199 46 -84 -122 -37 -41 67 264 62 333 167 -118 10 -59 139 132 52 292
6641 292 -219 -134 201 36 -72 36 82 148 242 118 206 -7 -240 -100 50 -105 -177 44 10 -72 79 14 -50
6664 -50 -19 296 15 -77 108 -13 -79 -89 -197 -175 -125 93 -93 143 88 -60 -130 49 -194 170 -72 -114 -25 197
6688 197 -237 -310 50 -103 -20 -24 -230 -53 105 207 -150 216 -27 -124 28 50 73 -105 -257 -14 351 384 263
6711 263 -44 -245 61 135 140 138 -175 40 80 28 41 141 -114 -87 125 32 -173 50 -35 -184 7 -23 -30 115 77
6736 77 -72 -45 -164 5 -50 17 116 -104 127 -43 89 112 157 -83 -9 -80 -72 -43 58 54 -157 -27 0 102 336
6761 336 122 0 -242 -221 138 -9 -185 48 -94 -57 37 11 254 -72 -149 71 -215 60 -82 -60 -58 -208 1
6784 1 6 107 -203 -109 46 -228 194 -33 -105 64 -209 -63 -148 9 -88 74 -40 -19 152 47 90 -116 -69 1
6808 1 -267 313 -108 -115 -63 -178 48 154 215 -134 -47 -108 126 -18 285 -69 134 226 -96 -12 -77 -41 -160 10
6832 10 35 187 -108 75 -162 235 -205 -218 -129 -121 94 -110 58 -90 -113 -95 -78 331 -121 -5 68 -19 5 224
6856 224 230 -127 85 -273 128 6 404 131 -24 -195 -68 -52 -12 -91 100 -138 26 -152 -188 120 71 -109
6878 -109 -80 -167 -113 -24 -75 65 -151 140 -217 139 -96 -109 256 174 49 76 36 77 -32 40 60 86 -137 52
6902 52 -166 -10 0 80 26 -3 -140 112 160 -198 113 73 8 -16 286 119 -128 -180 -163 297 111 -28 203 222
6926 222 95 -107 -74 116 28 104 -146 -162 -111 93 109 44 -187 -259 -65 -64 36 4 -6 18 -11 49 114 98 -90 12
6952 12 -21 99 60 -147 -87 -144 96 -28 69 217 -168 -126 -113 -282 249 -47 -64 -97 174 -18 -89 60 2 -176
6976 -176 58 144 -67 -160 104 -53 -191 50 -31 -193 -253 -84 -111 62 87 -101 -111 141 -338 -314 -228 138 -109
6999 -109 -47 85 -233 -34 12 137 -131 -163 -148 -196 -368 -188 -34 -161 -142 60 8 124 -169 10 -6 -7 175
7022 175 -27 -139 145 -74 -77 117 -1 -144 107 -77 103 11 -259 -47 48 -30 106 11 52 205 4 182
7044 182 -93 -322 43 141 -45 -84 310 46 -20 -86 -39 210 -38 -249 -230 322 68 -73 -108 165 -91 197
7066 197 135 43 -142 -436 19 -84 -46 -95 75 -197 175 19 9 221 40 298 -1 -31 -145 -6 -159 -5
7088 -5 117 -46 -97 13 -163 -84 -97 -41 304 -106 -35 -76 162 40 -55 152 15 -186 -1 -122 8 -61 27 -50
7112 -50 68 177 57 80 130 73 28 8 31 110 -71 132 -98 138 197 113 -19 -30 79 118 31 -76 108 -139
7136 -139 9 -195 -109 61 -111 -138 98 -98 -119 -9 -113 31 -20 -59 235 -23 109 53 80 -32 -174 127
7158 127 -184 -65 -63 -29 -211 -112 -221 28 -379 -60 -140 81 14 149 -59 -3 -85 14 189 -214 98 286 28
7181 28 -37 -5 238 137 -37 -203 74 -17 -36 16 148 -28 177 71 -35 -24 117 125 -228 -91 -27 204 248 271
7205 271 -27 -11 65 290 -176 71 8 141 27 -18 50 145 -19 -68 48 -3 148 -213 21 -60 202 -82 116
7228 116 272 104 -68 -100 -137 -108 167 -56 209 -68 184 -89 113 92 -84 -18 -76 -114 69 250 -208 390
7250 390 251 -12 -67 -123 -218 -119 -116 -136 -87 -41 41 -147 217 -105 -203 12 146 -18 191 26 -249 42 -15 -106
7274 -106 124 116 -78 -96 -14 -189 -211 97 -157 56 -104 -179 -77 217 -80 -104 -112 -129 86 -218 -2 -283 -127
7297 -127 83 139 -100 35 -97 191 273 135 23 -57 -135 104 53 -34 -71 -3 -39 -377 -68 -65 47 -119 61 108
7321 108 62 -283 -152 3 -47 181 185 78 73 107 63 80 147 142 -64 -107 152 -126 125 149 1 139 -81 109 107
7346 107 4 32 6 -23 86 2 -159 -148 -40 62 25 -385 22 -7 7 -83 -272 92 -29 -48 -5 37 0 94 -54
7371 -54 -25 108 102 46 22 -139 148 -100 -146 -114 173 203 -100 -130 -89 -210 112 77 -124 -18 -161 140 -125 164
7395 164 90 133 24 -3 113 -80 -77 -140 -211 -147 -116 -211 -83 -87 188 73 5 38 -39 54 18 -165 181 165 -52 51
7421 51 254 -24 29 -25 8 -137 -54 -77 -190 158 132 -52 28 193 127 302 137 -135 220 3 188 -187 -143
7444 -143 245 58 146 -24 -83 29 104 52 -9 -163 358 -154 -26 -167 0 138 -204 -97 70 -107 -129 178
7466 178 79 107 98 -5 81 103 55 -105 100 219 -52 159 91 65 4 58 -127 -132 97 14 -72 -13 117 176 47 154
7492 154 81 -143 55 -212 -7 -119 180 83 188 165 -134 104 48 42 -19 39 -223 -90 57 -172 -75 129 89
7515 89 139 -56 134 53 233 -78 -8 -246 -216 104 -227 -8 233 -61 -119 -154 -58 -192 49 68 133 27 -90
7538 -90 -48 -213 -20 225 -2 141 -124 -166 128 -128 138 26 51 21 57 66 -25 -170 -93 -121 -83 207 -170 -71
7562 -71 37 -81 65 105 116 -197 -11 50 -86 -217 -64 98 -82 5 96 -125 183 -32 -170 -172 -55 18 147
7585 147 -190 -37 57 50 72 160 125 -99 23 25 -187 -110 -240 -56 376 -87 98 61 152 -281 23 88 -116 -102
7609 -102 210 248 25 -114 6 4 62 25 -6 -34 -154 20 69 -32 -79 25 9 26 7 48 -127 -48 131 -17 -118
7634 -118 -210 48 -80 5 27 -26 -340 120 209 -133 41 -77 -48 41 43 -131 225 -35 -100 -20 -11 -73 33 135 59
7659 59 6 -91 -102 -207 441 154 41 -68 61 6 4 62 -121 46 -42 -78 109 -43 -93 -293 -106 59 -53 60
7683 60 -147 -135 24 -132 103 95 -86 -153 165 81 -118 16 18 -298 -46 -212 5 108 -174 -257 148 -105 112
7706 112 -180 -115 -81 -87 -72 -99 -69 -357 7 14 196 -174 -50 -33 -182 -46 -105 -29 -248 -212 -21 282 34 -70
7730 -70 0 -15 -12 20 -52 -219 -99 0 -167 227 -95 -139 -152 106 57 -26 -67 10 95 56 187 22 -49 26 399 110
7756 110 -87 -55 146 -135 135 15 15 -74 68 178 13 -13 -37 -97 -137 -76 -64 -40 -21 -205 335 219 -171 -115
7780 -115 -26 45 103 4 -109 72 56 36 -71 70 229 -145 273 -66 38 -4 -12 201 92 -88 35 -215 -78
7803 -78 75 -25 123 -155 -3 -69 -353 57 87 17 -13 118 211 -147 128 117 380 87 -162 -157 244 -175 39
7826 39 220 206 168 -78 -3 -197 -245 21 -96 -55 145 -97 -138 -25 -20 -107 -239 58 16 -30 81 -18 -6 -69 68
7851 68 -40 188 80 21 -118 56 -100 10 -111 55 -117 -11 97 -8 68 -345 121 280 -208 -11 49
7872 49 82 50 62 123 -65 -33 -88 81 5 -104 75 -172 -82 52 25 -68 49 139 42 -88 145 -34 -174 70
7896 70 160 167 -76 -162 -245 -70 -66 -39 -273 -236 -138 260 -59 -33 -13 -5 -300 74 64 36 -194 200 15 122 -180 -119
7922 -119 -19 107 78 4 -25 48 85 -21 132 40 -22 272 -11 253 -102 -287 -12 90 -226 175 291 210 14
7945 14 82 -90 -64 -24 101 75 60 38 -63 98 -124 70 -13 14 79 253 -138 45 2 -102 -54 98 -101 161
7969 161 -178 0 24 -51 -28 -37 -154 10 -14 -115 -24 32 37 -179 -130 32 99 134 30 9 -32 -11 65 -68 91 39
7995 39 -175 -140 43 -21 -61 192 -142 254 -78 1 129 45 49 -136 209 -127 126 24 342 82 -21 97 -275
8018 -275 -255 -133 -239 -1 -134 303 31 -85 38 -105 233 196 -58 -140 -165 54 -69 85 210 55 58 -122
8040 -122 -171 -86 138 -67 -42 104 42 70 88 237 200 267 157 97 -19 200 -39 207 278 -51 -160 103 109 177
8064 177 -107 -118 157 -3 -223 141 -98 -154 -143 54 -374 -14 -114 130 -166 254 121 72 -223 -141 136 28
8086 28 146 53 13 -227 -41 -4 -94 -40 -179 -148 38 -86 -37 102 154 18 -63 33 88 -95 127 -106 170 21
8110 21 58 -8 100 18 69 167 198 238 125 -208 -177 0 -52 -15 72 179 -172 160 -66 -141 -141 -154 -13 -94 -77 111
8136 111 -118 -104 -5 -204 -115 102 56 10 -184 -192 142 -205 66 41 73 -40 43 -59 278 206 36 157 102 -136
8160 -136 167 -247 146 5 -94 -129 219 187 27 -55 -72 -209 -139 68 52 70 164 -238 22 -86 -37 -80 -28 75
8184 75 -94 -22 181 59 127 -71 -171
8191a71
$$ Imaginary data points
##PAGE= N=2
##DATA TABLE= (X++(I..I)), XYDATA
0 0 0 0 0 0 0 0 0 0 0 0 0 -8 8 -8 8 -9 16 -16 24 -24 32 -40 47 -56 64 -72 83 -96 112 -128 145 -168 192
33 192 -216 244 -273 308 -345 386 -431 479 -533 591 -655 725 -800 885 -974 1075 -1182 1302
51 1302 -1437 1583 -1746 1929 -2136 2370 -2639 2953 -3322 3766 -4307 4990 -5878 7091 -8843
66 -8843 11629 -16726 29118 -126775 -31789 257856 15625 -176947 -44083 126514 4485
77 4485 -93255 -15716 73497 27503 -11044 -24549 -35232 -6729 81366 66142 -49033 -76221
89 -76221 29601 63344 -3920 -24513 18792 9405 -19595 -8034 -4593 -20874 23782 53438
101 53438 -37301 -106047 2180 100565 10764 -86300 -19100 50576 -3370 -42285 13045 40760
113 40760 1283 -18260 -5234 -6157 7950 45429 26459 -39577 -30769 37798 26915 -28236 3637
126 3637 47605 -20100 -69506 17968 67237 -26250 -62538 31772 42028 -63691 -56695 61166
138 61166 56253 -54217 -56467 28051 28838 -19664 -1021 27253 -6272 -23034 15399 21692 -12591
151 -12591 2947 41309 2537 -50065 -4307 57260 17141 -39985 -9688 23848 -9080 -23727
163 -23727 12235 15835 -16111 -15997 -2064 -11404 -6681 18639 6721 -26386 -14176 16047 4246
176 4246 -11928 12390 22490 -13484 -23806 18320 30068 -6561 -9862 21739 7166 -27375
188 -27375 900 39563 2865 -35877 1620 28554 -17534 -34318 20684 33069 -26803 -43870
200 -43870 7609 27819 -5545 -20898 -3280 6725 1675 -4853 -7700 1791 21775 14754 -22021
213 -22021 -23850 26543 42507 -10053 -34965 13544 36154 -10433 -28277 17012 28680 -14664
225 -14664 -24895 6284 8919 -9853 -1381 7754 -13038 -22046 3362 15067 -5442 -15676 -646
238 -646 7078 -1833 -6233 1548 8529 9103 2168 -9656 -6379 17620 24402 -5973 -21588 8644
252 8644 26293 -5621 -21921 11098 23142 -12863 -25770 6005 15861 -8086 -13473 2128 -968
265 -968 -13077 -4028 8186 487 -10182 -3696 4644 -9 -2590 4806 7459 761 -1641 2027 3284
280 3284 6651 10740 1975 -9315 739 14417 1679 -12138 2380 12309 -7164 -17585 1831
293 1831 11295 -5187 -12929 -2103 782 -6153 -3539 3519 -353 -6955 -1758 4614 -155 -2729 6729
308 6729 9215 -2675 -5892 6800 11584 2157 -1121 3853 2340 -535 2416 2092 -1705 885 1133
323 1133 -7229 -7699 3344 3978 -7408 -9523 3 548 -6325 -4017 3889 1356 -6710 -3392 5683
338 5683 4054 -2440 1937 8016 1373 -4294 4938 11277 2527 -3627 2656 5485 -276 -1908 1909
353 1909 1612 -1622 -4296 -4728 -1637 1607 -2210 -7242 -4307 832 -1987 -5878 -2150 3587 508 -5429
369 -5429 -2765 5742 5909 -1179 -852 5679 4263 -1247 3227 8267 2054 -2799 2620 5041 -1298 -3199
385 -3199 2317 3060 -3118 -7744 -3806 3057 2026 -7258 -9404 -167 4356 -3689 -8753 -858 6804
400 6804 1812 -6983 -4307 7050 10087 -995 -5578 3492 9080 3185 -619 2346 3216 1598 2246
415 2246 635 -2653 -582 3830 1228 -6442 -7526 190 4893 -2214 -10548 -5652 4361 1843 -7789
430 -7789 -5578 4199 4114 -3002 -3787 2324 5022 3138 901 1649 2664 2418 3162 5140 2556 -2524 -145
447 -145 5616 2946 -4914 -3759 2804 1860 -4500 -6148 -2950 878 934 -4012 -8041 -4144 3817 4315
463 4315 -4481 -8649 153 10554 4118 -9216 -4499 12336 12016 -4868 -8515 5896 13120 4038
477 4038 -5492 -4526 3797 8431 1992 -7781 -7188 3798 7923 -4197 -15112 -5254 10733 5435 -14697
492 -14697 -14882 7203 13085 -6221 -14605 1214 12381 2635 -7700 -2132 7391 6835 381 -1247
506 -1247 1760 3515 4512 4665 -300 -5443 910 9303 1264 -11163 -4657 8476 2189 -11896 -7072
521 -7072 6245 2541 -10151 -6678 5312 1801 -8652 -2723 9353 1823 -10800 -588 14601
534 14601 4781 -11067 -1548 14854 7395 -8048 -3785 8470 7607 -1908 -4831 -802 2693 2983
548 2983 -632 -6471 -6709 1823 6364 -4255 -14168 -3082 10360 2296 -13767 -8163 9233 9111
562 9111 -5746 -9341 1921 10354 4930 -4349 -3438 4840 8560 3184 -2919 -2471 3800 8017 2420
577 2420 -7890 -5861 7741 8444 -7906 -13666 2055 10608 -3465 -14633 -3012 9128 501
590 501 -11551 -3724 7856 1337 -7661 254 7691 -649 -4982 5327 8615 -1976 -4294 6148
604 6148 8245 -1246 -3723 3498 4891 -669 -2504 176 44 -2399 -538 136 -4850 -6147 1323 3647
620 3647 -5353 -9016 559 6306 -807 -7354 -2325 5658 5027 -1777 -4145 1755 8415 4608 -3337
635 -3337 -2433 5419 7644 1086 -3783 -1520 4106 4916 -1763 -6747 -2026 5060 2060 -7630 -8134 1586
651 1586 5888 -3162 -10665 -2871 6795 1845 -7130 -3523 4742 4160 -1205 -1015 1417 3158 3949 2123
667 2123 -1154 541 5319 4225 -1633 -2069 2502 3195 -1953 -3446 -120 938 -2018 -3381 -1777 -1559
683 -1559 -2893 -1958 -383 -2516 -3424 -43 1591 -1482 -2140 1649 2898 520 159 1684 2836 2706
699 2706 1473 607 1945 3139 1239 -636 548 1664 -13 -1763 -1062 239 -1066 -2959 -2272 -233
715 -233 -1351 -3982 -1783 504 -1682 -3439 -77 1730 -597 -1531 1399 2935 829 280 2070 2961
731 2961 2288 1257 717 2462 2937 547 -1329 403 1730 -219 -2604 -1765 301 -369 -3583 -3719 -254
748 -254 365 -3287 -3812 -361 699 -1946 -1630 683 1082 -123 927 1683 1526 1290 1864 2418 2121 1560
766 1560 1142 1885 1884 227 -461 404 766 -717 -1682 -1448 -969 -845 -2499 -2829 -1362 -506 -1884 -2534 -540
785 -540 81 -1119 -245 1098 375 70 1629 2068 1060 1169 2382 2416 1558 903 989 2077 1263 -191 -432
804 -432 422 65 -1023 -1543 -1679 -1253 -1099 -1891 -3084 -1650 -307 -1345 -2744 -993 721 -262 -669 393
822 393 1065 1366 1389 1174 801 2033 2593 1538 636 1292 2212 1464 -471 -685 1089 796 -1619 -2403 -357
841 -357 273 -2378 -2769 -1488 -943 -1309 -1347 -1715 -1588 178 813 -769 -584 1625 1565 866 812 1918 2139
860 2139 1745 1519 1368 1278 960 1634 986 -669 -1011 465 494 -2040 -2361 -248 -117 -2165 -2728 -1000 -939
879 -939 -2108 -952 -428 -1363 -504 1337 496 -864 660 2456 1987 657 760 1838 2221 1422 1087 743
897 743 269 1723 1504 -881 -2287 -9 1724 -1508 -3778 -1306 790 -1554 -3336 -1756 -449 -611
913 -611 -760 -1401 -1553 11 2107 363 -1354 543 3351 1970 -401 850 2887 2057 295 1241 1698
930 1698 -184 110 1946 423 -2973 -1518 2089 -686 -4853 -2038 1609 -1192 -4068 -1456 767
945 767 -1853 -1533 1094 526 -2083 165 3387 1560 -2033 27 4615 3219 -1169 -876 3410 3212
961 3212 95 -1064 169 1452 1354 -742 -3098 -1561 1650 100 -3460 -2997 -163 -20 -1354 -1957
977 -1957 -2293 -1236 1718 1488 -2869 -2711 4059 4916 -1889 -3673 3847 6323 -152 -3213 2643 5043
993 5043 -78 -2075 1712 1516 -2165 -100 2088 -2380 -4568 976 2791 -4287 -5776 1495 2943
1008 2943 -4203 -5131 1629 2482 -2681 -2143 2509 1624 -1773 591 3691 1050 -1710 1833 4675 843
1024 843 -1551 1410 3279 462 -1154 -254 322 -171 -501 -1683 -2154 -734 -91 -1720 -2296 -1196 -684
1041 -684 -1082 -229 -159 -2142 -605 3218 1876 -3339 -704 5556 3885 -3263 -1898 5878 4447 -3246
1057 -3246 -1694 4615 2675 -2998 -994 2411 -988 -2808 1224 954 -4578 -3205 3037 596 -6211
1072 -6211 -2752 3805 716 -5386 -1710 3956 1571 -2786 149 3777 824 -1010 2050 2433 -509
1087 -509 651 3501 1149 -1568 946 2521 -506 -2051 507 758 -1899 -1720 -163 -1260 -2321 -833
1103 -833 -588 -2076 -1421 372 -1062 -1693 522 1623 -1080 -1254 2640 2331 -1326 -241 4258 2422
1119 2422 -1894 192 4326 893 -2299 567 2757 -1072 -2447 1425 659 -3421 -2025 2075 -1065
1134 -1065 -4488 -917 2206 -1781 -4356 483 2770 -1452 -2507 1888 2351 -1021 -293 3063 1493
1149 1493 -784 1672 3236 36 -1045 2367 2378 -1769 -948 2441 520 -2457 -816 1418 -1542 -3029
1165 -3029 -401 -22 -2406 -2159 746 -621 -2307 -202 1461 -857 -1594 1600 2593 -440 -455 2759
1181 2759 2493 -1020 523 3271 1056 -1206 1033 2289 -570 -1229 1415 274 -2641 -863 1383
1196 1383 -1258 -3212 -597 946 -2159 -2799 697 455 -2331 -1379 1925 485 -1450 751 3020 132
1212 132 -1300 2341 3127 -377 -546 2861 2038 -1122 -83 2160 209 -1882 215 918 -1640 -1945
1228 -1945 138 -280 -2973 -1529 904 -781 -2643 -595 827 -1080 -1716 963 1375 -754 -165 2551
1244 2551 1190 -633 1338 2981 444 -910 1497 2328 -629 -765 1595 648 -1603 -759 660 -968
1260 -968 -2603 -198 98 -2022 -1957 393 -110 -2085 -861 1151 -105 -1471 579 1791 -17 -556
1276 -556 2343 2350 -519 256 2456 1311 -648 727 1938 -44 -1215 904 769 -1608 -1062 707 -284
1293 -284 -2351 -1086 264 -1502 -2647 -563 572 -1471 -1472 651 766 -1111 -286 1768 924 -218 1325
1310 1325 2539 534 -46 1814 1903 -405 -56 1696 445 -1302 -396 934 -531 -1577 -597 -507 -1290
1327 -1290 -1391 -438 -532 -1488 -783 112 -676 -1076 347 743 -210 -109 1532 1244 -178 693 2064 1008
1345 1008 333 1284 1505 184 122 1034 393 -944 -251 708 -882 -1894 -836 70 -1118 -1981 -722 -170
1363 -170 -1290 -1328 68 348 -1180 -499 1210 566 -181 856 1522 694 451 1000 1350 529 638 1053 684
1382 684 248 -89 379 -308 -747 -270 -560 -1090 -1131 -786 -717 -999 -1034 -949 -578 -534 -27 -346 -583 -14 1144
1403 1144 660 -107 1028 1406 939 411 966 1452 301 428 982 386 -244 -45 243 -504 -941 -420 -385
1422 -385 -802 -1437 -930 -274 -759 -1635 -844 173 -424 -751 64 620 170 315 741 911 743 787 1059 1137
1442 1137 649 456 755 1189 286 -515 504 439 -299 -1117 -556 -342 -648 -1229 -953 -618 -806 -836 -331 -183
1462 -183 -548 -452 417 462 -453 -63 923 1378 66 81 1263 1434 480 -32 1086 1373 313 -517 387 679
1482 679 -330 -966 -370 -536 -1242 -1198 -98 -847 -1843 -974 116 -302 -1578 -386 927 104 -836 245
1500 245 1494 889 -315 875 1758 871 -126 797 1276 363 -238 909 885 -492 -1005 281 365 -1258
1518 -1258 -1562 -391 -377 -1188 -1194 -593 -518 -1164 -664 128 94 -214 17 877 977 154 560 1560 841 -30 543
1539 543 1446 1028 -89 66 793 624 -529 -554 41 44 -1228 -985 -217 -718 -1269 -656 52 -985 -1311 -167
1559 -167 655 -292 -1051 173 970 324 -138 972 1657 314 185 1108 1561 293 138 894 765 -276
1577 -276 -298 572 -126 -1013 -568 73 -862 -1280 -833 -193 -419 -1230 -212 -113 -316 -510 -98 718 422 223
1597 223 692 763 624 618 721 817 905 588 589 911 397 -122 -188 97 -221 -818 -661 -455 -407 -908 -680 -530 -913
1620 -913 -973 -593 -208 -496 -591 144 552 -103 242 1039 1067 496 487 1368 957 106 279 1138 760 -259 -79
1641 -79 569 -132 -682 -65 -94 -674 -1157 -194 -445 -1147 -750 -489 -639 -807 -578 102 38 -325 421 558 402
1662 402 652 743 563 956 769 721 461 566 553 514 -54 88 501 -389 -739 -503 -137 -678 -768 -206 -501 -1172
1684 -1172 -530 -181 -606 -956 4 475 -232 -247 497 685 148 146 961 985 282 601 901 740 -40 595 498
1705 498 45 -417 99 31 -600 -794 -584 -437 -1046 -763 -614 -455 -835 -522 -199 -215 -229 -223 210 41 437 635
1727 635 641 452 899 775 490 653 769 596 165 584 290 -59 -439 -127 -193 -815 -674 -367 -526 -1031 -768
1748 -768 -338 -531 -784 -342 129 -356 -79 2 479 69 397 929 707 434 502 1155 635 586 482 678 216
1769 216 7 185 183 -165 -472 -354 -413 -641 -633 -793 -384 -595 -429 -477 -513 -270 -155 211 -103 273 684 368
1791 368 268 848 615 559 669 985 609 586 363 592 435 4 -8 -192 -499 -417 -293 -443 -719 -740 -656 -483
1813 -483 -630 -702 -153 -359 -524 -153 296 30 -69 47 765 557 226 821 761 897 560 612 471 245 197 230
1835 230 20 35 -474 -501 -157 -416 -784 -480 -458 -787 -806 -749 -257 -117 -284 16 -2 125 230 -79 598 359
1857 359 324 607 1041 747 343 411 674 283 -6 228 193 66 -530 -372 116 -347 -869 -281 -347 -724 -847
1878 -847 -89 -170 -491 -911 22 72 -134 39 370 390 137 116 593 774 500 468 816 885 7 53 382 235
1900 235 -321 -94 -31 -99 -686 -707 -33 -545 -719 -751 -378 -341 -702 -202 224 207 13 101 246 626 518 254
1922 254 839 1055 514 535 838 503 -68 231 513 258 -298 -56 -220 -255 -804 -437 -149 -728 -883 -438 -81
1943 -81 -820 -631 -180 -78 -246 -216 223 642 117 22 313 904 181 252 809 785 15 271 443 530 -241 -234 167
1966 167 -81 -370 -239 -483 -274 -715 -672 -487 -329 -689 -384 -68 -114 -330 -408 323 235 -41 -14 664 428 554
1988 554 293 798 629 282 91 691 581 -228 67 298 -34 -711 -642 -163 -330 -902 -434 -46 -317 -707
2008 -707 -336 -332 -288 -441 156 483 119 44 658 703 109 261 790 686 245 327 478 405 217 135 261 117 -167
2031 -167 -300 -202 -440 -483 -257 -569 -252 -694 -323 -145 -184 -310 -403 -103 -133 343 157 55 688 357 245 645
2053 645 614 572 197 609 617 19 14 332 62 -103 -239 -195 -199 -861 -526 -280 -726 -606 -433 -206 -470 -1136 -95
2076 -95 78 -268 -125 444 420 76 411 769 390 118 495 791 440 -145 614 289 21 -20 163 -209 -297
2097 -297 -272 -478 -620 -555 -460 -671 -474 -220 -202 -665 -484 -110 174 -16 -75 483 267 150 484 954 399 -22
2119 -22 665 560 58 76 498 230 -285 -362 299 -91 -729 -514 -127 -601 -1004 -419 -62 -572 -748 -21 55
2140 55 -424 -126 371 54 -296 278 606 231 114 674 501 134 320 524 334 65 196 231 0 -183 -78
2161 -78 -211 -432 -402 -443 -444 -632 -148 -257 -718 -506 53 -90 -447 -58 627 157 -197 468 628 359 -210 841
2183 841 663 -25 61 664 483 -330 -345 460 -66 -564 -48 151 -403 -889 1 -125 -680 -470 79 -349 -627
2204 -627 -355 112 67 -195 200 359 107 -19 630 702 133 214 589 356 100 160 536 99 90 195 -73 -492
2226 -492 -374 34 -674 -462 -227 -154 -637 -732 -23 -69 -852 -354 323 5 -336 179 627 178 -274 555 680
2247 680 112 160 939 371 -380 455 606 179 -447 271 17 -329 -307 -134 -80 -887 -642 1 -522 -613 -195
2268 -195 278 -191 -158 246 146 -71 535 1011 292 399 680 733 62 -49 659 402 -335 393 490 -100 -308
2289 -308 48 203 -384 -600 -248 -250 -652 -586 7 -216 -632 -100 99 -136 -422 327 574 -237 -18 617 475
2310 475 247 378 674 443 -64 142 414 81 -249 205 144 -221 -110 119 -215 -666 -188 -115 -444 -717 -39
2331 -39 -120 -633 -435 75 -1 -324 353 561 122 -109 683 794 -81 323 720 396 -206 395 521 216 -320
2352 -320 261 240 -375 -299 106 -119 -839 -501 87 -163 -412 -43 257 -391 -582 164 238 -172 393 379 481
2373 481 68 267 628 254 9 275 355 351 163 237 226 -319 24 95 -156 -266 -221 -176 -623 -579 -300 -387 -468 -28
2397 -28 -218 -262 -130 194 126 -221 280 524 353 286 497 645 309 -74 403 538 63 7 55 326 -333 -270
2419 -270 112 177 -205 -285 -132 -633 -537 -166 -413 -267 -198 104 154 -273 42 53 58 429 495 353 159 357 102
2442 102 349 142 243 335 123 108 217 52 -139 -310 -259 -235 -484 -213 -341 -380 -479 -209 -298 -489 -260 224
2464 224 26 -221 326 242 206 110 359 531 519 329 388 373 -42 240 305 -5 78 236 140 120 -259 -184 -195 -324
2488 -324 -363 -441 -258 -233 -148 -6 -363 5 102 -191 31 -25 301 120 349 301 406 245 432 243 85 201
2510 201 233 149 35 -39 12 -64 -323 10 -247 -143 -198 -403 -124 -578 -345 -261 -150 84 -52 -21 308 -21 352
2533 352 379 487 201 226 483 484 316 293 204 137 17 42 -110 70 -303 -60 -290 -442 -79 -284 -257 -337 -152
2556 -152 -227 -279 -67 80 -25 0 132 15 -36 291 63 114 421 328 219 166 184 147 129 154 77 -15 263 -116
2580 -116 -255 -271 -292 -38 -307 -319 -380 -125 -113 -193 -228 -80 -50 -102 39 82 120 248 29 364 154 265 452 147
2604 147 286 170 299 135 214 225 -77 169 -108 -47 -10 -208 -304 -325 -400 -216 -414 -109 -292 -219 48 98 144
2627 144 291 180 222 340 367 121 620 448 347 302 244 138 -32 105 -113 -60 -52 -114 -251 -329 -400 -276 -277 -140
2651 -140 -130 -468 13 -185 -181 -126 32 196 100 36 257 148 88 140 524 114 158 434 349 -90 -143 296 448 -204
2675 -204 -412 157 -63 -451 -231 -49 -391 -311 -55 -268 -338 -306 10 119 16 -318 92 170 123 136 288 156
2697 156 337 176 166 148 198 340 129 232 151 -243 -99 -56 -150 -179 -308 -461 -23 -506 -490 -211 -32 -320 -248
2720 -248 162 113 -261 84 340 -64 -193 352 425 -45 76 204 410 61 98 154 316 -47 -53 139 94 -375
2742 -375 -403 27 -407 -579 -69 -114 -481 -292 -92 -78 -63 -361 -45 143 39 172 369 -112 197 270 -120 326
2764 326 220 345 286 370 42 298 -144 -68 -94 -109 -203 -208 -243 -352 -567 -212 -153 -340 -423 87 -117 -76 122 51
2788 51 303 -92 241 165 243 -93 70 496 47 188 211 296 -71 3 -46 10 -90 -93 -114 -421 -422 -36 100 -325
2812 -325 -85 -319 -145 -178 -426 -185 -86 -220 -195 203 134 181 29 293 54 265 137 396 164 29 245 19
2834 19 -33 160 -113 83 -136 -290 -68 -277 -69 79 -63 -322 -142 -3 -368 -66 -20 -54 -94 13 126 120
2856 120 143 468 500 72 110 439 487 -139 132 353 210 -40 146 211 -318 -267 -57 -109 -403 -365 45 -123 -97
2879 -97 -135 22 -57 -150 -268 57 -66 237 -190 147 49 179 358 162 110 244 60 -40 271 141 46 -168
2901 -168 141 17 -154 -194 6 -94 -213 -293 -72 -70 -107 -259 -55 -120 -138 76 337 -160 184 51 146 154 181 221
2925 221 232 122 100 400 136 -13 45 -36 -2 -139 -211 -53 -19 -173 -149 -259 -270 -297 -263 -42 -244 -370 -5 -66
2949 -66 -147 220 240 76 98 241 74 413 271 -57 -69 284 108 305 -197 -7 -184 -257 60 96 -288 -314 -122
2972 -122 -140 -73 -321 -143 -152 -323 -146 -202 42 -143 140 85 225 92 20 342 143 64 305 316 257 198 -107 55
2996 55 105 -23 -445 30 -124 -137 38 -351 -286 -317 -142 -243 -344 -51 -135 -4 -117 -118 -60 -143 82 91 163 231 105
3021 105 279 92 -22 -44 327 342 144 92 -167 -51 32 20 -22 -340 -286 -180 -250 -374 -163 -358 -134 231 -149
3044 -149 -269 107 231 290 114 131 69 583 211 278 445 114 236 159 94 54 195 188 -245 -116 122 -61 -233
3067 -233 -617 -242 -395 -199 -114 -140 -209 77 -65 -88 45 10 -195 257 355 83 263 163 161 132 274 290 417
3090 417 -131 -4 19 -56 51 149 100 -44 -316 -360 -247 -60 -179 108 -55 -274 -20 190 -74 -179 -252 -68
3112 -68 234 73 297 248 118 235 187 285 -59 127 119 253 70 122 188 -117 194 -111 -214 -334 -294 -252 30
3135 30 -255 -167 -232 -113 -326 134 -101 -56 143 50 169 56 367 211 94 87 321 -42 226 175 347 -207 300
3158 300 -56 88 3 -191 5 -126 -308 -272 -61 -373 -24 -280 62 -137 -210 70 -80 0 88 234 21 283
3180 283 78 663 -1 16 237 352 289 22 199 13 274 -114 -47 -146 -64 253 -182 3 -12 -384 -203 -178
3202 -178 -177 62 -199 66 -119 -9 -4 10 189 105 214 74 344 127 235 70 180 67 -150 -206 48 -185
3224 -185 -120 24 -52 -84 -134 242 -270 -193 -27 -91 -126 -338 -50 -25 -57 26 -107 101 -19 52 105 73 76 167 245 -14
3250 -14 46 157 155 3 -152 147 177 -90 36 -133 -105 -62 88 91 -236 -35 -2 116 -144 60 176 -101 -174 218
3274 218 241 109 187 167 269 179 85 -13 3 268 360 -14 -88 -18 250 199 -120 43 -12 -41 -163 -85 -19 -324 -218
3299 -218 -19 -160 -44 -38 108 325 -115 -54 -146 11 42 185 55 21 183 132 409 73 -242 236 100 66 128
3322 128 -339 -89 -60 -152 -197 -178 -101 -3 -191 -161 178 -38 -134 -40 29 13 -8 -156 365 406 87 132 158 169 320
3347 320 51 90 22 -133 92 139 -60 -138 -128 -342 -241 -197 -123 -274 -224 -7 63 124 -108 55 -209 -335 -125
3370 -125 47 19 -17 -107 237 164 -154 129 116 1 -21 -82 127 -144 49 273 -28 -3 17 -154 -92 -251 -281 -140
3394 -140 -51 11 -179 -27 -151 118 -77 -83 17 -84 -205 51 278 248 -121 165 196 97 196 -30 236 50 -219
3417 -219 -46 165 -293 -223 27 -89 -169 -294 -90 -41 -18 -37 -66 -344 -123 -23 188 164 -139 156 114 84 -6
3440 -6 214 86 40 205 148 -52 -92 231 86 -85 -102 -101 -95 -134 -260 -125 -35 159 -193 -207 -95 -83 -126 -258 -156
3465 -156 -123 -1 -137 58 277 308 256 199 237 59 -48 152 18 -36 108 -60 82 -56 -179 27 171 -120
3487 -120 -315 -117 29 -315 -93 36 -42 186 -103 103 98 -29 223 194 189 107 87 1 -208 -14 2 84 -196 74
3511 74 -63 111 170 -12 40 34 -133 109 3 -156 -284 -339 -108 -61 -68 -54 220 -117 -63 -71 -9 187 35 -116 -70
3536 -70 155 274 203 267 266 10 98 -45 60 110 -267 124 76 -123 58 251 -303 -149 -384 -217 -165 -126 -167 -115
3560 -115 -49 -36 -38 9 -60 74 7 -83 80 -38 146 -100 389 -61 288 531 -63 -167 55 22 -92 -94 43 -341
3584 -341 -277 72 -421 -216 130 -91 -227 86 147 -25 13 -226 317 -248 22 -5 -61 250 133 12 63 -27
3606 -27 50 -179 16 -3 99 55 86 98 184 135 264 -170 -44 253 -187 107 -66 26 157 -97 162 -57 394
3629 394 113 324 187 173 161 -336 111 -26 -65 169 159 14 177 -48 77 166 34 99 -158 -26 86 -36
3651 -36 -209 -121 56 -204 -309 -87 59 0 133 67 28 213 -103 -119 -32 62 82 238 195 29 -96 311 -15
3674 -15 223 -130 257 -35 -80 214 -197 127 -110 -191 -51 -24 81 -367 168 -117 -226 -229 90 -41 44 86 -32
3697 -32 262 166 -113 95 222 48 122 258 77 17 162 33 99 -153 113 -49 22 -176 -104 -77 -22 115 78
3720 78 18 -16 -172 67 -36 -24 146 -178 -60 -36 168 198 36 -110 163 40 97 111 101 161 166 -78 -155 167
3744 167 -82 -185 -101 -263 -73 -122 -157 224 -138 -16 166 -53 144 -141 57 82 16 -48 -133 -72 61 141 86
3767 86 14 -64 39 124 2 -165 -47 -106 70 -152 -40 55 -115 0 -140 -212 -158 101 105 -224 1 23 53 297
3791 297 186 -51 372 180 -158 238 300 -40 -52 -49 161 351 -91 97 162 10 -188 -97 -68 -85 172 -348 -99
3814 -99 -193 157 -141 -44 3 -85 -77 -14 90 235 82 110 98 177 258 409 45 200 -72 159 -51 102 174 -71
3838 -71 -21 -153 -73 -12 -432 -295 -238 -40 -6 -181 -235 283 -74 190 159 -167 -14 204 96 154 -37 -63 44
3861 44 34 196 260 15 97 183 -73 3 -121 -73 37 -87 -6 -287 -253 -293 99 -238 35 -334 -2 83 -133 126
3885 126 73 5 104 -40 166 240 225 267 -54 -63 -143 -10 70 141 55 54 -169 22 -231 -52 -133 -238 -3 -203 -203 -252
3911 -252 -53 -59 47 168 134 -23 -257 -120 93 -204 -16 -22 161 194 202 37 55 -175 374 145 126 298 0
3934 0 172 -32 -63 10 158 96 167 -242 -272 -262 -158 2 141 -52 3 258 218 70 -171 260 166 9 -105 91
3958 91 92 240 -151 -21 57 -14 25 134 -223 85 152 61 139 -189 187 -120 -12 71 -134 -246 287 -57 18 206
3982 206 29 -85 -106 -66 277 113 -109 276 402 157 33 106 -10 -4 133 94 91 -173 9 -79 -91 -158 -33 -33
4006 -33 -209 -276 87 78 -204 -77 -92 199 -46 207 -29 163 -50 -29 120 208 58 -149 -18 78 8 33 -180
4029 -180 -97 -33 -140 8 -123 84 58 -70 125 -168 -32 142 82 -75 -119 -265 -238 50 10 -88 -57 83 232
4052 232 111 -80 -8 102 -159 76 32 -54 7 27 -318 35 -255 -146 -38 -63 -162 -28 -26 30 162 -8 -377
4075 -377 -30 4 132 -94 25 209 -150 206 -61 -171 99 82 -166 68 161 157 67 12 13 56 -117 -69 79 66
4099 66 -206 59 -182 51 -105 -189 -224 -4 81 15 6 382 46 193 299 188 116 299 163 134 -32 194 -46
4122 -46 -57 234 87 -186 -106 -203 -18 83 -43 -173 -81 -13 -149 51 61 -339 -166 -122 -31 141 -225 23 -14
4145 -14 -183 -86 55 167 96 -2 222 64 57 84 5 13 153 48 40 139 62 -125 73 -14 -76 -46 -189 -292 67 184
4171 184 -173 -52 271 -119 -33 42 152 30 -78 262 -54 3 62 236 90 24 170 -30 -100 33 -89 14
4193 14 23 -209 -23 -58 86 -93 -257 -2 1 129 -24 -114 -63 -285 -176 -285 27 -1 -9 33 133 -168 56 27
4217 27 233 142 235 -261 124 202 -337 -183 -239 28 38 24 -54 -108 -206 153 128 219 -146 -172 -4 5 -39 70 263
4242 263 141 4 161 34 117 -97 -81 -124 174 21 153 124 -95 162 -20 101 147 143 -233 -195 -178 -422 -275
4265 -275 -357 -128 -296 -184 -43 -160 138 20 64 -56 -36 -9 28 -50 132 51 -104 149 69 202 -198 27 -71
4288 -71 68 18 113 131 -12 -144 -198 20 -186 -213 173 -13 6 -157 -365 167 -68 54 176 -12 -40 33 80
4311 80 76 65 80 90 167 -126 -140 -209 109 171 11 33 -192 69 110 76 -66 83 -54 -124 -116 43 55 36 38 120 -170
4338 -170 -96 59 -212 25 153 -7 160 -82 -177 -57 213 -111 90 -21 12 -91 -85 -37 -90 -24 178 362 157
4361 157 158 135 163 -267 4 -22 -181 -70 -167 210 37 -93 -30 -71 -156 209 -282 -97 84 11 -4 68 -79 -37
4385 -37 17 -88 -178 -138 -290 -239 318 164 -83 -121 -180 69 -264 27 -110 -60 -42 0 94 6 202 -199 213 55
4409 55 130 -155 77 -22 -48 11 -236 -305 31 -63 87 48 -236 -195 78 89 253 -2 70 -67 -203 244 -64 109
4433 109 73 -57 87 1 -329 -17 -207 -172 1 173 -72 -57 155 -161 -88 -35 -32 191 -406 93 -63 207 106
4456 106 -236 -44 -65 130 -55 -139 -13 -41 79 232 141 -10 110 216 -58 69 -190 20 -162 17 -117
4477 -117 157 171 -75 200 254 -164 55 -91 205 -67 -93 -34 210 -277 96 -186 -31 -68 -32 254 -126 -55
4499 -55 -200 163 64 49 190 -35 109 -143 38 95 35 -9 224 185 66 131 46 19 -175 -174 -123 -257 104 109 -139
4524 -139 -55 -80 7 -150 122 -50 119 -52 -69 461 114 -10 215 212 31 -91 -84 -183 55 -230 -103 -94 97 -158
4548 -158 -2 -118 -59 -179 64 -142 153 58 -61 -170 116 344 49 -66 15 73 -97 -228 90 -139 -57 -38
4570 -38 -78 150 -103 283 6 94 322 145 66 -87 -24 -38 -214 -96 335 -76 -53 -153 -91 -21 9 150 64 -118
4594 -118 112 67 -59 121 -35 -186 113 59 33 279 124 50 -140 30 -144 -38 -73 209 94 211 47 -76
4616 -76 52 34 226 131 95 -268 -138 -59 -7 230 -6 -71 -64 15 -121 109 -327 76 108 136 66 66 216 -105 -29
4641 -29 -31 147 -166 -97 -177 197 -63 141 -3 -249 -25 -178 -34 29 71 -16 40 195 -71 -197 -170 -48 198
4664 198 -31 285 -16 13 435 33 156 -49 -74 -21 -133 -354 -62 -151 53 -214 26 105 -35 -78 -129 183
4686 183 18 -16 109 77 -159 154 26 134 107 -55 142 18 71 -51 55 273 -107 -32 77 -93 -120 -109
4708 -109 -112 -80 109 47 -147 40 -46 86 131 70 120 120 251 -48 248 -113 93 123 -203 -57 143 61 -26 -273
4732 -273 -47 138 -42 -37 1 48 5 -15 186 171 -286 247 -279 -105 15 -118 223 19 48 127 -108 182 -225
4755 -225 -213 75 133 -103 -72 -400 37 111 -6 89 -70 153 208 -267 154 -3 -3 70 181 41 -136 255 239
4778 239 -4 -190 69 101 -25 85 27 -20 -137 -82 -61 -59 5 -13 -205 -54 -111 -143 164 -7 -238 -3 -120 5
4802 5 -146 -75 -33 -112 -1 -99 -236 -239 6 -179 16 -294 2 -120 -298 98 26 -121 -69 339 181 170 250 84
4826 84 10 138 298 240 108 -81 173 -57 185 -456 -69 -16 80 158 -158 -90 24 211 -131 97 27 63 -146
4849 -146 -22 -327 -35 115 43 -12 -59 -163 67 -45 91 117 9 29 -38 -307 -44 167 -58 36 -9 25 180
4872 180 -204 83 -192 -116 43 -84 57 -34 42 16 -11 -283 41 -317 -296 -39 -183 -43 -43 -33 253 237 -118
4895 -118 -119 4 -105 144 281 -61 -248 1 91 -177 -14 -163 -38 44 66 51 -114 17 -8 184 168 -95 -57
4918 -57 75 -24 20 -124 230 191 -29 95 97 60 -107 25 -38 -30 28 -25 -77 146 231 -25 -94 60 -2 -61 -257 55
4944 55 140 -35 -109 21 207 106 -119 -69 129 24 50 -107 52 -104 -43 -192 165 76 -123 -202 -213 -93 -80
4967 -80 149 -38 63 198 137 -207 140 105 -135 -79 -48 -77 -251 -203 -156 25 83 -34 309 -45 -119 82 100 -42
4991 -42 -139 130 303 -302 -90 -4 245 199 -69 2 -237 105 -259 -188 -47 -49 -278 137 16 70 104 -5 227
5014 227 -35 -82 135 120 77 56 145 -52 191 -280 -176 -13 -144 -224 23 -146 -29 172 -78 -132 -120 -132 194
5037 194 87 -14 -90 107 174 117 -225 -92 10 -93 82 -24 -48 79 227 65 0 -44 -116 -67 -128 116 121 45
5061 45 -273 -142 -82 -33 -42 130 -97 -12 -281 -281 33 -92 225 -134 22 -91 -83 75 101 -62 163 267 -27 -114
5085 -114 87 124 100 86 -30 11 -169 -93 154 132 -155 -291 43 35 -146 99 -142 -44 -377 -164 -11 -157 -96
5108 -96 -85 19 -35 90 -97 -37 -39 -8 76 125 44 14 176 118 -35 268 77 -89 -105 280 50 -11 -17 -150 -145 -46
5134 -46 -281 -204 -106 130 -79 -294 -105 -12 -2 -121 230 -98 -76 132 85 216 230 124 -191 -15 51 92 222
5157 222 -1 -23 62 -93 120 -115 51 55 35 12 3 -314 21 -193 -121 13 -116 -43 27 -110 78 -2 102 -240
5181 -240 -103 28 -156 -117 -41 -3 118 8 136 25 32 95 -109 -246 -122 -247 161 -195 -30 315 -102 -209
5203 -209 -200 28 -99 282 187 0 13 102 -64 -146 -73 265 10 46 34 -10 259 123 107 174 81 130 27 -162 -262
5228 -262 27 -77 10 -94 47 -89 10 -72 -206 -247 227 -180 125 41 -89 -228 74 13 -270 62 -159 123
5250 123 -110 106 79 42 11 151 -11 -31 -115 -40 79 42 0 -86 -168 -12 71 105 67 -53 226 -227 -153 200 -52
5275 -52 -234 73 -181 73 148 -16 8 -55 36 114 -26 62 107 33 116 38 92 -45 57 57 29 84 1 -17 -53 -113 -121
5302 -121 16 63 -56 -186 -100 173 229 -52 -76 -95 64 199 121 -40 -170 273 86 27 129 -137 61 -85
5324 -85 -5 -120 186 -371 97 86 -135 152 -202 -147 -299 65 -159 154 -7 65 -8 168 65 -8 -33 -72 -117
5347 -117 -110 -105 -120 -92 74 2 8 229 -215 26 107 -141 -51 70 102 -322 82 -81 -33 115 -47 110 -154 90
5371 90 49 19 -50 -121 222 -64 89 -35 59 240 -59 -41 -6 108 97 23 -335 -304 186 110 139 24 39 138 -69
5396 -69 32 -233 -188 -124 -269 9 -136 -134 -202 5 -144 27 -136 85 252 170 -123 454 5 49 -222 89 194
5419 194 -263 -80 -91 108 -49 -131 -223 243 -184 -17 -116 -3 -88 -45 -162 199 -253 -87 110 -49 170 -69
5441 -69 -123 155 163 -65 -314 -157 194 124 61 -121 -23 62 -76 -38 -157 11 -133 46 -337 -41 119 -66 45
5464 45 113 46 76 31 88 -91 30 129 -51 234 203 85 -204 171 -73 5 -80 -132 70 70 -77 69 243 -41
5488 -41 255 -46 -32 23 87 -68 109 -139 39 179 -94 77 -180 211 110 29 131 -61 -25 158 -2 232
5510 232 16 -133 51 67 -16 7 187 135 182 66 -37 34 119 22 -107 -207 289 39 -175 -113 -111 -38 -171 -1
5534 -1 -3 74 -44 122 207 160 262 141 -157 148 35 3 -233 140 131 -79 18 121 -135 -117 29 -54 -53 -29 -216
5559 -216 -112 -145 -112 143 152 -1 -12 -24 -68 99 88 161 152 -93 199 170 224 -24 -131 -2 -157 86 49 -117 -25
5584 -25 174 124 165 89 -182 -102 40 -108 -119 103 -24 -80 144 2 -158 -93 77 171 28 -208 -2 2 -18 -11 -154
5609 -154 77 192 336 -92 27 -223 -282 -8 -109 68 -101 226 -82 -155 -103 -106 -161 188 -23 -165 186 -22
5631 -22 -69 45 -227 -107 -17 -57 150 200 -159 -19 -344 44 -102 123 -5 -87 -122 -285 125 5 45 -146 -46
5654 -46 -109 -92 -131 31 148 -42 -87 45 -38 87 -31 -69 -5 178 -160 -41 81 9 -104 94 77 125 66 -134
5678 -134 372 -163 92 255 -149 -219 76 147 -1 -89 88 -150 -53 -180 -95 188 -49 -67 -35 -102 117 -299 122
5701 122 100 -82 142 -19 -287 6 -23 -207 -116 -129 -260 -82 72 156 18 -198 126 110 -47 46 -91 -73 -167
5724 -167 -218 305 179 201 -90 39 -45 12 2 280 231 -81 -78 47 325 107 220 -260 -62 -154 -78 -182 75
5747 75 -31 -111 -157 -101 4 -104 86 -267 -39 -71 -289 58 -65 -80 9 -227 -80 -59 86 93 243 -32 80
5770 80 133 -147 -42 -102 53 89 167 99 -96 -166 -188 36 -157 -277 173 -47 5 -70 136 -64 -337 275 -182
5793 -182 -112 -158 -17 -240 -268 -79 154 212 85 53 109 174 20 -60 -68 84 -6 -121 -108 -145 10 -50 10 42 -67
5818 -67 -176 -41 157 35 82 -62 -241 86 -131 111 144 71 -156 176 -243 16 -60 166 166 185 -75 17 95
5841 95 -162 117 84 -159 -135 -105 -125 20 110 143 -37 -14 53 12 60 101 -268 203 250 50 53 468 122 108 85 21
5867 21 -43 216 158 -33 -10 -249 -43 -113 33 136 89 -265 -99 -164 38 -2 38 -22 -253 95 119 141 -121 -169
5891 -169 4 21 85 -52 153 -5 -95 -274 108 70 -73 78 31 65 60 -27 -68 101 -2 -77 93 207 -13 -43
5915 -43 109 74 99 -100 -163 52 167 -22 -9 -24 121 -90 8 -21 6 153 191 48 194 -52 -90 -127 -152 7
5939 7 -94 -62 182 -51 -14 -97 30 68 103 4 23 -258 -101 -46 215 182 -126 71 102 -110 132 9 -60 -91 103
5964 103 40 -19 5 -120 -15 -9 50 49 -100 -214 -134 -37 -37 -46 -173 6 55 -62 117 70 -54 -72 -218 -199 -22 -60
5990 -60 116 -145 281 51 41 155 -51 -54 238 196 72 186 282 186 52 -207 -207 -205 94 -259 103 -50 88 24
6014 24 13 -42 121 169 -155 13 201 22 97 83 -233 -7 34 -94 15 112 70 16 102 -78 -27 -40 -1 53 49 166
6040 166 -105 -147 220 140 56 86 -115 88 -220 247 215 -13 5 -99 161 -216 -93 15 -125 174 79 55 167
6063 167 100 8 103 -54 -82 28 -202 134 21 -202 -149 -120 -331 -29 0 77 140 73 68 121 151 -38 -160 -64 132
6088 132 -114 -4 17 -64 125 15 58 -68 26 -160 -41 -25 177 255 46 -105 8 -96 25 -149 210 171
6110 171 226 -65 124 -155 -24 1 44 139 -1 11 189 81 222 -343 -32 146 -197 77 -135 38 114 -115
6132 -115 -170 24 -125 -15 -133 26 113 151 -47 -186 -192 -13 114 -203 -143 76 141 160 -130 -138 114 -49 25 50
6156 50 37 238 -59 -127 -102 -129 34 -35 -93 64 -128 -11 61 -65 -165 -50 11 52 163 -36 47 -305 71 44
6180 44 94 -49 0 205 83 182 62 -55 -45 133 94 -188 -120 17 -126 -244 -267 -85 28 -71 133 -152 -73
6203 -73 72 -47 220 -237 19 -27 54 -178 -20 70 -296 137 72 -91 -60 24 125 260 0 25 -112 80 -52
6226 -52 -170 68 -37 -10 55 80 -68 -289 74 129 62 -224 92 270 -117 -19 -84 180 79 -260 93 -83 -10
6249 -10 46 171 -24 111 -3 -11 -175 -8 -240 -12 -82 96 -19 113 4 42 -229 58 -32 -81 -140 -143 -59 13
6273 13 -114 115 -57 69 247 51 14 201 -71 242 -145 -170 105 -144 89 -235 72 -7 -69 174 29 94
6295 94 77 -264 -261 360 228 60 -300 -198 30 88 100 -392 -67 67 -97 213 46 102 -88 -10 -217 -54 9
6318 9 26 204 -5 -161 -18 51 147 96 100 -63 203 -61 53 -66 46 97 -113 -315 -184 112 -80 -219 -138
6341 -138 112 231 -76 -256 -167 148 253 81 -29 -120 -9 160 40 -156 -268 -91 -126 67 4 13 -224 -45
6363 -45 231 -32 -160 -190 140 -80 -60 118 131 313 220 -79 -168 -46 -35 -56 174 -188 -50 155 -32 -98 81
6386 81 -153 -192 -188 -63 -125 -65 -138 -63 212 70 61 127 -145 162 199 109 -180 -78 -43 -148 51 94 -136 -108 -29 38
6412 38 162 65 32 -173 -91 101 -119 -126 174 62 -118 -4 -149 -80 -47 42 -54 -97 -47 -51 -198 -262 -86 15 -302
6437 -302 -91 -11 -254 -165 98 -112 -39 -88 187 175 -28 180 200 37 -13 89 -151 122 164 103 -49 -1 -85 -66
6461 -66 -235 130 -295 125 81 16 -33 -8 -141 -17 15 -35 252 -55 191 73 196 163 54 -68 112 43 -50
6484 -50 233 -45 -46 115 200 -157 -207 -24 194 199 -17 145 115 -48 123 43 -30 19 262 -74 93 49 -137 95
6508 95 85 -136 -37 27 47 -111 -37 9 -5 -6 -149 64 15 47 67 -18 11 92 -272 -62 -108 38 -51 -68 44 51 90
6535 90 79 -45 95 78 89 -35 -131 94 -9 17 -48 -15 -367 -204 112 213 151 133 -192 -341 -145 -223 232 -256
6559 -256 -138 33 -139 -323 -95 -105 -76 84 88 -94 -5 280 1 179 172 -135 92 173 55 65 -90 78 -42
6582 -42 23 -150 94 -75 -184 -158 -203 -149 -22 -172 -224 121 -86 115 26 59 167 -185 32 2 -53 92 -148
6605 -148 27 -22 8 154 264 64 -1 -11 21 -74 -211 -11 -59 104 59 5 248 -140 -110 -34 -116 -93 -122 -154 -217
6630 -217 -101 -62 131 -24 -120 -72 -107 186 -66 49 248 -18 -80 -73 -34 47 -2 -87 -34 -63 62 -161 70 107 23
6655 23 104 -96 -173 -7 85 -170 21 87 -68 -37 -97 -279 -69 -71 49 39 -170 6 78 205 89 -168 202 86
6679 86 78 -126 -162 -126 -549 17 -267 -221 -262 -187 27 -5 69 -112 240 26 -134 -13 219 -125 -61 -102 -52 -34 15
6704 15 -20 -69 187 -2 -34 -58 62 254 196 -70 208 -113 -10 -95 -162 100 -302 -65 -93 -3 -68 -42 -29 303
6728 303 155 291 -55 275 95 -22 -94 32 -150 -162 189 -66 -161 84 68 64 95 20 19 12 -153 17 -78 -71 -216
6753 -216 4 112 -14 -163 99 163 213 8 -89 -47 27 -224 -14 21 -142 296 70 5 -115 134 67 -189 55
6776 55 -43 -54 -110 -137 -269 133 -53 -269 -248 -13 -217 -149 10 -174 -105 -14 -196 257 -73 -182 -261 -8 -62 -86
6800 -86 25 83 -32 61 98 -56 -41 77 162 57 -42 65 -217 -74 -153 84 85 31 -189 -144 -130 -217 178 71 -76
6825 -76 -180 77 -50 -73 87 105 -18 -30 22 -87 -72 105 -5 113 -25 198 -118 111 60 117 -43 -63 -65 170
6849 170 30 21 25 -78 93 -62 -88 -135 -109 -129 267 11 11 90 167 -294 -76 117 -70 -165 -121 -14 -196 133 34
6874 34 -32 -56 -91 130 -192 -148 52 151 -218 49 -259 135 -25 -93 -43 -156 157 -131 124 51 31 78 362 -116
6898 -116 -220 130 -326 129 250 -71 88 142 5 -150 -128 62 233 -1 -32 -60 -68 -119 53 93 -4 -37 -82 94
6922 94 -167 -33 134 50 -31 69 75 155 101 15 37 287 -321 97 36 -29 31 -152 161 169 18 136 77 -91 -58
6947 -58 73 -146 -54 189 286 94 66 91 14 -289 149 61 218 -166 -87 16 82 61 59 -8 2 -217 -211 172 36
6972 36 3 30 -151 123 -15 226 72 -139 -7 137 -56 -42 104 -40 203 -30 23 24 88 -83 39 301 -57
6995 -57 81 -87 137 -150 145 171 237 17 -51 -117 32 18 -66 -252 -274 103 -187 43 -225 137 -315 -20 15
7018 15 -54 -48 -70 65 163 -77 209 62 -160 104 -53 -64 -90 8 335 -156 -31 285 126 28 32 123 3 13 -90
7043 -90 -55 -106 -167 77 -9 -114 -29 -188 11 -29 -19 -294 25 -335 89 -81 -24 28 -89 -202 -79 -34 40 23
7067 23 -154 125 17 127 -23 -280 -47 -87 -47 51 -123 -161 -79 -46 -19 -4 58 -208 -1 27 -124 108 235 193
7091 193 -149 159 -220 110 268 287 -107 92 -95 -113 61 26 -301 -116 -36 -23 178 86 -18 144 -140 76
7113 76 99 -123 -88 112 346 37 -2 -59 221 -145 322 -140 -17 107 173 -19 -133 31 247 106 -45 107
7135 107 -65 -96 -93 2 32 -132 -55 -103 209 -134 17 77 -8 -241 11 79 160 -195 -34 -145 -114 -83 108 -11
7159 -11 -1 -50 119 281 59 -64 -57 130 -133 52 -72 -62 -147 -28 -19 50 -4 -185 54 233 206 -196 -47 62
7183 62 -304 -278 -61 -57 -133 318 78 127 -16 -97 -183 144 343 -215 -80 330 147 183 227 -1 318 142 -94
7206 -94 -33 -190 39 -62 118 -17 -17 188 -86 -172 -115 -101 -13 -151 -112 -40 323 37 105 -207 -183 -275 146 -50
7230 -50 110 141 -154 -102 173 103 8 243 -20 -71 -78 -136 68 -109 -173 195 27 30 97 -1 -85 107 125 -173 97
7255 97 63 -183 36 88 -29 64 273 -30 82 -374 -20 20 -322 -353 -56 -16 166 -68 95 -226 -61 88
7277 88 -6 -174 -22 -146 -72 12 275 163 90 -138 20 -96 115 31 -124 227 16 -19 -105 -98 47 23 101 -246
7301 -246 0 -11 78 -37 -256 -61 -149 -66 136 146 -29 -180 -88 121 191 288 129 -30 213 -14 154 40 -68
7324 -68 -23 -42 69 -25 -65 86 -23 96 -305 78 167 -48 11 45 258 -123 28 -31 83 -267 36 52 205
7347 205 -171 -37 12 423 142 -150 -54 -69 7 80 180 116 207 -34 58 131 68 -66 277 -501 -70 -121 -83 76
7371 76 1 116 -282 286 52 69 -72 39 86 115 37 -43 -149 -104 66 87 156 -62 77 9 -97 56 -129 19
7395 19 172 146 -261 3 24 -13 -100 -133 80 -90 114 164 -6 -46 -37 -157 172 98 38 -33 63 147 -69 153 -77
7420 -77 -101 180 -46 -77 -63 179 -188 -208 31 -58 37 -161 -8 -176 -143 -122 -60 -3 75 25 38 57 -8 84 -44 52
7446 52 174 -171 195 21 -187 -93 6 -127 -173 234 -126 115 -283 -133 57 73 -19 218 -229 15 103 -16
7468 -16 151 -50 24 -130 -115 -91 -237 -79 44 41 34 62 191 212 133 -69 -306 25 -169 45 14 4 1 271 -224
7493 -224 -79 101 69 63 -26 -163 -167 4 -43 45 161 46 29 -45 -64 246 -43 78 46 124 3 -27 111 -14 89
7518 89 -109 -216 67 101 57 -123 -124 -134 123 -27 192 -24 83 122 -183 -206 71 36 310 214 -61 -85 -154 -7
7542 -7 -44 221 265 45 -104 -179 86 136 -196 -55 30 -111 -7 -52 -61 101 1 -97 -158 -156 149 146 35 67 -77 13
7568 13 -88 124 16 -159 121 -13 -37 21 -27 259 -162 86 14 88 140 83 55 -178 44 71 66 -68 10 -94
7592 -94 -41 75 139 -55 -137 15 -124 -148 -76 -141 123 35 35 -26 -77 -17 24 -155 9 -243 91 -89 193 69 24
7617 24 264 93 -175 -76 39 168 -123 -137 114 -30 5 -205 137 256 -150 63 -91 -184 140 -56 10 -163
7639 -163 -79 195 422 -108 -58 53 -123 33 -108 59 336 -103 -163 154 -65 -40 102 13 -24 -111 125 54 87
7662 87 70 34 43 -22 94 -45 33 290 -36 211 54 -68 -285 -135 -201 2 122 -73 -76 -115 -91 -64 -45 -9 -12 -331
7688 -331 -78 171 -207 -90 -110 -33 45 -75 -122 -135 145 -144 68 -86 61 50 -150 0 -91 -308 -43 43 242
7711 242 9 -192 47 -15 117 -34 52 -61 -142 -162 -90 -2 -159 164 -105 -67 51 170 217 -129 -142 -29 12
7734 12 15 3 -11 -13 79 75 91 -218 -332 -85 -151 -181 -197 96 36 -124 -72 153 -33 -26 170 -65 -58 56 143 -208 -125
7761 -125 98 110 -203 -21 135 88 -204 -37 109 83 41 136 -124 243 54 26 -81 -173 97 -84 -276 -173
7783 -173 -66 -42 54 -200 153 -218 28 -291 -96 236 -239 163 222 257 -142 -108 261 27 280 -20 -39 -17
7805 -17 -62 -221 -91 152 192 -12 124 -21 3 45 -116 -1 -167 72 -15 204 -91 73 -11 -155 47 12 -36
7828 -36 105 -6 182 113 -81 -176 94 87 200 -81 116 146 -4 -148 46 -286 7 -105 310 -96 -103 -138 -123
7851 -123 35 -202 75 -48 -31 48 31 -44 12 67 -5 -4 -82 134 -240 121 -167 -115 114 111 24 -44 -94 -35 98 204
7877 204 -16 -81 -384 20 -68 -3 105 -25 137 112 -44 -57 27 19 165 92 449 146 220 -17 82 61 34 -57 -85
7902 -85 -67 93 21 -52 -226 -223 -60 -5 78 67 -341 35 -20 -162 -487 -131 -22 -159 -128 -96 175 -28 -123 -135 -194
7927 -194 7 240 107 114 -67 250 39 50 175 227 -16 -204 -124 119 -264 -3 104 -187 0 186 -90 -199
7949 -199 -283 3 130 -68 261 -49 119 -127 4 24 -96 -107 -70 133 -217 -79 93 -262 -7 87 37 194
7971 194 -61 223 14 -170 12 139 159 62 126 -34 -342 -272 68 -46 -177 51 -41 -107 65 -26 157 164 177
7994 177 -85 107 175 83 -98 110 -110 -7 -2 0 -22 201 -28 -321 54 18 185 12 -14 -94 -9 109 54 -172
8018 -172 -53 -109 66 -28 -234 -149 112 -105 -74 91 -88 22 42 -8 369 -165 175 -131 110 -28 -183 -137
8040 -137 145 -217 -390 34 -150 86 59 13 -301 30 116 180 42 12 20 86 -97 -108 314 -189 152 297 -100
8063 -100 -13 -64 -134 26 167 -97 -109 -61 64 -346 72 50 -95 -33 114 99 -71 -187 29 88 79 17 -122 54
8087 54 -208 43 -148 1 223 -75 243 180 5 63 -67 3 163 -137 5 9 89 -7 -184 37 144 -5 -196
8110 -196 131 23 -42 121 70 17 -23 51 -110 -224 -206 -201 51 -127 -56 117 66 53 56 -58 139 109 -77 38 -6
8135 -6 141 -119 -78 -152 -8 -51 180 128 3 4 76 9 -73 -19 30 132 -79 110 -125 -5 -118 150 13 156
8159 156 -36 -271 238 -192 66 195 -98 -268 -192 32 110 92 149 -1 -58 76 75 132 -77 120 115 106 72 171 97
8184 97 -135 -203 -18 0 270 93 -71
8191g1
##END NTUPLES=NMR FID
##END=
