##TITLE=1H_Pr 371d
 CDCl3
 8 sc, 
 21.10.2022
##JCAMPDX= 6.0         $$ Bruker NMR JCAMP-DX V2.0
##DATA TYPE= NMR FID
##DATA CLASS= NTUPLES
##ORIGIN= UXNMR, Bruker Analytische Messtechnik GmbH
##OWNER= root
$$ XWIN-NMR		Version 3.5
$$ Fri Oct 21 14:30:39 2022 Russian Standard Time (UT+4h)  she@DPX200
##.OBSERVE FREQUENCY= 200.1313499994
##.OBSERVE NUCLEUS= ^1H
##.DELAY= (6, 6)
##.ACQUISITION MODE= SIMULTANEOUS
##.ACQUISITION SCHEME= undefined
##.AVERAGES= 8
##.DIGITISER RES= 18
##SPECTROMETER/DATA SYSTEM= spect
##.PULSE SEQUENCE= zg30
##.SOLVENT NAME= CDCl3
##.SHIFT REFERENCE= (INTERNAL, CDCl3, 0, 15.7039)
##AUDIT TRAIL= $$ (NUMBER, WHEN, WHO, WHERE, WHAT)
$$ ##TITLE= Audit trail, XWIN-NMR		Version 3.5
$$ ##JCAMPDX= 5.01
$$ ##ORIGIN= Bruker BioSpin GmbH
$$ ##OWNER= she
$$ F:/spectra/data/she/nmr/H-F/1/audita.txt
$$ ##AUDIT TRAIL=  $$ (NUMBER, WHEN, WHO, WHERE, WHAT)
(   1,<2022-10-21 14:29:21.48 +0400>,<she>,<DPX200>,
      <created by zg, POWCHK disabled, PULCHK disabled
       configuration hash MD5:
       00 E9 B6 7A A2 85 ED C7 34 08 36 98 17 FE 4E 26
       data hash MD5: 16K
       A0 8E 07 90 8F 50 DA 71 76 FD 3F 3D E1 84 9A 84>)
$$ ##END=
$$ 
$$ hash MD5
$$ 7D AF C6 91 90 D0 1F 00 6E 39 A4 02 AC E3 68 00
##$RELAX= 
##$RELAX= 
##$RELAX= 
##$RELAX= 
##$RELAX= 
##$RELAX= 
$$ Bruker specific parameters
$$ --------------------------
##$DU= <F:/spectra>
##$EXPNO= 1
##$NAME= <H-F>
##$PROCNO= 1
##$TYPE= <nmr>
##$USER= <she>
##$AMP= (0..31)
100 100 100 100 100 100 100 100 100 100 100 100 100 100 100 100 100 100 
100 100 100 100 100 100 100 100 100 100 100 100 100 100 
##$AQSEQ= 0
##$AQ_mod= 1
##$AUNM= <au_zg>
##$AUTOPOS= <>
##$BF1= 200.13
##$BF2= 200.13
##$BF3= 200.13
##$BF4= 200.13
##$BF5= 200.13
##$BF6= 200.13
##$BF7= 200.13
##$BF8= 200.13
##$BYTORDA= 1
##$CFDGTYP= 0
##$CFRGTYP= 5
##$CHEMSTR= <none>
##$CNST= (0..31)
1 1 145 1 1 1 1 1 1 1 1 1 1 1 1 1 1 1 1 1 1 1 1 1 1 1 1 1 1 1 1 1 
##$CPDPRG= <>
##$CPDPRG1= <>
##$CPDPRG2= <>
##$CPDPRG3= <>
##$CPDPRG4= <mlev>
##$CPDPRG5= <mlev>
##$CPDPRG6= <mlev>
##$CPDPRG7= <mlev>
##$CPDPRG8= <mlev>
##$CPDPRGB= <>
##$CPDPRGT= <>
##$D= (0..31)
0 1.2 0 0 0 0 0 0 0 0.06 0 0.03 0 0 0 0 0.0002 0 0 0 0 0 0 0 0 0 0 0 0 
0 0 0 
##$DATE= 1666348160
##$DBL= (0..7)
120 120 120 120 120 120 120 120 
##$DBP= (0..7)
150 150 150 150 150 150 150 150 
##$DBP07= 0
##$DBPNAM0= <>
##$DBPNAM1= <>
##$DBPNAM2= <>
##$DBPNAM3= <>
##$DBPNAM4= <>
##$DBPNAM5= <>
##$DBPNAM6= <>
##$DBPNAM7= <>
##$DBPOAL= (0..7)
0.5 0.5 0.5 0.5 0.5 0.5 0.5 0.5 
##$DBPOFFS= (0..7)
0 0 0 0 0 0 0 0 
##$DE= 6
##$DECBNUC= <off>
##$DECIM= 32
##$DECNUC= <off>
##$DECSTAT= 4
##$DIGMOD= 1
##$DIGTYP= 9
##$DL= (0..7)
0 120 120 120 120 120 120 120 
##$DP= (0..7)
150 150 150 150 150 150 150 150 
##$DP07= 0
##$DPNAME0= <>
##$DPNAME1= <>
##$DPNAME2= <>
##$DPNAME3= <>
##$DPNAME4= <>
##$DPNAME5= <>
##$DPNAME6= <>
##$DPNAME7= <>
##$DPOAL= (0..7)
0.5 0.5 0.5 0.5 0.5 0.5 0.5 0.5 
##$DPOFFS= (0..7)
0 0 0 0 0 0 0 0 
##$DQDMODE= 0
##$DR= 18
##$DS= 0
##$DSLIST= <SSSSSSSSSSSSSSS>
$$ [...]
##$SUBNAM2= <"">
##$SUBNAM3= <"">
##$SUBNAM4= <"">
##$SUBNAM5= <"">
##$SUBNAM6= <"">
##$SUBNAM7= <"">
##$SUBNAM8= <"">
##$SUBNAM9= <"">
##$SW= 18.0517283424941
##$SWIBOX= (0..15)
0 0 2 0 0 0 0 0 0 0 0 0 0 0 0 0 
##$SW_h= 3612.71676300578
##$TD= 16384
##$TD0= 1
##$TE= 0
##$TE2= 300
##$TE3= 300
##$TEG= 300
##$TL= (0..7)
0 120 120 120 120 120 120 120 
##$TP= (0..7)
150 150 150 150 150 150 150 150 
##$TP07= 0
##$TPNAME0= <>
##$TPNAME1= <>
##$TPNAME2= <>
##$TPNAME3= <>
##$TPNAME4= <>
##$TPNAME5= <>
##$TPNAME6= <>
##$TPNAME7= <>
##$TPOAL= (0..7)
0.5 0.5 0.5 0.5 0.5 0.5 0.5 0.5 
##$TPOFFS= (0..7)
0 0 0 0 0 0 0 0 
##$TUNHIN= 0
##$TUNHOUT= 0
##$TUNXOUT= 0
##$USERA1= <user>
##$USERA2= <user>
##$USERA3= <user>
##$USERA4= <user>
##$USERA5= <user>
##$V9= 5
##$VALIST= <valist>
##$VCLIST= <CCCCCCCCCCCCCCC>
##$VD= 0
##$VDLIST= <DDDDDDDDDDDDDDD>
##$VPLIST= <PPPPPPPPPPPPPPP>
##$VTLIST= <TTTTTTTTTTTTTTT>
##$WBST= 1024
##$WBSW= 4
##$XGAIN= (0..3)
0 0 0 0 
##$XL= 0
##$YL= 0
##$YMAX_a= 406793
##$YMIN_a= -477400
##$ZGOPTNS= <>
##$ZL1= 120
##$ZL2= 120
##$ZL3= 120
##$ZL4= 120
##$ABSF1= 10
##$ABSF2= 0
##$ABSG= 5
##$ABSL= 3
##$ALPHA= 0
##$AQORDER= 0
##$ASSFAC= 0
##$ASSFACI= 0
##$ASSFACX= 0
##$ASSWID= 0
##$AUNMP= <proc_1d>
##$AZFE= 0.1
##$AZFW= 0.1
##$BCFW= 1
##$BC_mod= 2
##$BYTORDP= 1
##$COROFFS= 0
##$CY= 11.3945322036743
##$DATMOD= 1
##$DC= 2
##$DFILT= <>
##$DTYPP= 0
##$F1P= 2.36226072786647
##$F2P= -0.459571619588291
##$FCOR= 0.5
##$FTSIZE= 0
##$FT_mod= 4
##$GAMMA= 1
##$GB= 0.15
##$INTBC= 1
##$INTSCL= 1
##$ISEN= 128
##$LB= 0.24
##$LEV0= 0
##$LPBIN= 0
##$MAXI= 10000
##$MC2= 0
##$MEAN= 0
##$ME_mod= 0
##$MI= 1.114404
##$NCOEF= 0
##$NC_proc= 0
##$NLEV= 6
##$NOISF1= 3.799351
##$NOISF2= 2.8
##$NSP= 1
##$NTH_PI= 0
##$NZP= 0
##$OFFSET= 15.70392
##$PC= 1
##$PHC0= -18034.09
##$PHC1= 12.0007
##$PH_mod= 1
##$PKNL= yes
##$PPARMOD= 0
##$PSCAL= 0
##$PSIGN= 0
##$REVERSE= no
##$SF= 200.130013532006
##$SI= 16384
##$SIGF1= 3
##$SIGF2= 2
##$SINO= 400
##$SIOLD= 16384
##$SREGLST= <1H.CDCl3>
##$SSB= 0
##$STSI= 0
##$STSR= 0
##$SW_p= 3612.71676300578
##$SYMM= 0
##$S_DEV= 0
##$TDeff= 0
##$TDoff= 0
##$TI= <>
##$TILT= no
##$TM1= 0
##$TM2= 0
##$TOPLEV= 0
##$USERP1= <user>
##$USERP2= <user>
##$USERP3= <user>
##$USERP4= <user>
##$USERP5= <user>
##$WDW= 1
##$XDIM= 8192
##$YMAX_p= 0
##$YMIN_p= 0
$$ End of Bruker specific parameters
$$ ---------------------------------
##NTUPLES= NMR FID
##VAR_NAME=  TIME,          FID/REAL,        FID/IMAG
##SYMBOL=    X,             R,               I
##VAR_TYPE=  INDEPENDENT,   DEPENDENT,       DEPENDENT
##VAR_FORM=  AFFN,          ASDF,            ASDF
##VAR_DIM=   8192,          8192,            8192
##UNITS=     SECONDS,       ARBITRARY UNITS, ARBITRARY UNITS
##FACTOR=    0.0002768,     1,               1
##FIRST=     0,             0,               0
##LAST=      2.2672688,     0,               0
##MIN=       0,             -477400,         0
##MAX=       2.2672688,     406793,          0
$$ Real data points
##PAGE= N=1
##DATA TABLE= (X++(R..R)), XYDATA
0@%%%%%%%%%%qJ6j6J6k4L2m0N6o4P2q8J12j36J58j88K20k54K94l40L90m46N09
32B71n79O57p43Q39r42J057j184J320j472J639j821K019k234K470k727L008l317
49a739L654m024M434m887N388n948O578p290Q102r040J0138j1441J3016j4971
63h030J7471k0795K5458l2520M4611p0767K27991k57701l98078N32826K90883
74C51349k98760k94095J76197J38783K544k1317p5748j60208J33875K79750r9475
85A32895l79556N1869L91147K5592l55042p2979K54701J03794j39325q5210R260
96f2854M7392Q8282J9123j59023o9895J83506J08025j74662j06976J41972P4250
107H9140r8189j1778N6138o7077l2771J40818K0303j96853k5031K21829K7684
$$ y = [0, 0, 0, 0, 0, 0, 0, 0, 0, 0, 0, -8, 8, -8, 8, -16, 16, -24, 32, -32, 40, -48, 64, -72, 86, -102, 118, -136, 158, -182, 208, -238, 271, -308, 349, -394, 445, -497, 560, -624, 696, -776, 863, -958, 1061, -1173, 1297, -1430, 1578, -1739, 1915, -2109, 2325, -2562, 2826, -3122, 3456, -3834, 4268, -4772, 5366, -6075, 6941, -8030, 9441, -11354, 14104, -18416, 26195, -44572, 183419, -74282, -472360, 60466, 351349, 52589, -241506, -65309, 73474, 76018, 54701, -21047, -181255, -47380, 232370, 132895, -246661, -194792, 196355, 221947, -133095, -206074, 48627, 152421, 13096, -72114, -62854, -15462, 72820, 91943, -67080, -136975, 46531, 154556, -20106, -127082, 14890, 89140, -9049, -20827, 35311, -31766, -64537, 76281, 96584, -100269, -125300, 96529, 124213]
118A24213k16528k3741J85456L308j35824L9399Q2611r5220l6649J59828Q967
129I5820k12895K564K46344Q74k50836r882K22828J6723j70819j2510J02202n355
141B5058l2147L4988k7608o9840O8461J00708q8391j22177Q6315J25060p3057
152B7370j10780N2136P9333l3445l6712K0139p054j1116M7680Q253p5187l505
164d2888R1204k074r1446J4716Q2764l2444o7876N1772N0531p1851l7630Q4032
176B8810K4570q9454j4324Q2865J951o6027J4573M2376l5415j7843O1715l861
188B9936q7822J7576J09915k1119j22033J7213J21058o447j03130l825P2152J0164
200C3638k9558r272j3526q19N2285J8681q0102l9825R0803N7736q8175p0328O9226
$$ y = [124213, -92315, -116056, 69400, 72708, -63116, -23717, 58894, -36326, -72975, 86853, 95820, -117075, -114511, 131833, 132707, -118129, -128011, 94817, 111540, -59279, -71789, 30413, 25058, -7089, 27899, 291, -69549, -1088, 99620, 11229, -110948, -24633, 100427, 27370, -83410, -31274, 48059, 14614, -22098, -1959, -9013, -20129, 27551, 35804, -39383, -42888, 48316, 46242, -45204, -30488, 52276, 19832, -48044, 3728, 54259, -17592, -55222, 28810, 53380, -36074, -50398, 32467, 34418, -31609, -17036, 25340, -10075, -27918, 33797, 29936, -57886, -40310, 69605, 48486, -73547, -56334, 64724, 58277, -44853, -48678, 23474, 33638, 4080, -5192, -18718, -19537, 32748, 51429, -28673, -68498, 22305, 80041, -8134, -78462, -9236]
213i236O8727m4422n6136J7155L1418P489Q65k3276l2628L1040O1347k8650p8071
226e4378K1335Q3941j1413p5678L690N8399r9l4922J355R708q889J2071J7452
239B2572k8425k7272L7576L3493m0822l5408L8942L0890l4823k1974K8924Q353
251A2026k4672N159K1720j8012j7571K7983J5141l1306j0532L2548N801k7898
263i613J382K1932q974j4698J6586P845k4186l556K9327j091l3205K775L1979
276A6503n111k9202N873K3025p614j3530R504M499j1344N840J3726j4358j5398
289a7587K1661J6448k5241j6357K7203J5359k4658j2222K0553Q165j4003l323
301d002P246l556j110R281l889j6586P018K0790r108k4994Q778K4984q523k2330
$$ y = [-9236, 59491, 15069, -41067, -23912, 7506, 14995, 15860, -7416, -40044, -9004, 52343, 23693, -54378, -33043, 50898, 39485, -36193, -32503, 25896, 25797, -9125, -7770, 1938, -6951, 5120, 22572, -5853, -33125, 4451, 37944, -2878, -38286, 656, 31546, -3277, -25251, 3673, 12026, -12646, -7487, 14233, -3779, -21350, 6633, 21774, -9532, -20064, 12484, 18285, -9613, -8231, 13701, 4727, -9971, 6615, 14460, -9726, -13282, 16045, 14954, -18251, -15476, 16503, 11392, -17810, -11937, 11088, 3474, -10056, -552, 3947, -7397, -1557, 12169, -2189, -17587, 4074, 20522, -4719, -21076, 6127, 21486, -3172, -15394, 5159, 13324, -679, -4002, 3244, -312, -1422, 7859, 3970, -12616, -5598, 15192, 6084, -18910, -10132, 14852, 6329, -16001]
315a6001O717J7347m795r440M827K011k869O340L501j2024l930J6401N110j8497
329e302n723J8029N685j6357m925J2837L065j0023r70N406k420j778M642j482
343F84p985M713R559o786j0584Q128J0379q528q777Q021P096o153l700N187J240
358B494k254K445J406n165n00P459n8r084j278Q762J305q227j987N172J206l381
374a685L22q1l085K317O317l383q970L615J0832j152j0042o83Q144L370l448n293
390b905q94M735O442k631r427j434J0507O419q475j0876L201J2654K032j1403
404b055r300O582J2841O45j5185q751J3354J5125q047j8611J586J7649N874j1819
418a12j0089M391J1983N674q601j3122J851J8107O534j8451j5599J3432K2179
$$ y = [-16001, -9284, 8063, 3268, -6172, -1345, 666, -2203, 4137, 7638, -4386, -8316, 8085, 13195, -5302, -11025, 7004, 12689, -3668, -8593, 4244, 7309, -2714, -3684, 1722, -698, -2476, 2166, 684, -7301, -2588, 6971, 185, -10399, -2271, 8108, -420, -9197, -1176, 5920, -233, -3933, 1254, 2494, 240, 2685, 4091, -1074, -1574, 5885, 5827, -3257, -4535, 4227, 5532, -2695, -4682, 490, 1696, -1685, -1363, -1444, -4529, -2212, 4105, 722, -8248, -4633, 6199, 5047, -4995, -5678, 2466, 5836, 2388, -2905, -3799, 936, 7378, 4747, -4680, -6114, 4393, 10812, 2337, -8539, -5338, 7316, 9348, -2055, -11355, -4773, 8068, 8713, -6472, -15223, -1869, 13256, 5209, -13402, -11816, 5833, 11707, -112, -10201, -5810, 6173, 11847, 3246, -9876, -8025, 10082, 16616, -1835, -17434, -4002, 18177]
431A8177o924k4597j863K2061Q732j5989j2543N931J1705L431o744j1046j158
444a0827J3302J1445j1575j9022N081K4105M878k3579j4331J9255K1440j0198
456I974k3418J440K0636N644j2232r621K532P542O640j842j3363q876J3642J8538
470A7236r243k7708J318L1816Q044k9944j6602K3824K0398j4139j7999N196J1915
483D112J147l64k159j1206j137K1154Q862k6890j8557K6383K8134k1150l4195
496b5866J2368L4264k656l0055n213K0039P969r055o485k156k97R257J0302j0609
510A807k0578O755K9803J401l3319j1238L2227K1595k5539k7177J5949K8711o296
523A4101k3694m78J4867K246n227Q76m651r487R846J9864j1113l0563O927L7709
$$ y = [18177, 11253, -13344, -15207, 6854, 15586, -403, -12946, -7015, 4690, 8121, 1377, -9669, -10827, 2475, 13920, 2345, -16677, -11596, 12509, 17387, -6192, -20523, -1268, 20172, 9974, -13444, -12004, 8632, 14276, 2044, -7577, -5045, 2497, 9137, 7295, -6068, -14944, -1302, 17236, 7993, -19715, -18397, 13419, 21463, -8481, -25083, -1259, 19139, 5000, -12999, -7803, 4112, 5259, 4895, 2736, -8470, -9607, 11547, 20409, -6481, -25038, 1345, 29479, 8329, -25866, -13498, 20766, 18110, -11945, -17158, 2881, 10850, 1795, -4690, -6846, -7143, 2114, 12416, 1807, -18771, -12016, 17787, 19188, -14131, -25369, 6858, 28453, 2914, -24263, -8314, 20397, 14101, -9593, -10071, 4796, 7042, 1815, 2691, -1960, -11447, -1601, 18263, 7150, -23413, -16486, 21223]
537B1223N3l9961p569L6394J3400k8871j4773J9252J1186r351k330L874q029k705
551h207J9608O824k7648j4179L1318K2767k9397k9695K2116L2588j2307l1367
563a7579K000K3854N281j4463r084L297O605O203K14j2199r288J2540K0219p753
577I847k8007k36L1667J1171l0657j9834K5020K7089j6707k7945P329K4555R6
590A3388j7583l412P242K181K259K409j0444j0105J4084J8526j4847k5594J1720
603a0176K8206o231k8150J211K4464K841j8010l704J1880K236m773J632J729o721
617c566o7J0684J163j2979l468J3458M963j0986p394P417P528l952p183L52M225
632A95J087k018p12L28j249Q08M102o61o681o29R285L259r971n472R280Q109p024
$$ y = [21223, 21276, -18685, -26254, 10140, 23540, -5331, -20104, -852, 10334, 983, -1347, 2527, -5502, -8207, 11401, 18225, -9423, -23602, 7716, 30483, 1086, -28609, -6493, 26095, 13788, -17579, -15579, 8275, 13556, -907, -9991, -6694, -89, 6114, 6328, -5871, -15159, -2619, 17600, 9847, -18160, -18396, 13271, 24442, -6215, -26049, -1029, 26060, 9353, -18592, -11263, 13292, 13388, -4195, -7607, -365, 1816, 4075, 6484, -3960, -14065, 19, 18545, 3698, -21896, -10176, 18030, 11799, -16351, -15140, 9324, 12165, -5845, -9549, 2331, 4567, -206, 1426, 3155, -3566, -3633, 7051, 8214, -4765, -8233, 5225, 10188, -798, -8192, -775, 6753, 2801, -4382, -4030, 195, 1282, -736, -1448, -1120, -2369, -1561, 2541, 1880, -4801, -5430, 3855, 7114, -2857, -8329, 951, 9060, 2036]
649B036q871M939Q930k670p209J007L896o84n38J126l134l343N283M942o945o560
665g795O696P228n849p763M282O668k017m684J148L066J48j339O66M04n12j27
681B20J460l65j537L66J533k09p47j30m89n01J058N19k155p65J070J228p28j511
699a683p77J500K202o02l239p28L829K422l347l145K854M596j039m660j23M256
715B316J896k906l074Q28L314J175l254l566J996M655q46n571r24M850K129l784
731g66l502J808M079r0l406j589L022L192j457l268L7L298J507k449k271J400
747d55L415J3l426q37K921J306k098j973M47J408L94j582j694J297J141m69j469
764a661l18J640O03q79r00N77J302P5r47j45J588P6m12l25M67L50o7k48l81J96
$$ y = [2036, -6835, -1896, 7034, 4364, -2845, -1838, 2058, 1374, 836, 1962, -1172, -4515, 768, 5710, -1235, -7795, -1099, 6129, 280, -7483, -3201, 3467, 1450, -3234, -2086, 980, 1128, -211, 455, 859, 347, 220, 1680, 1315, -222, 144, 1677, 1468, 721, 591, 102, -399, 659, 1178, -977, -1742, -672, 556, -172, -1683, -2460, -960, 1242, 640, -2599, -3327, 502, 2924, -423, -3568, -714, 3882, 2843, -1817, -1940, 2316, 4212, 1306, -1768, -940, 2374, 3549, 295, -3271, -1275, 3380, 2534, -3037, -3961, 889, 3018, -766, -4268, -2460, 1619, 1529, -1877, -3466, -444, 2748, 1291, -1977, -1940, 1358, 2865, 416, -1855, -455, 2960, 2973, -453, -1290, 1631, 2937, 839, -1134, -687, 721, 1115, -467, -2161, -864, 277, -192, -1661, -1979, -339, 264, -615, -1515, -938, 364, 439, -508, -653, 935, 1011, 599, 274, 741, 1091, 1024, 776, 395, 591]
784E91N06r18n01P30p2l39l42L71l63o5n92k77M82K58j49k22K07M86J71l77P9
805c36L49O47k77n06N77O82n55q9Q24j30o90j90O45k83q47o9J60k01K7l28k06
826g96m00O97L89j256l58J473P87j062j010P81J568j96j088J33J241L03N1q93
844C64q98J190J742j437k627J188K703m51k964J86J469M17j437m53j91L56J011
861A68j98j761o04K666J504k512j473K306J750j307j554R51J069k46M33k59j429
878d96P21K119p71k691J09K703n66k473O02J050j013j69J288n29k380J169L214
895A887j799l916K418L956j809l781K127L458k149j561K331R25l105O11L577j495
911A675m580K420M363k258m092J088L766r15l599K88K547k86j213m41N68j28N02
$$ y = [591, 1097, 179, -322, 408, 336, -3, -345, 26, -337, -402, -994, -1271, -789, -531, -680, -902, -695, -209, -38, -415, -336, 13, 660, 383, -123, 454, 1136, 581, 492, 1316, 1186, 496, 306, 951, 668, -179, -248, -88, -289, -262, -590, -796, -1196, -499, -110, -1366, -1724, -251, 536, -526, -1536, -755, 813, 617, -471, -338, 903, 1206, 1257, 364, -534, 656, 2398, 961, -1666, -478, 2225, 1774, -1190, -1004, 465, 882, -555, -1008, -1199, -843, 168, -30, -1791, -2395, 271, 1775, -737, -2210, 96, 1846, 539, -1015, -64, 1005, 759, 1192, 933, -496, 225, 2344, 1573, -1118, -1009, 1694, 1128, -1345, -743, 307, -706, -875, 413, -116, -2496, -1327, 1887, 88, -3828, -1410, 2546, 737, -3044, -917, 2541, 392, -1169, 1162, 2087, -1018, -407, 3170, 1675, -2905, -485, 3878, 1620, -2472, -1384, 2382, 1467, -2132, -1844, 703, 417, -796, -1237, -669, -797, -295]
928b95L27p18n97P80R30M39m19j552J4K847J273l927j476N013K221n968k295N694
946B291J682o120r48N840p05n591K116N666l778o612N258O805o657o894P397O606
962F356p599n470P473M923p162k911P190J348p031N69O956j669o845K474O649
977E251k674o288K223N606j961n270Q21M380n07l709k03K779P11k490q31K415
993B53J053k425j567L795J491m921j007O515J158p358p97R129K55r846L79J0181
1009F288j819j0294K797R928m420r517N906Q591p642p936Q588O525r332n703R990
1024A950M309r781l127R972J631q987j13Q858j213q041K667O882k902n893L419
1039c69M706k882m217K522K913j616k399L80J601M84j986j120J446J833k061k267
$$ y = [-295, 32, -686, -1283, -503, 427, 866, 447, -1105, -1091, 1756, 3029, -898, -2374, 2639, 4860, -1108, -3403, 2291, 3973, -2147, -3095, 2745, 2040, -3551, -1435, 4231, 453, -6159, -901, 5904, -753, -7647, -250, 6356, -1243, -6713, 760, 5683, -1479, -4390, 2800, 4148, -2883, -2314, 4642, 2973, -3872, -1398, 5251, 2577, -3711, -1488, 4118, 2157, -3113, -2292, 2088, 1581, -2128, -2331, 448, 1159, -1331, -2162, 253, 1306, -1119, -2686, 1109, 2600, -2321, -3328, 3187, 4345, -3013, -3810, 5319, 5574, -4272, -3893, 6288, 4469, -5825, -3028, 6900, 2480, -7037, -1131, 7460, -182, -8118, 470, 6995, -2337, -8040, 1950, 6259, -3522, -6649, 3323, 4954, -4033, -4146, 4712, 3499, -4542, -1875, 5007, 2105, -3788, -369, 4337, 1455, -2762, -240, 2673, 1057, -1342, -962, 639, 1123, -863, -1983, -537, 1296, -765, -3032]
1055c032K714K274l080k447M732K137n472j885P145J031p877R2Q862q25r024J973
1071b682R077l376q634M550P426n731o752P192M773q087l024P995J757q572n77
1086d665Q262j208p316K289O445k975n010L549M119l781k561M317R94l807J48
1101a200L374j158j918J770J188k504r6K382j181k472J989J538l075m46K896j61
1117I26l608J593L480k853l235L976K226m113j702N198R99n279M80N511j619n276
1133c296L015M884m213l867M610K836n276j797N688K0n500J102N057k691m684
1148d112L828L408m535k239M837J138m912L76M585j228m050K723L216l741j807
1163b513L980J427m367K6M517j131m206K242K998k629k516L137J230l858k43L856
$$ y = [-3032, -318, 1956, -1124, -3571, 1161, 3298, -2174, -4059, 3086, 4117, -3760, -3668, 5194, 4369, -4655, -2682, 6395, 3019, -5615, -1065, 6361, 630, -6122, 1070, 5843, -2244, -5268, 2727, 4484, -4088, -4665, 3597, 2389, -4927, -2638, 3807, 832, -4178, -629, 3490, -291, -2852, 1465, 2459, -1348, -1200, 2174, 1016, -902, 868, 2056, -448, -544, 1838, 657, -1815, 174, 1712, -1363, -1809, 1087, 926, -2682, -1089, 2391, -462, -3697, 279, 2505, -1608, -3310, 1888, 2887, -2392, -1912, 3599, 1980, -3296, -281, 4603, 390, -3477, 1133, 3969, -1307, -3104, 2584, 2604, -2896, -1794, 3263, 572, -4112, -284, 3124, -1411, -3650, 1187, 2325, -2587, -2211, 2374, 1146, -2904, -181, 3035, -706, -2513, 1467, 2894, -1473, -1447, 3070, 1939, -2267, -25, 2973, 344, -2172, 965, 2195, -1663, -1906, 1950]
1179A950j241l629K057L066l021k136L354J535l812j45L778q05l343K250K724
1194B582k628k122L594J676m200m52M340p26m115J407L633k419l098L552J717
1209B741m088j423M478k69m232O85M303j912l568K810K908l146j815L641P42l540
1225a685M45L556j110l399K057L264k824k111K919J379l094o19K893p00k547J298
1241b78K447k850j754L084J083l450l93L316m31l094J076K769j893j670K678J039
1257A679k642j39L396r05k918J370K578j917k280K304J682k602j115L105k67l072
1273a743Q42K549j654k391K027J712k333j115K689M89k752K61K800j026k270J884
1289c1J882k066j119K471O12k260PK050l55j976R41J593j642j334J886O72k089
$$ y = [1950, 709, -2920, -863, 2203, -818, -2954, 400, 1935, -1877, -2022, 1756, 951, -2392, -142, 2582, -46, -2168, 1426, 3102, -1098, -1550, 2790, 2064, -2051, -644, 2989, 570, -2528, 1024, 2741, -1347, -2770, 1708, 1439, -2793, -2108, 2195, 283, -3285, -475, 2433, -713, -2528, 1113, 1855, -1685, -1240, 2316, 1206, -2193, -136, 3128, 304, -1807, 1112, 2491, -603, -1222, 1671, 971, -1576, -278, 2169, -681, -2435, 649, 1732, -1718, -2111, 1205, 774, -2320, -1244, 1525, -368, -2038, 640, 1679, -963, -1102, 2294, 1389, -1529, -159, 2419, 502, -1778, 526, 2208, -394, -1509, 1596, 1329, -1743, -901, 1648, -6, -2397, -370, 1342, -991, -2106, 583, 1072, -1680, -1419, 1381, 355, -1915, -31, 1851, -215, -1334, 1137, 1749, -511, -504, 1546, 1191, -785, 156, 1749, 107, -1227, 659, 1331, -758]
1306g58n78K129j60k127N36J505q10j281J443L98j521L32J631n70j134J040J198
1323A273j156q58J361N83j106m94J699o08j043P64J054j328j131J491O52j627
1339d74q03J500K83j493k43J529n51q48O54J021j087n08J110M01p61m85J130M05
1357G80n99j23N43lm82M27l2o23J97N85k37p95K24L48l65l08J71J93o72L41L82
1378d8n12n33Q66O14o45m81N89O16k56n46N27M01m50j97Q00j74k66j24N77j91
1398E67n73j01N40j47r02j47Q91K72j112l84Q33M69o86n82R78J89p27p4J149j78
1418B75p63K13J088l30r06L87J237k48j331J58J502k28j385k6J144j18j349N7
1436f23J018j57j417L61J103m85j043M01J517n25j688R49J965r87j653J018J660
$$ y = [-758, -1336, 793, 633, -1494, -958, 547, -263, -1544, -101, 297, -1224, -892, 739, 169, -965, 75, 1273, 117, -741, 620, 1203, 97, -397, 1302, 694, -349, 415, 1469, 141, -990, 501, 1153, -474, -1277, 223, 506, -987, -1230, 299, -252, -1100, -446, 575, -512, -1020, 90, 491, -270, -755, 375, 780, 181, 58, 601, 598, 116, 543, 511, -112, 85, 670, 433, -362, -138, 210, -155, -463, -292, -99, -771, -430, -48, -560, -1093, -227, 387, -258, -739, -150, 466, 210, -336, 191, 592, 142, -55, 745, 571, 305, 181, 758, 567, -6, -107, 433, 286, -616, -763, 128, 400, -712, -1096, -263, 206, -480, -1062, -84, 105, -622, -696, 453, 275, -488, -275, 813, 483, -423, -36, 1201, 953, -378, -220, 1282, 1054, -331, -357, 787, 669, -680, -623, 395, 238, -1179, -818, 285, -200, -1243, -842, 675, 150, -1538, -589, 1376, 389, -1264, -246, 1414]
1453A414q86j564R99J746j028j673J319J555j570j638J898J189k188j229K243
1468E87J077k690j096K725R22k602q72K340O55k375j46K142R9k031N71J670J7
1485I93k137O36J921m47j901P94J598n44k050N37K225o94k047K93J955l57k353
1502a578L96K059o42j726N48J815o13k169J018K253p82k442J242K612j574k242
1518a825J760K423j983k022K209J723k176j360J816J160k479r59K818J64k637
1533a368l00K670J80k707J58K352l97k230M04J864l03j217N44J271n99j166J014
1550A70N99m57n53K61R02k55r55R8J136k18j088j32J057J39j570K21R66K90j586
1569i75k7J253R5j657O78J776j078j684J177J999j683j424K062R89j775r30K194
$$ y = [1414, 528, -1036, -37, 1709, 681, -992, 327, 1882, 312, -1326, 572, 1761, -427, -1656, 587, 1664, -1026, -2122, 603, 1525, -1077, -1949, 391, 1046, -1329, -1475, 667, 766, -1265, -694, 976, 993, -1144, -508, 1413, 966, -935, -141, 1457, 913, -1137, -600, 1625, 931, -1116, -823, 1132, 775, -1578, -1182, 877, 235, -1491, -943, 872, 259, -1910, -892, 1361, 579, -1863, -621, 1991, 417, -1825, -65, 2358, 375, -1647, 562, 2285, 109, -1251, 565, 1725, -754, -1713, 1105, 1269, -1368, -1668, 1002, 1182, -1525, -1367, 985, 588, -1642, -1238, 626, 323, -894, -350, 921, 322, -844, 170, 769, 312, -241, 20, 922, 667, -288, -190, 946, 728, -360, -492, 565, 704, -866, -645, 321, 611, -975, -1002, 251, 346, -1311, -633, 1143, 65, -1619, -442, 1557, -126, -1550, 512, 1501, -274, -1204, 990]
1586I90O17j902l41J744j65j634L19J509r41j223Q40J365j449j028J356O03j197
1603e37m19J251M7j276N24J011o33n26J182kr13L07N18l68l62N77K66n85k14P35
1623E83j70q41L91Q53j014m49Q23M82j417l17J522m31j147P14J019p77j211J469
1641H2J237k149k64J799M19j904M54J668l99j752J226J249j250j137J125Q76k031
1658g51j93J497K91j837J69J725q43j324Q39Q43j131k66J053K99j357O13J166
1675G93m54r92R34K94o22j10O09J7r90P51Q04n34p79P71L61j325j64R70j62q08
1695f36MJ302n03j141P08J038j311m39J144L17j544M63J545p85j011Q99J127j066
1713A11p02J128M31j130o5J121k78j216M32J162q01j051P81P71j120m06R72J39
$$ y = [990, 1607, -295, -636, 1108, 943, -691, -372, 1137, 196, -1027, -187, 1178, -271, -1299, 57, 660, -537, -956, 295, 342, -934, -410, 601, -32, -558, 624, 622, -291, 16, 534, 166, -196, 381, 647, 62, -152, 583, 413, -428, -37, 816, -198, -647, 176, 658, -759, -1076, 446, 15, -1132, -418, 601, -176, -1387, 82, 1319, -830, -1094, 705, 1124, -780, -326, 1342, 943, -809, 417, 1666, 416, -721, 404, 1280, -751, -944, 553, 844, -993, -824, 901, 58, -1266, -427, 416, -715, -981, 72, 371, -986, -373, 793, 339, -653, 281, 575, -47, -157, 452, 469, -521, 230, 1034, 500, -279, 492, 853, -472, -636, 334, 172, -636, -632, 670, 167, -974, -266, 772, -539, -978, 166, 483, -1061, -598, 947, 162, -849, 50, 1177, 111, -591, 537, 968, -162, -227, 894, 616, -600, -168, 994, 193, -858, -77, 694, -426, -832, 140, 279]
1731B79j014L66P72r17q24J291M13p02m00J120K13r08N4J118o12p49R17L59p29
1750D7l80J350j84j380K58Q16l50r54P04N87r99k74R49j20p48J10P98k53q55O92
1770a86P83n41n85Q10L42r27J66R36m05p74N77Q89j311k61J008L16j204l49J461
1789G45j14j425M58Q69p40n81M31O66r29l21J355J26j037k0J165m34j015Q15O15
1808F29n37k98Q21R1o98r1R91l31j040O63N36p14m79R55l54q34M18M68m72l98
1828f74M78M64p27o12J470j41r83L34J179n01r11R85O65r00o29R54N83j221j48
1847c35J181j53j153M26R98p02r98Q04M33r25j66O43q9o59M12Q18o49o09O85L01
1867B63m91j72O78J62l80K24L11l41m51P10J93j002J6O93K13j146M35J043r93
$$ y = [279, -735, -369, 403, -514, -1338, -47, 366, -336, -736, 384, 597, -311, -257, 861, 249, -500, 417, 776, 47, -333, 1017, 833, -547, -289, 527, 177, -777, -73, 514, -485, -759, 190, 70, -678, -568, 230, -23, -878, -186, 597, 56, -529, 281, 623, -304, -138, 798, 393, -381, 196, 1085, -226, -487, 521, 837, -367, -716, 745, 631, -794, -336, 533, -207, -788, -357, 309, -620, -941, 414, 540, -497, -517, 648, 214, -801, 14, 629, 92, -206, 615, 706, 8, -83, 908, 577, -463, 200, 736, 22, -457, 498, 144, -690, -272, 196, -276, -674, -196, 268, -459, -1071, 399, 258, -725, -391, 788, 287, -624, 361, 1026, 126, -503, 451, 1034, -187, -335, 846, 693, -460, -34, 964, 262, -736, 68, 501, -424, -590, 53, -36, -695, -283, 535, -114, -723, -38, 263, -228, -400, 278, 440, 60, 284, 595, 254, -197, 513, 706, -296, -280, 413, 626, -520, -85, 958, -35]
1886c5p56P32N51o48o45J050N5j040O8O45L71r96K15P21J54j065O03L35j8o02
1906c05M10K50k74k11K27L87n55L0J10J03k23R0k42O1j4k04q3M52q0O4n85M08
1928a84O76j103K49P55N3p63pQ66r1r27K12J146k68r29J08J077n22j003Q58M85
1948F88o86n93O60O63r44n18Q70J66o21o74R38N22j062M7N85M62j039l5R05M44
1968G78r84n91J403K5p00k60Q88O0q06M8Q24J32j299J98P18k09j031M58O96l99
1988e1o66M62O79l73m66qQ68n72l47M05M70k22n05L86L51k02l10J4N29l53k20
2009a31K31L68r2p70K23P52o34k01o0M40k05p22N45O42r01k73N12P59r46j96Q84
2030B25L94q03l97J520k29j141K33R83l14j220R41Q49n80r98N46P37p62l27J52
$$ y = [-35, -791, -59, 492, -156, -801, 249, 304, -736, -668, -23, 348, -648, -433, 288, 442, -623, -20, 315, 297, -305, 105, 355, 81, -130, 97, 484, -71, -41, 69, 172, -51, 39, -203, -142, -156, -360, -443, 9, -71, -7, -592, -184, 492, -611, -362, 393, 446, -317, -324, 542, 451, -476, -264, 882, 614, -315, -207, 870, 348, -655, 203, 688, 2, -591, 69, 732, -212, -730, 140, 306, -315, -989, -51, 471, -591, -544, 41, 503, -536, -571, 334, 778, -206, -797, 606, 631, -69, -329, 559, 619, -187, -139, 685, 817, -482, -284, 434, 225, -806, -348, 348, -51, -717, -255, 424, 51, -415, -423, 445, -127, -474, -69, 401, 179, -326, 60, 411, 209, -101, -87, 442, 89, -131, 100, 468, 376, -394, -171, 581, -53, -254, -314, 126, -79, -801, -256, 386, -515, -788, -276, 483, -463, -659, 225, 619, -184, -581, 939, 710, -431, -198, 785, 471, -749, 192, 1041, 461, -537, 9, 746, -16, -343, -191]
2049a91N98p41j74N34L23q63Q8M60K9k52o3M50N5j97J37j79J62J56j47j45J65
2070B05R5k19k17O08k27j67k40M26j06n91L52O90o85q10Q56L20j004q3J076K45
2090E24r93j28Q25L63j130N96L83k13p88N91O87q02l27R50L09r15l75R35o7o54
2110b29K77M50n79m78O68L7n19LK37Pm25M1M00l8l05M07K2n1L00n7j82k87M99
2133A98K98n32j27M17J78n18n7P05m37n81N95N14j068k97J170j79p02k95R88j96
2153G4q61M17P96l27n90N84N36o05l47Q05k88m01K54N43l54n59M37L69j36m31
2173h4L33j88l65k00Q07k20m93M19J0m44j4O98l33m03L63N11n30k72K16P10p67
2194b46K6Q78j4p86l8J100n32q80N55N19n74l88O50K56p53l11P50k11l79m06R27
$$ y = [-191, 407, -334, -508, 26, 349, -514, -426, 34, 63, -189, -252, 198, 253, 56, 193, 14, 176, 332, 185, 40, 205, 300, 81, -136, 472, 245, 78, -162, 264, 158, -433, -81, 609, -76, -886, -30, 290, -714, -797, 279, 524, -469, -597, 228, 591, -539, 57, 440, 227, -561, 30, 717, -85, -412, 538, 847, -68, -443, 492, 425, -229, 48, 498, -81, -559, 109, 146, -373, -370, -133, -126, -551, -510, -110, -148, -453, -46, -24, -75, 225, 168, -14, -301, 198, 496, -36, -163, 254, 432, -86, -143, 562, 125, -456, 139, 653, -415, -712, 458, 279, -423, -718, 270, 74, -787, -370, 426, 99, -491, 93, 629, 24, -323, 482, 194, -207, 47, 590, 236, -323, 114, 483, 347, -84, 249, 61, -304, -504, 303, 83, -410, 9, 19, -425, -439, 259, -74, -477, -114, 397, -133, -405, -189, 521, -246, -220, 658, 644, -142, -180, 920, 388, -492, 63, 582, 8, -380, 270, 526, -227, -538, 212, 1, -378, -784, 143]
2215A43j17n81O07l5P9n56M27L51o63J12N13p8l79K57K31l40l4N46m3n16N5N81
2237E60o73jJ28N1m05M1N58k67n17L22M57o84k93M53P83q31k79P30J77n46K1M79
2259B64k61l72M20M84m48k48P45m16j27k56N49j27n03K24L25o24k20N29J24k86
2279b24j5L29j02k41K91O8j40k59J07N19m59J48K56O3n88L01O58l42p14L87N62
2300F05n92q0R5J72n13L13J04K19o94L11J70k64k45M97K45n07j14K66J37l09K
2321a82L63k81j73L27Q2r1J5M41l89m42N21J45k83k51M81q5l37q7L19r9l29KL62
2344B9m53k3L09M57n43j86M81P9l42k00Q42m27N6k32L35q0j62l1K60k11L2J81
2366A71q5k84K09O1k47J05ok68P4J56J42k84L17j21O4L2j84J36J77m83N40p5j4
$$ y = [143, 26, -555, 52, 17, 96, -460, -33, 318, -345, -233, 280, 202, -177, 80, 311, -29, -63, 483, 440, -76, -21, 560, -113, -114, 14, 65, -340, -299, 259, -8, -525, -203, 254, -430, -723, -270, 513, -318, -597, 133, 310, -236, -215, 264, 3, -369, 51, 535, 87, -161, 584, 168, 41, -215, 334, 207, -296, -72, 253, -371, -591, -62, 62, -224, -239, 90, -12, -253, 38, 106, -34, -293, -186, 333, -126, 22, 278, 341, -247, 54, 712, 370, -344, 43, 605, 13, -67, 28, 200, -313, 0, 104, 323, -371, -60, 110, -154, -399, 98, 343, -164, -278, -12, 125, -184, -182, 181, -100, -273, 54, 136, 45, 60, 501, 112, -330, 191, 336, 53, -198, 283, 198, -139, -226, 93, -6, -335, -333, 29, -424, -447, -138, 319, -224, -410, 71, 150, -192, -392, 450, 23, 79, -153, 182, 102, -60, -91, 169, -42, -10, 171, 86, -198, 11, 72, -175, -70, -76, -344, -270, -114, 28, -256, 61, -60, 4, 36, -148, -12, 165, -318, 222, 147, 133]
2389A33k27J35M09o67q7M31Q7n36O3K92K94n78j48N38k22l55K5M25l64N5O8L86
2411A57j89k05L12J52j25l22J95j46L05j82O9Q2q0Q8l25M15k7l86K15K44k10k61
2433b24J36J76j36k91J30L03k40l45J86M13N2o91K33N16r2l91K21J15j4r7r3M21
2455B88k23L4O3K44m54j45O58l18p6m68L15K39l28k82N48m8L4l85L02j07K3k80
2477c66M74R0n19l5O16K8n39J27L48K6k71MM36l39k67l4K29P5j64M6J47L8o10
2500d60J85N52m83j93L41J16j66k15M80k3k11r6j50M54k0L9m04L70J28l52N0K36
2522A78Qj94J35K06j68j55l6L25l07k09K65Q4m03k1L21L64o74K13m8K32k60Q7
2544e7L12k26J24k30L61k47j88J63J77j73j40R7L14j67j95m7L17n9L2l79J52M8
$$ y = [133, -94, 41, 450, -217, -304, 127, 214, -322, -259, 33, 327, -251, -399, 139, -83, -438, -413, 12, -352, -297, -229, 157, -32, -237, 75, 227, 102, -220, -25, -171, 134, -48, 21, 103, 23, 111, -214, 201, 174, -212, 3, 247, 37, -224, -88, 88, -48, -339, -209, 94, -146, -491, -305, 108, 160, -531, -298, 218, 126, -265, -44, 71, 57, -40, -133, 288, 65, 99, 162, 406, -48, -193, 465, 147, 71, -397, -82, 157, -171, -453, 95, 47, 81, -304, -2, -109, -86, -366, 108, 198, -321, -356, 260, 288, -251, -124, 224, 250, -21, -17, 419, 80, -187, -221, 8, 83, -81, -35, 112, 150, -460, -275, 277, -206, -399, -58, 58, -108, -323, 157, 134, -77, -173, -323, 131, 111, 150, -254, 116, 244, -108, -58, 178, 186, -8, 127, 333, 165, 10, -26, 299, -8, -217, 48, 132, -271, -292, 29, 393, -281, -68, -116, 116, -144, -57, 255, 29, 153, -77, 284, 37, -151, 12, 189, 16, -124, -27, 287, 120, -75, -122, 195, 136, 168, -211, -59, -11]
2566a1m3j99rK85l38J23K30j41J78j42J19J24l83J65L09n7k88k45N47J07n43R6
2588a16N30k35n45L77J35l5k65J84L48m97k84L10J03r1KM9J31k92o1J75K8m06
2610d55M91Rl08K86J63m1l12J07J01J0K0R6j32j9O3J26k41K0l4K22k99J51J00
2633A24J07l95K37L22m01j17N3J64k14q6M23p5l30J73p0L55n68M74K18k88k80
2654a74K35J26l54J25r9j34R2k61O92k40l87M39j7j8l23J3J3K09j59K2M35m25
2676a90K66J20m05J81L55k31j54R9K56l7n70L60M24o05j7L71j46m09L50R7J97
2697C12o80J78L09j43k48K65L75m91j9N28j18n13K40M31l47n9K60jj63l78J85
2718g7L06k36N2J72j76k83K22R2j80q1K53k9j38k4K08j54J3k0J78j56J13o6pj04
$$ y = [-11, -54, -253, -262, 23, -315, -192, 38, -103, 75, -67, 52, 176, -207, -42, 267, 210, -78, -323, 224, 331, -212, -116, 414, 179, -366, 11, 146, 111, -154, 30, 378, -119, -403, -93, 10, -81, -79, -30, 101, -191, -252, -77, -49, -455, 36, 45, -263, 23, 186, 145, -167, -60, 41, 51, 71, 167, 35, 16, 79, 205, -36, -16, -50, 172, -127, 24, 124, 231, -164, 73, 395, -6, -123, -70, 94, -120, -206, 217, 142, -188, -15, -85, 270, -298, 176, 394, 106, -174, 61, 187, -167, -42, -141, -275, -183, -444, 248, 8, -379, 60, 43, 25, -298, -285, -272, -63, -222, -200, 235, -190, 76, 196, -209, -28, 327, 96, -58, 41, 297, 260, -310, 50, 474, -131, -148, 223, 77, -332, 18, 115, 312, -368, -190, 119, -24, -272, -7, 368, -123, -142, 386, 268, -245, -5, 426, 79, 20, 280, 279, 116, -262, -77, 229, -7, 45, 217, 41, -242, -20, 72, -108, -189, 64, 35, -103, -127, 81, -73, -60, -80, 98, -58, 55, -11, -18, -122]
2742a22K21j2k39j05J77K09k50J24J84Kl69K88O4j88l41M38K38j54m03M15l04
2763a27p9r1M81K07m80OJ26l0o9J78K69k94j05L79j67l84J17L00k0j43J78K4l72
2786i6rJ73L5l31J30K97k57j21J63K4k25r0J07K43l52J35K43J1l33K96K46n5l98
2809a64K22J38k57J14L15k15m10RM25j58j18K10p1mn9N2j65j2l3J32m8q4K65n9
2833B5j73N1M39j64q4m9J15j17l30J86J75m40R3L57L57m15j83K98k32pP4jl8n6
2857a19K28j19l70K9M96k83O7l0K99l33K25L7j12J16j03J68J10m43P0K70l98L15
2879A20k10J85q9J1k6l53L9K28L16m19L9J47j24k49J53J62Rk32L40O2k33J80R3
2902A49k83J08j83J49L47l13p2K36k2m7k15K92l6k78n8J48R3j77K4K05j55r9L69
$$ y = [-122, 99, 87, -152, -257, -80, 129, -121, 3, 187, 189, -180, 108, 172, -16, -357, 81, 319, 165, -238, 177, -127, -206, -297, 184, 391, -89, -83, 43, 13, -56, 122, 391, 97, -8, 371, 204, -180, -63, 237, 217, 74, 252, 276, -96, -105, 68, 103, -228, -98, 199, -58, -179, -16, 8, -217, -307, -200, 43, -309, -174, 69, 80, -253, 43, 289, 234, -164, 58, 196, -61, 53, 368, 153, -257, -248, 177, 19, -99, 111, 40, 36, -23, 29, -136, -148, -181, -49, -97, -181, 84, 25, -148, -97, 342, 178, 94, 45, 160, 43, -287, -101, 74, -366, -273, 84, 441, 26, -157, 141, -91, -98, -24, -25, -63, -119, 109, -10, -380, -351, 145, -138, -71, -101, 198, -135, 90, 127, 15, 131, 28, 196, 306, -137, -67, 203, -195, 120, -90, 95, 6, 17, -9, -362, -323, -95, 221, -198, -159, -12, -136, -385, -232, -70, -61, -293, 47, 109, -124, 56, 149, -134, -26, -209, -60, 287, -26, -98, 138, 116, 69, -146, 146, 110, -168, -226, -78, 15, -162, -138, 67, -88, -187, 182]
2925A82m16j7J71q8L14k19l7J97L6J28j56n9K25j34lk67J68q0j33K03J42N5l23
2948a11j60K05J24p0m31O32r7m17j29M91j5j82L68k14m5L3J18p3k8p5K18P3o0
2971A55k33J98P3j58l33L24k5j01J9q1J18J87l06O7P3j54K10j03K23j94k13L53
2993I9q7M4j66j8M83j66j31K6O9m7j25M0P5J36j90R2j75J2j48O3K9pr5K97k93
3018a83M50l78R2j0j51K15k37N59n05m8M78j29pj59k18K83k7L09j23J56l51j50
3040a34L9L5Q5k70L40m7p8K7P2j58j26K11L7k6l2JJl6O5l4R0m2p3J17J36k05o5
3067g0M0j19K05K2N6K2j14j08j22L21k28j66K90p8n8J92j30J64j55M1k19K38J02
3090A26l10K36l8j30N4P1L35l91J37L0P6k36P7l2j3j04P0K7J26O9r2l20J98L9
$$ y = [182, -234, -251, -80, -168, 146, -73, -110, 87, 123, 251, 95, 36, 261, 127, 124, -143, 25, -55, -188, 15, 157, 212, -111, -271, -66, 58, -12, -443, 189, 92, -325, -454, 37, 22, -160, 208, -6, -51, -18, 100, 27, -1, -76, 142, 215, 155, -78, 120, 193, 35, -298, 26, 1, -100, -81, -162, -44, 143, -163, -96, -23, -177, 33, -70, 153, -41, -254, 99, 12, 56, -110, -128, 355, 189, 58, 84, 153, 106, -19, 21, 96, 232, 42, 134, -41, -29, -177, -114, -85, -92, -187, 110, -183, 267, -111, -19, -29, -180, 35, -202, 357, -148, -196, 282, 153, 146, -13, -231, 52, 25, 334, 211, 367, 16, -134, -95, -60, 25, -245, 95, 48, -30, -3, 69, -89, -215, -4, 33, 7, -25, -24, -23, -59, 6, -28, 62, 20, -53, 64, 200, -5, -70, -30, -149, 56, 78, 134, 156, 42, -66, -188, 133, -95, -261, 29, -49, -107, 85, -45, 119, -36, 5, -214, 24, 126, -184, 52, 14, -116, -62, 9, 344, -47, 90, 120, 196, -40, 37, 5, -8, -112, -42, -15, 111, 180, 88, -232, -34, 5]
3114Er8K5k02K09J30r3J18l64J27J31K59k86k6J39nk07K14J63k59l8l6J33J70
3137B09k85p9K12J24m61L11k01M05n94M46j2P3n11K16K00P2p6j5o2j85L48J88
3159C23j6p3k59J5j4l45N53k8q6j81J10J20J33j93p4k93M25k39J16j58J16k01
3181b49R4J98j68J30j55p9J72J70r5p4K54j39q8J07M0j41k39K49l0j59OL22k24
3204i8j22K94J39m33j49L20J37k58J81M9om4RK9P5j81k1N5K39l26J30J29n6j76
3228h4M24l17n3K23k25q0K33l1K1j7l15J80l7k6Q8r3J57j87L9P3o9K99k67k5n
3253i4j49M02j17k29J62J15r4k6Q7J7n5J84j53q4nk3J74m94K21J05L45m59P7J24
3277C1j76R8P7J5P4k37Q5K44l19J12J23j71J23L1K4j80l7l1L68p9M7k75l0j6Q2
$$ y = [5, -93, -68, -270, -61, 69, -24, 94, -270, -143, -12, 247, -39, -65, 74, 69, -138, 76, 239, -20, -58, -94, 39, 209, -76, -155, 57, 181, -280, 31, -170, 235, -359, 87, 75, 148, -363, -147, 53, 125, 49, 34, -28, -213, 135, 323, 307, 234, -25, -10, -24, -369, 184, 156, 70, -111, -1, 119, 252, 59, -15, -308, 117, -122, -6, -164, -48, -249, -155, 43, -125, 5, -150, -229, -57, 113, 18, -56, 198, 59, -29, 78, 118, -23, -262, -13, -43, -202, -196, 126, -98, -220, 74, 213, -220, -369, -49, 88, -170, 11, 60, 54, 10, 19, 48, 123, -58, -79, -24, 215, -111, 19, 148, 92, -84, 340, 23, -30, 193, -32, -112, 121, 90, 111, 94, -221, -41, -78, -104, -16, -109, 48, -139, -100, -27, -96, 203, -64, -89, -94, -243, 159, 42, -187, -25, 90, -4, -30, 57, 74, 19, 203, 50, -34, -39, -62, 112, -382, -161, -56, 289, -170, -93, 31, -145, -47, 30, 45, 119, -118, -33, 211, -108, 4, 127, -44, 79, 110, 134, -46, -83, -114, 254, 175, 222, -53, -83, -99, -17]
3302a7L23k53q9j49J98J24l15j0J38K19j77j4n2K7M6K16o1k53J15L20k48k92K33
3325B9K43j52J8J15l07J87o7q7k17J36K32j90o3j0p6K47k47J79J35k73M6K90j67
3348Aj41L74o5k87oNJ63k13J54k3K12l28J93J1m8Q7k04K02m54L28n8J04p7M1j85
3373b14K83k9o2j35J4M5K7J33k29J60m0q5K90%q6m6j28M0M7K0K35oj43m02M71
3398A60j77J4o3Q7K34k87j72K78k5k81L07j57J3l8j98M71l6n7q4J18N2N2k64J28
3422G5M8j31q2j17J09K90r8q4K2J6r2J01j98O3j04J43j5K38k86pJ07Q7L6K7Ll58
3448b07K44j30J66J83l44N4K03j86k3QJ15j94P0QK44k27j16o9O5q6K38j47K89
3471A58j11O9j92l1J45j72N6J18JJ02K9k52J06L8K7K3p1J33q3j36J56j12k37L81
$$ y = [-17, 306, 53, -36, -185, 13, 137, -178, -188, -50, 169, -8, -22, -74, -47, -1, 215, 154, -99, 16, 336, 88, -204, 29, 272, 120, 138, 253, -54, 133, 66, -21, -238, -102, 130, -60, -123, -133, -209, 38, -209, -30, 105, -168, -122, 168, 1, -140, 234, 169, -118, -124, -119, 44, -169, -15, -38, 174, -154, 39, 50, 2, 89, -115, 87, -367, -39, -97, 7, -70, -29, -214, 69, 40, -22, -157, -143, -98, -71, 62, -167, -7, -47, -132, 158, 158, 72, 26, -102, -62, -15, 5, 240, 234, 91, -311, 160, -17, -3, -66, 21, 255, -32, -204, 74, 49, -232, 75, -82, -69, -107, -305, 166, 130, 73, -11, 107, 159, 211, -53, 75, 123, -8, -90, -207, -98, 192, 94, 10, 32, 48, -44, 57, -141, -78, -182, -39, -54, 184, -102, -109, -2, 85, 121, 148, 151, -207, 37, -93, 73, 256, -88, -34, 169, -17, -40, -32, 83, -111, -41, -33, 211, -16, -132, -201, -136, -222, 16, -131, 158, 47, 116, -76, -107, 38, -134, -78, 40, 41, 143, 172, -80, 26, 64, 91, 114, 43, 176, 93, -43, 113, 1, -236, 145]
3495A45j3j66J75k85k9L76j73n5l5k5J15j09j02L89j19j73K03J93l02M8r4J12
3517G6k40J39j81P2M15n62K24R9Oj04O2o2K9p3J07j10K56J7j61j80L52k76L11
3540B16j82j41J80m9J5J15j40q6L52l03K63j31q7j02m6K17kk02q1L8L06k44j63
3563b57M30j79l06J03N0J19K54j91k32K65p7J26q5m8K5r6n2K07K07j68j79L52
3585B68j86k83L19l7k23r7LJ96N6n0J17q0K10k57J61O7k83O0P1J23k37m0j20K29
3609a3p5J11O4j16q0j12J86K01o2m19K11J69k74L92m89K98R9j52m3r7P9J08J79
3632A65j33j83N9K9K41l54K30L61m43j56J03k41K10J55k22P1j35K22K71j00l4
3653A16j74L8K05l31QJ36Ll0j06K22k70R2K03q8l23M22j87Q4J0r6R0J13k09J11
$$ y = [145, 132, -34, 141, -144, -173, 203, 30, -25, -60, -85, 30, -79, -181, 208, 89, -84, 119, 312, 10, 58, -36, 76, -164, -25, -206, -134, 281, -281, -57, 42, 48, -56, 6, -56, -27, -100, 7, -103, 153, 170, 9, -171, 181, -95, 216, 34, -107, 73, 24, 39, 154, 14, -72, 280, -23, 240, 109, 22, -80, -126, 91, 89, -113, -194, -156, 150, -94, -257, 173, -6, -312, -209, -159, -40, 214, 23, -209, 56, -21, 105, 20, -28, -3, -99, -151, 56, 263, 95, -84, 268, 82, -201, 118, 81, -142, -239, -236, -40, 16, -34, 83, 3, 213, -44, 117, 184, -99, -39, 32, 155, -82, -122, -242, -13, -88, 23, 87, -29, -109, -221, -35, 166, 104, -315, -104, 65, -209, 183, -306, -8, 91, -61, -104, -201, -122, -14, 165, 32, -151, -92, -63, 178, -176, 54, 415, -28, -184, -81, -322, -112, 43, -179, -108, -243, -21, 250, 150, 116, -58, -20, 185, -146, -138, -2, 1, -29, -135, 87, -183, -91, 112, 24, -299, 123, -64, 20, 30, -66, 24, 137, -72, 39]
3677C9J31k57N9J5K5J41j00l3N8k4m2J2j01j23K96k64K5K00j70PJ35m1j34J21
3701b5M3j91J14J68j33j01K27J30n7o4j37j40L64k50K08l38J06M2j26k2K23j45
3723a04J69q2j71K14JK01l37J49m6j76P0K8K04l8q2JP9K00j35m1N1k19J79k57
3747a42L2M8LL02l60J46%k05kN5K84l14k6O0J72p2M45n49L98p9k09K44j64j18
3771e1RJ19J2j71m4K86j45j23L07R1k10j19j8K00q2j28o1J71P6l1K67l9o04L78
3795I0J13j39O5J38j06j80R1m8l7o9J63M7j36P5o7p8J56L1j04l9m6j28J50J42
3819H4Q0o0l27J65l8j35L98j44L2J0j1o9j0J05k99K23j20L95k36j0L9j17p6L10
3843A89j80k09J39J65j91r5K76j07r5R0K75m53Q4j99L36j76J59O9k74K01K16k97
$$ y = [39, 170, -87, -28, -13, 12, 153, 53, 20, 78, 54, 12, 24, -77, -200, 96, -168, -143, 57, -113, -106, 29, -12, -146, -25, 18, -173, -59, 109, -24, -125, 102, 232, 175, 111, -26, -166, 198, -52, 156, -182, -76, -34, -160, -182, 41, -104, 65, -17, -188, 26, 27, 228, -109, 40, -6, -182, -112, -84, 120, 82, 0, 1, 80, 280, 145, 104, 155, -64, 115, -142, -110, -62, -59, 243, -117, 29, 29, -176, -178, -123, 161, -153, -179, -119, 53, -19, 426, -123, 275, 196, -13, 231, 67, -51, -42, 77, 89, -82, -126, 160, 15, -108, 199, 290, 80, -39, -57, 143, 61, -67, -128, 43, 119, 88, 355, 316, -288, 90, 203, 64, 129, 267, 161, -19, 72, 24, -13, -82, 81, 128, -8, 67, 0, -78, 78, 109, 5, -34, -80, -208, -58, 84, 164, 104, -223, -58, -96, -231, 167, 23, 55, 65, 54, -15, -25, 80, -219, 4, -116, 279, 43, 33, 72, -45, -121, 189, 9, -200, -61, 104, -87, -182, 94, -13, -108, -18, 257, -196, -112, -311, 25, -151, 8, 77, -197, 4, 220, -77]
3865g7J45P9j70J52k95L19k2j18p5RjM2j04P1RK54l56M15l54j37J68j31k2J86
3889a3Q0k47P6K55O1p3J49l45l4J32J04r3k5K06k31m2K51k69O9J71k02o8m8J33
3913cM4NJ04L4j21j37J05o9L76l60k41K43k7m2K36J21rj58P5mk39K25j7k34J29
3938C6R5m82K44K66k54J56k69J42J33j80n1KK7J95J4j59J39j00L5J18k74M6M3
3961g8J3j8J36K7j23J07J4j48J97L6j91o9K20j87j36J30P9q1J66l52L3K15J15
3984A05o6j40O3J10j54J20j58P2O7R4j39N7J34r5j0k14K52j4k13K71L7l49K53
4007H3N1k42J29q9J78L7k24r5L03j51J3P6k57K3K0j33J38K56j04J68m9o7l8J52
4031A78j69J95k37K24l47J03j92K0L53j12M5j71j82N26k40J38j58O9M7j95M63
$$ y = [-77, 68, 147, -23, 129, -166, 153, 131, 13, -62, -53, -54, -12, -116, -45, -36, 218, -138, 277, -77, -214, -46, -177, -199, -13, 67, -180, -104, 151, 212, 139, 288, -57, -91, 41, 145, 52, 27, 233, 2, -40, 211, -58, 11, 182, -20, -88, -136, -3, 41, 46, 150, 184, 63, -74, 31, -38, 338, -22, -263, -20, -47, -89, 147, 268, 259, 101, 176, 172, -67, 158, 141, -93, 36, 131, -351, -107, 159, -95, 61, -208, -66, 67, -113, -164, -162, -135, 60, 74, -85, 54, -46, -11, 107, -167, -121, -78, -65, -83, 53, 80, -43, 64, 78, -70, 127, 163, -28, -97, 123, -64, -200, -70, 9, -72, 94, -258, -225, -10, 105, 39, -101, -38, 72, -82, 38, -120, -48, 19, 113, -26, 31, 165, 70, 60, -154, 98, 84, -129, 142, 179, -170, 83, 134, -108, 21, -68, 110, 147, -77, -172, 131, -20, -7, 69, -188, -165, -145, -278, -140, 116, 12, 180, 131, 64, 26, 178, 9, 204, -33, 191, -156, -53, -245, -225, 128, 16, 61, -110, -292, 234, -6, 132, -26, 43, 90, -105, 358]
4052C58l31j12K48l5j32J2k2j23L05l69K50r6l7q1O8L24j17j97k2K84k90J51j60
4075a24L13m3l55J57JJ12k08J24J10j89j66K09K7J89k18j79K66P1l9K8r1k98L83
4098H0l71M07K2o7j79J74p8r8J97qQ4l72N5J81k69J96o3j5J11J9k19K91k9L6j70
4123h5n0J81Q6J1r9J08j98J16J59j47k9n7J35m52N81j94j26j52L06j57M7n2M7
4146b1Kj51J08M4K96k85j46J38Q6J95l62P9K59Ql70k78N54k28M9J19k30P8J0O9
4170B3J50M8m12J79r9j9K31j32j71J67j86L37k85J70L06m48O7n3Q3J1J03J37r4
4193A13M0n0q5J38j92j5O1L20l07j53r7J38JP2J58j09J30j33J97m53L25q5j77
4216a63J52J42pj01j43J89J07k80J76q3oP8O2j51Lj06J60j01n5N5O5l4o4J33l92
$$ y = [358, 27, -85, 163, 128, -4, 8, -14, -137, 168, -201, 49, -47, -84, -165, -97, 227, 110, -87, -109, 175, -115, 36, -124, 189, 146, -209, -52, -51, 61, -147, -23, 87, -102, -268, -59, -32, 157, -61, -240, 26, 97, 58, 86, -5, -303, 80, -291, 116, 138, 71, -108, 66, -12, -110, 87, 79, 163, -209, -154, 27, -242, -46, -109, -124, -13, 6, -213, 78, 49, 85, -85, -135, 46, 132, 143, 44, 152, -46, 70, 229, 82, 53, -4, 131, -321, 260, 66, -60, -212, 94, -63, -16, -68, -21, -19, -170, -62, -18, 278, -7, -153, -15, 71, 266, -96, -17, 242, 250, -120, -398, 156, -72, -23, 96, -134, -56, -46, 23, 173, 221, -191, -12, -111, -130, 101, -31, -202, -35, -221, 116, -169, 1, 307, -141, -74, -127, -44, -33, 70, 207, 113, 153, 103, 18, 156, -36, -51, 10, 330, 23, -130, -227, -89, -88, -16, 142, 33, 163, 30, 227, -226, 99, 14, -163, -11, 131, 124, 23, -120, 69, 176, -104, 72, -11, -17, 61, 123, -28, -25, -131, 29, -72, -127, -72, -7, -41, -105, 28, -364]
4241c64M01Q2r8j99K24K27n12K12p4L52j52N7k02J03J75j21o9L20k69oj05m9J39
4264G2q4j13J57k20J44j4%RL3L11m85K88Q2j30rj0O0q8J86k20K62l47J00L8M8
4289G0J32k42J75j32q3J18J10k11q1j24K93j48O8J0N7k29K80J30Mj33J01j19M8
4312I4j14J11o1j93NL79k85r2L46j94j37P6K38j09k1R6m05K54j05J63j34k2J08
4335bJ74o8k99J44R4j04k1J00L6j9R5j48K55k85p8J89j50O8MJ61j0r4K35k08k96
4360b27K51Q0j08L3J74J36m96j98K90L6r3j47L22K7r1j28J28j09L9J77k54P9K49
4383A70j24n5O3O6J03k67j12k8R6J43j50kJ13k04L96k90q9MQ3n3N3M7p6k2Q1J08
4409E4k29K4n2J32J01M3L5O5j01J28o9m6n1k52Q8K2K02k38K39k7j52k40J36Q6
$$ y = [-364, 37, 119, 21, -178, 46, 273, -239, -27, -101, 251, 99, 156, -46, 57, 232, 111, 42, 362, 93, 87, -18, -67, 72, -12, -125, 32, -188, -44, -58, -58, -49, -16, 295, -190, 98, 180, 50, 41, 31, 91, 3, 189, -31, 231, -116, -16, 22, 70, 202, -40, 135, 3, -80, 38, 148, -63, -144, -268, 25, -123, -55, -45, 12, -217, 63, 193, 197, 64, 165, 46, 94, -20, 91, 30, -163, -158, 221, -64, -156, 190, -4, -141, -65, 173, 64, 43, 139, -266, -12, -117, 46, -88, -110, -2, 172, 104, -195, -51, 43, -61, -82, 18, 54, 35, 130, -18, 237, -48, -126, 63, -87, -19, -15, 146, 136, 42, 277, 69, -227, 24, 104, -4, 29, 203, 339, -157, -355, -65, -29, -122, -269, 53, 80, -11, -139, -11, -120, -81, 96, -158, -79, 170, 46, -9, 54, 120, 223, -44, -156, -184, -88, 55, -95, -97, 16, -188, 208, -82, -171, -167, -84, -137, -84, -37, -113, -135, -54, 54, -175, -151, -203, -71, 30, 73, 108, 173, 72, 200, 131, 85, 34, -218, -130, -108, 94, -144, 95, 68, -84, -324, -188, -102]
4433a02M7j4j16L92l7M2k93O9L8Km9k02L46k22n3K96M8k40Qr1J2L8K43J38l22
4458b2J42j95J49j37j40j60L20J05j65J49l23Q5M08j40j2Q0p4k16K86o4p2M0M3
4481H7p6o1k7J56j6J61n1j89M0J7l16K20J45j8k85J66j10L09k31K90l60J75j13
4504h7K78J3k43j10K01P6j66O5nj65P8M8O2J8rq5p7J0N3J87k23n1L33l72L08k90
4530a53K26l0l36L97P7r9j40LJ56k29L2N8N8Q4k27Q1R3j4k15J77l1l6J34j68r3
4555a95L05J62k56k8l9j22J34j38J39j70L40j2M6k93n0K00J14k0k25K20j38J4
4577a2J77k9j81J1L55l97j14J89J5K06l10J67Q7k87r5J04j65L86Q0m24J29K37
4599A29j02%LrM9j16L6J46j04l5N0J26k18rl6J65Plj19M2l9l7J77k35R7r6K92
$$ y = [-102, -55, -69, -185, 207, 170, 212, -81, -12, 26, 28, -21, -223, 123, -99, -152, 144, 192, -48, -40, -131, -119, -81, 162, 300, -22, 120, -75, 74, -63, -203, -363, -43, 62, -103, 46, -277, -192, 216, 76, 64, 144, 70, -146, 140, 76, 4, 44, 87, 11, -50, -77, 79, 63, 224, 173, -16, 24, 41, -275, -55, 90, 72, -213, -47, -157, 152, -79, 211, -149, 26, -87, 191, 204, -39, -149, 52, 128, -38, 27, 22, -143, -65, -17, 45, 63, 54, -31, -108, -98, -45, 142, -81, -132, 201, -171, 137, -153, 73, 43, -293, 104, 181, 82, -58, -55, 101, -128, -96, -38, 20, 104, -123, -42, 51, 37, -178, -1, -32, -68, 66, -102, -195, 110, 272, 16, -12, -51, -173, -39, -177, -38, -208, 132, 120, 166, -127, -177, 23, 137, 117, -108, 112, -26, -12, 165, 136, -45, -34, 321, -76, -190, -1, 14, 220, -90, 77, 164, -123, -218, -114, -279, 107, 187, -237, -108, 129, 27, 27, 30, 21, 70, -46, -10, 136, 32, -3, 47, 173, -45, -54, -90, 75, 82, 79, -40, 2, -37, -74, 103, -132, -35, -131, 161]
4626A61k17o1J40n4j80K64j18J90p5k68K98Jj79J15J2P9n5k9J01k08J69m4j46
4649a04R1p6LJ62j16J65m4p6P8J9l24J40O4R7k69M18o1q5K3j78J07m0q6N5R3o6
4675a0r8J04R0p9m8J48q0k9J65k21K4l7k65N23k44n3K18n4Q6j49J03M3o7j28J92
4700A34k09P3k8P6j8L75o12n2N10k00k7j25J5j41L00M1j77m0j28L27m5n3JJ76
4724A73p9l62L7K50l7Q9m21L59jJ7J52l05L57l48J75L5O1k69N4K66q2j48J07q3
4748cm7L80m79J52j17J61P3k35K05l04K77k09L09r7j35K9o7K14j30J4j9j54K11
4771B9j2J23N2j57J63l97M99m18m8L3J74j68K28l02K81K2K0l62K7K78K2r6k4J5
4795a8k13J71N4j05J32K0N9k03n4K57o8q0o0J87op5R6k73J32J37k92O5L9K61k5
$$ y = [161, -56, -117, 23, -31, -211, 53, -65, 125, 50, -218, 80, 81, -98, 17, 29, 108, 53, 24, 125, -83, 86, 42, -104, -13, -89, -86, 76, -40, 125, 81, 5, 83, 102, -222, -82, -18, 79, -190, 228, 167, 82, 105, -73, 34, -6, -92, -37, 56, -10, -108, -4, 86, 7, -41, 107, 27, -2, 163, -58, -34, -71, -336, 187, -57, -110, 108, 54, 140, -9, 94, 137, 70, -58, 134, -75, -2, -30, 46, 28, 403, -209, -261, 249, 49, 22, -103, -88, -229, 71, 112, -65, -105, -233, 94, 49, -4, -3, 173, 94, -268, -231, 19, -18, 71, -350, 9, 8, 25, 177, -128, 229, -119, 56, 91, 152, -117, -63, 203, 121, -27, 80, -3, -50, 330, -149, 3, -114, 47, 120, -115, 90, -214, 63, -146, 163, 66, -69, -40, -107, 107, -23, -9, -28, -182, 29, 17, 140, 192, 35, 198, -199, 300, -118, -166, -133, 41, -127, 101, -201, 80, 102, 122, -240, -213, 65, 87, -9, -33, -18, -231, -60, -6, -111, 21, 41, 100, -103, -157, 100, 32, -48, -108, 79, 73, -2, 94, -179, -47, 90, -202, -137, -98, 163, 138]
4820A38p0j24r4J53p1M30l87R2j26L73j38k20J33r7q0o5J01m7R4k5r4k09M10j72
4844i5J03om1nn5K3j33N04k32Q4l31n8J77RP6J24k09j13J92K51k03k9j76L57k79
4869f5K02q4j66j26K16N9N7n0l28J17J34J07k05J71q0kQ8j25j43O5K04j33J85
4892I8Q5l50J33J44K8k48k7K52j27O1k46J41J81j21j8j2j53K97j31J95j11k53
4914a82kJ45R9j26JK54k99J7L38m45J3L08l18M8l1J71k29L79k58o9J94j28N8j20
4938a82K42j20N9O5j42J77j39N6k28L64N2k70J78p8j33K17r2J67j6j40N6j78L49
4961B64k44L3O0j99J21m1J01q4j24KLR6j02J14m8J25J24j99J19j93J00j69K0K5
4985i6J92l35K17O0k30J28J59l0j01k36M95j61MJ73j74q1OJ84j42N2p8J90l28
$$ y = [138, 68, -56, -150, 3, -68, 362, -25, 67, -59, 314, 176, -44, 89, -8, -88, -153, -52, -99, -5, -30, -124, -333, 77, -95, 8, 2, -39, -44, -99, -76, -209, 295, 63, 147, -184, -242, -65, -56, 20, 144, -65, -178, 14, 265, 62, 33, -143, 214, -65, 137, 53, -113, -239, -23, 36, 93, 43, -285, -168, -34, 73, -132, 39, -41, -43, 45, -80, -223, -158, 46, -87, 98, 183, -167, -34, 110, 138, -110, -137, 115, -12, 49, -197, -56, 125, 4, -14, -26, -179, 118, -13, 182, 71, -182, -184, -39, 60, -66, -65, 189, -110, -93, 245, -200, -187, 121, -197, -149, -180, -9, -238, 141, -117, -186, 8, -120, -62, -182, 60, -60, -1, 64, -78, 99, -40, 16, -212, 152, 204, -66, 112, 34, -99, 118, 26, 193, 177, 37, 93, -85, 264, 20, 53, 113, -86, 35, -6, 95, 11, -113, -111, -108, -12, -114, 0, -48, 77, 201, 2, 121, -72, 28, -141, -121, -96, 96, -239, -22, 38, -192, -64, 95, 65, -36, -272, 223, 62, 66, 239, 65, -16, -10, 174, 32, 84, 6, 196, -132]
5008a32J55p4o0J27j03p2k6L00k66j00M10j76r4R5n8K6J35j51J32R5k72M22l21
5031hN4j7k7q0J36J18J17l58nQ1l26K94jK91l74NK28J00j60q4P2Qj32J18m4j64
5057a58K25k00O6M4J8qMK90k47j20J28j72N7K03j58N0ko1k01J39j38K3L09o4K6
5082E3Qj8J27j03r2J34j6p2j36j8J86l2k88M28n3j44J7K57j83r2%P5j06R6j21
5107i3k8J35o8k2J39q8l3qp5J7J47P5J07l4K6k40k3J06o1J30j9P5J55k06l03K
5133a87J33n2P9Q5P3k14j91J65N7r0K76n9q1K72k00j73J69j62j07K86j8L2o1K01
5157B33l53K9K6Q7J05r7j7P6m7J53j73r6n4r9J47K42J6l10N1P6KM6l6k3J10n9
5183C5R4k8j76j15K82N4j34J18ll44J97j07J54M0J74m40K60n3j72K6R7O2k30P4
$$ y = [-132, 23, -51, -111, 16, -87, -159, -185, 115, -151, -251, 159, -17, -111, -16, -74, -48, 87, -64, 68, 163, -109, 313, -8, 46, 29, 2, -78, 58, 176, 293, -65, -70, 11, -315, -21, -22, 269, -105, -100, 128, 228, 68, -16, 56, 64, -68, 50, 6, -158, 67, -133, -67, -23, -5, -13, -9, 281, 34, -86, 42, -130, -73, 130, -28, 22, 20, -41, -242, -103, -241, -218, 91, 27, 53, 61, 43, 170, 67, -25, 109, 93, 21, -115, -133, 53, 21, -267, 161, 108, -36, -19, 238, 55, -37, -37, 38, -68, 28, -93, -121, 14, -54, -76, 63, -25, -58, -66, -141, -124, 23, 98, 205, 171, 197, -43, -66, 40, -21, 109, 90, 165, 320, 114, -189, -187, -54, -106, -27, 58, 131, -83, -274, -109, -52, -142, 134, 75, -6, 266, 66, -107, 62, -100, -207, 79, 61, 93, 32, 233, -120, -91, -65, 22, 127, 30, 13, 89, 42, 195, 22, -74, -128, -227, -80, 162, 178, -132, -81, -5, -3, 43, 7, -16, 94, 35, 129, 101, -75, -190, 92, 146, 12, 130, 127, -217, -20, -127, 27, 67, 241, -199, 61, 8, -164, -138, -41, 21, -209, -135]
5207a35K38j2K7r0J81k11j13K25j53K49k09J46l70L11R6k34J82Jj71J77j26j43
5229a34K11j3l01oj25L36N6m6JJ31K9M0n39M34j3OJ10n38K19K19j49J07M1J75
5253B51k31l77M65j62K00k90P9j46J80L68m53J70O1p7j7J4r0K6M9j36P5lp5J65
5277D6L4J36l71q2K99K2j34J87M6k94L02j6k76J11m1J35p7J20n2j34J71J56k39
5300D9M7j12R7j36k2J91k66Q1j1K30M0k29L18k67R1Rj18j40J48q5K4J46L2j48
5324c1J53j56J22K39l51j44J95j64P3J39k64J53J19l63L79N4k32N4J35pl16J74
5346c9n0J25Ql9r9K24L4n2j36j51J98n6j75K34l9j49QJ98J51j45l03J13M96l04
5370E2q1j13Q8J45j73K2N0J8j4K54k62L1NJ81L9l97R3K40k47J3K52j65j59o0Q3
$$ y = [-135, 103, 91, 118, 28, 209, -2, -115, 110, -43, 206, -3, 143, -227, 84, 180, -54, 128, 129, -42, 135, 9, -134, 77, 64, -237, -243, -368, -32, 24, -22, -21, 110, 139, 179, -360, 74, 61, 67, 177, -361, -142, 77, -72, 35, 76, 251, 20, -357, 108, -54, 146, -144, -65, -211, -31, 337, -116, 54, 115, 38, 21, 35, -55, -29, 20, -116, -41, -44, -119, 46, 80, 216, -155, -237, 62, 84, -50, 137, 183, -111, 191, 175, -101, 10, -31, 104, 27, 147, 95, -39, 132, 288, 49, 96, -16, 81, -55, -77, 114, -152, -71, -82, 148, 188, -41, 277, 10, 101, 110, -8, -148, 0, -85, -61, 85, 117, -31, 122, -34, 88, 327, -24, -168, 27, -137, -64, 75, -189, -36, 83, -280, 99, 153, -79, -25, 110, 103, -213, -39, -89, 36, 44, 5, -94, 130, 164, 112, -24, -175, 23, -33, -208, 26, -13, -162, -154, 44, 195, 50, -253, -140, 356, 52, -29, -142, -54, 91, -82, -60, -10, 8, -6, 248, -14, 17, 22, 203, 242, -155, -62, 178, -69, -56, 196, 31, -128, -188, -105]
5395a05J61J12rpj63k63K55m9m1r5P7K40k0J27l16L48k20r2j8j27L93j67l66N53
5419B08j87m6J6n9P1k2j9N2m2j53Q2K12o8r5J14k83J65L30m88%L46k49J92Q2n1
5444A08k24P5k4j34K55k88J70Q6m3j1P8k3J77l8k37J51p5J99j65Lm0n0m4J06j7
5469ej22J29Jm4l0J62p1j29M40l53J84Nj59j17k1N1Q1K1k91K92J10k7Q3l06K26
5494A10P2j46P8k64J61j23o6J62K22m11K80Q2J38m74J56j67L60k66p1L60l00J37
5516C0j63MJ06l6N5J74l72L93l04M6j29J35M06k78J66j62K49k33m0L6Jj67J99
5539A16k11J54j94K42n1k9q3no7o0K66j43j69K58j76k2J92q0J08j3N3J6j60j37
5563a95J88J52O1m84L33j60K72k36J16j65J97Q3j23J46k97K43j17J5k2q3J55k44
$$ y = [-105, 56, 168, 159, 152, -11, -274, -19, -68, -109, -204, -127, 113, 93, 220, -96, 252, 32, -60, -78, -205, 188, 21, -345, 208, 21, -25, -9, -68, 3, -19, -38, 14, -28, -181, -99, 113, 45, -50, 64, -219, -54, 276, -212, -212, 134, -115, 77, 159, 108, -116, -41, -65, -199, 56, -232, -62, 24, -19, -30, 48, 25, 202, 164, -73, 78, 3, 202, 37, 40, 0, -50, -94, 12, -5, -127, 2, 3, -41, -71, 91, 20, -109, 331, -22, 162, 167, 8, -109, -130, -79, 2, 23, -268, 24, 134, 107, 190, -116, 110, 182, 36, 114, -150, 11, -112, -178, -16, 206, -205, 75, 157, 295, -179, -23, -190, 170, -96, -167, 193, -107, 30, -133, -129, -23, -59, -4, 170, -202, 191, -113, -67, -196, -61, 345, 67, 233, 71, 320, 87, 47, 83, 84, -83, 116, -95, 59, -135, 107, 56, 27, -56, -61, -128, -188, 78, -65, -234, 24, -152, -174, 18, -62, 46, 33, 86, 102, -58, -195, -7, 145, 206, -278, 55, -105, 167, -69, 47, -118, 79, 162, 39, 185, -112, 131, 14, 29, 7, -76, 79, -165]
5585a65k55N46j32R5p7Nnp5J55m3J9j93P1K4L7r1K07j81J23j20K34j11k21J53
5609@R0l11K32k9M0j43K28k00J7m2o1J34K30l47K35o4L0k2j27M10k88j47L33o
5633A92j96J85L2l27J98j39J12L0N3j1p8m7k9R1j57m7L37l16oJ66J64l14n0J35
5657b2j81N17k87J6K5n1J3k05K79k6P7j40Q6mq6j05o4K80k79K37j91L8L4J09O4
5682A34j52J57k51N8J08p5Q6j22J22j65J38l9j31J5P4j09M40l84O6L01qj56q2
5705B5j13kK70l03J91l40K11oJ99m6k24K06K7P2k21L41k59k18K85n1L2k12L6%
5729a00J29k9r0p5R9L29l25J71j3K11l05k25L47M7k68m6J61O4n6j0o6J26m8J23
5753A51k71K20J73m52J75j86J06J91J67j38k68L80l20J55k70J22J22k3J12m3o0
$$ y = [-165, -420, 126, -6, 89, 12, 17, 12, -63, 92, 49, 68, -125, -54, -30, 7, -84, 123, -58, 65, -55, 179, 68, -153, 0, 90, -221, 11, -18, 22, -121, 107, -93, -76, -118, -179, -45, 185, -162, 73, 9, 39, 17, -110, 300, 12, -135, 198, 192, -4, 181, 213, -114, 84, -55, 57, 87, 140, 129, 51, 4, -25, 66, -91, -138, 199, -117, -123, 43, 207, -107, -157, -22, -203, 314, 27, 43, 68, 17, 30, -175, 104, 78, 155, 15, 101, 97, 11, -94, -158, 122, -157, 80, -111, -73, -39, 70, 134, -18, 139, -112, -54, 54, -21, 65, -57, 65, -100, 38, -1, -132, -117, -43, -152, 288, -96, -30, 271, 263, 107, 25, -88, -90, 180, -123, 68, -272, -61, -67, 132, 86, -138, 68, 95, 167, -54, 287, 28, -190, 95, 44, 76, -136, -100, -100, 29, 0, -90, -165, -66, 263, -62, 109, 96, 307, 2, -223, 124, 171, -97, -143, 18, 82, 26, 16, -50, 76, 28, 151, -120, 100, 273, -179, -4, -190, -84, 107, 274, 136, -132, 248, -72, 83, -187, -65, 57, 34, 146, 103, 43]
5774D3J46j23k94L53Rk49QL4L20k94Q4J87l54mP9N4J04r8k15K26k09K46j27k01
5798b75L59p2J31l14O6K51O3k77L11l12K41l8l4j98Q9R7J18k33Mq7K36m9K8k38
5822a33N25m03O0l53L55j10K44p9J42j96j28R4j55J24N8l14J69J36j09P4R1j70
5844g8lj31J61K05j66j78J61j07J54J26O1k36n4L14m58L23k42J49j18rL58l39
5866a07J14nJ2j66L57r5j01M5o7Lj66N4J63j9j07Q1k1L9K2PO8m5l36J21J57j09
5892a01J45m5M9M2l45J69J23K7n0J49j70p7J48k35O8J98j7o2RJ44k27M3K08l22
5916a29J09L5N3j37p8J68J7k09K7L08r8l9j37j31J85o5o1P3J61k67K38Q0j26k6
5940d9o0K85k10J51Jj54M5K78j58k77J54j68K33j38K55m10K25k18J45K72k66k1
$$ y = [43, 189, 66, -228, 125, 134, -115, -107, -73, 247, -47, 37, 224, -130, -134, -55, -1, 103, 5, -210, 16, -193, 53, -74, -275, 84, 12, 143, -171, -105, 146, 209, -68, 243, -69, 172, 134, 100, -98, -9, 88, 206, -27, -23, -110, 126, 77, 105, -133, 392, -11, 49, -304, 51, -59, 185, 106, 248, 52, -76, 18, -137, -13, 45, -269, -100, 36, -73, 1, 92, -78, -81, -212, -51, 154, -12, -190, -29, -136, 18, 144, 205, -31, -85, 229, -229, 94, -148, 1, -117, -126, 232, -107, 7, 2, 14, -152, 205, 110, 9, 54, -13, -10, -176, -122, 41, 22, -85, -4, -25, 14, 36, 43, 111, 66, -270, -149, 8, -101, 44, -1, 48, 90, -255, -86, 37, 64, 14, 163, -7, -84, 64, -171, -103, 95, 78, 16, 25, 169, -58, -15, 193, -129, -20, 15, 68, -69, -147, 21, 38, -171, -144, 164, 66, 27, -110, -241, -56, -121, -182, -109, 52, -215, 23, 103, -23, -49, -109, 176, -34, 117, 118, -36, 9, 287, 129, -148, 6, -162, 71, -67, 188, -222, 3, -215, -70, 202, -64, -85]
5962h5M6K42k26j8P5j3l3J4K85k53j07k09L57j70O4n1L0k58J88K93j92O3J62l15
5986a11L0P5R7j41J57k38K51j98J07K25j23j73L0P0o1N6k03K39%j83J43k42L12
6009A19k69K61k76J41L4j57K66k81J39m8l8nL42l43Q0J53j00J16k21J25P2M8k51
6032i3j05R7J08K41l83n3J20K36j41j84K56o2l6l56L53l07L79j31O1j77n0K48
6054B1J09j63P2J56q5j25K25J22k69k14J14M9m6J10j68J06Pj27J08R1j25j1q1
6077a24R5J21kQ1j04L94m97q1L10k96J15j98K70j9j9k3k62M08k20k3N6K8j67P5
6101h2QM0J62k87J23k13R7O2L39k09j17J27j21o7M77j19m36L10m7l4KK14l36J68
6125F1R1J3k44J8l04K35N9K41j59j04n0J01k32L64J44k68M2J8J15j49k1j60J52
$$ y = [-85, -39, 203, -23, -41, 34, 21, -12, 2, 287, 34, -73, -282, 75, -95, -31, -82, -52, -310, -122, 171, -21, 42, 204, -111, -81, -6, 91, -50, 107, -131, 120, -78, 29, 254, 131, -42, -12, 58, -3, 53, -150, 89, 89, -94, 49, -193, 119, -150, 111, -165, -24, 10, -147, 119, -162, -23, -71, -109, -114, 228, -115, -35, 118, 18, 134, -87, 38, 110, 158, -93, -198, -101, 7, 248, -135, -188, -68, 168, 27, -157, 99, 37, 1, -355, -2, -309, 70, -61, 0, -177, -227, 21, 130, -33, 39, 195, 110, -15, 210, 332, 63, -151, -37, 12, -34, 76, -92, 14, 21, -106, 2, 93, -32, -43, -124, -29, 92, 90, 171, 67, 461, -36, -117, 193, -103, 12, -186, 84, 65, 46, 23, -239, 169, -51, -74, -18, 10, -157, -82, -74, -34, 128, -159, -36, -249, -152, -90, 249, 40, -77, 50, -71, -138, 339, 220, -216, 94, 47, 13, 15, 229, -107, 61, 152, 165, -79, -61, -365, -130, -71, 170, 11, -93, -143, -42, -274, 90, 234, -34, 8, 26, 141, -8, -29, -189, -37]
6148c7J21N9p2j30K46j45j9L6k7Jk87K57o1J30N3m27J56K63j22K8j83j55Q1K55
6172B1j65Q0J32j2j63M12l38j46J04K00n5Q3j93L1M1J15k9j80J87l5j13O3M9r6
6196gO0k12J94j77L72j96j3j17K85o3P1l26P4J85j21j65K88l54K81m2P5q1j21
6219a10K39j88r9N7J6J22j91P0L58j84k2k19N6L10j89n1J81L2l1K3k77L70m26
6242a53P9J55j76J74L3p8q2J48j72K17l48J95J28j87K6k7j00q0JK19K95m73J87
6265a9J16k66J10j7p6N1K14q0J03kj82m7L53l50RK24j82J17N3j14k65M12j14P0
6289A18j57l3K59l89L79k34J92Kk19L6Lj05K64J33m23j1M42l07J34J28l58L6n2
6312a62L79j99k17N26m48K83m72L39q7M2J45j37j19J20j10o4M00l44J69j11l9
$$ y = [-37, 84, 143, 71, -59, 187, 42, 23, 59, 32, 33, -254, 3, -58, 72, 125, -302, -146, 117, -5, 23, -160, -315, -234, 21, -144, -64, 68, 56, -107, 305, -33, -179, -75, 125, 70, 153, -40, -9, 32, 147, 118, -62, 125, 90, -23, 40, 89, -7, 53, -159, 35, -142, 230, 34, 21, -96, 189, 126, 197, -129, -55, 130, 9, -156, 132, -222, 59, 17, 92, 11, -110, 129, -59, -158, -101, -85, 37, -154, -84, 274, 90, 68, -151, -95, 215, 26, -25, 156, 188, 157, 180, -97, 273, -153, -74, 81, -95, 79, 112, 34, -48, 100, -72, 145, -203, -8, 120, -67, -41, -68, -168, -248, -247, -28, 267, -206, -19, 97, -169, -59, -76, -152, -101, 113, 33, 136, 134, -48, -95, 258, -92, -83, 141, -41, 76, 129, 15, -250, 162, 48, 118, -39, -72, 187, -202, 177, -57, 135, 137, -82, -46, -43, -148, 116, 249, -174, -185, 257, -50, 84, 212, -146, -110, -162, 217, 18, -199, 327, -121, 162, -310, 29, -58, -16, 129, -8, -127, -7, -117, -181, 219, -125, 44, -67, -106]
6333a06pj31L37r0j85K59P1j34R2K7K4q7j52j00P5l2L16k68J36R4j49J43Q9k31
6357ij47L95k78J20L8r0j38J68j96J09L60m77K85K4j46k26J73LJ09l6j71K27K8
6380A25R1j63j35Q2j89J84n8K22n5j79K32j26k63L52j56OO6j66J51l4J58k87O0
6403h2K62j75j07J71K88l61O7J46l93J84K48k46J44L7k18k5l5J85k27k5K20k00
6425a42K13j22j02J57K01j00n6J03m69L20j16K24k59J59J42j46j9l67M09L0k21
6446a61J04l2J60J4N6j84Q1j6N1J29k15l01K17R8L3n9J86j42k75P9J71o4o8K34
6470I6l0l5M6N2j64l1P8j92K22j28l2Q4o9n8J97k35K30j76J6J34k66L67K4m20
6494b90L27J59k09m0Q6j00J46M5j25l54L26r7J99j01J86j28L2Q7N6j44J72k31
$$ y = [-106, -113, -244, 93, 3, -182, 77, 148, 14, 106, 133, 157, 70, -82, -182, -107, -139, 177, -91, 45, 139, -10, 133, 222, -9, -156, 239, -39, 81, 119, 29, -109, 59, -137, -28, 332, -145, 140, 164, 18, -208, -35, -32, 77, 41, -130, 97, 125, 216, 53, -82, 0, -189, -5, -63, 159, 104, -75, 157, 31, -232, 120, -36, -30, 36, -130, 21, -13, 145, -142, -82, 180, 5, -102, 69, 357, -4, 63, 209, -184, 0, 248, 2, 146, 183, -35, -60, -95, 90, -137, -162, 58, -142, 71, -51, -153, 4, 205, 105, 49, 152, -317, 3, -113, 111, -148, 11, 153, 7, -12, -379, 30, 60, -161, -57, -89, 71, 85, 141, -43, 38, 22, 73, 202, -13, -314, -97, 1, 34, -25, 161, 19, -256, -177, -6, -70, -138, 96, 66, 31, 77, 129, -35, -66, 12, -180, 42, -86, -118, -34, -103, -161, 36, -199, 31, -145, -129, 5, -261, 106, 130, -290, 37, 196, -13, -53, 33, -67, 79, 124, -1, -355, -29, -126, 73, -28, 158, 30, 62, 149, 205, 61, 233, 2]
6516Bj88K28j12J30N1k60J44L3J44j20J4kk00o7J60J69l67K11rk51L29o6m2K06
6540A37l3j32K1j09j41K44k9L94l02m8J8j66j87K85l9j58J35R9j59K3K03L6L4
6563A26J77m23r5L73j50m1k49L47pj20K64k34k61K35k2P8j15JL09J5j48J56l93
6586a77J66K62l39J27m8m1P5P5k16K42p7J42k93l8J98m6K04k50J6j67J54K35j93
6609A1k14Q4J34J05P7k43J0L4J42l30K31j84R6P2q8P9R0k23J43j67L9J61j42J18
6633C5o9n8J0p3J72Nr8N9R8r2R7k75R1j18M13j63O7K15k55J85j35O8j86j54J42
6658a9J96j89L2L6K45k99j08K84P0j2k59R0p1J64Lk57L03k49JJ90l06J25L4J78
6682A82n07L32K0j5o8R6n3Oj2J17k99K70r9J6o0K1l0K30j33J09k74J89O4n1k31
$$ y = [2, -186, 42, -70, 60, 111, -149, -5, 28, 172, 52, 66, 64, -136, -203, -43, 126, -241, -30, -39, -290, 39, -27, -69, 137, 104, -28, -7, -116, -257, -13, -42, 352, 50, 2, 20, -146, -333, -48, -87, -245, -110, -11, -170, -147, 56, 92, 126, 303, -120, -215, 158, 8, -33, -282, 65, 58, -62, 202, -32, -293, -58, -80, -2, -117, -116, 193, 208, 60, 216, -177, -11, 251, -88, 39, -9, -50, 25, 100, -116, 126, 49, 191, -102, -140, 58, 12, 216, -34, -18, -185, -31, 204, 11, -203, -119, 15, 120, 197, -46, -36, -2, 140, -190, 41, -143, -47, 25, -63, 16, 106, -117, 26, -141, -102, 59, -83, 35, -34, -92, -82, -155, 17, 22, -76, -17, 81, -11, 86, -189, -98, -216, 197, 34, 101, 316, 61, 246, 111, 179, -7, -161, -19, 177, -12, 20, 56, 301, 2, -106, 178, 248, 236, -23, 67, -4, 160, 163, -94, 209, -40, -39, 151, -155, -30, 4, 182, -325, 7, 27, 12, -56, 40, -13, -7, -19, 98, -201, 69, -30, -14, -74, -53, -83, 147, 14, 123, -151, 38, 102, 51, -180]
6707a80K31J64m73L73q5K54j05l91K76J39j52mj18J53j8q0J03j5K5k84J23P1l5
6730b8L5j06K3J17K32j48l67L2M04k47J76m1n3q4J1J21j35R9m6j37OR9m1K92P8
6755B92l48l8K49k99K16k26M6P2O7l4N4j5k61K11K49j47j42Kl08K44M39l28j30
6778a35k9RJ06j35k9K48n4jP8j10J48j04P7j45P9J42m9k15J79M2k54L2M3J91l01
6803a87L28j21p4J29l9k40L93J1q1q5j2k5J28l45r1M40k45K11l8j24j24J87O2
6826E8q0j08N9M6J66j76k18K91%j18N5j12n8P6R1l1J94P3m90R3LJ66J8o5J52k20
6852a35K13o2l27M01qr8j49L18J54m01l3R1K54n16M04ol1p1RN0j97PNJ03j33K29
6878G1j26r2K65k71K69m4k10K18k87K23J32k00QO9K9J63k4j91j49L35m49M76k53
$$ y = [-180, 51, 215, -258, 115, 30, 284, 179, -212, 64, 203, 51, 47, -71, 82, 64, -16, 87, 72, 97, -187, -64, 7, -28, 7, -99, -76, 41, 273, 125, -242, -210, 194, -53, 123, 82, 29, -55, -44, 77, -58, 41, -5, -142, -136, -37, -78, 214, 292, -56, -94, 155, -144, 72, -154, -108, -36, 31, -3, 51, 36, -225, -14, 235, 88, -54, -52, -360, -116, 323, -5, -135, -164, -155, -49, -184, -213, 35, -19, -20, 58, -52, 96, -8, 69, -76, 3, 145, 96, -119, 60, 102, -152, -120, -77, 114, -187, 141, 20, -54, 75, 36, -204, 189, 200, 119, 34, 22, -3, 125, -220, -311, 129, -116, 95, 57, -67, -191, -4, 58, -22, -130, -71, -25, 141, -35, -253, 38, 38, -80, -25, -137, -195, -119, -28, -59, 135, 208, -282, -189, -186, -20, -2, -67, 85, -135, 78, 16, -311, 90, 82, -16, -165, 153, 307, -94, -127, -36, 218, -298, 106, 100, 69, -2, 7, 57, -140, -133, -128, -25, -158, 71, -55, -147, 118, -153, 116, 72, -138, 80, -207, 16, 148, -52, -44, 25, 54, 217, 193, 2, -147, 188, -261, 215, -38]
6901c8j19J15J73l21k2P9M4M3L8j31J73m9J14j90M0l7L6J88q7l06N73j26j61q5
6925e6J10J84j84K41l22j27K10l9J7j32K6M8o4P5N1k15J37j00Q3K28N6k44J54
6948A37l54M63m77l5M92j60R8j71J21l94L63r7j10J56O6j64K68k75k3O7j95J09
6970a15K4P0Q9j57p0K85L9l18J49L0N3l57Q7o3L59j35j05K24r5K0K46k36r5M1
6994c0J05j62J24l4l8K0Rj64L54r3o5k19R0J22r0J5N0j20qJ58P7j68J64l6n9J52
7020A54j20K60k27j4L9m14L90Rk8R5k15K72k79J49K6o2Q1k58J17J09k4K42m16
7043a14J66j82J44K2J20j42l20J69k5K41q1J70n73M73N3j99PJ58k25J62k3j3l1
7066d3j03J98j57k6K29j26l9J96m16M35k47Q5p6J84P9n4j90K82j90k28L11k39
$$ y = [-38, -157, -42, 131, -190, -212, -133, -89, -46, -8, -139, 34, -15, 99, -91, -51, -88, -52, 136, 49, -257, 316, 190, 29, -56, 54, 238, 54, 295, -27, -154, 56, 17, 34, -98, -72, -24, -88, -13, 38, -177, -40, -140, -57, 171, 227, -17, 137, -217, 246, -231, -266, 226, 66, 164, -7, 114, -280, 83, -14, -124, 32, 98, -66, 202, -73, -96, -29, -224, -115, -91, -21, 68, -89, -159, 126, 165, -153, -4, 26, 79, -278, -191, -254, 105, -30, -135, 89, -6, 14, 260, 24, -71, -30, 75, -87, 37, 3, -35, -15, -6, -170, 184, 91, 26, -193, -103, 19, -71, -56, -6, -126, -134, 24, 101, -67, 97, 61, 2, 154, 34, 294, 67, 53, 92, -322, 68, 77, 49, 144, -71, 201, -78, 71, 97, 35, 116, -142, -25, 84, 60, 302, -114, 52, -130, 14, 36, 156, 14, -306, -137, -162, 79, -2, 168, -405, 68, 121, -78, -71, 87, -138, 24, 1, -12, -43, -146, 52, -105, -131, 98, -28, -67, 129, -287, 148, -99, -14, -90, 94, 173, 119, -71, 211, 21, -207, 104, -135]
7088a35K35n0n6J79r9M1O5J3j45j34J06N7k50M06k06rj83J01NL3j61J94N3l03
7112b43K28k24K56Q3K2k03O5l3k0J5L01l27jN3l7O1R5j38k5j9R2J13j66k9k50
7137c31M96j99j73J64j52J80k8L58m54J70j89P9L9j39P9J05N1j20N6M1l8q2K44
7160A57k56K71J0k48j01J26K15k6k42K0K37k23k5K0J00n9k09L39l20K81k01J25
7182iM1J59j38q4l8J36j78J93J27j05j06Q9j01J02o4l0q1j24J11o5R1J20J57p1
7206A32k95j64L91m60M37j26J25p1k5J34j06J20j00J9L4J05K8k96q2K93k98L19
7228A14k58J21o6j1R8O2J82l07j00M1K41k43K20k20j59M65l07K96m00L68k03J60
7250I4n1r8L47j67j86m0J87j21P6J55j25k00K34j22J51Qj37j38j25J31L50k00
$$ y = [-135, 100, 50, -6, 173, 74, 115, 180, 193, 48, -86, 20, 77, -173, 233, 27, 18, -165, -64, -59, -26, -187, 7, 60, -243, -15, -239, 17, 100, 122, -81, -16, -49, -69, -54, 247, -80, -81, -28, -65, -4, 91, -47, -72, -91, 1, 114, -52, -81, -331, 165, -34, -207, -43, -195, -15, -43, 315, -139, 31, -158, -79, -40, -179, -100, 5, 56, -64, -8, 33, -5, -87, 157, -99, 172, 182, -66, -167, -41, 174, 148, -94, -74, 163, -60, -85, -65, 35, -24, -233, 106, -214, 67, -134, -9, 32, 191, 53, -31, -69, 67, -111, 82, 209, 104, -2, 87, -14, 88, 24, -6, -87, -211, -100, -165, -74, 46, 203, 132, -163, -327, 64, -396, 41, -85, 40, -31, -56, 78, -28, 92, -8, 11, 45, 150, 178, -118, -200, 93, -205, 114, -144, -23, -89, -100, -2, 60, 242, -65, -165, -124, 117, -126, 94, -126, -285, 180, -127, 169, -231, 137, -66, 94, 43, -55, 292, 125, -61, -101, 86, -35, 41, 196, 71, -129, 105, -17, 134, 142, 5, -133, -258, -127, 223, 23]
7272B3J00j25J20j35J15k07J56j43L00j97q4Q3k6O3K13j70j63L11l51J66k02j57
7294c10K55n1N1N0L8k89J75J60j83q8J10j94L24l14J74J96j86K16j77J35J7l24
7316b15O6L01k38K7O1K39m15l7K72J47j46j4J24k28k6k4O3j17J66Q3m7J17j74
7339a5j34jP5j31M22j76j69L54j59M5r7L0N4j05K1J14j81p9K72j86K14l89M22
7362B01k21K7K3l0J12k2m60K69O4J7k8j1mj5n3J30K92m00K32l05L17j66J22j35
7386d4N2J94l35J5K22Q8j47k1Q7j66j17L09j69N2J24pn1k35J18J51p1J14k03J0
7410c0J42j03J49k05J45j45M0m5l7K60j14k31k4K13o9J50J49k03K3k06J40L1r
7433B1J54p0k09j41M36l9j99J80l00R6mk2J47j0j21J39q4J9J33n8l98L65q3K20
$$ y = [23, 123, -2, 118, -17, 98, -109, 47, -96, 204, 7, -77, 6, -20, 43, 256, 86, -77, 234, -117, 49, -153, -310, -55, -106, -55, -5, 33, -256, -81, 79, -104, -192, -82, -276, 48, -266, -92, 104, -82, 134, -43, 92, 109, -215, -149, 152, -86, -59, 2, 241, -174, -211, 61, 208, 62, 48, 172, -56, -82, -106, -43, -160, 6, 89, 42, 159, -15, -149, -150, -75, -206, 216, 40, -129, 225, 66, 111, 14, 44, 98, -7, 14, 128, -53, -132, 140, -46, 168, -221, 201, -20, 7, 30, 0, 112, 90, -370, -101, -37, -20, -48, -59, -63, -78, -131, -1, 291, -109, 123, -182, 135, -31, 91, -44, 8, 202, -133, -118, 104, 192, 45, 24, 111, -55, -172, 137, -32, 20, 144, 137, 86, -149, -31, 120, 49, 163, -40, -30, 112, 9, 158, -47, 98, -47, -7, -52, -89, 171, 57, -174, -198, 15, -54, 96, 245, 42, 65, -141, -1, 30, 21, 175, 105, -104, -245, 191, 152, -47, 133, -167, -71, -75, -97, 50, 40, -81, 58, -26, -7, 126, 68, -330, 35, -48, 172]
7457A72j45r4P4p9J25L6k10K21k22k8K70j8l3j31J9J0K09p1p6L28k71j12O8k9
7481A3K57n78K84L9J17k57M4j15M97l42J91or0Q1k18j11J84p5J94m8j74M2J27
7504E6m3j9j2J18n8j41K83q4Rj03J06j35n6j38L47k65R3j9P5R9k91L83k19N0j75
7529a39R3m7J75j94K88j01On5j85Q9K9R6k22M93k02k21O0R1l6j92J83o8J70j4
7553I7j25j62L17p3k39K45m3O1k99M7J27J13p3K7K18k07J17j06mj88j0L46j91
7576eO8m2j03j6MJ96o9j06j22J13m6L78k3q7k83j69M16J33k74P4j34K30q0p6O6
7601D3q1J84k42K7K30j08k41J11J80n9Q9O5j23Jk88J27j43M65j86kJ00j66J9k27
7625b25K53j41j02n3M70j71R7m71L03L4M5r6O5k74J68L4K01l96J33J93j66m7L20
$$ y = [172, 27, -67, 7, -72, 53, 89, -121, 100, -122, -150, 120, 102, 69, -62, -43, -33, 176, 105, 29, 357, 86, -26, 42, 13, 270, -308, -24, 15, 132, -125, -81, -196, 301, -41, 150, 144, 54, 135, -83, -194, -10, -85, 109, 61, -113, -71, 56, 13, -6, -18, 100, 42, -99, 184, 100, 109, 6, 112, -23, -79, -217, 130, -135, -42, -61, 14, 113, -178, 205, -14, 36, -139, -46, -93, 82, -112, 176, 75, 81, 26, -159, -70, -41, 55, -167, 326, 124, -97, -37, 54, 18, -174, 9, -59, 111, 97, -28, -190, 127, 54, -185, 60, 17, 78, -221, -174, -47, 66, -7, 20, 238, 31, 148, 42, 38, -150, -160, 186, -5, 63, 21, -82, -98, -94, 102, 33, -73, -195, -82, -128, 250, 227, 140, -143, -312, 104, 237, -37, 37, -97, 133, 53, -23, 43, -38, 146, -96, -69, 161, 53, -188, -77, 103, 44, 133, 198, 75, 76, -212, -85, -228, 237, 51, 49, 149, -17, 2, -225, 28, -113, -215, -268, 202, 31, 128, -343, -40, -6, 39, -57, 8, -266, -98, -64, 137, -259, -126, 67, -99, -146, 174]
7648A74q9jl22j3M33j47n1P0J52k38N2o5o8Q5%j53J61j56M61j92Kj52n5K39J40
7673B67j56l00K31M7j55q8K24p4j0L6n8n4L4n9L9K57j73J72k39J07L6r2o0P9j4
7698cq3L53N3m30O6J88Pl5k46N9J18k69J68Q6o1o1K14j58J67k24qMl2K80l13L19
7724A59j40k9j8M4J59J5j90K34l63m5K56o1k09J38K36l01J49j28J3J82k04J13
7746A0j41LL39k65j03K37j34p2K64j95K6K2P7j48j29M7J63j38K54ol19K28j70
7769a50K55O5J26l93m5P4L1J77l68K41o8j06J07k45L99R3j31J44j28j03q9J10
7791dj84K89p4jk23J48j30K49N0o1m8j84M79m71J15L35j94j81j48J08K71l8j0
7814I3j7j15k0J59j20m8J73k48O8P7J8J48j32M1L6j70j91M30j29m3K07o2k22K
$$ y = [174, 85, 84, -238, -251, 182, 35, -16, 54, 206, -32, 20, -45, -113, -28, -28, -181, -20, -176, 285, 93, 95, -57, -112, 127, 267, 111, -189, 42, 89, -66, -154, 70, -4, -14, 22, -36, -90, -56, -115, -76, 181, 8, 180, -59, 48, 84, -8, -68, 11, -3, -86, 267, 320, -110, -44, 144, 151, 116, -130, -71, 47, -222, -54, 32, -29, -90, 124, -34, 133, -91, -99, -95, -127, 153, -160, 159, 19, -10, -28, 16, 175, 190, 0, 234, -129, -174, 82, 21, -188, -50, 186, -115, 34, -94, -81, 101, -103, 10, -131, -128, 211, -54, -157, 80, -54, -126, 138, -57, -31, -9, 68, -80, -209, -162, 1, -137, 117, 111, -208, 20, -150, 105, 170, 296, -97, -142, -68, -37, 140, -228, 13, -55, -161, -54, -299, 100, 193, 62, 206, 78, -25, -114, -4, -188, 101, 27, 26, -197, -49, -179, 70, 120, 59, 11, -173, 306, -165, -50, 285, 91, -90, -238, -130, 141, 103, 93, 76, -39, -59, 100, -20, -68, 105, -143, -75, 2, 20, 168, 36, 77, 113, -57, -248, 182, 53, 10, 217, 155, -67, -65]
7838f5J41j79K80j92j65K37J37q8k01J2r5P9j13J44Ok10J35J85R0k37O5p7J00
7861a1L1q0k21K49r2P3K2J71l17M29l00J6K46j13p3j63pP1J39l7j49K33q5j81
7885a49K12j7J80m09N1J11Q2k45RJ86l01M68j56j41Q0K72k10M1J73j37M1j34j11
7908a04j02L07q0J62n14M16N2r0J87l1k25K70l37Q3K02q7j75K1k7J27m2j58K63
7931A18l26P5K59l9j34MR2L7L6j15R6K24n99K2L30m9K41o0l93O3J52j22P9K2k21
7956b08J77J55j2l31L14k51L16Qj40np4J14L6K4l45M97l95QM1k4k8J44mq3J99
7981A33j16K1o2j70J63Q9L7J1m8J0j93L04r4j5j5m5n2K41p2j05J31k73M38m92
8005a74K40P5j18p6n9K2L9O8j48P2O9k6M6j10J37j15K4M8o6J48k97L22l6j97Q6
$$ y = [-65, 76, -103, 177, -15, -180, 57, 194, 106, -95, -83, -178, -99, -212, -68, -62, -272, -137, 48, 138, -99, -34, -111, -11, 20, -60, -281, -32, -124, -51, -29, 142, -175, 254, -46, -30, 216, 103, 30, -133, -140, -69, 70, 33, -116, 117, 32, -149, 63, 46, 226, -183, -132, -21, 61, -184, -175, 11, -290, 178, 22, -119, -39, 233, 23, 64, 237, 100, 141, 7, -104, -206, 101, 21, 183, -331, 85, 137, 47, 234, 203, -22, 248, -89, -6, 196, 109, -66, -45, -72, 55, 13, -145, 118, -208, -133, 126, 87, -47, -43, 49, 86, 122, 7, 103, 327, -272, -250, 80, 31, 272, 212, -181, -118, 34, -88, -9, 13, -208, -31, 124, 112, -219, 95, -156, 160, 168, 28, 23, -51, 63, 99, 123, -222, 275, -120, -112, -71, -95, -123, 21, 17, -66, 133, 17, 38, -24, -194, -31, 58, 95, 106, 58, 68, -125, 179, 85, 70, 55, 10, -42, 199, 127, 22, 153, -120, 318, -174, 66, 141, 23, -53, -112, -90, -51, 17, -131, -59, 10, -16, 30, -80, 57, -58, -34, 14, -52, 96, -201, 121, 85, -112, -26]
8030b6j75K05j23k67L99l0j06o5m4J55N8q6J5J41q6J61M4K1j56n7K73j33j14J6
8054B0P6m07K89l5l2M0O9Rj02J0L3o7J31j74j9L17q5j62L8q7L38l00j4P7j4J39
8080H8m9k23K57J98k37j5J3J11j33R9j12j29N4J17J0J66l64qM54k83l4l76L13
8103h3KJ18q6p3j75L27J36k20k5l2n7J00J39M0j0r8k3K6r4J75n3j01M01m91j06
8128b63J16l2K60k31J87l0j89K76j8j5K4k91L65j65p4J25K3rK7k49o1K50m6J19
8152I9m4J22Pl84J16K55j69r3J79Qk94J39J00j44M5J5J11k38K80N1n2K9qm3j70
8177h3J30K05k73k6j04j1J96k97J6J45P7O7q0r
$$ y = [-26, -201, 4, -119, -386, 13, -17, -123, -188, -232, -77, -19, -105, -90, 51, -35, 126, 170, 191, 35, -22, 251, 118, 4, 20, 96, -311, -22, -57, -89, -49, 20, 29, -73, -63, -30, -97, 34, -140, -159, 158, 73, -89, -51, -138, 200, -100, -114, -37, -51, 88, 39, -184, 73, 271, 34, 19, 32, 143, 10, 109, -3, -132, -78, 39, 49, 215, -149, -157, 297, 14, -20, -396, -83, -81, 37, -49, -122, -297, 30, 166, -54, -79, -111, -168, -68, 71, 111, 101, 3, -20, 6, -88, 87, 34, -67, 334, -157, -263, -147, -179, 81, -150, 37, 7, -182, 94, 76, 61, 85, -206, 159, -6, -80, 45, 68, 59, 86, -163, -224, 26, -20, 99, 55, 177, 184, -200, -84, 171, 2, -91, 88, 96, -198, -59, 41, -103, -58, -43, 68, -170, 110, 161, 109, 138, 130, 87, -83, 47, 252, -21, -47, -151, -162, 34, -263, -247, -102, -25, 42, -38, -47]
8191d7
$$ Imaginary data points
##PAGE= N=2
##DATA TABLE= (X++(I..I)), XYDATA
0@%%%%%%%%%%%%Qj6J6j6K0k8L2m0M8n6O4p2Q8j04J20j38J61j85K10k39K71l06
34a62L46l90M37m89N45o07O76p52Q34r22J018j125J242j368J506j658J828k013
52a054K218k450K709l002L335l718M168m701N343o137P145q471J0304j3008J7396
67A0077k5672M6416j90158l18063N63931L20262l98922l13323K48556K14342p3862
78H3584q9699l9026p6296J18657K18844j18825l42293Q1682L89946j1626l83147
89a68199n2039L08068R2586j99898r8987P2108O9925M3024j3144j29468m4061
100a20085J75451R4733j83143j10031J60309R5369j20650m5714P6299k7038m1927
111d6427J05030K5026j72595k1368K13062K6700k23338k8094K04094J5227j62290
$$ y = [0, 0, 0, 0, 0, 0, 0, 0, 0, 0, 0, 0, 0, 8, -8, 8, -8, 12, -16, 16, -24, 24, -32, 32, -40, 48, -56, 64, -74, 87, -98, 112, -127, 144, -162, 184, -206, 231, -258, 287, -320, 356, -396, 438, -484, 534, -591, 651, -717, 789, -869, 959, -1054, 1164, -1286, 1423, -1579, 1756, -1962, 2206, -2495, 2848, -3289, 3856, -4615, 5689, -7319, 10077, -15595, 30821, -159337, -477400, 86531, 406793, 7871, -305452, -56896, 157446, 83584, -6115, -45141, -121437, -2780, 216064, 97239, -245054, -163372, 226574, 214948, -168199, -220238, 87830, 180416, -19482, -118469, -46361, 23564, 66588, 53444, -76024, -120085, 55366, 150099, -33044, -143075, 17234, 112603, -8047, -53761, 22538, -4500, -46427, 58603, 83629, -88966, -110334, 102728, 129428, -93910, -122004, 82090, 97317, -64973]
122f4973J4562J08357o6126n8561J27232K0068j88346j582K33224k167k52214
133a30526m677K41320J5203j98592j5611J38536O284o6086J9746L80n2702N0895
145D170Q5876q1736j14009Q9086J24992q1438j20473O2129R6446m2358n9362K5455
157a1222J5206j5120K8162R592o2828o206Q5464J002r2265P969Q8436k2604p5355
170d9769M2410N9133o1715m3473P9240L1511q8034j8945Q7475Q445p6151N652
182b4221N4191k5119l0812M7668N485p5527J1587R9373k1220j17668K0274J23875
194F7886j2163j13768J499Q9890Q352n0956j0388Q447N449L4387R647o8221k8843
207e8782Q7422M9362r1732o5814Q0085P1233n8027o4138L0495M4625m350j6039
$$ y = [-64973, -50411, 57946, -8180, -66741, 60491, 80559, -107787, -109369, 123855, 121688, -130526, -135203, 106117, 121320, -77272, -92883, 45653, 51937, -14149, 5597, 5977, -46725, 4170, 90046, 8310, -105699, -16613, 108379, 26941, -93532, -31403, 65043, 22685, -36677, -11222, 3984, -11136, 17026, 26618, -36210, -42416, 43048, 44050, -48215, -40246, 48190, 25586, -49769, -7359, 51774, -9941, -53414, 25826, 57337, -30697, -49642, 37833, 46278, -29873, -24221, 29970, 4851, -25961, 21707, 27192, -48335, -36748, 62625, 41405, -76263, -55989, 67886, 55723, -58045, -56546, 33344, 41696, -9260, -19648, -11201, -5752, 28635, 38282, -29939, -58782, 28640, 78002, -13730, -79544, 541, 71774, 13747, -50391, -19896, 24729, 20379, 4340]
219D340j6969j7172K7651M7761l1032p1505K5559Q2521j6145q1330P724O8423
231B9826o20m6872M58K2724l591J852J3274k0804k2041L3904L0700l9887l5474
244c6551L9780L3409l7562k7531L1593J4948k7336j865K3041j2158j9554K3161
256C375J6833l0239j3082L2527Q625l0037k426K5410m981j7817J3464J1400k0478
269g426n397K7578R67l1336K073L2900l784l0740N006K6044o876j8946Q072Q633
283F768j0923l3J2432j0707j5035J8547J6008k4188j6103K7058J6375k5810j3531
296a9142K2986J1363j7282n280J0738M18m353O645j638j3119N820J8689q707k3590
310a6452R035K4836r130k4263P652J9703n830j3741M468N619l732K014L066r296
$$ y = [4340, -12629, -29801, -2150, 45611, 14579, -56926, -31367, 51154, 35009, -46321, -38597, 29826, 29206, -17666, -17208, 5516, 1925, 3777, 17051, -3753, -25794, 8110, 38810, -1077, -36551, 3229, 36638, -924, -28455, 3138, 18086, -9250, -11115, 11926, -232, -19786, 3375, 20208, -10031, -23113, 9414, 18039, -11998, -14424, 10986, 6005, -11812, 1652, 13052, -7426, -12823, 14755, 15722, -15614, -13541, 19359, 15575, -15165, -10159, 15885, 9009, -9937, -1865, 6768, -4155, -4188, 8244, -2463, -17498, 1049, 17057, -7131, -23234, 3824, 20199, -5611, -19142, 3844, 15207, -2075, -7355, 3383, 3801, -552, 6093, 4455, -8664, -2844, 15845, 7138, -16452, -7417, 17419, 8289, -15974, -8322, 11381, 5551, -8190, -3722, 1897, -1835, 179, 3245, -6051]
324f051l772J4469M690j7060m911J8607O547j7186m746J4725M263j0997j962P534
338D150p00l874L794k01o578K139Q910o095j0956P349J0168q827j0055Q438Q389
353F051p480n257O000K509l551J114K406m122k92O584K51q268j33R114J861q639
369a852j676O952J557m735m98J403k115J054M660l316p995L286R795k857j1215
384g552M19R018K537o498m337J395N948M240l928p579J050J0451M407r487q446
399h362O145J2185r74j2434n795R237J1316l415j4832n052J4264J2008j1075j7728
413a4512M502J8604K181j5412p998Q022J1854P91j0388r903N680J6551K417j8701
427f312j0932J6870J9325j0072k3591K726K3953N468j9073j1407J0619J2929j729
$$ y = [-6051, -9823, 4646, 9336, -7724, -12635, 5972, 12519, -4667, -9413, 5312, 9575, -1422, -3384, 4150, 3450, -424, 3370, 3169, -3409, -1270, 7640, 1545, -9411, -2062, 8106, -721, -10776, -2338, 6051, -1429, -6686, -686, 1823, -1728, -614, 1792, -2330, -2622, 3962, 4213, -4055, -4188, 4926, 6787, -1852, -3528, 3424, 4981, 246, -252, 1151, -964, 90, 4750, 1434, -6561, -3275, 6520, 3663, -7552, -7133, 1885, 4422, -2076, -6413, -5018, 930, 5170, 1242, -6337, -5287, 5164, 9571, 84, -8362, -2217, 9968, 8994, -3440, -9235, 2, 11318, 7903, -6929, -11981, 2283, 14291, 3216, -14512, -10010, 8594, 10775, -4637, -12635, -4613, 7241, 8032, -2356, -12259, -6579, 9972, 12389, -6312, -17244, -374, 18951, 8879, -14712, -11986, 11967, 17435, -1638, -13045, -2426, 10503, 8774]
440H774r948p882K758J2152O456j3588j5771Q407K2126l33k4250r937K2175J8273
454A9412j4780k2427N821K3078K817j6629q222P776R472K398n245j0046l563J4149
468D011J4011j2437k3543N490L0006L117l1528j2918K6886J8999j9427k0493R587
481h239J5507j835o159j945n904J614J6364N096k4368j3354K7387K4502k3998
494D668l1892J7305L5057p245l2969j553K5455O833j4946q265L205L498N755M862
508I768j0592j5985R191K5268l461l1747o567L3316J6754k9163k4602K1158K8862
521B2200j0812k6415K490J9867K279r889j315K44m277P921J4289j0968k5711R450
535a0647L4478l861l9896m357L8349J1063l3340j5140K4287J3251j4286p314O329
$$ y = [8774, -1174, -9056, -6298, 5854, 12310, -1278, -17049, -8642, 13484, 13151, -11099, -21036, 1139, 19412, 4632, -17795, -11974, 11104, 13921, -2708, -10930, -3154, 6318, 8716, 3471, -6575, -10138, 4011, 18022, 5585, -17958, -12468, 17538, 20655, -10873, -23791, 3095, 22094, 2667, -17826, -8239, 7268, 5433, -726, -2671, -8575, -6961, 9403, 14499, -9869, -23223, 4164, 28666, 4668, -27224, -9919, 25138, 17893, -15076, -16629, 8826, 15659, 713, -7552, -4347, -849, 4906, 9768, -824, -16809, -7618, 17650, 14189, -17558, -24125, 9191, 25945, -3218, -27820, -6662, 22200, 11388, -15027, -12537, 7330, 9609, -280, -1595, -1351, -5628, 2293, 16582, 5614, -20097, -10647, 23831, 19970, -19926, -24283, 14066, 25129, -8211, -23351, 936, 14187, -99, -7413, -1084]
548a084k668k674J4320M415k3883j0013L0439J8722l0658k6515K6949L1903j7848
561A1405l2097O607K8125K181j9459q146Q726Q427J837m186j0049m536J2667J4807
575A6309j1136k4518L658L0618N553l1774j5710K8664K3796k0807k7974J2205
587a1116K7193l108k1159j717J2504L334k314J7o483o406J2829J4261j5621k2129
601a9915J3260K6882r349k8539L275K6547R09k1533l642J4908L076q157l83L289
615F28m169o76R287R88j2386j981J3858M593j2236o249R270P823n619p584J826
630b627O091M43l550j336J075m53L74J929j106n532K40P882J718r757m424R807
646G74P313q200q715O250R442l744p971J821O111n94k012J044j379k269M295M115
$$ y = [-1084, -3752, -6426, 7894, 12309, -11574, -21587, 8852, 27574, -3084, -29599, -2650, 29253, 11405, -20692, -14085, 14040, 16221, -3238, -11384, -2658, 5769, 7606, 3420, -6629, -11165, 1502, 16309, 5173, -19345, -15687, 14931, 20484, -11290, -27000, 1664, 25460, 4653, -23321, -11116, 16077, 12969, -8190, -9907, 2597, 5931, 3617, 3634, -2849, -9255, 3574, 17835, 2214, -19915, -6655, 20227, 10878, -17661, -14386, 12161, 13070, -8463, -12105, 2803, 5879, -2278, -2661, 628, -3541, -4217, 5070, 6058, -6328, -8309, 5549, 10142, -2094, -8343, 927, 8750, 3131, -4453, -2627, 3464, 3907, 357, -979, 96, -357, 17, 1946, 840, -4692, -4452, 3430, 5148, -4609, -9033, 774, 8087, -113, -8828, -2578, 6864, 3120, -4851, -3030, 3081, 2487, 475, 1519, 140, -2129, 2166, 6281]
662F281o573n869O906O747o815p457M856P080l223n915J116M013n09k360K22R79
678e21p11p5J506l35j293N23J997J87j099L70Or8R96L84j424n36J068J333j203
697A075j645m26J459J450j432l213j10L616J304l941k771L569L823j777m380K98
713c101M891J015l370k644K389L166O41l264k493L277L914j401n076l54N326J435
729D351m630l152L144L311j095l902j190L100K457k695l207P40L340R14k679k198
745c391K128L537p26l206k41L278J461k188j632J181J858j47j647r49J260J538
761B114j083j647j25J325J91j274q59N54N23P0j294K75R14J68p13j81O20N42k53
780a33o52N01R12m7l16J80L81M06p65r1M02J34k67k94l63L32j15k70l80J2L36
$$ y = [6281, -292, -6161, 745, 7492, 677, -6780, -1924, 5156, 1933, -3982, -2866, 1147, 638, -1722, -1500, -521, -1232, -1307, 199, -136, -1429, -906, 1091, 1278, 179, 549, 555, 457, 1453, 1837, 413, -123, 945, 2278, 1075, -570, -996, 463, 1913, 481, -2732, -2842, 774, 2078, -1863, -4634, -1065, 2758, 981, -3399, -3101, 1790, 2805, -565, -3209, -820, 2346, 2987, -277, -2770, 507, 4421, 3020, -2056, -2410, 2916, 4351, -279, -3431, -287, 3024, 1929, -1973, -3163, -63, 2394, -301, -3508, -2768, 572, 1486, -1193, -3391, -1263, 2274, 1548, -1658, -1899, 1379, 2840, 652, -980, 201, 2059, 1912, 265, -684, 576, 2114, 1031, -616, -741, 584, 775, -499, -1358, -804, -281, -211, -1505, -1230, -316, -148, -861, -1042, -422, 120, -133, -785, -284, 628, 581, 265, 445, 826, 1232, 467, 376, 778, 912, 645, 351, -12, 320, 205, -65, -445, -433, -97]
801i7n00l73l00M78Q4k54m01P54M94k36j54P55L67q39N93P18l10n21K19Q01l90
822H88k68K94l27l43P16k95j048m55J152Q5j110j059Q48J385o07j476L98R02M61
841A41n94n44k26J255J291q46k218J621K719o27k894K70K321J94j456p35O65L70
859G07L54l08j753n34K157Q50k442j854K189J908j743j834Q97J687k59k02k64
876d44n90O49J967n16k331L75L389n44k584P30J284l68q69J055n79j966J072K578
894B308j451m238J981M000k110m203K078L649k087k551K097J684k778R9L608j021
910A065l948K401M232j926m614K192L916j185l846O04K871O3k148J08N40k19M28
927E34j78p41q74N24N81j42o09m35m9K048Q74l369j330M555K280n247k449N833
$$ y = [-97, -597, -970, -1270, -792, -708, -962, -1363, -609, -115, -351, -505, 250, 617, -222, 371, 1089, 779, 258, 477, 1278, 888, 620, 914, 587, 244, 960, 665, -383, -838, 314, 399, -711, -1770, -922, 463, -144, -1620, -1222, -320, 141, -453, -997, -1223, 32, 1323, 477, -1741, -120, 2599, 1972, -922, -652, 1669, 1863, 407, -328, 337, 707, 1061, 753, -1000, -1534, 623, 1473, -969, -2823, -634, 1274, -469, -2303, -1406, 281, 22, -180, -444, -1034, -385, 1582, 1066, -1265, -890, 2499, 1955, -629, 101, 1385, 1017, 148, 1203, 624, -1342, -270, 2308, 857, -3381, -1400, 2600, 490, -3713, -1635, 2014, -73, -2624, -527, 1157, -1621, -1522, 2086, 1065, -2883, -482, 3750, 1824, -2790, -598, 3318, 2133, -1713, -1109, 1762, 1825, -323, -215, 325, 106, 534, 356, -385, -1259, -735, -154, -296, -905, -1340, -1389, 659, 1533, -1836, -3166, 1389, 3669, -1578, -4027, 1806]
945A806K406n541j506N984K41n935J577N579l129o290M485O674o040p071O700
960f0O514p103o448P480N177p623l915P235K237o899l15P087r41o836K201O816
976D607k510o157K795N804j938n425J240M746n46m131J70K995O40k608j527K526
992F81N65k372j317K752J444m123j351N712J303p077r24Q430J030r646J58J0229
1008E494r86j0147K310J0245l526r511N001Q989o672q172P750P173r121o573R781
1023B035N208j0159m081R919K417r634q57Q842o18q259J821P854l066o351L408
1038a521N759l341m196K826L611j753k682P62K203o4j601q44J392J723j872k053
1054a651J847K160k921k602L649K767n662k118O722J497p379q24Q306n6q994J332
$$ y = [1806, 4212, -1329, -2835, 3149, 3390, -2545, -968, 4611, 1482, -4808, -323, 6351, 311, -6760, -60, 6454, -649, -7097, 383, 5560, -2063, -5978, 1257, 3494, -3405, -3720, 3367, 2426, -4410, -2209, 4607, 2097, -4060, -1265, 4539, 2601, -2824, -1584, 3162, 2616, -1515, -1345, 1650, 2290, -318, -1845, 681, 1246, -1126, -2443, 309, 1753, -2370, -3721, 1991, 3294, -3783, -4707, 3723, 4753, -4893, -4735, 5494, 4508, -5639, -3329, 6916, 3390, -6121, -1120, 7869, 1197, -6975, 775, 7948, -1173, -7746, 2035, 7243, -2916, -6997, 2922, 5339, -4295, -5152, 3690, 3072, -5187, -3366, 4488, 1422, -4929, -1521, 4238, 897, -3299, -473, 3138, 1385, -1297, -535, 1668, 1604, 3, -841, 551, 2274, 402, -1651, 196, 2356, -565, -3167, 482, 3249, -2413, -4531, 2191, 3688, -3691, -4515, 3791, 3735, -5259, -3927]
1070c927R382k346q856M180Q075n210p129O688N662p334m199P820K831q887j240
1085d490Q499l27p963J649O625k521o049L433M476m207k966M217J462l679p73
1100b614L941m35k422J303J986k039o20K393l10k384J655J934k364j439L265K44
1116B094l727Q72L469k084m011L698K622m333k345M938J376n571k15N795j131
1131A447n329K412N010l489m125M766L237n203j796N709R21n724O40N362k035
1146A803m993L149L901m005k836M449J528n290m14M877j064m546J992L691k835
1161e93k651L977J603m274l29M324m00m118J567L783k166k876K792K046l253r52
1177a520L907o58l678J565L298k861l036L327K016l825j136L902j11m012J501
$$ y = [-3927, 5455, 3109, -5747, -1567, 6508, 1298, -5831, 857, 6519, -815, -5014, 2806, 5637, -3250, -4490, 4009, 3682, -4281, -2632, 3993, 1472, -4577, -1144, 3332, -875, -3841, 376, 1838, -1841, -2614, 1327, 892, -1530, -227, 1759, -280, -900, 1493, 1183, -1201, 454, 2388, 24, -1415, 1850, 2094, -1633, -761, 2708, 624, -3387, 311, 2933, -1400, -3745, 1193, 2569, -3002, -3217, 2578, 1447, -3882, -1470, 3540, 51, -4074, 692, 3929, -1274, -3070, 2639, 3560, -2164, -1524, 3838, 1803, -3190, -41, 3860, -145, -2981, 1468, 2996, -2294, -2708, 2169, 1105, -3441, -1449, 2242, -593, -3244, 733, 2336, -1938, -2267, 2057, 1657, -2461, -894, 2889, 723, -2153, 639, 2685, -568, -1520, 2387, 1729, -1949, -384, 2914, 53, -2983, 344, 2360, -1465, -2601, 1301, 1190, -2822, -1321]
1192a321L355k531k506L251J933l637j323M747J49m485J264M175k265k774K875
1207I07K234l645j496M200L08m454K00M487j544m075K194L179l038k442L457J304
1223A776l827k25L713n04l705J749L526k458k353K745J748l066p14K965P3k473
1239a030J009K580k123k241L107J226l529o14L306N4l443O17K915j843k122K440
1255C09J077k875n17K993r2l209J265L103j606k451J624K515k405j309K763N34
1271A719k473K01K616j138k418J809J754k375j226K218Q04k697k45K558r28k108
1287a929J095K104j672j864K281J503k693k22K396m9k345R86J959j382j186J857
1303H39R06j747o54K023p9j939N0J772j013r99O97P86j163l81J487n35j323P07
$$ y = [-1321, 2034, -497, -3003, 248, 2181, -1456, -2779, 1968, 2117, -2368, -1104, 3071, 806, -1968, 907, 3141, -504, -2000, 2200, 2508, -1946, -1746, 2741, 1197, -2878, -684, 2495, -543, -2985, 472, 1776, -2051, -2276, 1437, 933, -2772, -1023, 2503, 45, -2308, 437, 2185, -881, -1595, 1370, 1443, -1030, -21, 2559, 436, -1805, 1302, 2528, -1001, -1615, 1691, 1745, -1698, -1081, 1834, -9, -2131, 309, 1386, -1489, -2006, 987, 895, -2314, -1049, 2054, 448, -2003, -379, 2136, -269, -1578, 1185, 1719, -754, -553, 2063, 925, -1493, 316, 2070, -305, -1531, 687, 1491, -1206, -1451, 1107, 179, -1929, -834, 1270, -402, -2266, 15, 1518, -1175, -1397, 999, 950, -1395, -409, 1550, 168, -1018, 839, 1745, -2, -656, 1367, 1288, -651, -601, 1171, 158, -841, -144, 642, -521, -902, 585, 50, -1273, -566]
1321e66J074j041o66Q31J030j338pJ448m16r46O14J606j310j041J282J004j558
1338@o52J466M23j515j28J491o16j451Q49O40j030q68R68Q51j141m66J046L90
1356B57q02j17O62j23k71M79J51l11M2P55o2p05M58L05n0q22P28l15k58J57L08
1377D66m50m76M74M96j032m05P09M36q41j61L69M62j77m81P79j5j27k45M06L73
1397E60p25O1Q47j68n94k2Q75J98j012k58O77J91p53n48Q56K82q75o96J230Kj185
1418a057M02R62j50j081M45J093k56j296L45J254J2j220L03R86R5j198J94J041
1436H74j45j005J5J163m40j339Q17J088r78j577Q32J489p22j916R39J709n58j924
1454a678Q52K231j162j809J257J794j079j634J644J561k251p43K036R45k309j301
$$ y = [-566, 508, -533, -1199, -368, 662, -676, -683, 765, 349, -597, 17, 1623, 313, -728, 554, 1558, 0, -652, 814, 1237, -278, -406, 1085, 469, -982, -133, 507, -523, -1391, -423, 428, -713, -1179, -133, 257, -545, -662, 0, -123, -394, 85, 236, -75, -33, 722, 660, -45, 413, 718, 668, -154, 574, 259, 1, 158, 466, 16, -460, 14, 510, -522, -927, -218, 218, -623, -784, -415, 47, -130, -611, 168, 153, 26, -219, 187, 560, -165, -104, 743, 575, -19, -41, 834, 1032, 20, -238, 439, 630, -123, -671, 185, 467, -408, -1104, 126, 128, -1057, -655, 307, 157, -924, -479, 614, 358, -938, -593, 661, 673, -547, -244, 742, 837, -361, -167, 874, 729, -276, -261, 902, 462, -877, -60, 1028, 50, -1527, -695, 794, 72, -1844, -905, 804, 246, -1678, -826, 1405, 243, -1566, -309, 1485, 406, -1228, 416, 1977, -274, -1017, 1019, 1964, -345, -1646]
1470a646K792O62k655p74K565O07k564o40K181K03k027JJ898j58j892M81J795
1487H29l52j899Q42J816n47j802O32J945l05j941L55J655k89j617P6J502j3j756
1505h69M52J447o63j829Q05K242j580j986J066K562j477k434J696K464j740k233
1521b077J792K319k075j763K366J654k657r58K654O12k827l01L136l31k659o6
1537a181K495m75k302N24J871o25j475N11J103n00j186R52P04o88m53M83Q39m06
1555A91n77J06J107l26q36q9J128K14j183j35J371j54j545K5J243J22j701L68
1573f71J708r51j843J191J944j771j432J911J405j965j114J947Q01j716p45K170
1589H69J11k148N85J980p22j723J139J734j590j116J318N55j241p51J443P3j308
$$ y = [-1646, 1146, 1808, -847, -1621, 944, 1551, -1013, -1653, 528, 731, -1296, -1295, 603, 445, -1447, -966, 829, 477, -1422, -580, 1236, 689, -1113, -481, 1464, 1159, -782, -427, 1228, 939, -678, -602, 900, 887, -869, -417, 1030, 367, -1462, -657, 1585, 5, -1981, -915, 1647, 170, -2264, -568, 1896, 156, -2077, -285, 2034, -41, -1804, 562, 2216, -441, -1399, 1255, 1867, -960, -1261, 1875, 1544, -1115, -1181, 1314, 839, -1463, -939, 932, 307, -1168, -657, 446, -54, -1240, -288, 416, -272, -725, -242, 597, 191, -386, -280, 827, 501, -335, -424, 704, 918, -265, -400, 971, 817, -728, -703, 540, 662, -1039, -671, 1037, 86, -1757, -566, 1378, -393, -1825, 86, 1491, -474, -1588, 359, 1160, -556, -1301, 869, 980, -1168, -583, 1397, 675, -1048, 91, 1825, 235, -881, 437, 992, -249, -1000, 443, 516, -792]
1606g92o2J152l15j101J099M28j092k02R12l70R3K39L9j98oP56l39m15L99O52
1626H77o39j093J223O25r95m26J136J18j394J14J295q47j331J279R91j779m64
1643a310J537M10j760K83J462j97j559Q02J388j198r73J474Q45j681j99J653K77
1660A254j822K08J599m90j442P99P67j099o38J208L9j266L27J003o80j052R68
1677c17P49p44l91R30P8p15K26R32o07n43P13M99r02l06J186J94j706P16R56o57
1697B91r33Q27P31j279n94J233J84j357J9J410l11j432P75J000r19o91J117P41
1715H12j262L7J095m3j194K62J728r47p70N06P60q79m65J050Jj151j10J167n08
1734H9r47J182K41j007l45Q24L23r56p3J020k99o55Q13K33r42J57J172j80j215
$$ y = [-792, -854, 298, -17, -1118, -19, 409, -683, -885, 27, -343, -250, -11, 28, -170, -176, 580, 241, -174, 225, 877, 238, -855, 368, 993, -2, -428, 708, 826, -568, -454, 841, -6, -1337, -58, 933, -846, -1310, 227, 637, -1123, -840, 622, 425, -1134, -332, 1056, -142, -1115, 359, 1204, -477, -676, 977, 1254, -568, -360, 1239, 749, -693, 106, 873, -226, -864, 344, 383, -883, -556, 447, -233, -1285, -317, 432, -312, -703, 227, 305, -410, -184, 748, 141, -402, 311, 810, -92, -398, 788, 982, -724, -8, 948, 291, -642, 185, 916, -363, -957, 276, 460, -897, -878, 532, 221, -1211, -436, 564, -355, -1046, 71, 812, -450, -413, 682, 639, -555, -293, 1435, 488, -282, 224, 984, 105, -360, 690, 691, -460, -570, 597, 89, -858, 324, 565, -442, -787, 37, 360, -596, -669, 351, 52, -603, 210, 443, -499, -342, 830, 650, -565]
1753e65L86J106m96p45K91J194j196k52P83O4r14M0P66k46r49O33Q39j107m10
1772g78R08K91j114J43J120m51j028P18R01r96k80J018M11j240qJ038j07p46J71
1791b9R86q64p67Q20N28j040l13J108l6j079J49R13k40j149K67J253p36n27Q31
1810G5K01n44j66Q32j09m13L00P90q22m49P34R3n95O7P65n25n64N34L14r34j86
1831f02Q79K11j186J64R75n30p64O33Q32r41n24J212P4j072J74J009L55j485L41
1850b45J219n92p93P40L57n25m76O72L73j001K07N62l04p31J97O54m30m79N51
1869d4Q7l88K5N52k84n10O31N00o63l32Q54K6j131Q42N02l06o05L00Q05q41l12
1890b92O56M94j325k69J200p9r29J7P95l70n06J05R20m24n73K27M96l95j61O85
$$ y = [-565, -179, 927, 431, -314, -23, 1171, -25, -277, 506, 570, -344, -304, 462, 216, -733, -100, 739, -368, -778, 130, 421, -693, -550, 570, 119, -909, -191, 710, -286, -566, 452, 863, -377, -385, 653, 546, -200, -29, 957, 93, -674, 146, 674, -366, -679, 429, 393, -686, -537, 376, 136, -1013, -746, 507, -229, -756, 75, 276, -268, -434, 398, 289, -124, 176, 966, 144, -305, 429, 522, -73, -6, 759, 234, -330, 204, 518, -416, -602, 277, 488, -698, -534, 441, -89, -853, -220, 612, -329, -853, 359, 433, -639, -465, 544, 899, -586, -245, 974, 382, -411, 329, 686, 161, -315, 357, 730, -271, -64, 498, 194, -537, -340, 314, -116, -595, -44, 43, -345, -320, 232, -52, -562, 69, 569, -94, -426, 428, 454, -677, 165, 667, 361, -244, 56, 861, 20, -292, 364, 858, -467, -736, 464, 385, -544, -527, 268, -102, -608, -503, 417, -7, -580, -353, 143, -252, -413, 272]
1910B72L18l98j97K79J51k56J46j23O8q2Lj48K16J65l92m53O49L42o87m73O17
1931A7M98p23n22J081j31o15Q9Q22J09j457O13P07l15q60P20Q41j010l01O57N39
1951G59m45o84Q36M60j033n19Q91L97o78m68M18L88n89m03O63J42m89m15R28L7
1971A96n49q3Q64J49r49o0R04J83r86K21P33j97q34J90P97j30p39J41P62n68q21
1992g76M74O13l64o76M43O29m84m08L13L85j28k39L9N62k81m00J95M38j90m10
2012b65J81R01m60r18O98R23o74q14M85O53q39p62O51L82l53o85R94L20j062r6
2032g40J160J7j165J29J144M8j178J04J164k64j125P89P06n98n42O44N28p07k41
2051a27L32M20p51j0L21M1n31K20M5kk05P5J73J42l30J21k10J73L43n67M5L97
$$ y = [272, 590, 192, -5, 274, 425, 169, 315, 192, 260, 178, 181, 33, 249, 414, 22, -431, 218, 560, -127, -600, 17, 515, -208, -730, 351, 220, -395, -306, 516, 625, -832, -219, 488, 173, -687, 33, 874, -136, -437, 220, 759, 314, -370, 466, 926, -107, -626, 265, 662, -16, -484, -66, 322, -267, -670, -7, 135, -354, -769, 159, 196, -353, -436, 428, 577, -372, -432, 472, 655, -331, -110, 623, 426, -408, -218, 579, 449, -290, -149, 613, 45, -776, -302, 311, -53, -729, -286, 343, -141, -549, -236, 149, 21, -218, -179, 383, 102, -298, -103, 335, 145, -265, -84, 817, 357, -561, 137, 1060, 386, -428, 57, 710, -129, -891, -240, 142, -211, -896, 98, 418, -644, -740, 420, 437, -728, -599, 545, 593, -585, -481, 683, 419, -706, 83, 789, 191, -351, 293, 821, 114, -127, 205, 625, -126, -136, 185, 226, -305, -85, -40, -42, -247, -172, 1, 143, -187, -66, -276, -103, 240, -327, -282, 115]
2073A15M55n50j90Q29j92r04N22P79o09o73M19R63j163n08J324n7r41j33P21j46
2093F1n26Q3P18l9j134P14O51l95p69N82L40m70l95P73K10o78J07N75K8p25K89
2114@L29jn29M39J01p22J94L10k52JK03k43k4j57N87l94j75O3N38n39j32Q71J5
2137D83p90K10Q07l99n64K37O71m58o32N44P70j143k61P33L88j036Q5P29m20m40
2157d86m7R61n71m68L47O18o82j69O93J73p67M33N76o04k01M87K48l35J35J52
2177D93l22k01K87N4m23j48M95q8k01j28L00k14k49L94J34m87k34P49N8m49j01
2198b81O71k21o73K66R66p05l13M81K40n49k37Q81l42n83N0Q83k58o95J32N89
2218C02o33j04K28J81n42L94L19k85j49K40K80m57lJ74L78m65l1N87k59l47L04
$$ y = [115, 570, 20, -170, 659, 467, -437, 85, 864, 255, -418, 1, 964, -199, -707, 617, 560, -381, -514, 207, 61, -465, -382, 336, 297, -837, -123, 528, 133, -636, -54, 286, -184, -579, 194, 404, -274, -167, 408, 436, -289, 0, 329, 328, -201, 238, 339, -383, -189, 121, -131, -130, 73, -170, -194, -351, 236, -158, -333, -270, 268, -271, -403, 468, 483, -307, -97, 710, 311, -253, -16, 655, 197, -435, 109, 879, -264, -525, 208, 596, -440, -355, 374, -46, -486, -533, 428, -143, -611, -264, 354, -328, -497, 196, 369, -398, 35, 611, 7, -194, 293, 541, 206, 341, 493, 171, -30, 257, 311, -112, -260, 235, 147, -54, -182, 118, -96, -345, 49, 183, -304, -538, 211, 269, -180, -281, 390, 169, -504, -238, 728, 23, -290, 191, 431, -118, -355, 526, 184, -399, -349, 534, 276, -419, -287, 302, -331, -435, -207, -26, -568, -174, 145, -140, -289, -49, 231, -226, -229, -55, 323, -142, -173, 414, 155, -192, 112]
2239A12M87n47L1M44k43m15j44N53l14j68J34M00n93m8L83L8l04j92P37m90j85
2260c24L92J56j71n06O82M39n69k90N62j8m36J65K45r0l97K40L35n90J40M83j73
2281B75o48L88L19m80j82M94k16k09k13O87j57l51P6N08l08l61L13L93k75k07
2301a54L47M11o32k26N50j48l21L6N87l16l10M40J56o43K18J34k29k28K76r1j85
2322c28O4K58o7k77J52M22j46k44q8N90k23l48M28j6l50J75K46n3m69M67J60l43
2344A0m67O67P6o28N5K52K41l65j45P3K6j34K07J79k00K07k1N9L5k21J61J44l24
2367a13O5NK06j34K17n40J97J39N4k18k18L55K10l34j34L72k74r0J74K17l29j80
2389c53L67K90k65l03J44L90j90k39M40r2k29m1K08J54l30j96M17j68q4j69L09
$$ y = [112, 599, 52, 83, 527, 284, -131, -275, 278, -36, -204, -70, 330, -263, -311, 72, 110, -194, -386, 351, -139, -324, 68, 224, 53, -453, 229, 668, 99, -191, 371, 353, -83, 82, 327, 237, -160, 80, 415, -175, -35, 448, 275, -373, 15, 334, -146, -328, 166, -50, -259, -472, 215, 58, -293, -217, 291, -17, -378, -65, 328, 53, -154, 193, 604, -28, -254, 296, 148, -173, -137, 450, 134, -176, 264, 420, -223, -5, 129, -100, -328, -52, -143, -328, -264, -6, -73, -350, -198, 224, 78, -166, -254, 336, 113, -235, 193, 177, -173, 2, 248, 195, -274, 193, 353, 10, -457, 210, 286, -342, -287, -35, 206, -159, -304, -231, -205, -339, -132, 47, -153, 54, 33, 92, 127, -94, 67, 211, -113, -48, -43, 163, 29, 246, -294, -97, 42, 96, -122, -340, 15, 225, -109, -243, 129, -145, -235, -61, 156, -173, -353, 14, 304, 39, -264, -120, 270, 80, -159, 281, 189, -40, -81, 127, 281, -49, -245, 172, 4, -80, -249, 60]
2410F0j18P3j0o8j65J20o1K03m9j44j6j69L74j0l88L14K02P9j70J74J04l55J7
2433cK65nk63q0M85l15k60m2O03j68n93K08K98j31m37M36K11m15q0L64K11k59
2455C0l31J70M45m39j72M63J23m67j13K60L92j02l66k2M49k16l88M67k47L5l06
2476c35K38L4j53J54o1o8nj8L37lm20M8L69n8j20K20l1L4j95l7L81k60j90j0N31
2501C82j12p09M65J85r4m25M36j56J55l25R9J56q1k17J01J40J54l01J57M1J39
2522A90j30j55N4J50l78L60K45k18k79L64q1P0l37J11L74l35k29Q7K20l57J71
2543a03J15k30r8K03R9N3o98L41L72M3L6k29J67nmj41K32R4k41J11j73J76k01
2566h1J38j04n8K17j60J75Lk49o8l9J40m7o7L80J3k45j06Q9J23j17k57M48J10
$$ y = [60, -58, 15, 5, -63, -228, -108, -169, 34, -15, -159, -175, -344, 30, 20, -368, -54, 148, 227, 57, 231, 335, -20, -3, 262, 257, -6, -86, 399, 84, -176, -218, 385, 217, -376, -168, 130, -1, -438, -2, 209, -206, -286, 78, 289, 30, -301, -131, 314, -125, -297, 166, 289, -178, -291, -31, 361, 259, -107, -129, 320, 104, -284, 183, -64, -29, -335, -97, -63, -216, -62, -123, -191, -196, -214, 123, 120, -300, -252, 117, 59, -61, 159, 128, 162, -33, -70, 311, 51, -139, -149, 382, 270, -439, 26, 211, 117, -308, 128, -28, 127, -198, -99, 57, -24, -241, -140, 0, 154, -147, 10, 51, 190, 60, -95, -41, 109, -269, 91, 336, 118, -161, 203, 122, 192, -145, -34, 340, 5, -224, -137, 83, -274, -103, 12, -218, -316, -113, -14, 39, -659, -318, 54, 97, 133, -96, 71, 66, 62, -79, 153, 247, 6, 117, -56, 120, -81, 57, -47, -105, 112, -48, 127, 130, -119, -187, -226, -86, -133, -200, 180, 193, -52, -158, -69, 54, -63, -320, 128, 238]
2589B38k45jK36l25L20J3J75l48k82K47L56m49k83N33j70m30L95J60j18j35P1
2610d2K9j98o0K27N8p1k4N0K28L9k90K1J41j94M05l62n6L27K29n70j19N98l78
2633a2l00L26N08o08k93N10J45o80L39J45r0k80K01J29j9k76J03L37nn95L24N54
2655D63o40J64K05j01k61J22K64m2j43j71L13j19l18L72qk03o1J88j74q2R8j3
2677a47N5OJ55J3k76O5L21k92q8K01O1N1j15J92q7j50j13M15k17l81M79K1j99
2700c0k28O8N44m39o3K07n7k24q5M26J42m51K42J36l04n2J32K19r7j84J91O2l55
2723b00J74L23l19k27N62j42l91K54j91K25k4J22R8m01j52N55k42k05pK06L0k55
2745b07K40J53p0j81J64K27n15P7J60Mj36J60Q8j05l34K29J18j85l2J71j31J37
$$ y = [238, -7, -8, 228, -97, 223, 236, 411, 63, -219, 28, 384, -65, -348, 185, 15, -415, -20, 140, 22, -113, -42, -13, -211, -271, -44, 14, -57, -81, -31, 197, 236, -54, -33, 108, -86, 319, -43, -99, 228, 457, -113, -232, 366, -12, -312, 14, 522, -86, -379, 131, 276, -404, -65, 80, -10, -290, -89, 40, 21, -255, -152, 185, 180, -415, -91, 463, -177, -13, 192, 91, -170, -48, 216, 174, 31, -140, 173, 54, -264, 108, 100, -103, -164, 24, -150, -232, -134, -147, -92, -86, 69, 82, -194, -129, 192, -100, -188, 13, 74, 125, 10, 202, 115, -35, -148, 267, 50, -331, 148, 169, -30, -258, -190, 354, -85, -148, 59, 2, -222, -307, 119, 261, -190, 52, 188, -116, -168, -36, 183, 86, -98, 93, 155, -200, -26, 297, -22, -249, 313, 171, -220, 34, -157, 68, 44, 166, 264, -137, -289, 266, 24, -181, -188, 18, 48, -207, 33, 186, 116, -65, 99, 326, -189, -112, 48, 52, -84, 76, 164, 59, -275, -46, 72, -113, -145, 26, -105, 32]
2767C2j1j56N5k83K37J16N6k00R7J84k60jK2J28k26M46m8k60j20N02j38m62K30
2790f0K84j95k21K55M8M5j81J22j24M2j68L19k51j49J32K07l04J15L47J53k05
2811B11l20k4J81r8K33K25o04J3Q2M54n20J84L24p8n17L79J01l14J74k13K31k00
2833i6J66j44M5k02M5L85k93k43K62L38k99j8L78l30j45J93L42k69m44M90J92
2854C53k12j37J76J37l27k64L69P6k34j92J81kJ26J0l0k6n2K16l59J89Q8J08j41
2877E3n8q6J20j77L41k68j4j25M87J01o28k00M47K6m1q4J40J19m23M46j62o6p6
2900a28N7J57m03k4M45q2k14J77K29k2l6m05J58nJ38oL08l28j38K82j21r8k3M
2924g8J60R7k40J35j90K07r9j39L2L09m31o4J70K37j84N4Q6J79k79J5J63j43j97
$$ y = [32, 21, -135, -80, -363, -126, -10, 46, -154, -57, 127, -133, -134, -112, 16, -210, 236, 188, -72, -192, 310, 172, -290, -60, 224, 29, -192, 63, 111, 156, -25, 97, -27, 15, -153, 166, -85, -234, -102, 105, -199, -84, 263, 416, 211, -109, -133, 48, -50, 183, 408, -196, -183, -101, 353, -167, 17, 341, 263, -254, 125, 226, -88, 86, -127, 104, -96, 70, -74, -29, -231, -186, 199, -94, -337, -75, 263, -36, -54, 324, -6, -151, 42, 384, 115, -329, 161, 353, 141, 4, 180, 317, -10, -274, 95, 171, -63, -255, -74, -76, 50, 60, 30, 4, -48, 168, -191, -2, 86, 194, 53, -5, -91, 29, -148, 193, -75, -89, -214, 273, 374, -254, -454, -7, 19, -22, -106, 34, 153, -270, 176, 14, -52, -128, -71, 86, -317, -341, 104, 22, -192, -15, 214, 192, 156, -249, -91, -96, 42, 36, 344, 16, -122, 160, 39, -59, -82, -78, 82, 179, -61, 74, -116, 91, -8, -147, -115, 194, -237, -301, -131, 106, -78, -24, 62, 241, -38, -23, 140, -3, -200]
2947b00K18J58oj10j91J55J27k61Q1J37q8j4l85M55k86J79L48m08j11K16N6K05
2969B75k96j31Q3J23m9r8K67j78k42K96j5lQ5k54M64j17k08k31K94K00k59j75
2991a69J90p8Q1m01K66R0J4J93j85O1j63J16Q6J08l20K8J72m11L21O7K1j47N5
3014eJ3J85l06J0J52r2K8K6m6J35r5j41j31L9J01K05k64K09N7j76J85m1J27l20
3038a45J76j49L90m82K35j02J8L0j09K47j4o2oJ13k75J50n6J16R8m37K21J93l75
3061b25J11N2Q4k13J69J79J23m31J34J81l07K16j90j62R4L68m6r4J33n3m33J78
3083a32J53k2k18K61J28j98l9O7J36l96l3L48k55K37k17J29L23k28j11L67j49
3104A51k35j17L94%k40l5N0J6qp9J78M1j54J49k26R7m3K21l96L48j44J7J0j7M9
$$ y = [-200, 18, 176, 170, 60, -131, 24, 151, -110, -29, 108, 20, 6, -379, 76, -210, -31, 317, -91, -202, 14, 70, 275, -21, -152, -69, 54, 5, -93, 174, -4, -246, 50, 35, 32, 117, -137, 327, 210, 2, -229, 65, 265, 6, -169, 21, -57, 24, -377, -111, -21, -7, 186, 1, 62, -101, 15, 101, 209, -111, -83, 89, -322, -1, 66, 87, -60, -5, 8, 193, -113, -103, 49, -43, -15, 11, -35, 100, 5, -136, -267, -228, -127, 78, -186, 23, 80, -96, 89, 48, 175, -145, 31, -118, 272, -210, 25, -77, -59, -29, -138, 109, 95, 33, 27, 140, -135, 15, -41, 75, 173, -264, -43, 150, -225, -114, -62, 22, -191, -22, 157, 280, -151, -17, 164, -143, 73, -117, -279, -185, 183, 137, 43, 176, 123, -310, -132, 21, -1, -219, 42, 170, -28, -67, 0, 136, -260, -293, 55, -200, 37, -180, -51, 272, 44, -67, 300, 151, -84, -201, 193, 193, -47, -82, -32, -16, -24, -103, 75, 116, -38, 111, -115, -18, -61, 160, -236, 112, -32, -15, -5, -22, 27]
3129B7k70L85%l46O3N7K45k12L6L80k96j74K08mr1j75K06l9Q8j62j63J22K80q9
3153G6m0n4k5J40Q9j58j95K84j63K6j54J11pJ36K14l42n1m5M28j72j86J48l7j10
3177h7J97m43J27L58j23m2q3n8R8J02l12L28N6k54L88n23J50J56j14j43K89R9
$$ y = [27, -243, 142, 142, -204, -141, -84, 161, -51, -15, 365, 69, -105, 103, 99, 8, -167, 39, 0, 88, -74, -237, -115, 165, 76, 36, -18, -43, 97, 186, 28, -167, 117, -46, -20, -174, -63, -70, 66, 280, -62, -113, -158, 270, 98, -88, 60, 23, -87, 110, -333, -206, 152, 29, -13, -96, -154, -56, 46, -266, 62, 118, -136, 252, -271, -121, 35, -79, -222, 67, 166]
$$ [...]
8191A14
##END NTUPLES=NMR FID
##END=
