##TITLE=1H_Pr 37-1
 CDCl3
 8 sc, 
 19.4.2023
##JCAMPDX= 6.0         $$ Bruker NMR JCAMP-DX V2.0
##DATA TYPE= NMR FID
##DATA CLASS= NTUPLES
##ORIGIN= UXNMR, Bruker Analytische Messtechnik GmbH
##OWNER= root
$$ XWIN-NMR		Version 3.5
$$ Wed Apr 19 14:06:46 2023 Russian Standard Time (UT+4h)  she@DPX200
##.OBSERVE FREQUENCY= 200.13135
##.OBSERVE NUCLEUS= ^1H
##.DELAY= (6, 6)
##.ACQUISITION MODE= SIMULTANEOUS
##.ACQUISITION SCHEME= undefined
##.AVERAGES= 8
##.DIGITISER RES= 18
##SPECTROMETER/DATA SYSTEM= spect
##.PULSE SEQUENCE= zg30
##.SOLVENT NAME= CDCl3
##.SHIFT REFERENCE= (INTERNAL, CDCl3, 0, 15.7039)
##AUDIT TRAIL= $$ (NUMBER, WHEN, WHO, WHERE, WHAT)
$$ ##TITLE= Audit trail, XWIN-NMR		Version 3.5
$$ ##JCAMPDX= 5.01
$$ ##ORIGIN= Bruker BioSpin GmbH
$$ ##OWNER= she
$$ F:/spectra/data/she/nmr/H-F/1/audita.txt
$$ ##AUDIT TRAIL=  $$ (NUMBER, WHEN, WHO, WHERE, WHAT)
(   1,<2023-04-19 14:05:51.73 +0400>,<she>,<DPX200>,
      <created by zg, POWCHK disabled, PULCHK disabled
       configuration hash MD5:
       00 E9 B6 7A A2 85 ED C7 34 08 36 98 17 FE 4E 26
       data hash MD5: 16K
       58 B3 47 A5 A5 1D E4 32 3D 3F 55 3C CD 5C 01 3F>)
$$ ##END=
$$ 
$$ hash MD5
$$ 2A CA F4 DE D8 88 5C A2 F3 E4 CB 7B 15 18 94 3C
##$RELAX= 
##$RELAX= 
##$RELAX= 
##$RELAX= 
##$RELAX= 
##$RELAX= 
$$ Bruker specific parameters
$$ --------------------------
##$DU= <F:/spectra>
##$EXPNO= 1
##$NAME= <H-F>
##$PROCNO= 1
##$TYPE= <nmr>
##$USER= <she>
##$AMP= (0..31)
100 100 100 100 100 100 100 100 100 100 100 100 100 100 100 100 100 100 
100 100 100 100 100 100 100 100 100 100 100 100 100 100 
##$AQSEQ= 0
##$AQ_mod= 1
##$AUNM= <au_zg>
##$AUTOPOS= <>
##$BF1= 200.13
##$BF2= 200.13
##$BF3= 200.13
##$BF4= 200.13
##$BF5= 200.13
##$BF6= 200.13
##$BF7= 200.13
##$BF8= 200.13
##$BYTORDA= 1
##$CFDGTYP= 0
##$CFRGTYP= 5
##$CHEMSTR= <none>
##$CNST= (0..31)
1 1 145 1 1 1 1 1 1 1 1 1 1 1 1 1 1 1 1 1 1 1 1 1 1 1 1 1 1 1 1 1 
##$CPDPRG= <>
##$CPDPRG1= <>
##$CPDPRG2= <>
##$CPDPRG3= <>
##$CPDPRG4= <mlev>
##$CPDPRG5= <mlev>
##$CPDPRG6= <mlev>
##$CPDPRG7= <mlev>
##$CPDPRG8= <mlev>
##$CPDPRGB= <>
##$CPDPRGT= <>
##$D= (0..31)
0 1.2 0 0 0 0 0 0 0 0.06 0 0.03 0 0 0 0 0.0002 0 0 0 0 0 0 0 0 0 0 0 0 
0 0 0 
##$DATE= 1681898751
##$DBL= (0..7)
120 120 120 120 120 120 120 120 
##$DBP= (0..7)
150 150 150 150 150 150 150 150 
##$DBP07= 0
##$DBPNAM0= <>
##$DBPNAM1= <>
##$DBPNAM2= <>
##$DBPNAM3= <>
##$DBPNAM4= <>
##$DBPNAM5= <>
##$DBPNAM6= <>
##$DBPNAM7= <>
##$DBPOAL= (0..7)
0.5 0.5 0.5 0.5 0.5 0.5 0.5 0.5 
##$DBPOFFS= (0..7)
0 0 0 0 0 0 0 0 
##$DE= 6
##$DECBNUC= <off>
##$DECIM= 32
##$DECNUC= <off>
##$DECSTAT= 4
##$DIGMOD= 1
##$DIGTYP= 9
##$DL= (0..7)
0 120 120 120 120 120 120 120 
##$DP= (0..7)
150 150 150 150 150 150 150 150 
##$DP07= 0
##$DPNAME0= <>
##$DPNAME1= <>
##$DPNAME2= <>
##$DPNAME3= <>
##$DPNAME4= <>
##$DPNAME5= <>
##$DPNAME6= <>
##$DPNAME7= <>
##$DPOAL= (0..7)
0.5 0.5 0.5 0.5 0.5 0.5 0.5 0.5 
##$DPOFFS= (0..7)
0 0 0 0 0 0 0 0 
##$DQDMODE= 0
##$DR= 18
##$DS= 0
##$DSLIST= <SSSSSSSSSSSSSSS>
$$ [...]
##$SUBNAM2= <"">
##$SUBNAM3= <"">
##$SUBNAM4= <"">
##$SUBNAM5= <"">
##$SUBNAM6= <"">
##$SUBNAM7= <"">
##$SUBNAM8= <"">
##$SUBNAM9= <"">
##$SW= 18.05172834244
##$SWIBOX= (0..15)
0 0 2 0 0 0 0 0 0 0 0 0 0 0 0 0 
##$SW_h= 3612.71676300578
##$TD= 16384
##$TD0= 1
##$TE= 0
##$TE2= 300
##$TE3= 300
##$TEG= 300
##$TL= (0..7)
0 120 120 120 120 120 120 120 
##$TP= (0..7)
150 150 150 150 150 150 150 150 
##$TP07= 0
##$TPNAME0= <>
##$TPNAME1= <>
##$TPNAME2= <>
##$TPNAME3= <>
##$TPNAME4= <>
##$TPNAME5= <>
##$TPNAME6= <>
##$TPNAME7= <>
##$TPOAL= (0..7)
0.5 0.5 0.5 0.5 0.5 0.5 0.5 0.5 
##$TPOFFS= (0..7)
0 0 0 0 0 0 0 0 
##$TUNHIN= 0
##$TUNHOUT= 0
##$TUNXOUT= 0
##$USERA1= <user>
##$USERA2= <user>
##$USERA3= <user>
##$USERA4= <user>
##$USERA5= <user>
##$V9= 5
##$VALIST= <valist>
##$VCLIST= <CCCCCCCCCCCCCCC>
##$VD= 0
##$VDLIST= <DDDDDDDDDDDDDDD>
##$VPLIST= <PPPPPPPPPPPPPPP>
##$VTLIST= <TTTTTTTTTTTTTTT>
##$WBST= 1024
##$WBSW= 4
##$XGAIN= (0..3)
0 0 0 0 
##$XL= 0
##$YL= 0
##$YMAX_a= 217913
##$YMIN_a= -267194
##$ZGOPTNS= <>
##$ZL1= 120
##$ZL2= 120
##$ZL3= 120
##$ZL4= 120
##$ABSF1= 10
##$ABSF2= 0
##$ABSG= 5
##$ABSL= 3
##$ALPHA= 0
##$AQORDER= 0
##$ASSFAC= 0
##$ASSFACI= 0
##$ASSFACX= 0
##$ASSWID= 0
##$AUNMP= <proc_1d>
##$AZFE= 0.1
##$AZFW= 0.1
##$BCFW= 1
##$BC_mod= 2
##$BYTORDP= 1
##$COROFFS= 0
##$CY= 11.3945322036743
##$DATMOD= 1
##$DC= 2
##$DFILT= <>
##$DTYPP= 0
##$F1P= 15.7292609196834
##$F2P= 12.9074282941183
##$FCOR= 0.5
##$FTSIZE= 0
##$FT_mod= 4
##$GAMMA= 1
##$GB= 0.15
##$INTBC= 1
##$INTSCL= 1
##$ISEN= 128
##$LB= 0.24
##$LEV0= 0
##$LPBIN= 0
##$MAXI= 10000
##$MC2= 0
##$MEAN= 0
##$ME_mod= 0
##$MI= 1.114404
##$NCOEF= 0
##$NC_proc= 0
##$NLEV= 6
##$NOISF1= 3.799351
##$NOISF2= 2.8
##$NSP= 1
##$NTH_PI= 0
##$NZP= 0
##$OFFSET= 15.70392
##$PC= 1
##$PHC0= -19833.7
##$PHC1= 16.00081
##$PH_mod= 1
##$PKNL= yes
##$PPARMOD= 0
##$PSCAL= 0
##$PSIGN= 0
##$REVERSE= no
##$SF= 200.130013532006
##$SI= 16384
##$SIGF1= 3
##$SIGF2= 2
##$SINO= 400
##$SIOLD= 16384
##$SREGLST= <1H.CDCl3>
##$SSB= 0
##$STSI= 0
##$STSR= 0
##$SW_p= 3612.71676300578
##$SYMM= 0
##$S_DEV= 0
##$TDeff= 0
##$TDoff= 0
##$TI= <>
##$TILT= no
##$TM1= 0
##$TM2= 0
##$TOPLEV= 0
##$USERP1= <user>
##$USERP2= <user>
##$USERP3= <user>
##$USERP4= <user>
##$USERP5= <user>
##$WDW= 1
##$XDIM= 8192
##$YMAX_p= 0
##$YMIN_p= 0
$$ End of Bruker specific parameters
$$ ---------------------------------
##NTUPLES= NMR FID
##VAR_NAME=  TIME,          FID/REAL,        FID/IMAG
##SYMBOL=    X,             R,               I
##VAR_TYPE=  INDEPENDENT,   DEPENDENT,       DEPENDENT
##VAR_FORM=  AFFN,          ASDF,            ASDF
##VAR_DIM=   8192,          8192,            8192
##UNITS=     SECONDS,       ARBITRARY UNITS, ARBITRARY UNITS
##FACTOR=    0.0002768,     1,               1
##FIRST=     0,             0,               0
##LAST=      2.2672688,     0,               0
##MIN=       0,             -267194,         0
##MAX=       2.2672688,     217913,          0
$$ Real data points
##PAGE= N=1
##DATA TABLE= (X++(R..R)), XYDATA
0 0 0 0 0 0 0 0 0 0 0 0 0 8 -8 8 -8 8 -16 16 -21 24 -32 32 -40 48 -56 64 -79 88 -104 120 -136 155 -176 199
34 199 -226 253 -285 320 -357 399 -444 495 -548 607 -671 742 -817 901 -994 1094 -1206 1327
52 1327 -1464 1616 -1785 1976 -2194 2442 -2730 3071 -3478 3977 -4603 5419 -6524 8123 -10637
67 -10637 15211 -26154 111286 -14766 -261051 11955 181213 18681 -136446 11982 101473
78 101473 -821 -82605 -14500 25257 27655 33403 -579 -83499 -48050 68183 70143 -40202
90 -40202 -55487 11333 18422 -17928 -1395 15563 1337 8688 14895 -41843 -50620 57580 99624
103 99624 -32440 -107936 8719 92222 1926 -58762 15361 48149 -24797 -45659 13357 28984
115 28984 2632 3635 -7098 -43103 -16558 48957 25711 -41063 -17653 28710 -14910 -40612
127 -40612 35185 57381 -37354 -58323 38662 46164 -46999 -27551 73069 34654 -78777 -41382
139 -41382 69462 43262 -42341 -19121 28880 -7884 -29707 20863 28386 -24299 -18815 24704
151 24704 -5070 -44569 9946 58117 -5730 -63171 -7953 44881 5717 -27312 6986 21016
163 21016 -12425 -18384 9848 15598 5791 5730 -5676 -19737 2380 27409 4378 -18260 5279
176 5279 13405 -21499 -19533 29859 25066 -30276 -26180 21876 9418 -29376 8 36436 -7140
189 -7140 -44979 3689 40000 -7144 -31536 18761 31329 -26848 -35153 28367 43014 -12974
201 -12974 -33988 5213 24279 2851 -11914 -3598 9783 12814 -6195 -27863 -6285 36580
213 36580 19557 -40311 -34538 30243 32546 -28923 -30258 27126 24097 -30808 -25139 26473 22599
226 22599 -17348 -11127 14502 -360 -15125 10918 24577 -6597 -22740 4747 20601 -24
238 -24 -13068 1717 11726 1136 -12147 -10568 6279 18611 1565 -26370 -15468 21216 17664
251 17664 -21105 -18732 19719 15086 -24595 -17890 24613 19888 -18933 -15202 16206 9513 -12990
264 -12990 454 19482 587 -18497 239 18114 1838 -12057 1154 9412 -3856 -11263
276 -11263 195 9061 3427 -6859 -10360 -2830 7559 4950 -8751 -7397 7724 4716 -12449
289 -12449 -6707 15398 10249 -12945 -8987 12276 7943 -8153 380 13105 -862 -12977 3260
302 3260 14783 -1663 -11623 4485 9951 -8552 -12544 7414 12745 -6936 -14827 9 8957
315 8957 -846 -7740 -1394 4760 1008 -6668 -5030 5792 9689 -1932 -9937 915 11256 1241
329 1241 -7786 3673 11380 -2885 -11702 4721 14149 -2375 -12740 3006 10594 -6279 -12280
342 -12280 6100 11695 -7856 -15146 2726 11253 -3640 -10914 1927 8645 -2988 -9943 1327
355 1327 11079 3039 -8591 -3743 8339 6765 -4906 -4329 7876 7699 -6526 -8399 7013 10901
369 10901 -4419 -10833 3123 8224 -5067 -9053 4635 7571 -7742 -11229 4574 8702 -6329
382 -6329 -9556 5102 8895 -6686 -10781 6331 13630 -2163 -12966 663 14386 4461 -10176
395 -10176 -3822 11299 7535 -8347 -8516 7560 10743 -4347 -10825 533 6973 -826 -6380 -73
409 -73 2504 -3800 -4462 3001 2004 -6183 -3509 7394 3445 -9607 -5589 11363 10268 -8816 -11351
424 -11351 8170 14654 -2889 -12363 3168 14017 12 -11839 -839 11559 2134 -9349 -2901
437 -2901 6554 315 -7529 -705 6406 -2505 -10347 -282 9690 -556 -11787 -2372 11321 3279
451 3279 -10989 -4416 10603 7516 -6693 -6846 4943 7704 509 -2679 -237 1264 1707 3354 282
466 282 -5112 -2259 6352 4287 -7507 -9328 4028 10550 -1947 -13754 -5096 10642 8397 -8218
480 -8218 -13111 2703 14448 2628 -14247 -7044 13849 13286 -8746 -15051 5815 18128 1230
493 1230 -14577 -3507 12741 6795 -8193 -6181 5075 4502 -3220 -3082 197 -1935 -1916 3679 1962
508 1962 -8520 -7225 7868 9776 -8222 -13580 6377 15686 -4061 -15923 3425 17863 -287
521 -287 -15835 787 17140 1014 -14104 1724 15657 -1890 -15704 3081 17204 -3620
533 -3620 -19289 1345 18555 -1201 -20061 -2841 16720 3326 -16423 -7076 10970 6875 -7386
546 -7386 -6789 2908 4735 1211 -377 -1682 -1469 3125 6473 197 -6471 -1060 9251 5960 -6826
561 -6826 -8077 4285 10562 -274 -11590 -5182 8704 7591 -7368 -11787 1425 10791 990 -11995
575 -11995 -6997 8395 9338 -5339 -11463 1101 12160 3136 -9784 -4387 9734 7069 -6484
588 -6484 -5398 7087 6444 -4710 -3942 6224 2868 -6676 -1429 7788 212 -10497 -1226 10202
602 10202 139 -12090 -2264 9814 599 -10473 -1435 8309 -86 -7517 1457 6756 -2719 -6027
616 -6027 5246 8087 -5102 -7762 6605 11369 -3871 -10784 2806 12690 720 -12101 -3654
629 -3654 10497 5751 -9153 -9052 4910 8181 -3689 -9191 -568 5855 302 -4751 -1583 1464
643 1464 461 678 1820 -1552 -3249 3514 7147 -1229 -7364 1664 10451 2079 -8855 -3322 8718
658 8718 5862 -6339 -7019 3820 7203 -1933 -8112 -2079 6054 2672 -6929 -5776 3677 4953 -3859
673 -3859 -5756 2689 4734 -2698 -4692 3227 4784 -2700 -3183 5139 4819 -3936 -3409 5845 5433 -4794
689 -4794 -4928 5499 5630 -4562 -5766 3432 5517 -3597 -6701 1073 5123 -1711 -6530 -587 4826
704 4826 -125 -5844 -1266 5606 1653 -5589 -1506 6285 2861 -5197 -1849 6577 3660 -5106 -2328
719 -2328 6525 3974 -5170 -3391 5757 3880 -5449 -4200 4722 4014 -5154 -5337 3293 4423 -3898 -5667
735 -5667 1481 4395 -1840 -5369 241 4865 164 -4566 -366 5091 2197 -3318 -507 4691 2190
750 2190 -3021 -581 4381 1728 -3656 -949 4560 1206 -4689 -1956 4154 1357 -5444 -2676 4106
765 4106 1770 -4792 -3521 3317 2397 -3751 -3451 2971 3497 -2167 -2853 2287 3891 -1241 -2503 2267
781 2267 4005 -541 -2754 1650 4402 -848 -4059 948 4499 -839 -5360 -144 4562 -475 -5891
796 -5891 -1092 4347 256 -5578 -1763 4159 1076 -4666 -1529 4018 1776 -3176 -1169 4097 1983
811 1983 -2573 -860 3457 2034 -2261 -893 3430 2053 -2708 -2048 2759 2324 -3335 -3561 2336 2921
827 2921 -3176 -4989 1845 4156 -2745 -6152 1178 5280 -1371 -5933 291 6220 261 -5086 -24
842 -24 6028 1769 -4274 -386 4903 1866 -3192 -818 3790 1468 -2652 -1012 2583 1002 -2940 -1839
858 -1839 2336 1141 -3640 -3083 2358 2320 -3550 -3762 1989 3969 -2693 -4792 2094 5116 -1456 -4437
874 -4437 1758 5361 -447 -3915 1817 4498 -626 -3593 1497 3799 -1625 -3266 1289 3404 -1687
889 -1687 -4295 466 3090 -696 -4507 -1252 3337 1032 -4169 -3006 2834 3182 -2675 -3748 1865
904 1865 4552 -1011 -3715 1524 4312 -375 -2401 1813 3084 -1439 -1958 2694 2168 -2862 -2226 3282
920 3282 1983 -3878 -3369 2688 2236 -3290 -3635 949 2410 -1006 -2986 -840 1711 1402 -1118 -1857
936 -1857 1040 2582 -193 -1916 1259 3349 -493 -2158 2326 3264 -2229 -3236 3393 3979 -3507 -4865
952 -4865 3499 5118 -4007 -6356 2192 5205 -2624 -5933 651 4312 -550 -4035 -532 2551 611
967 611 -1444 -244 1469 680 -445 933 1991 -262 -2029 1412 4272 -522 -4928 111 6828 1077
983 1077 -7625 -2460 7958 2762 -8766 -4232 6965 3814 -7488 -4481 5252 2981 -5321 -2529
997 -2529 3969 972 -3532 536 3550 -787 -2925 2511 3706 -1569 -2317 2523 3054 -1042 -1743 859
1013 859 1258 -90 -144 -952 -1219 1216 1172 -1634 -2797 834 2046 -1946 -2732 1038 1483 -2062 -1795 1899
1031 1899 930 -2086 -305 3366 797 -2708 -165 3405 1725 -2061 -1306 2096 2904 -285 -2985 -752
1047 -752 3574 1757 -4065 -3792 3733 3663 -3996 -4945 3035 4006 -3875 -4290 3192 2898 -4174 -2049 4810
1064 4810 1012 -5346 252 6863 -334 -6815 1675 8256 -690 -7041 1653 7763 -725 -6395 546
1079 546 5627 -329 -4581 3 2855 -280 -2505 -806 726 -136 -785 -1008 -336 1014 17 -1351
1095 -1351 -105 2267 375 -2352 360 3406 91 -3175 1297 4320 -338 -3209 1663 3971 -1171
1110 -1171 -2754 1917 2650 -2363 -2478 1904 1383 -2438 -1733 1483 568 -2190 -1157 724 150 -208 -136
1127 -136 -856 -131 1922 631 -2541 -160 4090 1124 -4163 -40 5355 653 -4755 -116 5519 -215
1143 -215 -4977 685 4778 -1456 -4770 1249 3374 -2406 -3763 1937 2712 -2763 -2863 1605 1799 -2015
1159 -2015 -1479 1470 1213 -711 -579 498 1124 892 49 -1111 1110 2574 -153 -2684 1036 3555
1175 3555 -1292 -3709 1514 3732 -2093 -4528 1833 3565 -2717 -4271 1921 2957 -2693 -3061 2263
1190 2263 2195 -2390 -1702 2012 1173 -1522 -523 1772 1060 -179 -75 699 680 860 -181 -902 667 1992
1208 1992 -651 -2430 734 2345 -1843 -3153 1278 3149 -2262 -3695 1782 2690 -2773 -3334 2747
1223 2747 2873 -2846 -2179 3286 2023 -2529 -1146 2897 1566 -1877 -611 2359 1143 -1081 -691 1328
1239 1328 626 -500 -931 -688 648 626 -1132 -1912 837 1472 -1945 -2420 1231 1761 -2446 -2383 2392 1855
1257 1855 -2847 -1798 3124 1998 -2723 -1351 3396 1558 -2670 -616 3093 1107 -2139 -360 2427
1272 2427 551 -1596 -411 1025 172 -1047 -687 -116 47 -387 -1298 -713 1055 513 -1895 -1271 1771
1289 1771 1375 -2142 -1237 3041 1714 -2797 -875 3697 1466 -2866 -741 3503 880 -2916 -750
1304 -750 2980 792 -2652 -487 2082 83 -2375 -853 1090 -249 -1463 -547 465 324 -783 -978
1320 -978 108 850 -81 -1186 -97 1796 528 -1638 53 2569 846 -2257 -129 2931 589 -2477
1336 -2477 -220 2650 3 -2999 -479 2332 57 -2442 -565 1406 -516 -2240 -399 1103 -129
1351 -129 -1225 -202 643 292 -536 -552 686 1204 -105 -547 541 1715 439 -1398 209 2038 129
1368 129 -1889 25 2442 158 -2557 -308 2211 -173 -2809 -668 1804 -122 -2359 -337 1427
1383 1427 -44 -1822 -50 1736 193 -1301 106 1742 557 -790 -277 1989 1301 -1268 -1073 1412
1399 1412 1568 -974 -1643 952 1598 -897 -2274 469 1831 -854 -2386 206 1950 -849 -2220 214
1415 214 1506 -821 -1895 684 2041 -475 -1787 636 2289 44 -1704 390 2372 71 -1352
1430 -1352 212 2161 317 -1480 -31 1575 263 -1842 -518 1172 239 -1674 -928 971 93 -1702
1446 -1702 -862 970 546 -1239 -885 1407 1032 -736 -666 1246 1552 -402 -821 805 1838 66 -820
1463 -820 336 1061 51 -1167 -64 958 -158 -943 -416 145 -146 -1041 -460 564 258 -953 -680
1480 -680 671 393 -755 -633 818 1327 -559 -859 1134 1621 -166 -1161 653 1714 -87 -1619 259
1497 259 2115 -44 -1877 -359 2018 14 -2268 -334 1671 -372 -2417 -356 1573 -287 -2322
1512 -2322 -245 2065 -92 -2085 4 2256 370 -1726 179 2297 746 -1371 -91 1838 523
1527 523 -1497 -541 1896 531 -1580 -603 1396 151 -1945 -993 1067 413 -1844 -1299 1122 525 -1555
1544 -1555 -1315 1248 1154 -1377 -823 1194 1350 -336 -922 1087 792 -325 -280 673 1031 -322 -147 223
1562 223 467 -118 -529 -75 292 165 -771 -590 120 525 -701 -965 115 858 -622 -1161 304 1399
1580 1399 -451 -1098 643 1617 -203 -1160 547 1645 -79 -1084 699 1575 -87 -1461 395 1319
1596 1319 -275 -1720 -196 1184 -294 -1445 -340 967 50 -1572 -441 924 157 -1330 -514 1325
1612 1325 683 -1359 -349 1525 808 -1187 -655 1725 1006 -1024 -505 1348 1142 -1235 -768 1398 766
1629 766 -1125 -869 1000 638 -1323 -899 895 537 -987 -1019 357 492 -833 -865 308 667 -32 -690
1647 -690 244 1161 204 -521 -44 1199 618 -759 -110 1172 850 -725 -582 897 506 -1107 -953 941
1665 941 598 -1248 -896 645 237 -1218 -831 483 458 -1111 -1001 624 821 -463 -540 547 895 -116
1683 -116 -431 395 1197 364 -914 -134 1099 415 -982 -174 1191 317 -1249 -531 1128 375 -1644 -713
1701 -713 1282 412 -1350 -618 1384 520 -1452 -591 1308 698 -1067 -600 1288 672 -633 -503 1098
1718 1098 898 -479 -735 793 1072 -305 -589 532 935 -530 -1414 -96 838 -357 -1332 -334 907
1735 907 -496 -1424 20 1269 -149 -1472 428 1557 -11 -969 134 1460 409 -1045 163 1259
1751 1259 366 -900 -11 1027 257 -462 -317 609 31 -995 -482 229 299 -692 -952 278 362 -439 -782
1770 -782 255 556 -436 -1053 -1 837 -318 -766 382 1165 298 -716 146 1112 67 -520 158 1103
1788 1103 250 -893 -145 826 4 -774 -170 700 -37 -930 -572 614 231 -847 -586 528 762 -496
1806 -496 -553 438 672 -340 -696 483 1058 -161 -764 333 1154 7 -686 284 1241 -267 -1108 -28
1824 -28 828 -230 -1306 -239 768 -70 -1090 -414 522 91 -966 -384 679 298 -692 -108 1116 622
1842 622 -729 -414 1070 961 -647 -405 838 681 -333 -773 929 668 -683 -995 733 612 -760
1859 -760 -1080 412 625 -958 -1089 357 724 -694 -1122 439 901 -493 -927 590 1247 -312 -659
1876 -659 378 907 48 -556 241 788 254 -572 229 805 -175 -898 -153 440 16 -1043 -474 395 107
1895 107 -802 -552 225 189 -449 -629 284 246 -120 -346 282 794 -44 -485 479 767 -157 -388 433 738 -22
1916 -22 -155 134 490 56 -711 -241 216 -225 -737 -663 464 252 -992 -839 258 350 -619 -561 608 636
1936 636 -325 -1003 640 782 -506 -604 690 1103 -249 -544 599 1051 -240 -853 453 981 -352 -663
1954 -663 223 723 -214 -1073 182 778 -242 -950 19 761 -177 -1006 23 772 92 -866 39 1144 245
1973 245 -382 -3 1089 549 -522 -218 938 437 -730 -157 658 239 -584 -536 633 92 -950 -339
1991 -339 375 291 -897 -307 363 472 -437 -384 307 579 100 -227 304 451 -190 149 15 633 341 -173
2011 -173 114 385 373 -382 -217 311 312 -432 -517 119 264 -591 -844 11 346 -727 -674 246 367 -373 -383 329
2033 329 751 -124 -110 265 729 55 -246 450 354 -80 -489 247 763 -47 -652 -7 629 110 -738 -321 388
2054 388 83 -850 -424 427 -96 -1119 -504 547 411 -925 -86 1023 42 -930 -359 810 367 -660
2072 -660 -129 1138 717 -498 139 835 289 -619 -146 382 391 -502 -563 162 31 -481 -388 62 121 -228 -170
2093 -170 -75 408 -244 -584 -426 680 352 -658 -51 917 447 -342 296 953 286 -631 -78 471 436 -457
2113 -457 32 397 -56 -555 -89 373 -302 -391 -138 -3 -320 -253 -278 -141 142 126 -425 -160 681 136 -368
2134 -368 -147 942 86 -576 2 738 144 -730 -56 799 350 -525 36 727 -261 -988 -81 480 -233 -866
2154 -866 13 419 -209 -681 192 56 191 -265 -217 402 163 42 -193 88 689 138 -547 462 769 105
2174 105 -564 -12 821 -83 -795 -95 997 -305 -1026 259 653 -567 -891 40 498 -509 -757 322
2192 322 478 -583 -344 387 613 192 -270 499 348 122 229 18 204 372 -105 -34 97 363 -127 -460
2212 -460 208 437 -233 -852 112 560 -280 -892 518 539 -654 -732 359 584 -381 -280 429 459 -642 -24
2232 -24 598 307 -299 104 229 285 -4 -88 -170 260 244 -91 -345 6 309 -162 -589 96 300 -248 -729 379
2254 379 630 -501 -765 582 526 -648 -606 529 677 -610 -28 678 482 -394 -354 306 356 -439 -177 143
2274 143 -38 -155 -84 -41 -18 84 -391 -302 556 196 -214 -619 302 400 -208 -415 640 419 -471 -317 617
2295 617 509 -529 -292 1012 448 -509 -199 587 204 -582 -29 574 176 -565 -307 259 -1 -378 -225
2314 -225 -237 -6 -15 -215 -136 168 193 -388 -72 288 325 -186 -10 542 388 -320 144 730 320 -770 32 850
2336 850 352 -580 104 409 -69 -567 26 627 -190 -449 -31 226 -109 -118 -9 164 15 -109 20 9 58
2357 58 51 -104 -129 13 452 -84 -291 743 256 -705 -134 383 197 -467 -43 335 144 -690 -35 221 -138
2378 -138 -623 -194 155 -17 -555 -31 216 3 -561 -98 370 121 -193 77 93 255 321 -214 166 578 -5
2399 -5 -174 160 411 -211 -513 75 492 44 -533 -14 460 -144 -1085 43 461 -73 -478 105 602 -186
2419 -186 -385 292 94 167 -50 29 293 -171 -95 168 277 -7 -50 13 65 285 -222 -199 -86 330 -258 -312 92
2442 92 256 -347 -390 -202 262 -232 -379 341 173 -172 -173 311 35 -78 -243 293 360 70 105 95 228 189 -282
2465 -282 -148 89 43 -92 -118 332 206 -219 -325 87 289 -398 -545 81 226 -229 -48 219 358 -148 -176
2486 -176 342 177 -208 -431 203 516 -97 -111 414 338 318 -256 314 179 21 -291 -46 268 5 -254 -35
2507 -35 211 65 -124 -119 253 100 -328 -156 362 -75 -403 44 472 18 -254 -43 162 270 -385 92 269
2528 269 77 -290 -236 482 219 -257 -49 8 239 -275 -332 -103 125 -323 -414 -16 -63 -120 -352 -40 313 95
2550 95 -319 208 538 291 -308 175 400 60 -123 33 404 -29 -258 351 335 135 -346 -329 52 -80 -338
2571 -338 -160 186 163 -238 -297 44 323 -157 -35 235 498 -368 -105 91 264 -119 -149 47 332 -78 -129
2592 -129 177 191 -121 -144 103 283 -36 -172 98 115 -66 -224 -70 249 310 -410 -174 -81 148 -84 -190 -41
2614 -41 242 -104 14 -86 452 -21 -252 522 141 -96 -144 237 340 -226 -243 80 412 -144 -188 -4 101
2635 101 -82 -198 -172 97 -56 -196 81 225 13 -221 -246 254 126 -86 -142 438 302 -193 -9 366 314
2656 314 -527 -19 570 213 -197 44 127 -41 -261 -305 285 98 -175 -116 203 -218 -269 -204 63 -283 -314 264
2678 264 143 135 -25 -183 330 219 -34 56 254 97 176 -225 43 48 -32 -46 -227 319 272 -91 -198 296 -88
2701 -88 -99 -221 -71 -22 -265 69 309 106 -371 316 -35 -85 285 -384 82 181 327 -206 91 72 -147 -152 -121
2724 -121 181 189 -436 -170 42 -129 -241 14 168 -220 -382 -156 205 58 -500 -132 467 328 -282 -67 156
2745 156 243 -443 -141 525 115 -286 -58 293 199 -276 213 98 -37 22 -230 104 -204 -264 -380 277 117
2766 117 83 -5 215 304 -115 -370 160 62 -93 -175 -139 550 137 -93 317 265 -228 -269 65 173 -138 -434 318
2789 318 -120 20 -231 138 -130 -389 -13 -171 -9 60 -220 -66 -174 23 26 -2 20 126 134 11 -31 369 247
2812 247 -86 124 274 -64 -125 207 -46 -100 -231 -134 333 -240 -291 26 -25 -138 -352 -172 -65 132 -6 -94
2834 -94 191 -92 -142 -62 281 204 191 121 -19 45 -71 -253 58 333 -175 -287 50 143 -80 -365 -103 119 -159
2857 -159 -167 121 470 -355 -418 193 231 -168 -89 204 213 -31 -85 -58 -68 -197 -187 174 144 132 246 -52 -128 137 -81
2882 -81 22 247 138 -145 88 333 144 -199 -308 49 118 -204 -235 47 92 -210 -153 -58 -34 -215 -254 183 160
2905 160 -37 93 145 65 7 45 174 211 176 -63 -135 145 159 -144 112 15 176 -117 -89 202 -82 -252 -197 92
2929 92 239 -287 -8 75 59 -45 160 224 428 -136 -225 97 50 -161 -245 122 127 -188 -157 41 126 -36 -132 83
2953 83 49 -82 30 -47 185 -84 70 37 143 -249 -296 135 186 34 -50 169 284 -113 -170 296 142 -55 -100
2976 -100 -187 205 125 -207 85 -16 -66 46 81 89 -161 -186 8 -114 101 8 -92 -148 1 49 -177 200 74
2999 74 -305 -171 83 404 18 34 332 317 27 -173 210 212 175 -128 19 201 -90 -7 -173 82 198 -94
3021 -94 -95 118 -140 -169 -245 253 -117 -222 -20 79 41 -136 -221 58 157 40 -161 366 327 63 -31 50 398 45
3045 45 58 175 196 66 -177 105 80 -202 -193 189 221 -53 -37 -128 207 -20 -347 -137 149 -105 -31 -62 98 98
3069 98 -241 292 -160 -192 7 121 230 70 10 49 218 342 -73 -134 -101 -64 -16 42 115 26 34 -148 -29 177
3093 177 -76 -179 -346 307 -326 -249 69 107 99 -116 226 182 11 -269 172 201 95 -380 -4 124 60 -378
3115 -378 -241 -149 89 72 101 131 36 -87 -137 128 -27 -157 186 14 -155 -72 -187 2 149 3 -35 -109 11
3138 11 6 -13 288 318 -18 -175 164 301 -98 -130 141 85 -146 -13 -144 40 -222 -148 -11 -57 -81 186 247 383
3162 383 -84 -340 -22 -83 42 165 -72 -128 -12 -61 -123 108 141 143 16 108 190 9 -274 20 224 104 -242
3185 -242 194 54 -162 -177 -137 51 -51 68 114 192 -71 -181 146 105 254 -306 190 315 232 -234 -36 30
3207 30 248 -116 113 -150 113 26 -285 173 81 -202 -298 167 131 -46 -75 211 28 19 -345 109 165 -19 -272
3230 -272 82 299 -170 32 -170 0 -25 -29 99 60 36 -196 -74 75 57 -56 -461 76 440 -96 -223 -74
3252 -74 180 -231 -307 -28 110 -62 -313 -24 106 0 -170 25 185 -18 -163 142 -50 -248 -105 150 112
3273 112 -5 316 180 -246 -136 -79 -132 -89 -139 -11 -303 116 -128 -304 -64 -220 135 -181 25 177 94 -223
3295 -223 145 217 78 -341 -130 278 175 -155 -86 336 162 -134 -305 143 -67 -204 7 87 -263 -85 -59
3316 -59 -101 -90 -108 -97 -37 134 -206 -275 49 41 51 -47 -16 -12 -44 -67 -257 126 19 -61 61 202 -22 -251 -95 41
3342 41 -34 -167 17 -14 -29 -244 137 -92 -162 -217 -88 -166 109 -124 -391 -9 -65 84 67 -28 193 9 -220
3365 -220 -40 115 148 -155 -128 109 5 -110 89 -22 -26 -145 38 241 -142 -516 111 10 65 28 246 120
3387 120 -80 -278 116 416 115 155 58 25 -29 110 17 90 366 7 -99 -76 261 -109 -106 71 -76 -147 -358
3410 -358 -112 -182 -45 -182 -220 97 -210 -129 139 282 78 -275 138 144 -297 174 -57 18 143 -75 302 328
3432 328 222 -68 65 -71 71 226 104 -119 -223 -71 29 52 -130 -73 -90 169 -72 -143 -99 204 44 6
3454 6 -142 -20 119 -517 29 118 104 -119 -102 -47 45 -72 -31 5 -20 -181 -370 10 -36 -35 37 -14 149 231 -38
3479 -38 -89 185 132 -376 -364 55 32 -11 43 74 34 296 56 -139 151 -171 -235 419 310 -64 -202 20 9 21
3503 21 -98 107 191 -197 2 6 -195 -214 195 144 -24 -2 -109 178 -188 -131 -133 115 179 9 -47 -187 13 189
3527 189 16 -12 126 -16 -208 16 259 16 -5 -179 134 45 9 -147 -17 -1 -8 -187 -38 -8 -172 68 91
3550 91 209 204 -291 45 395 -110 74 20 70 -124 62 165 129 40 91 -61 3 136 -173 85 225 -46 -57
3573 -57 -355 149 -95 -7 -266 -131 -18 86 58 -66 67 77 46 236 103 145 239 89 212 -6 65 180 119
3596 119 -180 -139 123 45 -159 -185 -248 37 -165 -138 -285 -111 -148 -128 -27 -107 -41 155 85 50 -22 -145 55 -81
3620 -81 110 79 -148 107 1 -137 150 63 -32 19 252 86 185 -94 -199 -304 -127 11 -182 305 54 50 -22
3643 -22 281 -250 48 9 71 -76 232 109 -45 191 113 21 -70 162 226 -13 -63 189 261 -54 -202 -16 -131
3666 -131 -165 -74 -75 28 -16 -115 -8 -114 -94 -88 -56 -99 -185 -273 279 26 -11 141 80 75 -74 368 2 219 79 -156
3692 -156 83 171 -91 -170 -57 30 202 -55 -194 -108 93 -446 -135 -1 45 3 -60 313 192 -313 15 157
3714 157 86 -218 65 133 58 -95 -249 121 -213 200 205 166 -163 -29 -189 -120 52 -101 -184 -11 -54 -295 -57
3737 -57 -39 175 -56 -102 -144 251 -6 -124 -9 239 -235 235 76 -25 -234 154 17 167 -2 7 65 -22 -60
3760 -60 -39 0 11 -13 -237 -2 210 -143 -98 -38 11 14 -95 -243 -27 210 -173 -110 -41 336 -5 -160 -28 258
3784 258 48 195 124 110 21 114 -23 411 99 95 16 56 59 183 145 -184 198 1 124 113 224 -121 -109 44
3808 44 64 14 -100 105 55 234 -68 -12 174 -53 -21 -145 47 -27 -18 -115 73 -474 -181 217 -23 65 -232 44
3832 44 296 -63 -79 -21 -134 -90 10 2 13 103 239 -85 -39 184 73 -377 93 164 67 -21 402 300 -122 -71
3856 -71 -38 98 -233 -164 161 -22 -172 -121 222 -9 -85 -112 68 78 73 23 28 86 27 -74 120 -114 -94 188 77
3881 77 -150 -84 -129 -52 224 140 -42 -39 139 305 193 10 -25 -82 -206 74 101 -63 31 55 82 169 64 -6 -12 -43
3907 -43 -109 -139 230 37 -42 226 201 148 -124 170 -81 199 -64 -67 -42 96 300 -240 -209 245 -156 -91 -130 -356
3931 -356 -68 -153 53 112 166 -148 -29 -31 128 -90 120 189 53 37 -299 21 21 -14 -32 56 45 231 128 41 -179
3956 -179 -228 8 -66 -215 101 36 -198 -244 3 -195 -69 331 211 -137 -59 -24 38 -115 193 81 -135 79
3978 79 204 23 122 74 -18 26 99 -29 156 -107 6 -70 -37 277 149 112 -11 215 169 -122 61 135 34 -121
4002 -121 -91 -114 147 -289 -222 213 106 -22 63 236 59 78 -210 305 11 12 -204 194 1 22 121 -51 11
4025 11 -185 -226 109 55 -7 127 102 150 -21 161 158 -26 -5 -94 57 -39 -25 11 -94 30 132 -151 -203 -53 -184
4050 -184 -236 70 -133 -12 -55 -20 158 -185 16 -143 -207 18 -90 -69 -9 60 -228 -21 -34 -75 5 17 153 263
4074 263 -65 -163 50 -64 -38 70 -157 -92 95 63 173 5 205 -113 -158 29 145 -79 -32 -157 -267 -163
4096 -163 189 83 261 57 88 -79 -22 75 -77 216 259 153 179 55 -52 -63 -17 8 159 349 61 -24 120
4119 120 78 -195 -115 -26 -62 16 -15 189 -96 -170 -19 -227 3 -186 -98 0 -93 19 217 68 -111 149 128 226
4143 226 100 -133 207 120 31 -75 -206 18 213 81 -12 329 31 -19 32 -69 -74 -25 -169 2 -3 -251 72
4166 72 -281 -101 28 37 -147 -143 59 -330 108 -91 23 101 -192 -46 -53 -136 -87 -47 34 38 -11 92 313 133 148
4191 148 51 8 115 -57 0 20 132 67 -15 38 -139 -112 -34 184 -35 71 -143 -4 -95 101 18 127 -62 -34
4215 -34 -135 59 47 -251 -32 53 -63 -188 -198 -275 87 -160 42 -46 235 25 -196 -97 287 -10 -27 -46 27
4238 27 368 166 101 -120 16 -69 -183 -187 -296 43 57 100 140 -97 -141 -217 -94 -197 89 -56 -361 -99 88
4261 88 -91 223 -230 -35 14 295 162 -166 157 -43 92 -143 -113 -20 211 -219 -178 41 42 51 32 -1 65 40
4285 40 23 140 -9 104 -222 -6 51 -83 -37 132 -83 -158 112 -43 -84 67 -333 191 41 -113 23 98
4307 98 68 153 30 -73 -216 -211 -13 38 38 -91 -47 -368 -3 199 -110 -58 110 -86 36 -33 -78 -29 92 326
4331 326 217 -118 -17 -165 -136 -78 -145 -30 130 -243 34 -172 289 68 -144 29 -79 31 4 -14 197 -116
4353 -116 -102 77 63 -174 -152 -218 -63 -7 -226 64 -15 274 -72 -287 305 5 -136 113 81 -29 -73 2 -131
4376 -131 96 -69 242 126 24 61 -165 -136 163 53 -71 111 -190 -12 -12 81 -44 -42 32 -180 -48 -267 -310
4399 -310 -144 45 139 -86 -208 -70 245 -127 -47 -107 46 -37 235 270 -91 88 -34 -67 330 -153 -161 63 98
4422 98 2 -225 -116 -69 52 -142 -172 124 24 -117 7 69 77 97 108 -16 -250 -15 -263 -48 -31 -60 69 22
4446 22 -11 -231 -32 1 -49 -35 78 -87 -165 -170 149 102 226 -63 195 -28 -172 24 15 132 -66 -147 -36 -363
4470 -363 -33 -23 -17 45 132 -66 154 209 18 44 -151 -94 -95 -42 -148 20 108 121 19 -1 16 225 -110 84 -81
4495 -81 31 82 -125 -10 187 95 128 263 35 98 90 -18 -168 51 -79 -85 121 74 -350 -55 71 49 148 -138
4519 -138 -3 -60 -79 18 -88 -46 101 39 -133 56 -172 149 -38 -61 173 -116 36 -85 -255 -12 24 92 -26
4542 -26 -5 -232 136 -91 -194 241 -150 -105 -248 37 65 27 34 84 110 47 -73 102 88 -34 26 141 58 269
4566 269 24 16 61 74 -23 -50 185 0 215 2 119 140 84 -195 40 -22 -104 -9 -10 -141 67 241 214 -130 72
4591 72 -152 41 92 236 -106 72 -74 47 -283 253 -82 174 -95 96 61 -88 112 129 -42 -154 -106 -58
4613 -58 176 -206 -186 91 313 -213 -68 32 -159 -106 -85 -87 145 -146 59 -123 -21 45 196 124 29 41 10 63
4637 63 -152 -112 71 -255 -199 47 -146 -161 -74 224 109 77 -55 72 45 187 -24 293 -99 -18 142 -42 -45
4660 -45 -286 45 173 -95 62 -160 -29 -10 -162 152 84 -189 -321 224 -140 44 40 113 177 -67 -157 -103 -357
4683 -357 -144 27 6 87 50 29 -115 125 120 -4 66 278 -121 255 -207 -38 -25 47 -124 -191 -38 -200 -99
4706 -99 -8 54 303 55 -253 -55 164 102 -131 -48 -223 -60 -209 122 126 30 -81 20 -204 -160 96 42 -95
4729 -95 101 -179 -97 97 -32 -79 23 108 -114 109 17 -17 -112 -48 -72 -45 0 2 -9 182 18 73 18 -120 113
4754 113 -82 -205 -57 -116 175 -338 -42 -49 139 -110 51 20 -37 -184 96 17 10 83 214 -46 26 90 106 -258
4778 -258 149 48 -36 78 170 -196 120 163 -242 -134 206 253 -65 154 -91 -196 -127 17 169 -131 324 375
4800 375 -189 -168 57 135 191 168 40 -25 190 197 -151 35 -90 223 -192 -52 170 35 74 170 -27 -223 -85
4823 -85 153 -4 -40 301 193 112 -155 -82 266 91 203 -60 1 27 53 -3 -121 -92 93 -91 329 235 105
4846 105 66 195 -219 -67 119 295 46 39 174 114 -86 -194 -5 46 22 -101 -146 87 -34 72 -191 89
4868 89 -72 197 -48 -13 -217 93 -79 -57 107 -86 -95 18 82 -84 98 -234 -305 -31 -28 -112 -112 -85 90 -29
4892 -29 -8 100 -138 24 36 91 76 44 -288 197 57 18 136 -76 -137 59 -233 103 -2 -86 114 -30 125
4915 125 19 320 106 245 -4 -191 -264 -115 -15 -305 -205 102 66 -99 86 -33 -213 -28 241 -47 47
4936 47 55 -34 -186 -40 -75 -30 -33 136 167 14 -72 -79 -97 -45 107 -50 17 5 169 -92 -41 -75 -137 -47 -4 -93 179
4963 179 -51 -293 -194 149 -153 126 42 -36 81 36 -59 -142 -45 43 47 -160 46 30 193 276 110 -4 -162 63
4987 63 22 16 -58 140 -55 -136 96 -28 11 -223 -39 -44 65 -117 143 -113 -16 18 -22 125 13 167 82 181 20
5012 20 84 -117 290 -24 -124 245 -135 122 -124 42 196 82 14 -207 -240 -82 -194 -124 9 -105 -74 134
5034 134 -87 -99 -145 133 106 -21 130 0 174 110 69 214 201 127 102 -25 -4 245 -72 -148 73 -111 186
5057 186 -97 -213 -236 -151 -27 213 -86 83 -221 -83 76 162 242 22 169 -40 -140 99 148 9 72 135
5079 135 -177 -120 67 140 42 -110 -258 -253 -29 212 8 54 227 63 -125 0 -70 80 -37 70 -60 21 -68
5102 -68 -59 6 -9 31 120 15 -190 -307 -123 -83 66 -105 70 -18 107 -96 39 41 -120 0 197 -137 -228 116
5126 116 -126 -29 -24 229 76 53 79 45 85 76 132 44 63 -324 159 127 -385 104 -245 169 19 -90 -83 -48 79
5151 79 317 232 24 66 -126 152 240 -39 52 90 115 -219 8 20 -85 71 96 174 144 131 -315 58 -49 44
5175 44 2 279 -83 -55 333 68 -40 -148 -268 -115 123 -156 -43 123 -69 -67 -126 7 -5 -117 182 58
5197 58 -165 -219 94 199 168 -46 95 59 143 -111 -14 69 -96 81 -23 212 -279 279 39 38 -163 -73 5 387
5221 387 -20 -67 63 88 -43 -195 291 -230 128 -2 -40 -160 -235 -182 128 -16 -56 -6 104 39 39 108 112 43 121
5246 121 -96 -41 59 132 112 69 48 12 -20 -71 -46 -363 -6 -110 -154 -2 160 -83 -263 -184 -111 -189 -102 -42 -112
5271 -112 -22 -37 -92 -94 36 -117 -63 -245 -64 72 62 172 124 96 -52 16 -284 -153 257 48 -51 140 -282 -169
5295 -169 111 137 -34 -76 40 36 -27 -17 -85 334 81 76 -103 111 -87 -96 -39 105 -16 -76 -155 84 91 -27 -132
5320 -132 -36 -21 -17 -92 227 60 61 126 180 74 -247 48 49 64 77 -32 198 7 19 -20 56 83 171 -186 131 73
5346 73 -274 146 -150 -59 -18 -141 247 -85 147 167 -13 -17 0 50 180 111 -17 -51 111 12 -34 146 -94 -152
5370 -152 191 -35 8 291 -133 66 16 57 -10 56 44 -95 -67 -306 123 -92 18 5 -9 114 39 -74 -33 1
5394 1 -151 3 -86 50 216 -25 -105 55 22 132 186 57 45 -162 -2 192 -69 58 118 25 115 -80 -128 -33
5418 -33 -114 124 65 168 -68 -42 -57 93 -44 -270 178 39 147 208 -36 -170 -66 182 -67 141 -128 389
5440 389 0 -5 -165 -118 -102 -226 31 81 -101 -67 -45 -6 -72 1 38 -12 113 -80 84 257 208 232 167 -31 110
5465 110 346 99 -46 135 197 65 -9 -189 123 -129 -88 15 22 23 -236 168 201 129 -8 310 98 -56 36
5488 36 13 45 -198 -149 0 -15 -38 79 40 22 121 -207 52 -136 -60 304 -41 38 88 -97 -98 -95 166 -26 -74 15
5514 15 73 178 64 -28 27 88 -14 104 117 145 -136 25 229 -25 -103 363 -142 186 196 -80 -16 202 -161
5537 -161 -33 242 -63 370 147 61 -237 39 -82 -93 -283 32 -321 -45 -89 342 103 -81 -17 -241 -96
5558 -96 -17 193 193 -130 137 8 -66 86 -273 -46 24 57 -122 41 51 -219 24 125 101 -61 -154 -47 -103 -233
5582 -233 128 100 -146 -101 26 95 229 -6 88 266 -45 -90 5 117 293 -51 -68 18 -21 -21 -177 247 168 -12
5606 -12 8 -25 21 -309 -26 135 -38 -25 29 -40 -205 19 10 95 50 18 -235 -110 51 -27 0 196 -6 56 27
5631 27 -7 -114 -52 -33 183 1 -156 -41 114 -265 134 -40 -140 -82 84 -51 185 148 21 236 -146 -159
5653 -159 149 -152 33 7 91 -37 -24 109 69 -131 244 149 -279 122 102 -57 -21 -17 28 -65 278 -20 43 77
5677 77 118 -9 -39 156 -121 127 19 -40 279 -102 112 -29 119 -14 9 195 -81 -37 45 -46 103 -92 -202
5700 -202 -59 -84 184 61 -56 -114 256 -50 82 76 46 7 -249 -38 122 30 -64 190 317 188 66 -191 -119
5723 -119 196 -345 -8 -46 -53 -237 48 83 -334 -97 -24 180 -45 -160 -72 21 -97 -54 -37 -8 -70 -71 43 -181
5747 -181 2 48 215 -18 -233 137 -14 -5 -103 -79 21 -16 -65 43 -79 -239 137 -172 -16 -154 -176 -194 -100
5770 -100 94 27 45 -71 -56 18 75 -28 184 234 120 -145 95 158 -89 -115 101 7 -102 164 -117 7 56
5793 56 -70 433 -82 269 295 -47 -154 -44 -143 -63 117 -116 29 -116 63 -134 189 -100 -48 -59 166 46
5815 46 159 78 25 -21 126 -78 92 266 161 -86 253 141 69 -61 -123 127 35 115 -61 291 -135 -60 -54 175
5839 175 40 197 -15 -217 -32 -76 -20 -79 153 294 101 85 -77 30 203 45 92 155 291 -81 -30 135
5861 135 79 -179 -56 171 -136 -57 18 -152 218 -205 7 -62 145 12 -17 -253 176 -40 -82 -41 8 27 -137
5884 -137 -51 -120 122 -197 95 213 127 10 182 -1 132 72 -244 86 -36 -30 -24 113 -130 169 19 -23 -124
5907 -124 280 -13 215 -46 -89 12 105 -162 42 198 -77 -92 3 112 -85 -10 -13 -64 12 183 1 -46 -20 22
5931 22 126 172 16 125 -132 -225 -95 -8 -24 -198 215 33 -26 -38 15 67 149 -66 -2 -114 -52 -101 122 88 -44
5956 -44 -42 -119 -85 27 50 -425 -138 225 -21 -14 -3 -97 -179 -38 62 30 238 -4 70 114 -69 17 -147 30 -107
5981 -107 -105 215 167 149 -279 -76 -40 -206 131 -215 -26 -227 96 -246 -111 39 -46 43 -38 -92 -130 -9 -106 261
6005 261 91 156 -129 -79 128 -112 18 20 24 -166 -87 270 -70 -69 158 91 179 -35 -115 -135 -136 -122 151 20 -205
6030 -205 -48 -83 -20 132 43 63 93 83 -81 -60 222 64 68 123 -74 -62 -98 -63 10 -35 -258 -98 206 134 14
6055 14 -26 46 -43 -115 -86 -171 -260 -13 -130 -55 34 -110 87 98 -138 174 -72 160 -63 194 -117 53 -20 -36
6079 -36 208 55 31 94 166 -267 -118 -86 -115 -70 -35 57 143 183 45 58 56 56 5 60 102 4 113 -49 -92 83 89 112
6107 112 -251 -24 -47 -40 -116 -36 -99 -80 -176 4 244 93 92 -25 124 -138 -141 86 -17 28 -119 -43 -201 -196 15
6132 15 181 90 10 -78 89 122 -91 214 -86 -95 -53 -96 161 -44 19 68 -145 81 87 123 -157 296 -83 -15 -112
6157 -112 221 -135 61 -169 -91 -54 187 -184 -41 156 15 227 -80 -289 125 -17 -11 -164 6 -3 62 -29 60
6180 60 41 221 310 -185 127 51 21 22 -58 143 52 -308 34 83 -18 -110 -111 91 -279 -54 99 68 -86 226 -53
6205 -53 -158 -19 61 128 161 90 -18 67 43 61 -66 -72 25 -182 -213 -4 -40 255 128 98 160 302 -77 124 73
6230 73 -4 212 -211 35 100 167 -76 54 10 78 7 270 1 2 -16 121 -29 372 23 -215 -119 -179 -61 91
6254 91 93 -80 113 -191 27 -75 -60 37 73 117 -11 -161 -30 -69 87 163 63 377 204 258 99 201 -145
6277 -145 -15 27 135 120 82 140 -31 -16 -223 58 -79 -69 -200 -74 -3 17 -13 -192 -140 -92 -44 224 -116 37
6301 37 257 156 57 37 -65 426 191 -36 -122 95 32 15 -204 197 185 -44 83 -117 173 209 -49 -265 -112
6324 -112 -176 72 76 169 43 9 54 296 60 86 -17 325 143 254 219 -93 -196 -6 -26 -99 47 39 134 -9
6348 -9 -71 -36 -66 -174 111 161 -12 -107 -176 14 -10 -174 41 -93 109 -97 106 -99 116 157 -51 29 -28 140
6372 140 -7 -42 -142 -83 176 43 11 100 52 82 25 149 -12 105 -126 115 162 -91 -58 -56 -110 -10 25 -11 103
6397 103 3 -67 -65 -176 189 79 -159 -18 60 -80 -24 -94 -25 -183 -60 -60 -39 21 69 42 29 -289 29 106 -198
6422 -198 78 148 15 102 128 162 165 125 -90 -88 60 -79 207 39 52 167 165 88 -47 101 3 -51 34 -15 27 103
6448 103 -107 -230 -39 14 236 -18 39 -36 -54 -38 -118 -155 -232 94 -59 -143 214 -12 19 42 102 -158 -62 169
6472 169 55 26 -219 -134 47 181 49 -25 -137 212 89 8 47 -217 -46 -81 -91 -44 229 -44 -95 94 8
6495 8 222 306 18 74 -98 8 18 95 1 34 26 222 -63 -333 16 -214 -435 -97 123 -224 -61 99 160 79
6519 79 77 136 120 -57 -13 138 -17 63 262 -115 -140 -165 -89 -137 -217 -327 -135 -49 109 202 18 61 -36 -8 -30 14
6545 14 -266 11 255 -139 -23 33 -73 -116 157 -16 190 239 109 100 59 -250 -14 -141 88 82 24 195 81
6568 81 -135 224 155 83 4 -204 -88 -126 -40 -100 -92 -20 113 -60 -49 120 -80 -16 83 115 -25 -53 -58 256 97 35
6594 35 252 75 -66 -151 66 -173 -144 195 -22 -87 292 -7 -201 -163 -37 5 80 -63 -149 55 -101 333 -99
6617 -99 385 45 -193 -58 -154 78 38 -60 78 33 -4 128 -285 175 41 131 -4 225 -63 -281 89 242
6639 242 53 -146 -224 -311 180 -1 70 -19 -113 -10 -13 -173 -100 -108 -107 -74 -64 -287 133 68 -55 -76 -24 26 78 -12 217
6666 217 32 -22 23 -60 117 -52 34 -59 33 -50 -50 -247 464 -145 120 209 37 -112 83 14 68 -59 284 152
6690 152 -68 296 98 -25 77 -211 171 39 195 28 209 93 -122 54 52 -48 -93 -148 -20 -10 -170 -16
6712 -16 -209 50 8 -110 183 62 93 -56 -25 42 42 159 28 319 22 -115 135 200 169 -141 -79 -47 173 -82
6736 -82 207 260 -32 19 117 -116 199 172 -103 209 86 -146 -59 -102 -219 -84 -150 -78 -7 -144 -59 83 138 0
6760 0 11 223 164 269 -251 -81 41 -141 -298 -53 -28 172 -41 -117 9 158 -73 166 70 -28 66 139 111 114
6784 114 111 13 69 -35 -68 -41 222 55 -273 -391 -63 134 -65 -130 -69 57 48 -57 97 -98 102 2 158
6807 158 -47 -22 -116 -13 -63 272 217 -107 -31 -139 133 72 71 -28 -72 86 115 163 32 104 130 268 170 -36 64
6832 64 -130 -170 109 -53 187 -254 -345 21 -19 -10 -268 104 -72 98 -147 129 48 43 51 45 153 22 -13 -39 -52
6857 -52 -173 100 -19 -214 -144 -187 -19 -16 161 -109 58 -1 80 -115 -157 52 36 -127 59 47 72 -221 37 -136
6881 -136 -324 197 136 -185 -179 12 217 26 54 245 114 -129 -176 -9 88 96 -27 -210 -171 217 76 -33 -42 -32
6905 -32 63 -50 -222 48 132 134 -58 98 68 41 245 -20 50 -85 43 405 50 91 76 57 -32 -40 39 48 -109 103
6931 103 8 134 -99 -169 -449 31 88 163 -95 -126 155 79 -62 22 122 -37 195 150 168 -171 -32 -93 -151 68
6955 68 200 293 -167 15 -197 142 -85 266 52 -199 -65 -52 -137 101 -44 -73 -105 -186 36 161 147 4 86
6978 86 10 120 210 227 -31 50 -141 -61 117 -33 16 -185 -56 48 -2 10 45 303 -43 -131 -163 -67 3 -52 85
7003 85 -34 138 -34 144 -60 256 -196 296 -65 116 -50 58 135 80 -75 -55 106 222 -354 -62 -78 -238
7025 -238 -82 -28 38 188 -103 27 50 83 70 -125 -122 -375 8 -118 78 40 -87 -144 89 -158 113 183 129 129
7049 129 -146 -50 -89 0 195 62 -2 179 33 79 48 7 157 33 35 -78 70 146 -43 50 -2 118 205 58
7073 58 -173 81 197 121 -151 -288 118 103 -113 -5 212 -25 62 -56 -34 139 173 225 -262 -96 -73 -60 -143
7096 -143 15 -9 -23 38 -8 226 33 255 -145 101 200 146 -46 149 334 -21 -364 113 -130 -154 -137 -209 -82
7119 -82 -45 84 -192 -171 275 -15 -5 -100 -49 74 -145 -68 -129 90 23 19 -87 50 -167 -95 -47 91 73 -51 74
7144 74 -27 -58 127 205 60 -8 26 27 163 149 -128 -72 -137 245 -20 214 -99 141 -104 -14 139 294 -185 9
7168 9 -53 179 -2 86 64 87 -80 -56 -118 -203 -141 -143 -42 -7 168 -185 -132 -87 -87 -142 -275 203 -136 48 22 6 -37
7195 -37 -78 -124 130 63 36 -70 73 168 28 310 104 -86 6 -62 -303 -3 127 -135 303 235 -25 203 210 -321
7219 -321 79 -106 176 -174 -283 -41 -50 26 -42 70 7 -116 42 148 115 282 109 49 52 85 10 158 -44 -61
7243 -61 31 94 268 50 113 30 202 -16 -150 -9 98 -74 115 55 -262 -121 -101 67 -143 -24 -188 -91 21
7266 21 66 64 90 -20 115 33 160 283 -87 -137 129 -67 144 -34 -98 59 19 93 14 317 -25 96 -29 104
7290 104 -83 113 -154 5 311 205 -448 -55 80 -191 -64 -151 51 -76 193 6 21 69 65 -22 -158 -42
7312 -42 306 -118 -77 176 152 256 -14 -168 7 31 -276 -63 -44 257 8 96 52 -21 -46 -33 105 68 33 -84
7336 -84 -87 135 159 -10 60 218 30 -302 20 86 162 34 -223 -12 -61 -177 -299 9 -19 -50 -381 180 124 162
7360 162 -37 -49 80 70 185 97 137 -34 83 -224 -77 -139 -104 -35 -71 -196 185 69 -63 71 -131 36 125
7383 125 203 94 -9 -57 93 -175 75 -11 -134 -88 -166 10 18 52 -25 -155 -21 57 41 -103 -147 -70 -110 -17 80
7408 80 80 -116 100 -280 9 233 -6 130 -49 158 -187 -277 142 -149 -36 -81 154 -245 109 -28 -11 -156
7430 -156 205 98 -18 -5 157 106 79 -63 153 -99 -90 173 50 23 -107 -215 87 -99 35 79 -45 -14 204
7453 204 87 -74 -174 151 152 -50 -38 -21 -250 -42 -149 -136 -40 -115 -1 -137 -148 -146 37 -83 -12 -36 258 -73
7477 -73 142 89 -100 -85 -44 247 -76 -252 -19 193 -190 22 -23 -51 -10 231 -44 -6 -82 14 112 124 140 -29
7501 -29 -138 19 131 -146 -115 158 93 -15 71 23 -247 -75 81 -78 195 -117 122 -85 166 -35 -5 34
7523 34 152 163 -133 47 39 -213 0 29 -13 230 86 82 -45 -239 42 78 303 101 -44 140 30 -46 -102 -18
7547 -18 -149 14 -181 21 8 136 -2 69 126 -14 -312 131 186 53 209 294 -34 -81 146 215 -50 111 86
7570 86 -176 4 -7 135 -7 295 -159 -205 -59 -314 230 -90 69 223 47 197 7 33 -16 275 -177 141
7592 141 166 -146 128 -25 313 150 272 52 17 -83 -73 219 -177 -34 -12 158 49 -150 164 39 -64
7613 -64 -178 19 -56 -23 -103 -53 88 213 -94 54 58 134 102 242 247 186 -109 49 52 -125 -85 -143 246 136 -20
7638 -20 184 171 -72 35 91 75 0 109 216 6 22 -127 -204 -32 135 -20 62 -14 -13 55 -94 162 -105 -121
7662 -121 75 95 -75 -72 -221 -101 -165 -127 -23 -48 -109 187 -338 97 -43 4 -223 -101 150 55 119 220 0
7685 0 65 -124 36 -175 -26 24 23 -17 -158 140 -190 34 -38 -28 41 -4 -5 6 -30 -127 92 36 -8 89 23 -18 -12 65
7713 65 -43 150 115 129 145 -4 280 -9 87 -28 89 250 249 165 -123 -56 16 -14 -236 46 -62 -36 110 224
7737 224 192 110 -320 -41 -142 -21 -37 -164 38 54 65 2 -364 -282 92 34 26 -151 67 82 -38 -150 -33 46
7761 46 116 -28 130 -103 -197 -5 -162 -105 188 21 -74 101 168 2 120 70 185 -168 35 27 71 -86 -91 -155
7785 -155 -244 0 -208 -99 211 59 -3 97 33 357 -2 78 153 36 -288 70 -210 -99 13 -4 -22 30 -134
7808 -134 -295 -190 65 -94 -77 -27 129 75 23 106 7 131 416 104 178 86 246 -181 -86 49 166 -216 139
7831 139 200 -15 -98 -153 -92 94 146 -71 102 -184 -265 -294 -101 -265 296 -282 94 92 84 29 71 -142 -46 -6 -20
7856 -20 -164 -120 2 4 54 42 -12 112 75 124 100 96 -84 -54 286 132 -52 172 153 170 -44 -77 73 103 -111 -76
7882 -76 107 -101 12 30 -10 152 132 47 70 46 -94 220 -39 -197 56 -67 -62 -31 94 -126 176 -315 -145
7905 -145 235 -156 -63 32 -61 94 154 -95 -61 -218 255 -4 -33 -137 -178 115 -51 119 242 -84 -2 97 124
7928 124 1 22 145 -96 -45 77 -54 -98 27 -23 24 96 -299 -100 28 117 -66 48 76 22 -199 213 206 47
7952 47 45 54 -56 -28 57 115 -19 171 -26 -190 44 81 13 -109 209 -101 -158 114 29 221 -78 -47 57 -91
7976 -91 55 -103 113 10 -106 170 -3 -280 43 31 -137 -135 -95 23 29 148 -6 11 84 264 -140 -42 -42 140
8000 140 37 68 -119 -75 22 -18 69 138 178 -67 45 -305 81 143 -4 -6 101 -179 65 -102 -30 91 16 -126
8024 -126 -144 142 253 -21 -76 111 -113 -113 55 -142 152 148 -188 60 143 -166 25 -20 49 223 -91 183 95
8047 95 -114 136 103 -199 -101 -79 91 -162 -181 21 66 -186 -230 -98 -170 26 43 -30 111 222 182 162 -117 289
8071 289 31 22 -122 -89 -7 106 123 143 61 -11 -91 180 198 112 30 190 24 344 -200 -61 -37 31 10 -170 185
8096 185 -90 219 40 30 -72 260 61 130 147 -40 -7 -112 -58 35 91 160 -118 220 -53 73 -84 82 -101
8119 -101 -87 -115 64 -69 -83 -132 -55 389 120 158 283 126 -8 -95 -69 -20 115 -278 191 -123 42 -78 54
8142 54 82 -97 -1 106 168 181 101 74 -31 -140 25 31 -140 -148 -36 -19 -113 1 -202 43 -137 91 17 -81 -123
8167 -123 -54 -67 88 66 43 -166 -61 -177 233 -128 -97 55 -17 -111 105 2 31 100 -212 204 48 91 -9
8190iq1
8191i0
$$ Imaginary data points
##PAGE= N=2
##DATA TABLE= (X++(I..I)), XYDATA
0 0 0 0 0 0 0 0 0 0 0 0 0 0 0 0 0 -8 8 -8 8 -8 11 -16 16 -16 24 -24 32 -32 40 -46 51 -59 67 -75 84 -94 107
37 107 -118 131 -147 163 -181 201 -224 246 -271 298 -327 363 -399 440 -484 535 -590 652 -724
56 -724 807 -901 1014 -1149 1313 -1519 1784 -2143 2656 -3437 4774 -7485 15103 -80006 -267194
71 -267194 21386 217913 14001 -156668 1700 117408 -4949 -92344 -1386 59762 28768
82 28768 6410 -15420 -63222 -21940 81859 65027 -56026 -68176 20047 34798 -15611 -9552
94 -9552 15788 -2060 -9616 701 -29208 -32229 52279 76004 -48821 -108491 20059 103981
106 103981 1448 -72160 7776 53580 -19452 -43750 24433 42931 -2120 -12201 -6159 -24406
118 -24406 -3033 49973 23180 -47313 -26400 31194 -101 -34781 24581 46821 -40916 -63166
130 -63166 34833 51445 -42388 -36639 59430 28807 -78392 -37280 77996 46622 -53988 -30651
142 -30651 35855 7571 -25348 19186 32877 -21323 -23778 24291 7420 -33259 9537 51787
154 51787 -10547 -64687 -3736 53628 6236 -37804 -2294 20124 -13263 -21627 11456 17286
166 17286 -2812 -6226 -7114 -13140 5653 27142 3852 -21305 767 16990 -10927 -13094 29137
179 29137 24604 -29554 -26028 26286 19254 -24348 -4736 31699 -6424 -43593 3853 41710 -6490
192 -6490 -37620 10289 28002 -25614 -34107 28135 39363 -22129 -39722 8992 30249 810
204 810 -15593 -1349 12107 9206 -6394 -18106 2956 34817 14574 -38652 -27493 36034 34722
217 34722 -29410 -32095 26263 24813 -31167 -26410 27697 22541 -23875 -19566 13134 3879 -15005
230 -15005 6451 19590 -9780 -24607 6261 23392 -606 -14684 2555 13786 938 -10120
242 -10120 -3643 11783 16329 -1702 -22698 -8357 24652 17137 -21333 -19353 18440 15045 -24037
255 -24037 -18192 23406 17364 -24075 -19915 15897 11734 -14757 -4783 16157 -463 -18792 1158
268 1158 20234 2617 -13423 1013 12023 -1028 -8516 4380 11961 2323 -7514 -6744 2053 9482
282 9482 3721 -8879 -7543 6487 4563 -11546 -7267 12171 6758 -16391 -11537 11691 7898 -10095
296 -10095 -4180 10191 -698 -12638 3248 15479 -664 -11715 4445 12106 -4530 -9178 10059
309 10059 14166 -6664 -13816 3620 11857 -538 -8852 -1499 4836 -526 -7198 -4378 4874 6039
323 6039 -5813 -11530 381 10151 -83 -9460 1340 9606 -3067 -10714 5281 14774 -1664
336 -1664 -12025 3966 12762 -3115 -9411 7544 12656 -6428 -13469 5378 13183 -3558 -12042
349 -12042 1288 8215 -4367 -10998 965 9207 -617 -11324 -4759 7401 4946 -6661 -5687 6625
363 6625 6388 -6447 -6987 8132 11107 -4383 -9603 4678 10892 -2585 -7340 5591 8767 -6060
377 -6060 -9443 5901 9524 -6034 -10292 4385 7914 -7479 -11020 5314 10800 -5918 -14691 713
391 713 12913 1809 -12498 -3946 11173 6371 -9267 -6821 9793 10985 -4733 -9411 3495
404 3495 10523 343 -5808 972 4422 -1851 -3492 3482 2953 -5475 -4013 5184 1990 -9681 -5694
419 -5694 9556 6608 -11694 -11847 8189 12841 -5663 -13232 3470 13446 -756 -11905 966
432 966 13077 3234 -9415 -1780 9314 3021 -5833 516 7240 -848 -8672 1065 9693 -1011
446 -1011 -11931 -2053 10446 1308 -12517 -4884 9867 5071 -9854 -8284 5532 7283 -1823 -5138
460 -5138 -263 2703 2169 2131 351 -3096 -93 7161 4465 -5867 -6080 6852 10465 -3279 -12367
475 -12367 -1781 11945 6273 -10518 -11917 4576 12562 -1436 -15734 -6194 13101 9473 -12429
488 -12429 -14846 6927 16874 -2041 -16256 -2143 14857 6417 -9373 -5244 7516 6933 -3064
501 -3064 -2703 2360 1332 -307 2956 1727 -6126 -5055 7959 7805 -9239 -12849 6184 13565 -6253
516 -6253 -17032 2588 15997 -2413 -17350 108 16349 282 -15224 979 15356 -1255
528 -1255 -14369 3997 17358 -2389 -17325 3593 19799 -456 -18896 -505 18950 2943
540 2943 -17189 -5704 13154 6279 -10376 -8196 3789 4801 -1805 -3688 -2679 -1458 2074 3742
554 3742 -1969 -6522 -182 8480 4018 -7462 -6051 7121 10797 -1253 -10572 -1617 11335 7565
568 7565 -7452 -9631 4810 11545 -734 -12112 -4827 9434 7363 -8062 -11681 2207 10908
581 10908 104 -11980 -4917 9097 5512 -8337 -6433 6898 6563 -5330 -4425 6031 4289 -5284
595 -5284 -1224 8398 1958 -8235 -31 10761 1236 -10874 -1129 10867 1263 -10690 -2041 8267
609 8267 -276 -8561 -432 6246 -2789 -7160 3332 6357 -5776 -8199 5615 9761 -4846 -10776
623 -10776 4039 12960 303 -11271 -1247 12291 5950 -8768 -6579 7508 9258 -4266 -8965
636 -8965 1271 7211 211 -5701 -2204 1924 86 -1243 -550 -2258 -3128 1825 4340 -3121 -7605
651 -7605 1357 8999 731 -9359 -2061 9815 5553 -6784 -5336 6194 8036 -1743 -6929 585
665 585 7481 2465 -6202 -4203 4888 4715 -4427 -6112 2364 4484 -3570 -5779 1874 3837 -3589 -4774
681 -4774 3301 3855 -4420 -3968 5353 4627 -4815 -4328 5627 6126 -4035 -4623 4766 6506 -2607 -5108
697 -5108 2838 6336 -1324 -5948 307 5499 -235 -6195 -1345 4632 515 -6332 -2405 4974 1423
712 1423 -6255 -2892 5634 2651 -5805 -2899 6227 3560 -5394 -2890 6418 4821 -4507 -3088 5759
727 5759 4878 -4544 -4247 4517 4932 -3313 -5153 2547 4724 -2384 -5788 196 4311 -1016 -5515 -1040
743 -1040 4046 511 -5152 -1784 3700 1464 -3747 -1276 4290 1851 -3522 -453 4968 1919 -3435
758 -3435 -533 5280 2430 -4226 -1763 4863 2357 -4601 -2965 3609 2306 -3986 -3734 2433 2339 -3485
774 -3485 -3989 1853 2769 -2589 -3742 1437 3190 -1453 -3389 1508 4143 -429 -3359 1773 5138 -354
790 -354 -3978 1188 5404 178 -4795 176 5177 387 -5360 -1390 4265 951 -5198 -2084 3558
805 3558 928 -4492 -2031 2961 1055 -3438 -1775 2643 1317 -2832 -1402 3521 2072 -2220 -1413
820 -1413 3619 3065 -2418 -2169 3255 3845 -2166 -3824 2854 4297 -2292 -5353 1440 4957 -1652 -6335
836 -6335 -53 5013 -1172 -6527 -804 4876 111 -5116 -1136 4516 1252 -3764 -718 3804 1766
851 1766 -2321 -431 3491 1727 -1928 -627 3351 1812 -2694 -2034 3340 2527 -3270 -3243 2587 3456
867 3456 -3392 -4938 1764 4227 -2563 -5535 910 4544 -1469 -4716 964 4283 -1010 -3773 1515
882 1515 4211 -1035 -3001 2103 4193 -841 -2906 1567 4227 -303 -3800 -158 3867 950 -4215
897 -4215 -2458 2975 2213 -3438 -4418 1734 3346 -2189 -4618 754 3514 -1232 -3698 1123 2963 -1181
913 -1181 -2001 2632 2776 -2305 -1266 4176 2890 -2951 -2019 3706 3396 -2580 -3044 1974 2732 -1318 -3450
930 -3450 -524 2077 398 -2082 -2086 557 1513 -1112 -2780 308 2319 -1012 -2612 1542 2895 -1903
946 -1903 -2898 3268 4170 -2713 -3869 4563 5641 -3319 -5381 3380 5801 -2160 -6009 1339 4966 -1045
962 -1045 -4530 -850 2494 -113 -2431 -1075 859 -240 -1442 -280 972 -982 -1858 1092 3164
977 3164 -283 -4165 921 6409 1095 -6722 -1131 8232 3127 -7755 -3430 8218 4374 -7338
991 -7338 -4379 5896 3440 -5771 -3398 3824 1053 -4516 -942 2846 -1431 -3857 1615 2953 -2281
1006 -2281 -3088 2319 2927 -1505 -2244 1371 2031 267 -244 182 386 1314 1695 -878 -1878 1461 2447
1023 2447 -1566 -2409 1103 1639 -2103 -2127 1298 398 -2995 -965 2156 -87 -3306 -916 2826 810
1039 810 -2885 -1229 2346 2477 -1047 -2305 469 3900 1948 -3167 -2231 4488 3920 -3180 -4323 3629
1055 3629 4242 -3514 -4601 3388 3241 -3782 -3037 3665 1041 -5866 -959 5505 -874 -6994 696 7205
1071 7205 -1168 -7543 1406 7920 -832 -6644 1258 6722 69 -4697 612 4141 495 -2332 201
1086 201 1471 277 -1124 -563 57 449 -256 -1683 -852 1656 -476 -2815 -536 2381 -473 -3574
1102 -3574 385 3772 -830 -3442 1526 3802 -1092 -3062 2113 3557 -1354 -2136 2672 2097 -1954
1117 -1954 -1243 2140 996 -1990 -645 1078 148 -892 -408 -927 -705 707 -472 -2811 -644 3182
1133 3182 220 -4010 -623 4667 491 -5146 63 5715 453 -4799 1014 5347 -810 -4260 1855
1148 1855 4417 -1592 -3549 2135 2911 -2834 -2952 2275 1932 -2464 -2104 1184 717 -1372 -1441 -180 275
1165 275 -35 -752 -1146 807 2135 -154 -2305 924 3646 -815 -3173 1811 4252 -1230 -3660 2175
1181 2175 4169 -2167 -3884 2296 3623 -2607 -3519 2264 2154 -2693 -2570 1550 982 -2470 -1404 1174
1197 1174 353 -1315 -402 490 151 354 37 -772 795 1709 140 -1602 1219 2839 -677 -2732 1816
1214 1816 3672 -1638 -3402 1850 2871 -2683 -3527 2485 2451 -3271 -2885 2427 1700 -3050 -1855 2468
1230 2468 1065 -2740 -1166 2391 907 -1739 -340 1310 877 229 -349 492 1129 1467 -495 -963 1340
1247 1340 1654 -1335 -1985 1528 2082 -2466 -2599 1957 1544 -3038 -2146 2657 1363 -3452 -2076 2654
1263 2654 1396 -3201 -1090 3208 777 -2464 -54 2651 968 -1525 202 1829 685 -418 -240
1278 -240 532 499 -80 -956 -393 932 437 -1831 -1227 1366 820 -2516 -1888 2148 1175 -3159 -1707 3027
1296 3027 1228 -3196 -1193 3492 1056 -2648 -402 3353 1058 -2418 74 2844 831 -1818 65
1311 65 2109 371 -1419 -435 508 166 -882 -1068 173 702 -289 -1631 -521 965 -53 -2102 -481
1328 -481 1979 429 -2033 -225 2749 583 -2467 -154 2966 701 -2403 80 2871 336 -2182
1343 -2182 -102 2322 51 -1956 -183 1515 -49 -1289 -551 560 109 -1039 -980 68 566 -368
1359 -368 -1124 -93 1236 66 -1325 209 2077 378 -1478 468 2470 583 -1835 77 2596
1374 2596 477 -2145 33 2441 -4 -2307 -205 1825 -197 -1905 -509 1414 -194 -2189 -416
1389 -416 1019 -125 -1559 -903 1324 799 -1168 -740 1219 1348 -850 -1336 1239 2233 -639 -1699 1086
1406 1086 2289 -257 -1979 307 1884 -547 -1921 374 1745 -859 -2079 81 1586 -936 -2308
1421 -2308 441 1794 -843 -2110 405 1953 -118 -1820 487 1895 419 -1580 204 2188 697
1436 697 -1408 14 1916 691 -1469 -572 1423 335 -1534 -853 1065 386 -1446 -1340 779 595
1452 595 -1486 -1257 1076 1042 -935 -1325 736 1467 -360 -881 273 1289 282 -755 335 1251 112
1469 112 -677 14 956 168 -791 -280 629 -1 -903 -840 511 -92 -1014 -1061 437 212 -1174 -1398 360
1488 360 1005 -547 -1589 387 1891 -97 -1657 415 2437 406 -1467 247 2571 482 -1709
1503 -1709 75 2115 221 -2211 99 2141 -327 -2377 -320 2150 -389 -2334 -358 1959 -200
1518 -200 -2317 -232 1844 19 -2054 -96 1933 501 -1499 -239 1832 852 -1074 -7 2161
1533 2161 713 -1124 -520 1440 660 -1396 -826 1226 496 -1633 -1214 923 640 -1514 -1365 1031 717
1550 717 -1325 -996 570 652 -298 -707 601 654 -159 -189 249 765 288 -360 259 660 825 -463 -303 420
1570 420 353 -506 -722 511 551 -800 -1309 318 676 -653 -1840 210 1082 -676 -1722 537 1417 -480
1588 -480 -1414 709 1485 -353 -987 821 1564 80 -1093 390 1662 148 -1178 174 1372 282
1604 282 -1307 -469 1443 117 -1424 -874 973 142 -1625 -903 1120 455 -1470 -924 1254 758 -1520
1621 -1520 -976 1445 895 -1036 -481 1668 1081 -958 -336 1518 1159 -1005 -742 1251 825 -850 -870
1638 -870 504 593 -683 -835 -108 904 -566 -870 -184 722 -392 -1197 -446 937 468 -994 -107 1215
1656 1215 597 -959 -130 1100 838 -556 -321 1078 820 -600 -526 1039 596 -874 -597 690 397
1673 397 -994 -772 489 229 -989 -1092 309 372 -606 -793 -43 1005 44 -798 -413 1081 662 -586
1691 -586 -128 1571 658 -858 -19 1306 472 -1027 -224 1251 539 -1558 -765 1048 214 -1605 -863
1708 -863 1190 153 -1345 -797 962 419 -1039 -783 952 721 -803 -463 854 727 -542 -718 432
1725 432 1039 -89 -434 500 962 -85 -908 97 1115 -246 -1203 -122 1044 -316 -1562 -253 902
1742 902 -201 -1388 -329 1158 -20 -1122 -116 1350 -45 -899 167 1218 543 -677 -27 1308
1758 1308 508 -258 -203 954 562 -457 -489 266 667 -388 -699 60 523 -555 -1170 6 500 -553
1776 -553 -1216 -74 776 -165 -720 31 1129 207 -775 169 1182 247 -738 296 876 403 -519 89 756
1795 756 326 -658 -349 503 253 -648 -560 577 352 -769 -928 -16 505 -496 -647 431 721 -165 -852
1814 -852 495 918 140 -736 350 1190 145 -675 311 1015 28 -707 141 1550 49 -1246 -231 910
1832 910 29 -949 -363 940 91 -1179 -625 811 263 -1072 -450 861 388 -690 -573 724 889 -503
1850 -503 -410 1064 865 -280 -556 903 1051 -175 -734 337 1073 -373 -617 354 1019 -489 -1094 241
1868 241 499 -568 -1114 158 559 -531 -1023 160 732 -303 -962 230 1024 171 -500 42 1078 189
1886 189 -545 118 850 348 -407 -89 757 252 -528 -260 281 229 -566 -475 0 234 -318 -486 86 364 -513
1907 -513 -594 101 599 -401 -583 172 658 137 -526 333 620 19 -303 202 716 404 -468 18 523 326
1927 326 -560 -422 565 532 -697 -812 204 403 -948 -784 338 594 -650 -699 498 924 -375 -869
1945 -869 501 934 -448 -589 405 1104 -227 -812 505 916 -385 -827 243 850 -380 -1034 156
1962 156 858 -315 -1062 -169 580 -349 -1153 -171 580 -40 -589 2 843 242 -743 -143 1052 358 -813
1981 -813 11 912 372 -486 -16 1108 552 -604 -312 513 -2 -543 -417 591 207 -487 -652 353 99
2000 99 -644 -692 219 108 -235 -574 145 382 -117 -126 -94 662 297 -517 -131 526 424 -317 -401 322 319 -491 -404
2023 -404 277 417 -493 -492 171 321 -633 -863 426 181 -393 -546 195 501 -584 -562 308 745 -295 -620
2043 -620 147 884 1 -201 125 846 72 -347 -27 624 154 -670 -73 561 314 -800 -349 697 111
2062 111 -748 -532 816 162 -779 -551 780 210 -904 -353 821 174 -568 -150 784 547 -204 -34 649
2081 649 407 -281 162 199 344 -493 -428 471 236 -263 -587 -60 248 -260 -598 -189 569 -49 -833 -297 630
2102 630 -199 -784 -38 939 353 -626 -36 865 160 -753 69 902 287 -358 285 579 162 -275 145 407
2122 407 77 -585 -219 158 38 -78 -470 -300 88 -64 -592 -253 383 109 -581 63 969 300 -719 14
2142 14 1007 295 -632 206 997 376 -857 181 1021 37 -487 -4 432 -48 -565 -136 209 -279 -554 -3
2162 -3 -109 250 -492 -458 -96 298 -91 -575 288 755 -9 -502 54 1021 -11 -630 476 1174 -75 -499
2182 -499 251 920 -343 -847 105 695 -567 -747 281 350 -513 -516 291 433 -242 -306 267 308 -233 -272 -140
2203 -140 329 244 -2 -214 185 263 15 -235 182 861 -161 -558 156 618 -88 -584 302 550 -789 -927
2223 -927 57 428 -416 -713 0 495 -461 -288 260 183 -160 -80 73 33 -48 142 23 -73 398 143 173 435
2245 435 377 83 -246 32 320 -134 -590 68 511 -327 -784 180 488 -678 -715 253 476 -625 -650 481
2265 481 359 -669 -418 484 212 -234 163 332 401 -174 -283 -84 195 219 -282 -33 57 9 -225 -492 174
2286 174 221 -567 -393 441 403 -475 -460 298 250 -773 -386 581 352 -657 -151 582 198 -569 -90 727 194
2307 194 -381 -79 569 170 -69 -255 400 53 -208 -309 160 253 65 -306 -318 -21 102 -447 -259 203 -52
2328 -52 -544 -388 391 28 -592 -187 787 339 -339 132 647 181 -292 -37 643 38 -258 -6 305 6
2348 6 -220 -10 14 -322 -401 88 -158 46 -55 -305 -200 357 154 -477 -31 405 398 -313 -272 685 327 -214
2370 -214 -96 402 147 -706 62 621 223 -621 76 280 163 -464 -338 269 26 -494 156 190 6 -370
2390 -370 -259 213 16 -112 -335 186 387 -172 -519 265 463 -60 -399 387 718 21 -619 95 677 23
2410 23 -563 341 544 -358 -329 110 409 -251 -550 -252 430 -152 -425 -301 281 -94 -388 93 136 282 -52
2431 -52 261 73 185 -115 17 177 303 -198 -190 94 272 -52 -215 -117 313 -429 -248 -273 119 -207 -684 6
2453 6 222 -270 -383 121 166 -128 -177 -115 328 -1 259 193 102 163 -18 -279 261 275 -263 -285 27 134 -78
2476 -78 -275 191 426 -310 -113 282 456 -164 -440 241 449 -587 -166 122 417 -320 -332 324 570 10
2496 10 -17 379 392 33 -306 250 494 87 -183 -15 354 -12 -241 37 357 132 -509 -266 283 81 -573
2517 -573 -308 117 126 -386 -211 301 -217 -175 120 247 -47 41 -126 249 325 -35 52 269 219 27 -147 169
2539 169 286 -255 -220 271 321 -131 -274 -67 328 -254 -535 -116 142 -379 -620 101 425 -256 -228 -11 359
2560 359 199 -71 -25 495 102 -348 236 312 171 -169 -67 275 58 -551 -283 15 -178 -130 -361 203 55
2581 55 -442 -294 151 230 -106 -475 -25 185 -2 172 -49 413 35 -152 380 300 -14 -362 -25 167 126
2602 126 -12 191 108 -21 -308 -126 -169 -152 -264 -27 180 28 -66 -296 306 201 -116 -130 406 218 -138 -183
2624 -183 -48 186 -280 -209 158 490 112 -11 19 75 35 -26 46 81 -171 -217 169 220 21 -298 78 39 21 -286
2648 -286 89 281 177 -221 -196 254 128 -226 -34 193 522 -381 -95 518 386 -250 -83 520 144 -285
2668 -285 83 368 187 -470 36 26 -231 -268 -116 9 156 -207 95 205 215 -117 -73 129 150 -21 -114 -89
2690 -89 70 30 -46 221 269 374 -237 250 63 16 -148 -200 139 217 -126 -224 -36 -19 -396 -193 308 106 -231
2713 -231 -138 -108 -123 -149 -216 17 -95 190 145 106 332 211 -196 198 216 483 -116 203 518 190 -299 -83 138
2736 138 175 -346 -279 285 -99 -281 -209 220 -163 -372 61 126 151 -282 163 412 151 -245 56 297 267 -75
2758 -75 209 244 -111 -224 -58 137 317 60 7 205 -184 -34 -284 142 354 -264 -251 164 140 -5 -405 -20
2780 -20 -4 -47 -435 35 133 -281 -313 4 263 -198 -38 246 109 97 91 59 44 -87 -20 79 -31 51 100 -109 73
2805 73 195 158 -246 -321 166 -6 -309 -137 -18 -247 43 213 256 239 -177 153 199 272 -233 238 440 117
2827 117 -114 -135 438 314 -178 -206 173 -186 -391 -183 -16 44 -88 -137 122 132 -136 -88 168 215 -141 -158 145
2850 145 91 -276 -125 340 230 -293 -175 179 249 -141 -104 120 212 -236 -125 22 94 -72 88 300 216 -132
2872 -132 -136 239 89 -277 -141 -183 176 184 81 -234 -43 110 28 40 295 45 -31 41 178 38 207 28 103
2895 103 229 -27 46 229 236 -175 96 -81 -122 -326 112 -151 115 19 -90 -237 123 163 -71 -232 169 201
2917 201 58 -192 87 176 161 -178 305 198 -41 34 156 -26 -78 -87 203 104 -425 -130 67 -117 -389 -441 181
2940 181 172 -416 4 -136 45 -178 -115 187 63 -286 -199 350 379 -212 199 101 449 -432 -295 37 205 55
2962 55 -287 302 292 -66 -466 180 -125 75 -71 -165 249 -54 -203 143 234 -54 44 -90 57 68 -136 44
2984 44 165 5 306 2 172 -115 159 58 205 190 -26 -198 12 0 29 -102 207 101 -70 -264 -153
3005 -153 91 294 -78 -201 358 75 42 -271 239 275 -67 -102 352 88 -57 280 314 66 -243 63 -56
3026 -56 -57 -74 -107 120 -136 -190 -513 95 87 -401 -133 152 14 -431 -257 70 -75 163 -95 -69 271 101 82
3049 82 -162 191 -15 157 387 117 206 -71 81 4 1 -205 -142 -81 -197 -483 79 -189 33 -59 -117 -77 256
3072 256 184 -66 219 -187 -110 53 54 57 -3 127 158 120 -50 -110 82 70 -115 -154 -63 278 -232 -101 19 257
3096 257 180 -435 -61 86 25 -108 -218 359 165 -77 177 238 -137 -62 266 360 -11 -133 -76 7 199 -34
3118 -34 -123 240 183 -94 -138 -130 -17 -30 -183 -6 -14 -321 -14 -136 50 -297 -93 328 83 -35 -115 -7 -137
3141 -137 -57 -8 -45 230 -28 -157 122 144 96 0 6 48 148 -82 168 308 -21 -285 93 46 -11 76 -150 -74
3165 -74 -96 -95 -218 24 -18 192 -157 -77 183 -130 166 -4 127 -47 29 130 211 -99 31 180 184 209 -234 184
3189 184 -209 -82 -50 -78 145 45 -130 25 -3 -3 -64 -192 129 117 174 44 36 26 -124 -59 40 49 3 50 84 187
3215 187 -108 -84 214 112 113 -56 -10 37 -186 43 -77 199 -442 -179 109 320 -118 -184 94 -10 -52 61
3237 61 151 -7 -36 -127 134 113 -194 -96 -93 255 -192 -63 -3 178 -5 -147 -243 -42 206 -44 -261 -50 208
3260 208 -169 -212 50 -191 -189 32 47 24 -163 27 -51 -145 -176 -167 14 -28 -91 127 114 244 181 -122 -135 -126 91 136
3286 136 -173 165 -62 -332 -297 19 76 -178 -422 -3 324 -267 -76 380 385 -81 138 101 168 -55 -63 469 -49
3309 -49 -106 0 188 124 -69 -57 143 -85 -212 57 -16 172 142 -365 25 -52 179 -241 -155 213 160 -94 -61
3332 -61 173 -167 -74 71 71 57 -79 0 169 74 -160 191 -44 130 -53 -8 120 -116 163 44 93 -140 7
3355 7 236 -95 345 114 47 -86 -112 171 -106 -226 298 -3 -208 -1 -94 129 -113 107 140 328 -232 -52
3377 -52 -2 159 190 -210 253 -35 -289 191 174 170 -176 -59 12 -148 82 -23 215 -23 72 -107 47 -100 21
3400 21 -34 16 175 103 -85 25 175 49 -196 270 153 -275 -126 54 26 -143 -106 -15 6 -134 -312 112 126
3423 126 -329 44 86 199 0 -197 -91 -85 -93 143 -30 1 125 114 54 174 94 172 -103 398 61 -192 124
3446 124 -4 98 -21 141 142 -76 243 9 -195 22 -78 -91 -32 -116 -296 -75 280 192 -165 -70 -4 45 -103
3469 -103 -103 -3 320 64 -129 -174 269 40 -56 -167 18 -137 27 -52 2 -13 -39 -191 144 121 -32 -1 45 58
3493 58 -31 -94 -76 186 -57 -34 100 127 -292 -217 -92 245 -79 -132 -121 227 -66 -82 41 147 237 -290 -78 103
3517 103 12 -172 101 -140 211 -63 -163 235 19 -78 73 313 91 -107 -88 -66 107 156 133 2 -57 -55 64
3540 64 255 81 -1 32 165 182 -260 199 -39 49 -123 6 -51 124 29 79 -100 119 75 -114 79 121 9
3563 9 103 122 86 165 -138 -9 531 -107 -62 152 230 54 -81 -217 281 62 -155 -92 -15 -229 -200 -8 138 9
3587 9 -112 -446 121 50 -295 -90 -59 265 -40 -29 49 -123 -348 73 201 107 -21 106 51 62 -75 -165 12
3610 12 -6 -191 -250 -92 176 259 -89 -8 326 -295 -155 51 162 215 17 98 -140 -34 47 -87 -34 -92 -195
3633 -195 44 179 124 48 -91 -50 -24 -62 -300 66 114 -5 96 -193 85 -94 77 52 -151 -57 -41 51 213
3656 213 105 -35 120 174 33 -109 -179 125 111 -148 186 -1 127 69 -30 229 102 -30 -238 182 -130 102
3678 102 -45 132 151 -209 -166 -79 -243 -18 -208 -132 135 197 -225 132 169 -117 -180 184 53 86 -124 -151 47
3701 47 -101 3 62 -239 180 -215 -24 348 -229 -126 -57 -200 -34 -112 0 -179 -142 -3 42 -133 -184 71
3723 71 -134 -55 50 57 50 -57 -262 -159 -94 -42 201 -180 13 -81 4 -230 -348 221 1 -126 -214 -10 33 -53
3747 -53 106 174 77 -78 33 -25 -15 17 -131 116 298 84 281 -101 -92 40 -89 105 134 321 -130 -9 123
3770 123 -123 171 -203 95 111 -148 -63 229 -8 -3 70 -30 -25 -148 36 -146 14 74 -42 117 421 -162 106
3793 106 11 164 12 339 -92 156 116 205 -89 122 13 -6 64 -25 113 70 -63 -144 -122 145 77 31 69 -18
3817 -18 149 -28 186 235 80 -109 44 -215 -149 -134 43 44 23 60 -180 53 -204 -35 -37 244 -174 -183 104 142
3841 142 -135 8 78 -38 -141 -18 179 208 -155 80 168 -37 -261 -87 10 234 65 36 -108 -4 102 -85
3863 -85 -13 -177 -261 124 21 28 -33 128 -150 123 -38 114 -138 -23 120 184 61 11 134 -48 -49 -99 -138 -113
3887 -113 137 126 229 -25 -4 241 -10 120 -311 382 30 -68 -97 128 173 -182 -202 -123 40 -99 -9 124 -204
3910 -204 -85 -91 -237 139 29 82 186 291 74 25 35 42 9 69 158 -212 46 -173 -14 302 134 18 -81 -358
3934 -358 38 -224 191 -12 -44 16 -56 168 -80 -182 -116 -47 -102 20 -74 -233 -51 154 -52 13 83 -138 -247
3957 -247 -34 100 60 227 231 -279 93 -229 147 7 -33 -33 67 -23 107 86 3 133 -110 -53 -147 9 -44 -311
3981 -311 144 257 126 58 -16 124 65 -21 19 -63 -33 99 -18 -44 -168 -199 -14 -75 303 -149 -127 71 -14 -191
4005 -191 46 -90 -8 -127 -38 194 195 -160 283 18 -122 145 -432 300 111 215 85 84 -175 152 -119 162
4027 162 86 -39 -138 -192 32 34 154 -79 -254 60 -84 -20 17 -12 141 -150 -56 50 -70 -163 142 221 128 11
4051 11 -5 77 -58 91 123 -124 98 -12 188 8 39 -131 -95 -167 60 -104 -100 -120 -140 42 157 41 -71 59
4075 59 134 240 124 81 -1 50 87 92 -28 -255 -16 87 99 191 83 -97 -139 85 92 -61 125 -136 39 -19 -67
4100 -67 -90 -150 -153 198 167 40 -240 -233 42 167 176 -4 -129 252 100 113 -74 -37 154 299 -64 97 240 -4
4124 -4 -257 154 -171 73 -68 135 133 28 -92 208 31 114 102 48 159 -206 132 293 62 -51 -37 -193 110
4147 110 180 -104 -15 129 73 181 295 -71 -182 -6 -15 -5 -41 68 -104 100 198 -88 -120 -35 -9 -20 -112 -260
4171 -260 -85 208 -218 8 -275 -52 -1 -126 205 -7 -94 126 -151 -173 -81 67 -140 74 -278 -110 30
4192 30 -88 -117 20 -37 154 60 34 30 46 131 67 170 -120 132 116 -234 105 -130 -2 -137 79 167 119 -128
4216 -128 2 -10 13 106 -64 -17 -2 -31 -157 -256 -82 25 91 146 -76 5 112 -113 -334 -52 -203 129 34 -157
4240 -157 134 24 -75 49 102 -117 -78 -74 146 76 -19 218 272 165 2 21 -25 59 -90 -14 3 -86 81 161 282
4265 282 -67 -92 -235 -163 155 60 -85 287 34 28 83 255 85 67 -37 -122 -105 -33 -138 -25 -23 197 -51 385
4289 385 -137 -33 180 -155 83 32 -178 6 -164 -51 74 35 4 61 162 -69 170 89 -24 37 -164 -23
4311 -23 139 -186 177 31 -88 -190 79 -248 61 5 -125 154 -135 79 70 53 -46 -68 -179 155 117 -87 -136
4334 -136 81 -270 4 -140 -97 300 -4 -75 -150 -49 170 31 99 -229 -38 -23 -34 -22 152 9 121 16
4356 16 -89 130 174 41 57 140 34 -14 256 79 335 3 -106 -65 -30 -133 -98 -135 108 59 -190 -93 5 127
4380 127 -47 -263 -177 31 15 -73 -65 -169 11 90 -133 -54 -17 80 43 -182 -27 -202 93 76 171 127 -84 50
4404 50 70 87 57 58 134 -118 2 143 108 -116 -191 216 -6 80 -11 -188 40 39 -77 -12 -13 -130 170 -244 86
4429 86 81 -179 42 -99 74 -244 -241 95 61 -79 30 -24 41 -83 173 4 -178 239 269 11 -78 86 2 -6
4453 -6 -138 57 103 95 -93 -57 -53 -71 -124 -94 123 255 -198 -84 -161 120 -58 7 -10 -40 76 -43 -143 -286 -133
4478 -133 64 -159 -164 116 123 -314 -25 208 66 -55 64 53 100 54 -213 -218 26 129 -264 -54 120 -22 186
4501 186 -153 -29 -54 -92 -22 2 86 -28 59 -123 -77 -203 144 255 -212 -20 8 -60 -80 -41 199 -34 -170 34
4525 34 -97 63 33 39 -25 83 -52 -48 -111 -123 82 -38 32 143 73 -235 104 2 114 28 -84 -73 197 -34
4549 -34 7 92 140 290 -118 -94 285 10 -123 -55 -35 -212 53 -185 -99 57 169 -72 151 28 58 91 -30
4572 -30 178 103 4 -92 -14 -212 -202 -283 8 -1 -123 -43 -75 -18 52 -161 98 92 -148 120 173 113 171 62 49 135 196
4599 196 163 -29 210 -97 -67 -5 51 -35 -9 -32 -71 283 119 -309 -45 -289 17 -229 27 -163 -268 109 -100
4622 -100 50 -72 172 -173 81 -19 -59 163 -89 -46 103 17 22 -80 205 25 37 117 -6 -159 150 97 101
4645 101 208 -150 -52 121 23 85 -86 -165 -151 195 -36 88 -116 -140 -20 69 37 -204 -112 -112 244 89 -32 210
4669 210 -17 162 -130 -53 -19 90 -9 -145 328 -14 138 -62 -126 21 -86 -54 -106 155 55 40 -13 -8 -156
4692 -156 -150 211 14 -98 -42 -11 92 121 1 -22 -237 -93 88 149 51 -11 -161 -49 -106 35 87 141 161 108 -224
4717 -224 -237 -270 -2 81 94 -2 193 -3 329 -228 -81 191 -22 -74 -21 -17 -11 33 6 -50 148 5 70 253 -86
4742 -86 224 -75 -215 2 153 240 -227 0 182 -63 44 -30 -21 -103 56 87 161 -196 -3 -4 186 1 -152
4765 -152 4 33 -15 -329 131 -53 -216 -8 51 45 -22 -98 -5 -38 129 2 -240 -140 148 15 -195 13 -165
4788 -165 120 107 -193 88 -18 134 -193 54 -160 -3 8 -23 -36 -49 101 65 10 -181 27 336 23 36 -232
4811 -232 56 -4 97 -29 -62 -274 -44 -142 -78 137 -60 -128 147 169 19 -140 245 7 -221 -144 45 235
4833 235 72 -130 -115 -69 77 -89 52 -13 -94 117 -45 83 210 36 -46 -274 -65 59 154 -33 42 -17 -1
4856 -1 146 -103 29 4 -30 -93 40 -90 -179 59 -176 -28 102 13 17 -38 -45 110 -86 -94 -9 -127 260 90 -191
4881 -191 -165 -74 132 -48 72 52 61 131 -32 -87 240 -122 56 -179 50 114 55 -4 38 182 0 -32 89 26
4905 26 -175 -211 -109 55 27 -134 151 103 -174 250 80 -2 -50 -209 23 -162 -86 -167 364 250 126 48 49 110
4929 110 -123 132 153 -81 78 137 40 -15 -59 92 42 71 -141 107 47 -149 21 -190 -259 62 -37 109 138 197
4953 197 221 -34 -89 -233 -47 -186 -103 -192 178 61 -78 85 111 48 76 -103 -156 -128 -165 170 32 12 -26 76
4977 76 -243 90 -7 -220 -176 -102 7 76 27 -342 6 -87 -57 81 62 175 12 95 46 -102 64 222 -2 -82
5001 -82 -100 -128 -119 -56 -25 -217 41 -91 -46 -119 132 84 -37 112 -114 51 -41 61 -71 30 -43 16 -115 -76 -205
5026 -205 32 -203 -72 -107 -183 101 -209 189 6 -2 -47 220 45 45 -31 -44 -112 117 -18 -247 32 125 274 166
5050 166 162 -74 167 54 -10 50 19 -328 17 -134 -163 49 -311 51 -98 -250 15 -157 -91 271 176 120 -56
5073 -56 37 17 188 -89 52 16 205 154 -13 140 -139 -121 -50 11 272 -141 -140 101 -50 203 -265 -34 174
5096 174 39 92 -70 -96 -105 29 93 -159 214 97 -86 103 93 14 -93 278 -101 -263 -92 -41 -2 -134 -125 51
5120 51 48 118 -245 155 9 -54 -34 136 -188 -1 -45 -96 -196 18 -152 20 82 -243 -384 32 68 75 52 46 -42
5145 -42 -8 -30 195 102 -221 -80 317 139 -98 -23 22 62 -148 -135 -39 -138 104 -225 -169 38 -113 10 121 -70
5169 -70 8 -31 -55 54 -57 197 74 167 -314 119 -91 3 -122 45 30 -21 23 -248 92 17 189 -123 -31 62
5193 62 2 41 189 -42 97 68 203 67 65 289 58 5 -79 0 -74 -114 -133 -56 26 -104 47 -30 -8 -240 -181 218
5219 218 -132 98 -134 50 90 23 -244 5 52 -234 -111 -274 31 -113 -42 18 -93 -13 -97 19 98 88 143
5242 143 -196 -206 51 -155 97 -76 -4 404 24 22 -13 -101 -270 119 -9 28 -154 -8 -25 21 -2 113 -60
5265 -60 91 -15 -258 169 14 60 130 137 278 -3 -72 -31 44 -33 -50 -190 45 20 -183 97 103 69 -169 -2 29
5290 29 141 -283 -69 -9 -123 121 -219 80 -104 -53 146 238 -16 -136 40 -156 -5 -27 127 11 -190 -398
5312 -398 190 147 -293 256 -226 -205 -44 -15 -44 -172 7 -90 10 -101 -23 -289 -138 -28 -41 35 45 -33 -7 24
5336 24 154 -73 110 35 98 203 -113 -113 80 -137 -145 -59 -40 -111 -36 -163 -274 158 48 199 -134 124 318 289
5360 289 24 -116 -137 91 -11 -102 46 -19 389 -92 -207 -43 152 19 110 50 131 155 45 143 93 44 -4 -188
5384 -188 -103 158 319 117 -35 -264 -19 -12 -39 -167 -115 -56 -10 11 -247 -142 -29 268 -30 103 122 -227 -90
5407 -90 -10 85 59 7 46 14 -23 25 33 -199 -32 -158 64 -54 57 -29 -39 -126 -36 35 -11 105 -76 -153 -97 -25 109
5434 109 124 -29 -113 27 88 46 -55 252 -132 13 14 -59 -10 66 83 197 -112 239 142 88 -4 339 129 -39
5458 -39 -172 -67 51 -232 78 30 -130 37 -94 31 -2 191 90 211 142 -88 20 -41 -54 64 -34 73
5480 73 4 -15 -45 70 -247 -125 -61 -370 -65 -102 246 -151 -38 -51 -62 -105 143 -32 -105 -65 89 140 -125 174
5504 174 94 -70 161 -138 214 135 -67 -102 89 55 125 9 32 108 -141 -75 8 -115 -156 -150 -105 -62 -188 1 -36
5529 -36 -251 1 -34 68 92 16 -154 233 -265 108 33 80 35 -122 -150 55 152 -81 -221 -130 15 -101 -177 -80
5553 -80 -27 -69 -132 -147 -45 48 101 61 78 16 -202 85 -155 246 193 284 238 -36 165 23 45 36 74 -300 -248 79
5579 79 138 -106 3 -101 52 -46 81 -100 -58 24 -44 142 102 -94 -291 -95 -50 -101 -88 199 -1 264 35
5602 35 155 198 -93 44 -58 -72 -144 -113 40 81 -233 -89 158 -13 -102 232 247 215 10 -278 264 22 82
5625 82 175 213 70 -4 36 98 -18 -154 -120 67 -171 -60 114 -31 193 84 88 17 146 346 49 -250 -9
5648 -9 48 -59 -20 189 -55 59 119 -52 -25 -36 153 34 54 98 -126 28 52 -49 35 -41 -41 183 -134 380 53
5673 53 -149 2 -64 -63 -36 -51 -171 235 -56 -11 -65 165 36 -93 -78 136 1 310 45 118 -147 71 105 -73
5697 -73 145 -12 -6 380 196 -4 -156 -117 115 84 -82 41 -66 365 -61 104 -65 -90 -115 -179 -164 131 35
5720 35 121 113 -65 -270 25 -86 -148 120 -56 106 148 133 119 -179 19 164 37 -15 -288 32 39 -55 -66 -85 -29
5745 -29 104 64 -43 -93 245 -45 -64 -88 87 168 56 16 79 72 97 96 -222 -28 -253 79 78 -21 -209 55 -208
5770 -208 116 -13 -87 -54 -213 -111 19 -144 -181 -32 94 27 160 -21 63 -28 -38 -15 -21 -50 -57 44 32 79 -70
5795 -70 73 157 12 13 -4 -24 36 181 -61 42 34 -7 1 -95 -196 -41 111 25 154 1 -378 122 114 241 146 -112
5821 -112 185 -43 -224 -211 9 177 47 -70 -72 -88 171 -85 209 -340 200 244 -84 -9 -85 36 -33 97 135
5844 135 99 81 -156 -21 -42 72 22 -54 11 -10 -139 -39 -95 -78 -110 48 -9 -1 26 123 -190 87 -12 -195 184
5869 184 -17 118 132 41 -32 -118 -23 101 -268 120 -88 248 -175 -187 27 -183 23 -191 41 -263 11 36
5891 36 -45 -55 -76 -80 41 346 76 95 90 70 -155 18 -2 14 -253 1 186 115 164 -184 -38 -164 57 189 24
5916 24 -53 72 -116 141 -239 -61 -46 -86 -152 -273 -91 108 93 156 111 -176 -127 41 4 -132 180 -138 40
5939 40 115 -17 -221 203 -33 217 -193 260 47 166 4 95 132 -157 -113 -223 -97 -281 107 188 124 115 -216
5962 -216 271 -71 -186 -106 7 -26 -1 97 67 221 -23 -102 -104 43 -47 317 229 -52 -215 90 10 -127 -257 -171
5986 -171 3 -199 109 263 179 298 -89 -152 -123 -144 -42 -112 -9 65 41 68 -67 -90 -24 311 10 -244 31
6009 31 -29 -119 106 119 318 143 -92 -124 -23 -227 -110 4 -105 62 -109 -114 -62 -126 -78 47 8 -117 -163 295
6033 295 -77 -237 59 -88 -14 -77 -93 185 -251 -56 -79 -54 -9 43 -146 -91 37 42 93 -105 41 -31 -35 -35 -169
6058 -169 123 -148 49 354 121 -23 8 -68 19 290 138 -129 84 -144 -194 44 -178 -3 216 -78 80
6079 80 -13 121 177 157 183 -30 131 -167 154 63 -82 -205 84 11 -2 -118 -11 71 -6 55 135 -46 -77 -213
6103 -213 -82 -178 -37 -49 3 -219 228 -363 -187 -34 186 -15 92 -44 171 187 -124 206 -183 371 42
6124 42 77 14 55 -14 -90 124 77 34 -266 69 -92 -164 146 96 158 -19 -21 53 -79 73 -106 161 61 -150 -140
6149 -140 -69 177 -62 25 113 193 3 135 17 22 -75 -79 -8 -118 244 7 -135 135 -8 31 80 -126 376 15
6173 15 -167 -86 125 75 -31 -127 81 -25 -73 215 71 -159 128 55 -229 -83 36 -115 -120 -69 42 73 93 -40
6197 -40 -7 145 -54 -101 39 8 103 -145 47 -205 -232 -10 -24 -77 82 139 65 128 -106 -120 -185 -170 9 63 87
6222 87 221 -199 -42 54 -76 40 -148 79 -111 109 182 -7 -116 264 -97 117 100 -68 92 168 -4 -146
6244 -146 246 114 149 378 -23 -267 -17 108 214 -33 51 -264 76 -176 -74 100 -159 -102 -45 63 -58
6265 -58 66 8 -111 -180 -56 35 126 -34 64 205 -36 142 167 17 28 20 -119 248 116 -303 72 7 -76 -27
6289 -27 -192 -104 -334 -163 -99 -34 177 29 177 84 -34 49 -171 206 216 35 90 215 -92 124 88 76 148 -174
6313 -174 -59 -221 -110 -52 12 3 -91 -161 -44 338 -68 -215 -58 -200 45 200 -53 -311 -19 -165 -22 107
6335 107 -1 -21 218 211 -88 -142 -226 29 237 82 -101 -290 -283 20 -105 9 151 119 -80 -34 -37 46 -262 -110
6359 -110 261 -4 -10 79 -38 21 177 -98 63 -8 36 224 52 -188 -86 -93 164 -67 228 176 65 -25 -104 17
6383 17 169 -135 -76 23 398 53 32 178 69 129 85 -163 -242 -55 -91 -186 -106 134 -42 52 219 -9 -14 265
6407 265 27 128 -238 74 -33 -28 28 164 -4 -63 -45 36 166 4 256 -5 -59 12 -146 -42 -229 -57 2
6430 2 2 -6 -104 103 265 79 -3 -293 -16 -36 84 4 121 219 242 33 -80 -153 -105 -269 -161 25 47 -3 -80 80
6456 80 239 -51 23 85 74 332 140 -8 49 60 93 73 42 75 -53 342 15 -232 -152 226 38 113 181 84 -82
6481 -82 52 -81 54 -208 137 20 -259 -62 -80 -95 -5 82 -174 -37 21 208 49 31 -135 46 -111 -78 -120
6504 -120 -124 186 93 12 18 -92 109 198 -22 -141 114 80 -218 117 -226 -142 159 -43 -181 -93 66 52 -71 113
6528 113 145 -145 -112 113 -84 -176 217 76 -29 -25 85 90 55 -150 186 178 101 -101 45 166 154 121 191 104 266
6553 266 -80 46 16 233 42 39 126 -312 -230 48 133 0 81 -5 -47 -61 263 -16 -49 100 -90 112 -152 121
6577 121 -169 -147 142 -130 -74 108 59 -44 -190 188 -69 19 73 90 -27 257 -156 20 -85 -20 43 77 -100
6600 -100 -52 75 -61 144 -40 100 -99 -190 -165 78 -165 -217 17 136 -131 76 145 -178 7 1 -43 -132 -191
6623 -191 20 67 206 78 205 133 -9 159 48 10 -160 -146 -82 -15 -171 -52 -263 64 19 -19 -205 -23 97
6646 97 18 -14 -72 143 7 -31 -93 4 -124 -40 -208 -28 -104 78 16 162 101 -140 140 -111 -100 164 -25 -262
6670 -262 135 21 39 -214 -33 64 18 37 -91 -14 -57 16 186 -205 178 -145 -103 -74 176 61 -192 -20 149
6693 149 181 -57 -107 -5 21 67 321 -103 21 37 -212 -5 217 -43 91 -64 93 185 -45 -11 80 74 186
6716 186 21 179 167 -78 119 -28 29 343 174 184 -187 -14 -136 72 33 -116 -83 36 84 -18 20 14 118
6739 118 -128 -141 99 -58 -5 -41 -96 -261 -14 -247 21 -97 -220 -182 -36 75 143 -1 -87 -136 -23 176 -215
6762 -215 -18 -236 160 256 -42 -1 -84 -118 -193 363 -92 -73 -9 -13 -191 -52 99 -86 -115 57 -270 86 -9 -123
6786 -123 -71 93 -1 6 -191 -293 133 -157 5 26 117 -110 -156 1 87 -37 84 -147 70 -123 -5 130 -171
6809 -171 -189 -343 -28 -20 43 -32 -170 -14 -29 17 -53 52 72 -319 14 -178 224 14 -58 15 -224 -47 -149 13
6833 13 172 58 49 86 62 -4 -156 15 -29 29 70 -66 137 -93 20 -86 -184 56 -56 -91 -233 145 265 46
6857 46 -142 149 -82 185 -211 -134 -141 235 -178 -69 27 -15 -170 60 157 12 -28 -11 -71 -74 -67 -40 49 26 -198 -67
6883 -67 51 123 28 103 -44 195 -26 41 -159 -34 22 315 139 -246 36 163 10 -286 -4 20 -285 -103
6905 -103 121 268 34 58 -20 -83 258 -52 183 69 44 -26 123 63 80 -274 221 183 200 -37 136 -157 -69
6928 -69 25 -64 25 -81 125 -91 -112 -116 -41 -222 219 91 -28 65 -28 49 -113 -295 -1 54 3 -19 37 121 166 195
6954 195 -118 -7 1 126 7 240 -87 -117 -143 -15 132 224 -60 -55 -141 218 -168 171 -21 22 53 -65 -195
6977 -195 -207 20 97 -3 22 194 186 -119 -75 -83 340 -38 -22 -96 305 262 -32 -98 97 -76 -311 -76 -184 12
7001 12 15 50 -68 -215 116 36 117 40 -7 68 -59 95 148 169 33 -200 -184 -45 55 108 121 70 71 -87 104 132
7027 132 40 89 63 -175 241 -56 69 193 158 48 -114 107 -32 262 74 259 84 -162 18 185 189 49
7049 49 82 153 143 137 18 -15 164 98 -83 167 -80 141 -287 46 159 -258 -133 25 17 74 -11 0 -165 18
7073 18 27 157 -297 63 149 109 -116 111 247 107 118 -12 -165 16 -112 225 164 -123 9 -120 -212 291 58
7096 58 129 -218 -118 -54 -47 -37 -183 -17 99 -141 17 35 -368 318 14 -38 17 -61 -14 -185 72 186 205 38
7120 38 327 135 25 133 24 97 7 -137 262 -12 -20 -34 107 -93 46 -55 -178 -68 -267 -2 126 246
7142 246 29 0 119 113 -51 92 45 -203 -9 -41 43 -134 24 72 46 44 -32 9 -146 54 164 7 109 156
7166 156 -204 124 9 55 172 -148 50 12 51 -130 -87 -148 74 -107 60 -8 197 310 24 43 72 -187 229
7189 229 -150 382 41 -161 306 -242 -237 195 131 75 45 -4 -219 110 282 -142 126 -33 -51 -115 -156 -22 -324
7212 -324 -78 148 106 -61 24 86 -122 -282 -100 33 254 44 -15 -256 70 -157 -110 106 -76 68 185 -51
7234 -51 -215 76 -8 -10 -103 92 -56 160 -112 310 4 54 -46 121 33 106 110 19 213 25 129 -265 -133 11
7258 11 -203 18 88 -44 -29 -90 -37 232 8 72 84 -142 275 136 149 69 22 -134 250 -254 27 81 -111 71
7282 71 222 3 113 105 58 56 133 -93 79 -88 -191 -26 54 -157 -58 103 156 -28 101 -85 5 38 7 175
7306 175 -47 322 138 57 -13 10 115 67 69 -81 -83 -226 -237 180 -113 7 -30 5 -156 -25 -46 13 119 -46
7330 -46 -80 26 -89 -143 105 16 79 -57 134 52 -35 131 309 139 -48 237 82 94 57 28 -160 146 114 127
7354 127 -37 77 83 -171 -96 -41 -69 -59 -215 -59 90 143 -18 38 -89 107 -16 28 85 21 89 -68 -155 349
7378 349 -13 28 62 -116 52 227 -162 -114 -125 -31 32 -108 80 198 -100 58 383 -1 133 83 12 50 -179
7401 -179 17 153 72 46 177 -2 -163 -191 -189 -43 -214 56 156 -176 87 -146 58 137 132 -193 -117 -68 185
7424 185 -105 -44 5 -122 -26 -68 84 -118 117 65 94 -170 30 1 48 -167 -137 -173 -166 124 101 18 -77 -195 118
7449 118 2 -172 -55 42 139 127 -162 133 115 -2 -273 71 105 -126 -122 122 -59 24 76 -67 -170 67 -35
7472 -35 167 71 72 -25 112 -134 -333 23 -70 166 -251 -145 272 243 138 115 244 -214 -142 -58 -94 96 -126 81
7496 81 83 -109 -90 -99 80 374 -30 26 64 88 14 272 -36 -366 65 112 62 -46 -162 -63 199 204 -46 -181 -56
7521 -56 15 -138 -227 -122 -151 131 -112 49 -90 -50 -69 254 -7 -108 -254 31 107 60 -115 126 -60 -178 50
7544 50 -179 -140 -95 56 165 93 -110 82 -98 3 -115 -14 201 -32 -3 -3 -39 -22 -138 55 -14 -117 -84 -168
7568 -168 -77 23 -150 -45 6 -18 -32 39 47 -329 35 -7 27 183 -51 -18 -44 -51 -28 -78 39 66 184 46 -36 23
7594 23 77 83 214 -194 66 -267 -159 21 -84 -119 -168 54 38 151 359 -78 118 221 -219 -17 47 198 33
7617 33 107 -195 144 49 -95 138 7 122 -78 21 -10 34 115 34 137 -196 56 -115 -62 1 4 -75 142 33
7641 33 -202 -82 191 208 138 -123 108 62 -144 -139 -183 -298 -163 116 -155 -86 -144 -240 -118 -22 58 6 28 203 30
7666 30 138 -6 -110 -70 -179 5 190 250 135 104 208 -28 46 -118 92 8 9 -180 -23 28 19 -24 280 -2
7690 -2 -379 -190 38 67 36 -107 -80 78 148 186 -187 172 -133 -174 -57 153 35 82 -1 -52 212 85 22 136
7714 136 -203 -37 -148 -14 143 122 -246 -103 83 211 161 148 -65 9 26 48 158 48 52 -66 129 72 -78
7737 -78 -25 43 72 79 -65 209 12 93 105 191 7 119 -54 14 79 -100 -137 86 -33 124 96 50 62 246 -21
7762 -21 34 -38 12 103 -226 -56 26 -86 -82 85 -42 35 61 3 -35 -46 26 -31 63 197 28 149 -30 -27 8 -95
7788 -95 221 11 -79 62 5 -144 140 76 -34 181 109 -85 -93 132 171 0 -40 237 -4 89 -136 8 71 -187
7812 -187 -59 87 7 -195 20 -100 21 50 -3 -58 249 -73 2 -49 120 -159 -247 -93 -72 -78 120 48 204 -313
7836 -313 -113 38 -122 -163 -26 -110 189 -17 -55 -90 -78 -146 106 -191 17 -21 -136 237 16 -258 -143 32
7858 32 263 104 -98 201 92 -9 70 -95 -27 -58 58 -55 -186 10 -63 -109 22 29 -198 -246 -4 8 36 225
7882 225 -161 -83 4 -261 165 4 183 8 -32 -79 68 29 -57 -182 67 93 -44 93 143 20 103 -126 -148
7905 -148 43 127 1 23 -169 -3 57 -92 -312 -172 -64 280 85 49 -68 -100 65 239 45 -144 116 -100
7927 -100 23 -155 73 132 -46 -51 58 -129 -4 -232 -14 78 -8 -126 176 32 14 -34 84 0 -55 7 142
7950 142 60 0 -67 166 -47 3 235 -261 -123 50 -96 79 -227 47 -8 259 70 222 114 35 -170 -69
7972 -69 -70 -230 -111 -9 -6 -3 -32 85 -32 23 39 5 35 -29 209 -99 -229 -181 56 141 -77 16 -81 -45 -189 108
7998 108 271 -251 96 -54 160 -99 172 21 -120 27 236 101 -101 -174 -185 80 43 79 -75 -140 -58 11
8020 11 98 -54 6 263 104 35 -174 -45 254 69 -137 -3 -14 -206 -39 32 -224 -46 -127 32 117 45 -21
8043 -21 -13 -200 160 110 -4 16 -52 -159 73 45 -340 -40 120 -105 44 21 -257 75 -124 56 -55 -53 104
8066 104 -335 -37 19 158 9 -36 -122 64 113 -116 -130 -50 -210 50 -143 -153 -89 -160 -29 -47 43 35 -174 -109 150
8091 150 223 193 -167 87 94 -116 -146 -154 154 -162 4 -139 330 -162 100 166 27 -69 -268 -140 -106 58 -264
8114 -264 11 -178 271 -65 -4 39 -69 62 -154 78 -283 93 276 125 -132 14 -107 103 7 93 -150
8135 -150 -272 273 17 -20 -25 126 89 17 72 -134 -123 -43 -196 198 48 93 380 299 154 37 102 -37 312 -329
8159 -329 -141 7 70 122 65 -76 -260 -95 96 -34 66 96 -103 -64 -59 131 47 -44 -92 94 35 14 55 195
8183 195 -148 138 354 -243 166 -27 121 83
8191H3
##END NTUPLES=NMR FID
##END=
