##TITLE=1H_Pr 37-0
 CDCl3
 8 sc, 
 17.11.2021
##JCAMPDX= 6.0         $$ Bruker NMR JCAMP-DX V2.0
##DATA TYPE= NMR FID
##DATA CLASS= NTUPLES
##ORIGIN= UXNMR, Bruker Analytische Messtechnik GmbH
##OWNER= root
$$ XWIN-NMR		Version 3.5
$$ Wed Nov 17 12:59:40 2021 Russian Standard Time (UT+4h)  she@DPX200
##.OBSERVE FREQUENCY= 200.131346
##.OBSERVE NUCLEUS= ^1H
##.DELAY= (6, 6)
##.ACQUISITION MODE= SIMULTANEOUS
##.ACQUISITION SCHEME= undefined
##.AVERAGES= 8
##.DIGITISER RES= 18
##SPECTROMETER/DATA SYSTEM= spect
##.PULSE SEQUENCE= zg30
##.SOLVENT NAME= CDCl3
##.SHIFT REFERENCE= (INTERNAL, CDCl3, 0, 15.7039)
##AUDIT TRAIL= $$ (NUMBER, WHEN, WHO, WHERE, WHAT)
$$ ##TITLE= Audit trail, XWIN-NMR		Version 3.5
$$ ##JCAMPDX= 5.01
$$ ##ORIGIN= Bruker BioSpin GmbH
$$ ##OWNER= she
$$ F:/spectra/data/she/nmr/H-F/1/audita.txt
$$ ##AUDIT TRAIL=  $$ (NUMBER, WHEN, WHO, WHERE, WHAT)
(   1,<2021-11-17 12:58:34.25 +0400>,<she>,<DPX200>,
      <created by zg, POWCHK disabled, PULCHK disabled
       configuration hash MD5:
       00 E9 B6 7A A2 85 ED C7 34 08 36 98 17 FE 4E 26
       data hash MD5: 16K
       7F 2A 05 A9 41 AD 38 37 50 30 1E 5A 57 65 FC F9>)
$$ ##END=
$$ 
$$ hash MD5
$$ 5F 6D 64 88 8C 80 94 70 AE 1F CB A8 DE 03 15 26
##$RELAX= 
##$RELAX= 
##$RELAX= 
##$RELAX= 
##$RELAX= 
##$RELAX= 
$$ Bruker specific parameters
$$ --------------------------
##$DU= <F:/spectra>
##$EXPNO= 1
##$NAME= <H-F>
##$PROCNO= 1
##$TYPE= <nmr>
##$USER= <she>
##$AMP= (0..31)
100 100 100 100 100 100 100 100 100 100 100 100 100 100 100 100 100 100 
100 100 100 100 100 100 100 100 100 100 100 100 100 100 
##$AQSEQ= 0
##$AQ_mod= 1
##$AUNM= <au_zg>
##$AUTOPOS= <>
##$BF1= 200.13
##$BF2= 200.13
##$BF3= 200.13
##$BF4= 200.13
##$BF5= 200.13
##$BF6= 200.13
##$BF7= 200.13
##$BF8= 200.13
##$BYTORDA= 1
##$CFDGTYP= 0
##$CFRGTYP= 5
##$CHEMSTR= <none>
##$CNST= (0..31)
1 1 145 1 1 1 1 1 1 1 1 1 1 1 1 1 1 1 1 1 1 1 1 1 1 1 1 1 1 1 1 1 
##$CPDPRG= <>
##$CPDPRG1= <>
##$CPDPRG2= <>
##$CPDPRG3= <>
##$CPDPRG4= <mlev>
##$CPDPRG5= <mlev>
##$CPDPRG6= <mlev>
##$CPDPRG7= <mlev>
##$CPDPRG8= <mlev>
##$CPDPRGB= <>
##$CPDPRGT= <>
##$D= (0..31)
0 1.2 0 0 0 0 0 0 0 0.06 0 0.03 0 0 0 0 0.0002 0 0 0 0 0 0 0 0 0 0 0 0 
0 0 0 
##$DATE= 1637139513
##$DBL= (0..7)
120 120 120 120 120 120 120 120 
##$DBP= (0..7)
150 150 150 150 150 150 150 150 
##$DBP07= 0
##$DBPNAM0= <>
##$DBPNAM1= <>
##$DBPNAM2= <>
##$DBPNAM3= <>
##$DBPNAM4= <>
##$DBPNAM5= <>
##$DBPNAM6= <>
##$DBPNAM7= <>
##$DBPOAL= (0..7)
0.5 0.5 0.5 0.5 0.5 0.5 0.5 0.5 
##$DBPOFFS= (0..7)
0 0 0 0 0 0 0 0 
##$DE= 6
##$DECBNUC= <off>
##$DECIM= 32
##$DECNUC= <off>
##$DECSTAT= 4
##$DIGMOD= 1
##$DIGTYP= 9
##$DL= (0..7)
0 120 120 120 120 120 120 120 
##$DP= (0..7)
150 150 150 150 150 150 150 150 
##$DP07= 0
##$DPNAME0= <>
##$DPNAME1= <>
##$DPNAME2= <>
##$DPNAME3= <>
##$DPNAME4= <>
##$DPNAME5= <>
##$DPNAME6= <>
##$DPNAME7= <>
##$DPOAL= (0..7)
0.5 0.5 0.5 0.5 0.5 0.5 0.5 0.5 
##$DPOFFS= (0..7)
0 0 0 0 0 0 0 0 
##$DQDMODE= 0
##$DR= 18
##$DS= 0
##$DSLIST= <SSSSSSSSSSSSSSS>
$$ [...]
##$SUBNAM2= <"">
##$SUBNAM3= <"">
##$SUBNAM4= <"">
##$SUBNAM5= <"">
##$SUBNAM6= <"">
##$SUBNAM7= <"">
##$SUBNAM8= <"">
##$SUBNAM9= <"">
##$SW= 18.0517287032376
##$SWIBOX= (0..15)
0 0 2 0 0 0 0 0 0 0 0 0 0 0 0 0 
##$SW_h= 3612.71676300578
##$TD= 16384
##$TD0= 1
##$TE= 0
##$TE2= 300
##$TE3= 300
##$TEG= 300
##$TL= (0..7)
0 120 120 120 120 120 120 120 
##$TP= (0..7)
150 150 150 150 150 150 150 150 
##$TP07= 0
##$TPNAME0= <>
##$TPNAME1= <>
##$TPNAME2= <>
##$TPNAME3= <>
##$TPNAME4= <>
##$TPNAME5= <>
##$TPNAME6= <>
##$TPNAME7= <>
##$TPOAL= (0..7)
0.5 0.5 0.5 0.5 0.5 0.5 0.5 0.5 
##$TPOFFS= (0..7)
0 0 0 0 0 0 0 0 
##$TUNHIN= 0
##$TUNHOUT= 0
##$TUNXOUT= 0
##$USERA1= <user>
##$USERA2= <user>
##$USERA3= <user>
##$USERA4= <user>
##$USERA5= <user>
##$V9= 5
##$VALIST= <valist>
##$VCLIST= <CCCCCCCCCCCCCCC>
##$VD= 0
##$VDLIST= <DDDDDDDDDDDDDDD>
##$VPLIST= <PPPPPPPPPPPPPPP>
##$VTLIST= <TTTTTTTTTTTTTTT>
##$WBST= 1024
##$WBSW= 4
##$XGAIN= (0..3)
0 0 0 0 
##$XL= 0
##$YL= 0
##$YMAX_a= 133039
##$YMIN_a= -166910
##$ZGOPTNS= <>
##$ZL1= 120
##$ZL2= 120
##$ZL3= 120
##$ZL4= 120
##$ABSF1= 10
##$ABSF2= 0
##$ABSG= 5
##$ABSL= 3
##$ALPHA= 0
##$AQORDER= 0
##$ASSFAC= 0
##$ASSFACI= 0
##$ASSFACX= 0
##$ASSWID= 0
##$AUNMP= <proc_1d>
##$AZFE= 0.1
##$AZFW= 0.1
##$BCFW= 1
##$BC_mod= 2
##$BYTORDP= 1
##$COROFFS= 0
##$CY= 11.3945322036743
##$DATMOD= 1
##$DC= 2
##$DFILT= <>
##$DTYPP= 0
##$F1P= 2.36226072786647
##$F2P= -0.459571619588291
##$FCOR= 0.5
##$FTSIZE= 0
##$FT_mod= 4
##$GAMMA= 1
##$GB= 0.15
##$INTBC= 1
##$INTSCL= 1
##$ISEN= 128
##$LB= 0.24
##$LEV0= 0
##$LPBIN= 0
##$MAXI= 10000
##$MC2= 0
##$MEAN= 0
##$ME_mod= 0
##$MI= 1.114404
##$NCOEF= 0
##$NC_proc= 0
##$NLEV= 6
##$NOISF1= 3.799351
##$NOISF2= 2.8
##$NSP= 1
##$NTH_PI= 0
##$NZP= 0
##$OFFSET= 15.70392
##$PC= 1
##$PHC0= -15509.92
##$PHC1= 7.800809
##$PH_mod= 1
##$PKNL= yes
##$PPARMOD= 0
##$PSCAL= 0
##$PSIGN= 0
##$REVERSE= no
##$SF= 200.130013532006
##$SI= 16384
##$SIGF1= 3
##$SIGF2= 2
##$SINO= 400
##$SIOLD= 16384
##$SREGLST= <1H.CDCl3>
##$SSB= 0
##$STSI= 0
##$STSR= 0
##$SW_p= 3612.71676300578
##$SYMM= 0
##$S_DEV= 0
##$TDeff= 0
##$TDoff= 0
##$TI= <>
##$TILT= no
##$TM1= 0
##$TM2= 0
##$TOPLEV= 0
##$USERP1= <user>
##$USERP2= <user>
##$USERP3= <user>
##$USERP4= <user>
##$USERP5= <user>
##$WDW= 1
##$XDIM= 8192
##$YMAX_p= 0
##$YMIN_p= 0
$$ End of Bruker specific parameters
$$ ---------------------------------
##NTUPLES= NMR FID
##VAR_NAME=  TIME,          FID/REAL,        FID/IMAG
##SYMBOL=    X,             R,               I
##VAR_TYPE=  INDEPENDENT,   DEPENDENT,       DEPENDENT
##VAR_FORM=  AFFN,          ASDF,            ASDF
##VAR_DIM=   8192,          8192,            8192
##UNITS=     SECONDS,       ARBITRARY UNITS, ARBITRARY UNITS
##FACTOR=    0.0002768,     1,               1
##FIRST=     0,             0,               0
##LAST=      2.2672688,     0,               0
##MIN=       0,             -166910,         0
##MAX=       2.2672688,     133039,          0
$$ Real data points
##PAGE= N=1
##DATA TABLE= (X++(R..R)), XYDATA
$$ [...]
1744c66M01k29J8l29L50J77m67K5N85J09l11l05O40J02n04m4Q33k55l98j62M28
1765B98L78r17R0J032o38o09K5P29n15o40L05O73m51l97N59L0K41p91L38P24m39
1786B5m15N63J20l58l8M38O24q75l88P78om55q3Q0M68n30m32N61p6l60j2k08N90
1809A1j98n55P80j02l27K48j1L70k79j38N81R5n67J24K25L27m09l95N95K55p29
1830i9n5J10J96k84m32O81J12q30P9M54J48k95m62O79%l40J0O19N7l87l9M20j
1853C41n91M41M77j39k00l43L57K25p45J81L52q1m54k24M13K7m80J99P8j95mj79
1875e44O59j94l05K72N17k22k75j11P46n6n33K07K88M1m32q2M14j01n84L6N98
1896C39m76o0P5M41l64m78L25L59m54p4J91M15j25n05L79M94m45k61L26J20J04
$$ plain form
1744 -366 35 -194 -176 -505 -155 22 -445 -420 165 274 -37 -342 298 400 -104 -148 685 430 32 -130 298
1765 298 676 -241 -151 881 243 -366 -341 388 -127 -767 -462 211 -240 -637 -78 -48 193 -598 -260 464 25
1786 25 -390 173 293 -65 -103 335 959 84 -304 474 468 13 -70 10 478 -52 -484 77 1 -359 -371 -579 11
1809 11 -187 -742 38 -64 -391 -143 -154 216 -63 -201 380 475 -92 32 257 584 175 -220 375 630 -99
1830 -99 -154 -44 152 -132 -564 117 229 -601 -522 -68 80 -215 -677 2 2 -338 -328 291 348 -39 -78 342 341
1853 341 -250 191 668 529 329 -14 343 568 -177 4 356 275 -179 -403 10 37 -443 -244 -166 -361 -365 -544
1875 -544 115 -79 -384 -112 405 183 -92 -203 543 487 -46 161 449 490 58 -24 390 289 -295 -259 339
1896 339 -137 -197 -122 319 -45 -523 -198 161 -293 -367 -176 239 114 -391 -12 482 37 -224 102 222 326
1917C26n74N87K67o48J85Q8q1m9l70J74M95p98L9J47K80p8m08J74L94k68l44L78
1939h4J87J20m03L48M00o39oJ89N26l09n75K45L54l26J7K30q1J49m38K16K80o89
1961b89j14L90J24l62j7k4M80m84m33Q97r9m22L21j48P15n56J4M06k22q8R8j02
1983H5K34j9m62L82j06l60P7J01K67m42k54N36p7n04J98L11K87m59j10L79J06
2004A70l78J96L77k60L0k80M14R3o3l21N5N09l96j50L36m3o33J32M26k35k24j96
2026d41N61k5p01P7Q00m68l7j03O27k17n54M89L25m17N7M06J21J5p02K96J77k02
2048H4P0k94L07j53l17J70J62j96K7K6j68L59n64K47K80k89m7j50M72o0m49K10
2070b73Q83n29k88K61L41j20m25J20M73l02m53L35J85J77j152N20P23n42o40R10
$$ plain form
1917 326 -248 339 606 -42 143 231 150 101 -269 -95 400 -398 -359 -212 68 -10 -418 -244 150 -118 -462 -84
1939 -84 103 223 -180 168 568 -71 -77 112 638 329 -246 -1 353 27 44 274 193 342 -96 120 400 -289
1961 -289 -403 -13 111 -251 -268 -292 188 -296 -729 168 69 -353 -32 -180 535 -21 -7 399 177 89 187 85
1983 85 319 300 -162 220 114 -246 -169 -68 199 -243 -497 39 -38 -542 -344 -33 254 -205 -315 64 170
2004 170 -208 -12 365 105 135 -145 269 362 299 -22 33 542 146 -4 332 289 -344 -212 214 -21 -245 -441
2026 -441 120 95 -606 -529 271 -197 -234 -337 290 73 -481 8 333 -84 -27 379 500 515 -187 109 286 84
2048 84 154 -140 167 14 -303 -133 29 -167 -140 -114 -282 77 -487 -240 40 -249 -296 -446 26 -34 -483 -273
2070 -273 610 81 -207 54 395 275 -150 -30 443 141 -312 23 208 385 -767 -247 476 -66 -706 204
2090B04j30k48p96R54K40m88j42M40L17n55K62J45K97m26k57O99k44k98k28L43
2110H9J82l70P3O9j51r8J81oK05n12J06%L14l10m7q6M87l59j60M09L46l97k04
2133b39L07M79m17m97O71K95o85J66L34j02l90k67P67k74o51L83M29k81m09O4
2153c17M28k58o76P94J04l56M3K11L64k73l60L97Pj47M4P2N0M0l78J94K32j84
2175C1J58j99j18L45p64M43R6j51J37m77O96Q2q25P7P37l01k68L2M95M5o58N02
2197A15L72l87n6M1M11j29o38P10L76j164j76Q66k90l30j00M76J42n64j21L98
2217d8j51q6k92O45J22k78J3K14k28J23R9j26L42j49K6Q0m7J21k26j58L68j47
2239B17n83K82K08m3l98Q1M56n18m67P78K45k92k59J92N89p27k77P79N4o02K04
$$ plain form
2090 204 74 -174 -970 -16 224 -264 -406 34 351 -204 58 203 500 74 -183 516 272 -26 -254 89
2110 89 271 -99 -26 43 -108 -206 -25 -31 174 -338 -232 -232 82 -228 -275 -361 126 -233 -393 16 362 -35 -239
2133 -239 68 547 130 -367 304 599 -86 80 414 312 -78 -345 422 148 -503 -120 309 28 -381 -317
2153 -317 111 -147 -823 -29 75 -281 -238 -27 337 64 -296 101 108 -39 5 77 127 167 -211 -17 215 31
2175 31 189 -10 -128 217 -547 -104 -8 -159 -22 -499 197 279 -546 -469 268 -33 -301 -269 226 271 -387 115
2197 115 487 100 44 85 496 367 -271 439 815 -349 -525 341 51 -279 -379 97 239 -325 -446 -48
2217 -48 -199 -285 -577 68 190 -88 -75 139 -89 34 133 7 349 200 226 306 259 380 154 -4 364 217
2239 217 -366 -84 124 81 -317 -236 220 -298 -765 13 258 -34 -293 -101 488 -239 -516 263 317 -285 -81
2260h1L36K90n19k45Q64l09o32J87M85k55k74m1N13l88l33M77n1l19N6mJ77j44
2282b10JK52o2Pj2r4J59J84l7j82L4L23k5o39M90o9j27j04J59K34m65k85O13j1
2306A34m70PN27k31m04q2O86q3n28L71M71k18n02L19P01m97n46N23M63n80m35
2327c74O10P2k66q7P8J34m56K68J25m19L59j33K02k71K26j62m5l6K35k40K27n5
2349hK49j70j77K28J16m52K13K26j49J09n5M58l60o79L09M20k77l72K65K24l49
2370b31k29M07J60n41J50L05l31j76J44M40J40o35J48N62P8m29nL23J18l89l2
2391b3M67m12P3k07K52N4k00k30Q3K45j67N4j21J75j07j36J95k1q7j85o1O70j74
2414A37m05M77M6j40l5J48K66n70j20N98N6p02L68Q9J23o15k2M19k13j82O2L44
$$ plain form
2260 -81 255 545 26 -219 645 336 -296 -109 376 121 -153 -194 319 -69 -402 75 24 -295 -239 -243 -66 -210
2282 -210 -209 43 -19 -12 -24 -118 41 225 188 6 40 363 338 -301 189 120 -7 -111 48 282 -183 -468 145 134
2306 134 -336 -329 198 -33 -437 -519 167 84 -444 -73 398 180 -322 -3 698 201 -345 178 641 61 -374
2327 -374 236 308 42 -45 33 167 -289 -21 104 -315 44 -89 113 -158 68 -94 -139 -175 60 -180 47 -8
2349 -8 241 71 -106 122 238 -214 -1 225 76 185 130 588 228 -451 -142 278 1 -371 -106 118 -231
2370 -231 -460 -53 107 -434 -284 21 -310 -486 -342 98 238 -397 -249 313 391 -38 -43 280 398 9 -23
2391 -23 444 32 105 -102 150 204 4 -226 -143 102 -65 -11 -132 43 -64 -200 -5 -26 -113 -298 -359 311 137
2414 137 -268 209 255 115 80 228 494 -76 -196 402 458 -244 124 213 336 -279 -301 118 -95 -277 -215 129
2436A29Ln16J7P59m36j25K93n3J44l45p9N66k96j38N56l52M4O2n31N52r4j25O6
2459A01nk6k53j64L84j97k20K20J68k57J81l02N37n3m29M43J29j5k57J79N0Pm14
2482a93J16M09j44k97O5K61q8n03L95L94k53m47N7M76j90J7O8k06k98J35R3K89
2504A56j63j63L35m7p9J3K43q2k40j89N31J59n29P3J14J01j21l10K39j2k98J50
2526a19J01K44k40o7O5L83o24K3J60J12o9J36L3J64l88J65J89m49M3J49L03M1
2548C55n09K3L53l90J33qo8Q6j52q2J03L93p25K69L5J23k30k2M73l05o9L20j03
2571CJ70l05J80N12m43j86M40l23J15l20J66K32j62k77L40k05M4j91MM62n14N1
2593b07MJ24n9J2M1j2L8J4J04L3o0O7Q2K32k87j33L00J76k26m54K32L96k53k50
$$ plain form
2436 129 132 -384 -367 392 -44 -169 124 71 215 -130 -209 357 61 -77 479 127 171 233 -298 254 160 35 101
2459 101 96 70 -183 -347 37 -160 -380 -160 8 -249 -68 -370 167 114 -315 128 257 242 -15 164 214 221 -193
2482 -193 -77 332 188 -109 -44 217 129 -374 21 415 162 -285 -228 248 58 75 143 -63 -361 -226 -133 156
2504 156 -7 -170 165 118 39 52 295 213 -27 -216 315 474 -55 18 132 233 112 -198 41 29 -269 -119
2526 -119 -18 226 -14 -81 -16 367 -257 -234 -74 38 -31 105 138 302 -86 79 268 -181 -138 11 314 355
2548 355 -154 -131 222 -168 -35 -43 -111 -25 -177 -259 -156 237 -488 -219 -184 -61 -291 -313 160 -145 -214 106 3
2571 3 173 -132 48 560 117 -69 371 48 163 -157 9 241 79 -198 142 -63 -19 -210 -206 256 -258 -207
2593 -207 -203 -79 -138 -126 -85 -97 -59 -45 59 92 32 99 181 413 126 -7 293 469 243 -211 21 417 164 -86
2617h6n2L32m35N3J9J96j6m04N41k09n6J16j5J71r7m36N08K35k99j28J37K66l40
2640AJ08J86j86j91J4j13L69k44j46K13J27m45J41J56R9l48RJ31J14J4l0J55l2
2663A02K59l54J28M8j67L7J38Q5m31R2L09p7k47l8J83M8k31k01L47j01k15J77
2685a09k7j6J85k94M02K16k94j93J53k08K63o3L55p3l30NK22j79n1qJ56j14R8
2708I6j21J68l71L2R3k36M80k70j96L00p3O0k79K97K22k57nJ78R5m41J42O9L14
2731B97j16l29K46J53j21k18J29K30m86j0K34o0j03L35l48J24l58K92J36k78K06
2752d5K39k93M5n9L59k23k38o7L53J7k75K56j2R1k79L14l8J81n07M1R6L90k77
2775F9l20J73j08Q2j45O8L22n7j44l8M6J34l68K96Mj0l14L91L44l15L7m2L3l3
$$ plain form
2617 -86 -138 194 -241 -188 -169 27 11 -393 148 -61 -117 -1 -16 155 58 -378 130 365 66 -62 75 341 1
2640 1 109 295 109 -82 -68 -181 188 -56 -202 11 138 -307 -166 -10 89 -259 -250 -119 -5 9 -21 134 102
2663 102 361 7 135 183 16 53 191 276 -155 -63 246 169 -78 -116 67 115 -116 -317 30 -71 -286 -109
2685 -109 -136 -152 33 -261 141 357 63 -130 23 -185 78 15 370 297 -33 -28 194 15 -36 -44 112 -2 96
2708 96 -25 143 -228 -196 -103 -339 141 -129 -325 -25 -98 -38 -317 -20 202 -55 -60 118 213 -228 -86 -17 297
2731 297 181 -148 98 251 130 -88 41 271 -215 -225 9 -51 -154 181 -167 -43 -401 -109 27 -251 -45
2752 -45 194 -99 -54 -113 246 23 -215 -282 71 88 -187 69 57 148 -131 183 145 326 -181 -140 -44 346 69
2775 69 -251 -78 -186 -104 -249 -181 141 84 -60 -98 -52 82 -286 10 14 4 -310 81 425 110 147 105 138 105
2799A05l06L38Q8k11j70L48k31o2j42L98n1n94L09K16j90j23L03J4K0o3j65L72
2821B03p6j40jK49rl40K99o0n3k53M80k33M9j26k0n4M9L1k90RK36j18O8R0j51
2846a61J06R5n6k6j1J99L43l81j59n3M20r5p7j77L83l11j37J23L95m03OM7K09
2869B79l42j42L4k2L25l49j0L35o4l25L22p0oO1j70K82j35j01K09J34M1k15J79
2892B50p4j8k80K50k00R5j04J14N2j97k43M62P2l81P4J80k6p8l51O28j72m23L85
2915A5n2L19k71k99K43K02j39k6N0J23k77j17K42n0j86J94J19q5k17J26jj51J41
2938i7k48M57k94K09j23K19M2k6P7m06L89l19k5L47n2k94n6J94J84l06J34J21
2960A27r7q0K27l5k90n4R6j3r5L4P8N3j38O5J63J12j22j49J04J78j33k38L23q0
$$ plain form
2799 105 -201 137 225 14 -156 192 -39 -101 -243 155 104 -490 -181 35 -155 -278 25 39 59 -4 -169 203
2821 203 127 -13 -14 235 226 -114 185 125 72 -181 299 66 115 -11 -31 -85 -36 -5 -295 -286 -50 -168 -100 -10 -161
2846 -161 -55 40 -16 -42 -53 146 489 108 -51 -104 316 221 144 -33 350 39 -98 25 420 17 23 70 279
2869 279 -63 -205 -171 -193 132 -217 -227 108 44 -281 41 -29 -35 26 -144 138 3 -98 111 245 286 71 250
2892 250 176 158 -122 128 -72 23 -81 33 85 -112 -355 107 179 -202 -128 52 26 -52 -403 225 53 -370 15
2915 15 -37 282 11 -288 -45 157 18 -8 42 165 -112 -229 13 -37 -223 -29 90 5 -212 -86 -87 -238 -97
2938 -97 -345 112 -182 27 -96 123 165 139 216 -190 199 -120 -145 202 150 -144 -200 -6 178 -128 6 127
2960 127 30 -50 177 142 -148 -202 -106 -119 -214 -180 -102 -49 -187 -122 41 153 31 -118 -14 164 31 -207 116 36
2984C6j03N3J76j6l34j0M17j74j42J06r6J25k24O8J06k0J64n05K77L75l59L3J06
3007E9r6J10p3j97K50j18OK84j22p0%P4P2j23kj95K75j17k54M11On17L58J35l12
3032a56n4J37M9j49J37l9K76j79k34K17p5K59j91j86L26j91J39j05Q0P5k22J69
3054H3n7J22k66R6o0q3J49k2J00j64l1m7J76R9l71l7M67k82R9K72k58J25k1k7
3078F2O8j27l7J53j65j91J15R0K69j43j17L4k06k6J96l2M7r7Q0k00K97j33M9N9
3102D5j4o2Q6J42O3r7J3n6j4J9n2K1J82p3k54J42J02k81J17q9J44n6j08L69k54
3127C5k41R2O9m7J87j25J03K8J28k66L54j30j49K64j28j17p1J41r9P7k13P3J95
3150A60k10R3j44K9M5l11M83j76j70K22r1J49j10J56k0j85K1J17k5J44k25M5j14
$$ plain form
2984 36 -67 -14 162 146 -188 -198 219 45 -97 9 -87 38 -186 -118 -12 -32 132 -373 -96 279 -80 -47 59
3007 59 -37 73 0 -197 53 -65 -59 225 103 33 33 107 179 56 54 -141 134 17 -237 174 180 -337 21 156 -156
3032 -156 -210 -73 -24 -173 -36 -75 201 22 -212 5 -70 189 -2 -188 138 -53 86 -19 61 136 -86 83
3054 83 26 148 -118 -22 -82 -165 -16 -38 62 -102 -133 -180 -4 95 -276 -313 154 -128 -29 243 -15 110 89 62
3078 62 130 3 -34 119 -46 -237 -122 -32 237 94 -23 11 -195 -221 -25 -57 -10 -107 -27 -227 70 -63 -14 45
3102 45 31 -31 55 197 260 163 176 120 106 125 73 94 276 203 -51 91 193 -88 29 -60 84 28 -80 289 35
3127 35 -206 -114 -45 -92 95 -30 73 101 229 -37 317 187 38 302 174 57 -14 127 28 105 -108 -35 160
3150 160 -50 43 -101 -72 -27 -338 145 -31 -201 21 -70 79 -31 125 105 -80 -59 58 33 177 -48 -3 -117
3173a17J05J94j38nk9n6J08j28J03R9l0j93K66k18Km5M18n09P8k10K69P2j50J90
3197G6k73J52RJ29k10J64p9M1J09q1j6R2j67P0j38J11Q2j43Q4n0Lm4L00l60N7
3222h2P6p3J99k74J19j18J93o1k04K39J16J22j73J4j51J51j63j90J90K38k60K21
3244A29j60K39l08o4K53N0j37L7N4J61m39mJ74J31j43J11K1j02K30m16M38k38
3266A7J95j51JJ2o8m9J23M4k38J90j10%J2j95P5J22j78rK05J11o8k83J78K49j94
3291io3nK96L4j91J91l16K54j18M0k29J28j1j17L93l31R8J86l65J6M3L53k89R6
3315H4k48K32j72l7M67j69p6j85K26q1k86K65L4J3j50R1j5j57K22j17m0J11J70
3338A82l21j94J88K65j00J81k26K15l72N5K12j91m0J70j3j2N0j49L3K74l26J14
$$ plain form
3173 -117 -12 182 44 39 10 -46 62 -66 37 136 106 -87 179 -39 -37 -82 336 -173 -95 -305 -36 36 -114 76
3197 76 -197 -45 -36 93 -117 47 -32 9 118 37 21 113 -54 16 -122 -11 71 -72 12 -38 -35 -79 221 -139 -82
3222 -82 -6 -79 120 -154 -35 -153 40 -21 -225 14 130 252 79 93 -58 93 -70 -260 -70 168 -92 129
3244 129 -31 208 -100 -164 89 139 2 39 93 254 -185 -189 -15 116 -27 84 105 3 233 -183 255 17
3266 17 212 61 62 74 6 -43 80 124 -114 76 -34 -34 -22 -217 -142 -20 -198 -207 -2 109 41 -242 -64 185 -9
3291 -9 -72 -77 219 253 62 253 -63 191 73 113 -116 12 1 -116 277 -54 44 230 -135 -119 -76 277 -12 84
3315 84 -164 68 -104 -141 326 157 81 -104 122 41 -245 20 54 67 -83 8 -7 -164 58 -59 -99 12 182
3338 182 -139 -333 -145 120 20 201 -25 190 -182 -127 85 -106 -146 24 11 -1 49 -100 -67 207 -119 -5
3360eQ6M4l21Q4M21k79j45J58j5R9k55j34N58l12q5O6j3q2K43j01q2j22O4J74
3384D6o5Q9j5j28L40l35p0N0r3K18N9j14J41R7k60j11J92j38O3P1k7j20k0L48
3408B18J01l17j64K40m0r2J78r8M41k62k65J01L08l11j85M02k67P9M7K81k13j01
3430H1K7n2m1k30M46k07j92K84J3j95J90m70M7K84j43L9K22k18K01q0NK85j76
3453A20M5l82K70l8j06J76J54m54N40n45K57J07j53J30q8n0m2J41j39P1p9%K35
3476A70j00j19J79k1q3l9R5m1plj29K47l7j4qJ24m33J10J16j58K97k93J30K02
3500A85l25K29o3o5l7O2j45L19j29R5K48k43j53K11K08k31n7k09O4K7k77J96J34
3523D4q3O7o2J36k23R7j37j11K24m5P9J05k32L11J62k82j02K7j81K39N5k29M47
$$ plain form
3360 -5 81 125 -196 -112 309 30 -115 43 28 127 -128 -262 296 -16 -101 -35 -48 -130 113 12 -70 -192 -128 46
3384 46 -19 70 55 -73 267 -68 -138 -88 -181 37 96 -18 123 220 -40 -151 41 -97 -34 37 10 -110 -130 218
3408 218 319 2 -162 78 38 -54 124 26 467 205 -60 41 349 38 -147 255 -12 67 114 395 182 81
3430 81 108 56 15 -215 231 24 -168 116 129 -66 124 -346 -299 -15 -158 -119 103 -115 86 6 11 296 120
3453 120 165 -217 53 15 -91 85 239 -215 325 -220 37 144 -9 121 33 -17 -59 82 -57 14 -65 -65 170
3476 170 70 -49 130 109 26 -13 82 41 34 31 -98 149 112 98 90 214 -219 -109 7 -151 146 -147 -17 185
3500 185 -140 89 26 -39 -76 -14 -159 160 31 126 374 131 -22 189 397 166 109 -100 -36 -9 -286 -90 44
3523 44 -39 28 -34 102 -121 -24 -161 -272 -48 -93 -14 91 -141 170 332 50 -52 -25 -206 33 88 -141 306
3546C06j59k9l76M18k42O0K5J27r7j71j28K51q1K52j80K17k03j58O3K34kj39k01
3569b13K55k8j00J57j69K07k23J43J9q7K50j72j09l7J84k30K39k23K66k21Rm0
3591a23K85l55K99Rp8O4j66K54p8k65M2n5K25qp2j12K18o1O7J0Qj38r4L19l8l73
3617b16K89j68J16j84J24r1K24o4O3m1r7J12p5J08p6M0jk3j91J92J8J50j13j1
3641H5q5k81L98j11l6j52K33N6k0o4L3O8l61J67k9J5n8n8K74j06R9j01R4o7k5
3666c2o5m5J68j8Kkj59K87j5q6n2N8r6N0Q9j81J44r9j27j69K58oJ42J8j54J8J83
3693A11j25J48q2n2o6m4L03k97pj02M39k18k27M61q3l55L50K07k07k05L2J74j31
3716B4j97j0M43k41NP1k2Nj78J92J0l31K03Oq2K59j54m5K96l89J24J2K52k78J7
$$ plain form
3546 306 147 118 -258 160 -82 -22 3 130 33 -138 -266 -15 -96 156 -24 193 -10 -168 -105 129 127 -12 -213
3569 -213 42 14 -86 71 -98 109 -114 29 48 -39 211 39 -70 -107 77 -153 86 -137 129 -92 -83 -123
3591 -123 162 -193 106 115 37 101 -65 189 111 -154 -112 -167 58 50 -22 -134 84 23 90 100 108 -30 -124 195 157 -216
3617 -216 73 -95 21 -163 -39 -130 94 30 93 52 -45 67 -8 100 24 64 63 40 -151 41 59 209 96 85
3641 85 0 -281 117 6 -30 -182 51 107 87 23 56 124 -237 -70 -99 -84 -142 -200 74 -32 67 -34 60 -7 -32
3666 -32 -97 -142 26 8 10 8 -151 136 121 35 -17 41 -55 -5 84 -97 47 -52 -179 -348 -90 -96 46 64 -90 -72 111
3693 111 -14 134 52 0 -66 -110 193 -104 -111 -213 226 8 -219 242 159 -196 154 361 154 -51 -19 155 24
3716 24 -173 -183 260 19 24 95 73 78 -100 92 102 -229 -26 -20 -102 157 3 -42 254 -135 -11 1 253 -25 -8
3741hJ48o9k52lK21k09k08K88J18j18J1Q5q1M4J05j29J72Q2j35p7q9K44J94m93
3765a59L94k24J04j9J27l32r8K97j21O9j92K38k55J87j45K17l0J53l79M07k48
3786im6J28j21N8j48R1O4m5k9K85j15k10Q2p4j00L38l34K91j09Qj81P9K23j62
3810c6j38J84j13J14j53r1JL03L8j49K74k02N1j57k73L78p2J97m02L01q2K43j65
3833E1oN1j67L15k92K56m03J98L9J60k60J89k20j49K81k8N3j7j13j27K88o1J7
3856E5K4j6l8O9k31J78j99L68k07k5K5qk82K99O7R8l56R4O7p5K00k40K66L2j83
3881a8J09k49R7R8r9q1L3J22j03L39k45mr7k12L55j5N4q1j45K23k55L46j2K4l49
3906a65K16K3j43J74M2j36P4l9j13K10k52J98J64q6j37p0O4K1n4J09k19Q6m4J66
$$ plain form
3741 -8 140 71 -181 -184 37 -172 -380 -92 26 -92 -81 4 -77 -33 72 -57 115 197 62 -15 -104 140 334 -159
3765 -159 235 11 115 96 223 -109 -207 90 -31 38 -154 84 -171 16 -129 88 58 211 -168 239 -9
3786 -9 -55 73 -48 10 -138 -47 17 -28 -57 228 113 -97 -15 -89 -189 149 -185 106 -3 5 -176 -97 126 -36
3810 -36 -174 10 -103 11 -142 -233 -232 71 109 -40 234 32 83 -74 -347 31 -41 156 -246 55 -27 216 51
3833 51 45 96 -71 244 -48 208 -195 3 42 202 -58 131 -89 -238 43 15 68 51 -62 -189 99 38 55
3856 55 79 63 25 94 -137 41 -158 210 3 -22 3 -5 -287 12 79 177 -179 -85 -18 -93 107 -133 133 165 -18
3881 -18 91 -158 -61 37 -62 -143 -110 12 -91 248 3 -1 -98 -310 45 30 84 3 -142 81 -174 172 160 184 -165
3906 -165 51 74 -69 105 147 11 85 46 -67 143 -109 89 253 167 30 -40 24 45 -9 100 -119 -33 -77 89
3930H9R0j05k30r9M66j08k14j9L68j67j82K1N8q9J00NL4j95K23Q3l22J54J32m5
3954D8K4r6J47M4o8R3k12r3N7Q0L8J5o8l7J93m08J94K53j74j3N8j90K93l45M15
3979B48k36j34M0KMJ54l46M12J07m61M35k09J37j60j15R2R5j34J28k93M37k82
4001g9J02Q0l20J23K8J32j21l6J43j82M21k48J54l2k85J2L38l09J40kJ80n8l62
4024a81J86M9j75J89k30J62j9N9Q9l21L50q1k36J55q5K06k29r7K15J2J6lJ85k49
4048c3L9R0J59k86J43q8K06n2l61L21Nj31j54K55k3l22J93R8j0j60M5J54j4j4
4072F0O4j80K7j28L54l09J1O3m2J71m8n0J18o1n1j24N5L37k86k71L44p7j94K16
4096al9Lj38N6OJ95o0j54P9j05J18n4K19k75J39J17J28l11N3o4M01k10m8L1j9
$$ plain form
3930 89 179 74 -156 -255 211 103 -111 -130 238 71 -111 -90 -32 -121 -21 -16 18 -177 46 129 -193 -39 93 48
3954 48 72 -24 123 167 99 192 -20 -113 -56 24 62 77 9 -28 165 -243 -49 204 30 17 75 -115 178 -167 248
3979 248 12 -122 -82 -80 -76 78 -268 144 251 -210 225 16 153 -7 -122 -30 65 -69 59 -234 203 -79
4001 -79 23 103 -217 -94 -66 66 -55 -91 52 -130 291 43 197 165 -120 -108 230 -79 61 59 239 181 -181
4024 -181 5 54 -121 68 -162 0 -19 40 129 -192 158 77 -159 -4 -89 117 -112 -209 6 18 34 31 216 -33
4048 -33 6 96 255 -31 112 24 230 178 -183 138 143 12 -142 113 90 -232 -39 59 49 -111 -66 88 74 60
4072 60 124 -56 -29 -157 197 -112 -101 -38 -80 91 43 -7 111 50 -1 -125 -70 267 -19 -290 54 -23 -217 -1
4096 -1 -40 -37 -175 -119 -113 82 22 -132 -53 -158 -40 -94 125 -150 -11 106 234 -77 -24 -88 313 103 55 86 67
4121F7M2k72R8r2K29P7r5r2L9qr8m3L58k48J95j61j10R0J14k55J73j05K09o1O3
4146A14K2k86K14j07r5J76JK62l58K03m2n4p7k10L88l55K48k39K48n8j12O2mJ22
4170F3k00n5K58J95l35P7j30j03K21k51R0J65J44k08J63q9l8j10l8N6L44nj46
4193F8J81l10J2o2j37J91J18k88J19J41o4L24k14l4j05K31l03J38O8j06jJ0k5
4216d8J08l48L52J84l71J55j2J87k03j88K34j35L9M23m44L7J58j30R2k28K62K56
4238C80n02J45q2J53k37J49K7M0q2l8O7j3j87J65P6j12K2j18J01P9l4k30K55j95
4262a71J16qJ46k9j3j5m8j21J53Nl2J08M2j31P0Pj22R5k04K96l08K80j70N1m7
4287e0J10O6l6L6Q1k17J75j39pk13J17k80L06K41n6k59j03K90j32OM9P4j70Q2
$$ plain form
4121 67 109 -163 -65 -157 72 149 54 -38 1 -7 -105 -148 210 -38 157 -4 -114 -24 90 -165 8 -97 112 51 114
4146 114 136 -150 64 -43 -138 38 39 301 -57 146 104 50 -27 -237 151 -204 44 -195 53 -5 -117 -55 -59 63
4170 63 -137 -192 66 261 -74 3 -127 -230 -9 -260 -170 -5 139 -69 94 5 -33 -143 -181 -125 219 214 68
4193 68 249 -61 -49 -111 -248 -57 61 -227 -108 33 -31 293 79 45 -60 171 -132 6 74 -32 -33 -23 -48
4216 -48 60 -288 64 248 -123 32 20 207 4 -184 50 -85 -46 377 -67 -30 128 -2 90 -138 124 380
4238 380 -122 23 -59 94 -143 6 33 73 -9 -47 20 7 -180 -15 61 -51 -29 -147 -46 33 -1 -231 24 -171
4262 -171 -55 -63 83 54 41 26 -22 -143 10 15 -17 91 133 2 72 79 -43 52 -152 144 -164 116 -54 -3 -50
4287 -50 60 126 90 126 207 -10 165 26 19 -194 -77 -357 -51 190 134 -125 -228 62 -70 -64 -15 59 -111 -29
4311b9L6O1j28R2k78J82kj67K34J28j55Q1J24k7l11J24n5K4m8l4L8mR3j10J45
4336A4j53Q6j0Pl3M3Q8O8l07K76j75k18K70L8M4k57J95j36P5j20J10m2J92j09
4360e4Q8j48K03k08K39j21J0j46J15J30k75J99R4r9o6m4J2J39j46J8p7j34J34
4383a37J82o9Q6m2P7J6k8l18J74K03k04L6o6K23R0k59K54j04k87J76m8L10k52
4406A3j2j20L8RK02j92k83K74k19L75k14K55k40J86M3j00J27n5j2j33R6o6K57
4429B29k60Np2O7P4q6J09o7o4J90r4K3p7P4J29k08k15J46J76k0j47J24l8j5J23
4454A06J14k75K33k31J37rj10J92j27j30Q3J30k09J90J32l54J32K2O6o3k26l6
4476b33M09k43n4J88j4k85K37j79K68k3J1q5J75j26l7r5J0J14j1j51j3J10K5j8
$$ plain form
4311 -29 7 68 -60 32 -246 -64 -66 -233 1 129 -26 55 179 152 -159 -35 -90 -66 -114 -148 -110 -114 -21 -131 14
4336 14 -139 -53 -63 -56 -89 -46 42 110 -197 79 -96 -314 -44 -6 38 -219 -24 -160 -85 -205 -95 -137 55 -54
4360 -54 34 -114 89 -119 120 -1 9 -137 -22 108 -167 32 126 27 -39 -83 -71 68 -78 -60 -137 -271 -137
4383 -137 45 -24 62 20 97 113 85 -233 -59 144 -60 -24 -90 133 223 -36 218 114 -173 3 -45 265 13
4406 13 1 -119 -81 -72 130 -62 -345 -71 -290 85 -129 126 -114 72 115 15 142 87 75 -58 38 -28 229
4429 229 -31 -26 -98 -31 43 -43 66 -1 -65 125 31 54 -23 51 180 -28 -243 -97 79 59 -88 36 -2 -17 106
4454 106 220 -55 178 -53 84 75 -35 157 30 -100 -17 113 -96 94 226 -128 4 26 92 29 -197 -233
4476 -233 176 -67 -121 67 53 -232 5 -174 94 71 82 -3 172 46 9 -86 -76 38 27 -124 -137 -27 -2 -20
4500b0O5J33j58R3k14K41m28M05q0K31K0j72L2j34l7N0m5J73p4j97l6Q4R5k48
4524b21N4L21k02J35q9J21n5J0j09K6K04k49J30m6r7nj00K89j42l3J03j57L12
4547B00n01K46K7Q8m2L68l08L1o7K31k82K8K0jj00l5K86m3lk26l7mJ96l4J75j57
4573E6j69o1l2K91J62q1j68P6J01r3l86K21J28p5O2l5N1j88K27q9N9J16N4l21
4597i4K19J68j17m49K60Q2%p7J33k9k58n7L32Rk21Q4m3N5J44j9k07l5K22j79L
4622g4j0r7J50P1M0L2j20j43R3K5k5K66l01k4m4J41o8QJ09k69J26J96j71O1K7
4647ao5K68p8m6j19J59l84L57j3LJ19k84M7J22o7j1j05m5J85N6k76K27m8o2k5
4672h6L9n2N3J6k4J05Nk2oj11K98m2j27j82K07PP5l21J17m3R3J5L8j87P6J20j90
$$ plain form
4500 -20 45 178 20 113 -101 140 -288 117 37 268 288 116 148 14 -23 27 -18 155 81 -116 -152 -68 27 -221
4524 -221 -167 154 -48 87 -2 119 64 74 -35 -9 195 -54 76 30 -67 -72 -172 117 -25 -58 45 -112 200
4547 200 -301 -55 -28 60 18 386 78 109 42 273 -9 19 39 38 -62 -97 189 146 143 -83 -120 -124 72 38 213 56
4573 56 -113 -174 -206 85 247 166 -2 74 175 82 -304 -83 45 -30 32 -3 48 -140 87 -2 57 173 227 -94
4597 -94 125 293 176 -273 -13 69 69 -8 125 96 -162 -219 113 122 -99 -15 -58 -3 141 122 -85 -120 102 -77 -74
4622 -74 -84 -181 -31 40 80 112 -8 -151 -58 -33 -58 208 -93 -117 -161 -20 -88 -80 29 -240 -114 82 -89 -28 -1
4647 -1 -66 202 124 78 -41 118 -266 91 78 81 200 -84 -37 85 18 7 -98 -143 42 98 -178 49 1 -61 -86
4672 -86 -47 -99 -46 -30 -54 51 56 34 28 -83 215 173 46 -136 71 78 153 -168 -51 -94 -1 14 52 -135 -59 61 -129
4699a29L66j39k36J86J79j73J25k03J29O2j88P0k00K63j57j07J79k7K5l02L21
4720D4J31k98N1jJ94P9j06P4k83pJ84l68K79k9J7J61k3n5r3j01l9Q4j58K38Q0
4745E5K7J12j90j63J40R9Q7L5j72k41J14L18k83L9o2L51k22l9j8m79O12j00J02
4768A22M8L9k2k62J0J6R0o0o4R4j21J1J45j41j13K21M8p0M0Q2Q0j20j45J11j57
4793a18P8K27q1k72L89k10K04k78J06j78J13N6K12l60L33j79l6J54k96J87k66
4814b15L18k17l3J95k6j30L02k92PM4j32L02j85R1j32M8O1lj64K80o3k17L42j05
4838G6m5M0j43L15l07J00k01K72J0j39Q4J55k84l1M7K4P5j14K5m4K70k77O6o8
4862i4J65L4k18O0n5j48J42Q8o5J36j7o6K04P4k47K4j67L35j07j91J44m1R8q9
$$ plain form
4699 -129 237 98 -138 48 227 54 179 -24 105 167 -21 49 -151 112 -45 -152 27 0 25 -277 44
4720 44 175 -123 -72 -73 121 200 94 168 -115 -122 62 -306 -27 -56 -39 122 99 44 -49 -150 -189 -105 -263 -25 55
4745 55 82 194 4 -159 -19 80 167 202 30 -211 -97 221 -62 -23 -85 266 44 5 -13 -492 120 20 122
4768 122 170 209 187 -75 -65 -49 41 -19 -83 11 -110 -99 46 -95 -208 13 61 -9 31 113 193 73 -72 39 -118
4793 -118 -40 187 106 -166 223 13 217 -61 45 -133 -20 36 248 -112 221 42 6 160 -136 51 -215
4814 -215 103 -114 -147 48 22 -108 194 -98 -91 -47 -179 123 -62 29 -103 -55 6 3 -161 119 56 -161 181 76
4838 76 31 71 -72 243 -64 36 -165 107 117 -22 62 217 -67 -98 -51 -27 48 -66 -41 -85 185 -92 -26 -94
4862 -94 71 105 -113 -53 -108 -256 -114 -26 -91 45 28 -38 166 240 -7 17 -150 185 78 -113 31 -10 88 -1
4886aN1k23L3K26o2j10j13J87j35Q6L52m13P1J54o7K11k07p4J22o1O0m4n8r5L21
4911B11k59J90j74P0p4K11k2Kk97J81j8Nm6K80k64pj78K30j58l7K20j31P8M4r9
4936d2L54n71J66J92l28L83j21j09J25k90K90k4J48j33j91L09J4j20k56J81P8
4957E5k27J96j18J32O5%j21r7o7K47P1l07L31l04K16j48n4l5Q6J7j34K53k2j26
4981i1j09J16o6J47O0j23Q6ko6O4k02K84J8j23P1J27Q2k87j81J99M5q2j5o1Q3
5006b6j35L08l19K18Q9j11j41K62l16K23k79L84j41j65L63l53k34N15K07k83N4
5027A20k09j12J22j0N8L4o2J88L3M3N4J32k70l4j04OJ1N3k3K9R8m7l6r1n4K94
5053B23k33l88M92k3o1N5m1K7j09K55k45L17l2n5l05L15j75m0K38j85p6P5j28
$$ plain form
4886 -1 50 -173 -140 86 24 -86 -199 -12 -147 -61 291 -122 -51 103 36 247 40 -34 88 27 87 43 -15 -110 211
4911 211 -48 142 -32 38 -36 175 153 155 -142 39 21 26 -20 260 -4 -11 -189 41 -117 -154 66 -65 13 57 -42
4936 -42 312 -259 -93 99 -229 154 33 -76 49 -241 49 25 173 40 -151 158 172 52 -204 -23 55
4957 55 -172 24 -94 38 103 103 -18 -115 -182 65 136 -171 160 -144 72 -76 -130 -165 -79 -62 -196 57 35 -91
4981 -91 -200 -84 -150 -3 57 -66 20 18 -48 16 -186 98 116 -7 64 191 273 -14 -195 4 49 -33 -48 -109 -26
5006 -26 -161 147 -172 46 135 24 -117 145 -171 52 -227 157 16 -149 214 -139 -373 142 349 66 120
5027 120 -89 -201 -79 -89 -31 3 -59 129 162 205 259 391 121 87 -17 -11 0 53 30 59 157 110 74 -17 -71 223
5053 223 -10 -398 94 71 10 65 24 51 -58 197 -48 269 237 182 -123 192 17 -23 215 30 -46 29 -99
5076i9jj46K73j95J43j6m8k2K98j71k42L92n5j32K7J53j40r4nL6K37k00lk46J64
5101i2K7J66M2q9P0J26n63L98j0j50mJ85j66j5N1nL06l42k8L19k10r1K12j70q3
5126a16J34J25q8j25j1K47r6j41K9J45o8J34l16L60q6k00K54l65N2K21nj52j07
5149a75K55J9J35k33j21m3K5J74j06j20P6O7j38k2K06j13J06j6j30j2P4K35l76
5172b33J33O5J49n6m36L33r1R3P6J30M8k55P7j01J39j16j22J83O%k1K4k53M34
5196B06j31l15K96q3r8K57r8K2j2j65K00j01o6K8l17L27n8l1L31k38N01n53K93
5219A95j21J0j04r1k2J29k7K44k96p5L09j72J07O5n7R1j64j91N94n73K81k51K85
5242A66j73N2N5l3P8q1%p1J9M7R8k96N0JJ60K9k86P9J1K12j42J64k3j19k22L33
$$ plain form
5076 -99 -100 -246 27 -168 -25 -41 -89 -111 187 16 -226 166 111 -21 6 159 19 -75 -80 -44 193 -7 -10 -256 -92
5101 -92 -65 101 143 54 124 250 -313 85 75 -75 -79 106 -60 -75 -24 -29 277 -65 -93 226 16 -75 137 -33 -116
5126 -116 18 143 55 -70 -81 166 70 -71 -42 103 35 169 -147 213 127 -73 181 -184 -132 89 84 -68 -175
5149 -175 80 99 234 1 -120 -163 -138 36 -70 -190 -114 -47 -185 -207 -1 -114 -8 -24 -154 -166 -92 143 -233
5172 -233 -100 -35 114 58 -378 -45 -136 -43 33 163 211 -44 33 -68 71 -45 -167 16 22 22 1 25 -228 206
5196 206 75 -240 56 -27 -125 132 34 56 44 -121 79 -22 -88 -60 -377 -50 -108 -139 192 -46 455 -98 195
5219 195 74 84 -20 -111 -133 -4 -31 213 -83 -158 151 -21 86 151 94 185 21 -170 424 -149 132 -119 166
5242 166 -7 45 100 67 145 64 64 -7 12 59 157 -139 -89 -88 72 101 -185 -106 -95 117 -25 139 116 -3 -225 108
5268A08k34K8j13L11o0k01L01r9J26k70j84M12m04J32L4N1j01L6K29k42K52j74
5290f2j55O1P9J18J15l15P0m6p1K59O9j41j10J00J18k81L07o4K7m3j18K69j73
5313A3r4J16l5K34j21l5j63L62k25m6M1q2l2J15N8J4N1j90Q0K2r5J7K13q4l88
5338b54L10p3K9j16Q6j28K04l1k06K84k46n6K32p1j64L01l33M49rl64J53J47l75
5361b31J79o0P7NQ5m6O4k04l3K49j99q3L16k26J85j7o2m6J01j3n3p2j4J03mk54
5387b53Q3L53O4k74L9j47L60m06R2J10J9rn00O26j45k0J02n9k8j03N0K45k5j43
5411C1j43L80k16o7o7j4J7R1LM8J64l31j81L88J04j32j71J64j25L3K87j67J12
5434B08P9n3j18k11K21j88R4p0j16Q0N6o3k2O1J30Qo2n6K56k84K53m38J62J39
$$ plain form
5268 108 -126 -98 -211 100 40 -161 140 41 167 -103 -287 125 -279 -147 -113 -62 -163 -127 102 -140 112 -62
5290 -62 -217 -156 -77 41 156 -159 -89 -135 -206 53 122 -19 -129 -29 89 -192 115 51 78 35 -83 186 13
5313 13 -81 35 0 234 113 78 -85 277 52 6 47 -35 -67 48 106 120 171 -19 61 83 -12 5 218 134 -254
5338 -254 56 -17 12 -104 -18 -146 58 27 -179 105 -141 -197 35 -36 -200 101 -232 217 208 -156 -3 144 -231
5361 -231 -52 -112 -35 -30 55 9 73 -131 -164 85 -114 -197 119 -107 78 61 -1 -47 54 41 -12 -84 -98 5 1 -253
5387 -253 -170 183 247 -27 12 -135 225 -181 -89 21 40 31 -469 157 12 -8 94 35 7 -96 -46 199 174 31
5411 31 -112 268 52 -15 -82 -96 -79 12 15 63 227 -104 -285 103 207 75 -96 68 -57 -24 263 96 208
5434 208 287 234 116 -95 126 -62 32 -38 -154 -74 -18 -81 -103 -42 88 96 34 -22 234 -50 203 -235 -73 66
5458F6K35l60r4J44J79k75M80n35K9L99m76L90j27j55J91q1K5L4m1J21j42j28
5480a21PJ35J4j01Q6R0r8j66K53r7L55k93l86J33L04k75L20n3j38J34l39J15M1
5503h0L1M4Nj85L5o2J18Q7j22P1Q7M5q0r3K0j35L51j22J23L9j07N9pq9k79M43
5529A97j27q7j29k9K41J1q5O4o7J0m0K2j2L1R8J08k21J08J3k82K45k71J94j6J71
5554A47Jj61k4j03L95k35L7O5j32J82q9p2Q6m0j67j36K98k6j84P1j2K03j35J11
5578H0j02k5M18o68L93j25L6j38J62L5j50J24m7R1P4l18K31j30l8L29n73K57L4
5601e0L8P1J51k42o5J16k5k16J77K25k35l0L72m11J13o7j81L12k14K40j17K53
5623B15k48J65l41N29k75j15P1P5K7j65mJ37j09O9K09k07j03M7M3P9k38J18l5
$$ plain form
5458 66 301 -59 -153 -9 170 -105 375 -160 -131 268 -208 182 55 -100 91 10 35 69 28 149 7 -121
5480 -121 -114 21 35 -66 20 110 12 -154 99 2 357 64 -322 -189 115 -160 160 107 -31 103 -236 -121 -80
5503 -80 -49 -5 0 -185 -150 -212 -94 -7 -129 -58 29 74 -6 -99 -79 -214 137 15 138 177 70 129 122 33 -246 197
5529 197 70 -17 -146 -175 66 77 -8 56 -11 -1 -41 -19 -31 0 98 206 -15 93 106 -176 69 -202 -8 -24 147
5554 147 148 -13 -37 -140 255 20 57 122 -10 172 83 11 97 57 -110 -246 52 26 -158 -87 -99 104 -31 80
5578 80 -22 -47 371 -297 96 -29 7 -131 31 66 -84 40 -7 84 158 -160 71 -59 -97 232 -341 -84 -50
5601 -50 -12 59 210 -32 -97 19 -6 -222 -45 180 -55 -85 287 -124 -11 -78 -259 53 -161 79 -38 215
5623 215 -33 132 -209 320 45 -70 1 76 103 -62 -66 71 -38 31 240 33 -70 -23 20 99 -139 -21 -56
5646e6J94j94R5q2J6k04J94K15j18j73J09J02k22p4R1O3m6R9q0M7k00L89j34J59
5670A90j92j40N7PJ14m9j1jp1p3l1J60K4kj25J17L5m5m7L34J00m23Q3Q1Q0k60
5696h8j5J96K1k50j59M46j90J88l59M49l53o2J54j54L49M7j17k00L38l81K73k0
5718A13j67J48l47J12J89R7n8l49J79p1M48j12k14o7J02j0k9j05R7m8J66o7j36
5741a29K58k64J18L0j94M6L23p2j10J94j79ok3P4j53J47j25J14JJ8L4k50J47l8
5765c9J82Q4j99K98k95l2J6j8m2L72m87J39K57k15J83J95j18l16M6j2J45j07k0
5788A7o6J84q3q8j32l2J49l12L03K42l6j23M3k58K40J21m5P8k15j55qK25k45P
5812a89j2J24m1J66J93m08N9n7P0J21n5J82j92j81L81k29J63l8j74K19k06K72
$$ plain form
5646 -56 138 -56 39 -43 -27 -231 -37 178 60 -113 -4 98 -124 -198 -107 -44 -90 9 -71 -24 -224 165 31 190
5670 190 -2 -142 -85 -78 36 -13 -24 -25 -96 -169 -200 -40 -16 -18 -143 -26 9 -36 -83 251 351 -72 11 92 172 -88
5696 -88 -103 93 114 -136 -295 151 -39 149 -210 239 -114 -176 -22 -176 173 220 103 -97 241 -140 133 113
5718 113 -54 94 -253 -141 48 145 87 -262 -83 -154 294 182 -32 -99 3 -7 -36 -141 -44 -92 74 7 -129
5741 -129 129 -135 -17 13 -181 -135 188 116 6 200 21 15 -8 66 -87 60 -65 49 50 68 102 -148 -1 -39
5765 -39 143 227 28 326 31 -1 15 -3 -45 327 -160 -21 236 21 204 399 281 -35 11 -1 144 37 17
5788 17 -49 135 52 -36 -168 -200 -51 -363 -60 182 146 23 66 -192 48 169 124 202 -13 -168 -176 49 -196 -189
5812 -189 -201 -77 -118 48 241 -167 -108 -165 -95 26 -29 153 -39 -220 161 -68 95 57 -117 102 -104 168
5834A68l81J12M2m5O3J63p6j3l02K54n2k2P4m5j46L97j84J91k74NJ85k41J07j9
5858c9J3nj95L90l14K53j30J59k18j2J65rpq6N9lk4j00N9l7L08j52k33K2J3K05
5884H2L2O1k70J26R7k76r9L09j16J21o5K6L2L0j75J20j50K24l03K0J22K71k36
5907a7j02Q8N8oj91K68N4j29j6k37L12L8Qr1o6k32m1J76m8Q2J5o7J05J9J4k43
5933b49K32L1l77M11J23k09L0J3O9p2J73m6on5m9J5K14K4m08J89J00j51j32m2
5957a72J27q8J28M4j54J65k83L03n0j08J96pO0p8k4j97M7R0j71L56j08k66L45
5980A55k94J16N8k65L02j55P1J30K5j10K5qk18L4K57k25J17L2j06q5J95k9J03
6003A25L8j82m6N1J22j54N8m4k3J24p3k8J29o3M7k2j14J69k29J36k4q2J80rj01
$$ plain form
5834 168 -213 -101 -59 -104 -41 122 46 33 -269 -15 -67 -89 -15 -60 -206 191 7 198 -76 -71 114 -127 -20 -39
5858 -39 -26 -31 -226 164 -150 103 -27 132 -86 -98 67 58 51 -35 24 21 -3 -103 -44 -81 227 75 -158 -136 -123 82
5884 82 114 175 -95 31 128 -148 -247 62 -54 67 2 28 60 90 -85 35 -115 109 -194 -174 -52 219 -17
5907 -17 -119 -31 27 21 -170 98 152 23 7 -230 82 120 128 37 -29 -261 -302 -126 -174 -92 -77 -144 -39 -20 -6 -249
5933 -249 -17 14 -363 48 171 -38 -8 5 74 2 175 129 123 68 19 34 248 272 -136 53 153 2 -130 -172
5957 -172 -45 -133 -5 39 -115 50 -233 70 20 -88 108 101 161 83 59 -138 -91 -1 -172 184 76 -190 155
5980 155 -139 -23 35 -230 72 -83 -12 118 143 33 58 50 -168 -134 123 -102 15 47 -59 -144 51 22 125
6003 125 163 -19 -65 -14 108 -46 12 -32 -55 69 -4 -32 97 34 81 59 -55 114 -115 21 -3 -85 95 86 -15
6028a5K76k07n6k4Q3J40j97p2P0r4J43K8J26k81l0J05o3M7M1r3J14k2K17k62l
6053b9J02Jk45J28L25j19o8L7L0l89L43j24L18k19OP1p0p2O7K8l06M92m01QN2
6078c4K14l13M7m6JJ33j74O1L7q9L58j66k9J32r2J92k03n5Lj15P5J01rN1J4l2
6104F2n2j62K27%Ql8j64K45j22J50J05l39J81K47j35k46J56j52j56K75j46Q9k09
6127a76K29r3J09j33J96m08R1K28Q3L1j14K5j19N6j67L06r1k06J58PJ43j14q4
6150d3J82k08M3J44r3R2j57o7kM44m77R6K84j99m8q3K38l2k74M2j42J54K18m8
6174F4J59p7j61K51m25j10L55j76K27j50M9q4L06k06l1m7N5K50n10M57l70K13
6196C9J13%j59m9J62p9P9L5k42L5J65p0k83L68J2r4lK41m24J11J04l9j71K41m06
$$ plain form
6028 -15 261 54 -2 -26 57 197 0 -72 -2 -96 47 75 201 -80 -110 -5 -68 -21 20 -73 41 19 236 -26 -29
6053 -29 73 74 -171 -43 282 163 95 132 162 -227 116 -8 310 91 97 168 98 26 93 121 -185 307 -94 -86 -34
6078 -34 180 -133 -86 -132 -131 2 -172 -111 -74 -163 195 29 0 132 40 232 29 -26 -23 -138 -63 38 29 80 94 62
6104 62 10 -152 75 75 83 45 -119 126 4 154 259 -80 101 348 213 -33 123 -29 -185 90 -56 33 -176
6127 -176 53 -40 69 -64 132 -276 -185 43 126 157 43 68 -51 5 -162 144 53 -153 5 12 155 41 -43
6150 -43 139 -69 -26 118 25 117 -40 -107 -109 335 -142 -46 238 39 -9 -92 146 114 -160 -118 -260 -106 112 64
6174 64 223 146 -15 236 -189 -299 56 -120 107 -43 6 -78 228 22 -9 -56 -1 249 -261 196 -174 39
6196 39 152 152 -7 -56 106 27 106 141 -101 -66 99 29 -254 114 126 32 29 270 -154 -43 61 22 -149 92 -314
6221c14K40M34l33n0kK39k09N6K9j81N0K54q5k8n8J38m50J25P2Q0M3j85n9K63
6245F9J55j73K2l48K42O4R7l23J78j49J43J25j34J78J48q1l51L20j65M1R5l21
6267a68P9j23J30J9Or9J31J71j51K5j09L4j59L02l6LJ38l36J68J15l2j12o7o0
6291a31r8L66m32K33O0j81K98%k10q9O2J26M4j11q2M53k26k61J94k62K37m9K68
6314B09k09q5J3O4k6Qo0L36l26Pk7P3q3P5j82L32k06J61k5k51J85O3J46j18J06
6339A80l05o9K4L08k57M1J73L5j78Q3J02j68K2k9q1p9K31j14J81kk04l8K25p0
6363A1J66q3P0l18K71j55k05M03k18J31l7m3o7m2K25j73J1P3K8o1j18J41k60K29
6387b1o7LJ04pj38J69q5r2K5N9P3J02l22N73l85k57L96M6j58O6p1N9mK6o3N8l03
$$ plain form
6221 -314 -74 360 27 -23 -25 214 5 61 90 -91 -41 213 128 100 42 180 -270 -145 -73 7 50 -135 -194 69
6245 69 224 51 73 -275 -33 31 128 -195 -17 -166 -23 102 -32 146 294 213 -138 182 17 58 153 -168
6267 -168 -89 -212 -82 -63 -57 -156 -25 146 -5 20 -89 -55 -214 88 52 55 193 -143 25 140 108 -4 -71 -131
6291 -131 -229 137 -295 -62 -2 -183 115 115 -95 -184 -122 4 48 -63 -145 308 82 -179 15 -247 -10 -59 209
6314 209 0 -85 -72 -8 -34 -26 -86 250 -76 -69 -96 -23 -106 -31 -213 119 -87 74 49 -202 -17 46 192 74 180
6339 180 -125 -194 -170 138 -119 -78 95 130 -48 35 137 -31 -9 -38 -119 -198 33 -81 100 98 -106 -144 81 11
6363 11 177 94 164 -154 117 -38 -243 160 -58 73 36 -7 -74 -116 109 -64 -53 20 48 -13 -131 10 -250 -21
6387 -21 -88 -85 19 12 -126 43 -42 -134 -109 -50 23 125 -197 376 -9 -266 130 176 18 84 13 72 68 94 31 89 -214
6414b14J32k2MjJ63k0P8r4j52M8K58j78r4K2j57L25j00j3J41j97J23m1J86k94
6438i7O1K45l35J69j27N6J18J11l45K02M2l42J44K2L32l35K9J79j41J42k49J1
6460a08M10l24j50K03j57Q8r0J93j96L28j99j59J22Q3j88K67q7R5k51qJ90n4L4
6483D2j79k01K58jl1J06q1K77k11m5R2M2O5j36P8j39K5L01k08J5J10j59m0M13
6507C93l73r0j8L5k0Op6j17K37k07L61m2l08L92k86J88j96M9R2k13L28k36L6J35
6531G0j4J3r6k03L63k05j7J21J12l27K89O8j80j41R7j1N8L9k46M4P9Q9j3r3o5
6556a69J61p7P5L0J96l69L55o1j85j86K65q9J56j17r1J24j62N4P8j17j10K40k51
6579b50J05J63j94J00J46J70k7j04p3j25K6J81j12jO1o3K75k61L4m6j43K28l9
$$ plain form
6414 -214 -82 -104 -100 -101 62 42 120 26 -126 -78 180 2 -92 -70 -227 98 -2 -15 126 -71 52 11 197 -97
6438 -97 -36 209 -126 43 -84 -28 90 201 -144 58 100 -242 -98 -76 256 -79 -50 129 -12 130 -119 -108
6460 -108 302 -22 -172 31 -126 -38 -128 65 -131 197 -2 -161 -39 44 -144 123 36 131 -120 -128 62 8 42
6483 42 -137 -338 -80 -81 -112 -6 -87 190 -21 -66 26 68 133 -3 75 -64 -39 262 54 69 179 20 -20 393
6507 393 20 -70 -88 -53 -73 -67 -143 -260 -23 -230 131 89 -219 173 -113 75 -121 -72 20 -193 135 -101 -65 70
6531 70 56 69 -27 -230 133 -72 -89 32 144 -183 106 174 -6 -147 -50 -61 -3 36 -210 -166 -87 2 -11 -104 -169
6556 -169 -8 -85 -10 20 216 -153 202 141 -44 -230 35 -54 102 -15 -106 18 -144 -90 -12 -129 -239 1 -250
6579 -250 -145 18 -176 -76 70 240 213 109 36 -89 -63 118 6 5 66 3 278 17 51 5 -138 90 51
6602E1J71l28K45p3m3m7J5P3l21M51j34j12P1j72K61J56k55pK21n00J14J97j66
6625a32R6l9M31k85j29J23n9J2o0J1l7pq3J9K49p2k0M4j17P7r5q7J64P8q2m1M0
6652ak01L30mk41K38j93n3j12K42j14J32Oj36Q2j53O3J05j2J28R5n0k67J5k6j29
6677b56J81O3j53M1K75Pp6k91J82pL1M24l62L1J48j24j64j59L07p3m0j16J23m27
6701d35K88K36j0n2k91J28K70j00j22L0Q3r8J0l26L20K79j84J5j33J85j09k02
6723b18J86K55k53J55l60L29p7j72J65n4r8m7N1J84j71N1K70l97L47j18J01j37
6745hj64L5J58j63R9J15k30J49r4Q0r1P7Q8j5O8j87L4J44j15m0M1j05q8J22P0
6770b0j48QK57p3J5L4j11J33K9k19M5j36L15k33J53J60k29j72L36k33J19m1J71
$$ plain form
6602 51 222 -106 139 66 23 -24 -9 64 -257 194 60 -52 19 -153 108 264 9 2 223 -277 -163 34 -132
6625 -132 -36 -75 356 71 -58 65 6 18 -42 -31 -68 -75 -158 -139 110 38 18 62 -55 22 -73 -160 4 82 0 -41 -1
6652 -1 -202 128 124 -117 121 -72 -125 -237 5 -109 23 29 -107 -25 -178 -115 -10 -22 106 201 151 -116 -101 -127 -256
6677 -256 -75 -12 -165 -124 151 158 82 -209 -27 -34 -3 421 59 90 238 114 -50 -209 98 25 -15 -131 -8 -435
6701 -435 -147 89 79 27 -264 -136 134 34 -88 -58 25 -73 -63 -389 -69 210 26 41 -92 93 -16 -218
6723 -218 -32 223 -30 125 -235 94 17 -155 10 -44 -142 -189 -138 46 -125 -74 196 -201 146 28 129 -8
6745 -8 -172 -137 21 -142 -43 72 -158 -9 -103 -23 -114 -37 51 36 104 -83 -49 95 -20 -60 -19 -124 -212 -90 -20
6770 -20 -168 -160 97 24 39 73 -38 95 124 -95 -50 -186 129 -104 49 209 -20 -192 144 -89 30 -11 160
6793A60O3n13K78l4J64j19j24j29L15J13r1j13J95j66j1O2q4J63L5k6k35K58l22
6816a61J44Oj62K73q9P9J3l90K16J02NO0k99L59k46K6q9j3K78n0k28K26j78K59
6840A41k07NN7J44k56O2n6J07j61L57n13L18J57k42j32J60J36l04K85j50j07K60
6862F1k71K17P2P0l68J68J76j09j83J83j54L7K67j00m7NM4q6j2nK3p2l2r2n0K63
6888EJ79k80kPr8J71K04j07l97K64J56j29J3J65r4Q4l6n12M09k99M99j31r0q3
6912a02P3n3J04j1P3p8J07p8pj32JK1J17N5n3j99K85p9m1mj51K47j83L58k64J4
6938B0K17r4k52m7L51j95P2j40O0J95j81r4J08J18moj23Q3j21l5j3j16K85o8R2
6963A12j06p9m0o1K65p0K1L3p4k3J15j13r4l7oJ15LJ5j33J07l3Pk52J95L2Q1N3
$$ plain form
6793 160 223 -290 -12 -46 118 -1 -125 -254 61 174 83 -30 165 -1 -12 50 -34 129 164 138 -97 161 -161
6816 -161 -17 -11 -173 100 11 90 103 -287 -71 31 36 96 -203 156 -90 -64 -153 -166 112 62 -166 60 -118 141
6840 141 -66 -61 -4 140 -116 -54 -110 -3 -164 193 -320 -2 155 -87 -219 -59 77 -227 58 -92 -199 61
6862 61 -210 7 79 149 -219 -51 125 16 -167 16 -138 -101 166 66 19 24 68 -18 -30 -35 -12 -84 -116 -208 -258 5
6888 5 184 -96 -98 -91 -189 -18 186 79 -318 -54 102 -27 -14 151 57 141 105 -407 2 -297 202 71 -19 -102
6912 -102 -29 -82 22 11 84 6 113 35 28 -104 -103 -82 35 90 37 -162 123 44 3 -1 -152 95 -88 270 6 20
6938 20 237 143 -109 -156 195 0 72 -68 -8 187 6 -88 20 138 134 128 5 88 -33 -68 -81 -197 88 20 112
6963 112 6 -73 -113 -174 91 21 42 75 1 -22 93 -20 -114 -151 -157 -42 -39 -24 -157 -50 -83 -76 -328 -133 -101 -20 33
6990C3l0q6K0J31n6j17J31k00P3M9p8K70k25l4j85K40MO5O7J83l20j60K19j08
7014a14K41k90M8J78j39k27M24q6j5k17Q8K1P8r5Lj5K33j4L7j13o9kR4j69K5L29
7040B34l61J84j21k6M0J47j48r9K64j06k67J30K19j78J24k19J23J45k20J03jq
7062d1j75M15j67Q1r9j49k3K50k28L23k14Q9k31p6K14N3j08J28oR7r0p5J24j19
7086b7Lj19J38J43J09k43r1pM6P0Q2N8j16k13K52o4P0j27O3l3P3K19k07k29P3
7111g7R1j21J92J16m77K57M1j47J11J28o9k98K25J52j4k24p8K85q2r7RJ6j04K4
7135a41N8J6L78k24MO1k61j41J63K6O5j60J55QL2j03K53r8k32L54l27o8K92j58
7159d8o5q4J48j20L81l36L5J67q7p3J33r1J02j8L9j29r2J51j26J15j7oj13J63
$$ plain form
6990 33 3 -83 -63 68 12 -105 26 -174 -101 -52 -130 140 -85 -119 -304 -64 -60 5 72 255 -65 -225 -6 -114
7014 -114 127 -163 -115 63 -76 -303 121 35 20 -197 -109 -88 -10 -105 -102 -117 116 102 139 26 -43 -45 49 -120 -95 234
7040 234 -127 57 -64 -90 -50 97 -51 -150 114 8 -259 -129 90 -88 36 -183 -60 85 -135 -32 -33 -41
7062 -41 -216 199 32 113 14 -135 -158 92 -136 187 -27 62 -169 -245 -31 22 -86 42 36 133 43 -32 92 -27
7086 -27 -24 -143 -5 138 247 4 -87 -94 -48 22 104 162 46 -167 85 21 91 -36 27 -6 67 286 79 -150 -77
7111 -77 14 -107 85 201 -276 -19 22 -125 -14 114 45 -253 -28 124 110 -114 -192 93 11 -86 -77 -61 -165 -141
7135 -141 -83 -67 311 87 91 152 -109 -250 -87 -61 4 -156 -1 7 39 -64 189 91 -141 213 -114 -182 110 -48
7159 -48 -113 -197 -49 -169 212 -124 -89 78 -9 -82 51 -40 62 44 83 -46 -138 13 -113 2 -15 -21 -134 29
7183B9j26qO7L0J09nj40%J78j94J49j04Q1R0m8J81n27J57J16J00j42J65l72J09
7207a05j30K30q9K15r2J2o2j2J29r4j30K00j86J15jP6j93j16K22J01k37P8J89
7230A20r1m0P5k0q5P0l01K97J23j60J23j46Lm5n1J44P6k12RP3J13K4J6J37n8l12
7256a18R6n5J65R2l05K4O5l0j27J68k00P7K08j22j7J27q5J47J9j13j13J53n3o7
7280f4L45l56J92j73j43J04N3J60k13OM7J61k28K96l03J97kO3N6l12L6l1K73M1
7304B05l19J73J3o9J8%J05k01J98n6m4o4p6J17Q8m4j14M5J09PL5Qj47n6m5rJ94
7331G1L7k59K10k03K76k95J35j01l4K47j00k80J68J74N5q4p4J93l4l57N11l0r7
7354A29j11k85K70P9j12P6k1j52K53j90K10K18m63PJ80j67L04j75l5j24K25j88
$$ plain form
7183 29 -97 -105 -38 -8 101 96 -44 -44 134 -60 89 -15 66 156 108 289 -238 -81 35 135 -7 158 -214 -105
7207 -105 -235 -5 -94 121 29 41 -21 -33 96 2 -128 72 -114 1 0 76 -117 -233 -11 90 -147 -69 120
7230 120 29 -11 64 44 -41 29 -272 25 148 -12 111 -35 -32 -77 -128 16 92 -120 -111 -38 75 99 115 252 194 -118
7256 -118 -22 -77 88 180 -125 -101 -36 -66 -193 -25 -225 -148 60 -62 -79 48 -37 110 129 16 -97 56 3 -64
7280 -64 281 -75 117 -56 -199 -95 -42 118 -95 -89 -42 119 -109 187 -116 81 79 142 198 -114 -78 -109 164 205
7304 205 -114 59 72 3 21 21 126 -75 123 67 23 -41 -117 0 88 44 -70 -25 84 91 126 134 -13 -69 -114 -123 71
7331 71 108 -151 59 -144 132 -163 -28 -129 -163 84 -16 -296 -128 46 101 17 -57 136 102 -255 256 226 129
7354 129 18 -267 3 82 -30 46 25 -127 126 -64 146 364 -99 -92 88 -79 225 50 15 -109 116 -72
7376g2N1j9q6N1N8J79j14j84K01Rq3q7%J21R4j83J1J62n3k62K54o8J01L00l95
7401a4j62K05q5Lj56Q4L83k01J16l54L01j81M4O6l2n7j40K02j38J70j9j63K68
7424A40k65J72k2j24J57K6m4k4l7O4J6k54M4J96j18J76P3k97L41l18l9K25k60
7447a72J48M8J4k06K15K10l25Q7k2n6J68q9O2J50k23O2q7L3Q2k79K55Pk24J94
7471E2l01K29M9K43l73J68j30P0j52j9N7N0J84p1k58k5L04j18R4j31J54O3j6q7
7495C6J63j14j17J38j22k83K86r8K30O7l07L1K10L5j3k09J40N0M2J11n6m9j83
7518a2k50K15J85m2r3j11o6M26j66j27pJ19k3q6J68j31k3M62n44NP5L1J24k97
7542a68P2J11l14L16K0j85J02j44L25k67K64k98K80j40j08J73k05J26P8m2J09
$$ plain form
7376 -72 -21 -40 -126 -75 -17 162 48 -136 65 74 -9 -96 -96 25 119 -64 -53 109 56 -206 48 -20 81 381 -14
7401 -14 -176 29 -56 -53 -209 -125 258 57 173 -181 120 -61 -17 49 17 -40 -180 22 -116 54 35 -128 140
7424 140 -125 47 25 -99 58 84 40 16 -21 43 59 -195 -151 45 -73 103 176 -121 220 -98 -137 88 -172
7447 -172 -24 24 38 -168 47 257 -68 19 -3 -59 109 20 82 232 9 71 -16 17 99 -180 75 82 -142 52
7471 52 -249 -20 29 272 -101 67 -63 7 -145 -164 -107 -57 127 56 -202 -227 77 -41 53 -78 76 139 123 36
7495 36 199 85 -32 106 -16 -299 -13 -111 119 186 -121 -90 120 155 142 -67 73 123 165 276 220 171 -12
7518 -12 -262 -47 138 96 3 -108 -174 252 86 -41 -48 71 48 -38 130 -1 -24 438 -106 -101 -26 5 129 -168
7542 -168 -96 15 -299 17 37 -148 -46 -190 135 -132 132 -166 114 -26 -134 39 -166 -40 38 -4 105
7563A05j15K26q4k42j15K64j46K57l40J15j5j33J84noR6K32l44R1n1K41j79P7
7586A13m22K85L3MJ79Q9k78j53K78%l42M24j59nJ31Q5l78Q5n9L34j48M9k06m7
7610a08J45j43N9N5q9j13K55j27L14j22r4j42J84k10J64m1NK7J18k97M43j91j32
7633d0l5J60m1k00J65R9j03L4J86l93K20k0j77p0J91K22k24J69q0J5k0l0r7K17
7657A48k08J84q5k28K56j84J04N3k0K5q7j26K24L4r9O4l79L02Q9r9O0k47J54K45
7681A80j39Pj87LO9J07k41K63l07Q0K94k11K57j05j52K0Q4k83J54O2N5R2k27o8
7705a93J09K16q1K2mj9qk30n9J84q4N7J69j65J32m3J70l35J28J26j80J11k0N3
7729E6k8l55L58p3M4j3l7n7L0o1K12j36kR3J85k17J49m7O7k81n0K57j55J59l3
$$ plain form
7563 105 -10 216 132 -110 -225 39 -107 150 -190 -75 -90 -223 -39 -44 -50 46 278 -66 25 -26 215 36 113
7586 113 -309 -24 9 13 192 281 3 -150 128 128 -214 210 51 46 177 262 -116 -31 -90 244 96 145 -61 -108
7610 -108 37 -106 -47 8 -81 -194 61 -66 248 126 32 -110 74 -136 28 -13 -8 19 137 -160 283 92 -40
7633 -40 -75 85 44 -156 9 108 5 39 225 -168 52 32 -145 -215 -24 198 -26 143 63 78 58 28 -69 148
7657 148 -60 124 39 -189 67 -117 -13 40 20 45 -42 -168 56 90 -9 55 -324 -22 67 -32 28 -219 -65 180
7681 180 41 48 -139 -136 -67 40 -201 62 -245 -165 129 -82 175 70 -82 -62 22 -261 -107 -45 10 102 -125 -193
7705 -193 -84 132 51 73 69 50 42 -188 -247 -63 -147 -90 79 -86 46 3 173 -162 -34 92 -88 23 3 56
7729 56 28 -327 31 -42 2 -11 -48 -105 -75 -136 76 -60 -62 31 216 -1 148 101 168 -113 -163 94 -61 98 65
7754F5L4r1J11J7k25j2M6J95J0k02j26L22o1j35N7p2K58j12M5J73l08k6J66j81
7778e2P4O6n7j88l5K64p4OP0l22J75q0K38l69J34k33N23k15J96l14J08K47k80
7801a18K01K7j69J08j23K5Q4j56J01K30r8j61o2J51Qj9j37P0K63j32j59O7j9M5
7825B7k94M26k19K6l3N9J43l34J38j47K70r0J11k71J70K22j34J35j89P8Q0m14
7847b40L21j89o9J10J10J63j40Q0j01l1q9K90k14j27K20k20K70r7j60K03j37q3
7869a30J28k4m1J76p0k09J15K60k03J90k43j04J45J08k41J20j26J06L28k35nl33
7891b88L92j30J3k20L16J0J14l57J49K7M2J12k09R7n4k99L47k50J77m1j07J24
7913c5p9L57j81J21k41P7l4k0m5J90r1Q7k64l9K67j29L6P1R0J31j80k84K45J7
$$ plain form
7754 65 99 8 119 136 -89 -101 -55 140 150 -52 -178 144 83 -52 5 -67 191 79 124 297 -11 -37 129 -52
7778 -52 22 88 31 -157 -192 72 -2 4 74 -248 -73 -153 85 -284 -150 -383 140 -75 121 -193 -85 162 -118
7801 -118 83 110 -59 49 -74 -49 35 -121 -20 210 112 -49 -111 40 48 29 -108 -38 225 93 -66 1 -18 27
7825 27 -267 159 -60 -34 -67 -8 135 -199 -61 -208 62 -28 83 -188 -18 204 70 205 16 94 174 -240
7847 -240 81 -108 -177 -67 43 206 66 146 45 14 -75 215 1 -126 94 -126 144 47 -113 90 -47 -130
7869 -130 -2 -26 -67 109 39 -170 -55 205 2 192 -51 -155 -10 98 -143 -23 -149 -43 285 50 45 -288
7891 -288 104 -26 -13 -233 83 93 207 -150 -1 26 68 180 -29 68 14 -285 62 -188 -11 -52 -159 -35
7913 -35 -114 243 62 183 -58 19 -15 -35 -80 110 19 106 -158 -197 70 -59 -23 48 138 269 89 -195 50 67
7937F7j89L60l67J86R0l44J06j2J84n9m7l07M54o8k64K83j9k29oK80k28q5l7L52
7961A01k7n8J12k62O6j06K37p4R7J57k35j52R9K57l43K34k69J33m9K78k51R8k33
7984a90J70rnK18p3l56J73L2p4K24o4M1j70K02j07P0J2k68K59qk17K03j26L77
8008C14j86P7j76P7j26R4r2K09j50q0J82k42K82p3j34J8j08L3J20Q6j09k1o3R5
8032B7p1j0j60K90J56k81k38J47K27jl7M8j37j33L28O2m39L06O7r3j32n8J37J13
8056A18Q7k16K16j35j09J06j5K9J34j98J66n40L79M9J2j60Mj24L49k70M6j5l8
8079a25K73j35J62j18j24K47k66m5K03j61Q3r2J14k98L63j41j74K80K18m59M70
8100B75l14J97k01J88j70j31j7J44O3J39j47j32J8j32J31N1j4L6l03L19q3J32
$$ plain form
7937 67 -122 238 -129 57 147 -197 -91 -103 81 22 -25 -332 122 54 -210 73 54 -175 -181 99 -129 -214 -251 101
7961 101 74 16 128 -134 -68 -174 63 -11 86 243 8 -144 -45 212 -131 103 -166 -33 -82 196 -55 43 -190
7984 -190 -20 -29 -34 184 111 -245 -72 -40 -114 110 46 87 -83 119 12 82 94 -174 85 77 -140 63 -63 314
8008 314 128 205 29 106 -20 74 -18 191 41 -39 143 -99 183 110 -24 -6 -114 -81 39 125 16 -5 -68 27
8032 27 -44 -54 -214 76 232 -49 -287 -140 87 86 49 97 -40 -173 155 217 -222 84 151 58 -74 -132 5 118
8056 118 205 -11 205 70 -39 67 52 81 215 17 183 -357 22 71 83 -77 -73 -197 152 -118 -72 -87 -125
8079 -125 148 13 175 57 -67 180 -86 -131 72 -89 -6 -98 16 -282 81 -60 -234 46 264 -195 275
8100 275 -39 158 -43 145 -25 -156 -173 -29 34 173 26 -106 -88 -220 -89 -38 -52 -16 -319 0 -83 49
8122D9J01k01J22Qn1r0J26q8J9k9j10L57j95%J10K7r3k06K63r1K37l87N5o9J9
8147a17J70j29K46k5k11J04Lj59J07j00K7J01j86L80j36J61l24K6j7j65K69K9
8169E4n3J55j35N8k38J9Q0J15q3J36j65k6j09K81o0Q9P5j94K96m36L1J1
$$ plain form
8122 49 150 -51 71 79 28 -62 64 -24 -5 -34 -144 213 18 18 128 155 62 -144 119 28 265 -122 -67 -136 -117
8147 -117 53 -76 170 145 -66 38 41 -118 -11 -111 -84 17 -169 211 75 236 -88 -62 -79 -244 25 54
8169 54 1 156 21 79 -159 -140 -60 55 -28 108 -57 -83 -192 89 29 118 193 -1 295 -141 -110 -99
8191i9
$$ Imaginary data points
##PAGE= N=2
##DATA TABLE= (X++(I..I)), XYDATA
0@%%%%%%%%%%%%%%%%%qJ6j6J6j6J6k4L2l2M0m8N3o1P0p8Q8j03J16j29J44j61J80
39I5k02K24k49K77l06L39l73M11m52M96n48O05o67P34q10Q97r94J106j233J382
59G32j560J771k034K371k814L427m331N807q599J5610o3360j13930J87946J12003
73A33039j27440j00695R9690O9891q1833m8507O6336K5412k6429j836l994m0600
85c6966O282P6087J5373r1449l0972O9241K9265m3274k0138K9886J5742k4626
97e549j4545K451J1888L3518L301n3402k2584M6514L8461k7976l0856K1469R519
110A2209k3313Q584J9287j3925o464K0291p698m5505J2836P2359j2899q2285R681
123c6842P0964j4898o3544L1272O7461m9486p2958N7955O8398n4557n5439N7733
$$ plain form
0 0 0 0 0 0 0 0 0 0 0 0 0 0 0 0 0 0 0 -8 8 -8 8 -8 8 -16 16 -16 24 -24 29 -32 38 -40 48 -55 61 -68 76 -85 95
39 95 -107 117 -132 145 -161 178 -195 216 -236 260 -288 317 -350 384 -426 471 -523 583 -650 732
59 732 -828 943 -1091 1280 -1534 1893 -2438 3369 -5230 10380 -52980 -166910 21036 133039
73 133039 5599 -95096 4594 74485 -7348 -55855 10481 35893 9464 7628 3634 -36966
85 -36966 -30684 45403 60776 -30673 -61645 7596 36861 -6413 -26551 3335 19077 -5549
97 -5549 -20094 -17643 -5755 27763 31064 -22338 -44922 1592 40053 12077 -18779 2690 12209
110 12209 -11104 -2520 16767 2842 -3622 16669 8971 -36534 -23698 48661 35762 -46523 -36842
123 -36842 34122 19224 -44320 -13048 54413 4927 -68031 -10076 58322 3765 -51674 6059
135F059M9175o8441m7843P5371M9018o1598m4368L8228L3569k5411j7475K2656
147H940K423j7930K571J825n480J0624J3170j4459k6431J0212K9406q226j6872
160a0227J0162L082j2305P72J5453J324j3130O742P412k0194o10K9065J975k7353
174g832m420K3510k347k4424J5584K5419k4978k5308K2420K0304k1151j4145K7907
187A0539M616l8911K427M1704m541l7346O768L7294j2779m1604K1734M5522j9456
200A5967m2392R691L7828j986l0713J974K2102j683j4018p258P165J5046J5j6731
214d993j1408J0644J8647p841j7740P941J0591q224o135P281O526o987j004R331
228F629j0439r962K0414J3479k0099j8006J7245K0717j7634j5635J8975Q773j8559
$$ plain form
135 6059 55234 -13207 -61050 14321 63339 1741 -42627 -4399 29170 3759 -13716 8940
147 8940 11363 -6567 -3996 -2171 -7651 2973 16143 1684 -24747 -14535 14871 6645 -10227
160 -10227 -65 3017 -9288 -8516 6937 8261 -4869 1873 9285 -10909 -11519 17546 19521 -7832
174 -7832 -12252 11258 8911 -15513 71 25490 512 -24796 -2376 17928 -3223 -17368 10539
187 10539 15155 -23756 -21329 20375 15834 -21512 -14744 22550 9771 -31833 -10099 35423 15967
200 15967 -26425 -16734 21094 19108 -11605 -9631 12471 10788 -3230 -10488 -3323 11723 11738 -4993
214 -4993 -16401 -5757 12890 5049 -12691 -4750 5841 -2383 -8518 -1237 5289 -1698 -2702 6629
228 6629 -3810 -13772 6642 20121 22 -17984 -739 19978 2344 -13291 5684 14457 -4102
241d102o885J4553M897j3502J739J2891j3812j3611J9432J4864j7928j8414J6732
254c146J9111j8423j5228K0029J3438j5819j3732J0684J5264p456r396N963K932
267D221l326k260J961N326j975p028N09L606J492l996l396Q189P29j3119k65J3828
283D496M323j4630p384J6484O217j7080j435J6792K017j5329l898J5935K983j3989
297d498L484R739p578p840P588R498r181j0299J1455O361j4623l997J4087N114
311I310j4202q264J3972O938j2574k821R663K362p590m323R769M861q046j890
325b835N035J040k712k612N747L754q407l673O058M361m048p202M575P421q231
340a729p083P590P778n872j0731N956J0858q007p387R165N906p584p322Q604R088
$$ plain form
241 -4102 -10987 3566 8463 -5039 -3300 9591 -4221 -17832 1600 16464 -1464 -19878 -3146
254 -3146 15965 -2458 -17686 2343 15781 -38 -13770 -3086 12178 4722 -4674 1289 4221
267 4221 895 -1365 596 5922 3947 -3081 -2572 1034 2526 -1470 -4866 3323 4052 -9067 -9332 4496
283 4496 8819 -5811 -13195 3289 9506 -7574 -9009 7783 9800 -5529 -9427 6508 9491 -4498
297 -4498 -1014 8725 1147 -6693 895 10393 1212 -9087 2368 8729 -5894 -9891 4196 9310
311 9310 -4892 -13156 816 7754 -4820 -7641 2022 4384 -3206 -7529 2240 7101 -945 -2835
325 -2835 2200 3240 528 -2084 3663 7417 -990 -4663 1395 5756 1708 -5494 -919 6502 -1729
340 -1729 -8812 -1222 6556 684 -10047 -4091 6767 -1240 -8627 538 6444 -1140 -8462 142 9230
355I230r942m859J0128J828q285k510R615L627j2200j997J0980p70r446J87Q884
370D470P91j1763j149J1643l03q445q19O332J640o608n05Q323j670n229J751M497
386B956j40n903K335Q428m546r051L760J0001r43j2002j369J3250j5j2431j239
401f909J0101M254j0715o126R741L953o880j364L984O88l943N50O924l412o777
416e931O419O443n296p819M932J1418n038j2524M652J0528k137r630m59R354q76
431D036r330K575O516l128n359K002O232m374p624P640P216o761p456M337J0256
446F778k558j0909M044Q958l080o047J842O022k558n581N409L357q667k018R347
461D339M187j1831q881J4116J0853j5013j2212J1300J4727q137j6827O372J6075
$$ plain form
355 9230 -712 -5571 4557 6385 -1900 -4410 5205 8832 -3368 -5365 5615 4845 -4601 -4414 4470
370 4470 5261 -6502 -7651 3992 3689 -4756 -5575 757 2397 -4211 -4716 3607 1937 -3292 -1541 2956
386 2956 2816 -3087 -752 7676 3130 -5921 -2161 7840 6897 -5105 -6474 6776 6761 -5670 -6909
401 -6909 3192 7446 -3269 -9395 346 4299 -2581 -3945 39 727 -3216 -2666 4258 846 -5931
416 -5931 488 6931 1635 -6184 -1252 10166 5128 -7396 -2744 7784 5647 -3983 -4442 4912 4036
431 4036 -5294 -2719 3797 669 -4690 -2688 3544 -830 -8454 -814 6402 -359 -7815 -3478 6778
446 6778 4220 -6689 -2645 6313 3233 -2814 -972 5050 2492 -3089 2320 5677 -2990 -5008 4339
461 4339 8526 -3305 -12186 1930 12783 -2230 -14442 -3142 11585 3448 -13379 -7007 9068
474I068l685j1987Q96Q403J238m934J127K093m984K727P321l444r805J644J3784
489I462M32j8268j912J7677M504j6076r333J4030J0860j2492r836R080P545n333
503C40o805M645N378n561j431P372j901o955K518R257o08j2497J207J4003j999
518F963j2371L77J1796N05j3218K87J3047l216j2340L813J2091m563j4525N020
532f334J6831o166j6770M940J6737j914j6153P3J6213K91j2355N4P980J310n501
547g64N85L973m938j569Q291J62j0280k735J1501O235j4205q827J3253J0153j0711
562A24j2355O998J4116m458j3252K913R813L43o579j144N036K4k510L524l01n301
578c009J665O922R69j0532k809J3097L008j4064l641J1602N496j1684o769J1844
$$ plain form
474 9068 5383 -6604 -5708 2695 3933 -1001 126 2219 -2765 -38 7283 3839 -5966 -4322 9462
489 9462 9894 -8374 -10286 7391 11895 -4181 -13514 516 11376 -1116 -10952 -1872 5673 340
503 340 -6465 -1820 3558 -2003 -3434 3938 2037 -4918 -2400 6857 6249 -6248 -5041 8962 6963
518 6963 -5408 -5031 6765 7270 -5948 -5661 7386 4170 -8170 -4357 7734 3171 -11354 -6334
532 -6334 10497 4331 -12439 -7499 9238 7324 -8829 -8756 7457 7748 -4607 -4553 3427 4737 -764
547 -764 -179 3794 -1144 -2713 5578 5740 -4540 -7275 4226 10461 -3744 -12571 682 10835 124
562 124 -12231 -5233 8883 4425 -8827 -5914 3899 4242 -2337 -3481 1555 1579 -931 2593 2292 -3009
578 -3009 -1344 5578 6547 -3985 -6794 6303 9311 -4753 -8394 3208 8704 -2980 -9749 2095
592B095M711j0976l275R224L239q795l173J0715J721j0609l29R435K183q236l525
607e595Q634L136o864j823L785K033k004k283J895p1k322K703J326m403k179L356
623f76M726l287p795L225Q236j060p783k474R089M795q792m422O590N213l380
638B205n194K042M043j362j221R08k037m04L126J912n031m770O269O130p309p202
654g895N649Q050l453r849K885R335j959p150P26N817J130n152l39M476p15j968
670d12O57J655k93k455N83L899k371l241J304L027p73m176j35N233q85m873K39
687c017L727R54m159j206N280k78m384J375L685m03l809J054M812j869m610L110
703B62L396j934l614J508M268k748m170L587K338k848k640J780L231l101l242
$$ plain form
592 2095 6806 -4170 -7445 1779 5018 -3777 -6950 3765 5486 -5123 -5452 3983 6166 -2070 -5595
607 -5595 3039 6175 -689 -2512 1273 3306 1302 -981 914 843 -1479 1224 2550 -1853 -4032 -676
623 -676 4050 763 -7032 -3807 4429 3369 -4414 -6888 2201 6996 -1796 -6218 372 5585 2205
638 2205 -2989 -947 3096 1734 513 1421 -616 -1020 2106 4018 -1013 -5783 486 6616 -693 -7895
654 -7895 -2246 5804 2351 -7498 -4613 4722 2763 -4387 -3661 2156 3286 -1866 -2205 2271 1556 -412
670 -412 245 1900 1607 -848 -265 3634 1263 -1978 -674 2353 1580 -2596 -2731 2502 1617 -3256 -3017
687 -3017 710 1664 -2495 -3701 1579 1301 -3083 -1708 1977 1574 -2235 -1181 3631 1762 -2848 262
703 262 3658 1724 -1890 -382 3886 1138 -3032 555 2893 45 -2595 -815 2416 -685 -3927
718c927L904J602l221j205K203K663l071k722M591J891l678j203K786L132l159
733E86l595M339L226m188k645K361L860k412n127L255M160l723l278J769L309
748A897j479m313K792L074l193j824K444K473k413k900M335K261m384q80L582
763A472J562k914k454M067J974m410o07L184L61k922j210L246P98m283L2L285
779A181n11k586q57L599N79m294K77L854L77k956j037L544J668m108l84L913j85
796B074k424l68K447J136m185J68M079j142l530P0L330M16m940q2N386j440l937
813b942L40L856P49m991l2N044n88l708P18L016Q42l790M75L788j152k823J611
830D13J554o97k288J210K781k782k394K465J802k225k533J485L307k381k926K256
$$ plain form
718 -3927 -23 1579 -1642 -2847 -644 2019 -1052 -3774 817 2708 -970 -2173 613 3745 586
733 586 -3009 1330 4556 368 -2277 84 3944 1532 -3595 -340 3820 97 -3181 -1412 1897
748 1897 418 -3895 -1103 1971 -1222 -3046 -602 1871 -542 -3442 893 3154 -1230 -2110 1472
763 1472 3034 120 -2334 1733 3707 -703 -1310 1874 2235 -687 -1897 1349 2147 -2136 -2104 1181
779 1181 670 -1916 -2773 826 1405 -2889 -2612 1242 1619 -1337 -2374 1170 2838 -1270 -1654 2259 2074
796 2074 -350 -718 1729 2865 -1320 -1152 2927 1785 -1745 -1675 1655 2071 -2869 -2951 2435 995 -2942
813 -2942 -2602 1254 2003 -2988 -3020 2024 1436 -2272 -1554 1462 2304 -1486 -1011 2777 1625 -1198 413
830 413 1967 1270 -1018 192 2973 191 -2203 262 2064 -161 -2694 -1209 2098 -283 -3209 -953
846i53K435j349k523R41L260j053k856K035J777p64j902N20L316k188k505K649
862H40J983k104k420J538L284k775l762L173K717k699k563J764L107k582l075
877c574L305K019l023j201K829J928l301j839M603J327m364n16L165J891l140
892A09k145L607J363l130o13J018J275j382j095J124M82j973L47J237k35j247
908a258j089L196O61l571k45L239J506l025k300L950K216l815j517L323J516k531
924B56k039L179J696m381m01M182m92m053r5M178K34n796Q44N112r29m326o9M421
942A521K22m524J318L655k125j986K133K188k028k724L258L124l920k652L034
957D94K862k051m094J468M326j336l538k20K751J194l022j303K497N21j439J62
$$ plain form
846 -953 1482 133 -2390 -1449 1811 758 -2098 -63 1714 950 -952 -432 2884 696 -1809 840
862 840 2823 719 -1701 -163 3121 346 -3416 -243 2474 -225 -2788 -1024 2083 -499 -3574
877 -3574 -269 1750 -1273 -2474 355 2283 -1018 -2857 1746 3073 -1291 -1807 1358 3249 109
892 109 -2036 1571 2934 -196 -809 209 1484 102 -993 131 613 -1360 -1013 224 -11 -1258
908 -1258 -2347 849 1510 -2061 -2306 933 2439 -586 -2886 1064 3280 -535 -2052 1271 2787 256
924 256 -1783 1396 3092 -1289 -1690 2492 2000 -2053 -2148 2030 2264 -3532 -2688 2424 1495 -2831 -2900 1521
942 1521 1743 -2781 -1463 2192 67 -1919 214 2402 374 -2350 908 4032 112 -2540 494
957 494 3356 1305 -2789 -1321 3005 1669 -1869 -2089 662 1856 -1166 -2469 28 549 -890 -728
973g28Q48j35j772J625K711l098k698L961L286l099m981L631N822m061n567L958
989b97M541k971m597K330M593l641l258L921J359l642j075L639J286n357k70N718
1005B279n09m901O08M637L82m050k55M246p41k825R10J908j97k178J62K858j421
1022I13k235J170J552l54k085j078K841Q53k776j334K263K007k157k724K790K057
1038A703k261j060K036Q39j953n30L700o67m118J698M452k024n054J800N594j657
1054B498o426K316N066k232m151J029M128j876l286K408J862k496n22K440M07
1069A165k780j73L536k93l082P20K495k26j525p51K057l7r27j5j5L05L75p20p96
1088f87Q46Q6l44j299J368Q12k104l50K690n01k110P2K661M4l131R35L359j578
$$ plain form
973 -728 120 -15 -1787 -162 2549 -549 -3247 714 4000 901 -4080 -449 5373 1312 -4255 -297
989 -297 4244 1273 -3324 -994 3599 -42 -3300 621 1980 -1662 -2737 902 2188 -3169 -3439 2279
1005 2279 1770 -3131 -2523 2114 2496 -1554 -1809 2437 1696 -1129 -219 1689 1492 -686 -524 2334 913
1022 913 -1322 -152 1400 1046 -1039 -2117 724 1577 -1199 -2533 -270 1737 -420 -3144 -354 1703
1038 1703 -558 -1618 418 1257 -696 -1226 2474 1807 -2311 -613 3839 1815 -3239 -1439 4155 2498
1054 2498 -3928 -1612 3454 1222 -2929 -1900 2228 352 -2934 -526 1336 -1160 -1682 758 1165
1069 1165 -1615 -1788 1748 1455 -1627 -907 1588 1362 -163 -914 1143 1106 179 164 149 454 829 109 -687
1088 -687 159 245 -99 -1398 -30 782 -1322 -1672 1018 517 -1593 -1521 1140 1184 -1947 -1012 2347 769
1106G69k212J650K060j650k353K664J958l519p89L138M14l362p57L309N30l540
1122a690k11K728j74j967k79J757J1j453Q30O49q31L56P35r38M45O55n9j96l14
1141E4Q66l61j097J600J06j499Q5J404J50k604k06L235j230l110J753K299j237
1158B08k468J215L116k199k490K754J944k845r05K613J150k931q30L816l87k766
1174a005P16K173m26k631Q64K022j172k116J502P20p23j148O13J284r48j015J147
1191a43k14O4Q2o95O13O95l21n27K90R35K57j955J035K001k085q66J413J343j652
1210B70k214K701J454l121j207K658R56k685j045L068M53l422O72K809j055k312
1226b020R15K829j094k718K163K174k257j099J614J466j644j535J903R17k182
$$ plain form
1106 769 -1443 207 2267 617 -1736 928 2886 -633 -1422 1716 2130 -1232 -1989 1320 1850 -1690
1122 -1690 -1901 827 653 -1314 -1593 164 175 -1278 -448 201 -630 -274 461 -477 -32 623 564 368 54
1141 54 920 559 -538 1062 1168 -331 -246 1158 1308 -1296 -1502 1733 503 -2607 -854 1445 208
1158 208 -2260 -1045 2071 -128 -2618 136 2080 -765 -1670 943 2093 -838 -1668 2148 1761 -1005
1174 -1005 -289 1884 1458 -1173 -309 1713 541 -1575 -73 647 -76 -1224 -611 673 -275 -1290 -143
1191 -143 -357 -293 -211 -906 -293 402 81 -446 -156 779 1036 -919 116 2117 32 -834 579 1922 270
1210 270 -1944 757 2211 -910 -2117 541 1497 -1188 -2233 835 1288 -2134 -1462 1347 292 -2020
1226 -2020 -1105 1724 630 -2088 75 2249 -8 -1107 507 1973 329 -1206 697 1614 -568
1241e68K05J109O6q37p01Q72N48j470J41L38N5J49o97J80O69J09q45O6J073K95
1261G57j492l32K542m04j725L80J541Lk339N43K545j320k438J430J591j096k299
1278b113J722K290k452j832K611O10j610j048J946R88k340j26K282J30j836J95
1294e83J794J0j807N35J576r07r81L78P02j9r68J05P94n17m42r4p8P53m75p14
1314i38O38M97o56l63M08J263r35j122J423Q60j162k76R56R24j328j424K503J3
1332A281j991m0J680J85j956k28K135r0k432P56J422n92j473J73J965o32j857
1349a694J126J224p64q32J035P17p62q50J078R70r83l91M84N38m51r26Q75K86
1367F80n53k33O6M30K8j279O47P05q17m42P0R36n0j508N20J530m89r74J54J318
$$ plain form
1241 -568 -363 746 812 -25 -726 146 694 -776 -635 -297 -242 -93 -790 -610 59 168 -677 -611 462 757
1261 757 -735 -1067 1475 1071 -654 -274 1267 1270 -1069 -526 2019 699 -1739 -309 1282 186 -2113
1278 -2113 -391 1899 -553 -2385 226 836 -774 -1822 124 1112 -1228 -1354 928 1058 -778 -583
1294 -583 1211 1221 -586 -51 1525 618 -363 15 717 698 -270 -165 629 112 -330 -424 -502 251 -224 -938
1314 -938 -300 197 -459 -822 -414 849 -86 -1208 215 1075 -87 -363 593 1517 189 -1235 1268 1281
1332 1281 -710 -750 930 1115 -841 -1069 1066 976 -1456 -700 722 130 -1343 -1170 795 163 -1694
1349 -1694 -568 656 -108 -940 95 812 50 -800 278 1248 265 -126 358 896 445 -481 394 680
1367 680 127 -106 -40 390 418 -861 -214 491 -326 -768 -698 238 188 -1320 -800 730 241 -733 -579 739
1387G39J7j615R83J278j093p38O93Q61n07j412J033J071j512o02J281L36j295
1404d82p65J262Q95j497q26J691J54q17p83R02J078j293q5R56L5o12M3P93N83
1423A232j171m00J435l65p43l34O59O77j569j08J058nq73j19P11J95j056j89J567
1442F02o23o56K4P76M16j408L58J371l91j010L87O82L79j072k94J604m38j075
1460c68M43M23K7r56j5Q04m82q42Q91M95n49j074O21J119o07r20P71J012o99q16
1480g22L38J351o72j047J095N32l90p73N63O91q14p29J048J43r73pP9P92q52p23
1500a070R69K52n58k74K90O76n54o03R93L30q42K86L35K50j54m63P60Q0p21N9
1520D1M41L06l57r75Q84K46q79n7Q9K41rr85Q21M30r55L44L69j26j39l45Q10K69
$$ plain form
1387 739 756 -859 124 1402 309 -429 264 1125 618 -794 239 1310 -202 -804 477 813 -482
1404 -482 -1247 15 910 -587 -1413 278 432 -385 -1168 -266 812 -481 -566 390 425 -187 -144 649 1232
1423 1232 61 -339 1096 731 -12 -346 313 990 -579 -687 371 366 -507 -626 85 280 -776 -965 602
1442 602 -21 -677 -653 123 539 -869 -511 860 469 -541 -154 528 907 -165 -459 1145 707 -368
1460 -368 75 498 525 -431 -446 358 -124 -966 -75 420 -129 -1203 -582 537 -70 -990 -219 793 94 -722
1480 -722 -384 967 295 -752 343 875 485 -288 275 966 152 -577 471 614 -359 -366 -287 505 -347 -1070
1500 -1070 -101 151 -407 -681 -391 285 -269 -872 121 451 -391 -105 230 480 326 -137 623 703 -18 41
1520 41 482 788 431 -544 340 586 -293 -350 -261 -20 -29 -1014 -193 237 -718 -374 -5 -131 -270 -615 195 464
1542D64q25j8R54n9o53j19N81O21j238J80N21J86m99l18L35N8n92L17J89k52J10
1563e7l84L4M56n41J43L79n8k46J43k03O27j96n66P14J05j30j85K93O26q32k66
1584a44N33J39o17l21O70L92r82j99N59po03J17L70K56o70l31J202k45p04K14
1604c71P51J90j060K94Q59l63l72M30K10r2m27o3P22k56p31K12K90P0o09l5N93
1625B42k82p16N75O8J00o81l21J327j74n95pO04M45o13n06J264j21j113M52P44
1645F92o4o04l68J207m53j015O15P33p51p20L29Q41m80j072Q77L23n81j95K82
1664d04R12o52m98P54L81o71J9K07K67J94o20P00J18p04J55L76j81m1o79N84O3
1685B80m38l36K30L76j74n54L84M90n42n21P12K98m69n88Q76Q71j046j03M05P49
$$ plain form
1542 464 -361 -379 575 516 -137 -256 325 946 -292 -112 409 595 96 -222 113 171 -421 -104 85 -167 -57
1563 -57 -441 -407 49 -492 -349 30 -28 -274 -131 -334 293 97 -469 245 350 220 35 328 954 122 -144
1584 -144 389 528 -89 -410 260 652 -330 -529 30 23 -580 -463 -93 163 -507 -838 364 119 -585 -371
1604 -371 380 570 -490 -196 663 300 -72 358 568 476 49 -14 708 452 -279 -67 223 293 -316 -351 242
1625 242 -40 -756 -181 -113 -13 -694 -1015 312 138 -457 -464 140 585 -28 -534 730 609 -504 -52 692
1645 692 628 24 -344 863 410 -605 10 743 -8 -728 -399 442 -38 -1110 -233 90 -491 -686 -404
1664 -404 508 -144 -642 112 493 -178 -159 48 315 509 -111 589 707 3 158 534 353 312 -367 217 280
1685 280 -158 -494 -264 112 -62 -616 -232 258 -284 -805 -93 205 -264 -852 24 895 -151 -254 151 900
1705I00o63o72P98P10r13m29R51l8p77k81M74O29j200l9P07j14m80l25R08M0p96
1726f10J0J117n73l36L61L25J96o81Q9J136p34k12j33L94J43o29N5O03k02m64
1746a45N4M03j81k77m02P21k64m99j35N41L27p70J35O84L79q42J32N18K11o21
1766c1lP53k88n67R7R27l41q34K73N93l56p71P41pj11m50m0O98o56l42N43K12
1788D0q6n31L41P36n58k63P09P1l31j02m1P82m94l31M84O7m79o2J92L37o11k11
1810c41M91M9m16J12j26L43l23m23N84L00o05j46K24M42l30k04O16o5l77L85J05
1831B95J79k05m05O79Np84N8M11J18p37j52P97K35r02PL11J20j50k56J66K57l67
1853c20L1K21J05k39J34M25K53q76L86M01j87m2j61J97q9j0l81N78m58j78J32
$$ plain form
1705 900 237 -435 363 1073 160 -269 682 644 -133 -414 60 689 -511 -550 157 43 -437 -762 146 186 -610
1726 -610 -600 517 -56 -392 -31 294 490 -191 -102 1034 300 88 -45 349 492 -137 -82 521 319 -145
1746 -145 -91 312 131 -146 -548 173 -91 -590 -725 -184 143 -627 -492 192 571 -271 -139 379 590 -31
1766 -31 -34 719 431 -136 -39 888 547 -287 -14 579 223 -548 193 186 75 -375 -415 283 -373 -715 -172 40
1788 40 -46 -577 -236 500 -58 -321 388 459 128 26 -15 767 273 -58 426 493 14 -48 144 481 -130 -341
1810 -341 150 199 -217 -105 -231 112 -211 -634 -50 250 -355 -501 -277 165 -165 -369 247 182 -195 190 295
1831 295 474 269 -136 543 548 -236 -178 233 351 -386 -538 259 494 -408 -401 -90 30 -120 -376 -210 47 -320
1853 -320 -289 -68 37 -202 -68 357 610 -266 120 521 334 292 131 328 239 229 -152 426 -32 -210 -78
1874g8j65N12o43n5O76m79n5j56L10J85n67K16O25j09l76L33J72J63o92J19P35
1895F71n10k68L50J49L2o29K64K89l09k86J44q5J86l12m4M57k27m14P01k34j73
1916b48j56P7P30l92l7O7J26J50l03R4M27l35n3K01j04n5p6o2J56j09m95M10j
1939A2l18k04J10N06k74n34O84J90o17L71j86O49k90k71M14L6j46j04J15L05k59
1960A89k62K19M84q43J61r3P8J46o19N35J40n82K41K18P3j11n21M86J61l61K19
1981d2j26L68k88j4L80J20l47J39J33j16N0m19O21r7m29j74J36k2J30m06L21J34
2003E2l46JL99j84l3j16K77l1l31K69J64J83k54j66M85K15o38l4M64j02j39j30
2025EJ64J44o35L5L70j20l29J58K22l8n74M82L60m54j05J62K43J61m52L26L29
$$ plain form
1874 -78 -243 269 -374 -429 247 -232 -287 -443 -133 52 -515 -299 326 217 -159 174 346 509 -183 -64 671
1895 671 161 -107 243 392 424 -205 59 348 39 -247 -103 -188 -2 -314 -358 99 -128 -542 159 -75 -248
1916 -248 -404 -327 403 11 -26 41 167 317 14 108 535 200 147 348 244 189 113 51 207 98 -397 13 12
1939 12 -306 -510 -400 106 -168 -702 -18 172 -445 -74 -260 389 99 -172 242 278 132 28 143 448 189
1960 189 -73 146 630 -213 -52 -145 -67 79 -540 -5 135 -447 -206 12 85 -26 -547 -61 100 -261 -42
1981 -42 -168 200 -88 -102 278 398 51 190 323 207 257 -162 459 362 -67 -241 -105 -127 3 -403 -82 52
2003 52 -294 -293 106 -78 -111 -227 50 19 -312 -43 121 304 50 -116 369 584 -54 -88 376 274 135 5
2025 5 169 313 -322 -287 83 -37 -366 -208 14 -24 -598 -116 244 -210 -315 -153 90 251 -201 125 454
2046D54l66j73M58p8l4k30R9K14j2l63J59K3R0k65k17L11n8l39J60K29r7k68o6
2069c69O03k79k36J49L94j53l33m7P23l73m02M16N10l15m66l6Q13m75o62O83K63
2090D08o74j04L78L82n64m43P64l43l28M8L63K85o94n0Q42k83J03j87K83R4l19
2111c9j6K53j95L3J63p2J94J58k56k47Q4j81K3j89J97L6m31K49J19k38R8N8K44
2134D5j5m73N32J31n29M5N91J61o42qP87J15j022K45N49k47m82J21K50K22n91
2155b15j65N64l04j45M9R7j55m04L97M51o02J60L27O8k17k25K88N0K06o9L1n0
2177A37K93k32j58M41j75j29l07L8L87n29k24P36n2n50P4J31M01r10M54M95j45
2198A76n47L23L98l35n35N30P38n46m04P66j87n21j54M68L07n91ML57j68j43j65
$$ plain form
2046 454 88 -85 373 295 261 31 130 344 332 -31 128 151 241 -24 -241 70 12 -327 -167 62 -35 -303 -369
2069 -369 234 -45 -281 -132 262 109 -224 -271 452 79 -323 93 603 288 -178 -214 599 124 -538 145 408
2090 408 -266 -370 8 390 -174 -617 147 -196 -524 -476 -113 172 -522 -572 270 -13 90 -97 186 280 -39
2111 -39 -55 198 3 36 199 127 321 479 223 -24 60 -121 -98 -287 -90 -54 -485 -236 -117 -355 -257 -199 45
2134 45 30 -443 89 220 -309 -264 327 488 -154 -162 625 740 -282 -37 512 265 -217 -96 154 376 -215
2155 -215 -380 184 -120 -265 -216 -119 -274 -678 -281 170 -432 -272 55 123 -94 -319 -31 19 225 156 187 137
2177 137 430 198 40 481 306 177 -130 -92 295 -234 -458 278 226 -324 -250 -119 282 -628 -174 321 176
2198 176 -371 -48 350 15 -520 10 748 202 -202 564 377 -144 -298 170 477 -114 -110 247 79 -64 -229
2219b29R0K83n57J04L63m31K92Lp4k6L3l7L30k89M5N7J01K63k97j0K36p8L26m33
2243F5m3K85k19l13M71o3j49n68M23L50o52l20Q56N2l70J3J81K19m82rO20q9l66
2266a08M5K40K25m75P5N70n80k07J71L60j20l61M20o7ql98L38k40j20J76p3R7
2288d0Q4l63J65J51k1J16l49J76L65l27R0PK49J1l82J51M70o68K13J16J24n22
2310a84m5O62m61k89L51J19k35l83J57L38m2m02L70K06l22k19M16J73j24j29K12
2331A69K41n89K93M5Q3j50P6M2j96j06J82k14R7j01j03J60J02j69l49K16J58O7
2353d6k35l15P71J06m74LM73J97n79J57M04l22k72J47L32l18n0O1M50m71m35M44
2375B8K14n77P3J73M61o76m4L79J72m25j28M89j52k01j53N69J21j71L6l04K82
$$ plain form
2219 -229 -139 144 -413 -309 54 -377 -85 -82 -156 -182 -149 -186 144 -145 -100 -43 58 321 24 14 250 172 498 65
2243 65 22 307 88 -225 246 183 34 -534 -111 239 -413 -733 123 175 -195 -182 -1 218 -264 -273 347 258 -108
2266 -108 -63 177 402 -73 2 572 -8 -215 -44 316 196 -165 255 188 180 -218 120 -120 -240 -64 -137 -40
2288 -40 44 -319 -154 -3 -24 92 -257 -81 284 -43 47 54 303 314 -68 83 553 -115 98 214 338 -184
2310 -184 -229 433 -28 -317 34 153 -82 -465 -308 30 -12 -414 -44 162 -160 -379 37 210 86 -43 169
2331 169 410 -179 114 159 242 92 168 210 14 -92 90 -124 -27 -128 -231 -71 31 -138 -487 -271 -113 -46
2353 -46 -281 -596 175 281 -193 -190 283 480 -99 58 462 140 -132 15 347 29 -21 40 490 19 -416 28
2375 28 242 -335 -262 -89 372 -304 -348 31 203 -222 -350 139 -13 -214 -367 202 323 152 188 -116 166
2396A66j67K40J47k07j85J42j55J37J26k92l2j41J22l04J04L75j31k92L24J03
2416H0l81M2L66R5n2n16M74J94l92J17p7N83o13M6L27o5l54Q0J63j91O9j40K95
2439A50k81k97L11K46l26l0q6K08J20k13J46K04j37o0j33L21N3q1j7KQ5j59Q9
2462A15K50o7m95J13N1J01j09l87N14l14k88K57M36m42P0J12L43l06m01M39K39
2483B31k52q2J61M45j69l60L50J82n54J6L07q5m6m82N72l9m41J70L4J32r5l84
2505c89K69K07l73J56K45j67J33k82K74J88l03j74M93p7r6k93P07k10j45M5j94
2526A4K29k02m9J49J16l46k98O81l87J61j64J69k8k56j11L59j51k98N75j19pl64
2548c27J95L39j1l60K36M0l5k08L30j60m9j15Q6j64K56k48K83Lk91jo1L55L0k96
$$ plain form
2396 166 -1 239 386 179 -6 136 -19 118 244 -48 -80 -221 -99 -403 -299 76 -55 -347 -23 80
2416 80 -301 -259 107 202 150 -366 108 302 -90 27 -50 533 -80 -34 293 228 -126 -46 117 -74 -5 -145 150
2439 150 -131 -428 -117 129 -197 -227 -313 -105 15 -198 -52 152 15 -45 -178 143 196 115 98 100 185 26 115
2462 115 365 298 -197 -84 -33 68 -41 -428 86 -228 -516 -259 177 -265 -195 -83 260 -46 -447 -8 231
2483 231 -21 -103 58 503 334 -26 324 506 -48 -32 275 190 144 -338 234 195 -246 -76 -42 90 -5 -389
2505 -389 -120 87 -286 -130 115 -52 81 -201 73 261 -42 -216 277 200 104 -189 518 308 163 208 14
2526 14 243 41 -8 141 257 -89 -387 294 -93 68 -96 73 45 -211 -322 37 -114 -412 163 44 37 -327
2548 -327 -132 207 196 -164 72 112 77 -131 199 39 -10 -125 -39 -203 53 -195 88 91 -200 -201 -262 93 123 -173
2572a73K42P0j89k44K67Q9k5j68K77J18p6k54L91q8l39K23M5j32q2n44N40NK0
2595b7k5j03J3r8j81L74J24m09K57j73M58Q0l84J15L21j65j33j39L79j88j49J14
2617F1K96m12K4J2J7J19m37L88o3j09N9k49J94J70k86K42M5l09K04O9P8j14n5
2640e6j38N25l35J39L77n02K55l69K57L6l37J93J21l63M01k98J75kl27K06J38
2661I6k72M3j65RK55Q4q9n1p0J00q7L01M5l42k1M10k6q0Jj48N00m85j91L73n8
2686A32l75j80L02R8j70lJ99j72K17l61K74J73j84Q1J40j71j07M50k02J60k03
2707I8m5Q8n3q3o4L0L5P9J29l65K34p0Mo9q4j5j15K17L4l90K36j45M43j77k85
2732c33K09L45l92J03K03J25j64l63M09J72m02m4L87l3j70j94L25k89j17K00L70
$$ plain form
2572 -173 69 139 -50 -294 -27 62 37 -131 146 264 188 -66 325 237 -102 121 166 34 -48 -592 -52 -47 -27
2595 -27 -52 -155 -142 -240 -421 -47 77 -332 -75 -248 210 290 -94 21 342 177 44 -95 284 96 -53 61
2617 61 357 -55 -31 -19 -2 117 -320 68 5 -104 -45 -294 -100 70 -216 26 71 -238 -34 35 113 -1 -56
2640 -56 -194 331 -4 135 512 10 265 -104 153 189 -148 45 166 -197 204 -94 81 79 -248 -42 96
2661 96 -176 -133 -298 -289 -34 50 -39 -90 -160 -60 -147 154 199 -143 -164 246 220 140 141 -7 493 8 -183 190 132
2686 132 -243 -423 -121 -23 -193 -196 3 -169 48 -313 -39 134 -50 31 171 0 -107 343 141 301 98
2707 98 53 141 88 5 -59 -29 6 85 214 -151 83 13 17 -52 -136 -151 -266 -49 -15 -405 -169 -314 129 -48 -333
2732 -333 -124 221 -171 -68 135 260 96 -267 142 314 -88 -132 255 222 52 -142 183 -106 -223 -23 347
2753C47n34Oq3L61k91n3M7J66K2n6Q5P9N2j89M25j69j13j35P4r9K67k20K59j40
2777A08j49j39J38P6j22K08n6J85k28J1j50J00n5j51OJ02j22l5k1M23j83k31L20
2800C5L10k56k22O47j63m08r5K47Q1j28m13N97j69N5l54K16J67m76K85l2o0j31
2822b67J65L98k72k62N9J44l3LJ83j16L12l17k2K10r6N7mm2Q6k90J44O0q5k18
2846b03j38K87J24p9m3J28K20m15k38L53Kj19k1K31J6j13J28o0Q6l14J93K83l86
2869g8P0K35j90L1k61J63R0l66M7L06q6Jo9L54j2m77P6K43J97j82k10J55J41l5
2893A43k64K66J85q8k17K85k53K20k42Q5J55j82k08j1L40k31l43L87j56R3q4K08
2915H8J01k97M6K9L07m24RNN2q5Q1L21p3l01J86J32j07kO3M1P9k00m8K86m66J70
$$ plain form
2753 347 -187 -181 -264 97 -194 -247 -200 -34 -12 -68 17 96 148 -41 384 215 102 -33 41 -58 209 -11 248 108
2777 108 -41 -180 -42 34 -88 120 64 249 21 32 -118 -18 -73 -224 -218 -116 -238 -273 -294 129 -54 -285 35
2800 35 345 89 -133 514 351 -57 -152 95 176 48 -365 232 63 118 -236 -20 147 -329 -44 -76 -136 -267
2822 -267 -102 296 24 -238 -179 -35 -68 -65 118 2 314 -3 -25 185 89 146 142 100 186 -104 40 100 15 -203
2846 -203 -341 -54 70 -9 -52 76 296 -119 -357 -4 -2 -121 -142 89 105 -8 120 60 146 -168 25 308 -78
2869 -78 -8 227 37 68 -193 -30 60 -306 -259 47 -39 -38 -107 247 235 -242 -166 77 274 92 -118 37 178 143
2893 143 -121 145 330 242 25 310 57 277 35 120 275 93 -115 -126 214 -17 -360 27 -129 -36 -120 88
2915 88 189 -108 -62 -33 274 -150 -141 -136 -84 -169 -88 233 160 -141 45 177 70 68 131 172 251 51 3 289 -177 -7
2941gk08L27n0l02J6L32j86l3K7Q7j5o6K75k31O2M8p0J72k21Q6L0J42n2k44j34
2966b15L88N2l93R5M42n36NJ90K2J13m55K33J02j21r2J13R1k3j64J69L22j54l11
2989a27L18K92m66j1L10l0l24J57j02J43k54j98J82K52j6j21k1k11J52k31L52
3010D6j34J3n9K21k12K33k33J27K02l73pL62J26Q5m99LJ92l33J55J29l3k2k47
3033b58K15m3m33K89L51l9j59K21k99K00k62l8J68K86l89J26J13j31o5L05J8j10
3055F6n2J14k38L53m47P7L44j56k03K03K0k63J75k59L38j04l62L75R6l05L9l3
3077b22L69M5m12L20q7M9O8n4j8JQ3K21l40M3O0j68K94l93LJ82M8l49K04l0k01
3102b84KK51J13Q8j00L10l25J32j17l6k71L45J5n4j57J91K31m04P5K08k42j17
$$ plain form
2941 -7 -215 112 62 -240 -224 108 -78 -111 -84 3 -12 -78 197 -34 28 76 6 178 -43 43 73 215 163 -81 -215
2966 -215 173 225 -168 -73 369 -167 -162 28 50 163 -292 -59 43 -78 -170 -57 34 11 -153 16 338 184 -127
2989 -127 191 483 17 6 316 286 -38 119 17 160 -94 -292 -110 142 126 5 -16 -227 -75 -306 46
3010 46 -88 -75 -134 87 -125 108 -125 2 204 -169 -176 186 312 397 -102 -99 93 -240 -85 44 11 -11 -258
3033 -258 -43 -86 -519 -230 121 82 -77 144 -155 45 -217 -255 -87 199 -190 -64 49 -82 -147 158 176 66
3055 66 14 128 -110 243 -204 -127 217 61 -142 61 81 -182 -7 -266 72 -32 -394 -19 77 -228 -189 -222
3077 -222 147 192 -220 100 13 62 130 76 58 59 142 363 23 66 126 -42 252 -141 -138 44 92 -257 -53 -83 -284
3102 -284 -282 -31 82 170 70 380 55 187 70 34 -237 108 123 69 -88 103 334 -70 5 213 -29 -146
3124a46L36j11Q9m22K76k5k36P5j5K83j34k23J76J12nj74L43l15P1J04j90L15
3146A84l39J91J18q0q2M88l97O9J23n1l24J08j3R3j10J78j17k81Q6P5O1o9p9J80
3170A2r5j0K77j74j44K70QJ5o5k36K99%k7j35j28L36l84K98m1j37J07k04L48j35
3194E5p5r9K34l08j47J96L47l42J29q6P1jj62L99J8p3L9k23J26J13k01K66k54
3217B2j12L77m44J70Oj11J7r1K18q8oJ15j19J82j70J16m8p9P7J42R6l62L62l47
3241g7K77j04Km8k25R1j13L08o2j45J16M0r2j01K1J85k17j1J58q2J22k53j1J75
3265d6JJ05Q1p1q0Kp5J90j77J18j56L21q7k28j06p0J77NJ50k75M26k91J68m3j24
3290h5k07J71q8L27j88o2J29j20J40j3J72k83L2N1J03j59K19M5j52p3J49j37K4
$$ plain form
3124 -146 190 79 168 -254 22 -3 -239 -164 -179 104 -30 -253 -77 35 30 -144 199 -116 -45 59 -131 184
3146 184 -155 36 154 74 -8 480 83 152 275 224 -100 8 -5 88 -22 156 39 -242 -156 -81 -20 -89 -168 12
3170 12 -83 -93 184 10 -134 136 144 159 94 -142 157 157 130 -5 -133 203 -181 117 76 -61 46 -158 190 55
3194 55 -20 -119 115 -193 -340 -144 203 -139 -10 -96 -25 -26 -188 211 229 156 195 -28 98 211 10 276 22
3217 22 -90 287 -157 13 19 -92 -75 -166 52 -36 -42 73 -46 136 -34 82 34 -45 32 174 270 -92 270 -77
3241 -77 200 96 98 50 -175 -84 -197 111 49 -96 20 60 -32 -133 -112 73 -144 -155 3 -79 43 -210 -221 -46
3265 -46 -45 60 141 70 -10 -8 -83 107 -70 48 -108 213 126 -102 -208 -278 -101 -96 54 -221 205 -86 82 39 -85
3290 -85 -292 -121 -209 118 -70 -132 -3 -123 17 4 176 -107 -75 -24 79 -80 139 184 32 -41 108 -29 -5
3313ej19J0M04r7k20j3K1O2j3l43J08K07L5k3j25KQ6nM3N5r3M6j57L31Mjl54O1
3341i3K98j69J01l87L2J35K75k48l8oM9pK4r4J29L16o10L7L56k40pK9L47j49j69
3366h9J95K4j11o7q3M8K07m28M37l1j1j22N5j02N5q1j5K4J34k06J26J91l67Q6
3390a31J75r0K8J48j99K19J40l88J76k3j83Q6k18L51M3l6m6K0M4q7P5j60j09q7
3414b52J06J06l59L47J16K39l77l2J65n7r1J36L4l25J45kK02m3r8Qq9J11o5L26
3438B51l66P6J27R3Pl94K01Q2k81L64k19l9L27k38l5J2j6J51J09o4j60K35J0j96
3462C7J44k13%N0M3k5M8p7n7K9p5oJ90l35J05O7j38J23j4J31K5J7j41J68mj25
3488c3l2J30o5k07L56q6K12l28L31k35M1k61L64l27r3K6J31j67K57O4l05K50k31
$$ plain form
3313 -5 -124 -114 290 193 -27 -40 -19 43 30 -313 -205 2 37 14 -111 -109 -23 -28 15 70 -23 23 -134 197 201 200 -154 -93
3341 -93 205 36 137 -250 -218 -83 192 -56 -94 -100 -51 -58 -34 -128 1 317 -293 -256 100 -140 -147 -118 229 80 -89
3366 -89 106 130 19 -48 -131 -83 124 -304 133 102 91 -31 24 -78 -23 -104 -119 -95 39 -167 -41 150 -217 -131
3390 -131 44 -46 -18 130 -69 150 290 -98 78 55 -128 -42 -260 91 134 98 52 72 116 29 104 -56 -165 -252
3414 -252 -146 -40 -399 -52 64 303 -74 -106 59 2 -89 47 81 -244 -99 -101 101 58 -40 -32 -121 -10 -75 251
3438 251 -115 -39 88 181 188 -206 -5 77 -204 160 -59 -98 229 -9 -44 -32 -48 103 212 148 -12 223 233 37
3462 37 181 -32 -32 18 61 36 84 7 -50 -21 -96 -102 88 -247 -142 -75 -213 -90 -104 27 52 69 -72 96 92 -33
3488 -33 -65 65 0 -207 149 63 275 -53 278 43 84 -177 187 -140 -233 -207 -76 -243 14 78 -227 23 -208
3511b08k7J66J46J08j82L19l28K1k36L51j75J34n6k20K34O1j28jJ22j05J46j5
3533A27j24k05J43j33K02j0mq9p1J63k36K0J40K3J79o6J60k06r5J20o4J18j84
3556i2p7K73K5m1K3kJ00l0j54K03k89JJ66K7k19J47M3q3j7k64M03J3j85J73R6
3581B40K1j35k31L59j08Q8n5l73j4L64j80j44K00m3J35k24Q5J96k01r5J44l00
3603b71L24l4J13j58k6M6J95j89J47o6j97q3K64j58K32j2l9j26O4j3K32l81R1
3626d5j12J99J03l5j84j94M75j22K0j14q9M6k5j67R2L22q0k39J05J11j49r2L71
3649A97j26r8J7J41j98K43j91j53M78k09q5j06n5m4J31j66L09q6L5j37J9L8R3
3672D7N9k36M22j73k89L95q1k32L06q0o6j70Q5N5J64n5q0m2o1J07J15r6m4L5k76
$$ plain form
3511 -208 -235 -69 77 185 3 322 -6 15 -221 130 -45 89 33 -187 47 108 -20 -21 101 -4 142 127
3533 127 3 -202 -59 -192 10 0 -4 -93 -164 -1 -237 -217 -77 -54 125 59 219 13 -82 38 -26 92 -92
3556 -92 -169 104 129 88 111 109 209 179 25 228 -61 -60 106 133 -86 61 104 21 4 -260 143 156 -29 144 240
3581 240 261 126 -105 254 146 234 179 -194 -208 156 -24 -168 32 -11 124 -100 -15 181 -20 -115 29 -271
3603 -271 53 19 132 -26 -52 -6 189 0 147 81 -116 -199 65 -93 139 127 88 -38 26 13 245 -136 -45
3626 -45 -157 42 145 110 -74 -268 207 85 105 -9 -98 -52 -77 -244 -152 170 90 -149 -44 67 -82 -174 197
3649 197 71 -27 -10 131 -67 176 -15 -168 310 101 16 -90 -145 -189 -58 -224 85 -1 34 -103 -84 -46 47
3672 47 106 -130 292 119 -170 225 144 -88 218 138 72 -98 -13 42 206 151 71 29 -32 75 190 94 50 85 -191
3697a91P1J12p1n3J12K65m10R2J73L7j79j0J75r6J51j15j90J34J19k53K47k00
3719h0J51J4o5o4j24K47k10L34j16l07K73k56J91J6K29k78k7J00K9nj92J75j56
3742a21j19L96j59K4r5M7P5j13kj24K50k8j61j13J90J22k67K91j20l2L6J14j11
3765b0k6J40o9m4q3j26K34j0k9J95r4J03k05j21K06l1J1k8q0K16J42l55K46l00
3789a28K49l24O9K98k41m7j2K10j24j24N16l50j11Q3jj11j0M1K87k84J54l8K06
3812B08k17N0j31K88l21K15P5l86K30R1O4j39j01Q8OJ55j33q5K62k63O5P0Pj9
3836G9j55K84N9k96R4l65M78l7j72k0L55l50J79j08n8J16j7o1N9l15J53l5L8Q7
3860hrk6J63j08n3K41k83L63l34P0p9O5Lk75L65Rk5q8K53p9Jp2K1j79M3K5k89
$$ plain form
3697 -191 -120 -8 -79 -132 -20 245 -165 -73 100 137 -42 -52 123 27 178 63 -127 7 126 -127 120 -80
3719 -80 71 85 20 -44 -168 79 -131 203 87 -220 53 -203 -12 4 233 -45 -72 28 57 52 -140 35 -121
3742 -121 -240 156 -3 21 -74 -27 48 -65 -67 -191 59 31 -130 -243 -53 69 -198 93 -27 -59 -23 91 -20
3765 -20 -46 94 25 -19 -102 -228 6 -4 -33 162 68 171 -34 -155 51 20 31 3 -77 139 281 -74 172 -128
3789 -128 121 -203 -134 164 -77 -124 -136 74 -50 -174 342 -8 -119 -36 -37 -148 -158 -117 170 -114 40 2 208
3812 208 -9 41 -90 198 -123 92 167 -219 11 102 166 27 -74 14 20 175 42 -43 219 -44 21 91 98 79
3836 79 -76 208 267 -29 65 -300 178 141 -31 -51 304 -46 133 25 -33 83 66 5 64 -251 -98 -133 -95 -8
3860 -8 -17 -43 120 12 -41 200 -83 280 -54 16 -63 2 5 -270 95 104 79 -9 244 165 166 94 115 -64 -21 4 -285
3887b85M96l09J62QPm8L8J23l1R9q3j00n9J66m26M14j9j4j63N0J25j37J21k28
3911i3L40k38oJ17j78L00k38J18j32j54K85k19j64J95j07K03j59K15n3J37l1m2
3933I6k17K17j38O5j8J1j34K27K24m36K58Mk72q0J71j31j2M8J92j15M6j5J75O
3957A72Lj34K1Q2J19l23J4Pn1K90l85J70J7q5J23J10o1o9KJ3j94L4R2O%J16j84
3984i5M7j25n2J47Kk19N04p7k64K30m1K15j14j62o7O4k0M9J23l05K88k5K47j53
4008A97l57L58r1k06L04k39P9k80K11lR8j50J63j80K14lj47j13O7m2K80O7j15
4031A12l68K38k00J51k8J88o3k28J94k63L65J57k17k05rL05K7k37JK09q4j88K42
4054I9Q1q8j1m0J26k16K96l14J02L31k96l8k3j91L24M4l8j64k08J65J92n5j37
$$ plain form
3887 -285 211 -98 64 72 79 31 69 192 161 260 177 77 18 184 -242 172 153 139 -24 26 151 14 135 -93
3911 -93 247 9 3 120 -58 242 4 122 -10 -164 121 -98 -262 -67 -174 29 -130 85 32 169 138 96
3933 96 -121 96 -42 23 5 16 -118 109 333 -103 155 159 -113 -193 -22 -153 -165 -117 75 -40 6 -9 166 172
3957 172 175 41 62 144 263 -60 -46 -39 -90 200 -185 -15 2 -83 40 150 89 20 22 35 -159 -125 -33 -27 -27 89 -95
3984 -95 -48 -173 -225 -78 -76 -295 209 132 -132 98 57 272 158 -4 -71 -7 -27 22 145 -160 128 103 350 197
4008 197 -160 198 107 -99 205 -34 45 -235 -24 -27 71 -79 84 -96 118 115 -32 -145 -78 -120 160 227 112
4031 112 -256 -18 -218 -67 -95 93 30 -198 -4 -267 98 255 38 -167 -176 129 156 -81 -80 129 45 -143 99
4054 99 180 92 81 41 167 -49 247 -67 35 366 70 32 9 -182 142 186 148 -16 -224 -59 133 78 -59
4077e9j60K13N1%q9j19j01L40j47j05m4J31K10L2j55q4J24k1M5LK0Q2k29p4K72
4102A36l87J39K48p9j56J3J98j75J69k07K27j92L15l57K08k2j3J18l74J51j7n7
4124a14K69N4k63J57j49j4j56K99l1N7n31M42l18P2K88k16K86j97l2K90q6k49
4146a42K08k41J82J2J62k15qp2K70LN0k05k14L98j38n0r0k83N91j54j74O5J06
4169F1J02j33q4j79M68l05J7J60q3L3k87J79N8r1J72j43K37l73J37L5j53J56J1
4192ej20l7K36p5n6J53o3R3k86j17N69m85l4K96q9l9lK29j86l3p6l3L03j78J72
4217A36j78J02J47l48J15q0P0K08l47L08j33K34k87K2n4j23L98l92L91k79O9n5
4239g6K20p1k14J86j33K19J5J03k7m09K50j8j51K7J97N0k21J08j55J61j63l4Q7
$$ plain form
4077 -59 -219 -6 45 45 -44 -163 -264 76 -71 -176 -220 -89 121 153 -2 -86 38 17 62 65 85 167 -62 -136 136
4102 136 -251 -112 136 57 -99 -86 112 -63 106 -101 126 -66 249 -108 100 78 65 183 -191 -40 -57 -114
4124 -114 155 209 -54 103 -46 -60 -216 83 52 109 -422 20 -298 -226 62 -154 132 -65 -97 193 107 -142
4146 -142 66 -175 7 19 181 -34 -42 -114 156 159 209 4 -210 188 50 0 -90 -373 218 64 -110 -45 61
4169 61 163 30 -54 -233 235 -70 -53 107 24 57 -230 -51 7 -84 88 -55 182 -191 -54 -19 -172 -16 -5
4192 -5 -125 -162 74 -1 -57 96 33 126 -160 -277 292 -193 -227 69 -20 -59 -62 167 -19 -52 -128 -161 142 -36 136
4217 136 -42 60 207 -141 -26 -106 -36 172 -175 133 0 234 -53 -31 -85 -208 190 -202 189 -90 -21 -76
4239 -76 144 73 -141 45 -88 131 146 249 222 -187 63 45 -106 -79 118 168 -53 55 -100 61 -102 -136 -49
4262d9J53pp9J2M2L7q6j22M9j09L36j60j34K85k61kL80l00P5K9n9N5k29L5K15
4287A06l6J08m47M07j67O1J34k54q3m1J62J69j06j90J74j25R0K6M2J02o8k2l0
4310A2NJ14nj52n4j22M03k94J36P8M9mm44J96K93k72L51l53pK4j7R0K6j79p8N
4336a99N5J06K31n34K45P7m5o3j7N16m03n4L0j24m2J03p9P1Q8j49j2j00K87Nr
4361a6j09L9l5J26J89j28j64K5J87K3k24O6k0m1Q6P6pj2P6k41L95m26J74j61J70
4386D8pj60j19N5m7K49j62K59j98k24K71R0Qq1J36l8j29Q7J60l58J23K85k80R3
4410F1Kj87J86j03l5J7N7R7j5r9k23L33N6j02O5j22J28m9n7J1k54J62K50j84k8
4435c3K60l70lm2K49q9l99J95J92J49l10J76P9N5j13N8k8j18M9J97o9r0K3K15
$$ plain form
4262 -49 104 97 18 30 72 109 23 -99 -50 -159 177 17 -117 168 -93 -95 285 -15 60 89 30 85 -144 -109 106
4287 106 70 178 -269 138 -29 32 166 -88 -171 -212 -50 119 13 -177 -3 -128 -38 -12 30 132 64 42 12
4310 12 17 131 126 -26 -80 -202 201 -93 43 121 170 166 -278 -82 211 -61 290 -63 -70 -46 -63 27 53 -126 -204 -199
4336 -199 -144 -38 193 -341 -96 -19 -64 -127 -144 372 -31 -85 -55 -179 -221 -118 -197 -126 -38 -187 -199 -299 -12 -7 -16
4361 -16 -125 -86 -121 5 194 66 -98 -73 114 137 -87 -21 -41 -82 4 80 73 61 137 -104 291 -135 39 -122 48
4386 48 41 -119 -238 -183 -230 19 -143 116 -82 -306 -35 55 63 -18 118 80 -49 38 198 -160 -37 248 -32 61
4410 61 63 -124 62 -41 -76 -59 -2 95 80 -19 -242 91 147 45 110 -12 116 67 10 21 -233 -71 179 -5 -33
4435 -33 227 -143 -146 -188 61 -28 -427 -232 -40 109 -201 -25 54 109 -4 54 26 -92 -43 154 85 -5 18 233
4459B33j94J7J35k50Q7j58K46r2j73J99o8J22k59K95J10l21J28K5k8k8j55o8J09
4482h8J7J33k54N4l7J31j20kL39j66N3k85L57l9j25o8J00R4j28lj25k6K89k69
4506a68N0n1K0L7O4L8P5q1j56o5K80k20K39n2j64K4L19p6j7j21O0N4o1l1l30K30
4532a03K03n7r6J10j2J36k62J69k74J03J96l38J91J60k05K7J09k44R0N4K6K2j68
4555a63M8R6p8j4J05p5o5K29j31O9j17n7R0m5J70P4m60K78K1Q5k8N7m3j32M4j65
4581b07J35J01J16j74l4J34q0k28L39p2P6o0k82K2M64k08k06O0J46j61j04L62
4603A39lj88J95k69L1J22j75J19k6J28p3K15j07k20K4M4M22l42J24r4j0j4M1K
4627H5j0K45m0m1j79l5O9j46P6j11n0K56n2k9k80L51l5pJ40l02J22L9J48k20q0
$$ plain form
4459 233 39 56 191 -59 28 -130 116 24 -149 50 -18 104 -155 140 250 -71 57 82 54 26 -129 -197 -88
4482 -88 -71 62 -192 -138 -175 -44 -164 -166 173 7 60 -225 132 93 -32 -100 0 94 -34 -37 -162 -188 101 -168
4506 -168 -118 -169 -149 -112 -48 -10 65 -16 -172 -237 43 -177 62 10 -154 -130 189 113 96 -25 35 89 28 -3 -333 -103
4532 -103 100 43 -53 57 45 181 -81 88 -186 -83 113 -225 -34 126 -79 -52 57 -187 -97 -43 -17 5 -163
4555 -163 -115 -19 -97 -111 -6 -81 -146 83 -48 21 -96 -153 -63 -108 62 136 -324 -46 -25 60 32 89 46 -86 -42 -207
4581 -207 -72 29 145 -29 -63 71 -9 -237 102 30 106 46 -236 -214 250 42 -164 -104 42 -119 -223 139
4603 139 136 -52 143 -126 -95 27 -148 -29 -55 73 0 215 108 -112 -88 -44 378 36 160 66 56 42 83 85
4627 85 75 320 280 239 60 25 94 -52 24 -87 -137 119 67 38 -242 109 74 67 207 -95 27 66 214 -6 -86
4652h6J72L3m01M53m86K28K05J79k60OJ9jJ27k08J11o3j82K8J81j08J28k43K45
4675G7k70K35k05K51j98L5O1Q3k46K38m6p5k76K78j09L99k81J44l44N3J27R8j14
4698h5q0J16Q5P5j62K14j09r9J35k97J67J08J04k70j58K10P6j64J68j0Q3j0k13
4721a16K26k22J39l15K32q0J09k2N8J02j48p6J37j52J02k29k15N92O9j08p5R1
4743I9l4j22P4p8j31K30j41J01j35K23L3M4j20l6j68J07N9L26k91q2K60k33n4
4766f9j48L04l03K12J31p1n8J12Lk07J35M6l34L21k78K13p1J27K0j27N9j78R4
4789f7J07q0N3K10k69Q6lj1p6nj29L83k66m5n1O1J4n1K04o8J7J39k73K82k56K29
4815A35P6j76m7J27L2j31P5j70j31P1Q8p2J75J90l52K00l4o5Rr6L22k78J73J27
$$ plain form
4652 -86 86 119 -282 171 -315 -87 118 297 37 43 62 61 188 -20 91 28 -154 -126 55 -53 75 -168 77
4675 77 -193 42 -163 88 -110 -75 -14 69 -177 61 15 -60 -336 -58 -167 232 -49 95 -249 -196 -69 29 -85
4698 -85 -165 -49 36 111 -51 163 54 -45 90 -207 -40 68 172 -98 -256 -46 30 -134 34 24 107 97 -116
4721 -116 110 -112 27 -288 -56 -136 -27 -49 9 111 -37 -113 24 -128 -26 -255 -470 122 191 83 8 99
4743 99 65 -57 17 -61 -192 38 -103 -2 -137 86 119 163 43 7 -161 -54 5 331 40 -42 218 -15 -69
4766 -69 -217 87 -216 -4 127 56 -2 110 113 -94 41 87 -247 74 -204 9 -62 65 85 -42 17 -161 -67
4789 -67 40 -40 13 223 -46 40 37 26 -50 -55 -184 199 -67 -112 -163 -102 -88 -139 65 -3 14 153 -120 162 -94 135
4815 135 211 35 -12 115 147 16 91 -79 -210 -139 -51 -123 52 242 -110 90 56 -9 0 -96 226 -52 121 248
4839B48m49J10K47k34j6n4K15J24j46l3J45r6mN4o3q5L32n06K36q3Rm2J05k87
4863b73R6K0J54j86J25K64j10M0k86J65R7o3O8k0Q5n0l87M55j01j3jq9J06k3j65
4888i2N2J48k82K54j65K59M9k76K68k02j15J58J4j65J98n6k40K39j83K36q3n6
4910d0K12o3k98J50Q5k69K65NK57l67K27j73l4j21L37k04KN7M8k9O8j69L7l5J07
4935E5J06j75J07K5k22J0R6k4k4j00r4K73j85j79L12j45K22j27K02m94J2N02l76
4958b23K21k20N3J30nJ66j18O5n9j26K79j16K42k40O9j16j75K16J02k23j44K41
4980A9j27K59k03J36j54J83j29p9O2J94o5J83l89L20k57K28o5L1j40mK0q2j29
5003a88N1K10j01J41M2R1m12L7K26j24J68q8j65K4L27n78M03j45J25m6R9k69J92
$$ plain form
4839 248 -201 -91 156 -78 -94 -148 67 191 45 12 157 61 57 111 48 -37 295 -211 25 -58 -49 -91 14 -273
4863 -273 -177 -157 -3 -189 -64 200 90 130 -156 9 106 43 111 91 176 126 -261 194 93 80 79 -10 96 73 -92
4888 -92 -40 108 -174 80 -85 174 223 -53 215 13 -102 56 70 -95 103 47 -193 46 -137 99 16 -40
4910 -40 172 109 -189 -39 46 -223 42 47 304 -63 164 -9 -43 -164 173 -31 -29 28 76 47 115 -54 -17 -52 55
4935 55 161 -14 93 118 -104 -94 2 -22 -46 -146 -240 33 -152 -331 -19 -164 58 -69 133 -361 -349 153 -223
4958 -223 -2 -222 -169 -39 -44 122 4 69 10 -116 163 47 289 49 118 2 -173 43 145 -78 -222 19
4980 19 -108 151 -52 84 -70 113 -16 -95 -33 161 96 279 -110 210 -47 181 116 147 7 3 23 -59 -188
5003 -188 -137 73 -28 113 155 246 -166 -129 97 -27 141 53 -112 -88 239 -339 64 -81 44 -2 97 -172 20
5026B0J32k55R8n7J86j39o9J31M1rN0QM2Q1k21j73k7R2L6J28K57l61J19No3o5
5052a3J76o9k36J26J20j20J23j27n9L06l26Q4M2J4M44n46n0K77k23K21k85K17
5074I6m5k7J0L0j28KK94k81J87j78j18L20k61K49j80o3K97k76J28j19k73M67j76
5097d5L8R4l16J91L11l36n9J58j26l4J10o7K97p3k19j20J33L58l69J99l5j51J28
5120F7n3Mj11L72m09L96k47k1k3K40lq3k71K43k4j26K4j9j20k3L37k54K33O0j29
5145F0m3q1j66J63JJ59j74J8q4K39J9n4o3K3Q3l24K37o8O7J35J13l13l8J06J68
5170A83p9k28J9L72m37K20M6j27K52j74k0K11l20k4K3k49N91K3j84k15n5r1N0
5193b13M6J43L5J01j09l20J31K85k67J61k16J13j78J62L55n71L48L3M6j58L33
$$ plain form
5026 20 152 -103 -5 -62 124 -15 -84 47 88 79 129 137 179 260 39 -134 -161 -69 -33 95 352 -9 110 115 52 -13
5052 -13 163 94 -142 -16 104 -16 107 -20 -79 227 -99 -15 27 41 485 -61 -111 166 -57 164 -121 96
5074 96 51 24 34 64 -64 -62 232 -49 138 -40 -158 162 -99 150 -30 -93 204 -72 56 -63 -336 131 -45
5097 -45 -7 87 -229 -38 273 -63 -122 36 -90 -124 -14 -81 216 143 -76 -196 -63 295 -74 125 90 -61 67
5120 67 14 18 -93 279 -130 266 19 -2 -25 215 212 129 -142 101 77 -49 -25 -44 -164 -187 150 -104 129 189 60
5145 60 17 -64 -230 -67 -66 93 -81 -63 -147 92 111 57 -6 17 100 -224 13 -55 12 147 260 -53 -91 15 183
5170 183 104 -124 -105 267 -170 50 96 -31 221 47 27 238 -82 -106 -83 -332 259 282 98 -117 -172 -263 -213
5193 -213 -167 -24 11 112 3 -317 -186 99 -168 -7 -223 -110 -288 -126 229 -342 6 39 85 -73 260
5214B60k80N3j33p0K70j10j70m4L29p9k12K18qK0o6K0p4J87q1K37l29j13M18k51
5238hk39M73k66qJ41k57Q7J53K27m04K08j83K17j74M3P3j40J22ll0o8Q1L1j65
5262h9J86q4L15k64J14k70J42j56O6r5J30j59q2J55l2K51j89J25j68p7L86j44
5284F1j29J01j14J66j54L37q9j49lo7k79L12L7R3r5K30j69j25j8K28j65N3K5p1
5308A6J27m34M53j24M4k06J17l2K30l77K23J26k33k53J71K6J85j65j1J04R1K7
5330A05j06N2r3J4J33N9n1j15KJ86l10L34j42j97Q6N8j12L56l89J09J1p7J02j9
5354dj34M7O7k9M4k42M0P3l8J31R1J22r1l09Q5K15m0J27p7l3j75m0K05N4j56J73
5380A06j97K06J00k76k0K4OP8j49J61K8r3r5K29k9P7k06J35j50n3P1j39J59m5
$$ plain form
5214 260 -20 33 -100 -170 100 -10 -180 -224 105 26 -186 32 24 44 -22 -2 -76 111 30 267 -62 -175 243 -8
5238 -8 -247 226 -40 -48 93 -164 -77 76 303 -101 107 -76 141 -33 10 83 -57 65 62 32 -36 45 76 -89
5262 -89 97 13 328 64 178 -92 50 -106 -40 -135 -5 -164 -246 -91 -123 128 -61 64 -104 -181 205 61
5284 61 -68 33 -81 85 -69 268 179 30 27 -40 -319 -7 30 123 28 258 89 -36 -54 174 9 62 87 16
5308 16 143 -291 162 38 82 -124 -7 -39 191 -186 37 163 -70 -323 -152 -126 59 -106 -117 -13 78 105
5330 105 -1 51 -42 -28 105 164 113 -2 0 186 -124 210 68 -129 -43 15 -97 259 -130 -21 -10 -87 15 -4
5354 -4 -138 -91 -24 -53 -9 -251 -211 -138 -176 -45 46 168 77 -232 -147 68 28 155 78 45 -130 -170 35 89 -67 106
5380 106 -91 115 215 -61 -81 -57 -51 27 -122 39 67 -26 -121 108 79 156 -50 85 -65 -118 -47 -186 -27 -72
5404g2K30J6k40q5j7J25j12J80j99M6K43j21q2J6L9r2K08k19J09O0j36J86j54
5427g1LK02J4j94l1L27j19j62o0Q3J76j11k0j0j97J38J30j14J97k23j32J24K49
5450A99j48Q1m03J82j41L05j56K77O5j56Q6k79N4P7J1j17o3q3K89j53mK10l4m8
5474E1k2k22L42k67J26K82l76Q6Rj7j50J30j99M8R8K9M5m8J08M7j60J18K93m12
5498f1K73l85k1J94q5N83m42k0j2p3R4J44l31L21j71l6N0l1Q8N9r9k9j34J42J58
5523A76k82m0Q8K15J53n6k41k20K28J36l58M46J16k46L18k96m40K72L29k10r8
5544a0J41m6r0J60k28N7O0j16l1k0J56m9J5q7N7K90k79K9k14L64o2n9J71j49j76
5569a16j27M31l34L80m94J58J98m0n4j4j71P6J35j75k2J51l9j05K20j76K03k2
$$ plain form
5404 -72 158 174 -66 -151 -168 -43 -155 25 -174 -128 115 -6 -88 -72 -33 -125 83 -136 -27 33 -103 83 -71
5427 -71 -68 134 148 -46 -77 250 131 -31 -91 -8 168 57 37 27 -170 -32 98 -16 181 -42 -174 -50 199
5450 199 51 132 -271 -89 -230 75 -81 196 261 105 191 -88 -34 43 54 -63 -126 -209 80 -73 -77 133 99 51
5474 51 29 -193 149 -118 8 290 -86 0 9 -8 -158 -28 -227 -179 -81 -52 -7 -55 53 100 -60 58 351 -61
5498 -61 212 -173 -194 0 -85 498 56 36 24 -49 45 189 -142 179 8 -28 22 -9 79 138 39 10 -124 18 176
5523 176 -106 -146 -58 157 310 254 13 -207 21 157 -201 245 361 115 433 137 -303 -31 298 88 -10
5544 -10 131 85 -5 155 -73 -16 44 -72 -103 -123 33 -16 -1 -88 -31 259 -20 9 -205 159 97 38 209 60 -116
5569 -116 -243 188 -146 234 -260 -102 96 56 2 -12 -183 -107 28 -147 -169 -18 -57 -162 58 -118 85 63
5591F3ml6j8K0J2J04k62J22j42K70N3k24o7O2m5J6j00n2J30K48l07J73j10L7R4
5616C7o2o7q2J39J09J5J6p9N7j63J20J26k78K05KJ21l59K35P8k31J14J9P3j6j77
5641d8M0N0k21J62r0MJ38n3j39J81Q6n3l92L85k63K85j2J29m03L23n0Q4J1j85
5665c1p4J66n1j16K10j86nmj9P8K16k46K47Kl30N0n9J22j84l2K13J29o7N3J49
5690B31j85j19L9j80K96j71J93l5q7M2j25L9l7j50J21K70l66K37o2M2n5L32l45
5713g5K5J62R4K1l10K23j40J56j51k2k8J03Km6q7K27J29k51N7j08j49j43M43K31
5737C63n41L3QJ70j5O0j61l6O6O1J2j56j81L93Q0o9j81K6M1O8j56J37N8M5O4l64
5763a75m0J98OQl5K83k93r7M31j49j09l09Q4K90qj92J21j62j7K01J25j85O8j70
$$ plain form
5591 63 59 23 5 25 37 141 -121 1 -141 129 182 -42 -109 -47 -92 -76 -176 -228 -98 150 -157 16 -94 -57 37
5616 37 -25 -92 -174 -35 74 89 105 26 83 -80 40 166 -112 93 95 216 -143 92 170 -61 53 72 145 129 -48
5641 -48 -8 42 -179 -17 -107 -103 35 -18 -157 24 110 57 -335 50 -213 72 60 189 -214 109 59 143 154 -31
5665 -31 -105 61 10 -106 104 -82 -87 -91 -110 -32 184 -62 185 187 -143 -93 -152 -30 -214 -246 -33 96 29 82 231
5690 231 46 -73 -34 -214 82 -89 104 69 -18 24 -101 -62 -99 -249 -128 142 -224 13 -49 -7 -62 270 -75
5713 -75 -50 112 206 227 -83 140 0 156 5 -17 -45 58 60 14 -73 154 283 32 89 -19 -168 -311 132 363
5737 363 -178 -145 -137 33 18 78 -83 -119 -53 8 20 -136 -317 76 156 87 -94 -68 -27 41 -115 22 80 125 189 -175
5763 -175 -215 -17 -11 -3 -38 245 -48 -145 286 137 28 -281 -197 93 85 -107 14 -148 -165 36 161 -24 44 -126
5787a26K40k79L55j03J39j49Ok73K82J83l47J56J46j87k95J66J43j14K6J03j56
5808h4K07l63L38n5l9P1O6k5k5j62J48r3M1J06j86K2k4pJ93j15L6K0k24J00m7
5833a01kr7K24k76K20o6J26O1j21K7k7J19J17j91J72k14J29J75j81j07j77K83
5855I3J03J0q2k02K33P7k83J78p6N1j74J43P6k31N5k35L84j52O2o8P5k19R5n1
5879a38r6K70j89J90p1J48j29j85L45j66J11r9J33m15K93m2Mq5kJ73j5k37O2N4
5903h6Q6m8J45r4l0J54m8j52N6P8n5Q3l4O5j08j62J86j29j9K47j01L02l47J75
5927A64j05J08j83k71N13k30j00Q9p8o1J49J06k15J43R8m4k3K54m10K6j53L28
$$ plain form
5787 -126 114 -165 190 87 226 77 83 -190 92 275 -72 84 230 43 -252 -86 57 -57 -31 72 -84
5808 -84 123 -240 98 43 4 75 141 116 91 -71 77 -16 25 131 -55 -33 -57 -64 129 14 50 70 -154 -54 -101
5833 -101 -103 -200 24 -252 -32 -98 28 89 -32 -5 -32 87 204 13 185 -29 100 275 94 -13 -190 93
5855 93 196 206 124 -78 155 232 -51 127 51 102 -72 71 147 -84 -29 -264 120 -32 30 -38 37 -182 -87 -138
5879 -138 -234 36 -153 37 -34 114 -15 -200 145 -21 90 -9 124 -291 2 -40 -36 -121 -123 50 35 -202 -140 -86
5903 -86 0 -48 97 3 -27 127 79 -73 -17 61 6 89 55 120 12 -150 36 -93 -112 135 34 336 -11 164
5927 164 59 167 -16 -287 226 -4 -104 -15 -93 -154 -5 101 -114 29 127 83 60 314 -96 -70 -223 105
$$ [...]
8191A90
##END NTUPLES=NMR FID
##END=
