##TITLE=1H_Pr 35_14
 CD3OD
 8 sc, 
 2.4.2024
##JCAMPDX= 6.0         $$ Bruker NMR JCAMP-DX V2.0
##DATA TYPE= NMR FID
##DATA CLASS= NTUPLES
##ORIGIN= UXNMR, Bruker Analytische Messtechnik GmbH
##OWNER= root
$$ XWIN-NMR		Version 3.5
$$ Tue Apr  2 13:48:45 2024 Russian Standard Time (UT+4h)  she@DPX200
##.OBSERVE FREQUENCY= 200.1311
##.OBSERVE NUCLEUS= ^1H
##.DELAY= (6, 6)
##.ACQUISITION MODE= SIMULTANEOUS
##.ACQUISITION SCHEME= undefined
##.AVERAGES= 8
##.DIGITISER RES= 18
##SPECTROMETER/DATA SYSTEM= spect
##.PULSE SEQUENCE= zg30
##.SOLVENT NAME= MeOD
##.SHIFT REFERENCE= (INTERNAL, MeOD, 0, 15.7039)
##AUDIT TRAIL= $$ (NUMBER, WHEN, WHO, WHERE, WHAT)
$$ ##TITLE= Audit trail, XWIN-NMR		Version 3.5
$$ ##JCAMPDX= 5.01
$$ ##ORIGIN= Bruker BioSpin GmbH
$$ ##OWNER= she
$$ F:/spectra/data/she/nmr/H-F/1/audita.txt
$$ ##AUDIT TRAIL=  $$ (NUMBER, WHEN, WHO, WHERE, WHAT)
(   1,<2024-04-02 13:47:26.26 +0400>,<she>,<DPX200>,
      <created by zg, POWCHK disabled, PULCHK disabled
       configuration hash MD5:
       00 E9 B6 7A A2 85 ED C7 34 08 36 98 17 FE 4E 26
       data hash MD5: 16K
       68 A5 D0 61 CD EC 5F 14 81 13 96 E1 23 B7 89 23>)
$$ ##END=
$$ 
$$ hash MD5
$$ 2D DB 48 B8 D9 0C 54 01 1A 71 37 13 70 EC 76 F6
##$RELAX= 
##$RELAX= 
##$RELAX= 
##$RELAX= 
##$RELAX= 
##$RELAX= 
$$ Bruker specific parameters
$$ --------------------------
##$DU= <F:/spectra>
##$EXPNO= 1
##$NAME= <H-F>
##$PROCNO= 1
##$TYPE= <nmr>
##$USER= <she>
##$AMP= (0..31)
100 100 100 100 100 100 100 100 100 100 100 100 100 100 100 100 100 100 
100 100 100 100 100 100 100 100 100 100 100 100 100 100 
##$AQSEQ= 0
##$AQ_mod= 1
##$AUNM= <au_zg>
##$AUTOPOS= <>
##$BF1= 200.13
##$BF2= 200.13
##$BF3= 200.13
##$BF4= 200.13
##$BF5= 200.13
##$BF6= 200.13
##$BF7= 200.13
##$BF8= 200.13
##$BYTORDA= 1
##$CFDGTYP= 0
##$CFRGTYP= 5
##$CHEMSTR= <none>
##$CNST= (0..31)
1 1 145 1 1 1 1 1 1 1 1 1 1 1 1 1 1 1 1 1 1 1 1 1 1 1 1 1 1 1 1 1 
##$CPDPRG= <>
##$CPDPRG1= <>
##$CPDPRG2= <>
##$CPDPRG3= <>
##$CPDPRG4= <mlev>
##$CPDPRG5= <mlev>
##$CPDPRG6= <mlev>
##$CPDPRG7= <mlev>
##$CPDPRG8= <mlev>
##$CPDPRGB= <>
##$CPDPRGT= <>
##$D= (0..31)
0 1.2 0 0 0 0 0 0 0 0.06 0 0.03 0 0 0 0 0.0002 0 0 0 0 0 0 0 0 0 0 0 0 
0 0 0 
##$DATE= 1712051245
##$DBL= (0..7)
120 120 120 120 120 120 120 120 
##$DBP= (0..7)
150 150 150 150 150 150 150 150 
##$DBP07= 0
##$DBPNAM0= <>
##$DBPNAM1= <>
##$DBPNAM2= <>
##$DBPNAM3= <>
##$DBPNAM4= <>
##$DBPNAM5= <>
##$DBPNAM6= <>
##$DBPNAM7= <>
##$DBPOAL= (0..7)
0.5 0.5 0.5 0.5 0.5 0.5 0.5 0.5 
##$DBPOFFS= (0..7)
0 0 0 0 0 0 0 0 
##$DE= 6
##$DECBNUC= <off>
##$DECIM= 32
##$DECNUC= <off>
##$DECSTAT= 4
##$DIGMOD= 1
##$DIGTYP= 9
##$DL= (0..7)
0 120 120 120 120 120 120 120 
##$DP= (0..7)
150 150 150 150 150 150 150 150 
##$DP07= 0
##$DPNAME0= <>
##$DPNAME1= <>
##$DPNAME2= <>
##$DPNAME3= <>
##$DPNAME4= <>
##$DPNAME5= <>
##$DPNAME6= <>
##$DPNAME7= <>
##$DPOAL= (0..7)
0.5 0.5 0.5 0.5 0.5 0.5 0.5 0.5 
##$DPOFFS= (0..7)
0 0 0 0 0 0 0 0 
##$DQDMODE= 0
##$DR= 18
##$DS= 0
##$DSLIST= <SSSSSSSSSSSSSSS>
$$ [...]
##$SUBNAM2= <"">
##$SUBNAM3= <"">
##$SUBNAM4= <"">
##$SUBNAM5= <"">
##$SUBNAM6= <"">
##$SUBNAM7= <"">
##$SUBNAM8= <"">
##$SUBNAM9= <"">
##$SW= 18.051750892319
##$SWIBOX= (0..15)
0 0 2 0 0 0 0 0 0 0 0 0 0 0 0 0 
##$SW_h= 3612.71676300578
##$TD= 16384
##$TD0= 1
##$TE= 0
##$TE2= 300
##$TE3= 300
##$TEG= 300
##$TL= (0..7)
0 120 120 120 120 120 120 120 
##$TP= (0..7)
150 150 150 150 150 150 150 150 
##$TP07= 0
##$TPNAME0= <>
##$TPNAME1= <>
##$TPNAME2= <>
##$TPNAME3= <>
##$TPNAME4= <>
##$TPNAME5= <>
##$TPNAME6= <>
##$TPNAME7= <>
##$TPOAL= (0..7)
0.5 0.5 0.5 0.5 0.5 0.5 0.5 0.5 
##$TPOFFS= (0..7)
0 0 0 0 0 0 0 0 
##$TUNHIN= 0
##$TUNHOUT= 0
##$TUNXOUT= 0
##$USERA1= <user>
##$USERA2= <user>
##$USERA3= <user>
##$USERA4= <user>
##$USERA5= <user>
##$V9= 5
##$VALIST= <valist>
##$VCLIST= <CCCCCCCCCCCCCCC>
##$VD= 0
##$VDLIST= <DDDDDDDDDDDDDDD>
##$VPLIST= <PPPPPPPPPPPPPPP>
##$VTLIST= <TTTTTTTTTTTTTTT>
##$WBST= 1024
##$WBSW= 4
##$XGAIN= (0..3)
0 0 0 0 
##$XL= 0
##$YL= 0
##$YMAX_a= 135264
##$YMIN_a= -197605
##$ZGOPTNS= <>
##$ZL1= 120
##$ZL2= 120
##$ZL3= 120
##$ZL4= 120
##$ABSF1= 10
##$ABSF2= 0
##$ABSG= 5
##$ABSL= 3
##$ALPHA= 0
##$AQORDER= 0
##$ASSFAC= 0
##$ASSFACI= 0
##$ASSFACX= 0
##$ASSWID= 0
##$AUNMP= <proc_1d>
##$AZFE= 0.1
##$AZFW= 0.1
##$BCFW= 1
##$BC_mod= 2
##$BYTORDP= 1
##$COROFFS= 0
##$CY= 11.3945322036743
##$DATMOD= 1
##$DC= 2
##$DFILT= <>
##$DTYPP= 0
##$F1P= 15.7292609196834
##$F2P= 12.9074282941183
##$FCOR= 0.5
##$FTSIZE= 0
##$FT_mod= 4
##$GAMMA= 1
##$GB= 0.15
##$INTBC= 1
##$INTSCL= 1
##$ISEN= 128
##$LB= 0.24
##$LEV0= 0
##$LPBIN= 0
##$MAXI= 10000
##$MC2= 0
##$MEAN= 0
##$ME_mod= 0
##$MI= 1.114404
##$NCOEF= 0
##$NC_proc= 0
##$NLEV= 6
##$NOISF1= 3.799351
##$NOISF2= 2.8
##$NSP= 1
##$NTH_PI= 0
##$NZP= 0
##$OFFSET= 15.70392
##$PC= 1
##$PHC0= -25302.71
##$PHC1= 12.38731
##$PH_mod= 1
##$PKNL= yes
##$PPARMOD= 0
##$PSCAL= 0
##$PSIGN= 0
##$REVERSE= no
##$SF= 200.130013532006
##$SI= 16384
##$SIGF1= 3
##$SIGF2= 2
##$SINO= 400
##$SIOLD= 16384
##$SREGLST= <1H.CDCl3>
##$SSB= 0
##$STSI= 0
##$STSR= 0
##$SW_p= 3612.71676300578
##$SYMM= 0
##$S_DEV= 0
##$TDeff= 0
##$TDoff= 0
##$TI= <>
##$TILT= no
##$TM1= 0
##$TM2= 0
##$TOPLEV= 0
##$USERP1= <user>
##$USERP2= <user>
##$USERP3= <user>
##$USERP4= <user>
##$USERP5= <user>
##$WDW= 1
##$XDIM= 8192
##$YMAX_p= 0
##$YMIN_p= 0
$$ End of Bruker specific parameters
$$ ---------------------------------
##NTUPLES= NMR FID
##VAR_NAME=  TIME,          FID/REAL,        FID/IMAG
##SYMBOL=    X,             R,               I
##VAR_TYPE=  INDEPENDENT,   DEPENDENT,       DEPENDENT
##VAR_FORM=  AFFN,          ASDF,            ASDF
##VAR_DIM=   8192,          8192,            8192
##UNITS=     SECONDS,       ARBITRARY UNITS, ARBITRARY UNITS
##FACTOR=    0.0002768,     1,               1
##FIRST=     0,             0,               0
##LAST=      2.2672688,     0,               0
##MIN=       0,             -197605,         0
##MAX=       2.2672688,     135264,          0
$$ Real data points
##PAGE= N=1
##DATA TABLE= (X++(R..R)), XYDATA
$$ [...]
1865F32K26l8k86r75m51L36N15Q72J60q30o13n82M13Q03P56K06q95m67m46Q5R99
1886D20K91ln76q60k64O73P51K87K02j126k77m39N80P08L87J17p78n91l2J90K19
1907a21Q70P4o90p31l11N67O41N55O2r27o12q4L51O02O37n3p42o03l38N52O12
1928C11K93l1p60k33n73R28K85N84j38o44o87j35L33Q50M52k33m48p58j74M49
1948c29R83J16j75p89l10l60O51N29L63k43l21j041R6L23R07L39n87k51m46j6
1968e61K26Q48J87j98o74m79QK54P73L19m02n24n41J98K95O13J5J12n10o96J87
1989e50M76M91K61l67n75l49k29N65M00P33n55m85q68L98O57O01j50r0o80j44
2009d60j21M31M27O28l01q31m06q3O56J88O73l78o87n85Q1P13L88J50J61q61m99
$$ y = [632, 858, 820, 534, -441, -892, -556, -41, 831, 991, 161, -452, -1034, -621, 182, 938, 1144, 249, -218, -664, -579, 420, 711, 708, 132, -728, -992, -319, 432, 719, 921, -205, -482, -921, -341, 367, 754, 871, 93, -498, -530, -340, -121, 749, 823, 133, -598, -909, -342, 299, 854, 916, -11, -623, -707, -356, 246, 883, 830, 88, -515, -853, -301, 311, 604, 573, -187, -420, -993, -65, 220, 804, 666, 22, -665, -800, -467, 383, 835, 602, 154, -604, -778, -329, 654, 770, 595, -194, -504, -864, -213, 316, 679, 436, 115, -926, -830, -507, 400, 739, 152, -99, -545, -561, -335, 513, 700, 502, -172, -651, -643, -389, 384, 703, 301, -223, -764, -566, -271, 342, 357, 469, -41, -737, -550, -74, 417, 678, 311, -264, -613, -842, -277, 123, 856, 301, -184, -1052, -654, 3, 604, 454, 364, -316, -460, -581, -150, 277, 905, 604, -227, -633, -716, -60, 128, 801, 423, -264, -849, -768, -55, 333, 483, 644, -217, -716]
2030g16m2O60M81R2k91k11q02K21L24R25j76k53o24k73M21J49M38K28l76l98m94
2051g17K72M72L64J23m48l67k42J72L45N11Q0k56q71P9J23L23M07J7m69k17k58
2072e57J98O85L01j0m40o03j65k6P91M31r0l40n08J87o4M45K85l1l08m81P7m44
2094f67P82O06j23o49r0n32l9P52Q76l94l69p20r4M38j7Q35j92o31J74l32J97
2115a89K88N11j30n03l38l5J47M47L89l63j17k36n85M62O80p9K44p03m72J53l4
2136d63N77L96R9l14q01n8L95M16J66k04n5o40p4K01O39K42k46k81m10l21P48
2157A2M56J25j53m59k66l84N87J92M43k50l34p09J96L65N39J71k59m01l96j54
2177f79Q44J71L36l35j84n51k37M89M70J07j02n27j45k86N30K46N37m03m41j12
$$ y = [-716, -758, -98, 383, 475, 184, -27, -829, -608, -284, 641, 465, 212, -412, -685, -264, -115, 323, 551, 175, -223, -717, -445, 27, 391, 514, 66, -301, -543, -371, -26, 485, 565, 309, -562, -483, -360, -37, 370, 387, -82, -299, -557, -359, 326, 627, 617, 177, -426, -591, -617, 174, 605, 515, 175, -333, -146, -210, 235, 520, 489, 181, -300, -223, -667, 115, 721, 598, -51, -141, -673, -712, 40, 916, 522, 153, -567, -661, -223, -240, 595, 403, -228, -54, -386, -189, 99, 610, 480, -23, -361, -396, -249, 198, 587, 224, 107, -129, -714, -252, 428, 349, 593, -110, -582, -429, -463, 114, 510, 609, 295, -506, -564, -169, 247, 413, 209, 154, -486, -560, -359, 280, 522, 276, -5, -415, -736, 12, 468, 593, 440, -19, -285, -669, -82, 110, 553, 303, -31, -740, -544, -179, 360, 531, 272, -129, -525, -679, 165, 336, 672, 337, 153, -398, -635, -146, 324, 431, 329, -198, -343, -629, -99, 147, 684, 281, -160, -272]
2197b72r1K33M47kj33l97k20K08M1L89J92k4n01j12j72L43L82p0L8m15l72K77
2219b31n3P02ol34k38l66J82K59M94q2K2l77m04J65J88J51K60k20k63l32M08J93
2241A18M67j37L05j081nJ33K28J93K74k63l80j73j68M39J40K82j19n76m9J06L59
2262I3K03J24p2o34n5J12M52N6J26k14j85m42L55o3N41j8r3n27r9j1L91J50Q7
2285B77r1l27n65L21O67o2J44j62n74l17L85M17K95j84k36J6l90K60K44J09p3
2306A54j34k82j64J01Q5N70J09k57n41Q3k27M71L01j07q8j95k92K38M35J33j79
2327B14j11n77n4M60L04q5P6j0m29n5M7M33n4J78l37m17K07P4K83M34k71j55m70
2350c15kJ01M83K6j44l50k48K80n5M41Q9o1p0k12r1o4O3M06j20k55j79M0o6P11
$$ y = [-272, -363, -130, 317, 315, 182, -215, -435, -227, -186, 203, 395, 371, -130, -242, -414, -71, 311, 241, 279, -136, -508, -231, -284, 418, 412, 78, -160, -526, -344, -85, 409, 327, 349, -28, -432, -267, -79, 72, 332, 112, -151, -483, -75, 118, 585, 448, 753, -328, -333, -200, 28, 221, 495, 232, -148, -321, -489, -50, 90, 372, 253, -323, -372, -266, 93, 296, 420, 348, -286, -341, -229, 223, 279, 405, 191, 6, -436, -81, -144, 397, 379, 286, -241, -340, -351, 40, 190, 277, 186, -141, -706, -385, 282, 220, 364, 202, -372, -689, -304, 113, 408, 224, -12, 4, -386, -126, 118, 227, 154, 20, -262, -426, -325, -240, 330, 439, 182, -359, -276, -503, -32, 269, 162, 74, -121, -413, -175, 260, 393, 214, 103, -474, -528, -68, 236, 151, 227, 217, -212, -267, -220, 213, 159, 337, 0, -417, -210, -136, 147, 581, 310, 155, -315, -317, -216, 267, 293, 149, -201, -449, -169, -224, 217, 306, 245, 175, -37, -128, -192, -129, 277, 157, -98, -277, -237, -303, 408]
2374D08P3q5l32m60L4L6M73Pm7k14l75J96J22M19K79ll67k99j17J25L97n6l6l54
2398a76k48J88J27K00J99j60k57j07p7L4L67K37l13J7j03k90M26PK10P8m02l68
2420d11O7J65K15N57n54J12o75K96K55K05n2m34L11n27K29J64K83J62l84j97J98
2441a5k24L06J28l9o1k67J65N8J37r7L88m29k10j76M9K46K64n2J11m53l03L26
2463a48J08M57j48M1j96k30j15L82K2J16k88J33j19m6k62P19m15J89l65j04p7
2484c46M24j49J40J97j20k71oK90q9M15l36n68K42l4Q2J70L50l28k25np3N11j18
2507A53L48k68l44j41J37R0K54K2l06j39k05K16JM67R4m90k38m4J64K66N62l15
2529B84l15j02q9n4L37J5M2J34j44k13K4J59K46o5k76j08O2L4L37J69l45n5k39
$$ y = [408, 481, 396, 64, -396, -362, -326, 147, 154, 107, -107, -482, -286, -164, 255, 534, 531, 164, -135, -252, -127, 270, 214, 178, -176, -424, -236, -109, 91, 290, 130, -127, -234, -311, -277, 90, 327, 14, 31, -72, -362, 64, 71, 281, 359, -43, -411, -344, -179, 36, 593, 39, 151, -524, -228, 27, 232, 180, -254, 57, -470, -241, -77, 206, 368, -16, -213, -15, -239, 67, 195, 156, 95, -172, -7, 51, 188, 91, 479, 50, -160, -336, -287, -41, 223, 171, 282, -171, -474, -148, -40, 417, 269, 310, 114, -116, -231, 151, 173, 289, 1, 134, 15, -31, -293, 426, 11, 200, -165, -269, -346, 78, -71, 69, 266, 146, -125, -131, 159, 70, 485, 149, -419, -177, -211, -129, 41, 391, 63, -162, -167, -240, 271, 153, 501, 233, -111, -252, -115, -25, 229, 251, -55, -194, -399, -183, -182, 285, 379, -111, -349, -393, -229, 37, 599, 284, -31, -133, -222, -276, 61, 76, 118, 252, 108, -105, -81, 78, 324, 259, -17, -125, -63, -29, 308, 477, 132, 77, -162]
2552a62pj37N92m5L8k40p9l40K66J40Q8R3l55L7k2L1J26K54m9j69j72p2K73N0
2576A39j12K92k55O3n18kM64Q4Qj77P3j72QK19K02j20r4n79J44K10J80K66Mm63
2600a36J5m0K2K54J34k71m11J70K06L3k0J44P7j26K5l35n3L47L45l67j6j10J36
2623B3N0p2M11m91J32k94J17J98J73l8r2q8j4o3QK23Q3l01Q9l15K21L1K71L6k35
2648F3r7k4O2n2J38J45k23J42k21k6Q6M0R9j13O8k50J09J05K84k16J19n68L37
2671Gkk67L63p3K24m37R6K93l96L82J43j06j59j41l00J70M52M7j64j11j70j2q
2694a69K98l4J1j71j07K6M08J6m37K09k03J31k32L56n4l5k07J81K9l70J80N6L00
2717A82k32j63K90j08lL13j46L2j12k73K13J02p2K41m63J97q8J82j05o6K81j37
$$ y = [-162, -169, -306, 286, 241, 279, 39, -40, -380, -114, 26, 114, 207, -148, -111, -133, -102, 24, 278, 229, 60, -112, -184, 89, 139, 27, 319, 64, 127, -391, -393, 71, 155, 163, -14, 59, -113, -105, 114, 316, 196, 102, -477, -333, -123, 57, 323, 327, -136, -121, -161, -139, 115, 249, -22, -433, -263, -57, -24, -44, 100, 177, 51, 76, -259, -312, 35, 380, 13, -3, -113, 23, 73, 1, 412, -79, 53, -241, -124, 74, 247, 209, 117, 29, 15, -48, -40, 183, 266, -35, 54, -261, -40, -9, 262, 298, 63, -34, -58, 4, -48, 90, 235, 12, 154, -67, -93, -7, 33, 132, 19, 87, -163, -54, 51, 335, 119, 238, -330, 7, 5, -262, 101, 28, 252, -185, -89, 204, -192, 190, 333, 227, 68, -73, -373, -203, 249, 296, 132, 21, -149, -161, -169, 129, 95, 106, -65, -172, -146, 262, 278, -159, 50, -153, -22, -254, 102, 48, 13, -194, -13, 16, -354, -174, -118, 182, -50, -213, 77, -31, -34, 279, 133, 165, 53, -220, -7, 95, 23, 264, -199, -2, -90, 92, -13, -79, 202, 65]
2739F5j25q3K39L0J41j82Q2j34r2Q0J34N6q4l67R3L60k16j45L24j48k50M83m63
2762b02K63J71r6k7j97O3m5j34K96m0J10j72k7l58L00J76L2K5p8j5j64L43k44
2785b0l1K70j75m02J88o5J42k3J83j51M9j20K0J66O7P6o12L75j6J99j85L33L6
2808C04k73P8j60K16j23m1k38j7K78j03O2j72M61J36j62l42J32L8L9Q0k38J39
2830I4j19q7L44N3j37Pk62J59l57M08lj16P9k23P0j13K50j7j11J38k24J51j06
2853a22o6L74k2j03j31j86N7L46j85L6L3J15m12J8J62J79k24J91k26O2k44M60
2875A12N6j21j35l6J21q7M01l78K99l59J3J7j60K30k2M29l78j9l3jN5m4R5q1L1
2900Ej55qJ24M0K28k71k0P5P6N2k31M41l44j57N9r5N8L22q4J77j73j95m5j44K68
$$ y = [65, -60, -143, 96, 126, 267, 85, 167, 33, -59, 21, 155, 211, 127, -240, -147, 213, -3, -148, 176, 28, -222, 261, -202, 61, 232, 136, 109, -88, -25, -70, -204, 92, 52, 162, -10, -37, -395, -95, 81, 113, 138, 60, 45, -119, 224, -20, -51, 219, 44, -358, -170, -235, -93, -116, 67, -84, -35, -155, -135, 31, 98, 174, -438, -63, -79, 120, -65, 268, 304, 31, 109, -51, 165, 42, 1, -237, -254, 24, -79, -17, -189, 272, 408, 246, -96, 36, 74, 113, 193, -45, 94, -25, -112, 232, 285, 148, 155, -107, 52, -305, 103, 100, -16, 63, -160, -90, -203, 47, 30, -81, 57, -167, -16, -122, -188, 186, 164, 61, -70, -256, -199, 147, -38, -2, 31, 146, -266, -248, -86, 93, -131, 60, -166, -104, -348, 112, 168, 47, -88, -124, -3, -90, 311, -67, 232, -127, -114, -97, -257, -27, -49, 380, 2, -17, -50, -51, 4, -40, 55, -26, 5, -150, -158, -34, 6, 234, -37, -57, 18, 94, 146, -85, 356, 12, -145, -86, -181, -123, 199, 115, 292, 119, -76, -121, -265, 3]
2925Cq4J67l04M3J99n6J40J63l29j25L03k20K22oo2Q2l49K35j77K57j34j96J42
2948h6L9n01K58J83Q2Q1l45M3N2J68p9K98j4m15K41k78J62K10k50N01k08p7l96
2971c31J43J78l8J9l7j6k13L55l33K91j2k5q9P7j26J14L71j53n6k31M7j49J06
2994a08Q8J16k58m9lJ21J27pj83J07Q4m9j79K88k22K66k75j44K16Q1j62R1M54
3017D00k62q5l04J43L68l20K20k66J77j44L36m08Q0K84k35N0k6P6l6K96k11J05
3039B38l38M3J00Q1R6q9j45L5p8k36K77K23k13L22m43K18n1j75K9k16M48l12L18
3062A32K3N5J65j78p1o7L4l93K45K50j50k30P7r4l74O74J00j97q6P9k65K83N9
3085G1j91K15p2k04J01R4R9p9or5k24L08q6J72M7j43L2k41L70l45K71K26m5k99
$$ y = [3, -81, 86, -218, -175, 24, -32, 108, 271, -58, -183, 120, -100, 122, 116, 54, 136, -213, 22, -155, 102, -32, -228, -86, -47, -548, -290, -107, -25, 56, -289, -246, -194, -26, -105, 193, 179, -236, 5, -273, -111, 99, -151, 350, 142, 65, -331, -188, -10, -48, -29, -66, -82, -295, 60, -273, 18, 6, -19, -108, -31, -157, -43, 328, 175, 119, -112, -65, -214, -108, -20, 96, -162, -211, -214, -93, 34, 27, -156, -49, 35, -14, -193, 95, -127, 139, -136, -280, -64, 17, -145, -54, 400, 138, 53, -251, -108, 260, -60, 160, -106, 71, -73, 263, -145, -65, 219, -16, 34, 8, 84, 48, 344, 133, 238, -100, -57, 43, 124, 220, 131, -14, 21, -57, -293, -16, 207, -6, 316, -127, 91, 40, -135, -106, -322, 126, -186, 132, 155, 210, 375, 197, 126, 59, 93, -300, -55, 195, 45, -185, -108, -202, -576, 98, 198, 1, -85, -6, -271, 12, 71, -120, 95, 23, -181, -80, 14, 113, 34, 28, -67, -291, 17, -69, 103, 150, 7, 39, -202, 168, -177, 94, 320, 275, -24]
3109b4K3k8m4J89K2j06o4j55K29j55M9l5N5J28J9p9j16L19j59j03q4K32l46K46
3133A3JO2ook98l6L54Q3k59K97k04j15K51O0n4R9j63k24j19K16j65L52r5q9q3
3158a28k2J82q9K00k77K17R1l26j43K57o6K68k30M8j03K37m01M14J27j77p7k50
3180b48L90q9J06j0q6m6k3J63l12L09QM0n17K66j78L04L0O8k58j70J35j9K11k54
3204a80L13l63Q2K1J48J81p0j64J49k40J43j77K19p9N2j94J44q3J96J24m57K00
3226c5M2R9Qj2j81L15m04K90j13K21j49K44j44r1j77L1J07o5J28qK39j27l53n9
3250a94K35M0q1Q0Q6l61m5J04J42J00o5J62n0n28L18N0j6K40l40P7N6l12L07k1
3274a6P7P8m02K53k11K32J15m7k61L11k73K32k29J85k10j15J03j46J60J73K6J4
$$ y = [-24, -1, -29, -73, 116, 138, 32, -32, -187, 42, -113, -64, -99, -44, 84, 103, 24, -92, 227, 68, -35, -119, 113, -233, 13, 14, 76, 70, 64, -234, -270, 84, 167, -92, 205, 1, -114, 137, 197, 143, 242, 79, -145, -264, -48, -213, 139, 44, -45, -128, -150, 32, -57, 143, -134, 83, 174, -152, -295, -38, -104, 164, -66, -18, -121, 116, -285, 129, 256, 79, 2, -248, 142, 53, 159, 149, 63, 17, -6, 157, -155, 154, 162, 202, -315, -49, -227, 77, 107, 175, -83, -253, -118, -137, 74, -180, 133, -230, -148, -127, 21, 202, 132, -32, 117, -123, 20, -157, 62, -17, 35, -159, -15, -98, 98, 222, -235, -35, 7, 106, 114, 102, -79, 236, -168, 122, 9, 230, 81, 325, 181, 90, -87, -56, 51, -14, 114, 106, 345, 218, -135, -194, 41, 81, 0, 80, 166, -195, -240, -136, 6, 106, 41, 203, 153, -375, -57, -7, -23, 217, -123, -46, 10, -302, 5, -16, 61, 139, -263, -10, -221, 11, 126, 79, -182, 129, -144, 88, -141, 44, -166, -281, -178, -324, -164, 9, 35, 49]
3296D9J03m87K08J36p2Nj57P8j21Q2K5m9J87M22n82K59m3J40q6N5j32j64R8N2
3320Fj44J14K94k39r5k76K25N3L58j17k29j19K67q2k00K04R0j54j9k08K14k5L6
3343d6L45l14Mj60n4O3L05K1j68j40L1k10L76M5k30K80k73M86n06J03K15l14J41
3366@J92k67O7j04J01J74n4j73J07k84J74K54r4j40J14n2j44m7k7K91n0j93J28
3389b7q2J52j11j81K33Q2l2r9J1q9J79J13Q7k67O3j17L70q4O3l51N9r9L8J64k75
3414b00L88m4j27j33n6L84m03J26L7j79QK84P7J2n5J6k87L95j45j00O4n1j17J86
3438H0k02N7j3J18Q4k70K49j49J86l40L49o3j38J57l74M75q1j85jL8K57j05j9
3461A10l3j42M1k15O6J74j07m9L36k07J5K1m8Ln7Q7K17l0L5j93j34M30l27KJ49
$$ y = [49, 152, -335, -127, 9, -63, -58, -215, -137, -258, -176, -151, -200, -13, 409, -173, 86, 43, 183, 97, 152, 20, -144, -46, 6, -138, -24, 270, 31, -64, -340, -115, -62, 296, 179, -50, -169, 98, 16, -184, 20, 110, -44, -63, -271, -57, -82, -46, 299, -15, -11, -171, -225, -162, 143, 164, -4, -144, -113, -323, 53, 98, -132, 148, -125, 361, -145, -42, 173, -141, 0, 192, -75, -8, -112, -11, 163, 109, -64, 43, -241, -67, 187, 93, -47, 67, 15, -129, -176, -203, 88, 38, -155, -27, -109, 43, -68, -249, -16, 66, 34, -65, -54, -143, 36, 149, 236, -31, 32, -85, 285, 201, 264, -87, -28, -127, -89, 75, -200, 188, 144, 17, -116, -172, 212, -191, -65, -28, -207, -199, 85, 162, 174, 119, 135, -152, 243, 98, -2, 62, 11, -106, 80, -122, -65, -78, 40, 124, -146, 103, -46, 140, -200, 149, 86, -52, 105, -269, 206, 125, -60, -61, -23, 234, 129, 110, 77, -65, -24, -239, -173, 1, -106, -155, 181, -26, -11, 10, -38, -35, -92, -5, 212, 182, 217, 24, -110, 320, -7, -5, 144]
3486A44j61K46k06j65N5K32j62j03J22J0j51K43q1jj87K47k73L81L9j28j55k56
3508c10L37J2j20P7Ml89N77k63l5J54K87k60l7p7p5J05J18l9K29j67ok3j13M06
3532C92l71k57L02R1O2j43j97J28j52j2Q0m5J36J00j80K08r2J8j24P8K12n00N7
3555b09L85k85M8P1j74K14j10j45P1K82k90K3j32K20j51L51p4l80M38j81k10K12
3577b6K41j78J56j89j7j32%J65k44J35L13j31J00l82J19r6L08k73K6K49l68M58
3599B34l59K66O5j70l10J99J34j78M0Q0OQ0j49K08k14J25qk11M21j74kOP3o2m
3624I6J0P4k67r2M2R7n1j86J68J4Q9o4j63O37m03l8P0j8L13k81j15j5j06M7L51
3649B09Q5o2l8j76j78K70o2J0q6M4l09J92J05J82l56R7J53j50j61l0L15Q4r5j07
$$ y = [144, -17, 229, 23, -142, -87, 145, -17, -120, 2, 12, -139, 104, 23, 22, -165, 82, -191, 190, 229, 101, -54, -310, 27, 39, -81, -4, 0, -389, 188, -75, -110, 44, 331, 71, 34, -43, -118, -13, 105, 66, 295, 128, 122, 99, -14, 392, 21, -236, 66, 157, 219, 76, -121, 7, -145, -157, -77, -122, 14, 114, -66, 142, 50, 68, -56, 22, 234, -266, -209, 176, -109, -61, 10, -164, 50, -60, -205, -134, 148, -142, -119, -251, -31, -182, 169, 95, -285, 153, -28, -238, -26, 215, 37, 193, 4, -13, -145, -145, 20, -224, -89, 224, 93, 193, -189, -70, -166, 142, -131, -105, 144, -224, 234, -125, 141, 206, 36, -274, -75, 59, -119, -79, 1, 7, 87, -62, 146, -68, 57, 49, -162, 259, 85, 83, 89, 162, 100, 96, 106, 180, -87, -179, -137, -40, -91, -277, -109, -95, -6, -70, -233, 404, 1, -37, 33, 15, 328, 47, -68, -83, -189, -142, 209, 294, 232, 194, 18, -160, 110, 48, 58, -28, 16, -293, -101, 4, 186, -170, -73, 80, -70, -231, -261, 54, 138, 43, -64]
3673f4J35k26L35n0M0Nk83P0j1j17K34J25m7k3J28j69R6j84j67K4k3K75or2K79
3698B84m08J73j67j6K49J1O7j62p0O9l1R9q2k51K21k33J63JL00k71p1J97K9k23
3722a22K20n0j2K9o7k42L81j51k71K72n3K62o4q7k22M8L44j56k4J39j99K06j17
3745F4J29o5O8j60R8K4K6m29J69m0O6j76K42q0j07J34n8J97o6L10m85J40j13J03
3769iM7k13K28J4q5J83k44M7K34k32K3k80M46j59o9N2k40L20Q5k53K06o1n9j4
3793c3K7r1j59N05j14q3P8j17J12j27R5j12o6N6J75j69J50P2l67O1m0p6lJ81J55
3818A10Q0k97lQ6j80J41j13J06K26k29J12j89R9M6p8RR3N7P6J78m67R6l5pk37
3843c20L86j4j3j48OM4p8J67J33j86%M6Mn7L9k0j32R7J03n4l5j34m5L56o0m63
$$ y = [-64, 71, -155, 180, 130, 170, 175, -108, -38, -49, -166, 68, 193, 146, 123, 251, 82, 178, -6, -173, -149, -172, 103, 97, 5, 284, -124, 49, -118, -134, 115, 126, 193, 31, -39, 30, -1, 98, 16, -235, -14, -247, -84, -83, 217, -54, -125, 72, 101, -122, 98, 48, 36, 65, -2, -244, 137, -14, -285, -13, -66, 196, 132, 45, -177, -129, 215, 59, 35, 174, -25, 181, 64, 193, 128, 196, 36, 134, 158, 184, -245, -76, -116, -50, -226, 16, -64, -171, -37, -95, 102, 36, 346, -139, 1, -112, -9, 38, -175, 53, 67, -18, 165, -79, -32, 202, -30, -7, -287, 159, 0, -69, -17, -257, 63, 148, -105, 101, 40, -19, -33, -6, -97, -256, 249, 135, 52, 130, 13, 125, -2, 93, -19, -85, -29, 146, -23, 127, 199, -168, -107, -147, -223, -226, -45, 110, 190, -107, -110, -24, -204, -63, -176, -70, 156, -73, 39, -150, -51, -5, -83, -74, 19, 76, 152, 330, -137, -41, -76, -83, -320, 66, 52, 39, -109, -103, -59, -137, 30, 163, -23, -23, 23, 27, -30, 9, -11, -143, -46, 57, 3, -32, -166, -211, 145, 85, -378]
3869c78L30J32j64NJ88j03j95K53J8m3J44l09P1O1M3o4M7J30j38j85M2O3m1N8
3893c5MK17r7k14K13O2l91j04M93%m31K11n8J14J39j58J5J76p2jK2N1j89J17n2
3918C2p1L3K2nj55J12K8L3k03N19l60j8K06j70q1K53k45L81m16l0j3M0K67j78
3942a9M3P7l02K24k40J79m6M69m05k28K38m8Q3K68q4j97J30j11k18L35k34M2m0
3965h4P0p6K99m42L11N3k38J04j42K30j18J47k16L33k24m1k08M01k2K9k79O5K72
3988B24m13m3K22r7K89l74L47k36J48k7k28J35K5P7k55K48J0P9N3k73J92l7l58
4011b92K51J29j28k05J36J14P3j57J36j44ol1J36K07j04J22j58j56L8j9J09r1
4033d0J22K73j89o9P4J8k22n2L18l39J73J40k71p9J83l3q5L03l00PJ53l8o1J1
$$ y = [-378, -48, 84, -80, -75, 113, 10, -185, 68, 86, 43, 187, -122, -51, 10, 53, -11, 36, 166, 28, -157, -115, -52, -93, -35, -31, 186, 89, -125, 88, 150, -241, -345, 148, 148, -283, -72, -130, -16, 123, -35, -20, 156, 84, 83, 105, 156, -33, 84, 32, -39, -6, 16, 11, -144, -32, -4, 29, -174, 345, -15, -33, 173, 3, -78, 175, -70, 311, -105, -135, -148, -108, 159, -19, 24, 101, -201, 23, -217, -38, -84, 385, -20, -248, -10, -58, 25, 293, 209, 12, 142, 31, -187, 148, -86, -44, -84, -14, -90, 209, -233, 78, 131, -107, -3, -145, 85, -33, 114, -102, 231, 7, -34, -242, 159, 137, 166, -113, -48, 224, -189, -232, -10, -107, 182, -192, 155, -81, 67, 40, -188, -53, -28, 49, -206, 42, 52, 131, 184, -89, 103, 66, -292, -41, 88, -40, -245, -109, 5, 78, -79, 57, -87, -93, -124, 12, 219, 115, 237, 79, -77, -39, -58, 51, -40, 82, 355, 166, 97, 171, 189, -33, -85, 233, -106, 67, 207, -64, -143, 40, 7, -78, 225, -75, -68, 85, 47, -14, -3]
4057cJ29o4k4j48K68j41O4R1j93J00P0n1n6k73K58l2K24j83j87K50o1J26j89O3
4081C8O1O8l25J62L9J15k43l3L47j73J32k61j35M71m27P4J83j20Jj59Q7K38n42
4104d02M85l64L22j54N4K18l65J47K47k74P1J76m4L3o9j08j42P7K9n2M4o0J38
4127GJ31k83O6m5K01l1j74J01O5j24K79l52J52j09r4J33N4o9K14j70j9J3J95r4
4151D7n8J89j84L2k8MJ08K2j35Pk3j46K30J06mk11m7p7L35k09J07J29j99J98l22
4176a29K67Q3j86j81K22j33J20n9K14j18m5K98m59K71k18K61p6k08J53J27l9k41
4198g6j84L33R3q3K43m42J55P7j63k19K34J7k80L34n4J18j01j00O4m8k9J23P9
4221I1k6k6P5k16m5J40K67m84K14J72j73k68J95L31k11K2k3n2Mj36k0O9J84j54
$$ y = [-3, 126, 62, 38, -110, 158, 17, 81, 172, -21, 79, 149, 98, 42, -231, 27, -5, 219, 36, -151, 99, 38, 164, -25, 38, 99, 167, -158, 4, 43, 158, -85, -118, 229, 56, 188, -73, -208, 263, -164, -90, 93, -27, -26, -185, -98, 140, -402, 83, -281, 41, -113, -59, 159, -206, -59, 188, -86, -15, 161, 117, 150, 81, -27, -169, -92, -63, -115, -71, -131, 7, 138, -145, -79, -124, 77, 46, -128, -27, 38, -86, 193, -159, -7, -116, -210, -77, -23, -92, 122, -48, -67, -54, 141, 47, -11, 178, -6, 26, -2, 2, 110, 132, -3, 4, -19, -165, 65, 171, 167, -44, -91, -168, 167, -42, 65, 194, -5, 193, -129, 138, 221, 35, -146, 76, -57, 63, 4, 218, 100, 55, 353, -106, 165, -53, 208, 132, -76, 77, 204, 165, -76, -260, 73, 166, 83, 326, -116, 39, 116, -47, -266, -32, -15, -295, 39, -15, 103, 2, -98, -34, -82, -111, 12, 91, 65, 39, 114, -102, -147, -7, 260, -224, -10, 162, -11, -279, -84, 247, 36, 58, 35, -17, -13, -149, -169, -100, 84, -70]
4245g0j00j10R3J25j30J01p7K1o4K17j11M47k88q9j38L29n00J18K81l17J81K31
4267A50j34R7l28L02j97r2K52k6K19l49K29p8M6j94L92l20R7p4r8J38j9j23J50
4290D0P6n2Ml4k5k06K27j1j89K89k36K23k25K87M7j68M3k79K1K10j59J23j38k3
4314a55K14M7l3k81K4J97Q6j56N0K3j10L30l44P0L17l14J1n6n2j13M92j61k60
4337a74K10M8Q0o7j60k03J46K75k04k6k86M36k06Q5J08l93K15J5j33N3K05n6J33
4360A01j90J01j57J11K09k65J33j06L1Oq6J97j22J05N1l8L7j21j2K79m10M9N8
4383c9K87j70k65J40L6J1PR5k36L04N7l19L9J77j47j06J61j7j53P8J19O3q7N4
4407H9j92J63j43k3J46k29P7Q4K0L1k17j09M74l24L3%r8N84k13Lm7l3%r2M0pj21
$$ y = [-70, -170, -280, -187, -62, -192, -91, -168, -147, -211, 6, -105, 342, 54, -35, -173, 156, -344, -226, 55, -262, -81, 150, 16, 113, -215, 87, -110, -202, 50, 24, 243, -106, 123, 45, 91, -103, 289, -31, 66, -8, -106, 32, 13, -110, 40, 116, 64, 68, 34, 9, -197, 30, 19, -170, 119, -117, 106, -119, 168, 215, 47, 90, -189, -168, 42, -117, 6, -132, -155, 59, 106, 73, -208, -184, 13, 99, -57, -7, 16, -94, 236, -108, -38, 279, -35, -24, -80, -132, -245, 247, 86, -174, 36, 84, 164, 97, -63, -266, -120, 155, -49, -75, -361, 75, -131, -46, 62, -331, -116, -101, -234, -181, 24, -32, 101, -89, 12, -145, -34, 175, -90, 43, -63, -32, -26, -112, 85, -37, 68, 119, 81, 118, -3, -15, 264, -146, -97, -39, 248, 78, -187, -47, -11, 0, 7, 102, -134, 170, 227, -92, -53, 124, -23, -129, 32, 15, -138, -60, 59, 122, 35, 89, -103, 60, -83, -106, 40, -189, -112, -28, -8, 23, -194, -303, 171, -153, -120, -120, -218, 366, 153, 156, 109, 76, 76, -16, 24, 17, -104]
4434a04L25o8j65k8M5mmr7L21j53M6k09K75m00K21p5K09p5K00l00R9K1K98o6l04
4459HR2j08N4J33k25J27J29k37k41K14J39Rj14j34K08p5j23O6K68P2k51j77M7
4482a19pmQ9qR8j92R0P4j15K35o6l21J80j64J52J4J53l27K75N4j81M05m14L08
4506B09j64K13j62Q1o7l32K15J2J67j18k19L16n8Oj1j94K05j38L80n30K05j37
4528a21K78l45R8J47q5K9l4p0k6J32q2J31j20pl6Q3j83K13j7O0l0J79l26mj1K21
4554G4K58m20K27l17J70K3j09M1J26j47r2J04J88k49K43j37o3K10l21J13J44j3
4576E3J01K8k72K23n2K76j60k60j8J79o3N9J03j28j64P3Q5M8j34J52l2J14k1l22
4600a32L45n3j11JJ31k25J40p7K60k68j98L54k53N8m2L44j9l18K08j8Lj94J4R2
$$ y = [-104, 221, 153, -12, -40, 5, 1, -3, -100, 221, 68, 114, -95, 180, -220, 1, -74, 135, 60, 260, -40, 59, 80, 378, 312, 8, 100, -8, 46, 179, -46, 81, 210, -27, -268, -54, 85, 94, -20, -154, 54, -21, -144, -78, 190, 262, 11, -166, -119, -126, -130, -41, -49, 49, -143, -53, 21, -94, 141, 75, -246, -66, -230, -78, -64, 89, -238, 37, 91, -90, 315, -99, 209, 45, 258, 96, 177, 110, -222, -7, 5, 172, 54, -165, 151, 93, 99, 88, -106, 99, -39, 341, -189, 16, -121, 157, -188, -90, 57, -28, 1, -33, -103, -129, 3, -79, 52, -68, -75, -111, -28, -211, 2, -15, 45, 15, 194, -132, -136, -147, 74, 332, -88, 139, -178, -8, 15, -94, -53, 73, -74, -166, -62, 126, -123, 120, -17, -80, 130, -191, -78, 66, 53, 154, 182, -90, 133, 81, 357, 197, -63, -81, 98, 35, 94, 197, 69, -95, -22, 63, 111, -23, 129, 97, 211, 190, -132, 213, 160, 49, 50, 181, -44, 96, 19, 279, 11, -187, 167, -86, -28, -70, 274, 255, -63, 145, 127, 130, -64, -50, 42]
4624D2N3r4j09rJ17k26M94ll3r1k67M97l34J8K66nl83J56j5j81J81k53k3K98J17
4649B13l55L17j64k12L29l00J14K24k95L12m5k45L99k03j40j29L7r0L49k38r6
4670b18N0K76k03J96k03J50OR7N2l09k12L08J35k28Q4j16P9M8KJ56k21k14K64
4693b1j33M06m88K72j64L62j71j54pJ87r4o1J80j74M2m9P2N5j44K14L8j34Q6l0
4717I0J11L9j21J15k24l3L7J98l59J39M7k5k0R1q9R5j12k82L36O0j14r6K94M0
4741B17l98M07k27l90L14J42P5k36L25Qr8k05K43j38K0M5o5j84K86k86j17L58
4763I6k8p4Q8j51J7K11l60N13l16Q6M6k93J52k61M61l29j7L12j81k53N50k99l2
4786f2j09K64M1j0k74J13j20L5p0J28J17k9l2K1nQq7L5q8J1L23k40K03j09K07
$$ y = [42, 95, 1, -108, -117, 0, -226, 268, 265, 232, 141, -126, 371, 37, 55, 321, 316, -67, 89, 74, -107, 74, -179, -202, 96, 213, -142, 175, 11, -201, 128, -172, -58, 166, -129, 183, 138, -107, 292, 89, -51, -180, -143, -233, 116, -122, -218, -168, 108, -95, 101, -102, 48, 54, 151, 203, -106, -318, -10, 125, -103, -19, -135, -56, -8, -6, 150, -71, -285, -21, -154, 252, -236, 36, -128, 234, 63, -91, -98, 89, -5, -66, 114, -60, -18, -67, 5, 60, -84, 130, 168, 34, 120, 90, 201, 240, 119, 234, 10, -23, 14, 212, -147, -8, 39, 14, -6, 85, -4, 91, -21, -303, 33, 93, -21, -117, 177, 217, -181, 226, -1, -391, -77, 65, 140, -96, 229, 237, 139, -66, 177, 39, 59, 104, 39, -145, 141, -145, -262, 96, 68, -6, 82, -69, -52, 159, -201, 312, -4, 82, 128, -165, -13, -274, 187, -142, -159, 153, -28, -281, 269, -30, -62, -171, 93, 134, 124, -150, -37, -157, -122, -192, -64, 53, 24, -8, 13, 8, 16, -71, -36, -124, -113, 210, -30, 173, 64, 271]
4811B71j40R5j73N2l39J41r4K55k84K29q5J34j19J55J6j41K4O0K2p8J21j87K85
4834B20k25J59j72OL0j34P7jjj44J54K93j24k11J7k0M1J3K23J20k76k50L77k72
4858a00l4J13Q1k5Pj40p0L88k42j3qJ9o0Q8L8k91K79j39J37J85l31Q0k1m2M8K9
4884b4K00j43j54L9K00k61J76K1n5k0Q2j84m7KK20K7Po4K63k57r0q9M9K24k37
4909a15M55l03Q8q7p7O1n6M7l20K21K23l4j77k0J03j88K48j64k24K84m3J61K69
4932C52l92q7K1O3N2o9P9P5N5l41j41M59M7p2j01K77m81p3K96J0kl2P7k11K58
4957A19l67K30Q8M9l17L45j94p9k7J29Q6k02K12K3j35K03m6Pj71P6J43k97K02
4980G7n3N8N1O1m49N36m61J7J12R1n8p3J87l53L50j2J32j36j11K27l6j42K99l79
$$ y = [271, 131, 226, 53, 105, -234, -93, -187, 68, -216, 13, -72, 62, -57, 98, 114, -27, -3, 57, 79, 1, 122, -65, 220, -5, 154, -18, -12, 18, -116, -39, -40, -41, -185, -31, 262, 138, -73, -56, -76, -35, -22, 201, 321, 45, -205, 172, -100, -134, -21, 60, 35, 42, -98, -168, 220, -22, -35, -43, -24, -84, 4, 42, -249, 30, -109, 28, 213, -118, -38, -59, -101, -53, -24, 176, 33, -121, -82, 118, -143, 33, 54, -1, -21, 61, -123, -170, -168, 52, 79, 86, 22, 285, 28, -62, -151, -102, 122, -115, 340, 37, 125, 38, -39, 22, -34, 13, -307, -86, 137, 103, -74, -94, 9, -179, 69, -95, -319, -35, -78, 83, 352, -40, -127, -106, -43, 9, -60, 19, 94, 149, -192, -333, 126, 173, 101, 0, 277, -204, -277, 19, 29, 27, -5, 72, -139, 119, -248, -18, 70, 119, -198, 147, -47, -126, -153, -24, 62, -140, 72, 95, -40, 163, 117, 124, -47, 29, 172, -125, 77, 24, 82, 133, 194, -255, 281, -180, -163, -51, 40, -18, -91, 96, -257, 93, 81, 213, 77, -34, 193, 157, 15, 314, -65]
5004f5J31Oj99J94j26q9O0l5J34J18l4k33K06j53J84k85J72J35o2r5k9q2j36J83
5028a00RL18k71l7j8J38p5R5l4j72R1k7p9qJ10j49L00k68J2J79m8P2l90L59k0
5053a3j2K1Q5l44L15k10j05K77l9J23j38J01o8K0j49K41l1l34k6L19k72K22j0
5076b7j4j76J99rj26J75kJ30K7q9J88l75j2K25o1j04P5n00N45l59K31o0k26M94
5100A49P2n7k1j63M4j47J65l5j43L63l01J9N1J16K16l23k7K61j42n7J22l6k50
5123a24L56l95l5K68k18L82l90j23L06k4l5p5m0J09J70l9k04L84k40k92O4J66
5145b9J22j90K28j49O8O3q8j04K01r0J92k00q0O0j7R8J26r8kj91L97k98m7N0j07
5170h5Q1j89L64r5j12m2Oo3L31m3K7l29K06J6J46n40K02K61o4M8m3k04P1M34n47
$$ y = [-65, 66, 72, -127, 67, -59, -148, -88, -123, 11, 129, 95, -138, 68, -85, 99, -186, -14, 121, 59, -36, -65, -147, -283, -100, -91, 227, -44, -81, -99, 39, -36, 59, 25, -147, -56, -83, -162, -170, -60, -209, 91, -177, -165, 14, -34, 38, -352, 7, -13, -25, -4, 81, -263, 52, -158, -263, 14, -25, 98, -40, 61, -7, 13, -136, 105, 74, -260, -286, 33, -239, -17, -27, -41, -217, -18, -27, -153, 22, 20, 150, 177, 88, 276, -99, -111, 114, 53, -51, 24, -476, 69, -290, -59, -119, -345, 149, 221, 164, 143, -20, 24, -123, 42, 7, -136, 227, -74, -55, -4, 112, 328, 5, -22, 239, 97, 40, 162, 126, -124, 232, -163, -198, 70, -148, 234, -156, -279, 27, 3, -32, -107, -147, -38, 132, 93, -111, 273, 33, -259, -195, -29, 93, -97, 131, -18, 50, 113, 25, -79, 122, 32, 224, 24, -56, 4, -13, 85, 211, 113, 111, -80, 317, 19, -28, 22, -85, -4, -193, 171, 76, -36, -78, -72, -135, 196, 153, 180, -149, 57, 73, 219, -321, -119, 142, 78, 126, 83, -121, -50, 384, -163]
5195a63P8J82k02j49Q1j7L71j66k6O0j15J13m5R6j04j9m9K55l24j30L14j2k17
5218a88O4K36k65J2J67p8K4L0J22n71K44n1K89k61L73K7j49J86j6rj39N6l08L10
5242A05P8l56O9L55k90R2j00J48j04m3J48j65O3K32k67k54M20k27J1m3K26j56
5264e8pn7o3j22L54j98J34j47P9r7M9k4J58l6N5k4rr0P1M9J83k79L66k74j17n3
5290a57o0J22L34n19M66J79n37M45m80J44p4lJ52M5M1OL9J9m24L79j87k81K74
5313g7j80N33p2k09J23j53n3J27k72J15J89p3q0R1l5j18M8J22J42l41P0K26m0
5336H3P4m92O32l02J53q0j14O4K9K8M3j32m2J01O1k7j95K29m5j1j69K40O0J7l04
5361i9J15L0k26J47M31m93L22l13j7O5k30M02r5k62L69o6k31K29J63J02j04m8
$$ y = [-163, -85, 97, -105, -254, -173, -190, 181, 15, -11, 49, -66, 47, 2, 98, -6, -25, -74, 181, -143, -273, 41, 29, -188, -124, 112, -153, -141, 26, -52, -28, 2, 124, -447, -203, -254, 35, -226, 147, 174, 25, 211, 195, 186, 47, 103, -205, 105, 183, -173, -104, 251, -39, 53, -47, 101, -3, -46, 102, -63, 0, 232, -35, -289, 131, -96, -85, -128, 98, -58, -65, -122, -185, -307, 47, -151, -17, -164, -85, -182, -133, -157, 1, -35, 20, -4, -13, -103, -32, 17, 200, -79, 287, 13, -104, -157, -217, -95, 239, -280, 186, 365, -172, 273, -207, -63, -137, -140, 12, 57, 98, 104, 143, 162, -262, 117, -70, -351, -77, -257, 276, 204, -5, 118, -35, -88, 39, -233, -118, 71, -2, -82, 9, -26, -144, -96, 26, 168, -173, -103, 123, 83, 157, -335, 297, -5, 148, 68, -46, 18, 47, 75, 118, -14, -56, 45, 106, 79, -116, 113, 68, 57, -112, 128, 188, 205, -99, 16, 46, -180, -33, 398, -95, 227, -86, -103, -38, -268, 134, 39, -223, 146, 80, -151, 78, 241, 343, 239, 191]
5383A91k64LJ27K02l01J45k1J43m48J84K8NJ2l6l1N7M0j71Q8K14k27J69P3p9j36
5408c3j8oL6R5j17P2R6j0k65l5M3MK38j58P1J01k72J09L0k55L09O4L9r0P9j94
5434f7O3K6K3K23k72O1r6k2J10j70j21K75QO4j92r0M7K78R6l44M0k27M25J30m55
5459a87R7O1K16j97m5o0o5K50j28j9J60p8L1j18J37J36k47O7k88J18M97j39j42
5482E7J4j09O4k33K76k80Q3O9K25j70k25K60j38J29j52K85p9Jk32j6R5J41k04
5505a39qK29j10l92L25M8j18L95k07R4l11J76k9M5J07m4k15M6K91l80K26J48m61
5528b84K90rn0K68l54K85K04k65J5j61N5j32L6N0l9J60J8L2j67n3m0L35k9j44
5552B1k35K37k23M8K47k66L44k60K04j20j99k7j62K98J94q8l85L93m1o3r6Q8O9
$$ y = [191, -73, -70, 57, 259, -42, 103, 82, 225, -223, -39, -11, -6, 6, -30, -61, -4, 36, -135, -47, 167, -60, 109, 182, 103, -33, -51, -57, -21, 74, -43, 29, 125, 115, -150, -185, -142, -138, 100, -58, 13, 114, -158, -49, -19, -274, 35, 99, 138, 48, 127, -67, -4, 22, 45, 268, -4, 57, -39, -61, 49, -121, -242, 33, 41, 105, -87, -177, -130, 148, 244, -100, -60, -287, 138, 268, -187, -90, -29, 187, -10, -55, -115, -180, 70, -58, -77, 83, 5, 36, -82, 55, 191, -56, 11, -277, -159, 338, 199, 57, 71, -38, 26, -207, 69, -211, -128, -59, 166, -4, -229, 31, -107, 22, -130, 155, 76, 77, -155, -171, -76, 65, -139, -147, 82, -28, -420, -95, -47, -165, 230, 23, 117, -194, -18, -47, -2, 105, 61, -154, -108, 183, -197, 29, 177, -284, 6, -3, -53, 215, -139, 146, 350, 85, 100, -61, -6, -138, -102, -52, -91, 69, 87, 119, -48, -101, -141, 194, 165, 21, -214, 23, -200, -152, 95, -171, 173, -87, 117, -3, -202, -229, -391, -93, 101, 13, -372, 21, -20, -83, -179, -91, -22]
5575b2J42l98J97o9M13l07J21J46l54j04K97m20M91j74M4j0o7J6o0J34j20K21
5597A17Pk50j1%qN1R8J99l10J33K65k66k03K44N9K0K30m80J90q3j42n1J2K02L1
5622E4P6j65O8rn6j06K23r0n4Q5Q5r8o8K24j90L3mm8J02Pl8Rm1Q7p0R3l17O2K62
5651A16J5Ll66M46j26j70K34j53j28L11j29n1j25K59j50j63M25m77L82ok71L8
5673h6n6j02N92k44n4R4k50q4K20K16l79l8j7K21j1nn6r1K40j21j26L38k06K04
5697A99k81m1n3JK25q9Q4k35K49l82K13L9J00k2L9J72j31j62J65j71R4j55K46
5720A04o6n0J92l35J51J34l8k07K02n9n5J28l57j9k3L42Q9r5K0j27L9M1qm2j10
5745a49L15k38j8M03k60Q8l58J05j06J51J04l90K55P3J58j51J19l59J96p5K3J20
$$ y = [-22, 120, -278, -81, -150, 263, -44, 77, 223, -131, -235, 62, -358, 133, -41, 3, -7, -74, -58, -118, 16, -104, 117, 124, -126, -137, -137, -145, -94, 4, 203, -107, 26, 291, 25, -178, 66, 125, 145, 375, -105, 85, 2, -140, -191, -179, 23, 54, 130, -35, 33, 24, -32, -138, 85, -5, -59, 26, 111, 13, -55, 169, -21, 12, 8, -40, 62, 69, 31, 40, -1, 86, 16, 109, -208, -146, 116, 131, 134, -232, 214, 88, -82, 152, -1, -129, 182, 53, 2, -123, 136, -14, -177, 248, -229, 153, 147, -124, -86, -142, -244, 348, 104, 50, 144, -106, -190, 30, 246, -133, -171, -188, 33, 22, 17, -39, -130, 110, -11, -137, 201, -5, 199, -82, -123, -176, -175, 50, -39, 45, -190, 59, -323, -110, -71, 29, 7, 46, 218, 87, -75, 90, -81, 13, -142, 104, 38, -12, 180, -155, -4, 130, 92, -115, 87, 28, -27, 101, -256, -275, -298, 44, 133, 38, 58, -69, -30, 11, 3, -39, -149, 166, -72, -90, 313, 53, 141, -217, -112, -218, -67, 37, -353, -98, -25, 133, -18, 101, -258, -62, -137, -114, 6]
5767FJ31n5j34J1M0K04j75q0J68j73P5j20J31l1m7j35K77k04j3M5M17m3j31l5
5791A29k2k02j18L36k54K00K88j59j61p4k5J26J9j30L3J15K9j06j34mK9L74l37
5814d8K16j48jO0k91J82J64O3k02j24n0j59J12L29p7j47M1L1P9k33L60l82J00
5837a25J95j10K13m27L02O9j55l18J95K2L00j73l53J87J11k5L01l38O7L4n2L2
5859d8K00k24Q6j39J59N2j10J2J01j92j50K64j14J83k01K75j62j1J24l31M63m01
5881a64K16O3o9j7m0o0Q3m2J04K21l48j51M13lm32K16n2j77K83l8J31k56K76J14
5905B71n45K98J51j28p2J79j46j54L25n4j17PJ1pl76L51J33n4M3j00n5P8n9P1
5929E1O5n8k39R0qo3J09r0K12j76J23l7M7o9J24j80P7J81l29Q6j56K66j05J64
$$ y = [6, 137, 82, -52, -41, -1, 203, 28, -52, 116, -57, 18, -102, 29, -2, -49, -184, 93, -111, -124, -79, 338, 295, 164, 129, 107, -95, -213, 123, -131, 69, 357, 198, 37, -37, -62, 64, 83, -47, -14, 101, 130, 24, -110, -114, -85, 289, -48, 168, 20, 19, 79, -212, -30, 134, 197, -5, -129, -179, -338, -226, 103, 26, -121, -80, -49, 30, -203, 157, -225, -125, 70, -40, 173, -254, 48, 117, -38, -356, -161, -139, 161, -12, -365, -178, -67, -92, 209, -129, -62, -28, -80, -48, 152, -72, 14, -125, 34, 86, -24, -12, 89, -103, -253, 11, -103, 80, -121, 154, -8, -19, 105, -226, 237, -164, 52, 115, 46, 29, -11, -71, 12, -30, 74, 295, -53, -204, 209, 206, -226, -10, -62, -239, 44, 6, 137, -119, 157, 271, -274, 24, 175, 47, -25, 154, 8, -146, 179, 125, 8, 15, 26, 19, -357, -6, 127, 73, 116, 16, -39, 39, -20, 51, 116, 58, -181, -91, -99, -162, -53, -143, 69, -107, 16, -21, 26, -43, 81, -99, -22, 159, -170, -84, -240, 26, -79, 85]
5953H5k24j7r6N90k20k13L55j63k27K17L4j3k15K82j73j53J88j54J58m6M0j14
5975g9rJ09k2J52p7R6j09j05J53j26L25k88k02L71l13N0M5J72j06J25j09j11N
5998e3r1J3P7O9J70k38P0lK6K8q2j1J00L75l45J19j32l70R7K08k61J98qj35oQ0
6024a05K11l46K03j42J12K13j33J17k84L22k79j40L8J23Q2j00J83j12M2p4M2M0
6046A3Q7j98L31j94j44P6J57k03K33j66J29j08k75Q0K66k50L2K06k28K68l81N00
6068B31k04O1j87j4J77j57p7L75j68j24L06pp5l15L96n43M27j14j91K36P2j69
6090f4O9L19J5n28K52n6r9m6M3J39J5R5j34L2l3N8o4P9j27L5k1j13K33n0q4J60
6116A25j84r2K53K50l57j52L26l17K47m9k13M29k74J6J13j41J06j97J39N9k04
$$ y = [85, -139, -156, -252, 338, 118, -95, 260, 97, -130, 87, 121, 108, -107, 175, 2, -151, 37, -117, 41, -5, 35, -79, -88, 21, -1, 151, 74, 170, 61, -44, 109, -17, 308, 20, -182, 189, -124, -74, -29, 143, 37, 162, 53, -58, -53, -144, -131, -54, 15, 185, -53, 17, 14, 40, 68, -14, -25, 75, 450, 105, 224, 92, -278, -181, 27, -234, -36, -44, -179, -185, -105, 106, -240, -37, -179, -67, 146, 13, 130, -154, 168, -111, -251, -213, -90, -8, -108, 75, -37, 5, -69, -27, 13, 100, -98, 233, 39, -105, -29, 128, -75, 158, -8, 121, 13, -262, -182, 84, -166, -134, 72, -156, 112, -269, 231, 27, 88, -99, -113, 64, -93, -170, 205, 37, -87, 219, 212, 137, -178, 218, -325, 102, -12, -203, 33, 105, -64, 5, 324, 339, -189, 63, 7, -92, -138, -95, 44, 59, 154, 20, 52, 19, 77, 13, 92, -35, 0, -21, -134, 99, 49, -35, 125, -59, -151, 102, 352, -5, -157, 169, -148, 99, 50, -163, 266, -8, 8, 121, -20, 86, -111, 28, 87, -117]
6137a17J14j97L6J22P8k07K95o1LL8l50K23J22L2l87P7K64l2K30l45J35k76J26
6160g7L7N8n2j51R7K22K8k30q0K51n8Q9k22J24j19K97j33j34J90k08j64K16k37
6183b56L10k5k06L43K36l78j69K28j12J34k87K77m4L6j59J09K4p1J98l60O7J08
6205Cm3j64K61O5n5j00L8J69l52J57m4l8L56j22q8k26n1M09K2j47l12K92k46K05
6229a1j28L89l42R5o7J72j15j14L31k07P2M6l08J36K6mr7K07j43P2K3N9k88K51
6253E5j52N0J07K38n67K22p4O8P0r6k50M41k54J67L8j27O0k17J13J82m1j75j9
6276a61K48Kj88P1J10o2L1J59j52n9J7j5K5l5M9j71q1J12N9o9K59n02K91K17j47
6301HK02l41R4r4M8J90O0k12j9K1J25j51Qj5N3j10K51j39J56l86L80l12K56k40
$$ y = [-117, -3, -200, -164, -42, 36, -171, 124, 63, 66, 104, -246, -23, 99, 131, -256, -179, 85, 53, 283, -62, 73, -203, -77, -40, 18, -34, -185, -88, 134, 162, -68, -148, 103, 45, 134, -88, 36, -83, 214, 81, -53, 137, -71, -235, -19, -256, 54, 29, -177, 166, 402, 24, -145, 83, -29, 105, -182, 95, 51, 87, -72, 37, 61, -10, 188, -172, -105, 3, -40, -204, 57, 122, 67, -33, 5, 174, -178, -21, -65, -103, 253, 131, 43, -183, -234, 175, 197, 50, -262, 30, -216, -11, -139, 250, -92, 3, -64, 108, -7, -121, 210, 3, 75, 121, -187, -51, -25, -29, -126, 81, -62, 10, 33, 92, -196, 55, -97, -47, 60, 298, -269, -47, -121, -53, 17, -79, -329, 112, -142, 25, 63, -64, -4, -221, -108, 74, 33, -142, -161, 87, 89, -99, -28, 82, 20, 51, 210, 58, -1, 16, 1, 26, -9, 40, -131, -212, -100, -41, -110, 149, -353, -62, 155, 8, 210, -131, -37, -131, -83, 107, 167, -45, -64, -43, 82, -69, -61, -76, -23, -133, 118, -21, 135, -251, 129, -183, 73, -167]
6325a67l6J34j73K82l34O8L51N5k81K06k47J74J30l29L65L1Jmn9k31l4J40l16
6348b74J22L4L06o6o3j40mr1q2K07J39m2J65k46J10j09j86K58J3J3J37l15R5k12
6372b31J68q4J00k54J62J81M6q2l6MP9J2k77K55J63j87j25J77P8j32J2j14J19
6395C4j1N7m9%R8k53L3o5L23o0j80J24J27j58n5o2R2L69n82K22R3j19J95O7k76
6420c6J09j77o6J09N2j15K84l41J1k57L36J84k83q5L00j56J4J59R6k67K20P5k03
6443c7k53J06J00j9R2J31j67J96n7l71L31n3N8N8P2k44L0L5o9qR6j9J32J2l93
6468b41M46Op2j77p6J79j54L04l61K83j24j26M1P8j09o0L81l30J94P5K5n8J45
6491B69j43j86J27J97%l26r0L09j75L8j21J78j66N3M1M5l5k8Q6k42K65l6o3J28
$$ y = [-167, -203, -69, -242, 40, -294, -226, 125, 180, -101, 105, -142, 32, 162, -167, 198, 229, 230, 226, 167, -64, -98, 42, -274, -152, -118, 188, 122, 59, -81, -85, -176, -258, -51, 88, 46, 211, -35, 75, -34, -220, 38, 51, 64, 201, -114, -19, -231, -63, -147, -47, -301, -139, 42, 88, 6, -30, -26, 53, 65, -212, 43, 206, 19, -106, 71, 149, 17, 29, -85, 34, 23, 80, 31, 31, 129, -124, -91, -156, 167, 107, -73, 51, 178, 20, -35, -97, -5, 364, -218, 4, 97, -22, 173, 240, -36, 73, -104, -170, -61, -9, -124, 160, -181, -170, -427, -91, 93, -190, -275, 25, -131, -117, 42, 138, -129, 91, 166, -37, -290, -184, -84, -103, -11, 120, -47, 149, 92, -279, 52, -1, 57, 115, 187, -57, -27, 8, -61, -69, 27, 8, 140, 152, -241, 205, 211, 139, -38, -114, 65, -89, 215, -146, 137, 13, -113, -72, 6, -103, -163, 218, -112, 82, 157, 182, 124, 269, 126, -60, 67, 264, 264, -62, -152, 157, -18, 20, -101, 77, -89, -36, 5, 50, 15, -13, 73, -169, 96, 60, -3, 125]
6515A25M7O1j17j28L28n02K21K10m17K30k44K0K57k59J55j86K92n5J0j68k03J57
6537a66K46J09j44k47K96r0j72J35J89k73K67qo0k14L36r6j61J15R2l83q3L60
6559D8K0j22rL4K12k72R8J20m9P1j95J58o3n6P2p7J32j77J49K14m94J54j80L4
6583a78K33j66J82l7j53J47J11j45Q6N0j01m0O7j03k23L76k63J13K18N6j17j97
6605h4K67l09L95k01K30m87M19k24k28J47j81J16o5J09K06J00q7j55J31m8p6K54
6627B29k77j80J77J4N2k24p5L25P0r1Q4p9k18N13l93R2R9k58L73k05j41p2L95
6650B10k0j51L5q7q2R5O8Pj98j24K62j02K69oj87O4o9M8P4j25j20l04L32j26J61
6675g6J55J93k61k7P3k02K98j59K28k48j15K71L8j37r1k34K80P4q7K4L4O7j52
$$ y = [125, 172, 233, 116, -12, 316, -186, 35, 245, -172, 58, -186, -166, 91, -168, -13, -199, 93, 38, 48, -120, -323, -166, 80, 189, 45, -202, 94, 4, -168, -33, 156, -117, 150, 142, 82, -132, 204, 108, -53, 62, 154, -229, -312, 48, 68, -54, -63, -29, 183, -89, 9, 129, 80, 151, -44, 114, 51, -5, 67, -10, 122, -55, 94, 308, -186, -32, -212, -178, 55, -111, 71, 34, -119, 28, 139, -6, 80, 130, 29, -11, 56, -47, -270, 106, -157, -44, 174, 230, 113, -84, 183, -126, 269, 68, 298, -189, 230, 6, -222, -75, -256, -140, -205, -96, 110, 210, 123, -32, 99, 51, -25, 229, -48, -228, -51, -37, 15, -209, -284, 41, 111, 20, 104, 25, -193, 320, -73, 19, 118, -140, 233, 28, -113, -185, 210, 190, 39, 74, -13, -95, 0, 68, 75, -123, -247, 15, -87, 182, 176, -11, 53, -16, 32, 106, -19, -139, -443, -111, -237, -76, 79, 272, 11, -16, 57, -145, 153, -6, 222, -26, -141, 130, 168, 31, -60, -294, -14, 60, -27, -3, 31, 98, -54]
6698e4k7r3J70q0R5n6m3J54K4k62q0N61j18l26K15k87K76J55k45P4j3l4J06k60
6722a48J87M1j32o8K98j74o0q2K96N3l9k21P3Jn3n1j63L66j81m1J7L6K84r7KK22
6748C66n98J98K38k12K2n0K61k92j3N7K70l29mR1l59L35o2r0L15k25K24j08n0
6771a5j16L99k87n9N3j7n1Q8k88M98j31j45O5Q7q2N6j82J82k9n2l0Q8m4k87K50
6796d9n9j7J9J71R0j74J41K7k00l7J69J31k62J49k71L06k32K8J83o1J95m52K18
6819A3o9j8J23r8K26k88Q0k8o1K4K03J20n19K86k3J04m7J00j26j58m9q6K68J71
6843A48l48J59J05N5k48l9K76k37K52K2k92R4J0K5K3J28J41l23L75l78k6n3J97
6866F6n1j08j58K38J37j61j71K75K0k52K17j28K59q2k26j31M85l39K91l28l4J
$$ y = [-54, -81, -174, -4, -84, 11, -45, -88, 66, 90, -172, -252, 309, 191, -135, 80, -207, 69, 224, -21, 53, 40, 6, 112, -148, 39, 80, -52, -120, 178, 4, -56, -138, 158, 211, 172, -49, 24, 25, -28, -79, -242, 124, -57, -98, -81, -45, 239, 142, 144, 366, -232, -34, 204, -8, 14, -36, 225, -67, -80, -23, 247, -82, -86, 5, -354, -19, -81, -171, 144, -81, 143, 35, -15, -131, 268, -19, -78, -25, -42, -93, -5, -293, 205, 74, -71, -6, 81, -1, 55, -127, 55, 26, -26, -56, 32, -12, -299, -49, -108, -125, -106, 65, 155, -19, 122, 149, -51, -88, 81, 212, -50, 99, -172, 134, -98, -70, 113, 52, 247, -205, 13, -56, -74, 49, -49, 177, -111, -31, -59, -120, -96, 107, 227, -292, -6, -29, 75, 28, 128, 2, -156, -205, -291, -23, 148, -200, -41, 64, 119, -129, -168, 108, -129, 123, 145, -147, -53, -43, -18, 5, 133, 274, -49, 326, -52, -78, -131, 66, 15, -93, -251, -13, 124, -37, -208, 67, 87, -165, 52, -76, 183, 101, -125, -256, 229, -110, 181, -147, -181, -180]
6888a80J84J67p6K21k73r3J24j58J50j61q2J22L18k65r4J87J69r8l4o2n0p6P1
6911A1l1m2K88j3j78j52J7O1%J7J65j18l6K38l00j6R3j18Q3m7p7j7J24K37j0k54
6937g5n7K97j80P1j84l5j63J80K39R3J17l25M5j3Q9k37Q0K3Q5J74k40J39J45l47
6961g9K48m56M42j71m84M58J28j28L12k15J45m18L96p7j78J13j65J02j40N2N8
6982e7K78l88P5K43j9l31K68Mj74l4N3jq1J77l09L82j81N0q6K49j66N7j92K10
7006B7M0l7J2k67K53k34K64r2J5M6l89N02k43k33L16Q1l26M9L07j50m4O0K11q5
7030H3K6j3r3m8j31L73j43k67K86P7o50M30j01O3J04q2Q4L7j53J48p0J08Qk57
7054a81J88m5j69K67J54k16j86K73j46M5J05J64k41Q9k46j07K93o4R6q0j7%j16
$$ y = [-180, 4, 171, 95, 316, 43, -50, 74, -84, 66, -95, -177, -55, 263, -2, -96, 91, 260, 162, 128, 66, 16, -60, 11, -20, -62, 226, 213, 35, -117, -100, -39, -39, -22, 143, 25, -11, 227, -73, -89, 4, -114, -31, -78, -155, -172, -48, 189, 179, -75, -132, 165, -15, 56, -128, -163, -326, -146, 93, 186, 303, -22, 23, 10, 99, -138, -58, -35, 50, 224, -16, 123, 268, -79, 169, -287, 155, -16, -500, -42, 86, -42, 270, 55, 200, -218, 178, 101, -77, 36, -129, -27, -167, -115, -57, 221, -167, -92, 151, 132, -199, 69, 73, -101, -135, -82, -83, -164, 13, -296, 86, -95, -45, -131, 118, -48, 9, -183, 27, 67, 30, 42, -225, 28, -206, 58, -34, -19, 27, -362, 140, -103, -336, -20, 61, -265, -216, 91, -59, -103, -43, 168, 83, 109, 96, 3, -45, -176, 197, 54, -213, 73, 150, -500, -70, -171, -108, -4, -86, -2, 35, -118, 30, -40, 68, 76, -181, 7, -38, -207, 60, 214, -2, -188, 85, -61, -16, 89, 253, 12, 101, -145, -252, 41, -23, 73, -7, -24, -24, -140]
7077a40J45J81j57n3R3J25j12k03L11k49K00J04j0k71N8j24J14K17l63J41J12
7098A19q7p4p1L7p3K47r2k05J46R1k61L92k20j3J28o6j76K08k76K43oL8oP2k6
7123F9k24L95m70J52L4J59j08K26J21l28k51M47l13P0j17K41K4k83l8K98k0n9
7145B5j50L7L37l39L8j03K92k95M89l02J94l82M38j36p2Oj89K31j12N5l8j07p0
7168a53K21o0k26J70n3K04O3j1l04P3o2O2RJ1JK52J2k03j47P7m2M9P2j30J64j64
7194a15K01j41o0K56j12J98k98J38m3N4n5L7K23m00m5K43N8j36l21M41n5N9q6
7217D1o6K06j33j7n8K26k84K26k92K41m1k17L94j16j23K7R9l96L89n4l09j4K97
7240B6J3Q9k31K14N4k08J20j12L5k82K37L51j49n83L87M7l4j18J21J8o2q1J75
$$ y = [-140, 5, 186, 29, -24, 69, 194, 82, -121, 190, -59, 141, 245, 235, -36, 22, -102, 12, 229, -134, 7, 119, 32, -42, -113, -76, -149, 98, 6, -199, -53, 38, -223, 169, -51, -64, 64, -2, -178, 30, -246, -3, -9, 29, 23, 95, 69, -155, 240, -230, -78, -44, 115, 7, 233, 354, 26, -225, 222, -91, -21, -138, 103, 127, -156, -194, 104, 84, 25, -125, -88, 249, -90, -52, -155, 137, -158, 331, 29, 223, -159, 279, 143, 71, 77, -112, 119, 7, 62, 24, -83, -153, 68, 8, -218, -48, -101, 103, 166, 155, -149, -76, -138, -76, -67, -56, -55, 197, 209, 6, -141, -64, -106, -57, 15, -115, 49, -115, 86, -55, -115, 141, 29, 227, -71, 67, 24, 78, 23, 60, 283, -117, -162, 81, 139, 3, -318, 123, 68, 127, 41, -25, 181, 48, 31, -27, 199, -85, 141, -151, 90, 49, -168, 226, 110, -13, 14, 113, -283, 106, 52, -257, -271, 26, 39, 128, -103, 111, 165, -43, 77, -35, 0, -282, -45, 306, 157, -426, -39, 8, -26, -144, -23, -5, -67, -148, 27]
7263B7M3j08K02k26L7k6P1M4j19j49J55j77K27r9J9K44m5L7k58O0j9K41j84J22
7287A19K5J57m75J90K0p4O6j3nl17O25j64n5K79k62k43K19M3j00k13L45k96R8
7310c1R4o5L6j28M06m09J9J97j61r0L58j87o5l73L62J0J59K3l48K73l61N36j20
7333A35j61j1J94l06J44n4K06q7k20K45N0J68n12J38M5J96L8l03L76m79K80j31
7355d9J80j01J07j87RJ51p5ml29q0M15K35n58L05m9j0j39J36j3K7k04L06O6j48
7379iJ65l7J88m08Q4l1r7K95k01k10K84j7l88N31p1n9J3k22J97J31q5k8k4K9n4
7404b4k00R1J43l5L0J1k7L1K06l72M3J03j8M7j4j04O8j48l2J45m3j7K55j31J45
7429A53K8k27J03j20K4jK84l14Qj44K06m4N3K81l49m9m7K77o5m0k17N9O3l4O9
$$ y = [27, 70, -38, 164, -62, -25, -51, 20, 64, -55, -204, -49, -226, 1, -98, -79, 165, 120, 157, -101, -41, -60, 181, -3, 119, 144, 301, -174, 16, 36, -38, 28, 15, 10, -307, 318, 154, 99, 378, 116, -127, 92, 135, 35, -178, 167, -129, -31, 63, -2, 34, -94, 312, -97, -78, 119, -42, -132, 226, 39, -26, -399, -37, -27, 132, 155, -193, 80, -281, 255, 135, -26, -37, 157, -149, -5, -59, 147, 60, -160, 85, 135, 303, -209, -71, -26, 170, 208, -95, 281, -198, 82, -49, 131, 30, 137, -50, -41, 110, 35, 31, -298, -378, 37, 272, -286, 19, -30, -40, -179, -43, -56, -29, -233, 73, 139, -9, 156, 119, 307, -101, -17, -48, -145, 150, -51, -261, 23, 6, -382, 149, 78, 19, 32, -190, 7, 138, 53, 25, 1, 30, -24, -224, -133, 10, -25, 5, 16, -11, 20, 226, -146, -103, 0, -18, 29, 15, -89, -21, -169, -201, -56, -99, -116, 139, 8, 153, 181, -46, 57, -63, -39, -40, 244, -70, -62, -206, 0, -44, 9, 290, -59, -108, -155, 122, 57, 17, -200, -141, -78, -112, -43]
7454d3LJ85k28J90m39K00K75j57R5l2K17j16j37j63J72r1J99j11j83K6k62L27
7476g3r3O87n21J49k66K27M7j1k23l6p3J67K7j44K25M9k76K1J3K14J63l02K34
7499B05q9j0OJ49l75K5J1j9N9J93k65J78q2q9rj12Q0K34j08k34O8L51j37k20K7
7524a63j2K00j84K31j7J74k02Ml0j05J1K86L7l16J63k79K3M07k12N3o3j01K06
7547A11q8K9J11k16J71l9l8m8J97k21j34J60Q8j10J25j13N8P8n1m9j56L12M3l19
7571i9J00p9l7q9K19N9K73k78p6J41k95K95m07K76M7J92k90L07k66K9J66k80L2
7594f0L04l87J58K36l84K7J52l35K61Kj76L27l8j52K09o9j20n9o4J3K89l1j81
7617g8J31j90m3K72K7k27O8J50m9J14O8j04k94J15L53l21K07k30J74L7k51J92
$$ y = [-43, -40, 145, -83, 107, -332, -132, 143, -14, 81, 49, 266, 150, 13, -150, 22, -69, 130, 19, -164, -138, -400, -73, -166, 521, 0, 149, -117, 110, 157, 146, -77, -113, -186, -19, 8, -136, 89, 138, -138, -117, -104, 110, 273, -29, 205, 116, 106, 112, 261, -114, -89, -78, -97, -38, 155, -110, 68, -14, -103, -112, -224, -144, 90, -18, -252, -184, 167, 30, -190, -163, -175, 25, -159, 72, 55, 229, 27, 31, 1, -104, -93, 193, 230, -86, 77, -202, -179, 228, 16, 69, 6, -95, 111, 23, 52, 163, -53, 118, 79, 41, -7, 190, -31, -165, -5, 83, -27, 98, -15, 43, 121, 70, 21, -135, 177, 220, -99, 1, -78, -115, -204, 15, 74, 347, 69, -7, 134, -161, 134, -273, 3, 50, 242, -48, 259, -7, 22, 188, -92, -60, 244, -143, 15, 251, -133, -106, 46, -289, -28, -26, -202, 125, 87, -65, 144, 75, -45, -104, -168, -155, 134, 103, -78, 53, -137, -180, 92, 119, -108, -40, 110, 61, 175, 243, 139, -155, -40, 313, -8, 199, -31, 143, 180, -71, 121]
7639A21j39l8p4J9J36o6J36R8l59K0K36l8J95l72K52k37k23M30J20k97J04p1L32
7662B85q2j30K87k99l53J34K08K53j48l37K32l1K11j53P4m23K93J02r7J75l98
7683a97J54O3mk16J23N5P0j63m5R8O7J26j03L8R2k0m2r0P1n2j25q0k5L57l27N47
7709C72l77o1J97k92P2kK40j96K32j53m9k90L19m2o9J97K9l46n0J72J14J57k27
7732e3P7P5K21l40m1L0K88j66K0k04J17j01J66l05M11p5j38k17L72k4j55M5r1
7755h8J09j18L5N2K1j58J93m48L20R1P1k8R3k37K82j05k39N2j27M39o6j41o3p4
7779a34M8M21k51m4K61m23r0m4K55k3R2O9m45L55k95K58n2K64r4J4j64qP0K7n7
7804A0j12J08M5kl8J89k98K19K60o51M84m10K24n5K24j26n9o0m3K58k86J96L8
$$ y = [121, -18, -56, -130, -111, 25, -41, 95, 193, -166, -146, 90, 52, 247, -125, 127, -110, -333, 97, 217, -80, 24, -47, 285, 203, 73, 360, 61, -292, -158, 50, 303, 155, -182, 50, 19, 230, 77, 151, -272, 21, 123, 26, 201, -197, -43, 20, 16, -200, -77, -22, 48, -115, -160, -62, 5, 131, 28, 66, 158, 138, 96, 6, 77, 25, -100, -180, -205, 152, -175, 372, -5, -66, 131, -161, -89, -91, 149, -47, 185, 32, -17, -307, 12, -30, -99, 98, 127, -219, -269, -97, 17, 174, -53, 24, 99, 320, -20, -61, -31, 257, 91, 111, -93, 24, -77, 89, -216, 195, 120, -18, -235, 137, 113, -42, 3, -88, 21, -97, -62, -10, 11, -147, 46, -402, -82, 9, 80, 52, 145, -92, 190, 85, -154, -102, -229, 210, 144, 3, -60, -134, -86, 335, 84, 40, 301, -122, -212, -256, -1, -24, 68, 137, -308, 47, -248, 10, -42, 222, 128, 142, -22, -30, 40, 67, 10, -102, 6, 51, 49, 11, 200, -98, 121, 381, -270, 214, -196, 28, -27, 197, 71, 12, -48, -91, 167, -119, 77, 115]
7827A15J35r9j10j40jj5L8j21K77p6k66M16j89J67k84J46J71j98J15J10l18J66
7849C9JoJ44j15j5N8j13k95J74L07j7k91N7l3J77q5p6L65k32k04J37Q6N3J0j8
7874A08L2Q3r0J80m28K83k14l7K52p4Q1J21m23K73l07N4j00K58l18Q5L91M3j24
7897A29j67N4l2mO5M5k05K28k40J19j32J89K22l08k9Q8L6J92j16j79m4K4q2K81
7921A34k13p1J20K83l39n6n3J93r6K49n3n0j14O4L40o2j53j40M7OK25l09r7l1
7945a76j7M79k43j84p4J33K47j52n0K00Jj71JP7kJ62M7k38R9r7o5j81K07P3k11
7970a35M51k12l82K16K6k33M54j74L28l85L03l70P5M0m5L10m86K74l00R2J50K4
7992B1k48L33k15J48J33k87J50j01J42m6J98m69J89J81O5k15J8O4M0j62k4K17
$$ y = [115, 250, 151, 41, -99, -100, -115, -77, -198, 79, 3, -263, 153, -36, 131, -153, -7, 164, -34, 81, 191, -127, 39, 40, 34, 178, 63, 48, 106, -7, -302, -128, 179, 162, -129, -72, -105, 72, -13, -89, 276, 44, -160, -23, 63, 116, 126, 108, 140, 223, 133, 313, -115, 168, -46, -83, 169, 95, 176, 297, -126, 147, -160, -106, -206, 52, -266, -181, 210, 253, 129, -38, 16, -16, -20, 45, 90, -115, 113, -127, -8, -140, 49, 271, -37, -66, 22, 58, 250, 134, -45, -89, -65, -147, 134, -79, -150, -30, 253, -86, -142, -195, -2, -98, 151, 98, 48, -66, -2, 338, 276, 123, -17, 30, 36, 261, -48, -145, -176, -193, 286, 43, -141, -215, -82, 165, 13, -37, 163, 164, -7, -6, 71, 69, 231, 278, 40, 139, 42, -23, -204, 3, 76, -135, 316, 104, -278, -62, -36, -269, 185, 11, 339, -46, 257, -113, -38, 2, -43, 267, -219, 55, -245, -153, -3, 21, -227, 106, -109, 39, 172, -115, 35, -66, 76, 30, 228, -241, -52, 129, 194, -21, -3, 61, 101, -61, -85, 132]
8014A32l64K31j94K22K5j01J40k38k49M11P5j55j12J31K4j35L8J93q7M0rj11N8
8037c5K14k64J11q5k21K39J21J50k41K6J34l52J08N3q7K31j01J52k7k27L05j75
8059B9k51L44k72J73j17J66M1r1j60J27J78j20J60j35J51m85J41l1N4n7K70j91
8081g6p4J28n0K62j02L1mk27J79j96J73J95k11P6j21j39N2M9J21P4ol37K05k07
8105b05L14m2k85m1L54j42m0K69j25J6o6J8R0j35J68l29J47oj0K14l39q7J27r
8129a44q4L97m6l23J15P2l0J16l96K15L85l74q5M40l04L9j24j0m2J49j2o6K23
8152A11j01k39K24K83k18J92j48k0k54K17o6L1M2j32J61k65M99o7j41k53o1K7
8174a78%K77k53L34k27L5Pq4Q7M1n6j27J75L06k92l33K02
$$ y = [132, -232, -1, -195, 27, 52, -49, 91, -147, -396, 15, 90, -65, -177, -46, -22, -157, -119, 74, -13, 27, 18, -93, -35, 179, -85, 26, -59, -280, -41, 80, 230, -11, 15, 149, -203, -95, -42, -129, 102, 1, 153, 126, -101, 204, 29, -222, 122, -150, 23, -94, 72, 113, 22, -138, -11, 167, 47, 207, 72, 223, -262, -121, -152, -98, -155, 115, -76, -150, -22, -72, 190, 88, 119, 115, -112, 67, -129, 44, 239, 28, 104, -17, -156, -104, -55, 66, 140, 134, -203, 2, -205, 109, 67, -218, -259, 95, -47, -87, 182, 57, 73, 7, 25, 115, -20, 148, -181, -34, -40, -50, 164, -175, -262, -135, -144, -228, 169, 123, -200, -85, -13, -43, 73, -323, -108, 277, -97, -182, 258, -46, -7, -131, -141, -183, -34, -46, -112, 111, 10, -229, -5, 278, 60, 252, 104, 84, -170, 47, -19, 12, 54, -78, 83, -182, 317, 250, 109, -144, -205, -178, -178, 99, -154, 180, -47, -12, -5, -89, -2, 39, -17, -144, 31, 337, 45, -288, -86]
8191h6
$$ Imaginary data points
##PAGE= N=2
##DATA TABLE= (X++(I..I)), XYDATA
0@%%%%%%%%%%%pJ4j4J4k1K8k8L5m3N0o3P7r1J05j24J46j69J95k24K56k91L31l75
34a99M24m80N40o05O77p56Q42r34J037j151J274j408J553j712J890k084K295k529
52a326K788l074L393l753M162m630N170n802O556p472Q614j0082J2052j4854J9180
67A0922k6820M4333j61531l3011K58904K263j08184j17698L6882K0655j531J1269
79f3547P9130K6887o3649p9056j6732L8010N8046L7929L6470m9206r3128n0353
91a39199N5805J08051M6441k5815o9498p1353j2181N9016J09092K4541p7198p6102
103f8400J0439N5733n656k2580L6877O9898j3274j21301n6421O7597J10923L6314
115A00149o1561o1161l6772M045M9314O3430K0506n8315n4463l777L1598J5130
$$ y = [0, 0, 0, 0, 0, 0, 0, 0, 0, 0, 0, 0, -7, 7, -7, 7, -14, 14, -14, 21, -22, 28, -35, 42, -49, 56, -68, 78, -91, 104, -120, 136, -155, 176, -199, 225, -255, 285, -320, 357, -399, 443, -491, 546, -605, 669, -739, 814, -898, 992, -1092, 1203, -1326, 1462, -1612, 1781, -1972, 2190, -2440, 2730, -3072, 3484, -3988, 4626, -5456, 6596, -8258, 10922, -15898, 28435, -133096, -166107, 92797, 95060, -13124, -130822, -93940, -73285, -74816, -63547, 15583, 42470, -21179, -100235, -116967, -78957, -20911, 17018, 53488, 4282, -88846, -139199, -83394, 24657, 71098, 45283, -24215, -95568, -107749, -48733, 60359, 84900, 7702, -68400, -57961, -2228, -7884, -30464, 6413, 76311, 63037, -58264, -114685, -47088, 63835, 100149, 38588, -22573, -59345, -55300, -5986, 57444, 77950, 19635, -34828, -38605, -7007, 8123]
127H123n073K9293J7083k8443n5309k3277M1886M1741K4770k584l7677n6087l2363
140g7917N9015Q3138R586o9186n8457K1124L1599K850n590J9438K0642l5741l6067
153c5566j676K3709K0409O633K3557j0610o2587m4672M3918R2794J1265o4901
165B273n0800J8750L5675j1486k021K5608J7623k5442m2182O104K1677J1141Q274
178A5194K1540M899n6974m5093K8541P4303L0978m5332m0128o542J0233O423J8129
191A6171L4897n471l5325k8296Q971K2531k595J6759L0796m117n7599n2467L5467
204b0278P3097L0830l7527m5887j1844l922J7053L2643K9905p750n1185k5535
216b0400J0051K2888J3802J3547J7518k3701n0249k7288L2822N8820J5209j7154
$$ y = [8123, 3050, 32343, 49426, 20983, -34326, -57603, -15717, 26024, 50794, 48210, 10533, -45554, -77917, -18902, 64236, 73822, 4636, -53821, -32697, -1098, 1752, -3838, 15600, 36242, 501, -35566, -37242, -13533, 6876, 13509, 37066, 26456, -36131, -80803, -36885, 55909, 67174, 2273, -48527, -29777, 5898, -5588, -7609, 17999, 35622, 10180, -32002, -25898, -4221, 6920, 15194, 36734, 41633, -15341, -60434, -31893, 42410, 73388, 28056, -12072, -18614, -8381, -1958, 16171, 51068, 45597, 10272, -18024, -9053, 13478, 10883, 27642, 58438, 54321, -3278, -55745, -20278, 52819, 83649, 46122, 235, -11609, -15531, 1522, 34165, 64070, 56320, 5135, -20400, -10349, 12539, 26341, 39888, 57406, 33705, -16544, -43832, -11010, 47810, 63019, 45865]
228D5865l7063l4145j2613K5757O1934K2826l7895n7115j3213K9652J3294Q906
240A6190J7405J2340k8650o0075r173M6996N1471M000l0827k5390k8349r112K6952
253a6222N4807K7191m5157n4264j4900K6537K8725J4434J6020j1697l9709l6958
265e1193J1064N0508K3009m626j6279j8760k9459j9782M2159O3952J2379n9718
277C254n7904J0959L5782K1024K958Q294q66m2190l4294J5829N4372K7627k2887
290B1958k5576j7104q069j492K6022M4220J029l9795m0878jK9406K1103J6296
303B7119j434k0395l6239j3355L3101L2241N810j8141j2851n305j9372m64L0191
316I06L6781n624m4355k3252Q194K3448J0996O679P697j9048k8810j0562K5248
$$ y = [45865, 8802, -25343, -37956, -12199, 49735, 72561, 34666, -22449, -35662, -6010, 7284, 16190, 33595, 45935, 17285, -42790, -51963, -4967, 46504, 50504, 19677, -5713, -34062, -43174, -16222, 38585, 65776, 20619, -33645, -48545, -22008, 6717, 21151, 37171, 25474, -14235, -51193, -40129, 10379, 33388, 28762, 12483, -6277, -35736, -55518, -13359, 50593, 62972, 3254, -54650, -43691, -7909, 13115, 16073, 24367, 23501, -18689, -52983, -37154, 17218, 44845, 21958, -3618, -20722, -28791, -30283, -4261, 39959, 40988, 1193, -39685, -39686, -10280, 10823, 27119, 25685, 5290, -30949, -44304, -11203, 21038, 26848, 8707, -4144, -9449, -28821, -29285, 906, 37687, 32063, -12292, -35544, -27350, -3902, 7094, 13773, 21470, 2422, -26388, -36950, -11702]
329a1702K9948m83j0482j1250q431j3352M41L1552K0437q739k8703j4230P391
342a7603M211J1306J6475R271k0881l4033M99K3794K0489l140p456K102j4638
355i604j8001J781L0825K2956j5638k1754r118M988p39M655K5958R517k1204l3257
369b8635j845K7188J1993n50j262K759j5633k6208O977L1492K2851j4151k4419
382i443l383k356j162Q192K6614J2684k7087k9945m326K3967J5439J549N917n849
396A0811k0660k3256R174L6984J6571j1652k2886q173l980k479J9870K5961O970
409C3255l0281l1339L000J9402J8753O563K827r848l0027j4470J6669L6519J3157
422C4180j7403j7760j3955m310M667K4825K6982p614l1938k5507P769K1646J3107
$$ y = [-11702, 18246, 17763, 7281, -3969, -12400, -25752, -25311, 6241, 26678, 17939, -10764, -24994, -17603, -13392, -2086, 14389, 23660, 2779, -31254, -30755, -6961, 13528, 10388, 2932, 5034, -9604, -27605, -25824, 5001, 27957, 12319, -9435, -18553, -13565, -14304, -9649, 16309, 25826, 4622, -28635, -30480, -3292, 8701, 8151, 6889, 9648, -5985, -32193, -25216, 6276, 29127, 14976, -9443, -12826, -15182, -16344, -8152, 18462, 31146, 4059, -25886, -30212, -6245, 9194, 10743, 16660, 10811, -9849, -33105, -23931, 13053, 29624, 17972, -4914, -13087, -17067, -19546, 324, 26285, 33255, 2974, -28365, -25365, -5963, 12790, 19353, 22180, 12332, -17695, -32165, -15496, 21023, 34180, 16777, -983, -14938, -19248, -14581, 10244, 37226, 29612, -2326, -27833, -20064, 1582, 14689]
435A4689J1692k069j7057k8955r341K8507L0000O234j9542j7421r595p279J2268
448g869K5901K1308j4957l5750j3544J0160K0370J1139P305j17k4026k5414j565
461b7059L1448K6612n549j7336j5896o188m165J1106K9078J2362j9064l3368p919
474b5938J6698J4268J0422L956k851k2380k3960Q263K8432K0863r612j8409q654
487h902p276j61J1514K5413Q187k4706k4543l401J8549J1991L473N819o555j7988
501h586j8452R618K7581J1501q200j7061n913l618j383J4566J7301M016k1441
514g1j8034L224R941R297L653O171m644k1268r987J0702K1805N276r538o091m929
529d493n305n280J3996J9627j630j6835j5575M507Q687K284O853N590k829j8349
$$ y = [14689, 26381, 24312, 7255, -21700, -31041, -2534, 27466, 33700, 14158, -3263, -12858, -20137, -7869, 18032, 39340, 24383, -11367, -24911, -14751, 5619, 16758, 24063, 23946, -80, -25494, -27059, 4389, 31001, 25452, 8116, -7780, -13968, -18133, -7027, 22051, 34413, 15349, -18019, -25938, -9240, 5028, 15450, 19406, 16555, -5825, -29785, -21522, 6910, 27773, 18161, -248, -8902, -16178, -16339, -4825, 20588, 28775, 4069, -20474, -23875, -5326, 6665, 10138, 15957, 9402, -8586, -27038, -17420, 10161, 21662, 13462, -3599, -9512, -13130, -14513, 53, 17354, 21370, -71, -18105, -14881, -4940, 4357, 8010, 14181, 9537, -11731, -21718, -11016, 10789, 16065, 6527, 436, -4493, -9798, -15078, -1082, 18545, 16915, 80, -15495, -10988, -2301, -17, 6836, 12426, 9597, -8752]
543h752j0535R948J4765P316n812l760n911j1840R8J3302J7051k676j5705p466
557i977l47K551J546J2144J0992r914j8923j0442J3745J3475J309l20k018o464
571b643j5358k053J9342J5764j960j7184p665O45j644O261J2652J1512j1822k2589
585a6742n173J1725J4608J414M42n23j2309j3381j141K1421J7019m990j4918j1578
599a4126K64J610Q483J4973M368j1338k0802l783J0786J1767Q620P38n519j8210
613a2169j1971J1000K0464J1518j0673j1926m671n280L90J0211K1137L504k2020
626d86k1310P05J9865J0982L20p87o899j1514j1722Q689K1866J0389p600j8623
640f125q132k2P687J4382Q551k894j7989j1799K976R788J1355N677N48j3834j8406
$$ y = [-8752, -19287, -9339, 5426, 12742, 6930, 3170, -2741, -14581, -14483, -1181, 15870, 13194, -2511, -9977, -10324, -7773, -6227, 5917, 16909, 6995, -11928, -22370, -8625, 4850, 6159, 5839, 3821, -2643, -18001, -20054, -712, 15052, 13092, -4092, -11757, -11112, -12756, -6495, 6157, 17669, 5847, -16742, -21915, -10190, 4418, 5832, 6274, 5751, -6558, -19939, -21080, 341, 17360, 12370, -2548, -14126, -13862, -12252, -3769, 11204, 15572, 4234, -16568, -20351, -9565, 2202, 10822, 11560, 6041, -12169, -24140, -13140, 7324, 18842, 8169, -3757, -8428, -13708, -13318, -3107, 18030, 21534, -486, -21796, -21091, -1226, 9756, 10076, 9289, 2390, -9124, -20846, -12157, 9709, 20098, 12498, -6125, -14257, -14279, -6592, 7790, 16341, 13447, -4542, -16341, -13365, -3577, 7778, 13455, 14003, 169, -18237]
655a8237r23J7391J9903k533j3602p308k984m32N58J4150J4253o540k0532j3463
669b0299J0466J4486O186o6m371o148j2942j357J4433J3825K187j2353r793l945
683i691J062Q331J0940O227j0541j3778l186N344Q504L284N442o01j3269j2185
697a4117J841J8710J0144o044j0179m657J121k721L802J1684N853p677j5427k854
711a0521P959O703L655M73K47r587q942K345J0717R698l610n545n544m928P37
726f143O453J1585J68j0068p324M05M917p83L569Q077O9j1187j2977N322J3995
741F078N242l565o786n00m150l512N278J0482N760r901r330j696L428M703L009
756D540O153k142r921o781R04R898M781K218j889p865q268k300J2772J1047j735
$$ y = [-18237, -19160, -1769, 18134, 15601, 1999, -5309, -8293, -8725, -8167, 5983, 20236, 13696, -6836, -20299, -9833, 4653, 10839, 10773, 6402, 254, -12688, -14045, 388, 14213, 16400, 4047, -5746, -9691, -8629, -298, 10642, 16869, 6328, -7450, -10636, -5292, 3212, 6496, 11938, 11337, -1932, -14117, -12276, 6434, 16578, 10534, 355, -4302, -3181, -5902, -2100, 9584, 15437, 7760, -7667, -10521, -2562, 4141, 7796, 8269, 8516, -1071, -10013, -7668, 3049, 12747, 9137, 3592, -1952, -6880, -6143, 310, 11895, 12063, 1995, -5329, -4924, -7, -790, 2779, 10856, 10925, -262, -13239, -7917, 6078, 11320, 7755, 969, 469, -3681, -7193, -1915, 8567, 14327, 4426, -4904, -6600, -3172, 1531, 4540, 10693, 8551, -1370, -8151, -7247, 2651, 7432, 9650, 7761, -104, -8372, -10672, 2100, 13147, 11412]
771A1412r152p713K015M12Q19P642P254j688j4978p681M991J0350O472j941j976
786F238p239q355l24J0296J2781j474j0195p387j731L170K868R039M868o417j1823
801e685p391P651Q834M791J41m161p091r248K053J1786J0509q71j1784p597k205
816a0268L676Q789O921J131j0182r590l31N087O758K856L936l540j1980r095N046
831a0786J7507P155q141j1112m096L656N04M759P964K847q359j4596j034J0331
845c401J0208J734n823l796o392k077L694Q672O892l497p020q419k436P326R571
860E236O858o880j1192m107M394P188M47K066K409l708r962o286J0161J2716J775
875A1115r008q343Q64P08K268M419N898L5j0946o695J999Q215O144j289j993n391
$$ y = [11412, 2260, -5453, -3438, -3026, -2207, 5435, 12689, 11001, -3977, -11658, -6667, 3683, 10155, 8214, 6238, -1001, -9356, -9680, 616, 13397, 11923, 1728, -5659, -7390, -4220, -1352, 7687, 12555, 6138, -5685, -13076, -5425, 3409, 8200, 8341, 4180, -2911, -12159, -10106, 1680, 12189, 11318, -466, -8063, -10268, -6592, 2197, 9118, 10249, 67, -9523, -9854, -4767, 1991, 4847, 8783, 5243, -6737, -15832, -10786, 6721, 13876, 5735, -5377, -9473, -5817, -5313, -554, 7410, 10257, 1898, -12698, -13732, -3401, 6807, 8541, 2718, -1078, -7470, -9547, -5853, 2819, 9711, 6214, -806, -9225, -11661, -4335, 5236, 12094, 5214, -5978, -10085, -5691, 1497, 1944, 4010, 6419, 2711, -7251, -13537, -3376, 9340, 11115, 2107, -6236, -5372, -4664, -2396, 2023, 7921, 7956, -2990, -9685, -7686, 529, 6673, 5384, 3391, -2000]
891b000m197j17M704P020j70k017m645m106j145K832R031L991n609q656l258N519
907b823L177J928J477K98l169q354l36O607O918L73n828k008k865j122K399O068
923B740N401m819o751l652K320M707K022L093j144n027n440p22P101M371P94l264
939A730l011k487l413M000P123L836l752q092j596J338L396L364K865J65o788
954a322n479L69O377N456p48j165l827m190j736L408Q547K167m100o933k547K108
970c615K097M982L692j540p130o541K934O113M725O4k788k708n888o93N484O903
986F091K734o444n417k958K145L796L815M425l972p265m766K584P550K996L87
1001E701k907m510m341o66P315O475L10o286o154j83O91M690M774K097l304q922
$$ y = [-2000, -6197, -6314, -1610, 5410, 5240, 3223, -1422, -5528, -6673, -3841, 5190, 9181, 3572, -5084, -8342, -2823, 354, 2282, 3759, 4057, 888, -7466, -7802, -1195, 5723, 6096, 268, -1740, -4605, -5727, -3328, 2740, 8141, 3322, -3429, -7081, -4761, -54, 1968, 5061, 3917, -1110, -6550, -7272, -171, 4200, 4994, 1730, -1281, -3768, -7181, -3181, 3942, 7778, 4026, -4066, -5662, -4324, -928, 2436, 5301, 5466, -1322, -6801, -6432, -55, 5401, 4653, 3488, -339, -4529, -6265, -2857, 5690, 7857, 3757, -3176, -5723, -3615, -1518, 3464, 7156, 5616, -1514, -8055, -5121, 992, 5717, 5781, 2993, 285, -5603, -6296, -812, 6091, 8825, 2381, -3036, -5994, -3849, -53, 3762, 8187, 4215, -3050, -7816, -5232, 2318, 5314, 5701, 2794, -1716, -6057, -6723, 592, 7067, 7377, 1091, -5063, -5246, -4555, 135, 4909, 7006, 3702, -5220]
1017e220k666L403O903L221j370k246n566l040J019O257O667k056n398m758j048
1032e898K247L737N682M1m860o718j782N105M389L025j293l229m063l828K995
1047d450O473M717k644n795k906n14K353L879L890O20o299m675q41M258N069J007
1063D142l85l645m071k097K759P095J878k315m959k393L60J041M775K775j55n432
1079f27n050J842L318L398J146r56k061m453j462K600N846K183l388l046k409
1094c119pJ477L049M216j908m076m029N98L648K124J816m82k717l825k050M035
1110a250M326J858k733l273j335j354J948L151L557j091n323k153l88L489K463
1125A892J063O00l794l489j038L198M537P41j289l479j795q39J300M840K225j238
$$ y = [-5220, -7886, -4483, 2420, 5641, 4271, 2025, -3541, -6581, -5562, 695, 7362, 5306, -92, -4850, -5898, -3651, 86, 5768, 5809, 949, -5769, -7551, -2446, 1943, 4968, 3675, 446, -3617, -7445, -4450, 2023, 6740, 4096, -1699, -4605, -5119, -2766, 1113, 5003, 5623, -676, -5351, -6192, -1934, 3135, 4142, 3757, 112, -3959, -6056, -3297, 3798, 5676, 3361, -1598, -3991, -3631, -2590, 2185, 4960, 4805, -627, -5677, -3835, -517, 2881, 4027, 3071, 1010, -3443, -4905, -2305, 3541, 5724, 2336, -710, -3119, -3126, -1649, 1400, 5616, 3708, -368, -4397, -3799, -151, 1973, 3789, 3307, 590, -3235, -5285, -1250, 3076, 4934, 2201, -1072, -2407, -3761, -1813, 1338, 4895, 3804, -1519, -3672, -4060, -571, 1892, 2955, 3555, -239, -3728, -4766, -1568, 2969, 3710, 2421, -1058, -2853, -3692, -2392, 2448, 4673, 3435]
1141C435m915k940J560J635L182J423L33l514n050M97L019M430J276k682k047
1156c58k944l90J662M642K843l016l790k717R72K421K374K897j263l832m008M7
1172d460M437K985J408k163k593k783j032L335M290K089l003m560j317J30L078
1187a59K702J863j109m645l141O47M579L133j98j481l325k265o77L506M485Q26
1203D741k730m621j312J448K239L319Q75j297m769k803K262L132L268l56k189
1218A207k424l170R56L349L997K74l808k992j392J720K223K884J088k921l487
1233b496k562K694L636J268L22k344k771j766Q90L557K933l2l677k480n55O74
1249b709K881K228O61k201m267o35J616L537J480k80j549l537q03O18L812K495
$$ y = [3435, -1480, -4420, -2860, -1225, 1957, 3380, 3713, 199, -4851, -4354, -1335, 3095, 4371, 1689, -358, -3302, -3692, -2030, 2612, 5455, 2439, -1351, -4068, -3096, -675, 1699, 4596, 3333, -499, -4507, -4460, -23, 2962, 4370, 2207, -386, -3169, -4201, -866, 3424, 5513, 2510, -2050, -3367, -3237, -159, 2543, 4406, 3297, -1348, -4489, -3842, 737, 3870, 3672, 2191, -1134, -3399, -4076, -570, 3915, 4741, 2011, -2610, -3922, -2474, -235, 3084, 3959, 2662, -2107, -4910, -2648, 484, 3752, 3396, 1207, -1217, -4387, -3431, -82, 3915, 4189, 381, -2611, -4003, -2283, -60, 2824, 3912, 991, -2496, -5058, -2364, 1272, 2540, 2862, 518, -2253, -4019, -3129, 428, 3361, 3329, -348, -2828, -3383, -2709, 172, 2400, 3061, 860, -3407, -4042, -2426, 1111, 2591, 2311, 762, -2775, -3578, -2960, 852, 3347]
1265C347j122k407k527m41J101K113K771j53k236l708m97K184K391J902r12j182
1281F24k938j827K458K715J985j330k365j282q73J020J827K644L90l138k732r11
1297c733K407K343J040L19k596j474j771J570L175J414m15l063j406m46P21K828
1313I13J380K67k622k339K9O03K842J351P2k023l346n34K086L205J093j565j606
1330a94j904k16O42K606K148q76k031l010m2J976K027J569n18j396l364o49K265
1347i67K493J804j692j928j928J4J621J895J755j057k718j310k78J904J593J576
1363B777J16k782k614q50L049K650Q72j124k814j300p12K311K579R25q70k954
1379g41j348M38J296K190Q47k1k855k236J82J886L014L65j174k225j818M45J556
$$ y = [3347, 2225, -182, -2709, -3150, -2049, 64, 2835, 2682, 446, -3262, -3759, -1575, 816, 2718, 1806, 624, -2314, -4141, -1683, 1032, 3017, 1687, -678, -1960, -2833, -1813, 14, 2658, 3048, -90, -2822, -3733, -1326, 1017, 2057, 2376, -220, -1694, -3465, -1895, 1280, 2694, 2279, -784, -2190, -2636, -1915, 913, 2293, 2560, -62, -2401, -2372, -1769, 1073, 2424, 2496, 473, -2873, -3407, -1321, 1884, 2977, 1412, -194, -2098, -2314, -1672, 934, 3082, 2206, 175, -2835, -2877, -901, 1126, 2695, 2177, 781, -2583, -3232, -967, 1526, 3330, 1638, -290, -2218, -2204, -583, 1312, 3067, 2010, -708, -2018, -2296, -392, 1201, 2777, 2893, 111, -2503, -3353, -304, 2346, 3218, 2094, -720, -2020, -2732, -421, 2158, 3083, 2213, -741, -2089, -1651, -355, 1835, 2682, 2661, -194, -2430, -2248, -362, 2652, 3017, 1843, -382, -2200, -1755, -199]
1396a99K459J127j697k492j473R25J820J546R14j098j602k512M60K204J737J380
1412C499j922j997j922M58K686J933M33k013k137n31M23J567J556P91q93k567
1428f36j266L05K111J833K66j172k024j202J12K013K439J00j521k669p62J055
1444a018J607J660j53q43k052r56N78J597J648l1o38k150j502N00J920K423k53
1461B337j785k060m73J162J105J544N13j904j560r90R12J725J079K23j008j675
1477h55j420J28K514J650J74j922j656j099J005J836J020O1j442j544l25Q10J393
1494C28M01Q39j029j792r76M19K191J458k37j469j697l80M33J841J327o4j515
1511G8k204J54R11J489R14m54n30j569q17J60J865J389k11j167j585p79R72J633
$$ y = [-199, 2260, 3387, 1690, -802, -2275, -1350, 470, 2016, 2930, 1832, 230, -2282, -1822, 382, 2119, 3499, 1577, -420, -2342, -1884, 802, 2735, 3168, 1155, -982, -1513, -1090, 477, 2033, 2824, 1931, -636, -1902, -1597, 514, 2347, 2613, 1441, -583, -1785, -1673, 340, 2779, 2879, 1358, -1311, -2073, -1018, 589, 2249, 2096, 1253, -799, -1755, -1177, 420, 2068, 2037, 1399, -751, -2253, -1753, 167, 2590, 2337, 552, -1508, -1981, -819, 286, 1830, 2343, 439, -1121, -2111, -1199, 526, 1605, 1828, 820, -855, -2275, -2147, 367, 2017, 2191, 269, -1387, -2486, -1481, 355, 1375, 1436, -6, -1550, -1875, -1065, 328, 729, 1568, 539, -1253, -2229, -1810, 381, 1839, 1602, 133, -1564, -1944, -1511, 330, 1657, 1593, 78, -2126, -1972, -1061, 428, 1342, 888, 358, -1211, -2028, -1868, -3, 1386, 1175, 8, -1577, -2356, -1384, 249]
1529B49J543m66j837j152m89J458R18J030k49r33j566r99J152J663Q56K4j672
1546d70j125r10J243J532J157l7k107j241j37J310J448O87l27j665j249j62P90
1563a263J556R95n38j031j430l27O90K234P43n25j444j913N87O58J551P27m55
1580H15j503j307K40J008J616P35p69j223j139j45Q51J550R54q44j660p71m28
1597b020J690J358N00p35j287j096j68J153J683M20p83j175r41j82J114J620L80
1614A531m63j535j029K02J099J383K58m44j953l05J03J259J083J00k87j674n71
1631a243J87P26J665J58p80j030j221N34R33J242K83n72j077j381N39J127R76
1648A066N95r79j067q32K63R49R81P94j208p02j170N03J075R16O36r56j158p95
$$ y = [249, 1792, 1326, -511, -1663, -2152, -694, 224, 1254, 1005, 72, -1494, -2493, -1341, 322, 1178, 1202, -470, -1595, -2505, -1262, 270, 1427, 1390, -717, -1958, -2095, -785, 663, 1350, 1023, -642, -1891, -2053, -1263, 293, 1288, 750, -281, -1711, -2038, -1348, 886, 1629, 1104, -340, -2253, -1666, -1008, 543, 1270, 815, -688, -1995, -1755, -747, 869, 1604, 835, -388, -1527, -1672, -821, 729, 1683, 839, -821, -1592, -2020, -330, 1028, 1528, 793, -494, -1590, -1758, -605, 1078, 1498, 715, -460, -1401, -1583, -469, 1151, 1531, 1068, -467, -1496, -1294, -195, 1188, 1446, 1002, -951, -1256, -1153, 106, 1189, 1289, 1002, -672, -1243, -1056, -330, 1335, 1493, 713, -317, -1538, -1004, -71, 1171, 1454, 882, -195, -1576, -1037, 90, 1066, 1661, 682, -385, -1217, -954, -5, 976, 1770, 562, -140, -1310, -807, 268, 1184, 1820, 864, -294, -1089]
1666a089J51J208J166J21p18j361m84J38J018J016K75q62j017l51k31J433R01
1683A314nm90j665l12K80J431Q30O0q25j480l47L67J065J168j94n72r93n90K49
1702g09J210J028k08o86j343o99Q31J030R52j86o76r64q87O21R95R38J37j243
1720A41p88m84L22J150P88j8q34j346mL45R30Q03J27p97q68k43r7J567L60r5o11
1741C48j354k47M87J114R24q1r18j217k71P00R97N31j65p81j025n23J059Q53O88
1760A119n06m49j270n8M73J033N26r1o85r51n38P20J003J000o22p27q52l41Q19
1779c97P05Q59n30q11n62n32Q87Q74M06j41q75r19o3N54Q75P24m45q98r36j63
1799a388P31J198L85j86j040q22kP75R01K84l11o47p54p5L89R37N45l24q86r06
$$ y = [-1089, -938, 270, 1436, 1557, 839, -522, -1006, -868, 150, 1166, 1441, 579, -438, -789, -1020, 413, 1314, 1309, 819, -846, -1158, -878, 553, 1383, 1443, 618, -862, -1209, -842, 223, 1391, 1197, 625, -368, -958, -709, 501, 1529, 1321, 635, -708, -1407, -576, 454, 1406, 1220, 544, -420, -1307, -686, 309, 1247, 1384, 141, -647, -1131, -809, 341, 1129, 1111, 277, -1069, -1073, -728, 202, 1005, 1132, 335, -533, -776, -873, 694, 1054, 959, 348, -1006, -1253, -766, 348, 1272, 1191, 273, -944, -1215, -515, 482, 1013, 848, 67, -958, -1481, -422, 431, 1119, 613, 164, -1106, -1164, -691, 342, 868, 777, 92, -859, -1397, -677, 326, 1326, 704, -23, -875, -1216, -397, 308, 1167, 637, -174, -736, -1268, -381, 493, 899, 758, -117, -1036, -1099, -545, 330, 1054, 609, -289, -1225, -1388, -657, 541, 926, 740, -300, -1122, -1124, -349, 552, 836, 525, -122, -876, -951, -562, 375, 920, 596, -290, -1196]
1819a196K24O97R42J45k95m68j001o9P75P76N49p53n66p29L02K45Q57L32m53p45
1839d31l94j04M87R15N43n77j029k88j04J191L74N45o04p24p25R7P00P87J98l09
1859E48o40n79j3Q38M98O1j78r72m97K01O45P10J96k92j046m13K9R28O66J3l00
1880D03r22o26O11M00R67J05n75o90m32K00Q49N07K43o74p69l04M89M47O38K8
1900H95n03r00j26K65K81Q85J73o83o18m06J41P66P08j80o96o75j3L05M10P81
1920H10Pn16n38l80J6R66L64R5o07p48K7M8L98Q25n3n73n94n7K29N39O67k92l00
1943C33p60j06K00P07L12j16m84o75P0J90M74O46N6o41p02P7L4N81L89J84r43
1964a74j48n56N59N14M53k5l93q82k18N96Q13j13K25n12n85q5N5R15J88N4p59
$$ y = [-1196, -972, -275, 667, 812, 517, 49, -952, -1021, -246, 530, 1079, 326, -240, -969, -667, -422, 435, 767, 314, -431, -825, -929, -442, 473, 1016, 439, -590, -878, -982, 209, 583, 1128, 524, -200, -925, -828, -128, 659, 857, 548, -92, -671, -684, 154, 652, 713, 535, -437, -934, -733, -88, 622, 818, 526, -520, -933, -904, 24, 690, 703, 403, -519, -1145, -534, -134, 833, 938, 363, -327, -759, -559, 290, 797, 1040, 366, -403, -707, -218, 229, 867, 895, 392, -508, -634, -369, -88, 797, 970, 287, -331, -737, -596, 170, 878, 698, 2, -673, -686, -381, 29, 810, 817, 301, -237, -617, -601, 365, 729, 824, 217, -531, -504, -456, -58, 767, 714, 141, -453, -510, -281, 258, 925, 633, 333, -427, -533, -333, 374, 686, 570, 86, -589, -519, -329, 145, 791, 847, 206, -496, -419, -385, 196, 585, 769, -174, -322, -878, -319, 195, 648, 623, 230, -652, -870, -274, 539, 426, 651, 139, -446, -531, -476, 439, 627, 681, -78]
1985g8n94qN10M36M62K7q52p23L60J20Q73J44k37j72o12m25L72Q44N74l20q29
2006a28k30k23L87L25N37j72l74q53J58K78M57O16l83m19n54k61M71Q15J79j35
2026D91o69l94N4J54O55K38q2p20k24l71O23O64O2L7p30l53l57Q03M60L65o12
2047I4m37j67J31L29L69J62k66n45k97M9L02P05K80m78k87n92J3N36N25J81l03
2068C04o19k81m5O85N07M5k85n44l26j0K57P11J58k26n85m03K24M16J22L34l76
2089F3k53m42M1O80M55J52p18n08j92L19N29J61L04l54o85k04J31M92O49K0m33
2110B07n38K8J27L8N04J45l75n59n8K19K85L00K97j50q53k41J88M96N93l0l35
2131B88o65m90N31M81J70J82m81k47j55j11N51J87L81l89o47j1J43L67M61L4m85
$$ y = [-78, -672, -680, -170, 266, 728, 755, -97, -820, -460, -340, 533, 677, 440, 268, -344, -769, -397, 447, 1021, 701, -128, -358, -581, -194, 131, 668, 496, 122, -731, -573, -295, 162, 778, 395, -24, -578, -839, -368, 447, 626, 491, -178, -572, -518, -364, 291, 529, 447, -273, -497, -868, -245, 419, 481, 518, -212, -565, -922, -119, 341, 706, 94, -343, -510, -379, -50, 319, 481, 215, -330, -627, -578, -276, 429, 709, 231, -56, -648, -635, -99, 426, 607, 304, -315, -596, -641, 44, 551, 596, 311, -233, -559, -569, -312, 399, 557, 331, -254, -657, -433, -17, 105, 439, 63, -190, -632, -591, 89, 544, 696, -22, -530, -722, -403, 126, 287, 591, 237, -448, -652, -521, -29, 620, 640, 207, -331, -303, -176, -138, 366, 511, 136, -423, -481, -262, 23, 323, 620, 470, -383, -624, -436, 60, 653, 623, 288, -377, -867, -336, 145, 315, 497, 16, -231, -386, -497, 54, 241, 622, 233, -414, -425, -282, 85, 546, 580, 95]
2152I5n55Q4Q9M60J30M27p89k42k30K81M84K5K27j61q15q2M0Q03J60k93J32q36
2174e66J96p7O30J03K35m44n66k9L43N73K3N0l53n50j0L94L6P01l00l75p13M70
2196b29k18Q36ol9l13j40n2j80M12L73K4n36l69m9M07J44L84J72l77p36K89L6
2218a67M12L77l80k01m75l10O03N34K21l23n11k20J20K31M59J22J7m63m45l61
2238g60P63K91J61j28n91j22J22L08P5O46p52j71k24O7L4M72K98l61p3l04j12
2259c61O6N91L14k34o50p4K9J78N08J05k01j65k39m05N00L34L80n06j93k1l76
2280d20K53N80MM1m16m86J29L99q0K30j11k82j41j51J77L29N22m22k18k87j6L13
2302e3K74K02m00j75r5J93N8J82L22k11l83j58J39J15M70l3l04m04Oj42L41N10
$$ y = [95, -460, -376, -287, 173, 303, 730, -59, -301, -531, -250, 234, 259, 486, 325, -490, -572, -532, 271, 431, 138, 270, -566, -370, -447, 183, 286, 521, 77, -489, -518, -175, 398, 421, 471, 118, -432, -442, -48, -12, 689, 389, 14, -699, -229, -447, 389, 383, 344, 31, -109, -161, -341, 71, 444, 468, -68, -437, -486, -79, 65, 449, 621, 244, -492, -203, -167, 245, 622, 242, 41, -434, -744, -141, 393, 614, 291, -220, -440, -320, -89, 370, 492, 509, 46, -399, -760, 3, 294, 455, 327, -264, -386, -264, 44, 119, 765, 13, -158, -382, -315, -281, 191, 489, 128, 55, -249, -361, -295, 296, 610, 376, -274, -348, -319, -141, 367, 472, 271, 106, -133, -538, -38, 296, 676, 170, -23, -44, -420, -167, 413, 417, 458, 42, -444, -315, 84, 4, 234, 123, -159, -300, -451, -274, 55, 577, 155, -63, -350, -366, -53, 221, 423, 23, -152, -247, -54, 4, 186, 508, 297, -86, -244, -105, 10, 480, 447, 143, -261, -255, -397, -56, 454]
2324D54q7k62k29l05O2M61J96n9n85Q8J2J4N98j55L7k02j35L0l00M57J57j1j13
2347A23l29P1J2k1N85j06k55k41j98J42K22K08o2M8k46r6k46N20K79K33n21m07
2369b85r3K60K53j72N14l93l90P2J12M76k62J10k11p8j71J01L61N8J09k58l78
2390b65q6J23R4K64J87k02l29k0J65M09J98k14n10J04l13L13K46K29J12l48n91
2411d34L2L00N9O07l81l02m7l34L12J93L57j53l99p7J58jJ49J30Ll30n8j43J50
2434b09L24K66p9m8m74k34L41J89o3J66l55Oj53L82L3J91j95k12k23L11L9K11
2456B14J47k74k68j48J94J60J24P1j93j37m7j60L72K49P4l52n7J21n11K71K75
2477A25P6mp4l25n6K55Q1K81j24n86J07O5J31Q9p0K97k86j73J13K07O8o7P5j31
$$ y = [454, 367, 105, -124, -429, -367, 94, 290, 231, -354, -266, -254, -240, 358, 203, 240, 38, -97, -67, -367, 90, 247, 236, 123, -206, -135, -123, -144, 441, 335, 80, -161, -359, -217, 5, 213, 151, 199, -47, -143, -389, 131, 410, 643, 122, -285, -378, -118, 135, -37, 477, 84, -306, -234, -122, 354, 92, 202, -9, -87, -258, -157, 204, 262, 371, 113, -265, -351, -228, -134, 130, 317, 115, -214, -234, -69, 340, 538, 324, -186, -82, -395, -82, 164, 393, 505, 157, -434, -402, -102, -43, 564, 183, -119, -166, -500, -188, 5, 362, 209, -190, -267, -109, -110, 39, 169, 172, -158, -216, -359, -209, 115, 381, 302, 254, -220, -454, -113, 76, 13, 179, -176, -170, -323, 59, 92, 283, 88, -124, -347, -36, 3, 214, 361, 87, -181, -329, -135, 25, 149, 220, 27, -110, -157, -317, 55, 304, 378, 26, -31, 90, -421, -150, 125, 201, 197, 123, -202, -258, -3, 78, 359, 235, -351, -244, -179, -48, 41, -29, 268, -18, -191, -78, 129, 197, 130, 205, 74]
2501G4r7l5M52m00J57O1l93J19J19k40L68L02m48j53k72M72j93L95J2j48m39k7
2523c14L09n5p1M78m20j27k1O2O7J67K35m17N7j63j08M49k25M34k29k60j97qK96
2546f1J92m1K9l09P8j49Q9L64l9o4k04j61pM07L3K32m00j90K2K86k58R6K44k99
2570a10o9O6K6L1L30k23K3j35k88L45O8M7J17k11rj0j64jJ17K69l23K28k88K29
2594F5l0K88l4j63j01j36n3K61j12O6J3j87q8K11m4K27r0l5k89L6J44K50j19j48
2618f8P5k22m2J01M42r8J74m26k2J5j18O2L60j34L1k01K4O9K69k11J37j38l11
2641b32O7M34m2L1j63l6k77q6N46k69J43J3l7k85P3m3J95K09j74k01j94J94K75
2664A41M6k16Q4M1k32kQJ02K15k20J39k49k08K15L02J48j46k73L1K4J51m2J91
$$ y = [74, -23, -58, 394, -6, 151, 212, -181, -62, 57, -183, 185, 487, 39, -114, -386, 86, -107, 288, 300, 152, -287, -314, -5, -60, -131, 347, -73, -200, -221, -159, -92, 75, 310, -107, -50, -213, -321, 128, -97, 337, 108, -152, -349, -357, -61, 131, 90, 119, -190, -112, -261, -172, 192, 153, 89, -115, -276, -283, 124, 157, 389, -11, -201, -179, 107, -151, -55, 189, -110, -179, -113, -87, -56, 274, 51, 74, -61, -349, -4, 64, 111, 228, 17, 8, -2, -166, -167, -50, 219, -104, 124, -164, 65, 35, 323, 289, 126, 25, -111, -164, 97, -15, 51, 64, -123, -211, 0, -44, 183, 93, 58, -231, -195, -51, 199, 80, -68, 7, -215, -257, -156, 286, 188, 362, -64, -86, -71, -189, -127, 233, 99, 130, -71, -47, 22, 291, 80, 217, 79, -232, -165, 269, 227, 258, 95, 59, -218, -304, 242, -27, 116, 129, 92, -193, -120, -163, 32, 241, 67, -134, -328, -134, 141, 187, -29, 55, 96, -136, -138, -130, -28, 187, -33, 106, -143, -351, -136, 166, 314, 168, -105, -74, -50, 101, 59, 250]
2687B50N4l59j20O6J12K17J76k74j28ol37K29M6K08k03l1k49j42M74j80K53q3
2709b7n7j04J09k66L37J83k18l12J27j48L97O4j4mm74K65k25O36M4k20p3j49o3
2732a92R2m9K01M9J25l73P2p8L32p2K32j26k67k00j53N37j00q8R4l34J50j2J70
2755A0P8k00j0N3p5K96p2N1j65K17k48j83J32j66L9L12K19l54l4q6L38j32Q9K6
2779A35j23J9n5J07r0pK9k10N8J60k75K44J85o7j70LO4k6J99K59k82l88Q7J64
2803B0J36J37o7j83mj6P8j48Q1K04k55J06j41J0MJ47j73K77j84k1j31J69K2J54
2827B22k04j85j60K69k95K20K66J23l97n1J12M35m03l0N7k35J67j5PJ80J78k42
2849A9m4K19k34J20J68j65J78n25K54k1K46n7J73m49j84K11j86M15M2j27L3k70
$$ y = [250, 304, -55, -175, -109, 3, 220, 396, 122, -6, -12, -349, -120, -74, 134, -69, -100, -349, -491, -17, -197, 56, -27, -84, -188, -79, -345, -8, 175, -43, -355, -228, -376, 21, 85, 71, 67, -407, -142, -367, 269, 313, 93, 20, -129, -192, -100, -149, 52, 101, 226, -147, -75, -153, 179, 107, 339, 213, -54, -254, -407, 130, 30, -58, 36, -298, -148, -160, 10, 88, -112, -122, -69, -144, 152, 80, 131, -34, 183, -65, -248, -116, -282, -243, 69, 288, -66, -100, -186, 152, 20, 109, 135, 12, 31, -24, 83, -7, -14, 15, -195, -137, 23, -252, -8, 177, 110, -60, -57, 7, -19, 180, 439, 157, -231, -144, 20, 156, 293, 226, 43, 39, 23, 101, -47, 34, 238, -17, 89, -52, -42, -38, 109, -64, 213, 29, 8, -123, 46, 68, 222, 18, -167, -327, -58, -353, -133, 133, 256, -141, -192, -80, 355, -48, -78, -21, -256, -89, -104, -97, 83, 261, 19, -25, 194, -40, 80, 248, 83, 261, -264, -10, -31, 215, 158, 331, -118, -302, -91, -277, 138, 180, 53, 86, -184]
2871a84J45k85N18l00J98k99L7J83l40M97k47m7J11l0k3m0J67o6n2k7o7Q4O2K85
2895B80k17Q5k2P4l59N6K37r8J6q9k26K39k12J28J68J2K43l54o3J81l5R7pk07
2919g3j42J93J95j70K45k95j6J33kq1l3R8kl7k9n3P2L18j60J76n23N7L9J53N2
2944A15L20l97k43J30P3o9J5j40J95n7K5Q0j39O1K1K89m40P1Q8q3j13M34l22L61
2968B75k87o7K1j9J14lnl8M6k73J71J66j99J42j83L43j06n2Q5r8j8k46K14j79
2992a96L79j49p7J02q1j56L33q7K63l76K4k00M06j93J13j33j79R9J2p3Q4L33j1
3015B37k56lj21m1J52L1J43l05J57Q7j45j68M20j44j5j48Q7J2K5J28l70R7L76
3038B36n50K58R1j94N58n82J80j06J62J58l75L46l19k29K89R1K2p8j4q8L15k59
$$ y = [-184, -39, -324, 194, -106, 92, -207, -170, 13, -327, 170, -77, -124, -13, -43, -66, -106, 61, -5, -57, -84, -151, -67, -5, 280, 63, 148, 126, 200, -159, -103, 134, 36, 52, -37, -263, -24, -236, -108, 60, 72, 315, -39, -102, 79, 44, 141, 134, -73, -215, -22, 173, 3, 248, -47, -63, 70, 68, -13, -46, 52, 50, 13, -16, -69, 3, 321, 161, 337, -186, -129, -90, 63, 115, 435, 38, -205, -75, -2, -71, -56, -196, -1, -58, -33, 47, -92, -31, -10, 279, -161, -90, -2, -85, -198, 236, -86, 275, -12, -79, -58, -77, 37, 34, 29, -9, 37, -236, -65, 101, -98, 44, -139, 204, 98, 46, 131, 33, 15, -231, -17, -196, 183, 34, -43, 59, -22, -178, 155, 68, 331, -45, -21, -221, 185, -8, 105, -28, -207, -108, -96, -169, -85, 248, 237, -19, -22, -143, -184, -32, -1, 142, -163, -6, 81, -64, -232, 188, 44, 29, -119, -32, -20, 5, 133, -237, -140, 236, -314, -56, 35, -159, 399, -183, -3, -109, 53, 211, -164, 182, -137, -366, -77, 14, 36, -42, -56, -144, 171, -88]
3060h8J07N0k73L32l9j97m47N37jJ28J27l50j46K58j57L98j57j6J56l84L6n4J92
3083A2J40k96M0r6L0K51j40K26q2j38j84J29M1R7l29K37j29J76k54R7K00J60j45
3106D3O8m1j37K22k04K10k7j00rJ03p6j73R2Kk5j20K62O2J47l09n8O1o9J99m13
3131b90M54j02P6nj96L20k98K61k00j8k01oP1J15K58j69l14O13m44k25J59K54
3153A13q3j75O8J25j56K04j45K81o7j08l43J74o9K49J89k1m7lm37K75K34J3j38
3176A33k71K49p2o7j05L23l12j5j8N8k4k6L38o8M7l09J51J29j04j06K32j92o1
3199i0K09kP3l48K07J2k81L21j47J90l15kJ17L6k3N8K0p7n1J66j82l2J03J9m5
3224f4l0J2J31J03Q0j66J10j07Q6k20n5J68L6J08K02n38M2k8K88l41K31L9N2k17
$$ y = [-88, 19, 69, -204, 128, 89, -108, -555, -18, -19, 109, 236, -114, -260, -2, -159, 239, 82, 66, 222, -162, -126, -180, 12, 152, -144, -104, -200, -170, 81, -59, 167, 85, -53, -237, -108, -67, 30, -299, -62, -191, -15, -269, -172, 28, 188, 43, 111, 70, -67, 155, -49, 161, 134, 34, 25, 128, 52, -121, -29, -27, -52, -172, 90, 152, 299, -10, -68, -7, -76, 123, -290, 164, 62, 138, 133, -63, 257, -41, 220, 20, 2, -199, -205, -134, -19, 239, 70, -244, 369, -75, -300, -141, 113, 30, -145, -77, 48, -108, 96, -49, 232, 165, 57, -286, -112, -181, 68, 257, 236, 189, 186, -251, 24, 258, 271, 133, -138, 111, 39, -28, -133, 190, -122, -137, -155, -97, -121, -147, 191, 123, 170, -139, 12, 141, 37, -69, 163, -29, -90, 119, 117, 190, -158, 49, 61, -220, 101, -46, 144, -171, -173, -56, -20, -43, 15, 35, -42, -93, 73, -109, -141, -38, -19, -64, -94, -82, 49, 152, 232, 66, 176, 69, 155, -65, -120, 48, 84, 192, 394, -144, -102, -130, 158, -183, 48, 87, 139, -78]
3248g8r4J93L26k19k08L9o4K60p9O5q8k95J31l04M40k0Rl45K65O2M1m2r0J24k53
3273b24L39k56Q8j02K49j20K7j18J04J9Rk37J79K39l2j66m4k0J77j45M37l61N0
3296I2l16j43K31J26K34k19R9k70P6J36R0k0k02j17M6K08p1o3K93k34j38K45j48
3319f5Q0K0n2J7r8K28J50l45K13j05k6q6l59N78j21p9k0P6M2rP8j45J24j68K81
3344B09k25o4n2L6J76r7O5J31m73L48k47K81j08k4r6J6J18Q0l40J46K94k54P2
3367hl5J94K04j49k51J72k65jR3J73j39P0p5n34O01j3J63n9Jk17J59nk12K79j42
3392DJ30k97K72m4m1j54j10M92k81j48K41N2l9R1j12qj28J33J46Pj82j77M03l36
3416h6J39K3j87Q7M3l13J53K64Q7J32m03n2K95k97J79o5J72k90jK02q9j00O2J29
$$ y = [-78, -172, 21, 347, 128, -80, -41, -105, 155, 76, 141, 53, -242, -111, -415, 25, 5, 14, -331, -66, -4, 37, -5, -95, 29, -224, 115, -141, -53, -155, 94, -26, 1, -117, -13, 6, 15, -222, -43, 196, 164, -2, -46, -66, 111, -34, 403, 42, 92, -224, -367, -136, -10, 224, 5, 104, -166, -90, 46, 136, 116, -86, -203, -157, 51, -20, -83, 210, -24, -162, 83, -65, 15, 35, -17, 0, -98, 130, 280, -65, 148, 43, 17, -69, -428, 150, 29, -50, -70, 6, 48, 39, 117, -28, 96, -72, 209, -16, -80, -132, -96, 80, -17, 48, 179, -294, 54, -193, 88, -20, -44, -140, -124, -6, 74, -266, -120, 174, -80, -8, -43, 151, 355, 206, -45, 127, -138, -139, -46, 127, -12, 58, -17, -551, 50, 37, 200, 141, 142, -75, 84, 79, -133, 146, 4, 134, -163, 109, 65, 24, -130, -240, 252, -29, -177, 64, 116, 77, 168, 56, 48, -80, 53, 199, 206, 24, -153, 250, -86, 53, 76, -111, -24, 19, -294, -141, 123, 210, 342, -61, -113, 182, -115, 64, -1, 171, -119, -120, 82, -7, -107, -45, 84]
3440H4j66j49M32m91L40J56j7k2l05k63J83K19l3L32l23K5p6k76N07k8j57J20
3462I2O0o6J14m3j80p3J07O4L3n12L09j10K39l68O27l68j44L60q2n5J06L5n6k66
3486a77J26R0l05K14K2J11j09J86J92k89l9mj95J09J47K03k45k9k11L7J74r2O3
3509b1Jj76Q0K28k47Q8J80q5J86n9j68j00r0J58nj14J28j92K47J73l6j57l03K67
3533a7k76L04lo3J96m58K33kR9k41K39J70k31j56K71%L9l37Q2Q0L4J81k07o6N8
3558g1K7K07J16k82l0J51j40L2O1m0l8m3J09J9q6K59l29n7J04j95L31j33j11K18
3582G9l6Q0r1J8N3m5Qk24M60m52K16k9r0o9J58n9j7K70m97J81Q0r2J20J32l72
3607b18J96Q4J33l01lo3K12k9r1n4K02m0M9m0j41J78j02J14r0R9j96p8Q8K71k74
$$ y = [84, -82, -231, 201, -290, 50, 206, 189, 167, -138, -401, -218, 1, -32, 300, -23, 2, -74, -350, 157, 129, -28, 92, 152, 86, 200, 157, -23, -96, 11, 75, 108, -404, -95, -205, 34, -334, 293, -75, -219, 141, 59, 4, 110, 145, 89, -177, -51, 39, -266, -52, -30, 81, -28, 158, 350, 61, 22, 18, -177, -68, 79, 282, 37, 8, -203, -166, 8, -84, -21, -20, -196, -116, 112, -135, -47, 133, 48, 234, 175, 7, -93, -183, -25, -30, -144, -16, -208, 39, 212, 176, 19, -284, -17, -293, 11, 8, -55, 141, -317, -84, -86, 13, -228, 11, 181, -50, -206, 65, 65, 104, -233, -151, -71, -37, 144, -63, -129, -71, -44, 163, 279, -3, -33, 118, -22, 10, 71, 31, -7, -50, 59, 78, -8, 251, -78, -135, -31, -226, 105, -28, -139, 79, 43, 123, 32, 50, 103, 58, 66, -158, 302, -150, 66, 37, -53, -122, 36, -23, -40, 230, -267, -86, -6, -98, 22, 154, -218, -22, 62, 195, -106, -109, -172, 40, 11, -80, -134, 68, 28, 77, 37, -104, 74, -28, 86, -4, 95, -101, -179, -91, 180, -94]
3632i4K43J4j91K52m32J76O3j55rN9J18j21K0L3j92L47j21j92O4Q8L5o1K26k32
3656f2RR8j32K08j75j38N52j95k52O2j13J48p6O0j23J89K0L4k90L42m60L81l1
3679E6n0J00j68lK0J97J53m55K29j15J79J67j58j85j40K71j37q0J0O4J63j81o0
3702a23K33K05j62J11l68RK93m03L07J1k32j80J61q5K30P4q2j11K80j41j50q9
3724b12J93J00l92M40o2J06o5j77L45k24M5Q6m1m1m3K52k89j98K11L30j28o4j64
3747Hj01j34N01k00K8p8j22J79l94K50L43l24j70K75j83R9J5J61l88L60J89n20
3769b06J54P1J84j01J37l07M3kK9r0L53o5j39J60l61K41j88l6J17J70k1m4l13
3792b14K68m2J40O7l59K88k5j23K1J91k43j96L3J92M7j4m0p0j75k6K39mL11j91
$$ y = [-94, 149, 163, -28, 224, -208, -32, 31, -124, -133, -74, 44, -77, -57, -24, -216, 131, 10, -182, -118, -30, 5, -56, 170, -62, -53, 45, -87, 121, -54, -192, 360, 165, -87, -25, -138, 10, -66, -6, -129, 60, 80, 114, -176, 166, -294, 87, 56, 6, 106, -62, -65, -45, 152, 305, -150, 79, -36, 143, 310, 152, -33, -173, 98, -39, -119, -109, -45, 118, -63, -123, 110, 315, 153, 264, -104, -95, 198, -205, 102, 113, -119, -299, -138, -223, 7, 81, -1, -112, 168, 27, -123, -212, -19, 81, -311, 129, 67, 173, 108, -69, 276, 52, 97, 183, 142, 101, 58, 310, 21, -177, 34, 364, 236, 172, 8, -93, -227, 274, 74, 102, 24, -98, 81, -313, -63, 280, -44, -214, 61, -122, -23, -8, 153, -235, 125, 314, -206, -52, 19, 203, 102, 239, -68, -25, -27, 2, -88, 265, 200, 61, 221, -140, 101, -87, -123, -6, 164, 143, 99, -214, 54, 12, 152, 219, -140, 148, 123, 0, 21, 212, -31, -227, -194, -2, 45, 31, -9, -79, -254, -280, -41, -45, 266, 75]
3816G5k18J51p9P0P8m7L67l80l1l6j01K69k4J29j80q8Lj92K84L24l92J0k58L48
3840H2R7j01k92Q6O6j2L5l1J69K26n08K12jm0p5J31j77M33m39m2p2J3K36j40M2
3865a02J92J31k33J56m20Q0K22Oj25Lj72J52J6R3M6M6j55J36P4k03k1j81K00p2
3889a31m0J31O0J95k41Q0j22R6l7J02j04J21l7j45j71J08K40r5J37k64K96j84
3911el35L04N8P8j31L18j49R6j6k26k9j17J71q3K55k15p0J13k15K93J9k07L99
3934C06m39K66j04m5k44O06l29o1K24l40j07K70k5J17j28Q3j44L6j04N8J55O7
3956A18j71k14L81k37L91j29j15j17J30k24OM1J52L7J25l80K91j70J25j24J64
3977H0l00Q3J25j63J38nK1J61k20Q1p3j13L20P2j16J10k58j00o6J53j08qJ42O7
$$ y = [75, -143, 8, -71, -1, 77, 30, 397, 17, -14, -50, -151, 118, 94, 223, 43, -45, -42, -234, 50, 374, -18, -8, -266, 82, 179, 78, -214, -128, -62, -74, -39, -70, 99, 325, -183, 29, 28, -12, -87, 44, -133, 300, -139, -181, -253, -240, -4, -144, -102, 90, 221, -12, 144, -276, -196, 26, 32, -93, -90, -262, -110, -94, -1, 45, 91, -64, 72, 146, -57, -78, -259, -59, -131, -171, -40, 20, 215, -26, 54, -68, 28, -9, 93, -11, 110, 73, -72, -243, -135, 105, 10, 147, -117, 179, -5, -340, -36, 22, 100, -31, 287, 138, 234, 218, -8, -37, -154, 17, -66, 189, -26, -96, 17, -198, 95, 114, -93, 306, -133, 133, 29, -16, -260, 346, 17, -44, 180, -160, -267, 3, -22, 95, -33, 50, -94, -58, -162, -104, 51, 118, -53, -267, 114, -123, 268, 139, 24, -93, 37, -187, -181, -140, 12, 49, 174, -206, 85, -85, 40, -84, 80, -220, -137, -12, -175, -37, -42, -21, 140, -80, 1, -72, -185, 135, 207, 91, 201, -57, -157, -223, -70, -178, -186, -44, 23]
4001B3k15L00o9Kk92J09N44l95O0l8k1p3l8L04m05K57n1k80L15J03j48P4j79j61
4025b74L78J72p4j71o6J07q0kP6l26K77j84K49j2J24l65J79j92L65j57mK5j11
4048f6J86K00m48O8r0K07j0o3J02o9k23J78P0LN2j27q4n2L29k1l19J1O4J17j44
4073a29M3m0L63j36k01J77j98Q8kN8n1PN3mj97K78O6k09J4o6pK58j22r8%p9J80
4100D6o5kK9n5J06q3J25n3l3m1k4j53J83k12L12o8QJ06k38k0j8q1K83j93L6O5
4126d0r4L07O2k19M9j9k32J02R9o0k9J81j40q1j2P0J07k22K91k42K4M5l7J70Q7
4151A67j42n4J25k56K93l53j9K67J29j81J54l04K20j99J69j91K08L2J78j87L1
4172H7k01J95m4J57q9j65mp3J98N9r2j52J86j74O3K9JR7jk82L05q6N0j52J74M8
$$ y = [23, -192, 108, 39, 41, -251, -142, 402, 7, 67, 29, 8, -65, -103, 201, -204, 53, 2, -278, 37, 140, -8, 66, -113, -274, 104, 276, 202, 31, -35, 72, -8, -10, 66, -260, 17, -167, 82, 70, 194, -171, 8, -184, 181, 24, 20, 45, -66, 120, 320, -128, -60, -150, 57, 47, -16, 86, 17, -206, -28, 42, 45, 97, -30, -114, -166, 163, 142, -177, -166, -102, 15, -129, -86, -126, 237, 101, -100, 77, -121, -33, -35, 23, -28, -21, 32, 28, -169, 109, 175, -34, -20, -86, -93, 165, 43, -55, -55, -134, 46, -19, -21, 8, -47, 59, -24, 101, 48, 15, -26, -50, -203, -20, -232, 80, 12, 20, 126, -112, -132, -150, -231, 52, -141, -105, -40, -134, 173, 235, 16, 65, 46, -186, -84, 15, -45, -74, 107, -33, -114, -126, -56, 51, -171, 120, -122, -98, -53, -90, 80, 167, 25, -29, 96, -160, 133, -220, -239, 28, 157, -24, 130, -174, 46, -153, 16, -175, 33, 65, 243, 56, 87, -114, 81, 37, 194, 105, -60, -64, -137, 61, 120, 28, -124, 62, -112, -49, -20, -19, 78, 77, -205, 100, 14, 64, -88, 86, 134]
4198A34q8r3JM9kK8J44k59J46m8j83K44l3Rk55K04j25k4M0M84k19m24J44L24k55
4223e7rL7j50K05L1r8n0k8J07L0k59L56L5k15j14J30J48K1j70l6M5j24M61l07
4247a1n2M89N1o65L58j87j88J65n1P1j96J24K26j41J29N1p3P5k22J35j59K57j13
4270G3j48J89j11K7J84Lk10l50K92n4m7kp1K20K56k65K24j42m3j08K91k48k46
4293b86M76j09j8M0k12O2J35j79P0K55k61p6J22L3N2j74J87k55J53p5n2J19N2
4316E9k1K6m6J36m9k76L21R3k56l00L37j86K41r3Q2L7k80K7J51krO8N9k78K38
4341G9j03j14J98n8j62N4J12j68K80r4P6L7k95L62k25j32R6K80J33l43j58K30
4363H5j34Q6J01k71K3K26k15P1r5L95k18j16R2J92N4k47J05j33K01p7j21K5k9
$$ y = [134, 46, -47, -46, 3, 1, 29, 173, -86, 60, 12, -171, 73, 40, 49, -206, -2, -127, -151, -111, 373, 154, -270, -126, 198, -57, -66, -29, -179, 26, 57, -41, -91, -119, -12, 18, -241, 115, 150, -65, -179, -49, 99, 120, -50, -86, -41, -165, 296, -11, -63, 426, 477, -188, 170, -17, -205, -40, -91, -20, -216, -92, 134, -7, 122, 173, 100, 175, -47, 88, -71, 186, 73, -75, 114, 3, 30, 214, 217, 7, -343, -51, -105, -152, -154, -225, -5, 251, -14, 210, 68, 25, -83, 208, -40, -286, 190, 81, 63, 103, -109, -47, 88, -91, -21, 234, -27, -103, 19, 52, 104, -70, 117, -138, 15, -60, -112, 7, 59, 38, 64, 18, 154, 105, -171, 150, 243, -13, -313, 24, -162, 79, -14, 68, 105, -175, -148, 3, 1, -8, 60, 119, -159, 79, -24, -138, 60, 2, -160, -106, 6, -162, 118, 24, 100, 137, -158, 204, -21, -153, -57, 223, 356, 13, -145, 85, -49, 37, 138, -133, -110, 116, -99, -28, -123, 272, 54, -62, 30, 222, 276, 29, 134, 1, 202, 125, 4, 29, 0]
4386@L7j24J62k27J54Kj61j56J01K35k67K98Ok07K72l5o9N6r9n7m9K23J92p6j35
4411G6o9K02k92J21j74J74L6m1K0k8k72M21k63J07k0K6j49J10P1k18N8P8j47P5
4435i8N5R5j63K24L5j48M8j23J51n8P0p3j57j1K08J60k00J87j72j23K46j78M3
4458A8j00J88k92J43Q4R7l56K75R1r7j11J56o2l7J27j25O9J83p8l0j35K8R0j09
4482A7K77m22O4J35j94M8J45j77R4J22r3p6J15k07N8J25j38O3o4M3J82r9J55k17
4506d4k33L67j47K35j57N7K7k78M58k22k16K6K46k03J75p5j96J19J62r1J08q9
4528B9J94l01J62m5j51j54J93N5J2J23J8K00n01J25j1N7j50K4K75j93qk46K91
4551bm4NR7q6K9J32q0j78N0LK9J49M7k36j82L99k12J60N2R7k73j0l5m6J8J24j09
$$ y = [0, 37, -87, 75, -152, 2, 4, -157, -313, -212, 23, -244, 54, 60, -147, 125, 90, 21, 77, -22, -79, -128, 95, 287, 211, 76, 7, 209, -83, 38, -136, 38, 74, 33, 53, 25, -247, 174, -89, 18, -2, 24, -125, -15, 56, -162, -104, -26, -173, -98, -43, 52, -111, 113, 148, 0, 48, -75, 76, 18, 88, 15, -142, -153, 55, 215, 15, 202, 30, -93, 153, -25, 18, -82, 106, -186, -43, 41, 138, -218, 57, 148, 51, -60, 96, 34, -3, 124, -1, 68, 251, 173, 143, 8, 36, 126, 17, 294, -128, -64, 71, -123, -75, 70, -107, -13, 109, 16, -60, 55, -152, -94, 31, -107, -44, -108, -65, 117, 18, 173, -44, -277, 90, -57, 178, 21, 78, 105, -173, 285, 63, -153, -127, 119, -84, 91, 16, -180, -61, 101, 10, 118, 29, 223, -78, 84, 39, -112, -266, -73, -18, -6, 117, 135, 335, -166, -41, -52, 5, -145, -121, 154, -39, -47, -293, -2, -46, -41, 56, -30, -1, 131, 51, -127, -77, -74, -45, 104, 151, -85, -267, 132, -80, 80, 132, 229, -44, -54, -89, -135, -117, 7, -102]
4578a02L81l48j4q4lJ91q4J10o7K00l73K24j48M0p7K7K9K10m3l4qj88M0O5n8J63
4604D9l49Q4R9K81k23p2K34m6q3j4J56j07M7L4J60j51j7j79O1K1J5N0p4M1J74
4629A91k21J71j65j67L2L15k24J84J5j51K45k12N8j87M1m4M1J96L1l85K34k0J33
4652A11jj02K47l58J39j3j11P4j05Q0j57J03K79r4j00j48K09j52J84K0j98j11
4674b04K27j2K2J45l43j35M85k2j33j3o9J74j10J31m17L1k6K0L88l9l1J36J2j53
4698F4j34J33r4L3K10l03J77j66Q9j25n3M73l51Q7k04K96l85M63mn4k55J67k13
4721a49J48J18o0k6j71L14k9j98J17L2o4j36J35m3O0j12j13J75L8R3q8R6k52K3
4745i2O4Q0j55J28L4L8K5k93J23J63R9k34O7j36O2J67q2k01n0L19Q9j31k41K80
$$ y = [-102, 279, -69, -83, -167, -170, 21, -63, 47, -20, 180, -193, 31, -117, -77, -154, -127, -98, 112, 69, 35, 27, -161, -121, -56, -114, 49, -300, -216, -117, 164, -59, -131, 103, 57, -26, -40, 116, 9, 56, 90, 250, 99, 82, -97, -36, -15, 0, 50, -24, 17, 191, -30, 141, -24, -191, -159, 156, -68, 116, 131, -20, 225, 13, 71, -116, -75, -119, -78, 118, 149, -236, -2, -22, 111, 110, 8, 255, -103, 36, 23, -88, -14, -119, -39, -196, -93, 186, 92, -8, -156, 53, -99, 85, 105, -93, -204, 23, 11, 33, 178, -165, -300, 185, 163, 30, 17, -52, 122, 12, 143, -274, -243, -269, -249, 139, 100, 69, 205, 217, 64, -70, 63, -31, 2, 212, -91, 86, -80, 9, -116, -169, 304, -47, 40, -164, 132, -253, 210, 206, 152, -103, 64, -149, -1, 117, 57, 31, -140, 174, 145, -53, 64, 96, 32, -104, 31, -12, 48, -64, -177, -2, 36, 129, 41, 137, -115, -92, -28, 52, -103, 25, 59, 97, 122, -171, -48, 115, 214, -20, 47, -89, -27, 140, 58, -143, -193, 126, 215, 84, -157, 123]
4769A23K76n98J43Q3p8O0M8r0J20qk84K57O0q3j32k8Q2J04L06n75Q4J13J7L19
4793C19l36P5j78M69l19J62j22m4j61K69j11j3J12qk61J31j0J23j77p1K79k85
4815a57J89N0P5j45j3k87L34j97K03l5k01Q5N0J58j91Q1K2JO7m0mk49J47J00j53
4840a10L63l53J69Pp4m9J76r6J6j84m8J78k62L38j54K31n2k20J02J4m9j7J30J6
4864G2j40J36p9Q2j40J27l17L23p3J62K2k07j03J80j03L0J50O6k52J06J24l64
4886a98K12qO9j79M3l3j11K80q8N6j58J63p2nJ44r0RQ6M2m57M41n49L39K1O5j75
4912a53K16j34J20O3j24j43N8Q4j46L89k94K63l40m2K28L1J56k16J49k17L09j20
4934A37Q6j2l10l9K49J54k37R1l33L96j55J5j43J04J98j71J7r2K50p3j12P2N5
$$ y = [123, 399, -199, -56, 27, -51, 9, 57, -33, 87, 79, -205, 52, 112, 29, -103, -131, -49, 55, 361, -214, -130, -17, 0, 319, -17, 58, -120, 349, 30, 192, 70, 26, -135, 134, 23, 10, 122, 114, -147, -16, -26, 97, -80, -151, 128, -157, 32, 82, 157, 12, -1, -288, 46, -151, 52, 17, -184, -99, -49, 109, -82, -1, 21, 22, 89, 49, 45, -204, -57, 43, -110, 253, -100, 69, 76, 2, -47, 129, 33, 49, -135, -183, -5, -267, 71, -83, 148, 96, -124, -22, -8, -57, -74, 56, 72, -68, 68, -11, 71, -69, 58, -259, 64, -9, 153, 175, -32, -135, 45, -58, -28, 122, 188, -64, 42, 166, -198, 14, 6, 75, -104, -61, -94, -205, 75, -13, 43, -115, 48, -24, -29, 115, 25, 34, 120, 162, -295, 146, -403, -64, -43, 22, -153, 63, -71, 49, 112, -12, -155, -97, -13, -159, 230, -64, 199, -141, -183, 45, 76, 232, 16, 165, -52, 257, 137, 223, 211, -99, -138, 111, 265, 28, 119, -214, 182, 27, 42, -101, 3, 201, 30, 47, -45, 205, 132, 20, 92, 147]
4957A47N0j63j09m6J04J3L52l50J60N7k28l8L46k28j69K21l43J95j27J87j35N
4979i9K4L3R6lj28j5K92j98km2L5P1k15J44J6j7j95L41m5J8k78L67m5o0j31J20
5005H4L5J45k24j19M04j60M8L4r0k55k83L99k42R6L21l76L18j08j19K88k80J38
5027E4j59n0K55J06P1K2m76J50K9Kn7K78l3k65j34J42K79k38Q2j04R1J8j44j80
5051b61M57j75O6k54M12k86qK94j11r2K16M7k32R1k7P1l39J92j54J96k8j06N6
5074B5j75K32L0k56J18L5j57K38j99K05j20K05k63L43l86K34k80P8J9J86l2kJ12
5097A90j51j6L5j75P0J2J5oM7j11J23Q4q0R9l6j86J06k3K6Jj40J11r4Q7j4K22
5123A96k87J95n3j88M19k01J33k75N8l79K43L9q7J61Ll5o9K0l3M8M3N3j3N5N4
$$ y = [147, 197, 34, -75, -121, -17, -4, 348, -2, 158, 215, -13, -51, 295, 67, -102, 119, -224, -29, -156, 31, -104, -99, -75, -42, 54, 51, -77, -92, 200, 2, 0, -42, -7, 64, -151, -7, 9, -8, -203, 138, 93, 111, -167, 200, 155, 95, -36, 84, 119, 264, 40, -79, 325, 165, 213, 247, 157, -98, -381, 18, -224, -128, 193, -183, 135, 27, -92, 196, -84, 54, -105, -155, 100, 206, 277, 299, -177, -27, 2, 4, -53, 225, 192, -73, -207, -65, 214, -24, 58, -46, 45, 63, -81, -261, 196, 21, 87, -167, 245, -41, -49, 245, 134, 42, 258, 305, 73, 164, 137, 208, -131, 61, -93, 103, 75, -31, 25, -150, 82, 112, -144, -26, 9, -148, 90, -109, 96, -24, 181, -82, 261, -125, 109, -171, -93, -74, 112, 80, 78, 190, 39, 23, 58, -117, -47, -35, -20, -26, 21, -90, 33, 117, 37, 136, 100, -86, 20, -3, 23, 24, -116, -5, -99, -12, -26, 196, -91, 104, 51, -137, 282, 81, 214, -61, -3, -382, -139, -100, -187, -26, -23, -58, -127, -107, -140, -92, -49, 4, -9, 46, 100]
5148A00r0j16O3j66P2J94J80j63j64R9K21m33L46j86J87m1j56P1j36J96L9m14
5170b97M33L5l16K85k23J16j59K11j6k87K74p9K5R9j80r2k9m4K43j70J74j26R9
5193b4K99j18l47N64l27n0l5l3J12Lq8O6l8k21L15j79J71k19K63j45N6L8K04k03
5217F4o8n2K31m72K13J71k2r2M4J3j50K27k77K72P5m21L39J43k59J56j61J13P9
5240A66j95J27l64p1M70k46jQ9J26q9J85M9m24K26j20K8j08L23k57J94k32L56
5262B32k96L20l72K12j41k2p1J02L19l73Oj56L50j24j70J32K83k65K6Q7q9j77
5284a87L47q0j43O3j01K63q5m22L27N1k35K77J15l74J86N6P3n2K9q4O5j9j6j65
5308a11k8L25j42K28k75k11L23L2k00n3K21kO7k59p7M33j99K00m12J4L04k54l3
$$ y = [100, 10, -106, -43, -209, -137, 57, 237, 74, -90, 9, 230, -203, 143, -43, 144, 103, -53, 18, -118, 78, 117, -297, 136, 171, -145, 140, -83, 33, -126, 85, 69, -218, 56, -23, 2, 101, -79, -171, -200, -244, -1, -171, 3, -123, -24, 275, 157, -190, 374, 47, -3, -38, -71, 41, 44, -44, 22, -16, -237, 78, -101, 70, -149, 114, -31, 25, 63, 267, 64, -4, -56, 175, -297, -84, 87, 65, -27, 17, 30, -120, 107, -170, 102, 177, -244, 95, 238, -21, 135, -26, 87, 166, -29, 98, -266, -337, 133, -113, -114, -25, 101, 12, 197, 246, -178, 48, -72, -44, -152, 171, -86, 108, -124, 232, -64, 256, -116, 96, -45, -67, -138, -36, 283, -90, -84, -240, 110, -14, -184, -52, 231, -34, -8, 79, -10, -187, 160, 80, -63, 0, -101, 162, 77, -345, -18, 33, -202, 75, 190, -184, 2, 58, 131, 79, 108, 24, 89, 70, 54, -111, -139, 186, 44, 272, -3, -214, 109, 141, -59, -112, 109, 107, 174, -85, -162, 271, 72, 272, -140, -126, 178, -76, -109]
5331a09J90mj83j03K99j42P5Q9j45q1M2J03N8J04q0k5p1m1K86j47k48O4K6MJ64
5356A25m6J9j73J67J39j12k25N9J77p4j88J37k43L08K7P2l53K34n9L9K62m95J61
5379d2J05k29K01j7J89k49j94L24l83L34J57j02Ol3j36j19L44j01J07k53l2K02
5401G9p8L13j17j87k7Q9N2ml97M76k37O3K9n9K4N9N8j01p9P9R2k40J67o2J06j52
5427e4K00j42J9j9J39Kl53J04O8R9J21j66M7j62K60q8r4k07J85mJ3o2J76J8r1
5452ILr5p9J23j8L4J33j29j16K76j30K96n09K81p1Q9j29j41M39k55n3K9J00l65
5476b78K5K56K09k13K72k84j93M0K44l09J43Qj50O23l77n9l1M1M6M00n08J72N2
5499A29j6l16M9J18m0Q3k32L58M8n9l7Q2p6j88r5L01j07k63L45M1p2k62K7K41
$$ y = [-109, 81, 77, -106, -209, 90, -52, 23, 112, -33, -114, -72, 31, 89, 193, 113, 88, 17, -24, 262, 115, -133, -69, -43, -39, 125, 79, 98, -75, 92, 231, 119, -106, -47, 130, 56, -132, 5, -238, 70, 97, 169, -184, 50, -9, 30, 292, -203, -42, 63, -166, 35, 18, 207, -42, -236, 88, -295, 39, 196, 94, 100, 67, -69, -188, 156, 55, 162, -91, -123, 79, 1, 314, 197, 10, -17, 72, 124, 120, -277, 199, -38, 25, 54, -5, 19, 78, 136, 35, -44, 35, 127, -113, 54, -8, 98, -54, 146, 4, 23, 4, 143, 145, -208, -104, -36, 63, 184, 18, 65, -97, 163, 75, -19, -226, -41, -45, -32, -94, 82, 100, 9, 12, -83, -162, -39, -57, -23, 110, -19, -135, 141, 11, 307, -202, 79, 8, 97, -32, -173, 266, 11, -42, -13, 87, -278, -253, 3, 212, -1, 271, -13, -206, -166, 78, -231, -88, -80, -230, 393, 16, -43, -74, -33, 13, 413, -95, 77, 129, 113, -203, -154, -36, -76, 7, -225, 133, 181, 122, 85, 167, 91, -97, -192, 109, 2, -261, 84, 125, 53, -209, -182, 59]
5523E9j74K73k12m2R8J6M0j35J78Qj90J56q0L71n24J02K72J28l39P8P1o9K56l16
5547B5K6R5k93J60p8K27k67M4L31p7j08j94j7R9j07K33j73J14K26j88M7j17k34
5570b26L0J72P0j00k2K79l81J79j37K45l22N80l23j97K53J6j59j2mk8J85l22J39
5593h5J53k18o0J6M9J28J7J80J36k18m4l41K31L38l08o5J13k83O0O4q8J82J23
5616H0K6j9Nl07K66k69J49o0L29k88K8L39j04k45J7J85j11j21J32j18j6K80j54
5639B4j47J57QJ76l97L06k3k00q1J43L4M4L7k31j09M37l32K65j3k24kL01Q1j76
5663G8j64K20N7k04n8l0M22o21K15j16O90n76K7J76rk36L0O5L1J59l47M15o3k76
5687a15m8L01j49j41J45j2L0L40l66k06K7L64K5k77P3r3J51M6j33R2j66K02o9
$$ y = [59, -115, 158, -54, -96, 2, 18, 58, -77, 101, 109, -81, 75, -5, 366, -158, -56, 216, 344, 5, 83, 154, 85, 341, 25, 51, 146, -147, 13, -65, 162, -105, -61, 270, 193, 85, -109, -126, -27, -134, 99, -74, 40, 266, 78, 125, 8, -226, -196, -24, 46, -54, -76, 203, -178, 1, -136, 109, -213, 367, 44, -153, 100, 116, -43, -55, -59, -87, 98, -224, -85, 68, -150, -210, -194, -145, -17, 0, 180, 316, 98, 54, -287, -56, 282, -26, -91, 22, -261, -201, -137, -225, -43, 80, 106, 87, 92, -215, 51, -218, -69, -129, 200, -88, -60, 279, 175, -70, -53, 132, 21, -100, 32, -86, -102, 178, 24, -123, 34, 42, 218, -179, 127, 104, -96, -177, -34, 0, 44, 81, -150, -259, 178, -154, 111, 98, -126, -128, 173, 254, 78, -86, 134, 191, -13, -71, -101, 321, -300, -85, -201, 489, -87, -60, 116, 107, -129, -99, -34, -3, 156, -191, 224, 161, -115, -163, 138, -11, -152, -7, -19, 11, 351, -15, -221, -194, 170, 195, -82, -9, -102, 49, 95, -38, 54, -112, 90, 21]
$$ [...]
8191a1
##END NTUPLES=NMR FID
##END=
