##TITLE=1H_Pr 3568
 200.13MHz,CDCl3,
 8 sc
 
 1.4.2025
##JCAMPDX= 6.0         $$ Bruker NMR JCAMP-DX V2.0
##DATA TYPE= NMR FID
##DATA CLASS= NTUPLES
##ORIGIN= UXNMR, Bruker Analytische Messtechnik GmbH
##OWNER= pz
$$ XWIN-NMR		Version 3.5
$$ Tue Apr  1 14:04:23 2025 Russian Standard Time (UT+4h)  she@DPX200
##.OBSERVE FREQUENCY= 200.1313
##.OBSERVE NUCLEUS= ^1H
##.DELAY= (6, 6)
##.ACQUISITION MODE= SIMULTANEOUS
##.ACQUISITION SCHEME= undefined
##.AVERAGES= 8
##.DIGITISER RES= 18
##SPECTROMETER/DATA SYSTEM= spect
##.PULSE SEQUENCE= zg30
##.SOLVENT NAME= CDCl3
##.SHIFT REFERENCE= (INTERNAL, CDCl3, 0, 14.3821)
##AUDIT TRAIL= $$ (NUMBER, WHEN, WHO, WHERE, WHAT)
$$ ##TITLE= Audit trail, XWIN-NMR		Version 3.5
$$ ##JCAMPDX= 5.01
$$ ##ORIGIN= Bruker BioSpin GmbH
$$ ##OWNER= she
$$ F:/spectra/data/she/nmr/H-C/1/audita.txt
$$ ##AUDIT TRAIL=  $$ (NUMBER, WHEN, WHO, WHERE, WHAT)
(   1,<2025-04-01 14:02:56.45 +0400>,<she>,<DPX200>,
      <created by zg, POWCHK disabled, PULCHK disabled
       configuration hash MD5:
       00 E9 B6 7A A2 85 ED C7 34 08 36 98 17 FE 4E 26
       data hash MD5: 16K
       07 FA 49 89 F9 72 F6 AC 8F 5C B0 80 60 63 95 88>)
$$ ##END=
$$ 
$$ hash MD5
$$ 14 01 9E 87 6D BC B1 36 E2 27 8E EA 83 00 5F D0
##$RELAX= 
##$RELAX= 
##$RELAX= 
##$RELAX= 
##$RELAX= 
##$RELAX= 
$$ Bruker specific parameters
$$ --------------------------
##$DU= <F:/spectra>
##$EXPNO= 1
##$NAME= <H-C>
##$PROCNO= 1
##$TYPE= <nmr>
##$USER= <she>
##$AMP= (0..31)
100 100 100 100 100 100 100 100 100 100 100 100 100 100 100 100 100 100 
100 100 100 100 100 100 100 100 100 100 100 100 100 100 
##$AQSEQ= 0
##$AQ_mod= 1
##$AUNM= <au_zg>
##$AUTOPOS= <>
##$BF1= 200.13
##$BF2= 200.13
##$BF3= 200.13
##$BF4= 200.13
##$BF5= 200.13
##$BF6= 200.13
##$BF7= 200.13
##$BF8= 200.13
##$BYTORDA= 1
##$CFDGTYP= 0
##$CFRGTYP= 5
##$CHEMSTR= <none>
##$CNST= (0..31)
1 1 145 1 1 1 1 1 1 1 1 1 1 1 1 1 1 1 1 1 1 1 1 1 1 1 1 1 1 1 1 1 
##$CPDPRG= <>
##$CPDPRG1= <>
##$CPDPRG2= <>
##$CPDPRG3= <>
##$CPDPRG4= <mlev>
##$CPDPRG5= <mlev>
##$CPDPRG6= <mlev>
##$CPDPRG7= <mlev>
##$CPDPRG8= <mlev>
##$CPDPRGB= <>
##$CPDPRGT= <>
##$D= (0..31)
0 0.7 0 0 0 0 0 0 0 0 0 0.03 0 0 0 0 0 0 0 0 0 0 0 0 0 0 0 0 0 0 0 0 
##$DATE= 1743501775
##$DBL= (0..7)
120 120 120 120 120 120 120 120 
##$DBP= (0..7)
150 150 150 150 150 150 150 150 
##$DBP07= 0
##$DBPNAM0= <>
##$DBPNAM1= <>
##$DBPNAM2= <>
##$DBPNAM3= <>
##$DBPNAM4= <>
##$DBPNAM5= <>
##$DBPNAM6= <>
##$DBPNAM7= <>
##$DBPOAL= (0..7)
0.5 0.5 0.5 0.5 0.5 0.5 0.5 0.5 
##$DBPOFFS= (0..7)
0 0 0 0 0 0 0 0 
##$DE= 6
##$DECBNUC= <off>
##$DECIM= 32
##$DECNUC= <off>
##$DECSTAT= 4
##$DIGMOD= 1
##$DIGTYP= 9
##$DL= (0..7)
0 120 120 120 120 120 120 120 
##$DP= (0..7)
150 150 150 150 150 150 150 150 
##$DP07= 0
##$DPNAME0= <>
##$DPNAME1= <>
##$DPNAME2= <>
##$DPNAME3= <>
##$DPNAME4= <>
##$DPNAME5= <>
##$DPNAME6= <>
##$DPNAME7= <>
##$DPOAL= (0..7)
0.5 0.5 0.5 0.5 0.5 0.5 0.5 0.5 
##$DPOFFS= (0..7)
0 0 0 0 0 0 0 0 
##$DQDMODE= 0
##$DR= 18
##$DS= 0
##$DSLIST= <SSSSSSSSSSSSSSS>
$$ [...]
##$SUBNAM0= <"">
##$SUBNAM1= <"">
##$SUBNAM2= <"">
##$SUBNAM3= <"">
##$SUBNAM4= <"">
##$SUBNAM5= <"">
##$SUBNAM6= <"">
##$SUBNAM7= <"">
##$SUBNAM8= <"">
##$SUBNAM9= <"">
##$SW= 18.0517328524113
##$SWIBOX= (0..15)
0 0 2 0 0 0 0 0 0 0 0 0 0 0 0 0 
##$SW_h= 3612.71676300578
##$TD= 16384
##$TD0= 1
##$TE= 0
##$TE2= 300
##$TE3= 300
##$TEG= 300
##$TL= (0..7)
0 120 120 120 120 120 120 120 
##$TP= (0..7)
150 150 150 150 150 150 150 150 
##$TP07= 0
##$TPNAME0= <>
##$TPNAME1= <>
##$TPNAME2= <>
##$TPNAME3= <>
##$TPNAME4= <>
##$TPNAME5= <>
##$TPNAME6= <>
##$TPNAME7= <>
##$TPOAL= (0..7)
0.5 0.5 0.5 0.5 0.5 0.5 0.5 0.5 
##$TPOFFS= (0..7)
0 0 0 0 0 0 0 0 
##$TUNHIN= 0
##$TUNHOUT= 0
##$TUNXOUT= 0
##$USERA1= <user>
##$USERA2= <user>
##$USERA3= <user>
##$USERA4= <user>
##$USERA5= <user>
##$V9= 5
##$VALIST= <valist>
##$VCLIST= <CCCCCCCCCCCCCCC>
##$VD= 0
##$VDLIST= <DDDDDDDDDDDDDDD>
##$VPLIST= <PPPPPPPPPPPPPPP>
##$VTLIST= <TTTTTTTTTTTTTTT>
##$WBST= 1024
##$WBSW= 4
##$XGAIN= (0..3)
0 0 0 0 
##$XL= 0
##$YL= 0
##$YMAX_a= 567834
##$YMIN_a= -436004
##$ZGOPTNS= <>
##$ZL1= 120
##$ZL2= 120
##$ZL3= 120
##$ZL4= 120
##$ABSF1= 10
##$ABSF2= 0
##$ABSG= 5
##$ABSL= 3
##$ALPHA= 0
##$AQORDER= 0
##$ASSFAC= 0
##$ASSFACI= 0
##$ASSFACX= 0
##$ASSWID= 0
##$AUNMP= <proc_1d>
##$AZFE= 0.1
##$AZFW= 0.1
##$BCFW= 1
##$BC_mod= 2
##$BYTORDP= 1
##$COROFFS= 0
##$CY= -3
##$DATMOD= 1
##$DC= 2
##$DFILT= <>
##$DTYPP= 0
##$F1P= 0
##$F2P= 0
##$FCOR= 0.5
##$FTSIZE= 0
##$FT_mod= 4
##$GAMMA= 1
##$GB= 0.15
##$INTBC= 1
##$INTSCL= 1
##$ISEN= 128
##$LB= 0.25
##$LEV0= 0
##$LPBIN= 0
##$MAXI= 10000
##$MC2= 0
##$MEAN= 0
##$ME_mod= 0
##$MI= 1.114404
##$NCOEF= 0
##$NC_proc= 0
##$NLEV= 6
##$NOISF1= 3.799351
##$NOISF2= 2.8
##$NSP= 1
##$NTH_PI= 0
##$NZP= 0
##$OFFSET= 14.38212
##$PC= 1
##$PHC0= -629.9264
##$PHC1= 12.99221
##$PH_mod= 1
##$PKNL= yes
##$PPARMOD= 0
##$PSCAL= 0
##$PSIGN= 0
##$REVERSE= no
##$SF= 200.129724274929
##$SI= 16384
##$SIGF1= 3
##$SIGF2= 2
##$SINO= 400
##$SIOLD= 16384
##$SREGLST= <1H.CDCl3>
##$SSB= 0
##$STSI= 0
##$STSR= 0
##$SW_p= 3205.1282051282
##$SYMM= 0
##$S_DEV= 0
##$TDeff= 0
##$TDoff= 0
##$TI= <>
##$TILT= no
##$TM1= 0
##$TM2= 0
##$TOPLEV= 0
##$USERP1= <user>
##$USERP2= <user>
##$USERP3= <user>
##$USERP4= <user>
##$USERP5= <user>
##$WDW= 1
##$XDIM= 8192
##$YMAX_p= 0
##$YMIN_p= 0
$$ End of Bruker specific parameters
$$ ---------------------------------
##NTUPLES= NMR FID
##VAR_NAME=  TIME,          FID/REAL,        FID/IMAG
##SYMBOL=    X,             R,               I
##VAR_TYPE=  INDEPENDENT,   DEPENDENT,       DEPENDENT
##VAR_FORM=  AFFN,          ASDF,            ASDF
##VAR_DIM=   8192,          8192,            8192
##UNITS=     SECONDS,       ARBITRARY UNITS, ARBITRARY UNITS
##FACTOR=    0.0002768,     1,               1
##FIRST=     0,             0,               0
##LAST=      2.2672688,     0,               0
##MIN=       0,             -436004,         0
##MAX=       2.2672688,     567834,          0
$$ Real data points
##PAGE= N=1
##DATA TABLE= (X++(R..R)), XYDATA
0@%%%%%%%%%%%%%%Qj6J6j6J6k4L2l3L8m9O0o8P9r5J12j28J44j62J87k14K41k73
$$ 0 0 0 0 0 0 0 0 0 0 0 0 0 0 0 8 -8 8 -8 8 -16 16 -17 21 -28 32 -36 43 -52 60 -68 76 -86 101 -113 128 -145
36a45L10l49L92m40M91n45O06o74P47q29R16j013J118j230J355j492J645j811
$$ -145 165 -184 208 -232 259 -286 320 -354 393 -436 480 -533 585 -645 710 -782 863 -948
54i48J995k202K431k692K989l326L717m179M730n398O225p275Q629j0329J1821
$$ -948 1047 -1155 1276 -1416 1573 -1753 1964 -2215 2515 -2883 3342 -3933 4696 -5633 6188
69F188p048L50545k98846m86843K34093Q7969k49085N2905K28344k3779L4449
$$ 6188 -860 349685 50839 -436004 -201911 -113942 -363027 -310122 -81778 -105557 -71108
80g1108L5634j28813J71000M06578j16575k28496L04814O0920n33637k4745M85229
$$ -71108 -35474 -164287 6713 413291 296716 68220 373034 433954 -99683 -124428 360801
91C60801j33098m89548N3384J63705j67604j6064J59890j3904M9729O5382k45580
$$ 360801 227703 -261845 -208461 -44756 -212360 -228424 -68534 -82438 -32709 32673 -212907
102b12907m4996M24344N2118l63726J31075L20694k72105k01411M03745J41409
$$ -212907 -257903 166441 218559 -145167 -14092 306602 34497 -166914 236831 378240
112C78240l70355q7420J44751j06522p0934Q0220p0876k612J48622j55472j86892
$$ 378240 7885 -79535 65216 -41306 -112240 -32020 -102896 -105508 43114 -112358 -299250
123b99250L41875K60449l22780j13076L24957o6447l18916J61152K34093j87154
$$ -299250 42625 303074 -19706 -132782 192175 125728 -193188 -32036 202057 14903
133A4903j27479J13559q200k0234R8154n6333p2489J45908m9536k75265J33910
$$ 14903 -112576 983 -7217 -27451 70703 14370 -58119 87789 38253 -237012 -103102
144a03102L22459j76700k45441K29206J47436k17993k0568K00886l0530j25823
$$ -103102 219357 42657 -202784 26422 173858 -44135 -64703 136183 105653 -20170
154b0170M543m5051k8526J12970l3573j38148J32879J27757k00376l8295K94286
$$ -20170 -15627 -60678 -89204 23766 -9807 -147955 -15076 112681 -87695 -125990 168296
165A68296J0530k74136L3905J85378j01968j13413J06669M1511n2648J2942l8878
$$ 168296 178826 -95310 -61405 123973 22005 -91408 15261 56772 4124 17066 -21812
176b1812l6860J29629K2932j95495N602J85976r6601j80401J60469J54969j60284
$$ -21812 -58672 70957 93889 -101606 -96004 89972 -6629 -187030 -26561 128408 -31876
187c1876p1241J60255L5114q1139J4449J0924k9802K3835l6537r2080P7762J07751
$$ -31876 -103117 57138 92252 11113 25562 36486 6684 30519 -6018 -98098 -20336 87415
199H7415j24237q0087J74242N0202j70678Q870J48106n6529j21153N0477O1356
$$ 87415 -36822 -116909 57333 107535 -63143 -54273 93833 37304 -83849 -33372 27984
210B7984l1837r125J769r218N9149K2466r7188O398J23625o0374j51152P5619
$$ 27984 -3853 -12978 -11209 -20427 38722 61188 -36000 -29602 94023 33649 -117503 -41884
222d1884J21313r5709q1480J04118N6667o5083n245M5440O72o133k7056n4375
$$ -41884 79429 -16280 -97760 6358 63025 -2058 -7303 38137 38809 32676 5620 -48755
234d8755L3420N9111p4079n7862J06154M6057j16026j1875J27859k376j07469
$$ -48755 -15335 43776 -30303 -88165 17989 64046 -51980 -63855 64004 61628 -45841
245d5841R651O2834j9736l2796P184J9270L0118l519n1214J9043Q6809k7491j06552
$$ -45841 -36190 26644 6908 -25888 -18704 566 30684 27165 -24049 -5006 81803 54312 -52240
258e2240K8429Q2871o7325q5825O4654O5929m8654l7058L9014L6495m028k2804
$$ -52240 -23811 59060 -8265 -94090 -29436 36493 -12161 -49219 -10205 26290 22262 -542
270e42j0927K8291K0047n4078l6237P1461M2034p4426k5033Q0509J4832p2692
$$ -542 -11469 16822 36869 -17209 -53446 18015 60049 -14377 -39410 41099 55931 -16761
282a6761o349N7604n634o0551j8449K9941K2738j5211k8880K2918N5819j3352
$$ -16761 -23110 34494 28860 -31691 -50140 -20199 2539 -12672 -41552 -18634 37185 23833
294B3833n4277K7597O2634l1047o6435K2405N1542k7287m3304K8488M3423j5675
$$ 23833 -30444 -2847 59787 28740 -37695 -15290 36252 8965 -34339 -5851 37572 21897
306B1897m1232J280L8380L697m6385j7968L6845J1749m1562q842N5493K3798m3261
$$ 21897 -19335 -18055 20325 24022 -22363 -40331 -3486 8263 -33299 -42141 13352 37150 -6111
319f111j2454N0317J9091m5412k4875L4516J6033m5646k7939L7137L0145k6764
$$ -6111 -18565 31752 50843 5431 -19444 15072 31105 -14541 -42480 -5343 24802 -1962
331a962k7492K3700L1079k0039l6239J3938L6950j3061m3921J1829N4810k336
$$ -1962 -29454 -5754 25325 5286 -30953 -17015 19935 6874 -37047 -25218 29592 27256
343B7256m5240J4743M8920j2951m3497P511K9443j4664l6501n229K2245J0508
$$ 27256 -17984 -3241 45679 32728 -10769 -3258 26185 11521 -24980 -30209 -7964 2544
355B544j9759j6901L1031L3759l2513l2197M3530L0376m9611k7278M8605K1797
$$ 2544 -17215 -34116 -3085 30674 -1839 -34036 9494 39870 -9741 -37019 11586 33383
367C3383l9288r974L4039J1670j6889j6238j283K0141J567m2759j2832M5760L524
$$ 33383 -5905 -15879 18160 29830 12941 -3297 -4580 15561 17128 -25631 -38463 7297 10821
380A0821n2021R477N9632j1376m3372K7161L5883k5062k1743J1323M276j130l681
$$ 10821 -41200 -31723 27909 16533 -26839 322 36205 11143 -10600 723 4999 3869 188
393A88j5772R298L2539j6890l8318L2447L6614m8771l1040N0574J1253m9068L115
$$ 188 -15584 -6286 26253 9363 -28955 3492 40106 -8665 -39705 10869 22122 -26946 -23831
406b3831L8492o130j4940R984J746M065J3707k3154k4829L5348J1230n5930r14
$$ -23831 14661 8531 -6409 3575 5321 9386 23093 -61 -24890 10458 21688 -34242 -35156
419c5156N8474j4349m6630L3684L7951l3113j6233K8849j370j5713Q345o985o445
$$ -35156 23318 8969 -37661 -3977 33974 861 -15372 13477 12107 -3606 4739 -2246 -8691
432h691K9016m727l9549K4707M1444m2943l5197M9255J2424n8332j024M3945j4437
$$ -8691 20325 15598 -23951 756 42200 -743 -35940 13315 25739 -32593 -33617 10328 -4109
445d109k4148K1136P322l663K0339o261k3526K9199K0896m8046j0266N5326j0438
$$ -4109 -28257 -7121 201 -3462 16877 10616 -12910 16289 37185 -10861 -21127 34199 23761
458B3761n5228K7887M0854l8763k1244L3347l988k5202J1149j457j7965K1586
$$ 23761 -31467 -3580 37274 -1489 -22733 10614 6626 -18576 -7427 -8884 -26849 -5263
470e263R242l6431J3661N1438k5209l6301M9389K5179n2574m645M3397j5642k9901
$$ -5263 3979 -32452 -18791 32647 7438 -28863 20526 45705 -6869 -11514 31883 16241 -13660
483a3660K0365M689k0699J4325N791k9038J2402K6689l9158k0391M9984M89n2818
$$ -13660 6705 11394 -9305 5020 10811 -18227 -5825 20864 -18294 -38685 11299 11788 -41030
496d1030J8792M6206k6030k0305L7646N165k5366J7548R967k7348Q100J8496l0023
$$ -41030 -22238 23968 -2062 -22367 15279 20444 -4922 12626 22593 -4755 3345 21841 -8182
509h182n507L7227j8060l8383L7222K7863m9824j1950M6764j0637l6704K2409
$$ -8182 -13689 23538 5478 -32905 4317 32180 -17644 -29594 17170 6533 -30171 -7762
521g762J4604k3244J0986J8115k3276M395L4816j9806k6795L6775R211m8339Q716
$$ -7762 6842 -16402 -5416 12699 -10577 -6182 28634 8828 -17967 18808 28019 -20320 -11604
534a1604M1626k9110k8493L7734Q727l4886Q596K0692j9976j171J8437k3981j2644
$$ -11604 30022 912 -27581 10153 18880 -16006 -7410 13282 -6694 -7865 10572 -13409 -26053
547b6053L9139k659m0902K4698L6134l5044j5302M3179j252l5727J6345J8045
$$ -26053 13086 10427 -30475 -5777 30357 -4687 -19989 23190 21938 -13789 2556 20601
559B0601k8340k265K3491j5657q323K5794j4335k7386L3867J8492m5874m948M3168
$$ 20601 -7739 -10004 13487 -2170 -10493 15301 966 -26420 7447 25939 -19935 -24883 18285
572A8285j4465l3943K7950J8573k7585O471K2953k1430n353L0236j0696k3878
$$ 18285 3820 -30123 -2173 16400 -11185 -4714 18239 -3191 -8544 21692 10996 -12882
584a2882K2786L518l5024J3748L4762k9794k4063L8035O493l6233J0562K4011
$$ -12882 9904 13422 -21602 -7854 26908 -2886 -26949 11086 17579 -18654 -8092 15919
596A5919k1125o095J9618j5216j1502L1370J606l1774J5806K4917k8980q592L5361
$$ 15919 -5206 -11301 8317 -6899 -18401 12969 14575 -17199 -1393 23524 -5456 -14048 21313
609B1313r509l2948K0584J6051k9531l85K7994j1036j4145J9292m147j8715K3563
$$ 21313 11804 -21144 -560 15491 -14040 -14425 13569 2533 -11612 7680 3533 -15182 8381
622H381J1695l4695M17L2527j6686k2474K9220R406l0435O130K3084j9844j0915
$$ 8381 20076 -14619 -14202 18325 1639 -20835 8385 17791 -12644 -6514 16570 -3274 -14189
635a4189K4761n066k0572J6280N352k2313J3149K3666k3939j2695L1156q85k9932
$$ -14189 10572 5506 -15066 1214 6566 -15747 -2598 21068 -2871 -15566 15590 14705 -15227
648a5227J3474K0248k2889p933J9928r382j2381K1570J901k2419J0271J4097k0629
$$ -15227 -1753 18495 -4394 -12327 7601 -1781 -14162 7408 9309 -13110 -2839 11258 -9371
661i371j411K6305j1186k3360K1634J3821k4863J027K3674r939j2727J3436l142
$$ -9371 -10782 15523 4337 -19023 2611 16432 -8431 -7404 16270 6331 -6396 7040 3898
674C898j4265J4700O874k3930O02K1623j2727j2713K3350L740k3725P391J7065
$$ 3898 -10367 4333 11207 -12723 -12121 9502 -3225 -15938 7412 11152 -12573 -5182 11883
687A1883j4648n817J8136m590j4221J2497N210j5603Q068J4846j7806q864J9691
$$ 11883 -2765 -8582 9554 4964 -9257 3240 8450 -7153 915 15761 -2045 -10909 8782
700H782k945j8492J1335J0719j7261k922J6109n265p695J4183J22j5161Q560R597
$$ 8782 5837 -12655 -1320 9399 -7862 -10784 5325 60 -7635 6548 6670 -8491 69 9666
714I666j4794p64J6418q102j4045J3686P745j4550J880J2329r663p357J1688j778
$$ 9666 -5128 -5892 10526 2424 -11621 2065 9810 -4740 -2860 9469 -194 -7551 4137 2359
728B359j0045Q984L726j3292L300J3105q343p217J4070Q94j4904M749J0542r662
$$ 2359 -7686 1298 5024 -8268 -4968 8137 -206 -7423 6647 7541 -7363 -2614 7928 -1734
742a734m040J0064l229o749P827J945q329N383O473j1393l170J3069k809j1804
$$ -1734 -5774 4290 1061 -5688 2139 4084 -4245 1138 7611 -3782 -6952 6117 3308 -8496
756h496P700P101r790j406R263k153m393N333r55n906M975K605q578K047R001
$$ -8496 -796 6305 -3485 -4891 4372 2219 -2174 3159 2204 -3702 1273 3878 -4700 -2653 6348
771F348o947o962J0316L615r913K99P632l987n125M058J212k369K969o95m861
$$ 6348 -599 -7561 2755 6370 -3543 -3244 4388 401 -4724 -666 546 -1823 1146 451 -4410
786d410N542N166p588k079Q994j163r668L026P214m525m412M071Q05k274J462
$$ -4410 1132 6298 -1290 -3369 5625 4462 -5206 -2180 5034 509 -3903 168 973 -1301 161
801A61l61j304L338r18o109K293O756l479n284N446L940n633j009O011J9l647
$$ 161 -200 -1504 1834 916 -5193 -2900 3856 377 -4907 539 4479 -1154 -2163 3848 3867 220
817B20n52N01K66Q63k209j679L590J170n202o19O480M7o464N78M887j718k927
$$ 220 -332 169 435 1298 -911 -2590 1000 2170 -3032 -3651 2829 2876 -3588 -3010 1877 159 -2768
834b768J474K667K01j937q51K422K483k153l327K509K960m351l135M317K517l927
$$ -2768 -1294 1373 1574 -363 -1214 1208 3691 1538 -1789 720 3680 -671 -3806 511 3028 -899
850h99k430K959K788k140l008J787L265j995m379J745N302j263n094J863M924
$$ -899 -3329 -370 2418 278 -2730 -943 2322 327 -4052 -2307 2995 1732 -3362 -1499 3425
865C425j180l770P13L535J50l879j607L674J938m103k626M891K896n528k280N534
$$ 3425 2245 -1525 -812 2723 2873 -1006 -2613 1061 2999 -1104 -3730 1161 4057 -1471 -3751 1783
881A783J501n049j516L102J787k307k143J639L823o56m711P74O372j447o923K347
$$ 1783 3284 -1765 -3281 -179 1608 -699 -2842 -1203 2620 1964 -2747 -1973 4399 2952 -3971 -1624
897a624O280l165n324K943M008k040k730Q95J918Q95k207l255K973M386n064m892
$$ -1624 4656 1491 -3833 -890 3118 1078 -1652 -757 1161 2056 -151 -3406 -433 3953 -1111 -6003
913f003O582L918o736j847O661N73n538P68L989r35j615n27l71K874J144n276
$$ -6003 579 4497 -2239 -4086 2575 3148 -2390 -1622 2367 1432 -183 -710 -1081 1793 2937 -2339
929b339l09P065j101p915K419P343m581o128M886L424m452j285K755N97P46m08
$$ -2339 -2648 4417 3316 -4599 -2180 5163 582 -5546 -660 2764 -1688 -2973 -218 379 1125 717
945G17k956K023M944l919n469O293M473q201k452Q607n4p725J529M597j833k117
$$ 717 -2239 -216 4728 809 -4660 1633 6106 -2095 -4547 4060 4006 -3719 -2190 2407 574 -1543
961a543M95p57J546J924m383j473P864K19r095L110R508n146p540O080M712n876
$$ -1543 -1048 -1805 -259 1665 -2718 -4191 3673 3892 -5203 -2093 7415 2269 -5271 809 5521 -355
977c55k336L591K20o99L05l198L56N770l223o654O083N690q323l719R662J364
$$ -355 -2691 900 1120 421 726 -2472 -2116 3654 431 -6223 -140 5550 -2773 -6492 3170 4534
993D534q329J290O472k267k686J814o40J79K366m100l078P355J445r318Q72R705
$$ 4534 -3795 -2505 3967 1700 -986 828 188 367 2733 -1367 -4445 2910 4355 -4963 -4091 5614
1009E614l640q352N736N831o496k249M990k62j651J362j854m90N026j607p039
$$ 5614 1974 -6378 -642 5189 -1307 -3556 1434 1172 -479 883 -971 -1461 3565 1958 -5081
1024e081M612P067p795n539R316K363r151Q11P145k719l629K989M71j236K078
$$ -5081 -469 6598 -1197 -6736 2580 4943 -4208 -3397 3748 1029 -2600 389 860 -376 1702
1039A702j732l471N260K631q331k02R830l137r143N513P074o657l906N732R04
$$ 1702 -30 -3501 1759 4390 -3941 -4143 5687 2550 -6593 -1080 5994 -663 -4569 1163 2067
1054B067l259J169j74j387M063o5o265L009O927o310n667Q267L064r549k86Q415
$$ 2067 -1192 -23 -197 -1584 2479 2414 -3851 -842 6085 -225 -5892 2375 5439 -4110 -4396 4019
1070D019k302n977L352K420j993J113p52k960M377L248p198j791R320p92r419
$$ 4019 1717 -4260 -908 1512 -481 632 -120 -3080 1297 4545 -2653 -4444 4876 4084 -5335
1085e335L733P903n984m895N963J541m648N17J266j209J964L33m917K067O836
$$ -5335 -1602 6301 317 -4578 1385 2926 -1722 -1205 61 -1148 816 1149 -3768 -1701 5135
1100E135m679o738P385N002q356k008P752n64n897K399K812k476N4Q70k380J805
$$ 5135 456 -6282 1103 6105 -2251 -4259 3493 2929 -2968 -569 2243 -233 -179 691 -1689 116
1116A16K953n084k249P519J1q714K708Q139m339n964N350L105m344n20K381j294
$$ 116 3069 -2015 -4264 3255 3266 -5448 -2740 5399 1060 -4904 446 3551 -793 -1313 1068 -226
1132b26P24J221l685J60N463k685n610M883M649o904k623P533K84o701J630M355
$$ -226 498 1719 -1966 -1806 3657 972 -4638 245 4894 -2010 -4633 2900 3184 -3517 -1887 2468
1148B468j774j620J034q64J159K363l671k455N872J183p473Q23P370l107n934
$$ 2468 694 -926 108 -756 403 2766 -905 -3360 2512 3695 -3778 -2955 4415 1308 -4626
1163d626M351L850m408j563L070J63q58M09j732K05M016j689m894L708M883n599
$$ -4626 -275 3575 -833 -2396 674 837 -21 388 -1344 -1139 2877 1188 -3706 2 4885 -714
1179g14l544O293J608n850p6M234j034k547J185L88j70J404j947j846M228J379
$$ -714 -4258 2035 3643 -2207 -2283 1951 917 -1630 -445 -57 -227 1177 -770 -2616 1612 2991
1195B991n722J0O282j456n845K812M472l217k551K613R60j383no42j13K233q39
$$ 2991 -2731 -2721 3561 2105 -3740 -928 3544 327 -2224 389 1349 -34 -39 -681 -794 1439 600
1212F00l616K400L826l582l345M703K234n177m28M439m61l126R15J233j96K55
$$ 600 -3016 -616 3210 -372 -3717 986 3220 -1957 -2385 2054 1593 -1533 -618 615 419 674
1228F74j206p79K284J141l905m36M776p51m848J850L990k447k822K480J740j767
$$ 674 -532 -1311 973 2114 -1791 -2227 2549 1798 -3050 -1200 2790 343 -2479 1 1741 -26
1244b6p50M43L40J002o42k187J447K757k526k733L435K235l948j189L724M67k936
$$ -26 -776 -333 7 1009 367 -1820 -373 2384 -142 -2875 560 2795 -1153 -2342 1382 1849 -1087
1261a087n0J999o7q92o03Q6J573L92k672k89L351k87l814R68L686j544l151J767
$$ -1087 -1137 862 795 -97 -700 -614 959 1351 -1321 -1610 1741 1454 -2360 -1392 2294 750 -2401 -634
1279f34K240j502j086Q11O69M26r01r77J102J862j902k062K140K129k889j547
$$ -634 1606 104 -982 -171 498 924 23 -954 148 2010 108 -1954 186 2315 -574 -2121
1295b121L032N70k532m65J983L41j357l41N67R48n3j532N7K416j86k718N34K836
$$ -2121 911 1481 -1051 -1516 467 808 -549 -890 -323 625 572 -960 -903 1513 1327 -1391 -857 1979
1313A979r02k562J075J846j077j595P50J331m23j043l04J048P60j301r44J742
$$ 1979 1077 -1485 -410 1436 359 -1236 -486 845 422 -621 -925 123 883 -418 -1362 380
1329C80J032j918j023K277Q58k279n56J925M72j509n36J180P18r03j124M94J543
$$ 380 1412 -506 -1529 748 1606 -673 -1229 696 1168 -341 -877 303 1021 118 -1006 -512 1031
1346A031m90j768M44K146r01j895P56K054r23j567P56J339k59j462J61J400J37
$$ 1031 541 -1227 -783 1363 462 -1433 -677 1377 454 -1113 -357 982 723 -739 -578 822 959
1363I59j397n24J438O82j653p96J657P01j581p88J616P33j374p82J219R64j269
$$ 959 -438 -962 476 1158 -495 -1291 366 1067 -514 -1302 314 1047 -327 -1109 110 1074 -195
1380a95r31J256R00p94j090O29J273n51j314M14J321l77j483L12J507k20j724
$$ -195 -1126 130 1030 236 -854 -225 1048 497 -817 -403 918 541 -942 -630 877 657 -1067
1397a067L39J475j55j323J72J267q7j063j71R48L82q64o28J018O11j122p78J296
$$ -1067 -728 747 592 -731 -559 708 621 -442 -613 335 717 -147 -775 243 854 -268 -1046 250
1415B50P95j218j048J465P11j085o60R75N19o37n88K95Q54j23r67j03J235M0j532
$$ 250 1045 -173 -1221 244 955 -130 -790 185 704 67 -521 -226 628 505 -462 -565 670 710 -822
1434h22J14J625l88j480N24J210l41j041J15Q16l1n41l11O64Q08q23r37J066R83
$$ -822 -708 917 529 -951 -427 783 442 -599 -484 332 301 -240 -551 113 921 98 -839 227 1210
1453A210j329q89J323P07j374n18J207J97o91l78L95K94J17o71k79J150K71j427
$$ 1210 -119 -1008 315 1022 -352 -870 337 534 -157 -535 -140 154 271 -400 -679 471 742 -685
1471f85n9J661n6j684M96J245n77j050O12N39k95k90j95J76N73k59j010O32J084
$$ -685 -744 917 861 -823 -327 918 341 -709 -97 442 147 -143 -338 -162 411 152 -858 -226 858
1490H58q17j143J283Q60j441m21J239J82q37j20N16J7J29l34k68N89L98j153l65
$$ 858 41 -1102 181 1041 -400 -821 418 600 -237 -357 159 176 305 -29 -297 292 690 -463 -828
1509h28J609j97j510L08J497o72r87P20N81n41k06L22j60L32j9p61K64J086p24
$$ -828 781 584 -926 -618 879 207 -780 -60 521 -20 -226 96 -64 268 249 -512 -248 838 114
1528A14j136J120J018j332o02J217L26j169N2O82j84j54m2j76M45L03o87l97J129
$$ 114 -1022 98 1116 -216 -818 399 725 -444 -392 290 106 -48 -90 -266 179 482 -205 -602 527
1547E27J52j474K70J406m25j244O21P29o39l55N23m8r8J45m49m9Q23j54j048P38
$$ 527 679 -795 -525 881 456 -788 -167 562 -77 -432 91 43 -55 90 -359 -408 415 261 -787 -49
1567d9R62r13q48J112N00r54k70P62m3l75P9j19J65K73l65m60O22M31q94l11J249
$$ -49 913 0 -848 264 764 -190 -460 302 259 -116 -37 -156 9 282 -83 -543 79 510 -384 -695 554
1588E54o5j077M40Q02m80o19O52J56m01J34j32j97M70P4q21K30Q75m09j033Q02
$$ 554 489 -588 -148 654 174 -445 207 363 -38 96 -36 -233 237 311 -510 -280 595 186 -847 -45
1608d5O54q51l60R13jo34L51J52k19J87J2l70K46M50n75m66Q83J54r69k6R68l68
$$ -45 609 -242 -602 311 310 -324 27 179 -40 147 159 -211 35 485 -90 -556 327 481 -488 -514 454 86
1630H6n61M02L10k56j03N5j02J78J87m43kN60N5r53L86Q48p52n69P81L32o98K6
$$ 86 -475 -73 237 -19 -122 -67 -169 9 196 -247 -249 311 366 -587 -201 647 -105 -674 107 439 -259 -233
1652b33M68k64J0J20l24J48K89k08m65N09N33q91JO80M1q28L69M20l15k09K21
$$ -233 235 -29 -19 101 -223 -75 214 6 -459 50 583 -308 -307 373 414 -414 -45 375 60 -149 72
1673G2j9j16K9K4l16M22K58o16P7O21k00p84N93L95n05k28M69j3k34R0j9j37K37
$$ 72 53 -63 -34 -10 -326 96 354 -262 -185 436 236 -548 45 440 -65 -293 176 163 -71 19 0 -137 100
1696A00O9m87J81N42m45m52O39L22o34R5L14j41l65K06J58j63O9N7k00N4L95m30
$$ 100 169 -318 -137 405 -40 -492 147 469 -165 -70 244 103 -262 -56 102 -61 8 65 -135 -81 314 -116
1718a16j34M94J4o20J54M22k00l96M49K21m94M8K48j60J3J59k64q9N20j18l66
$$ -116 -250 244 258 -362 -208 214 14 -382 67 288 -206 -158 90 -70 -57 102 -162 -251 269 151 -215
1739b15J23L87l38m41N72J00m08Q2K96n4j92K00k31J8K67k10j63K07K37l83p3
$$ -215 -92 295 -43 -484 88 188 -220 -138 158 104 -88 112 -119 -101 166 -44 -207 0 237 -146 -219
1760b19M95j70l04J08L55k11p8P2J7m9Lj10o0L07jm03J43L52k25l39L20K56l37
$$ -219 276 106 -198 -90 265 54 -24 48 65 16 19 -91 -151 156 155 -248 -105 247 22 -317 3 259 -78
1783g8q3K69j43p0J38j00N5K37j20j15J9J55k51j16L55L8m12J26K17l9k54J71
$$ -78 -161 108 -35 -105 33 -67 -12 225 105 -10 9 164 -87 -203 152 190 -222 -96 121 82 -172 -1
1805aM7j41O7Q7j57rJ97j84M2J56rk19J65J97j77k81L36j8o0o1J9N3l7jj88k3
$$ -1 46 -95 -28 59 -98 -107 90 -94 -52 104 95 -124 41 238 61 -220 116 98 38 -23 -4 49 12 11 -177 -200
1831b00L04n1k09L13p0r4n3J73k0k02M6Q7J42k39N5O3l2J58k89L3J63R4l53J34
$$ -200 104 53 -156 157 87 -7 -60 113 93 -109 -63 24 166 -73 -18 45 13 171 -118 -85 78 172 -181 -47
1855d7K35r4o9j07K69j35m0m0J49p4L1j95J04J20j88j8M8K36j36j54J43J14j99
$$ -47 188 94 25 -82 187 52 12 -28 121 47 78 -117 -13 107 -81 -99 -51 185 49 -105 38 152 -47
1878d7j43J81J8l7n7P2J69n4q9n4Q9j55J91j54J54j63r7J09K5O0J7p2O7q1o2N3
$$ -47 -190 -9 9 -28 -85 -13 156 102 13 -41 48 -107 84 -70 84 -79 -176 -67 -42 18 35 -37 30 -51 -113 -60
1904f0O8n3J0L2L9K7l0l3K7KQ6j56oK26k35m2mJ98j33l1J76o2j59P7J31j23J1
$$ -60 8 -45 -35 -3 36 63 33 0 27 29 115 -41 -47 179 -56 -98 -102 96 -37 -68 108 46 -113 -36 95 -28 -17
1931a7o0j7J74Mq6JJ10Q8k01j00K98j00m20L45K9l8o6Q4ql9J45q2j63R8M8r6O9
$$ -17 -77 -94 80 84 -2 -1 109 197 -4 -104 194 94 -326 19 48 10 -56 28 20 -19 126 44 -119 -21 27 -69 0
1958@J98k65j27L27j1j98l3N9m0K0J50l4j44J83j17j19J69N3j32KK14m6j70J48
$$ 0 198 -67 -194 133 122 -76 -109 -50 -90 -70 80 46 -98 85 -32 -151 18 71 -61 -59 155 109 -61 87
1982H7K4j85m6L40j78j19K5K34l41K04J07k59Q3J21j74j61K41l0r8O6L31l36j55
$$ 87 111 -74 -120 220 42 -77 -52 182 -159 45 152 -107 -24 97 -77 -238 3 -27 -125 -59 272 -64 -219
2005b19M19j0l51K12R4j15l5J95j46j33K55j30j84J94K22m50JL65l7m56J72M41
$$ -219 200 190 -161 51 145 30 -5 190 44 -89 166 36 -148 46 268 -182 -181 184 147 -309 -137 304
2027C04k67j16L30r7k10L02j42j85K87p3l66N8L78k74j54K47P1k59J1K98j92l4
$$ 304 37 -79 251 154 -56 246 104 -81 206 133 -233 -175 203 -71 -225 22 93 -166 -155 143 -49 -83
2049h3K35r4j58K42j4l65J85K85k55k07M44j22m58K04L17k34r3L17n0j93J72O6
$$ -83 152 58 -100 142 128 -237 -52 233 -22 -229 215 93 -365 -161 156 -78 -171 146 96 -97 75 141
2071A41l39J95K53m10N8M33l61k80N20J31m80m2L88j73k08K64L6k45K82j07l20
$$ 141 -198 -3 250 -160 -102 331 -30 -310 210 341 -139 -181 207 34 -174 90 126 -119 163 56 -264
2092b64K15J33k92j31N37l4m97L00L06k30j84K71n1k12K90m1j24n6L38m40O8L54
$$ -264 -49 84 -208 -339 198 164 -333 -33 273 43 -141 130 79 -133 157 116 -8 -64 274 -166 -98 256
2114B56j96m77M14L28m70q6M17q1k34J78Rj66O7K15l34K14Q4k34j11L55P4m72
$$ 256 60 -417 -3 325 -145 -231 186 105 -129 49 58 -108 -41 174 -160 54 138 -96 -207 148 222 -250
2136b50J88L16l24k06L53J74m96M5L19j87lJ25k52J62L17l09l23M64J18l92m7
$$ -250 -62 254 -70 -276 77 251 -245 -200 119 -68 -71 54 -198 -36 281 -28 -351 113 231 -161 -208
2157b08N63j83m34N7M36k97p4K06n0jO0j14o3K70j02l32J53N78n21l23M85J63
$$ -208 355 172 -262 -205 231 -66 -140 66 16 15 75 -39 -102 168 66 -266 -113 465 -56 -379 106 269
2179B69l88j77K63K8L8j22p0J29K10j99k53L26K34m69j30N60l4n22J44M19k33
$$ 269 -119 -296 -33 -5 33 -89 -159 -30 180 -19 -272 54 288 -181 -311 249 215 -307 -163 256 23
2200B3j43J00K5M9o0j26R1K05k1l23PO56m60l32L65L65n07j66L53J79l89j0J39
$$ 23 -120 -20 5 54 -6 -132 -41 164 143 -180 -173 483 23 -309 56 421 -86 -252 101 280 -109 -119 20
2223B0L0m6j06j00M44J2m86P8M46q6n12K29L12r7l59P8L35n1k41l4J80J74o2m32
$$ 20 50 4 -102 -202 242 254 -232 -154 292 206 -306 -77 235 138 -221 -143 192 141 -100 -134 46 220 158 -274
2247b74K30M09l12l09L87J75l94k02N04%k91r0K80N9r4k56P6K59K03o72P9N36
$$ -274 -44 365 53 -256 131 306 -88 -290 214 214 -77 -167 113 172 78 -178 -102 157 360 -312 -233 303
2269C03j83m65J70N21k49n26L74L23l35P4j10J38K15j08m46L82L95o25l20N28
$$ 303 120 -345 -175 346 97 -429 -55 268 -67 7 -103 35 250 142 -304 78 473 -152 -472 56
2289E6L08m95k37M68J17m66k6M01o6M2k55m0L52N0l85j48O05O6p27K20M40j51
$$ 56 364 -131 -368 100 217 -249 -275 126 60 102 -153 -193 159 209 -176 -324 281 347 -380 -160 280 129
2311A29m21K23K55j19k14p6L37M5j93k08L39K70l84l13M99J72m21k37N27J73n21
$$ 129 -292 -69 186 67 -147 -223 114 159 -34 -242 97 367 -17 -330 169 341 -80 -317 210 383 -138
2332a38p1L32k6j36j00K0K75k1l05o4N76j95m74J50N81l59m17K92L65j92l79K36
$$ -138 -209 123 97 -39 -139 -119 156 135 -170 -234 342 147 -327 -177 404 45 -372 -80 285 93 -286 -50
2354e0K30j9k21j93L70J30n33j47O21J73n75j78M85M13p65l6M63L8k69k87K97
$$ -50 180 161 -60 -253 117 247 -286 -433 188 361 -214 -392 93 506 -259 -295 168 206 -63 -350 -53
2375e3L72k24l21J22L85k49m36L41L37j54n36L18L22j77l97K37L33m2l87O5K21
$$ -53 319 95 -226 -104 281 32 -404 -63 274 120 -416 -98 224 47 -350 -113 220 178 -209 -144 77
2396G7J58m66lN19P6n61j06M91P5l94k16N34M5l39k60M52L18l27l87K11M40k14
$$ 77 235 -231 -234 285 361 -200 -306 185 260 -134 -350 184 229 -110 -370 82 400 73 -314 -103 337 123
2418A23m98L80L09k31l98J61M92k35m50L14L87j48l90j10O29j30m17M9L84q6l55
$$ 123 -375 5 314 83 -315 -154 338 103 -347 -33 354 206 -184 -294 335 205 -212 -163 221 135 -220
2439b20l5N37j4l94j92M63K09m96j08K69L35l93j96K99L04l78l91M50K61m12l59
$$ -220 -255 282 268 -126 -318 145 354 -142 -250 19 354 -39 -235 64 368 -10 -401 49 310 -102 -461
2460d61M60K54r0n76K43L38O7n92K25M68j15n94J41N21j75m50K33L31j11l51m6
$$ -461 -1 253 163 -413 -170 168 235 -357 -132 336 221 -373 -232 289 114 -336 -103 228 117 -234 -280
2481b80M52R4m38j70N02K30n22j58L50K78m78k01M14K82n22j46L61K81k77l14
$$ -280 172 266 -172 -342 160 390 -132 -290 60 338 -140 -341 73 355 -167 -313 48 329 52 -262
2501b62J02M60j28m96K51M22j58o10L69L75j28n48K47M48j27l89l4L76J05k81
$$ -262 -160 300 172 -324 -73 349 191 -419 -50 325 197 -351 -104 344 217 -172 -206 170 275 -6
2521fk38K67L53o13l3N16N3m32j54N20O0l27j84L86l8k18j43J05L44p1n03K51
$$ -6 -244 23 376 -237 -270 246 299 -133 -287 233 293 -34 -218 168 130 -88 -231 -126 218 147 -356 -105
2543a05M32l35l83L45M02k40n31L24M29k93k67J11K25Q5l32o0K56J68l78j15L78
$$ -105 327 -8 -391 -46 356 116 -415 -91 338 45 -222 -111 114 199 -133 -193 63 231 -147 -262 116
2564A16K38n65m7N25k0m25P4K36K2k22k68K89M30l90l28L26L51k34m83K29M87
$$ 116 354 -211 -258 267 247 -178 -104 132 154 -68 -336 -47 383 -7 -335 -9 342 108 -375 -146 341
2585C41l09k29J72L01l38j72J76K90j09k75J04K29n8k79k06N86om98l5N06N5n77
$$ 341 32 -197 -25 276 -62 -234 -58 232 123 -152 -48 181 123 -156 -362 224 218 -280 -315 191 246 -331
2607c31J09M53j20l63K8K14R9M0l55P6M20k53m53L98M88m78k63L18K33l25o7K39
$$ -331 -222 231 111 -252 -224 -10 89 129 -226 -150 270 17 -436 -38 450 -28 -291 27 260 -65 -132 107
2629A07P2r3k17j21N00l1l72n1L62J11m85M5N24k77m88K47M94k55l53K85J1J38
$$ 107 179 86 -131 -252 248 217 -155 -206 156 267 -218 -173 351 74 -414 -167 327 72 -281 4 15 153
2651A53k78j9K11N9j57l48M49K99m62j65M11J70m90j06M79n0j63j18K7J33R2l43
$$ 153 -125 -144 67 126 -31 -379 70 369 -93 -258 153 323 -167 -273 206 156 -7 -125 -98 35 127 -216
2673b16P5L83o9n77L04N93l70m01K53L29m01p9J51P3l6j45k0K20N7k45j21K97
$$ -216 -141 242 173 -404 -100 493 123 -278 -25 304 -97 -176 -25 48 12 -133 -153 67 124 -121 -242 55
2695E5K15m35k10P16j34m08J2M39j90q7j46K01Q5l3l15J94L50k05l69J64M73l88
$$ 55 270 -165 -375 341 207 -201 -189 250 60 -27 -173 28 113 80 -235 -41 309 104 -265 -101 372 -16
2717a6l83M30K29k89k01K99O3j30k05Q4K40k3l31J6N47o4n23L5N38j5n78O9M75
$$ -16 -399 31 260 -29 -230 69 132 2 -203 -119 121 98 -233 -217 330 266 -257 -222 316 301 -277 -208 267
2740B67j80k94O9K26Q9j69j47N6L42l11k01K90L92m83j94N35J04n02j15L48J84
$$ 267 87 -207 -138 88 177 8 -139 -83 259 -52 -253 37 429 -54 -248 287 391 -111 -226 122 306
2761C06m08O0j6J13M0k21NL89j00m66J76M00j38m51J72M00r9m14K69K18r8k04
$$ 306 -102 -42 -58 55 95 -126 -121 268 168 -298 -122 278 140 -311 -139 261 162 -252 17 235 137 -67
2783f7o1K33L7k11j89L18K40l90j90L98K18m22j84L63J78l12j50J39K20j86o0
$$ -67 -128 105 142 -69 -258 60 300 -90 -280 118 336 -86 -270 93 271 -41 -191 -52 168 -18 -78
2804g8R5J77p4l72Q3L63j04l42J59L95k45k79J96K48j97j61K13j7J73m11k4K70
$$ -78 17 194 120 -252 -169 194 90 -252 -93 302 57 -222 -26 222 25 -136 77 60 233 -178 -202 68
2826F8J62k80j70K90J49l54m5L27M3l45j78L59K44l39r6J00L23k17l11J96K60
$$ 68 230 -50 -220 70 219 -135 -180 147 190 -155 -333 26 270 -69 -165 -65 258 41 -270 -74 186
2847A86k6m58K49L16j36m54K76K65l00q4J23K50k15k3j78K13K51l24j45L76J21
$$ 186 160 -298 -49 267 131 -323 -47 218 -82 -166 -43 207 -8 -31 -209 4 255 -69 -214 162 283
2868B83m88L3L32K2k83r8L87J67m92kK44J50l66j53K33K96k65k55K71K09j43k94
$$ 283 -205 -172 160 182 -101 -199 188 355 -137 -139 105 255 -111 -264 -31 265 0 -255 16 225 82 -212
2890b12K00L14k97j96K04L3J10k73o6L53p4l27J9M06K7l25m0L91o1l83P6L15L0
$$ -212 -12 302 5 -191 13 46 156 -117 -183 170 96 -231 -212 194 221 -104 -144 247 186 -197 -121 194 224
2913B24l12o0K47J02l53M7J42J77k90j15K48L41m01k72J84L29j40m00K77L15j78
$$ 224 -88 -148 99 201 -152 -105 37 214 -76 -191 57 398 -3 -275 -91 238 98 -302 -25 290 112
2934A12l01J48K07n2l86J77J68O8m11L0M12o5k84K4K99j6l15Q1K12K00l76n0J87
$$ 112 -189 -41 166 114 -272 -95 73 141 -270 -240 172 107 -177 -153 146 130 -185 -104 108 308 -68 -118 69
2957F9K04l56r1L81m7k61j44K70K62l04k50K74J80j39k02J87K53k27k59K25K20
$$ 69 273 -83 -174 207 160 -101 -245 25 287 -17 -267 7 187 48 -154 33 286 59 -200 25 245
2978B45k88j06K03J14r0k90J4K71J15m26Q2K66pk66O2L27l7k76n3K69l4j81p6
$$ 245 -43 -149 54 168 78 -212 -198 73 188 -238 -156 110 103 -163 -101 226 189 -87 -140 129 95 -86 -162
3001a62J23J32p4j87R6K77j96k53K93J28k66o7J63J52j21j13K31j00J2k47J73
$$ -162 -39 93 19 -168 -72 205 9 -244 49 177 -89 -156 7 159 38 -75 156 56 68 -179 -6
3022fJ08m3k25m1L86m0l81J29L12r2n21L46L08k25j70Q1K88j78p9k5J43O7j83
$$ -6 102 59 -166 -207 179 139 -242 -113 199 107 -414 -68 240 15 -155 -74 214 36 -43 -68 75 142 -41
3045d1j61L33J33k73k84M51L7k36j54L01O3j40k46J78J48mk26m5K79R6k98pL26
$$ -41 -202 131 264 -9 -293 158 195 -41 -195 106 169 29 -217 -39 109 105 -121 -166 113 209 -89 -96 230
3068B30j03k98OK49m8k79K54j7N2j94kL17p0j78PJ96N7k09j09K66O6k58j92N37
$$ 230 127 -171 -165 84 36 -243 11 -6 46 -148 -150 167 97 -81 -74 122 179 -30 -139 127 193 -65 -257 280
3092B80r0l13L6J72N5j84j7K2K01j21k65J82K84q0l66J36K79k21j64K38M7j46
$$ 280 190 -123 -87 85 140 -44 -61 -39 162 41 -224 -42 242 162 -204 -68 211 -10 -174 64 111 -35
3114c5j33J16J67j08r2p2J66J53k21j15J53K58l68m8M30J7m68O8M01j38j52N0
$$ -35 -168 -52 115 7 -85 -157 9 162 -59 -174 -21 237 -131 -179 251 268 -200 -132 269 131 -21 29
3136B9j5M6nj66K4L8J58l42J54K16j82k40L03J71k32l6J24Q7j90Q6p9P2K0mj76
$$ 29 14 60 55 -111 -87 -49 109 -233 -79 137 -45 -285 18 189 -43 -79 45 132 -58 28 -51 21 41 37 -139
3161a39J78J45l06q0L55n7k29M8K72j64j75J66K8K3p7nj9J60j51j68J08K85k87
$$ -139 39 184 -122 -202 153 96 -133 -85 187 23 -152 14 42 65 -12 -17 -36 124 -27 -195 -87 198 -89
3184h9k69M78R6m56J12J93n6r7N4pKM2j1k11L46m5j31mK27L7l99Q4L13k12k35
$$ -89 -358 120 216 -240 -128 65 9 -88 -34 -41 -39 3 -8 -219 127 82 -49 -53 174 211 -188 -104 209 -3 -238
3209b38K35J69k63o8J40P2M8k5k43J71J94k22q3J83J80l06l5K02n2l17K64O4o8
$$ -238 -3 166 -97 -165 -25 47 95 70 -173 -2 192 -30 -113 70 250 -56 -91 111 59 -258 6 70 2
3232BLj15J03J8Q2k37KL48p6m12K26K27m8l55K69P3k48m0K35m7k7M2m0jK36k08
$$ 2 5 -110 -7 11 93 -144 -142 206 130 -282 -56 171 123 -232 37 110 -138 -178 57 10 -17 25 -15 -16 220 12
3258A2l55M04Q6l95M5L80o9l94J64L21j78p9J09j51J85q6j1m0K43j93k87K63K45
$$ 12 -343 61 147 -248 -203 177 108 -286 -122 199 21 -58 51 -100 85 -1 -12 -52 191 -2 -289 -26 219
3281B19j74k04J91J67m15L5K80j1j45k1J03j3J73o7j73K33m9k15LL26j71k58k0
$$ 219 45 -159 32 199 -216 -181 99 88 -57 -78 25 12 185 118 -55 178 129 -86 -83 243 72 -186 -206
3304b06K78%l01K21Q4K2j65P8L3J0j9j78J38J90j69l13L70J05k84L1J98ok57O7
$$ -206 72 72 -229 -8 76 98 -67 11 44 54 35 -143 -5 185 16 -297 73 178 -106 -75 123 117 -140 -73
3328g3J87J0k4j96M2J04m2j62N6L98j56k49J5L51r8m15K62K48k37j67J01J56R1
$$ -73 114 124 100 -96 -54 50 8 -154 -98 300 144 -105 -90 261 163 -252 10 258 21 -146 -45 111 202
3351B02k77j06K47O5j63o9R7J69j57n9K15o4k10M0J16J79l51n7M6J65P6k59N7
$$ 202 -75 -181 66 131 -32 -101 -4 165 8 -51 164 100 -110 -70 46 225 -126 -183 -137 28 104 -155 -98
3374i8L05q6l03J67J83n3j78o4L49k74j13J05J41J74l76J64J53j78nk08J23K05
$$ -98 207 121 -182 -15 168 115 -63 -127 222 -52 -165 -60 81 255 -121 43 196 18 13 -195 -72 133
3396A33k72K3J10L4j09o2K96k7j77o5J15K53l11m1R2J60j16j30J24J79r5l01K27
$$ 133 -139 -116 -6 28 -81 -143 153 126 -51 -116 -1 252 -59 -100 -8 152 36 -94 30 209 114 -187 40
3419D0N8j18j4j3K04j26j41L7K86j60j53l5K85L4l62K9K94j0k68j07L95n5k23
$$ 40 98 -20 -34 -47 157 31 -110 -73 213 53 -100 -135 150 184 -178 -149 145 135 -133 -240 155 100 -123
3442a23j24L94R9l52M2K15j8j89j13K61k6q6o2J63P1j63k02K19L9r0j12K4L06
$$ -123 -247 147 246 -106 -64 151 133 -56 -169 92 66 -20 -82 81 152 -11 -213 6 45 -45 -157 -133 173
3465A73m0m38K36K00o1k06L0K95p8k07j4K67q2j56p3J50J64l80Q8K87l3j92lJ12
$$ 173 133 -305 -69 131 70 -136 -106 189 111 -96 -110 157 75 -81 -154 -4 160 -220 -132 155 122 -70 -73 39
3489C9J50l26M0P9J74j26k01J47K39j39k62Q7L27j97l42K35K02n2j22n5K27J5
$$ 39 189 -137 -97 -18 156 30 -171 -24 215 76 -186 -99 228 31 -311 -76 126 74 -48 -103 124 139
3511A39j42p1K15J39l35L6J92k4j40j63K25mk66Q6K86p4j99NJ89P3k11j05J19
$$ 139 -3 -74 141 280 -55 -19 173 149 9 -154 71 67 -199 -113 173 99 -100 -95 94 167 -44 -149 -30
3534c0J18k6k51K33J01j29m24M97j2k8k51K23J75j70p8M4J60k7k59J10K32r1j19
$$ -30 88 62 -189 44 145 16 -408 89 77 49 -202 21 196 26 -52 -8 152 125 -134 -24 208 117 -2
3557bj17K40L1k61r3K69Q5l50J66K51j91p8n5J12J50j82j55K15M5k39P1J73L6
$$ -2 -119 121 152 -109 -202 67 152 -198 -32 219 28 -50 -105 7 157 -25 -180 35 80 -159 -88 85 121
3580A21j82j39J98J83l54j8K84j5q2j27L0K19K0k85ML16p9k16M9L00L4m50J96
$$ 121 -61 -200 -2 181 -173 -191 93 78 -4 -131 -101 118 138 -147 -143 173 94 -122 -73 227 261 -189 7
3603GQ3Lr8j13J78P5k44QK17k4q8j77N6L58k88j83J19K16j25j48K12o6Q3j89L7
$$ 7 90 93 -5 -118 60 135 -109 -101 116 92 4 -173 -117 241 -47 -230 -111 105 -20 -168 44 -22 61 -128 -91
3628i1K38j36j95J18K10q3k34J26K06j21k40J16J33j3j45K0J98j28l0p7J37J24
$$ -91 147 11 -184 -66 144 61 -173 -47 159 38 -202 -86 47 34 -111 -91 107 -21 -51 -128 9 133
3650A33k88q2K31R0k63L4L10q7k18j46M17J03l01M7m6K43j92j96M6L09j17n4l5
$$ 133 -155 -237 -6 84 -179 -145 165 78 -140 -286 131 234 -67 -20 -66 177 -15 -211 -165 144 27 -27 -62
3673f2K40j54k44P8K67K0k30J5K22p5j76o1K34k9m8k04L31R4k98o5K13J37k88
$$ -62 178 24 -220 -142 125 145 -85 -70 152 77 -99 -160 74 45 -3 -207 124 218 -80 -145 68 205 -83
3696h3n5K51J35k84j00J54Q2j64J5m0J35mm3k7J80j51j45J55J11j74Rj6J72Lk52
$$ -83 -138 113 248 -36 -136 18 100 -64 -49 -89 46 42 -1 -28 152 1 -144 11 122 -52 -43 -59 113 116 -136
3721a36R1J09j7j00k7J57n8j35j25M27j08j67m0J91J05l60K64j15J71j53n5M0
$$ -136 -45 64 47 -53 -80 77 19 -116 -241 186 78 -89 -129 62 167 -193 71 -44 127 -26 -81 -41
3743d1J29m3k10J93J02j18j18J04J75j59j91K10P2o3k06J47J50j48n6m0K54n8
$$ -41 88 45 -165 28 130 12 -106 -2 173 14 -177 33 105 42 -164 -17 133 -15 -71 -111 143 85
3765H5j45m4K32k5k31n3L02j47r6J02J46j06p9l4K00M1J7k41J21Q7q0k00R3K25
$$ 85 -60 -104 128 103 -128 -181 121 -26 -122 -20 126 20 -59 -93 107 148 165 -76 45 132 52 -148 -55 170
3789A70k09j50J16K40j70j87K31P1j51p2R1O3N8k11k2K83J0l42J79J07j70o3M8
$$ 170 -39 -189 -73 167 -3 -190 41 112 -39 -111 -20 43 101 -110 -132 151 161 -181 -2 105 -65 -128 -80
3812h0J99j53J3j4PM7Nj27R9J60j67j30K48k5n2j98K78l9p3j14J52Q8k06L1J34
$$ -80 119 -34 -21 -35 -28 19 24 -103 -4 156 -11 -141 107 82 30 -168 110 71 -2 -116 36 124 -82 -51 83
3837H3J1o0j53J67J3p7p9J59K9m2k27J31K36k53q0L7J71oj17k7K05j04k0p2J14
$$ 83 94 34 -119 48 61 -16 -95 64 93 51 -176 -45 191 -62 -142 -105 66 60 -57 -84 121 17 -3 -75 39
3862C9L3j48p4K16N9j12n9n1O1o5o5J16O4L1q4L9J40n7k79P6K14l0k05J53O7M5
$$ 39 72 -76 -150 66 125 13 -46 -97 -36 -101 -166 -50 14 45 -39 0 140 83 -196 -120 94 64 -141 12 79 124
3888A24q3j7K4j20N8l7N8Q0j29p6K42j9j31rR3l0o7p3L1J23j19J01rm1P3j39J21
$$ 124 41 24 48 -72 -14 -51 7 87 -42 -118 124 105 -26 -35 58 28 -39 -112 -81 42 -77 24 15 -26 47 -92 29
3915B9J2l0r9P6J17k37N1J46J4m7kp2J91j67M2kP8p4j4l2K6K2j04Q9J16p3j35
$$ 29 41 11 -88 -12 105 -132 -81 65 79 32 30 -42 149 -18 24 22 100 26 12 -20 6 28 -76 13 129 56 -79
3942g9R9j32J48k49Q7J67Kr4J2K1P0q5j3J04Oo4p8M5Q0j40p0R9J09k4q9Q3K9j32
$$ -79 20 -112 36 -213 -126 41 43 -51 -39 -18 52 -33 -46 58 64 0 -78 -33 47 -93 -163 -64 45 21 -68 15 44 -88
3970h8J03l9O4P3j61j00K09j52R9j59K33k9j92R2N1J26k15j8P9J62j45j04K10
$$ -88 15 -24 40 113 -48 -148 61 -91 8 -151 82 53 -139 -47 4 130 -85 -103 -24 138 -7 -111 99
3993I9m1l6j35Q4m1j9P9J8R6j42k3l0J51j60N0M9m0J11o4r8J26nq1pR6L9r3l7
$$ 99 58 22 -113 -29 -70 -89 -10 8 104 -38 -61 -91 60 -100 -50 -1 -41 70 6 -92 34 29 -52 -59 37 76 -17 -54
4021e4J49m8j74Q2J5J44j18MP6N5j67K9O1L7j38l3J21ll3j09K18O2k46J0NJ32
$$ -54 95 47 -127 -45 -30 114 -4 0 76 131 -36 -7 54 91 -47 -80 41 38 5 -104 114 176 -70 -60 -55 77
4047G7q5m8J8M5j04L8O3J02j21j11KJ85L0k01J08q0J02j32Q6l7Q8l5P3m0m2q2
$$ 77 -8 -56 -38 7 -97 -59 4 106 -15 -126 -124 61 91 -110 -2 -82 20 -112 -26 -63 25 -10 63 23 -19 -101
4073a01Q4K6j1l6L0RO8j26P1n0K3K5l9k6N4R0j39R8r2l5L7OJ15j89J20m8QN5j11
$$ -101 -17 9 -2 -38 -8 1 69 -57 14 -36 -13 12 -27 -53 1 91 -48 50 -42 -77 -40 -34 81 -108 12 -36 -28 27 -84
4102h4R0J35l59O7J28J03m4m7nM6J28j16M5j2m3l9M3ppr2P1L9p2M4L1J2k5o7l9
$$ -84 6 141 -218 -151 -23 80 36 -11 -16 30 158 42 87 75 32 -7 36 29 22 -70 1 40 -32 12 43 55 30 -37 -76
4131g6J37K1m7j3L3L7j08o4O1N6r5l2K08k0j06n3L7P0j61J31j34J58M0j19N6J50
$$ -76 61 82 35 22 55 92 -16 -80 -19 37 -58 -90 118 98 -8 -61 -24 46 -115 16 -118 40 80 -39 17 167
4157A67k85N3N3K0Nm6K7P0o8p5J04K2mk21nK10Lj24J23K2n8j48J76o8L8r7O4N
$$ 167 -118 -65 -12 8 13 -33 -6 64 -4 -79 25 47 43 -178 -183 27 30 -94 29 51 -7 -155 21 -47 -9 -106 -42 -37
4185c7P9Kn7O1jpp7n6O3P2Jm0R3j12PJ9O1j23n7J26RN1k03J07P2j5j5j36J28N2
$$ -37 42 44 -13 48 47 40 -37 -93 -30 42 43 3 96 -16 -9 10 71 -52 -109 17 26 77 -126 -19 53 38 23 -113 15 67
4215F7j71l1K13l7j84J03J40l7j32N5j7P1j37J64k02K25n7K4oJ5j4j55J62P3k7
$$ 67 -104 -135 78 41 -143 -40 100 63 -69 -14 -31 40 -97 67 -135 90 33 57 51 66 52 -103 59 132 105
4240A05j21r9JO8k6K00j31J37k05J99j24J04j59n8J61l9Qj09R7P5j07k2R5l5j7
$$ 105 -16 -115 -114 -46 -72 128 -3 134 -71 128 4 108 -51 -109 52 13 21 -88 9 84 -23 -45 50 15 -2
4265bKj8M3O8j36L8O3j36m8J39Ln9%J02J4r8N3J0M5j21o1J42j22K54k30M6J5L1
$$ -2 0 -18 25 93 -43 -5 58 -78 -126 13 16 -43 -43 59 73 -25 28 38 83 -38 -99 43 -79 175 -55 -9 6 37
4293C7j41L9Q0mj56KK67j54k1N5M8p8Q2j37K3O1o0o8J06O6j02J8J52j96j0p8J17
$$ 37 -104 -65 15 11 -145 -143 124 -30 -51 4 52 -26 56 -81 -58 3 -57 -125 -19 47 -55 -37 115 -81 -91 -169 -52
4320e2K08j32n6q0J72p7r3O4O5M4j32J3J03j78J4K02j0n3r2O9J11m4j8q9J9P7
$$ -52 156 24 -32 -112 60 -17 -110 -46 19 63 -69 -56 47 -131 -117 85 75 22 -70 -1 110 66 48 -41 -22 55
4346E5m3j44O7J45p0q3J23jj09l3N8R9k4n7j1l7P4j38J68o4J13j10J5j1J09j91
$$ 55 12 -132 -65 80 10 -73 50 49 -60 -93 -35 64 40 -17 -28 -65 9 -129 39 -25 88 -22 -7 -18 91 -100
4372a00J40On2o1o1J36O4l6j31J54M6r9l9k8L4nlO6J3qj06K14o8j96O1M2N1o1
$$ -100 40 46 -6 -67 -128 8 72 36 -95 59 105 6 -33 -61 -27 -32 -35 31 44 36 -70 144 76 -120 -59 -17 34 -27
4400b7%P2N6j40pO9M8m1p4l6R4K0q9R0k8Rj2p6J10r8J4NK5m5Q6j06P3N0j23N2
$$ -27 -27 45 101 -39 -46 23 71 30 -44 -80 14 34 -55 35 7 16 4 -72 38 -60 -46 -41 -16 -61 25 -81 -8 42 -81 -29
4430b9J18j01j00QJ81j06R9j12J05J6k77K12L8j4j08n2J21J8r8oJ49q2L9k6Q1
$$ -29 89 -12 -112 -104 77 -29 70 -42 63 79 -198 14 52 38 -70 -122 -1 17 -81 -87 62 -20 19 -7 74
4455G4M8q7Qn5M6j90L8pJ51N5j72O6O0k7Kn7J01r0n0O5M6m0MO9P4k3j21k0K7N8
$$ 74 122 35 43 -12 34 -156 -118 -125 26 81 -91 -25 35 8 10 -47 54 -36 -86 -21 25 -15 -11 58 132 109 -12 -32 -5 53
4485E3j15m2L7J09o4K7J8J32j12j15J00L3r4L9O4k0j12o3J55M4o7Kn6P3k9l5Q
$$ 53 -62 -104 -67 42 -22 5 23 155 43 -72 28 61 -33 6 70 50 -62 -125 30 74 7 9 -47 26 -3 -38 -30
4512c0M5L7j20K6K6J12j76J9P3J3q5N0J02n8n1k8L2J29j60m7J52Kj92J32Q6q4
$$ -30 15 52 -68 -42 -16 96 -80 -61 12 25 -60 -10 92 34 -17 -45 -13 116 -44 -91 61 63 -129 3 89 5
4538EK2j31K02M5q4m6J13p5Pq4J16m1q2L1K9N3j27j35K47n9M1j86J27Q2q7Mo3
$$ 5 27 -104 98 143 59 13 126 51 58 -26 90 49 -33 -2 27 80 -47 -182 65 6 47 -139 -12 70 -17 -13 -76
4565g6J69L3j91J0J17M7r9J5O7n3j81P9J61n8Jj56K03p4j8L1jP2j75j05J04J40
$$ -76 93 126 -65 -55 62 109 10 25 92 39 -142 -63 98 40 41 -115 88 14 -4 27 26 98 -77 -182 -78 62
4591F2p6j39K85r3j36J43r8Q9n0j8J0m5J00j40M4R1P2j88p8J84J0q6m2K64r3j23
$$ 62 -14 -153 132 39 -97 46 -52 37 -13 -31 -21 -66 34 -106 -62 29 101 -87 -165 19 29 -57 -99 165 72 -51
4617e1J3mp9J09M4n7K07j70r5L0J51k03m3K19o8r1K3R2n4M4k21J60J64j66j53
$$ -51 -38 -42 -121 -12 32 -25 182 12 -83 -53 98 -105 -148 71 3 -88 -65 27 -27 17 -204 -44 120 -46 -199
4642a99L5K47k9j21J34J20k35j4M5P5n4m1M8O7k9n4K4PK4J2j03J55j08j3k0J84
$$ -199 -164 83 54 -67 67 187 -48 -62 -17 58 4 -37 11 78 49 -5 19 26 50 62 -41 114 6 -7 -27 157
4668A57j11p1M2p9J02p4n1P0J16j48o5R5J18q1p7l7R6J7j73J69J61j98k7P4j0
$$ 157 46 -25 17 -62 40 -34 -85 -15 101 -47 -112 -17 101 20 -57 -94 2 19 -154 15 176 -22 -49 25 15
4693A5L1j07R2o5M2J7j04M5p6J34L1l1N3j93k3J62K9N4r7J5k7M3j30J86o7N9m2
$$ 15 46 -61 31 -34 8 25 -79 -34 -110 24 55 24 77 -116 -139 23 52 106 9 24 -3 40 -90 96 29 88 46
4720D6o9J70j05k45J84J65j84p4J22j31J06m3K9Q1L9p6j8R9j22o1k1J78n4m5K6
$$ 46 -23 147 42 -203 -19 146 -38 -112 10 -121 -15 -58 -29 52 91 15 -3 96 -26 -87 -108 70 16 -29 -3
4745cl6M3k7pJ19j8n7l3J54j13R4j30N0N4j06r8M5K11j23j19O1J77j50nJ06r5
$$ -3 -39 4 -23 -30 89 71 14 -19 135 22 116 -14 36 90 -16 -114 -69 142 19 -100 -39 138 -12 -17 89 -6
4771fj00L6L0J86q3q5o2J11Q1l36K11J32q9l6lL4P4j03n0R5k3L7k8Lj6j7k10K20
$$ -6 -106 -70 -40 146 63 -22 -84 27 108 -228 -17 115 26 -10 -13 21 95 -8 -58 37 14 51 23 26 10 -7 -217 3
4799CM9q5m2L9J27k09J42n0J89j60o9J9J29j37m6N5J73j16j74JK33J3j42J05P9
$$ 3 52 -33 -75 -36 91 -118 24 -26 163 3 -66 -47 82 -55 -101 -46 127 11 -163 -162 71 84 -58 47 126
4824A26j32l9kO4o2L3n4O7Q4j29m5J42k6r1k1J65J00k56LP0Q2j86nK05q2n5n5
$$ 126 -6 -45 -47 17 -45 -12 -66 1 85 -44 -89 53 27 -64 -85 80 180 -76 -73 -3 79 -107 -112 93 11 -44 -99
4851i9j7K26j25q0L1M8J17o4p0rkj39Q3K22j25o0P4O1j3j15J3K11r4q8n5K00M5
$$ -99 -116 110 -15 -95 -64 -16 101 37 -33 -42 -44 -183 -100 122 -3 -63 11 72 59 -56 -43 168 74 -14 -69 131 176
4878A76j07j36k0K47j23j01J14O1j06r9M8PJ24j03p2M9J02r6L0J04J1k72J35N
$$ 176 69 -67 -87 160 37 -64 50 111 5 -94 -46 -39 85 -18 -90 -41 61 -35 -5 99 110 -162 -27 -22
4902b2P9q1j30J81l4j10R1N8L5r7m5J55J31l44P1J24k5j1j20J72j35K4j7Q4nj75
$$ -22 57 -24 -154 27 -7 -117 -26 32 67 -30 -75 80 211 -133 -62 62 37 26 -94 78 -57 -33 -50 34 29 -146
4928a46J03P4L7jj40O6N1%j49J26k0j7n1O1Qm2N8K0R3m3j00J24J2j3j27j30L13
$$ -146 -43 31 68 67 -73 -7 44 44 -105 21 1 -16 -67 -6 2 -40 18 38 131 88 -12 112 124 111 -16 -146 167
4955A67o4p1o0K65j97r4o0J37K3j86O4R9O8r9k1L6l3Jl5oJ05N1o9J1N0r0j66M2
$$ 167 103 32 -28 237 40 -54 -114 23 46 -140 -76 23 91 -8 -29 7 -26 -25 -60 -66 39 90 21 32 82 -8 -174 -132
4983a32J52M9j42M9R9pj43j2J34oq6L1L4j34L3J0l6J61%k20K00j0n8J7R5L2j99
$$ -132 20 69 -73 -24 75 68 -75 -87 47 41 -45 -14 20 -114 -81 -71 -107 54 54 -166 34 24 -34 -17 78 110 -89
5010h9Q9j02J77j12PL2J6K8j57J20Q3j01r4J29J27p2j31P2mN3r7n6J21j36J35
$$ -89 0 -102 75 -37 -30 2 18 46 -111 9 92 -9 -103 26 153 81 -50 22 18 71 -26 -82 39 -97 38
5035C8k4kO7j17j4K4J84kj57J18j14k0K6P2q7j05J07O5N0j75k0J45L4M4j73M7
$$ 38 14 12 79 -38 -52 -28 156 154 -3 115 1 -19 7 79 -8 -113 -6 59 109 -66 -86 59 93 137 -36 11
5061A1M3j66QJ03K2m2M9l0J40j67Q7j64J5L8j0K1kJ38j19JrO6m1l6Q3q6L8Q2N3
$$ 11 54 -112 -104 -1 21 -21 28 -2 138 -29 58 -106 -91 -53 -63 -42 -44 94 -25 -24 -33 33 -8 -44 39 -47 -9 73 126
5090A26n0K5p0qj0Kj18J53r4NQ5q6J83k31M0J4J28k5j53j3J36J8j66l5P7J18j8
$$ 126 76 101 31 23 13 15 -103 50 -44 -39 46 -40 143 -88 -48 -34 94 69 -84 -97 39 57 -109 -144 -67 51 33
5117C3r9R9p3r5R4P0L0j28L3j4J55j80J53J3l0j42mK31q2L4r8p3O3M3q0M6Q5J6
$$ 33 -66 33 -40 -135 -41 29 59 -69 -36 -50 105 -75 78 91 61 -81 -85 146 64 98 0 -73 -10 33 -47 -1 84 100
5145A00j55QJ32r2O2n7L3j13N3j25K72j67Q9j05j2j7L4P9l0k9N8o9O6m5R3k2j93
$$ 100 -55 -47 85 -7 55 -2 31 -82 -29 -154 118 -49 40 -65 -77 -94 -60 19 -11 -40 18 -51 15 -30 63 41 -152
5172a52J99l0K1n6mK3k0N4j3n0J07m7J8l7M7m7j8q3J38J6j61J40n0J8m8l7j8J69
$$ -152 47 17 38 -18 -22 1 -19 35 22 -28 79 32 50 13 60 13 -5 -88 50 66 -95 45 -5 13 -35 -72 -90 79
5200G9p3k4n9L2J53j20m3k4l2J58j49J47m7oL7Q5j57o%Q7J1r2N4J6q4J42o2q3
$$ 79 6 -18 -77 -45 108 -12 -55 -79 -111 47 -102 45 -2 -8 29 114 -43 -49 -49 38 49 -43 11 27 -57 85 23 -60
5228f0J19M4j52M7N0j2R2j49J23j70R0m5kK9P0q2j17Q3l3N2J15m2L6K2n4n9r3
$$ -60 59 103 -49 -2 48 36 128 -21 102 -68 22 -23 -25 4 74 -8 -125 -42 -75 -23 92 50 86 108 54 -5 -98
5255i8OlJ32kl9k7J5O8K3m5p0J7Q1j79J46m4k1J53q9M0o7O8r9Q1J2k0r5Q8j22
$$ -98 -92 -95 37 35 -4 -31 -16 52 75 30 -40 -23 58 -121 25 -19 -40 113 24 64 -3 65 -34 47 59 39 -56 32 -90
5284i0k1J04q1J38l2N8o0K2q2r9R6k2Q3j25J03NQ4j57J32J7r8p9R6J9K9L7n5O
$$ -90 -111 -7 -88 50 18 76 16 38 -44 -143 -47 -69 14 -111 -8 -3 81 -76 56 73 -25 -104 -8 11 40 77 22 28
5312B8Lk9p8J29j32J34p1O5k3n0J30j45k4NL2M4j6J0j09J27j63J20Q6j33N6J1
$$ 28 31 2 -76 53 -79 55 -16 49 26 -24 106 -39 -63 -58 -26 18 2 12 -97 30 -133 -13 73 -60 -4 7
5338Gk5K1p5J06n3l3RN0P0q1J41r5M9r6p1J37M3k19J01m5K10m3o9M5j9j32N0j3
$$ 7 -18 3 -72 34 -19 -52 -43 7 77 -4 137 42 91 -5 -76 61 104 -115 -14 -59 151 108 39 84 65 -67 -17 -30
5366c0j6P7p5p1J25l7N1j03J09k9j7m0l8J96j12o7O2N2k9m0j02J41q4J6N8m9M9
$$ -30 -46 31 -44 -115 10 -27 24 -79 30 1 -16 -56 -94 102 -10 -77 -15 37 8 -32 -134 7 -77 -61 -3 -52 -3
5393cj52J88J0m1N2j26R0L6o1p2J40q3o9P4n1L7K3k3N7n2p5J02K4K2n1l3Q4j05
$$ -3 -155 33 43 2 54 -72 18 54 -7 -79 61 -22 -91 -17 -68 -31 -8 -31 26 -26 -101 1 25 47 -4 -37 47 -58
5421e8P4j17R3P6p6JJ6O9J3k29J30opkm9J18p8L8qJ01j10Qj15J25Kj3M7q2J90
$$ -58 16 -101 -8 68 -8 -7 9 78 91 -138 -8 -14 -21 -23 -72 46 -32 6 -2 99 -11 -3 -118 7 9 -4 43 -39 151
5450A51o6p0n2Q4O2j28k6JK7m3o0J79k1j23R7L1j9j45J87r4K6q4J21%N9j17P1
$$ 151 85 15 -37 47 109 -19 -45 -44 -17 -60 -120 59 38 -85 12 43 24 -121 66 -28 -2 -86 35 35 94 -23 48
5477D8q7L2jl0P3P1q0j13Q4j0R6r8J23j12M3pJ7j20J44j10M4NM5j25N3J59j83
$$ 48 -39 -7 -8 -38 35 106 26 -87 -3 -13 83 -15 108 -4 39 32 49 -71 73 -37 7 12 57 -68 -15 144 -39
5504c9M1q2J77j37p0Q3L0J2q0J3J55m0k01K23L4o8L0n2nJ0R1k01J23j29J4L8%
$$ -39 2 -80 97 -40 -110 -27 3 15 -65 -52 103 63 -138 85 119 51 81 29 24 34 125 -76 47 -82 -68 -30 -30
5531c0J53o1j34J76j93J02p2J32l4K8j33M4P8K5k60K46J40k36mj5J14j51J51j03
$$ -30 123 62 -72 104 -89 13 -59 73 39 67 -66 -22 56 81 -179 67 207 -29 -33 -48 66 -85 66 -37
5555c7O2O7oj89J25J8k3j20J60n1pj06K33o8j43M4J44O0j71k9j9K8q2J16j05O2
$$ -37 25 92 86 -103 22 40 17 -103 57 6 -1 -107 126 58 -85 -41 103 163 -8 -37 -56 -28 -110 6 -99 -37
5581c7J3M2j7K0m3q5M8J65p8q7O1oo6j20J35J35n0j25R4J02m9o7j31K43j19q4
$$ -37 -24 18 1 21 -22 -107 -59 106 28 -59 2 -4 -70 -190 -55 80 30 -95 -1 101 52 -15 -146 97 -22 -106
5607a06J08K1J0o2K2LJ06j09j39J12M6m6j0J40n9l0m0L4O5q2j14R2J25o5j37n
$$ -106 2 23 33 -29 -7 -4 102 -7 -146 -34 12 -34 -44 96 37 7 -33 1 66 -16 -130 -38 87 22 -115 -120
5633a20K64j74q2P3M2j7q3M1J45Ko0q5Q3Qr0Q1N6J1n2r5J2J83j25r9J52l2r7J1
$$ -120 144 -30 -112 -39 3 -14 -97 -56 89 91 31 -54 29 37 -53 28 84 95 43 -52 -40 143 18 -81 71 39 -58 -47
5661d7J36l8j07p1P3J13j18J0P1N5n2no5J42Pj53PJ54p0o4n4R8m6j19O4Q1P9j71
$$ -47 89 51 -56 -127 -54 59 -59 -49 22 77 25 20 -45 97 104 -49 -42 112 42 -22 -76 22 -24 -143 -79 2 81 -90
5689i0O3L3L4j0j68K05M1j32l0N4J54j55L4L5P4j99l0L5J23K3j77L5N4K9k2j0
$$ -90 -27 6 40 30 -138 67 108 -24 -54 0 154 -1 33 68 142 -57 -87 -52 71 94 -83 -48 6 35 13 3
5715Ck3O9j64R0MJ30j42O1o7J61j81l6K22k3p9k38K51N6n6q4J58k9j50L1J43q6
$$ 3 -20 49 -115 -25 -21 109 -33 28 -39 122 -59 -95 127 104 25 -213 38 94 38 -46 112 83 -67 -36 107 21
5741B1q5N8K7m5kj8O0k3qj2M3P1p2j46Q9J15L6j35Q7j03P4l9j12K37k64M0J0J45
$$ 21 -64 -6 21 -24 -26 -44 16 -7 -15 -27 16 87 15 -131 -42 73 109 -26 61 -42 32 -7 -119 118 -146 -106 -96 49
5769D9N4j05J8R8Nj95M6N6k9m6qJ49Qj14p1J09j12J30j69J90Kq8l7P2L8p4o0Q1
$$ 49 103 -2 16 114 119 -76 -30 26 -3 -49 -57 92 100 -14 -85 24 -88 42 -127 63 65 -23 -60 12 50 -24 -84 -3
5797cR5j67P1K5k8mj17J08J30l2m7p5Q4ML9j05R1m8%K3P4m9j33o7L26j41j25J16
$$ -3 92 -75 -4 21 -7 -11 -128 -20 110 78 31 -44 40 44 83 -22 69 21 21 44 118 69 -64 -131 195 54 -71 45
5825D5j0J24k03j0R2J0n9jP5N3k79J20Q2j10J62j09N6qq3p3J10O7Rj38J34n4o
$$ 45 35 159 -44 -54 38 48 -11 -12 63 116 -163 -43 39 -71 91 -18 38 30 -53 -126 -16 51 60 -78 56 2 -4
5852dn4O1J23j01roN0k0m4l5k2J48j95J9P0J19q7j23J97n4L1r1j7L0K8j11P8l7
$$ -4 -58 3 126 25 16 10 60 40 -4 -39 -61 87 -108 -89 -19 100 13 -110 87 33 64 -27 -44 -14 14 -97 -19 -56
5880e6K07k85K16o6Jn0J14n4j3r7l3K24j70%J5J14J12j59MQn2j33J25J58j25n2
$$ -56 151 -134 82 16 17 -33 81 27 14 -83 -116 108 -62 -62 -47 67 179 20 24 32 -20 -153 -28 130 5 -47
5906d7N6J51L7j38n6L2kpK8o4O5k45J55Q7M1m1j51K05j23p6R8q2J62q5j10J26
$$ -47 9 160 197 59 3 35 33 26 54 -10 55 -190 -35 52 93 52 -99 106 -17 -93 5 -77 85 0 -110 16
5932A6K30k41q5J52k5R1k15J4N3M1m6J5R0l2l2p0J31r7q9R0N8m1j3k9J7P8j49
$$ 16 246 5 -80 72 47 138 -77 -63 -10 31 -15 0 90 58 26 -44 87 -10 -99 -9 49 8 -5 -34 -17 61 -88
5959h8q9K31j5n6j60J95N6j39m6K19M0j66q0O2J7l1k04K28M2P3j37J0J31j69r5
$$ -88 -177 54 39 -17 -177 18 74 -65 -111 108 148 -18 -98 -36 -19 -50 -254 -26 16 89 -48 -38 93 -76 -171
5984a71J56P8J27k59J15J23pj64j34J70N3k13M4J87o8j42j1J38L4o7q3O7K7r9
$$ -171 -15 63 190 -69 46 169 162 -2 -136 34 87 -126 -82 105 37 -105 -116 22 56 -11 -94 -27 0 -99
6008i9J65p9P6q6op0J42q8J1R5K6p0p9J6N3P5r2M8N2Jj73R0O7M8j42j3J00l8K3
$$ -99 66 -13 63 -23 -29 -99 43 -45 -34 61 87 17 -62 -46 7 82 -10 38 90 91 -82 8 75 123 -19 -32 68 30 53
6037E3m2J23M6k59p5K23N1k60J54j7J55j97O0N9l4l1p9J22o1J0j31J9J42nr4Q
$$ 53 11 134 180 -79 -154 69 120 -140 14 -3 152 -45 15 74 40 9 -70 52 -9 1 -130 -111 31 26 -68 -60
6063f0J88m7j40P3J4J03k38o4K83O6l14P9J86p6l0p8J68Mk99J05J72P6k56M4J11
$$ -60 128 81 -59 14 28 131 -107 -171 112 178 -136 -57 129 53 23 -55 113 117 -182 -77 95 171 -85 -41 70
6088G0K6j25p9K43nj55o3J87l5j40q9K25M8j87j0M8K70k49k90K87MJ07j09j29
$$ 70 96 -29 -108 135 130 -25 -88 99 64 -76 -165 60 108 -79 -89 -41 229 -20 -310 -23 -19 88 -21 -150
6112a50L17j37j26Q2J57q1k05P7K19n3j68n3J69J42k40r7J93J2j3j59K06k9pj66
$$ -150 167 30 -96 -14 143 62 -143 -66 153 100 -68 -121 48 190 -50 -147 46 58 45 -114 92 63 56 -110
6136a10J00J9k0j39J07J25%j82J9J76j10j40M6J53M1k12N1K22p4j75Q6K2Pr3j5
$$ -110 -10 9 -11 -150 -43 82 82 -100 -81 95 -15 -155 -109 44 85 -127 -76 146 72 -103 -17 5 12 -81 -96
6161i6L32j48j69K13q0Q7o7j14J45j05m2j1J10lMj33J45m3J47k70N0J98j55j47
$$ -96 236 88 -81 132 52 139 72 -42 103 -2 -44 -55 55 52 56 -77 68 25 172 -98 -48 150 -5 -152
6185a52J83J00r8j83K10Q4j59j01L5J71l8k19J07J63n0j57L0J71m2kj21J56po7
$$ -152 31 131 33 -150 60 144 -15 -116 -81 90 52 -167 -60 103 53 -104 -74 97 55 53 -68 88 81 14
6209A4j30J44L7j80L3K02m5k9j86K03P8k14r0J68Q9l5j46m9J26%JnNM0j69N1J71
$$ 14 -116 28 65 -115 -82 120 75 46 -140 63 141 -73 -163 5 94 59 -87 -136 -10 -10 -9 -14 -9 31 -138 -87 84
6236H4j12j06N0K21r2j54K0J49l4k49J06J58J4O8k13J30n0M4j52O5J38j03j48
$$ 84 -28 -134 -84 137 45 -109 -89 60 26 -223 -117 41 55 123 -90 40 -10 34 -118 -53 85 -18 -166
6259a66R6R2n8r8J06R2r8j1L0Q8j22j5L5J33r5j25K2J55J2j48L3J21l7j48J38
$$ -166 -70 22 -36 -134 -28 64 -34 -45 -15 73 -49 -64 -29 104 9 -116 -94 61 73 -75 -42 79 42 -106 32
6284C2O9j86K1J40k6j6o3k5K19L3k72M7J89m6j08j22K16J20j71k11J09J73j37
$$ 32 101 -85 -64 76 50 34 -29 -54 165 198 -74 -27 162 116 8 -114 102 222 51 -160 -51 122 -15
6307a5p0N7L5N0k63K07K7o8r8J33K26j65o9J11K8m2l68K13J71n2j36J6N9R8p6
$$ -15 -85 -28 7 57 -206 1 28 -40 -138 -5 221 56 -13 98 126 84 -284 -71 100 48 -88 -72 -13 85 9
6332Ij49K46j8r5o7J86L1k60M2J02P0q0p4R3J02j81j06J07R7q2n6J64Qj25q6J06
$$ 9 -140 106 88 -7 -74 112 143 -117 -75 27 97 17 -57 36 138 -43 -149 -42 55 -27 -83 81 89 -36 -122 -16
6358a6J78j11j52OK73j13j87J44J38j8k18O8J21k7r4n9P7J05j30j35J77kp6o8
$$ -16 162 51 -101 -95 178 65 -122 22 160 142 -76 -8 113 86 -8 -67 10 115 -15 -150 27 25 -51 -119
6382a19J45J58k12j66L16m3O5j44Lmm8m0o1K04m3k14K30J3k8r5j9K32q1k00M9
$$ -119 26 184 -28 -194 122 79 144 0 3 -1 -49 -89 -150 54 11 -203 27 40 12 -83 -102 130 49 -151 -102
6407a02K42Oj78n4J26R9j57j03L32j01j95OJ78nk31J12J00K4k46Q6J18L8j15q8
$$ -102 140 146 -32 -86 40 139 -18 -121 211 110 -85 -79 99 94 -137 -25 75 99 -147 -61 57 95 -20 -108
6431a08J61J9q2j46R3J80q8j86K14Nr4j2M4J75m8j65l8J91k6k83J26kJ25l9j40
$$ -108 53 72 -10 -156 -63 117 29 -157 57 62 -32 -44 0 175 127 -38 -76 115 89 -194 -68 -70 55 16 -124
6456a24L51j3k79pJ48J1k22QJ10Q9j23n8R8J06j46L5n0J72p7j03J35N0o0j22N6
$$ -124 227 214 -65 -72 76 87 -135 -127 -17 72 -51 -109 -11 95 -51 -16 -66 106 29 -74 61 111 51 -71 -15
6481a5J01p4j49%J73Q3j91P1L6l5n9l1J31j8j07L5Q5K5l7k09K38p8l1pK05o6j01
$$ -15 86 12 -137 -137 36 119 -72 -1 35 0 -59 -90 41 23 -84 -49 36 61 24 -185 53 -25 -56 -63 142 76 -25
6508b5L2O5R7q4j94J3L82k75o4L5J80j22j43J20R3j01j55J34L8p0l5O4J52j25
$$ -25 7 72 169 85 -109 -96 286 11 -53 -18 162 40 -103 17 110 9 -146 -12 26 -44 -79 -15 137 12
6532A2J8j91R3J18k29R9K11j01j43Q4N3R0j44L9Q2j9m6j11J55o7j23O9J1J89j40
$$ 12 30 -161 -68 50 -179 -80 131 30 -113 -29 24 114 -30 9 91 72 26 -85 70 3 -120 -51 -40 149 9
6557Ij45J88k3pp1l0K05r8j64J45J19j55J1P6j6Mj35N6L6l7j18O9O9K2p1K9J07
$$ 9 -136 52 29 22 -49 -79 126 28 -136 9 128 -27 -16 60 44 48 -87 -31 5 -32 -150 -81 -12 10 -61 -32 75
6584G5M6o1j61J25R2k55O7J82N9j83j40K74P0j49j50O8N3nq1R3m1j4j22J27J08
$$ 75 121 60 -101 24 116 -139 -72 110 169 -14 -154 120 190 41 -109 -41 12 7 -74 19 -22 -36 -158 -31 77
6609G7p3k40K38J51j94O0j93K18N2k17J5O6P9L8j10J88lk19o9J12K37k90M7l8
$$ 77 4 -236 2 153 -41 19 -174 44 96 -121 -106 -40 39 77 -33 155 152 -67 -136 -24 213 -77 -30 -68
6633f8R8r3j7M8J66j36n2N2K9P4k06PJ28n5%j3J99j74j59J82J27r9k30K17J25
$$ -68 30 -63 -80 -32 134 -2 -54 -2 27 101 -105 -98 30 -25 -25 -38 161 -13 -172 10 137 38 -192 25 150
6658A50p4j73J78j02J32j75r9J36j4L5m4M3Q9j9l5K3%j11q4J38J72j86j31K07
$$ 150 76 -97 81 -21 111 -64 -163 -27 -41 -6 -50 -7 82 63 28 51 51 -60 -144 -6 166 -20 -151 56
6682E6J8P2j81kJ30o4q0J46J6k42N0k4K83j24j86J9J02J43k53J67L6p3n8k4J41
$$ 56 74 146 -35 -37 93 29 -51 95 111 -131 -81 -105 178 54 -132 -113 -11 132 -121 46 82 9 -49 -73 68
6707F8Oo2jM5j0j12J08qN6jk67J78P1j01L1RQ8q2l1l5P3p7J8K6J91j50j38P5K14
$$ 68 74 12 11 56 46 -66 42 34 90 89 -178 0 71 -30 1 10 98 16 -15 -50 23 -54 -36 -10 181 31 -107 -32 182
6736A82j44j13P9J60j76m6p1K04p7j51J86J30K0k45j08J86J0n4j00K69r5p7l4
$$ 182 38 -75 4 164 -12 -58 -129 75 -2 -153 33 163 183 -62 -170 16 26 -28 -128 141 46 -31 -65
6759f5J70J02k55n5J86l0k9j72J35K15j41j05L8J32j24j09p4J10J59r9j36K55
$$ -65 105 207 -48 -103 83 53 24 -148 -13 202 61 -44 -6 126 2 -107 -181 -71 88 -11 -147 108
6781A08j41P5r2M0M1m6J3J9o2j04K02p3lk0J7J00M3p2j04J12p4K3M7k0n9L3o4
$$ 108 -33 42 -50 -10 31 -15 -2 17 -45 -149 53 -20 -23 -43 -26 74 117 45 -59 53 -21 2 49 29 -30 3 -61
6808f1J71j84J20j32J13O4j35L1k5KO2j18P5K0o6pL5j9J04j51J7J46r6j6ON6K
$$ -61 110 -74 46 -86 27 91 -44 -13 -38 -36 26 -92 -17 3 -63 -70 -35 -54 50 -101 -84 62 -34 -50 -44 12 14
6835A4Ko3K13r1j03JpN7M3j17J28Jk6j31K8O7j3p4J21o2j5o2k8J84o2k4J20j36
$$ 14 16 -47 166 75 -28 -27 -34 23 66 -51 77 78 52 -79 -51 16 3 -71 50 -12 -27 -89 -117 67 5 -19 101 -35
6863c5L8j39J52m7J12j87K3J11o6j7J0Q0M4j67K0K07m8m2j84R0J12m6r7J25j39
$$ -35 3 -136 16 -31 81 -106 -83 28 -38 -55 -45 35 79 -88 -68 139 91 49 -135 -45 67 21 -76 49 -90
6888i0K5n9J00J29j42n2K4J11j11K3R5l5q8L3k36L57j08l7M0J17p6p0J7J65ll17
$$ -90 -65 -124 -24 105 -37 -89 -65 46 -65 -42 53 18 -70 -37 -273 84 -24 -61 -21 96 20 -50 -33 132 129 -188
6914a88P2L7O3l1J0Q3N1k00Q3P4J9m9N6k0M2r6p9j5K49j77m3J71M7r4j29M4K14
$$ -188 -116 -79 -16 -47 -37 46 97 -103 -20 54 73 24 80 60 102 6 -73 -88 161 -16 -59 112 159 65 -64 -20 194
6941A94j99k0lJ33J4j66K7QR9j25q2L1N1n7R2r3J31p7K0R7J2j60M7R9r2j19J42
$$ 194 -5 -25 -28 105 119 -47 -20 -12 87 -38 -120 -89 -38 -95 -3 -96 35 -42 -22 75 87 -73 -26 73 -19 -138 4
6968DK2M1n8L9J9m1n1N0L5o3j0p0J24Oj6o4N2L9r5l3J3l1J12p9J46j32JN8jl1
$$ 4 26 67 9 48 67 26 -25 25 60 -3 -13 -83 41 47 31 -33 19 58 -37 -70 -57 -88 24 -55 91 -41 -40 18 17 -14
6998a4K2j51J49P2l0j30M3J16jp2L8L9Mr4j11N2J33q8j09J26l5M9L2J3J23k22
$$ -14 8 -143 6 78 48 -82 -39 77 76 4 42 81 85 -9 -120 -68 65 -23 -132 -6 -41 8 40 53 176 -46
7024d6K6J25K2m3j43M3J09j33o7R0J17j5n2n9J9L0j68J32N0Q2j12j30J20P9j84
$$ -46 -20 105 127 84 -59 -16 93 -40 -107 -17 100 85 33 -26 -7 23 -145 -13 37 119 7 -123 -3 76 -108
7049a08R7k5Q9jj08O1O3l6j02J42K0r4j4N2Kj60J09K2j9m5J31Kn2k3J3j7n0R9
$$ -108 -11 -36 53 52 -56 5 68 32 -70 72 92 -2 -16 36 38 -122 -13 9 -10 -55 76 78 26 3 16 -1 -51 48
7077D8j12nJ80j06j84J90M6j03lK7N0k5O8q7K0n8J0R5l6l6J17j46K4J16k3j6j01
$$ 48 -64 -69 111 5 -179 11 57 -46 -49 -22 28 3 71 -16 4 -54 -44 51 15 -21 96 -50 -26 90 67 51 -50
7104e0J56L8j80M8k5L2On7N3Qn3M8kl4J8N5j02J6n8J91p0O6j38JL4R5k31J62O3
$$ -50 106 144 -36 12 -13 19 25 -32 21 29 -24 24 22 -12 6 61 -41 -25 -83 108 38 104 -34 -33 1 96 -135 27 90
7133I0j46Q8j8J6l2J47j62n5K9l8P6L5K5n6L2k6j3K9RJ5mq4J18n1rpM1k5O7kj22
$$ 90 -56 32 14 30 -2 145 -17 -72 -43 -81 -5 30 55 -1 31 5 -8 21 30 45 41 -43 75 24 15 8 49 24 91 89 -33
7164c3M0O6q7l6J29k0q1j6J2q6M0r4K45j03J28p7j3J4j37N0J24p8m0J36j47P2
$$ -33 7 73 -14 -50 79 59 -22 -38 -26 -112 -72 -166 79 -24 104 27 14 28 -109 -59 65 -13 -53 83 -64 8
7190Hpl6O2P3Nq1j21J19J2o0k8K9m8L6j05J05j8J2Q8q7K8M5j12N5Q5P7j40QN3
$$ 8 1 -35 27 100 105 24 -97 22 34 -26 -54 -25 -73 -37 -142 -37 -55 -43 45 -42 -14 31 -81 -26 59 136 -4 4 57
7219E7k0n8K7p5k5R7l4L4n6M2J4j6N4J37j41r1KJ8R2r2K7m0K1Q7j10J15j18J7
$$ 57 37 -21 6 -69 -94 3 -31 3 -53 -11 3 -13 41 178 37 -54 -52 -34 58 -34 -7 -47 -26 61 -49 66 -52 -35
7247c5J8q9J26r2j04J90j14O6P7n0m7J00n7k1J00q9N1M2q5L8N5k14J73j6n8M6
$$ -35 -17 -106 20 -72 -176 14 -100 -34 43 -7 -54 46 -11 -32 68 -21 30 72 -13 25 80 -134 39 23 -35 11
7273A1j8l6J20l0k8l8NJ02r2p9P1%L0j9M8Q0k30qP2k8R5r3J21m2P7n7j0k7M0k2
$$ 11 -7 -43 77 47 19 -19 -14 88 -4 -83 -12 -12 18 -1 47 127 -103 -111 -39 -67 28 -65 56 14 91 34 24 -3 37 15
7303A5j6lm7J18l1m7QL7M7q3q9P6N1M5r7Om1pK0Q0j26J27n9j7j00J14M5P8j63
$$ 15 -1 -4 -51 67 36 -11 -3 34 81 -2 -91 -15 36 81 -16 -10 -51 -58 -38 42 -84 43 -16 -33 -133 -19 26 104 -59
7332e9N4Kro9L6J23j47J05o1P5j07J60j96J75k5K3j13okR3m4o0O3K0Oj5q9l0O6
$$ -59 -5 -3 -12 -81 -45 78 -69 36 -25 50 -57 103 -93 82 57 80 -33 -39 -41 52 8 -52 11 31 37 22 -67 -97 -31
7361c1l3J62p7j7j00N8J05p1o7J8m7m1J21m3M6O0r1JK1M8m3J34k6k10J45L9mp5
$$ -31 -64 98 21 4 -96 -38 67 -4 -71 -53 -100 -141 -20 -63 -17 43 -48 -47 -26 22 -21 113 87 -123 22 61 57 -18
7389a8R1j35mR2j71M9J8J37OJ20k23R0j2j9Q8m3k0m8j2N7n2%J78n4n8o6K2K9r9
$$ -18 73 -62 -66 26 -145 -96 -78 59 65 185 -38 52 40 21 109 66 46 -2 -14 43 -9 -9 169 115 57 -9 13 42 -57
7418e7M8l2Q9j39O2P6n6P3p9Q2j4mj02L8L4J13j70J16r8O4j8J08k8j93J42l5m
$$ -57 -9 -41 48 -91 -29 47 -9 64 -15 67 53 49 -53 -15 19 132 -38 78 -20 44 26 134 106 -87 55 20 16
7445A6m7pO8q2n8J89l4m0K2j8r1J98k30J04o1J51o9P0j39l1J09o8mP7l7L6k0q
$$ 16 -31 -38 30 -52 -110 79 45 5 27 9 -82 116 -114 -10 -71 80 11 81 -58 -89 20 -48 -52 25 -12 24 4 -4
7473dL1k7r6j7J71m0Qj75K24j09M2L4j5m1Q8q1N0l7J89k17k2J10p6J8K0M2l4M4
$$ -4 27 0 -96 -113 58 18 26 -149 75 -34 8 42 27 -14 74 -7 43 6 195 -22 -44 66 -10 8 28 70 36 80
7501H0j12L3l5l2K00j92Q6J4l1l0m7J01q6P3kML4r1Q8K8l4j14J24kqj08J97j11
$$ 80 -32 1 -34 -66 134 -58 28 42 11 -19 -66 35 -51 22 20 24 58 -33 55 83 49 -65 59 57 49 -59 138 27
7529B7j7n1k7L4R3j86N8j4P0rr5J82j23O0N1n3m5J28q1K5j35P5kQ9j37J55J2o4
$$ 27 10 -41 -68 -34 59 -127 -69 -83 -13 -22 -117 65 -58 2 53 0 -45 83 2 27 -108 -33 -35 54 -83 72 84 20
7557B0l9J29n6k0J4kk8m9K3R3j0jk8J2j41K6j6k7P8OL6j18J31l5J35j28o4L9N3
$$ 20 -19 110 54 34 48 46 18 -31 -8 85 75 74 46 58 -83 -57 -73 -100 -22 -16 20 -98 33 -2 133 5 -59 -20 33
7586C3n6j70L21j91L2M6j68J30j0m9J7J05q8J01n2l6%M5RK8J04k00P8R8j00j5
$$ 33 -23 -193 128 -63 -31 15 -153 -23 -33 -82 -65 40 -48 53 1 -35 -35 10 19 47 151 -49 29 127 27 12
7612A2n4M8P1q9j1n2J5J8J29r0O4k3M2j18N4m3o3O8R4j8qk6j09O2O4j01M7n3K7
$$ 12 -42 6 77 -12 -23 -75 -60 -42 87 -3 61 38 80 -38 16 -27 -90 -22 72 54 46 20 -89 -27 37 -64 -17 -70 -43
7641d3L0N7r1j9N8J9J4k5n2J26o9l7J9M5jl3n6pP8q5J8R6p2Q1l1q7J39j12P0J3
$$ -43 -13 44 -47 -66 -8 11 25 0 -52 74 5 -32 -13 32 31 -2 -58 -65 13 -72 -54 42 -30 51 20 -67 72 -40 30 43
7671D3klj02jk4K7j8P0Q8r6j0M8j56K42j50J04j98K69j17k7l3rN9m2pJ38j12J47
$$ 43 41 38 -64 -65 -89 -62 -80 -10 78 -18 -28 20 -136 106 -44 60 -138 131 14 -13 -46 -55 4 -38 -45 93 -19 128
7699A28q2m2J3m1k6J34m5k8mj16K3R7q0N2m9J53l8m1L9o7R1k7j40M1j9N8l2J21
$$ 128 46 4 17 -24 -50 84 39 11 7 -109 -86 11 -69 -17 -66 87 49 8 47 -20 71 44 -96 -55 -74 -16 -48 73
7727G3p6j6R8q9kQ5r1K0J6J5r7Q9M6j30K35k52J44p9L4RMr6O6Q8j32M6R6q1J3
$$ 73 -3 -19 79 -10 -12 73 -18 2 18 33 -64 25 71 -59 176 -76 68 -11 23 32 36 -60 6 94 -38 8 104 23 36
7756C6j08Q2K0j20J1R5k01R2J47p3m4j19K12j2J00Rj14J43j51p0R2j3K2j39L1
$$ 36 -72 10 30 -90 -79 16 -185 -93 54 -19 -63 -182 30 18 118 127 13 156 5 -65 27 14 36 -103 -72
7781g2J54P1j12r9k4J2J04n9J06q1p2J42j3q6j3k5M5M2j2p2J43j52N9l5j00J80
$$ -72 82 153 41 -58 -82 -70 34 -25 81 0 -72 70 57 -29 -42 -67 -22 20 8 -64 79 -73 -14 -49 -149 31
7807C1M9r3l5N9m6Oj42J47O6k4L5j3k5j96J20RJ31j56R7Q0j74J29J0j57O3m3M6
$$ 31 80 -13 -48 11 -35 -29 -171 -24 42 18 53 40 15 -181 -61 -52 79 -77 20 100 -74 55 65 -92 -29 -72 -26
7834b6J31Jr4j18K2J07k3r0J04L8J1j03l4L7O2o5N9M1Lj60P5j9J16j00l5J3Q2
$$ -26 105 106 12 -106 -84 23 0 -90 14 52 63 -40 -74 -37 25 -40 19 60 63 -97 -22 -41 75 -25 -60 -47 35
7861C5j14P5j0j27R7Q8n3J83j86j28J73Q0o2j57N5J09j46O8K0m5o7J41Jp3k5J68
$$ 35 -79 -4 -14 -141 -44 44 -9 174 -12 -140 33 113 51 -106 -51 58 -88 -20 0 -45 -112 29 30 -43 -68 100
7887A00k10Q1J7O4j16N8l7N3k1M5L8r8L7n8RLL3L7jo1pO1j0k8j02J92m4J15j11
$$ 100 -110 -29 -12 52 -64 -6 -43 10 -11 34 72 -26 11 -47 -38 -35 -2 35 34 -27 -34 27 17 -11 -113 79 35 150 39
7916C9r9J35j15k2O5P4n0J1mRj17kK9lL6n5O1R5j21J7k7PR2N5o0m9j4P2j76R9
$$ 39 -60 75 -40 -62 3 77 27 38 34 43 -74 -76 -47 -50 -14 -69 -8 87 -34 -17 -44 -37 55 110 50 1 -13 59 -117 -18
7946a8M4j35Q4kJ47r2Rm3O1p1R1j80N9M9j9J5l6R5j15J9J12j7q5%J30j20r4J20
$$ -18 26 -109 -25 -27 120 28 37 -6 55 -16 75 -105 -46 3 -16 -1 -37 58 -57 -38 74 57 -28 -28 102 -18 -112 8
7974HR1j03k6oJ20j7q9L5k3Pq7J66j8j38L1Q4j60J45lL5j60J61J0j25J42p5j7
$$ 8 99 -4 -30 -36 84 67 -22 13 -10 -3 -90 76 58 -80 -49 35 -125 20 17 52 -108 53 63 -62 80 5 -12
8001a2o3O8k0Q1N9jl9p9L6p2L1L2k9J8k2Q2j39L5o6J52k00Q5J65j60J8J1p2N8
$$ -12 -75 -7 -27 54 113 112 73 -6 30 -42 -11 21 -8 10 -12 70 -69 -34 -100 52 -148 -63 102 -58 -40 -29 -101 -43
8029d3J69k28K47j27N4j03P0j06K55k70K43j45J4j4j6R5n5or3n9K32j07QJ25k37
$$ -43 126 -102 145 18 72 -31 39 -67 188 -82 161 16 30 16 0 95 40 34 -59 -118 114 7 15 140 -97
8054i7J21j02K3J27q0j40J61Jj17L7J0K9J26j81M7Q5J7j27K51m6l1r7L7p7J1q3
$$ -97 24 -78 -55 72 -8 -148 13 14 -103 -66 -56 -27 99 -82 -35 50 67 -60 191 145 114 17 54 -23 -12 -95
8080i5J52n4K5p3o0K42p8l0M1q4j3j9Qll5M5RM4R7j39n9R7k0q4mJ25p3loO9L8
$$ -95 57 3 28 -45 -105 137 59 29 70 -14 -27 -46 -38 -41 -76 -31 -22 22 119 -20 -79 18 -2 -86 -90 35 -38 -41 -47 22 60
8111F0q0j04R5L7L2o8k2J13l6j26J10N8L1r5j80J90Pk4p2K7J14j54K60n3L7k10
$$ 60 -20 -124 -29 8 40 -28 -50 63 27 -99 11 69 100 5 -175 15 22 -2 -74 -47 67 -87 173 120 157 -53
8137e3p1J41L4n1Pn4J06r6J34q8L5Kj1j16J49j13j9R3P7j61L1O6j37J03p3O2Q5
$$ -53 -124 17 51 0 7 -47 59 -37 97 9 44 46 35 -81 68 -45 -64 29 106 -55 -24 42 -95 8 -65 -3 82
8164H2m6q7R8n2L3L6j5L9r9n8M0J38j30l7m4J50N4j02j3J12m5n8l9J27r5n6J10
$$ 82 36 -51 47 -5 28 64 49 88 -11 -69 -29 109 -21 -58 -102 48 102 0 -13 99 54 -4 -43 84 -11 -67 43
8191D3
$$ Imaginary data points
##PAGE= N=2
##DATA TABLE= (X++(I..I)), XYDATA
0@%%%%%%qQqJ6j6K4l2M0m8O4q0R6j20J44j76K11k51K96l48M07m75N52o37P32q40
$$ 0 0 0 0 0 0 0 -8 0 -8 8 -8 16 -16 24 -24 40 -40 56 -64 80 -96 115 -136 160 -188 219 -256 296 -341 391 -449
31d49R59j090J237j397J574j771J987k223K481k762L073l411L777m179M620n106
$$ -449 510 -580 657 -740 834 -937 1050 -1173 1308 -1454 1619 -1792 1985 -2194 2426 -2680
47b680N632o203O834p530Q297r143J0084j1138J2322j3665J5201j6978J9062k1549
$$ -2680 2952 -3251 3583 -3947 4350 -4793 5291 -5847 6475 -7190 8011 -8967 10095 -11454
61a1454K4578k8354L3220l9765M9085o3505Q9005j47412N23488J38948p84178
$$ -11454 13124 -15230 17990 -21775 27310 -36195 52810 -94602 428886 567834 -216344
72b16344L40416J14514l55066j05340K46437j93701j46454M5514o0010L9912L76352
$$ -216344 124072 238586 -116480 -221820 24617 -169084 -315538 -270024 -330034 -290122 86230
83H6230o4730k99424K40860K55440l80324l521N86341K14n25914Q8197L39875
$$ 86230 21500 -277924 -37064 218376 -161948 -165469 420872 421086 -104828 -16631 323244
94C23244j39109j45280J45156o1250j56089k9613j75393r5966L23803P4145l74905
$$ 323244 184135 38855 184011 122761 -33328 -62941 -238334 -334300 -10497 63648 -311257
105c11257M7167L88868j38759k13508L81234K13479l79519j23075K59310q858
$$ -311257 -264090 124778 -13981 -227489 153745 367224 -12295 -135370 123940 115082
115A15082j18433Q3520j7142p1427P9895r3798j76812K44236K17622l47545k03700
$$ 115082 -3351 80169 63027 -8400 71495 -22303 -199115 45121 262743 -84802 -288502
126b88502L19341L1058l02072J44384L00173j60767j65005J63874O2880o4148
$$ -288502 30839 61897 -240175 -95791 204382 43615 -121390 42484 105364 41216
136D1216N3035l6918j14650P9400n777k24800R6135L12515j55406k83499K18135
$$ 41216 94251 57333 -57317 22083 16306 -208494 -112359 200156 44750 -238749 -20614
147b0614K08501k14939o6475K19825j4219j71941J8220L5228k2354Q6471j237
$$ -20614 187887 -27052 -93527 126298 112079 -59862 -41642 -6414 -28768 57703 56466
158E6466j39769P6899J32874j77472r1674K47775J5598k98853J2851K40946n9731
$$ 56466 -83303 -6404 126470 -51002 -142676 105099 120697 -178156 -165305 75641 15910
169A5910j32481J30106Q9876p6182l718J1973l2412P9961K3906j82900k6985J85315
$$ 15910 -116571 13535 103411 27229 23511 35484 3072 83033 106939 -75961 -102946 82369
181H2369n6360j89895J32279J73483j62945j11154J69918N4271j23083o157M6055
$$ 82369 26009 -163886 -31607 141876 -21069 -132223 37695 91966 -31117 -37274 8781
192H781k6906R679N029n4245O2302J09398r9067r9032J48165O1815j83697k8932
$$ 8781 -18125 -8446 -3417 -57662 4640 114038 14971 -84061 64104 125919 -57778 -86710
204h6710J54496m1774j39184N9319R7012l7320k6736K5308K713L1293J9586q2100
$$ -86710 67786 26012 -113172 -53853 43159 5839 -20897 4411 7124 38417 58003 -24097
216b4097j6349J06461l8449j44576O7720J39695q5704r9470J05622P1635q5048
$$ -24097 -40446 66015 27566 -117010 -49290 90405 4701 -94769 10853 82488 -2560
227b560k9310N5648j906k8155j2175k4722L2312O4540m8753n7484R2489N2718
$$ -2560 -31870 23778 21872 -6283 -18458 -43180 -10868 53672 4919 -52565 39924 92642
239I2642j15395l3769J17682m072j28047J388Q3377j6239m3705K0356L0102J6913
$$ 92642 -22753 -56522 61160 57088 -70959 -69571 13806 -2433 -46138 -25782 4320 21233
251B1233l601l6175J3505P1500k3342j00445K5175R4753m8773q4405O9207P7023
$$ 21233 17632 -18543 -5038 66462 43120 -57325 -32150 62603 13830 -70575 -1368 75655
263G5655n9136n3412M0803L1226k6700l3980r225K0647J5505l7754k4088O9997
$$ 75655 16519 -36893 3910 35136 8436 -25544 -34769 -14122 1383 -36371 -60459 9538
275I538M7593o7817k9058Q2501K1886p6994j1355O2571m390o3140q076M3733J9767
$$ 9538 57131 -10686 -39744 42757 64643 -12351 -23706 38865 34475 -28665 -36741 6992 26759
288B6759k1893k6263J5951L9934k0610n8613J8102N7023l0520o3947L0570O5036
$$ 26759 4866 -21397 -5446 34488 13878 -44735 -26633 30390 -130 -64077 -33507 31529
300C1529j8281m0749L3707M6531k1448m2470O280L5942k790m7324j5833L7677
$$ 31529 13248 -27501 6206 52737 31289 -11181 -4901 31041 28251 -19073 -34906 2771
312B771J2857l9461r979M9274J6776m9561j8466M7218J6252m6771k0406M2058
$$ 2771 15628 -23833 -33812 15462 32238 -17323 -35789 11429 27681 -19090 -39496 2562
324B562K3899l5626j7381M5781L1614l2059l0651K1138K4052k7610l9404J2020
$$ 2562 26461 -9165 -26546 19235 50849 18790 -11861 9277 33329 5719 -33685 -21665
336b1665L2882j5200m0273J4185N2645k949m6656J1410N0199j2173m4962J2000
$$ -21665 11217 -3983 -44256 -30071 22574 19625 -27031 -15621 34578 22405 -22557 -10557
348a0557L7424j0898l2491N772K9681P708k1478j6193K0996K1404l6380l8557
$$ -10557 26867 15969 -16522 -10750 18931 26639 5161 -11032 9964 31368 -5012 -43569
360d3569L4057K9329m7715k7445N3162K9273l9451j0520M1810J3193k3982j2587
$$ -43569 -9512 19817 -27898 -55343 -2181 27092 -12359 -22879 18931 32124 8142 -4445
372d445O681J6293P20l3329r920M3418P657n0483J599N5355j2416n4278J8161
$$ -4445 2236 18529 19249 -14080 -24000 19418 27075 -23408 -21809 33546 21130 -33148 -14987
385a4987L8543k8468k8832K0309J4864l189J141l690Q290K6338j2101l7645K2018
$$ -14987 23556 -4912 -33744 -13435 1429 -1760 -619 -4309 3981 30319 18218 -19427 2591
398B591L5556m4322l7497M8995K0687n1220k398M6161l853k5378J0502R058l797
$$ 2591 38147 -6175 -43672 5323 26010 -25210 -27608 18553 14700 -10678 -176 8882 5085
411E085O466j3362k1218K8948J9402m6107o280N9140p056n4619K3219M0698l7003
$$ 5085 11551 -1811 -23029 5919 25321 -20786 -27066 32074 25018 -29601 -6382 34316 -2687
424b687k9606L0268O058k3047P685P400n603K2329N153l2571J6667M2911l4607
$$ -2687 -32293 -2025 4033 -19014 -11329 -3929 -9532 12797 17950 -14621 2046 44957 10350
437A0350m0539M5497K2321n7321q790N0832r360l6394J8028J4234j5514N982j864
$$ 10350 -30189 15308 37629 -19692 -28482 22350 12990 -23404 -5376 8858 -6656 -674 -2538
450b538k4259J7627K4698l7162j3499N6931M665n2679K3205N2248l3220l1553
$$ -2538 -26797 -9170 15528 -21634 -35133 21798 26463 -26216 -3011 49237 16017 -15536
462a5536L6359N725l3565N337R168j9133Q616J2513l1826K0M4638k0377m5940
$$ -15536 20823 26548 -7017 -1680 7488 -11645 -3029 9484 -22342 -22322 22316 1939 -44001
475d4001L8552L2441n1080j2633N2231k623l3495K3214K1166j9216P139J4899
$$ -44001 -5449 26992 -24088 -36721 15510 12887 -20608 2606 23772 4556 11695 26594
487B6594k3956M34K6397k9662k8057M2559P937n5221P659M9828k3755l4242L3291
$$ 26594 2638 3072 29469 -193 -28250 14309 22246 -32975 -25316 24512 757 -33485 -194
500a94J3015l2361Q148K0203k2284J371K7360j6864j0417L7089m457l8443K8096
$$ -194 12821 -19540 -11392 8811 -13473 -12102 15258 -1606 -12023 25066 20609 -17834 10262
513A0262L2896m6770k3043M6955k338m5153J6015K5284k5052j642K2091j8039
$$ 10262 43158 -3612 -26655 20300 17962 -27191 -11176 14108 -10944 -12586 9505 -8534
525h534o924L0826j1852l2032K9606K0074m2484J030M8497j7653l4561L6206J9382
$$ -8534 -15458 15368 3516 -28516 1090 21164 -21320 -20290 28207 10554 -24007 12199 31581
538C1581l8000p3K7548j6997j3507J8441j3273j7916L2066N334m1955J3710L9733
$$ 31581 -6419 -6492 21056 4059 -9448 8993 -4280 -22196 9870 15204 -26751 -13041 26692
551B6692l0593k5998M0610P200m0399J0340K8824k2064q620K9330n796j5979K2270
$$ 26692 -3901 -29899 10711 17911 -22488 -12148 16676 -5388 -14008 15322 9526 -6453 15817
564A5817l045k8369K3714K2495m3169j4009M4089n949m0333K1856K7031k8968
$$ 15817 12772 -15597 8117 30612 -12557 -26566 17523 11574 -28759 -6903 20128 -8840
576h840o096K6721j4413j4319K7885k308k8141J7984J5753k8611O472L7301k1860
$$ -8840 -14936 11785 -2628 -16947 10938 8630 -19511 -1527 14226 -14385 -7913 29388 7528
589G528l0552L4939J4896l9769J333K9830j8453j6738K0867m905j6059K4955P747
$$ 7528 -23024 11915 26811 -12958 -11625 18205 -248 -16986 3881 -1024 -17083 7872 15619
602A5619l2713P330L0034k2404j6820L3718n94l5524J5886K5390k5617p729K9894
$$ 15619 -17094 -9764 20270 -2134 -18954 14764 14170 -21354 -5468 19922 -5695 -13424 16470
615A6470o219k2753J5206M759k0741J3929J5746l0532o027L5732p747k7381K4666
$$ 16470 10251 -12502 2704 7463 -13278 651 16397 -14135 -20162 15570 7823 -19558 5108
628E108J6806l0780j878K7614j4102j8088K2907K110k4573J0964J3635k0102M274
$$ 5108 21914 -8866 -10744 16870 2768 -15320 7587 9697 -14876 -3912 9723 -10379 -6105
641f105K4344j9149j8961K8444O377l1228Q075K6445j8745j4263K3263n37j6437
$$ -6105 18239 -910 -19871 8573 14950 -16278 -8203 18242 -503 -14766 8497 7960 -8477
654h477J6539O718k4144K952J8101j6840q894K3800n309k5895J7373K0037k3307
$$ -8477 8062 14780 -9364 -6412 11689 -5151 -14045 9755 4446 -21449 -4076 15961 -7346
667g346n273K6142n544j8538J2879N241j4246R449J1287k0632l821K3580o858
$$ -7346 -12619 13523 7979 -10559 2320 7561 -6685 2764 14051 -6581 -10402 13178 6320
680F320j8216J7863P541k5838J136K0813j1831j1763J7390J196j6554J0001J1362
$$ 6320 -11896 5967 13508 -12330 -11194 9619 -2212 -13975 3415 4611 -11943 -1942 9420
693I420j3979K172J6336j3413j2413J9438K923j9987P365J4491j5347p299J7317
$$ 9420 -4559 -2387 13949 536 -11877 7561 10484 -9503 -2138 12353 -2994 -10293 7024
706G024j354j2640R705L535j5961M151J3047j1857n100J6734l473j5167J1966
$$ 7024 5670 -6970 2735 6270 -9691 -5540 7507 -4350 -9450 7284 3811 -11356 610
719F10J1734j4288l220J3732o288j0570J1019K631j1513N621O955j1768r6J3958
$$ 610 12344 -1944 -5164 8568 2280 -8290 2729 5360 -6153 -532 6423 -5345 -5441 8517
733H517n948j0674J1499L827j5322J931J3455p575p106J0533N55q596O315M553
$$ 8517 2569 -8105 3394 7221 -8101 -6170 7285 -290 -7396 3137 3692 -4904 1411 5964
747E964q592J694P222q894n107J2694J06j2919N488R836r160m026J0126p83p158
$$ 5964 -2628 -934 6288 -2606 -7713 4981 5087 -7832 -2344 7492 -1668 -5694 4432 3649 -3509
762c509L920J438n962L043M866o973r1R393m316q089Q965N534j0874j664Q506
$$ -3509 411 1849 -4113 -1070 3796 -3177 -3268 6125 1809 -6280 2685 8219 -2655 -4319 4187
777D187k671o625M132L108l399R55R16l986L008N471o525l852Q404M04r234K566
$$ 4187 1516 -5109 -977 2131 -1268 -313 603 -3383 -375 5096 -1429 -5281 3123 3527 -5707 -3141
793c141Q695l421n730M585K774l334M42O15j977J478n8n238J491O304k974n987
$$ -3141 5554 2133 -3597 988 3762 428 870 1485 -492 986 928 -4310 -2819 3485 511 -5476
809e476M673M541n595k187O236P07m866j13K206O34P28r35j129K856J250m377
$$ -5476 -803 3738 -1857 -4044 2192 2899 -1967 -2080 126 760 1488 553 -576 2280 3530 -847
825h47j198N763j09p110j65N577j286l761J429K991p21k183m80K478J824k098
$$ -847 -2045 3718 3609 -3501 -3666 1911 625 -3136 -1707 1284 563 -1620 -2100 378 2202 104
841A04k867K366L238l300k733M583L049m067k618L356K580k737l301J731K666
$$ 104 -2763 -397 2841 -459 -3192 1391 4440 373 -2245 1111 3691 954 -2347 -616 2050
856B050k174l747J841M834j480n104J655N281j627m250P42L879k42l588q83M036
$$ 2050 -124 -3871 -2030 2804 1324 -3780 -2125 3156 1529 -2721 -1979 1900 1658 -1930 -2813 1223
872A223K009l595k307M595K798n315k815N570J682n564j495L791J521k748j737
$$ 1223 3232 -363 -2670 1925 4723 -592 -3407 2163 3845 -1719 -3214 577 2098 -650 -2387
887b387J756K953j003m305N08N353q32o760J881O892k777n676L362M869k280l296
$$ -2387 -631 2322 1319 -2986 -2478 2875 2043 -4717 -2836 4056 1279 -4397 -1035 3834 1554 -1742
903a742J385K344j78k007k150K280L920m116m790N877M459o688k985O543J147
$$ -1742 -357 1987 1809 -198 -2348 -68 3852 -264 -5054 823 5282 -1406 -4391 2152 3299
918C299o366m7M992r85k785N97O23J773J096l902q48O587k61p644J813P705l682
$$ 3299 -3067 -3114 1878 893 -1892 -1295 -672 1101 2197 -1705 -2553 4034 3773 -3871 -2058 5647 1965
935A965o929M616M826n043k381L669L86j269m20k107J172M269k922n286N572N552
$$ 1965 -4964 -348 4478 -565 -2946 723 1109 -160 -580 -2687 -1515 2754 -168 -5454 118 5670
951E670p200l282Q775J315q249J016O106k148l570J334L13J04J270l073k130O054
$$ 5670 -1530 -4812 3963 5278 -2971 -1955 4151 2003 -1567 -233 80 184 1454 -1619 -3749 2305
967B305R59q665J433R471m008q479O021O518n985l235N217J283k247M59j554j78
$$ 2305 3264 -5401 -3968 5503 1495 -6984 -963 5555 -430 -3665 1552 2835 588 1047 -507 -685
983f85M324j879o837M404O431p635m871R186K469r267J80P711j719m746K672R56
$$ -685 3639 1760 -5077 -673 5758 -1877 -6748 2438 4907 -4360 -4180 3531 1812 -2934 -262 694
999F94r34J903j883k878N755K465q480n81R746k450r455M584O927o393l952N985
$$ 694 -240 1663 -220 -3098 2657 5122 -3358 -3939 5807 3357 -6098 -1514 5413 -980 -4932 1053
1015A053R94l404R76P3j032L651k87o188K915P320o270o565Q685M255r596q34
$$ 1053 2047 -1357 -381 -308 -1340 2311 2024 -4164 -1249 6071 -199 -6764 1921 6176 -3420 -4254
1031d254Q494k112n448L039J943k496J167j36k996L625L324o803j610R466j484
$$ -4254 4240 2128 -3320 -281 1662 -834 333 197 -2799 826 4150 -2653 -4263 5203 3719
1046C719r714M389Q207o512n742O344K475m835K33J826j584K247J088n420J477
$$ 3719 -5995 -1606 6601 89 -5653 691 3166 -1669 -1436 390 -1194 1053 2141 -3279 -1802
1061a802P006m678o428P345M734r057j667R059j143p353K888L978l002o81O83
$$ -1802 5204 526 -5902 1443 6177 -2880 -4547 4512 3369 -3984 -1096 2882 -120 -801 -118
1076a18k271K558L311o127k366Q526P67r534K435R091m828o474O045L267n539
$$ -118 -2389 169 3480 -2647 -5013 3513 4280 -5254 -2819 6272 1444 -5030 1015 4282 -1257
1091a257l65L002j184K12Q86l776P78O086l615p181O290O099q215l480Q440O86
$$ -1257 -1622 1380 196 408 1294 -2482 -1704 4382 767 -6414 -124 5975 -2240 -5720 2720 3406
1107C406o871J863M508k494j240J815j302L7L090l556l095O622J129q462J344
$$ 3406 -3465 -1602 2906 412 -828 987 -315 -278 2812 -744 -3839 2783 3912 -4550 -3206
1122c206Q473l561p200M915M688m986j748L542n77o90J528k324n61M809j253n826
$$ -3206 5267 1706 -5494 -579 4109 -877 -2625 917 340 -350 1178 -1146 -1707 3102 1849 -3977
1138c977L708N287n987l762P262J347p328P10N649j837k980J762J08J4J759k268
$$ -3977 -269 5018 -969 -4731 2531 3878 -3450 -2740 2909 1072 -1908 -146 -38 -24 1735 -533
1154e33k528M911J841o717k10P600k038o856L900M932m636k672L888N82k075K15
$$ -533 -3061 1850 3691 -3026 -3236 4364 2326 -4530 -630 4302 -334 -3006 882 1464 -611 -396
1170c96m00l40L078r97m396K834N261m923m279N952K862o166r39N306o45l581
$$ -396 -796 -1136 1942 945 -3451 -617 4644 -279 -4558 1394 4256 -1910 -2849 2457 1812 -1769
1186a769J277J375q16L70q06j730L011J678n081q04O265o39o268K357N234k936
$$ -1769 -492 883 67 437 -369 -2099 912 2590 -2491 -3295 2970 2331 -3937 -1580 3654 718
1202G18l644L092J815k139k62L03k11J549k84l041J520L759l086l707M316K579
$$ 718 -2926 166 1981 -158 -420 -117 -328 1221 937 -2104 -584 3175 89 -3618 698 3277
1218C277m923j323M722L8l773P03K360l54p06l03o45J844J090l312r43M397k8
$$ 3277 -1646 -2969 1753 1791 -1982 -1279 1081 727 21 -282 -927 917 2007 -1305 -2248 2149 2121
1235B121n076J365M573k238l428K520K277k197j032J005O73l3l31j663R88K821
$$ 2121 -2955 -1590 2983 745 -2683 -163 2114 -83 -1115 -110 563 530 199 -1464 -476 2345
1251B345k156k938L118K488l684j926L989Q59l527j52K538q9j406m1L25J136J97
$$ 2345 189 -2749 369 2857 -827 -2753 1236 2095 -1432 -1584 954 865 -541 -582 -257 879 1076
1268A076j924m52K993O3l851O94L841j358l549J718K498j536j710J078R44k54
$$ 1076 -848 -1300 1693 1756 -2095 -1401 2440 1082 -2467 -749 1749 213 -1497 -419 525 271
1284B71q04m78J055J463j538j815K025K275k727j617K889R97k745o90K354K40
$$ 271 -533 -1011 44 1507 -31 -1846 179 2454 -273 -1890 999 1996 -749 -1439 915 1155
1300A155j668l72Q24M56k2j434P4J793qk529N01K914q31k520J031K341j124j883
$$ 1155 -513 -885 -61 395 373 -1061 -987 806 798 -1731 -1230 1684 853 -1667 -636 1705 581 -1302
1318a302J156J389o74j153k3R74N11j135j006J502R38j779j070K152J021k364
$$ -1302 -146 1243 569 -584 -607 367 878 -257 -1263 239 1177 -602 -1672 480 1501 -863
1334h63o79K312L67j660n21J472N55q41q62O18J224n74j658N27J871p04j956N84
$$ -863 -1542 770 1137 -523 -1044 428 983 142 -720 -102 1122 548 -1110 -583 1288 584 -1372 -788
1352g88J980p29j838P32J652n45j344L30J205R9j373k20J517L64j422q23J672
$$ -788 1192 463 -1375 -643 1009 464 -880 -550 655 754 -619 -839 678 1042 -380 -1203 469
1369D69O73j554p41J527Q13j569o98J347P15j138q96R59J111j003j127Q67J163
$$ 469 1142 -412 -1153 374 1187 -382 -1080 267 982 -156 -1052 -93 1018 15 -1112 -245 918
1386I18m60j397N93J321l67j396L89J340l45j580M46J382k80j318K8J328j50j120
$$ 918 458 -939 -346 975 608 -788 -399 941 596 -984 -538 844 564 -754 -726 602 452 -668
1404f68N6J014J74p84o00J019P01j037q39J147R20j261j030J258Q69j144n71R39
$$ -668 -612 402 576 -208 -808 211 912 -125 -964 183 1103 -158 -1188 70 939 -205 -776 163
1422A63N79q60m59L64Q70l33j042K81J155o2j328K5J570l37j484M02J359m11j219
$$ 163 742 -118 -577 -213 657 324 -718 -437 718 656 -672 -647 923 586 -898 -496 863 452 -767
1441g67L98P37o1o95o7N08N65o61q33R12J038j133j029J358P39j305n74J332L75
$$ -767 -369 368 307 -388 -455 53 618 -43 -876 36 1074 -59 -1088 270 1009 -296 -870 462 837
1460H37j148k21N85L37k7p49j46R31K57j318l01J623k1j641N29J402o05j233O97
$$ 837 -311 -532 53 390 363 -386 -532 399 656 -662 -963 660 639 -1002 -473 929 324 -909 -212
1479b12Q75m95m44J14L81J15j01q41M70R81p36j283J150J094j468o04J360L45
$$ -212 663 168 -276 -162 219 334 233 -608 -138 843 107 -1176 -26 1068 -400 -1004 356 701
1497G01j172L6O55L4k48j39j13M52M49q97l90J265J03j489K18J437n21j258P27
$$ 701 -471 -435 220 254 6 -133 -246 206 655 -242 -632 633 736 -753 -535 902 381 -877 -150
1516a50Q25p30m33M85J03r1K8m14P2R91m79j047R17Q36j074o54J365K82j288m0
$$ -150 675 -55 -488 -3 100 9 37 -377 -305 686 207 -840 77 913 -161 -815 550 832 -456 -496
1536d96R93j82o16K66n0J54K27l95n35R13M04j194j53J393l45j227O60J042q19
$$ -496 497 315 -301 -35 -85 69 296 -99 -634 279 683 -511 -664 729 384 -843 -183 859 40
1555D0n12O18J40k46L4k18k22O57j6r19M38J075q85r78J127P34j083m40J052p9
$$ 40 -472 146 286 40 74 -144 -366 291 275 -644 -206 869 -16 -994 133 867 -216 -656 396 317
1575C17n16O0L70k09K33r2n77M64O32r64l52J046M3j004J68J001m10q54O22M75
$$ 317 -199 -139 231 22 255 163 -414 50 682 -282 -634 412 455 -549 -381 620 210 -644 -22 453
1595D53m84L9o6j3K92J54p41J77P88k85r96N86P70q29m47Q62J16p82J53N01k60
$$ 453 -31 8 -58 -71 221 375 -366 -189 599 314 -682 -96 674 -155 -602 260 376 -406 -253 248 -12
1616a2J3N6k03J9O08n98m97Q59M28r31r2Q47j73p54L93M93o45q0L87k57N3J66
$$ -12 1 57 -146 -127 481 -117 -614 245 673 -258 -350 497 324 -430 -37 456 -189 -269 118 -139 -86 80
1638H0j12l56P10M7q49K55P93m98o37P28L37o22j57N20j44k49J69L7j88L35j77
$$ 80 -32 -388 322 369 -480 -225 568 70 -567 161 498 -124 -281 239 95 -154 15 52 -136 199 22
1659B2m64M60M35o24l55Q75K0p08M7N98j98l12K88N7k61L01j56k89L56J12m83
$$ 22 -442 18 453 -171 -526 349 369 -339 -292 306 108 -204 84 141 -120 181 25 -264 92 204 -279
1680b79o5O77r8p58L89N52l62k47L75J97n46J22J69k96J33J58k32q7O11l89m59
$$ -279 -344 333 235 -523 -134 418 56 -191 184 381 -165 -43 126 -170 -37 121 -111 -198 413 24 -435
1701d35N44K79o04j11N17p8m08J31L60k38K6O3j64J9K58j38l67N64n6m40M4M50
$$ -435 109 388 -216 -327 190 112 -296 -165 195 -43 -17 46 -118 -99 159 21 -346 218 162 -278 -234 216
1723B16j05m57L64K24l28j24M07k67M7K01k13q0L79m0m47J73L46k81l12L05L26
$$ 216 111 -346 18 242 -86 -210 197 -70 -23 178 -35 -115 264 224 -223 -50 296 15 -297 8 334
1744C34n59P9K18j10q0P5R9k18L32q2l47K46K19k77k21N11j7m65K15K55j54l90
$$ 334 -225 -146 72 -38 -118 -43 56 -162 170 88 -259 -13 206 -71 -292 219 202 -263 -48 207 53 -337
1766c37L61R0j46R9J2k91L00R5k67J4L67j12n18L34K25k09k01K59N8k39J34m8
$$ -337 24 114 -32 67 79 -212 88 183 -84 -70 297 185 -333 1 226 17 -184 75 133 -106 28 -20
1788b0p9R1M1l33K91K43j87k22K13J89l19j52L48P2l67J81J53o1j08O0k0J5m7
$$ -20 -99 -8 33 -300 -9 234 47 -175 38 227 -92 -244 104 176 -191 -10 143 82 -26 34 14 29 -18
1811a8p7n7J81J87l76R5K95k25j99K05K37l31LO7R0o4k0j13L4J96r0k31K83O7
$$ -18 -95 -152 29 216 -160 -65 230 5 -194 11 248 -83 -80 -13 77 13 -7 -120 -86 110 20 -211 72 139
1835A39k23k04L39M0j42J5J18P9j49p5n7J21L4j60N1J36K3j12l5K02l5j77K0J58
$$ 139 -84 -288 51 91 -51 -36 82 161 12 -63 -120 1 35 -125 -74 62 85 -27 -62 140 105 -72 -52 106
1859A06R4k11lM9p2l6p2J87L6m2j38J12R2j03j94R3J65p7p7O8P0l7j36J41N8j2
$$ 106 200 -11 -14 35 -37 -73 -145 42 78 36 -102 10 102 -1 -195 -102 63 -14 -91 -23 47 10 -126 15 73 61
1885F1j49J6Q9M7o2mn8K08k65Q4Q1N4j62J9Q5K2j60k2K94j84j71K75j07Mj00J08
$$ 61 -88 -72 17 64 2 -2 -60 148 -117 -33 48 102 -60 -41 44 66 -94 -116 178 -6 -177 98 -9 -5 -105 3
1911CL1j26J01n3M2R6j24q3J32J39r9k07K47m4j80O8J21pj06k6O5k3J46j12j14
$$ 3 34 -92 9 -44 -2 94 -30 -113 19 158 59 -148 99 55 -125 -57 64 57 -49 -75 -10 -33 113 1 -113
1936a13J17L2r5OK31m2l54J93J10j41n8J78q6n2R6l3o5M0O4r0N2J13j25j09J70
$$ -113 4 36 -59 -53 178 136 -218 -25 85 -56 -114 64 -22 -74 22 -11 -76 -36 28 -62 -10 103 -22 -131 39
1961C9K11k79J7N5qn5J71j25r0J02Q1j72O4L0l1j30K32J3k97OK80j62r1J36O6
$$ 39 250 -29 -12 43 35 -20 151 26 -64 38 119 -53 11 41 10 -120 112 125 -172 -166 114 -48 -139 -3 63
1986F3j53P7J38j24j4J05p7j37K33r4k51K75Q9l90N9K59Nm30L70J73l29Q7K39
$$ 63 -90 -13 125 1 -13 92 15 -122 111 17 -234 41 130 -260 -201 58 63 -367 3 176 -153 -66 173
2009A73j62j02J77L5j83J74o3k63K31J36j40k55L51K0k85J05J73j66m7J36jk10
$$ 173 11 -91 86 121 -62 112 49 -214 17 153 13 -242 109 129 -156 -51 122 -44 -91 45 44 -166
2031a66K03J28k79K53J80l80j07L69j41k85L59J2m14O1L54j82j39K98k2l38K16
$$ -166 37 165 -114 139 319 -61 -168 201 60 -225 134 146 -268 -207 147 -35 -174 124 102 -236 -20
2052b0J45k77J06K01j94k44M41J81n91K14L35l60p5K46lk53Q2J72k22K43J23l49
$$ -20 125 -152 -46 155 -39 -283 158 339 -252 -38 297 -63 -138 108 105 -148 -66 106 -116 127 250 -99
2074i9r8M25k00l80M66J76m43j43N28j04l13K93q7q2J20J20k60p8L99l12r4K48
$$ -99 -197 228 28 -352 114 290 -153 -296 232 128 -185 108 21 -61 59 179 -81 -159 240 -72 -166 82
2096H2J64n14K09L09k31l34L60K06m13J25J97j51J33j18j81K19N0P2n19L65L11
$$ 82 246 -268 -59 250 19 -315 45 251 -162 -37 160 9 142 24 -157 62 112 184 -335 30 341
2117C41m36j32M00j06k82J63J86k34p5K61k23Q7J72j40k23L85J63n77J89M33l59
$$ 341 -95 -227 173 67 -215 -52 134 -100 -175 86 -137 -50 122 -18 -241 144 307 -270 -81 352 -7
2138gl26L65L64m06j53L18j08r2N3j2p9J95j68l21M92J86k99l91N87N8m98J08
$$ -7 -333 32 396 -10 -163 155 47 -45 8 -4 -83 112 -56 -377 115 301 2 -389 198 256 -242 -134
2160a34M47k51k15J02J26j10J40j34p1K31p9l63K11N24l09n79N82K17n24jK35
$$ -134 313 62 -153 -51 75 -35 105 -29 -100 131 52 -311 -100 424 115 -464 118 335 -189 -190 45
2181D5J9k42J47L4L5J27k22l22M81J54m32j92O18J03o50K12L08j18l62K60J56
$$ 45 64 -178 -31 3 38 165 -57 -379 102 256 -176 -368 250 353 -297 -85 223 105 -257 3 159
2202A59j26n4Qk9K25q4m08J31N34l14m24M26L19m32k14L69J71l47%J95n9R4p7
$$ 159 33 -21 -13 -42 183 99 -309 -178 356 42 -382 44 363 -69 -283 86 257 -90 -90 105 46 140 63
2225F3j71K19J37l24j93M97j8o07J40N52k18k87J28K27j8o7j45J62J41j05l05
$$ 63 -108 111 248 -76 -269 228 210 -397 -257 295 77 -210 -82 145 127 60 -85 77 218 113 -192
2246a92K33K32j78m09M07K25m84k57N32J68l74j19L22Pl6k74M6L41%l19k4L92
$$ -192 41 273 95 -314 93 318 -166 -423 109 277 -97 -216 106 113 77 -197 -151 190 190 -129 -153 239
2268B39P1o81J89M74j20m51J83L23j68j87J7J69m7Q3l61J96L79l37m26O13L11
$$ 239 310 -371 -182 292 172 -279 -96 227 59 -128 -111 58 11 94 -267 -71 308 -29 -455 158 469
2289D69n83k21M66R1l17j01L51K7j74j74n3L89p1m20J26M01j8n88K79L30m6m77
$$ 469 -114 -335 131 222 -95 -196 155 182 8 -166 -219 170 99 -321 -195 206 188 -400 -121 209 163 -314
2311c14L42K85j54m12J16L34j80j98q1K14K86l33l35N35L42m77l45N13M2m02k
$$ -314 28 313 159 -253 -137 197 17 -181 -262 -48 238 -95 -430 105 447 -30 -375 138 180 -222 -224
2332b24L36J17k53j66J33M28l67j42m7N41j94n39J44N64k56m69K88M30k36m68
$$ -224 112 229 -24 -190 -57 371 4 -138 -185 356 162 -377 -233 331 75 -394 -106 324 88 -380
2352c80K06L41j02k32j17M68J66m66k07O07J02n03k33N90J06o11jM74L9l55k34
$$ -380 -174 167 65 -167 -284 184 350 -116 -323 284 386 -117 -350 240 346 -265 -266 208 247 -108 -342
2373c42L21L10k72m18L46L83j51n12J97M54k01m69K76M24k63m30J89L60j25k45
$$ -342 -21 289 17 -401 -55 328 177 -335 -138 316 115 -354 -78 346 83 -347 -158 202 77 -168
2393a68PM86j02m75j09N78P3m16k52N37J47n22r5L50K82k89l06M12J68k89l76
$$ -168 -161 325 223 -252 -361 217 290 -126 -378 159 306 -216 -311 39 321 32 -274 138 306 17 -359
2414c59L14M66l80m47M09M70l14m79K20M31j25n09J10M88k37k91l8M72j9m79J21
$$ -359 -45 421 41 -406 3 473 159 -320 -100 331 206 -303 -193 295 58 -233 -271 201 182 -297 -176
2435a76L60O0n12J27M21Jl76k46N93P1m76j97M34K31l70l52M21L72n41k10M39
$$ -176 184 244 -268 -141 280 281 -95 -341 252 323 -153 -350 84 315 -55 -407 14 386 -155 -365 74
2456G4L23l67m24L17L73j68m70K29L83n5n34J22M89j15n64J87N07k06m21R5N74
$$ 74 397 30 -394 -77 296 128 -342 -113 270 215 -319 -197 292 177 -387 -200 307 101 -320 -225 349
2477C49j57m09o3M52J62l63k86L27M03m91l17N91J94n18l33N16L45n28k04M97
$$ 349 192 -217 -280 172 334 -29 -315 12 415 -76 -393 198 392 -126 -459 57 402 -126 -330 167
2497A67J59l01k91K25L49k28l45J10N20j77n41K25M46k26m71L23L90j63l71lL62
$$ 167 326 25 -266 -41 308 80 -265 -155 365 188 -353 -128 318 92 -379 -56 334 171 -200 -203 159
2518A59J1k54j70M04J26l69k85N22K01n16q4M15J2k83j20K96K28l65j36K62J98
$$ 159 170 -84 -254 150 276 -93 -378 144 345 -171 -255 160 172 -111 -231 65 293 -72 -208 54 252
2539B52k07l06J83L98j83m86J72N55l19n01L60M25l56j63P4L38j62j46q7L34M8
$$ 252 45 -261 -78 320 137 -349 -177 378 59 -442 -82 343 -13 -176 -102 236 74 -72 -159 175 223
2560B23l82k30N83N1m85n6M89j3l83J5L81K5m20m4L15J27j58l90K38L85j46l91
$$ 223 -159 -389 194 245 -240 -296 193 180 -203 -188 193 218 -202 -246 69 196 38 -352 -114 271 125 -266
2582b66K06N28m58m26M07L03l46k89K62K97j02l03O4K75L3k84k26M38J45n63J70
$$ -266 -60 468 10 -416 -9 294 -52 -341 -79 218 116 -187 -123 152 185 -99 -325 113 258 -305 -135
2603a35L33J5m79J01L28m4l02P3K08K9j78j79J18L58k50l58M55M35n71k70M92
$$ -135 198 213 -266 -165 163 119 -183 -110 98 127 -51 -230 -112 246 -4 -362 93 528 -43 -313 179
2624A79J68l94j42K67J27j83j85P9J28P5l85l0M82J8n83J26O59l13m32L23K98
$$ 179 347 -47 -189 78 205 22 -163 -84 44 119 -266 -296 186 204 -379 -253 406 93 -339 -16 282
2645B82k69k17J53K82j21k13j26K53J34k95k29L32L53m54j79N55%m38j23N29o5
$$ 282 13 -204 -51 231 110 -103 -229 24 158 -137 -366 -34 319 -135 -314 241 241 -197 -320 209 144
2666A44k92K1K31MK2l58J15K78j2n10J93L73n7n18K88L36l04k08J60K20j43j13
$$ 144 -148 -127 104 108 130 -228 -113 165 153 -357 -164 209 152 -366 -78 258 -46 -254 -94 126 -17 -130
2688a30N8J74J02k64j77K64J94m38j67N15K1l18o7L89o5l08K05m2R4l0j83J35
$$ -130 -72 102 204 -60 -237 27 221 -217 -384 131 152 -166 -233 156 91 -217 -12 -54 40 10 -173 -38
2710c8K06p0k90J18M54m22l51L58L59m71j07L23J14k38r1J45J14N9k33r8J99K20
$$ -38 168 98 -192 -74 380 -42 -393 -35 324 -147 -254 69 183 -55 -146 -1 113 172 -61 -159 40 260
2732B60m58j0N41n3n21J12M28r8m77J15L73j29j83pjL35j67m08L54M16l95m79
$$ 260 -198 -208 333 280 -241 -129 299 201 -276 -161 212 83 -100 -107 -108 227 60 -348 6 422 27 -452
2754d52N16L04n45j28L71J87m39P4K57J0p1k53J14L35j54k61p1M01j03l53J14
$$ -452 64 368 -177 -305 66 253 -186 -112 145 155 84 -169 -55 280 126 -135 -206 195 92 -261 -147
2775a47L98j63l20J83J59j06j67O3J57M2j09k57L62K57m24k81M74J29m57j39M45
$$ -147 251 88 -232 -49 110 4 -163 -100 57 99 -10 -267 95 352 -72 -353 121 250 -207 -346 99
2796I9J30l51jK17K6r8j98J29J99Pl55O1L50o1n38J84O42m58k65L09K78k16l78
$$ 99 229 -122 -123 94 120 22 -176 -47 152 159 -196 -135 215 154 -384 -200 442 -16 -281 28 306 90 -288
2819b88K54J44N9j59j56K81J43l75k59M67K5k03j77M41J80o44P4K99P2k25j45
$$ -288 -34 110 169 10 -146 135 278 -97 -356 111 136 -67 -244 197 377 -267 -193 106 178 -47 -192
2840a92K42J45n3l43O7L89k68l85L73L83l74l11L56J72j89j10p5L08j01k94L6
$$ -192 50 195 142 -201 -134 255 -13 -398 -25 358 -16 -327 29 201 12 -98 -173 135 34 -260 -224
2861b24M14j4m52ML82J02l14j55M57J07m45j46M91n2k55m4K39o8k0k19K27R9j51
$$ -224 190 176 -276 -272 110 212 -102 -257 200 307 -138 -284 207 155 -100 -144 95 27 7 -212 15 114 -37
2884c7q2P0K51l10j50K90L00l69j78N9L62o8l84K02J73O0m26J02L27Rl64q3L62
$$ -37 -119 -49 202 -108 -258 32 332 -37 -215 -156 206 138 -246 -44 129 189 -237 -135 192 201 -163 -246 116
2907A16J12l40QK97Q5m24LK89J19m16j21L41O6k70M2Q1J35j28j80R9L50k07l43
$$ 116 228 -112 -104 193 278 -146 -143 146 265 -151 -272 69 135 -135 -93 -12 123 -5 -185 -86 264 57 -286
2930b86L43J12k56j77K47K85j89k00mL17j7l97J37L40j27l12P4L58j44k68R0J77
$$ -286 57 169 -87 -264 -17 268 79 -121 -125 192 175 -222 -85 255 128 -184 -110 248 104 -164 -74 103
2952A03J73m48m0K72R1k76r5K45K4m5k20K49J38j94k05K53J86k37j33J56J68j10
$$ 103 276 -172 -212 60 151 -125 -220 25 49 4 -216 33 171 -23 -228 25 211 -26 -159 -3 165 55
2974E5l30K65K71k94j28R6J53j3r5j31K97L9k36j83L85n3k59KK62J37l28j42M35
$$ 55 -275 -10 261 -33 -161 -65 88 75 -20 -151 146 185 -51 -234 151 98 -161 -159 103 240 -88 -230 205
2997B05j17k63l1K75N0j38q2Q7J77o8j61O7L14l04l66L97J74k51j28K17J32k55
$$ 205 88 -175 -206 69 119 -19 -101 -14 163 95 -66 1 315 11 -355 42 216 -35 -163 54 186 -69
3019f9p5L0K51r8j56L7K78Ml66L3L58j44k92L6K55p6k49J40J52Q3k89K4J39J16
$$ -69 -144 -114 137 39 -117 -80 198 202 -164 -131 227 83 -209 -173 82 6 -243 -103 49 132 -157 -133 6 122
3043A22j01r5J28J42k17k45K74K68l02j19J08K73k20k66L00J6j38N0r8J72J67
$$ 122 21 -74 54 196 -21 -266 8 276 -26 -145 -37 236 16 -250 50 66 -72 -22 -120 52 219
3064B19l80K6L25j22j68J7K91j09k26J14N8k5o3J19j34M6o1q6K63J0j15k40L71
$$ 219 -161 -135 190 68 -100 -83 208 99 -127 -13 45 20 -43 76 -58 -12 -73 -159 104 114 -1 -241 130
3087A30K8k61K6J89L4l45m1N07j42j51k2P7K1M4j25j63L52j31k04J26L18k09k70
$$ 130 158 -103 -77 112 146 -199 -240 267 125 -26 -48 29 50 94 -31 -194 158 27 -177 -51 267 58 -212
3110b12L00N2k43l3J57M2m3r6N1NR2j16j68K52L17m74l0K60J5l20J0M89k18k73
$$ -212 88 140 -103 -136 21 63 20 -76 -25 -20 72 -44 -212 40 357 -117 -147 113 128 -192 -182 307 89 -184
3134a84J19J13k7O7j87J87Rl9k90K25J45p3l26K73K09k53j79K87P3k55Q1Jm1K47
$$ -184 -65 48 21 88 -99 88 97 58 -232 -7 138 65 -261 12 221 -32 -211 76 149 -106 -25 -24 -65 182
3158A82o6k63Q4K18j91j66L20R1m24J09M68l91j52J79l9r7J47J27k41J94n6j51
$$ 182 116 -147 -63 155 -36 -202 118 209 -215 -106 362 -29 -181 -2 -41 -138 9 136 -105 89 33 -118
3180a18O0L33k00j30J46J36k87j45L23Mk07M2J42j25mK5j80J63J14k21j06M20
$$ -118 -58 275 75 -55 91 227 -60 -205 118 122 -85 -43 99 -26 -30 -5 -185 -22 92 -129 -235 185
3202A85L9m88K03M21l23j99J81O8j52j9J46q4J4k1p2R3J90r7k63K06K32l35j85
$$ 185 224 -264 -61 360 37 -162 19 87 -65 -84 62 -22 -8 -29 -101 -8 182 85 -178 28 260 -75 -260
3225b60M05l0l14Q3K38j12j41J79o7j3k1L5q8K74j14k95J24L29j56k17J34K42
$$ -260 145 115 -199 -116 122 10 -131 48 -19 -32 -53 -18 -106 168 54 -241 -117 212 56 -161 -27 215
3247B15k89q9K44N9j48l4J13o0J72k60oK26N8l30p2K60J28l90J66K99j09k46q
$$ 215 -74 -163 81 140 -8 -42 71 11 183 -77 -83 143 201 -129 -201 59 187 -203 -37 262 153 -93 -101
3270a01J90n8K7j92R8K03j70j25M5L91k71k46L04M2j80j7J21O1k79K9K29q2Q3
$$ -101 89 31 58 -134 -36 167 -3 -128 -83 308 37 -209 95 137 -43 -60 61 122 -157 -128 101 19 102
3293A02j37j03K19O0k94l3K26K48n35O8L96r4j74n0J95n8j40P0m5J19n6k29K01
$$ 102 -35 -138 81 141 -153 -186 40 288 -247 -179 217 123 -51 -101 94 36 -104 -34 -79 40 -16 -245 -44
3316d4K77k94j23J70K68l50o6L33jj80j12J78L8j27P4o8J55j09j23R6K06o4k19
$$ -44 233 -61 -184 -14 254 -96 -162 171 170 -10 -122 56 94 -33 41 -27 128 19 -104 -8 198 134 -85
3339h5l3K01l0j44MK03j97o8Q8K4O9k0j32K16J24k71j12L05J39k98j52K98M0l15
$$ -85 -118 83 53 -91 -87 116 -81 -149 -61 -37 32 12 -120 96 220 -51 -163 142 281 -17 -169 129 169 -146
3363a46L8R4N9J5j86J65P4n9k21J25J50k5k58K12J78k09j54J18J75k54j2J65J3
$$ -146 -108 -14 45 60 -126 39 113 54 -167 -42 108 83 -175 37 215 6 -148 -30 145 -109 -121 44 57
3386E7n3j11PK29jk61L3L16j32j47n1K02P9k63q0K36Q2k61J0J81J46j42j80J27
$$ 57 4 -107 -100 129 128 -133 -100 216 84 -63 -114 88 167 -96 -176 60 142 -119 -109 72 218 76 -104 23
3410B3K97l09j78J60J21j39j59J02J87p3k00K04J8L8k25o0L27o8n3j26J85L9k35
$$ 23 320 11 -167 -7 114 -25 -184 -82 105 32 -168 36 54 92 -133 -193 134 66 13 -113 72 111 -124
3433a24K5K91j33k63R9K33J7k89R4J78jk47r9L27M1j74q0Q1J85j29j59K9K28j48
$$ -124 -99 192 59 -204 -105 128 145 -144 -50 128 127 -120 -219 108 149 -25 -105 -24 161 32 -127 -98 130 -18
3457a8j66J04K94j75j74MJ89l8k49J90L12k46n9j1K02m2j59p3J65J07l45L3J82
$$ -18 -184 -80 214 39 -135 -131 58 20 -229 -39 273 27 -32 -43 159 117 -42 -115 50 157 -188 -155 27
3480B7O4k9j57K18k3j97j4J81k3j14r2K04O1o1j41J24M8k32J17m5L15k18j91J99
$$ 27 91 62 -95 123 100 -97 -111 70 47 -67 -159 45 106 45 -96 28 76 -156 -39 -84 231 13 -178 21
$$ [...]
8191C7
##END NTUPLES=NMR FID
##END=
