##TITLE=1H_Pr 3568-Py2
 200.13MHz,CDCl3,
 8 sc
 
 2.4.2025
##JCAMPDX= 6.0         $$ Bruker NMR JCAMP-DX V2.0
##DATA TYPE= NMR FID
##DATA CLASS= NTUPLES
##ORIGIN= UXNMR, Bruker Analytische Messtechnik GmbH
##OWNER= pz
$$ XWIN-NMR		Version 3.5
$$ Wed Apr  2 13:51:43 2025 Russian Standard Time (UT+4h)  she@DPX200
##.OBSERVE FREQUENCY= 200.1313
##.OBSERVE NUCLEUS= ^1H
##.DELAY= (6, 6)
##.ACQUISITION MODE= SIMULTANEOUS
##.ACQUISITION SCHEME= undefined
##.AVERAGES= 8
##.DIGITISER RES= 18
##SPECTROMETER/DATA SYSTEM= spect
##.PULSE SEQUENCE= zg30
##.SOLVENT NAME= CDCl3
##.SHIFT REFERENCE= (INTERNAL, CDCl3, 0, 14.3821)
##AUDIT TRAIL= $$ (NUMBER, WHEN, WHO, WHERE, WHAT)
$$ ##TITLE= Audit trail, XWIN-NMR		Version 3.5
$$ ##JCAMPDX= 5.01
$$ ##ORIGIN= Bruker BioSpin GmbH
$$ ##OWNER= she
$$ F:/spectra/data/she/nmr/H-C/1/audita.txt
$$ ##AUDIT TRAIL=  $$ (NUMBER, WHEN, WHO, WHERE, WHAT)
(   1,<2025-04-02 13:49:40.60 +0400>,<she>,<DPX200>,
      <created by zg, POWCHK disabled, PULCHK disabled
       configuration hash MD5:
       00 E9 B6 7A A2 85 ED C7 34 08 36 98 17 FE 4E 26
       data hash MD5: 16K
       99 D2 09 0B 20 65 09 4F A7 36 6C CF 6C BE 97 EF>)
$$ ##END=
$$ 
$$ hash MD5
$$ 61 27 80 67 CA 93 8E B8 48 1C DE 2A 45 E5 C1 28
##$RELAX= 
##$RELAX= 
##$RELAX= 
##$RELAX= 
##$RELAX= 
##$RELAX= 
$$ Bruker specific parameters
$$ --------------------------
##$DU= <F:/spectra>
##$EXPNO= 1
##$NAME= <H-C>
##$PROCNO= 1
##$TYPE= <nmr>
##$USER= <she>
##$AMP= (0..31)
100 100 100 100 100 100 100 100 100 100 100 100 100 100 100 100 100 100 
100 100 100 100 100 100 100 100 100 100 100 100 100 100 
##$AQSEQ= 0
##$AQ_mod= 1
##$AUNM= <au_zg>
##$AUTOPOS= <>
##$BF1= 200.13
##$BF2= 200.13
##$BF3= 200.13
##$BF4= 200.13
##$BF5= 200.13
##$BF6= 200.13
##$BF7= 200.13
##$BF8= 200.13
##$BYTORDA= 1
##$CFDGTYP= 0
##$CFRGTYP= 5
##$CHEMSTR= <none>
##$CNST= (0..31)
1 1 145 1 1 1 1 1 1 1 1 1 1 1 1 1 1 1 1 1 1 1 1 1 1 1 1 1 1 1 1 1 
##$CPDPRG= <>
##$CPDPRG1= <>
##$CPDPRG2= <>
##$CPDPRG3= <>
##$CPDPRG4= <mlev>
##$CPDPRG5= <mlev>
##$CPDPRG6= <mlev>
##$CPDPRG7= <mlev>
##$CPDPRG8= <mlev>
##$CPDPRGB= <>
##$CPDPRGT= <>
##$D= (0..31)
0 0.7 0 0 0 0 0 0 0 0 0 0.03 0 0 0 0 0 0 0 0 0 0 0 0 0 0 0 0 0 0 0 0 
##$DATE= 1743587380
##$DBL= (0..7)
120 120 120 120 120 120 120 120 
##$DBP= (0..7)
150 150 150 150 150 150 150 150 
##$DBP07= 0
##$DBPNAM0= <>
##$DBPNAM1= <>
##$DBPNAM2= <>
##$DBPNAM3= <>
##$DBPNAM4= <>
##$DBPNAM5= <>
##$DBPNAM6= <>
##$DBPNAM7= <>
##$DBPOAL= (0..7)
0.5 0.5 0.5 0.5 0.5 0.5 0.5 0.5 
##$DBPOFFS= (0..7)
0 0 0 0 0 0 0 0 
##$DE= 6
##$DECBNUC= <off>
##$DECIM= 32
##$DECNUC= <off>
##$DECSTAT= 4
##$DIGMOD= 1
##$DIGTYP= 9
##$DL= (0..7)
0 120 120 120 120 120 120 120 
##$DP= (0..7)
150 150 150 150 150 150 150 150 
##$DP07= 0
##$DPNAME0= <>
##$DPNAME1= <>
##$DPNAME2= <>
##$DPNAME3= <>
##$DPNAME4= <>
##$DPNAME5= <>
##$DPNAME6= <>
##$DPNAME7= <>
##$DPOAL= (0..7)
0.5 0.5 0.5 0.5 0.5 0.5 0.5 0.5 
##$DPOFFS= (0..7)
0 0 0 0 0 0 0 0 
##$DQDMODE= 0
##$DR= 18
##$DS= 0
##$DSLIST= <SSSSSSSSSSSSSSS>
$$ [...]
##$SUBNAM0= <"">
##$SUBNAM1= <"">
##$SUBNAM2= <"">
##$SUBNAM3= <"">
##$SUBNAM4= <"">
##$SUBNAM5= <"">
##$SUBNAM6= <"">
##$SUBNAM7= <"">
##$SUBNAM8= <"">
##$SUBNAM9= <"">
##$SW= 18.0517328524113
##$SWIBOX= (0..15)
0 0 2 0 0 0 0 0 0 0 0 0 0 0 0 0 
##$SW_h= 3612.71676300578
##$TD= 16384
##$TD0= 1
##$TE= 0
##$TE2= 300
##$TE3= 300
##$TEG= 300
##$TL= (0..7)
0 120 120 120 120 120 120 120 
##$TP= (0..7)
150 150 150 150 150 150 150 150 
##$TP07= 0
##$TPNAME0= <>
##$TPNAME1= <>
##$TPNAME2= <>
##$TPNAME3= <>
##$TPNAME4= <>
##$TPNAME5= <>
##$TPNAME6= <>
##$TPNAME7= <>
##$TPOAL= (0..7)
0.5 0.5 0.5 0.5 0.5 0.5 0.5 0.5 
##$TPOFFS= (0..7)
0 0 0 0 0 0 0 0 
##$TUNHIN= 0
##$TUNHOUT= 0
##$TUNXOUT= 0
##$USERA1= <user>
##$USERA2= <user>
##$USERA3= <user>
##$USERA4= <user>
##$USERA5= <user>
##$V9= 5
##$VALIST= <valist>
##$VCLIST= <CCCCCCCCCCCCCCC>
##$VD= 0
##$VDLIST= <DDDDDDDDDDDDDDD>
##$VPLIST= <PPPPPPPPPPPPPPP>
##$VTLIST= <TTTTTTTTTTTTTTT>
##$WBST= 1024
##$WBSW= 4
##$XGAIN= (0..3)
0 0 0 0 
##$XL= 0
##$YL= 0
##$YMAX_a= 818500
##$YMIN_a= -757453
##$ZGOPTNS= <>
##$ZL1= 120
##$ZL2= 120
##$ZL3= 120
##$ZL4= 120
##$ABSF1= 10
##$ABSF2= 0
##$ABSG= 5
##$ABSL= 3
##$ALPHA= 0
##$AQORDER= 0
##$ASSFAC= 0
##$ASSFACI= 0
##$ASSFACX= 0
##$ASSWID= 0
##$AUNMP= <proc_1d>
##$AZFE= 0.1
##$AZFW= 0.1
##$BCFW= 1
##$BC_mod= 2
##$BYTORDP= 1
##$COROFFS= 0
##$CY= -3
##$DATMOD= 1
##$DC= 2
##$DFILT= <>
##$DTYPP= 0
##$F1P= 0
##$F2P= 0
##$FCOR= 0.5
##$FTSIZE= 0
##$FT_mod= 4
##$GAMMA= 1
##$GB= 0.15
##$INTBC= 1
##$INTSCL= 1
##$ISEN= 128
##$LB= 0.25
##$LEV0= 0
##$LPBIN= 0
##$MAXI= 10000
##$MC2= 0
##$MEAN= 0
##$ME_mod= 0
##$MI= 1.114404
##$NCOEF= 0
##$NC_proc= 0
##$NLEV= 6
##$NOISF1= 3.799351
##$NOISF2= 2.8
##$NSP= 1
##$NTH_PI= 0
##$NZP= 0
##$OFFSET= 14.38212
##$PC= 1
##$PHC0= -624.4532
##$PHC1= 3.992206
##$PH_mod= 1
##$PKNL= yes
##$PPARMOD= 0
##$PSCAL= 0
##$PSIGN= 0
##$REVERSE= no
##$SF= 200.129724274929
##$SI= 16384
##$SIGF1= 3
##$SIGF2= 2
##$SINO= 400
##$SIOLD= 16384
##$SREGLST= <1H.CDCl3>
##$SSB= 0
##$STSI= 0
##$STSR= 0
##$SW_p= 3205.1282051282
##$SYMM= 0
##$S_DEV= 0
##$TDeff= 0
##$TDoff= 0
##$TI= <>
##$TILT= no
##$TM1= 0
##$TM2= 0
##$TOPLEV= 0
##$USERP1= <user>
##$USERP2= <user>
##$USERP3= <user>
##$USERP4= <user>
##$USERP5= <user>
##$WDW= 1
##$XDIM= 8192
##$YMAX_p= 0
##$YMIN_p= 0
$$ End of Bruker specific parameters
$$ ---------------------------------
##NTUPLES= NMR FID
##VAR_NAME=  TIME,          FID/REAL,        FID/IMAG
##SYMBOL=    X,             R,               I
##VAR_TYPE=  INDEPENDENT,   DEPENDENT,       DEPENDENT
##VAR_FORM=  AFFN,          ASDF,            ASDF
##VAR_DIM=   8192,          8192,            8192
##UNITS=     SECONDS,       ARBITRARY UNITS, ARBITRARY UNITS
##FACTOR=    0.0002768,     1,               1
##FIRST=     0,             0,               0
##LAST=      2.2672688,     0,               0
##MIN=       0,             -757453,         0
##MAX=       2.2672688,     818500,          0
$$ Real data points
##PAGE= N=1
##DATA TABLE= (X++(R..R)), XYDATA
$$ [...]
1521a114j679N582M75m494M89K384j488j486n73j90K283K00l342J661M888k857
1537G39m369M703L148n248r90N250o14m164Q85J351j355l57l77J49K793J6l766
1554b206J872M265l864l849M924K068n599j4M560j656l212J505J142m93R94j53
1570B84j7K620n91m084J931L527m718k670N502P30n393J081L562k735k316K423
1586h64J027n52J205l44l28K553j618l993L002L296m808j426O013k07n259J516
1602g87K967k615j398K367J73j75M75j993o32K615k017l657L852L549m570n27
1618b373N506j076m565K053K586k014oJ757n00L80K75l096l99L081k046l267M183
1635D79K739m816p46M412k080l948K683K140j641L23J350j112N97L02k897Q15
$$ y = [-1114, -2793, 2789, 3264, -1230, -741, 1643, 155, -1331, -1904, -2094, 189, 389, -2953, -1292, 3596, 739, -3630, 1073, 4221, -1027, -2017, 3233, 2619, -1545, -660, 691, -664, -1021, -1398, -1249, 1544, 1560, -2206, -334, 3931, 67, -3782, 1142, 3210, -2389, -2403, 2157, 501, -2711, -1206, -64, -557, 437, 284, 267, 2887, 2296, -1788, 143, 3670, -1048, -3718, 1784, 2514, -2879, -1798, 1764, -971, -3287, -864, 163, -389, 816, 472, 144, 2697, 1079, -2914, 88, 3384, -1424, -2850, 3163, 2956, -2303, -787, 2180, -435, -1833, 534, 707, 532, 1007, -986, -1618, 997, -1020, -4677, -825, 2724, -1846, -2373, 3133, 2057, -2508, -455, 2131, 117, 111, 1868, 1368, 1748, 2023, -1073, -1472, 1609, -437, -3704, 479, 3218, -1598, -2344, 2068, -12, -3960, -1277, 863, -778, -455, 895, -217, 380, 682, -2215, -1400]
1651a400L904j902k293M637J524n352l87L875k259k944K919J647j888J67K20j476
1667a008N53o42k734K224L595k753j888M644N53n517N16M379j763j871L124J221
1683B633j433j54n06q74R36n72j780K697K811l728k063L914p91n001J253M021
1699A363j502j708K572P37j588q15o38jJ610P0j223L071J647l578j617L408q97
1716I11l718K113L483j800j566J776j62k021p05j14P12J941m03j151K254O82m069
1733a837q52L446p41k473K796K779k290j492J241m78j547Q7O63J475J490r94j243
1750C0J509j16l788r4L458m34k109K563J498k731j810J026M0o86P38Q89J101R38
1768B022j566j604J661l6k552Q38L784l29k191J474Q41k719j663R81N95K83M06
$$ y = [-1400, 2504, 602, -1691, 2946, 4470, -882, -1269, 2606, 347, -2597, 322, 1969, 81, 248, 468, -1008, -455, -1097, -3831, -1607, 1988, -765, -2653, 1991, 2544, -2973, -2457, 1922, 159, -1712, 1412, 2633, 1200, 1046, 540, -334, 602, 30, -1750, 947, 3758, 30, -2033, 1881, 1090, -3911, -2658, 1363, -139, -1847, 725, 1462, -126, -941, -1579, -1580, 30, 100, -1123, 1948, 3595, 17, -1600, 1808, 911, -2807, -694, 2789, 989, -577, 1199, 1037, -984, -1689, -1803, -1091, 850, 447, -704, 1550, 2232, -1837, -2689, 757, 16, -2457, 339, 3118, 828, -664, 577, 99, -1448, -1361, -698, 777, 2267, 1273, 30, 1539, 1423, -2365, -2459, 999, 565, -1544, 1019, 2517, -214, -2024, -998, -958, -1644, -906, -17, 1084, 2022, 456, -1148, 513, 477, -2075, -1237, 2547, 2218, 27, 1501, 2342, -377, -2040, -1059, -464, -181, 225]
1785B25K63N87J6k261j237J643K86j781J392L415q16k382J044O65j971p77J622
1802f7J351M29k88q6j1n84k420q68K152N35j811J290K318j823k507P72J195j048
1820a471j6K054J727p3q52n88J71n38j980K88K665K21j792Q56J231k316k412J041
1838a784J379o76j53J654J084j083j768l96P91k57q27J666K810j39j664Q22J095
1855B554k039j469J750J464p31p90P10j53k096k272O6J305j95l85J796J906r56
1872D65j809O31J065j277n67K248J924q63j099O76J75j716j339J251J710o2m20
1889I93P89N61k153k134O0P62j017m90J587J148j068j151O40P72n55J64K244K075
1907C227l76n34L54l49j691j701N90J052n74n38P93N73j564j638O27Q46o83L06
$$ y = [225, 488, 1075, 1091, -1170, -2407, -764, -478, -2259, -867, 2548, 1732, -650, 394, 1059, -912, -1689, -67, 1284, 1713, 1425, 1339, 1328, 744, -1676, -2544, -392, 143, -1668, -378, 1940, 117, -2390, -1618, -423, -1471, -1487, 567, 2294, 2221, 1369, 781, 952, 414, -1566, -1278, 1387, 1608, -184, 672, 1903, -413, -2825, -1784, -405, -1081, -1234, 420, 1504, 421, -1347, -1743, -952, -1209, -2036, -370, 2440, 2301, 637, 1459, 2554, 515, -954, 796, 2260, 1529, 739, 1449, 1296, -800, -3072, -3006, -1701, -1896, -2281, -485, 1421, 465, -1344, -713, 352, -925, -1492, 756, 2680, 1817, 718, 1394, 1569, -147, -1486, -235, 1475, 1413, 993, 1782, 2343, 190, -1944, -1884, -1122, -2139, -2629, -1042, 106, -962, -2113, -1473, -701, -1256, -1092, 1152, 3227, 2851, 2317, 2671, 2322, 631, -1070, -480, 572, -2, -540, 253, 826, -738, -2376, -1749, -903, -1586, -1280]
1925a280J734Q26j084r39J19o7q01l10J545J942J98n79O92P25j800j175J218P86
1943A750j256k80O85k71k140j362J43K39l3J32J686K014l04j212R38Q62j428q26
1961f63J960J065j170n47Q55m75j655o57N44Q22J94k62Q71Q82j563k111P40P03
1979d67j583n67K398P73j239R6O65j34l87K94J198J372J63q62L59L71k089k026
1997a665R96N92j630Q0J908k04j465k8O35k75L9N25Q84J121m88j048L86N91j869
2016i15o71K110Q71j348N25J573q37j558J76J72l31J08k38L00N95j233j579R03
2034a377R77j738J99K737M93j171P09J089r76q39L51J98J40Q7o56J14O85j535
2052e13j552J299R66j480J27K244n19j409O41M20r72k13M27K75Q40J99q10K36
$$ y = [-1280, 454, 1280, 196, -743, -624, -691, -1492, -1802, -257, 1685, 1883, 1304, 1996, 2721, 921, -254, 964, 1750, 494, 214, 899, 628, -1512, -2874, -2731, -2492, -2525, -2393, -707, 1307, 1003, -209, 729, 1591, 163, -663, 1297, 2362, 1192, 645, 1500, 1025, -630, -1287, -743, 79, 273, 11, 882, 1764, 201, -1910, -1170, -467, -2050, -2617, -219, 554, -685, -589, 76, -58, -445, -151, 1047, 2419, 2582, 1720, 2079, 2450, 361, -1665, -669, -77, -1707, -1627, 281, 77, -1388, -1416, -781, -1056, -1017, -492, 392, 1513, 1025, -23, 363, 954, -915, -1586, 524, 1395, 47, 572, 2145, 1308, -250, -74, 98, -233, -125, -363, -63, 532, -701, -2280, -1377, -400, -2138, -1939, 798, 1291, 120, 829, 1918, 942, 103, 454, 652, 792, 879, 223, 337, 1022, -513, -2065, -766, 200, -1280, -1153, 1091, 572, -837, -196, 224, -748, -961, -534, -259, 581, 780, -30, 206]
2070B06J090j380r98J977N20j616N41J468j282j260N03q4p34J77K86M2P42j67
2088C1j181P45R94j430l32K225K16j660Q30J048j230p49P48J3l38L81m4j38P22
2107H51q10j224J202O49j706M7J994m95j697R70R18j326l19Q07J68J25J98m03
2125e1K07Q04r58q44J511L12j593L52J720j069j263Q69N96j163q7O07l11K28J02
2144c1n79L23Q44j036m66J570J08j600P19J502j227r24J140J91r29J32N09k23
2162B3K63j27o05P81M93j304k2J338m51j468R03J089j303p19J402J16r05J50L67
2181B1J28J80j99m49Q94J34j385Q3J384p19j322J118R58j284l24J121j28n89K51
2200a27K82P7K77l34l12O51m6j225J57J213p89p45J270N60j260j10P36j74n40
$$ y = [206, 1296, -84, -1082, 895, 1415, -201, 340, 1808, 526, -734, -231, -315, -1049, -872, -586, -544, 198, 31, -1150, -405, 589, -841, -1173, 1052, 1268, -392, 438, 1486, 256, -493, 255, 268, -70, 311, 267, 129, 851, 41, -1183, 19, 668, -1038, -991, 1003, 508, -1189, -219, 699, -627, -946, -139, 29, 154, 352, -51, 156, 960, 2, -842, 669, 981, -612, -260, 1460, 391, -872, -3, 593, -570, -657, -50, -361, -133, -31, -610, -287, 557, -479, -945, 625, 733, -867, -148, 1354, 127, -797, 343, 534, -395, -263, 246, 23, 286, 159, -446, 335, 828, -476, -498, 840, 389, -1079, -176, 913, -390, -1109, 293, 409, -496, -346, 21, 149, 329, 130, -319, 575, 709, -676, -593, 791, 72, -1250, -132, 826, -458, -782, 339, 211, -378, -127, 155, 232, 509, 175, -137, 514, 468, -757, -600, 613, -176, -921, 349, 909, -351, -461, 275, 101, -439]
2219d39K21J39K30K47o51k36O14m9j113O77J118o78n89J163M24j139l02P90k11
2238B16l15K71J83Q8k1p14k70N74k94o24M67J036o87n75J001J32j165r4P48J28
2258H5m1K39L61m5r1p52l4P17k66p33R07Q23r55o95O30n0r68mQ03J65k94L2K92
2281A26j82l35m93K54Q52pl88J017N95j046p00P94Qr05K50P47L2n23m44Q7j85
2302d46n45m08P63P73o2m32P69M45j181l28R51K73n80M27O25o2p10l57J33r2l33
2323c77j04P84M97n30o79L99j37j090j70R51K69m67M92P81k70o18L5L04M69O9
2343F08J66O60K75r64p09J99l61q18j77J116p1l74p8K82k88n92J19P39M90k9L5
2364B28N55n0r95k31O17Q8k89M46Q86J26o31l31rl43o72oN19K71n81l06J63k57
$$ y = [-439, -218, -79, 151, 398, -253, -489, 125, 76, -1037, -360, 758, 80, -509, 654, 1078, -61, -363, 427, 216, -99, 172, 355, 443, 422, -292, -562, 12, -282, -906, -439, 597, -90, -665, 336, 468, -697, -791, -43, 85, 44, 283, 644, 599, 508, -244, -278, 439, 173, -560, 347, 1170, 215, -480, 150, 100, -868, -872, -69, 96, -198, -166, 126, -56, -391, -884, -630, 222, 215, -173, 844, 1439, 393, -307, 487, 495, -410, -160, 587, 619, 96, -348, -261, -446, -991, -1399, -636, 137, 75, -357, 412, 857, -324, -652, 299, 572, -8, 419, 1044, 982, 272, -85, 48, -44, -377, -481, 303, 800, 270, -409, -10, -147, -1237, -1407, -456, -187, -654, -162, 619, 349, -269, -234, 70, 539, 608, 774, 1434, 1709, 745, 36, 235, -126, -944, -1121, -5, -76, -450, -528, -246, -534, -1126, -1007, -268, 222, 193, 228, 783, 733, -262, -493, 124, 212, -77, 369, 1255, 1381, 750, 419, 410, 67, -605, -611, -92, 179, -402, -708, -545, -802]
2386h02q28p9R79O66J53L80P54J79p50j79K29K15o12J77P41j43r99m10J68n90
2406g51o27K19P54M38k36m6K13j59r95j36Q84M13k04M51Q34o3o60o1L59j36O5
2427E56K25N24o9p42n69j23n50q94r0R30J84l34M82N60l73o10L26O13K78K37M15
2448I76L38K04r46o09L48n3p31L44J029q2q51L9J34q82n90L87L11J72l2J43J80
2469a71q2p30q5R26K86j07Q00R80l51q11J06p4n50k30J63L22J02n08m17n6k64
2490g51q06J89Q68L03m35P30O35p11n81L70K63k65L41N62K55Pl12l23M6j71m69
2511b55J15Q49j93o84K06J2j032n68M55L25l1M98K82K78qm47o4N10K09l21M07
2532E43Q91l61q71L41k32p55k24O01J59j58N6j88n2o0p43r6Q79J48l37O16P14
$$ y = [-802, -1630, -1709, -730, -64, 89, 469, 1223, 1402, 652, 473, 702, 917, 305, 482, 1223, 1080, 81, -329, -161, -751, -1378, -1159, -405, 33, -203, -249, -36, -195, -1190, -1326, -442, -29, -233, 218, 1052, 989, 329, 268, 627, 491, 556, 781, 1305, 1236, 494, -75, -198, -748, -1642, -1732, -802, -618, -952, -470, 90, -283, -893, -567, 46, 324, 561, 976, 1314, 1518, 572, -37, 311, 258, -473, -129, 900, 818, -33, 6, 140, -742, -1332, -945, -634, -462, -494, -351, -171, -253, -983, -1068, -142, 144, 37, 837, 1817, 1466, 655, 761, 687, 137, -93, 70, 392, 494, -14, -431, -487, -751, -1557, -1368, -500, -197, -632, 98, 733, 22, -559, -189, 74, -191, 150, 712, 967, 974, 662, 339, 385, 214, -255, -140, 709, 516, -168, 38, 50, -982, -1550, -1095, -770, -801, -303, -21, 257, 249, -198, -262, 248, 457, 136, 543, 1434, 1073, 202, 543, 311, -444, -668, -67, 92, -66, -10, -198, -250, -310, -1053, -1149, -270, -122, -459, 157, 871]
2553H71p51o35N78K53m50J75O19K77j35j35l71j84j97n71N2O68N7o81M07L47p15
2574e21n76N43K94k29M22M83R7n2j90l20J50L6l67L93P56l87o16L80O4q67l60
2595h67P25J15k73L49K82m35j39k47j42L96J67k37N96O74o59n46N15J56q84J10
2615c44R06q0k98J08m2j75l46k42O1N69q9l38N07K67o55m99O12J20m32K40O35
2636D85j74k82pM1j87l6k32K90O36j64m75L49J09n95m92P77O0l51L62L24k59j84
2658ej47m6N3pl5K65M34k71m80K56J73p50P3P44j8l96M03O6l63j32O0j40L60O3
2682A60j39J76L61m96n18L97K22n97J62N13m7m35K52J38l28q9J24lJ73J42k19
2703e1K06K00l57o25P08L00o45L49N23j66m84J09P9l51j21P4J87J83j63l52K84
$$ y = [871, 120, -515, 63, 316, -134, 41, 660, 937, 802, 667, 296, 112, -85, -656, -604, 64, 121, -560, -153, 194, -521, -1097, -554, -260, -489, -67, 416, 513, 461, 271, -49, 101, 137, -230, 163, 919, 532, -84, 296, 360, -507, -867, -142, -27, -300, 49, 331, -104, -243, -490, -632, -236, -69, -306, 290, 964, 305, -241, 274, 430, -454, -344, 562, 482, 184, 292, 250, 75, -271, -513, -452, 117, 28, -310, 197, 464, -191, -690, -78, 42, -390, -150, 485, 311, 29, 22, 63, -124, -160, -392, -102, 534, 370, -105, 244, 353, -242, -734, 43, 103, -248, 114, 438, 179, -5, -152, -198, -145, -152, -187, 78, 512, 241, -239, 17, 190, -560, -487, 257, 239, -157, 246, 312, -51, -183, -123, -263, 97, 160, 21, 197, 558, 62, -456, -59, 163, -434, -272, 241, 194, -241, 11, 149, -179, -268, -144, -147, 26, 168, -51, 155, 355, -2, -627, 81, 381, -264, 85, 608, 442, -42, 67, 146, -205, -326, -252, -65, 118, -45, -397, -113]
2724a13K81n59j90O90J55m62K73M93l37l30K11K0q8l9J23J16Nk19k81K77K04n63
2746c33q3O53K1o19J17L34k60l33L18K03j03KJ84J30P7k9l80M94K4m35r2O33k15
2769C08n76K07K44m81k80M82j3r5J00P1O3Q4k24j90N72J22n76Q7O17k99m30K40
2791C3L66m40q4K06J34j86J7r8J11n7l06p1L16J70m33j7N22j32m47M07K89j53
2813A47j15J41J83q6j91J2K7jj61j45M09j33m92J58L89j91m86L98L21l53n0J73
2835d6J48k46Ql6L20J1k51L1M48r5l77R7L99k20k91J58J06k19j65J02M9j79r3
2858c41N1K96j7k33J04K72J63l89J85L19l44k09L18P4l06q4J76P4j50j24J27P7
2880C9K1k71J02J83q3l23J49J96k55k4J83K65k21o1L19L5p6p9r5K72r1k89O1K92
$$ y = [-113, 168, -391, -581, 109, 264, -198, 75, 568, 231, -99, 112, 132, 44, 5, 128, 244, 249, 30, -251, 26, 230, -333, -416, 237, 258, -361, -244, 90, -170, -503, -185, 18, -85, -83, 101, 231, 308, 279, -101, 393, 417, -18, -110, 523, 308, -268, -61, 183, -298, -578, -96, -109, -204, -104, -33, 30, 114, -110, -300, 272, 394, -182, -95, 522, 223, -207, 33, 399, -41, -125, 81, 215, 29, 46, -52, 59, 2, -304, -375, -59, 111, -322, -339, 183, 51, -396, 11, 300, 147, 32, 173, 356, 270, 79, 91, 118, 117, -44, -189, 220, 87, -405, -247, 142, -49, -535, -137, 184, -169, -219, -46, 102, -144, -136, -172, 148, 159, -92, -61, 387, 292, -85, 12, 411, 191, -100, 58, 164, -55, -220, -118, -69, -248, -341, -290, 6, -11, -244, -140, 132, 295, -94, 91, 410, 66, -143, 175, 249, -57, -141, 35, 109, -41, -165, -38, 39, 60, -211, -109, 74, -9, -332, -183, 13, -242, -266, -83, 182, -39, -100, 219, 254, 178, 99, 4, 276, 185, -104, -43, 249]
2904B49j59l96K69K03k82j17J63J14j44K5J01R0j83j99L01n9J62l53K2K74j97
2925a16p2K79L10k75k54L52J68k47j75K42l0k19j44m0K57p3k40K37J95k39l3J85
2947F8M2j28j04K89Pk42l9J79p6j30k9J86R8k70J57P2Q0m6o6l4J72l01J4J23K9
2972E1k47j13J72K40j24p9J41J64q6j25Q6J33j75q5j0J79j46j48J48K14j47k63
2994b20K67N2j66m9K66J9k37k4RJ11j25j10K01m8j2o2J65K05l19j0L04j17j04
3017dJ46l5J1j29j5M6L3j79k1L8K46j13j84K67O3m41J61K84l8k00k6J80q9j00
3041i9R3l9J63r2j22L62Jk00j46J84J57m95lK55j00j28n8K69l5K0p4N0J06j13
3065d4j05K36K99l88j90M01k9k32q8K64j54j87M9J17o1J93k18N6J16m7j35K27
$$ y = [249, 90, -306, -37, 166, -116, -233, -70, 44, -100, -75, 26, 116, -67, -266, 35, -24, 138, -215, -193, 81, -116, -188, 91, 401, 126, -128, 224, 392, 145, -30, 212, 182, -37, -181, -221, 36, -37, -277, -40, 155, -84, -117, 68, 110, -18, -122, 167, 174, -68, -107, 72, -4, -134, -163, 23, 121, -149, 8, 80, 160, 114, 48, 14, 186, -115, -101, 22, 51, -196, -309, -137, 103, -21, -100, 41, 205, 119, -6, 80, 213, 38, -47, -57, 122, -24, -172, -24, 190, 43, -220, 47, 99, -67, -116, 150, 169, -68, -92, -83, 28, -97, -207, -6, -54, -66, -128, 37, 242, -77, -87, 217, 100, -4, 142, 107, 118, -11, -26, 20, 53, -126, -147, -109, 137, 24, -160, 107, 170, -271, -110, 174, 136, -64, -90, 90, 1, -99, -6, -45, 118, 26, -96, 266, 267, 67, -79, 105, 262, -233, -236, 19, -81, -209, -267, 2, -33, -13, -87, -37, 69, -44, -149, 87, 386, -2, -192, 209, 180, -52, -140, 124, -30, -217, -168, -51, -112, 81, -137, -81, 35, -12, -147, 80]
3087H0M0l48J43J89Jj98J17J11q0n0R5L8q2Ok17J85Q4j80j88J92Q7k39QL49j79
3112c6o8K22J13j92j9P8p1J14j77j4J03L0k44n1K95m4l15K18J43q5n1O9J09k33
3136a06L0q3N2J19k9r7L06r5j60lK72q3j55L9R5J6p4K8n3l5j51j6O3J09j03J30
3162A6P5J5p8o8J46qj34J96P9j03o3j41O3q0j5J21j40K77k34o9K83n8j90n4O6
3187i8Q3j45J57N0n4j36J14P2J36n0n8K28J9k21j50L04k18k65L3K92j01j50R5
3210f3K5k4l1N4J4J02j20R7n4R2j40j7K66k19JrK00r4j24MR9r7r3Q6k5O3l0j2
3238d9j03N0m2N4Q9l7j15J93K09j73o8nJ86j64J15p2np7m2O2o9k0l6m6J53L8j52
3265a26P6J05n5j40J53J02q8q5J36lJm2K5MQ3k44Q1K16l4k82J37J32l71j06J96
$$ y = [80, 120, -228, -85, 104, 105, -93, 24, 135, 55, 5, 100, 138, 56, 62, -155, 30, 114, -66, -254, -62, 25, -214, -206, 143, -36, -104, 118, 231, 39, 20, 98, 27, 141, -36, -50, 53, 83, -161, -212, 83, 39, -276, -58, 85, 0, -51, 18, 127, -106, -76, -159, -107, 12, -17, -114, 192, 97, -63, -66, 206, 123, -32, 7, 102, 118, 44, 72, 19, -16, -167, -183, -120, -11, -114, 16, 91, 106, 28, -40, 106, 98, -36, 160, 239, 136, 73, -68, -5, -85, -100, 21, -119, 158, -76, -145, 138, 80, -110, -164, -98, -15, -160, -3, 47, -7, -143, -29, 43, 179, 129, 71, 299, 318, 97, -53, 251, 33, -232, -199, 93, -8, -158, -63, -38, -62, -93, -39, -25, 77, -43, 54, 0, 92, -48, -65, 201, -18, -17, -26, 174, 80, -44, -40, 59, -38, -131, -45, -70, -7, -37, -49, -152, -102, -144, -90, -1, -38, -153, 40, 249, 76, 8, 3, 189, 25, 140, 68, 63, -14, -56, 6, -63, -83, -119, -165, -12, 26, -126, -50, 55, 0, -140, 13, 115, 27, -58, 78, 75, 76, 34, 59, 63, 146, -98, -17, 199, 165, -117, 20, 152, -219, -325, -129]
3290a29J06p1K8R4m9J9J7p9J74o5N4j7J13q7j46l7R5j50M1P0R4j58J14op5n2p8
3317a80N2J77j20P0p8J69j28j66K29R2n6j02K30kj23q5J52p1m3%l0J65o9j89N6
3342e0j7j39P0K1O9L8L7J11l1j74N9n1J76p1j76K38L5oj35Q1K5j72M9K74j39k00
3368g8N9J8M6j75m6J17M3r1k3K6J81m0j56J50J21j06m6J21K5j08n0O7k17PM4P2
3394c9Q4%j70J43P9l4j9r0O4j3l5J43n8r9K6P7n2Pn1N5J18m4n5l3k4l7j0J01j1
3423B3k9q1q3K06j46j52J83R3M9r9J74k4j12j40K10k9rl8k8J22p5kL8J0j85K5
3449i9J51K0m0n8J77j16j37Q4n8J44j39K0J90J5j12L3p5J20j95rK33j45k4L9K8
3474D7j54K0P4L0N8j32L8J65r6rj03l2J65l8q1K44j6k02r0J43l5j38P7J81q2l8
$$ y = [-129, -23, -94, -66, 28, -21, -2, 15, -64, 110, 45, 99, 82, 195, 108, -38, -75, 20, -130, -89, -19, 75, -83, 31, 25, -50, -102, -180, -128, 49, -71, -1, -79, 90, -38, -204, 25, 117, 61, -41, 189, 187, 64, -21, 131, 60, 17, 17, -13, 152, 83, -106, -50, -67, -206, -136, -115, -46, -8, 29, 140, 109, -65, -6, -57, 119, 48, -128, 110, 145, 139, 4, 85, 110, -62, -13, 261, 122, -78, -19, -1, 45, -130, -176, -59, -16, -107, -130, -104, 77, 37, -119, 31, 152, 46, 0, 121, 146, 38, -12, 55, -162, -155, -111, -39, 45, 45, -125, 18, 97, 63, 44, -46, 18, 5, -30, 113, 55, -44, -18, 59, 7, 14, -37, 18, 136, 92, 37, 4, -20, -57, -67, 34, 23, -6, -87, -170, 36, -110, -262, -79, 14, 63, -36, 138, 114, 2, -138, 72, 43, 34, -4, -32, 90, 15, 13, 51, 61, -124, -99, 52, 72, 32, -26, 151, 35, -102, -18, -76, 68, -71, -51, 139, 154, 42, 75, 0, 120, -75, -84, 149, 4, -20, 19, 47, -107, -87, -13, 17, 75, -57, -19, 146, 50, 41, -62, -94, 71, 33, -48, 196, 180, -22, -112, 31, -4, -142, -65, 116, 34, -4]
3500dk1J18j11Rq2J10j17QP1J04Lj67L7K1J5r9Q8N2l2L4r5R1Q8k19jJ51qk1o2
3529c9Q6k5m4n9J58j23Q0J0k1n0N2j70J57P2r7j5N5L8k38J34J33k45J49Q5j6o1
3555Fj9R6j00Q5p3J4L5Mj44L7J20o2p8N7O2l8pK6j38K57j51j7K1j4PP4j6J8j0
3584E2o7K3k5j19N9J37p2M8k0N6j10Q6m7j42J44k2q6K20j91KN3j3r3J28j8R5j02
3611b4P9K0j25K4R2o1M4j24L9J5J66j84o3J44jpn4Q9J6k5k14Q3k8pm6J62P9n8
3639C1Mj19J4J01j79J29L9m9qJ68J4r4o4q2PP1l6J90p7o0j10P8M6k6LJ3J30j90
3667e6m3O5J06k12J10JJ64k9k04J98Q9k73J04q1O7MK5M8J01q3j55Qk5N3m6J19
3693E5l8mN1o2K3o7o3R8L5m3M9l9J0j42J36K6m9O5j11J73o3j9o9K1Jl5j2J8O5
$$ y = [-4, -25, 93, -18, -9, -91, 19, -98, -90, -19, 85, 88, -79, -42, -21, -6, -105, -17, 35, 3, 37, -58, 33, 121, -98, -99, 52, 44, 23, -39, 47, 22, -22, -81, 77, -46, 34, 44, 23, -27, 25, -145, 12, 84, -13, -28, 27, 65, -173, -39, 94, -151, -2, 83, 67, 6, -13, 83, -17, 68, -5, 9, 44, 48, -96, -59, 61, -1, -79, -22, 40, 2, -5, 21, -117, 140, -11, -28, -7, -21, -14, 60, 44, 62, 52, -15, 8, -17, -136, -77, 60, -12, 36, 16, 72, -38, 48, 1, -141, 3, -19, -105, 115, -76, -74, -21, -34, -127, 1, -17, 78, -24, 55, 75, -50, -26, 66, 5, 49, -75, -36, -21, 145, -39, -102, 42, 41, 34, -20, 69, 85, 60, -154, -71, -99, -106, -152, 10, 89, 31, 35, -84, -70, 31, -148, -19, 20, -29, -37, 131, 145, 51, -13, -95, -88, -17, -53, 137, 60, 0, -110, -32, 14, -12, -9, 4, 134, -56, -99, -34, 72, -140, -30, -29, 135, 106, -98, 100, 189, -84, 20, -61, 6, 10, 35, 83, 184, 101, -54, -46, -71, -18, -64, 55, 17, 13, 64, 2, 25, -42, -105, -7, 28, -15, 34, -5, 5, -137, -1, 25, -24, 41, -70, 103, 40, 21, -48, -27, -26, -61, -73, -55, 10]
3722A0p9N5Q0n2j07Q3NK1j21J42N8K2j23j69K53l2m2O2m1o8nJJ03o3j81N9J19
3749a0N1L6j28J22l9j44QJ07m8Q1j11P3P1j18l6J67j08Q0qp0J40j72J2J38j92
3774i8LJ13l7P4j85K22J5k1j56O9j4J67j18M3J7n9k6K1k9o4k8m1J86q3q0O6K37
3801A94j56j29J40Q4r5OJ4k9k7j53J37q1Q1j3l1K1K2L1Q1K7k5j66J30Pj00L0k6
3828b6R3j72J63j82J37J12j90O1J41r7j41J53lj5o7O5M7j43j07K52j56L7o8O8
3852c8O1M7j02J64j89R8j20j5J80j58j1KJ98l05J17N9N7N0j19J64r2j7o2M6O8
3877H3j24j10J14J04K8r7l1J34r3n9Q6j0j47M0J00n6M7n1l2%M5k3P4M1j13p8K61
3904A33n3j43N1J65j31Pq8K5P0K1k28J46L0Pj02J57J9j59M6PJ44j11R7k16J40
$$ y = [10, -69, -14, 66, 14, -93, -10, -5, 16, -105, 37, 95, 117, -6, -175, 78, 46, 4, 66, 25, -43, -48, -47, 56, -7, -188, -129, -10, 41, 77, -51, 71, 32, -112, -104, 3, -45, 36, -75, -2, 69, -49, -85, 82, -26, 54, 46, -24, 116, -56, -44, 94, -98, -95, 18, -19, 55, -130, 92, 107, 86, -70, -1, -15, 152, 34, 77, 94, 35, 9, 30, 1, -63, -91, -132, 54, -29, -109, -43, 194, 38, -91, 49, 133, 38, 44, 58, 29, 2, -151, -14, -95, -14, -27, -58, -37, -15, 16, 97, 124, 99, -67, 63, 70, -30, 0, -26, 67, -105, 58, -124, 13, 125, -65, -4, 137, 40, -101, 52, 49, 34, -33, 32, 79, -64, -171, 81, -75, -38, -106, -38, 23, 70, -32, 132, -57, 41, -79, -94, 86, -72, -83, -81, 117, -188, -71, -12, 45, 95, -24, 140, 48, 31, -31, 15, 83, -41, -151, -37, 67, 95, -2, -33, 101, 8, -51, 35, 25, -122, -82, 18, -38, 9, -42, -74, -74, -29, -52, 22, 63, -50, -128, 133, 80, -63, -12, 153, 22, 29, -59, -34, 36, 57, -171, -25, 5, 12, -90, 67, 86, -73, -27, -20, 124, 13, 110, -106, 34]
3929C4n0J5M1Kj05O9no3O9n8J58m1j11j2L6J34j21o6M5R8n5k0Okk3m1O3L5o0j05
3959a33K27j9j51M0J96k47K1l8J97k3l1o6J4K8Jl3l2P6k6rL5J09j29q3J40j42
3985g8K5r5N3K58q6m3o1J52r3j40P8m8P5J8N5j1rq8j3o6O7J3rQ6m1p4L6N0Nj07
4015i1K50j07j54J64j59J40j76LP5O8k0o1K8R4r8j0J45p7o3R1o8J29j33MQ4k8
4041C0j19L6J24L6j46O2M1O5j40KJ4K1k4N9o7q8R1j04J37j6o7M7o6Q5L2o8N6p5
4069d2j20J27J2P0m9J33j14J2j9pK1qj6O1O6l5o4l7n3O5j40J48K4p9P7n5P9j03
4097d6K8r8Q0J42k25j2R4o4q3J08K9M6K9J6q7J01j23N7L3jP8j89J86r9Q4m5j1
4124B8q5p2M0J42k7j8m4R5No9L1p2l0p5K28j25P8L2r0M7p8k0Q7Q4j18M6J8P7q2
$$ y = [34, -16, -1, 40, 42, -63, 6, 1, -62, 7, -51, 107, 66, -45, -57, -21, 113, -8, -74, -29, 69, 14, -6, 0, -2, -25, -66, -3, 32, -28, -133, 94, 75, -76, -36, 160, -87, -66, -104, 93, 70, 39, -27, -13, 15, 16, -17, -49, 27, 1, -8, 27, 136, 7, -76, 64, -78, -53, -148, -95, 163, 77, 34, -27, 125, 32, -108, -30, -78, -3, 15, 70, 59, 50, -38, -51, -117, -50, -37, -46, 40, -1, -75, -39, 11, 16, -91, 159, 52, -102, 62, -97, 43, -133, -130, -55, 13, -7, -68, -40, 54, -44, -54, 91, 14, -49, 42, -26, 103, -30, -26, 58, 30, -89, -53, 71, 107, -39, 23, 64, 129, -11, -9, 5, 26, 2, 61, -6, -94, -3, -107, 30, 14, -53, -6, -72, 13, 45, -23, 33, -42, -162, -35, -23, 47, -2, 131, 17, 29, 10, 3, 24, 16, 0, 61, 127, 92, 28, -9, -62, 3, -137, 11, 35, -44, 33, -22, 57, -46, -18, -116, -36, 106, -119, -131, -37, -101, -184, -76, -47, -1, 28, 44, -43, 58, -65, -8, 25, 24, 102, -87, 99, 0, 84, 39, 28, -57, -129, -89, 53, 26, 8, -36, 59, 64, -5, 26, -46, -76, -151, 77, -48, 30, 62, -28, 19, -59, -79, 8, 92, -26, 20, 38, 115, 33]
4153C3r2J9m1P3L7L6j6M2k26J13L0J2j65K18L1j02RL6M7j18n4k0P6K8J5M6Q8k00
4181d5p1J01r7J49J09j52K8K5K1q1L5m0R1j8l0Q6k04M6J10n4l1P8O0o2q0J3L1
4208A8jj16K2J42j61J31j5n6J51j26n1N9nK3P2p1m9N0rN3k2q7R5j20n6J18M4K6
4236E9j24k0J98o1j09LJ39m6m6m2k9nM9N5O9L3l6q1L0L8l2k1j8L2q3Mk1R8q1l1
4266g9N6r6J57m5O3J2J5q8J48j13k11J40qJ18o0J0N8j11m4L4P5p5KJ82j58L9p7
4293e6j1M2M4j35M7j19K30o4J02K9q9Q0r8J1%J6O5j38K1j13J15L4j3q5p1J87p7
4320d6mK0M4m5L6mqoO0nN4j59%l0J23q4J66n0jKl9r1J03j59L8O5M7j6k2%Kj51
4352a60J76j02J59J22j58%L7q2K5m6R6r4Q6K1k2j25k0P6j15R2J49j44P3K7j38
$$ y = [33, -59, -40, -81, -8, 29, 65, 49, 91, -135, -22, 8, 20, -145, 73, 104, 2, 11, 47, 94, -24, -78, -98, -22, 6, 21, 67, 155, -45, -116, -15, -112, 37, 146, -6, 22, 47, 68, -13, 22, -18, 73, 55, 25, 111, -93, -47, 63, 9, -22, 56, 116, 54, -26, -13, 18, 17, -99, -77, 65, -96, 35, 20, -36, 115, -11, -62, -3, -8, 15, 87, 16, -33, 17, 8, 61, 39, -48, 47, -73, -129, -11, 33, 59, -65, -85, 113, 52, -57, -54, 85, 39, -7, -49, -78, -83, -34, 21, 90, 123, 87, 6, 36, 74, 42, 21, 3, 35, -48, -44, -65, 33, -48, -79, -23, -119, 38, -7, 56, 68, 83, -5, 143, 30, -181, -41, -49, 69, 9, 19, 77, -34, -78, -44, 31, -44, -42, 140, -18, 21, -56, -67, -25, 19, -116, -69, -188, 42, -22, 80, 109, 20, 100, 2, 13, 13, 29, 94, -44, -23, -136, -21, 13, 0, -85, -156, 31, -46, -50, -30, 14, -31, 5, 1, -7, -13, 47, 42, 96, -63, -63, -93, 30, -54, 112, 62, 61, 63, 24, -67, 36, -123, -85, -20, 27, 11, -11, -11, -9, -160, 16, -86, 73, 195, 37, 37, 74, -8, 17, -29, 67, -27, 59, 80, 58, -67, -87, -11, -126, -34, 115, -29, 44, 71, -67]
4377f7O1P4p5j7j9R5MJ1k3J10k37P2N7r3L2J9K5M6q9L2p0p8J03p7N2J38n6K9P
4406F6r0J31o6o9P2N9k25P9P5l2r6K3P2M7r5q2J54jq0l6J72j22p2J45j09M8J9
4433a3p6rP0l7J33mj94K11j73J31M5r4Q2r6m0Q7m5K4J5o8R3j2L5j44J4O2J82k14
4461c5NJ2J74k56R0R9n1J7q2J78k17pL8J46k03M1J67q0j3R4j41J20j05rRm0K1
4488b8Q3mn3m8l7J16r3N3R3p2K7K6p7NJ4L2m2L5j80J31M4n5J13j50N1L5R5p3%
4517D1k0K4L1j03k2P9n2P8RO1j27R0l0q5P8k1l0%n0J9L8N2j62J30l3JJ13k22P4
4546c9M9m3J4qP1l4l3l4J83j96Q2n0M2r7P4K2l3M2K8K8j51M8J18n2r5k9K9J56
4574I2q1q9L5M4q8m5J57N0l0J7Q0j08l6P1k7P0m2k6L0j9pJ6r3J00M9n1j66P7N6
$$ y = [-67, -6, 68, -7, -24, -43, 52, 56, 67, 44, 154, -83, -11, 46, -47, -15, 4, 29, 75, -14, 18, -52, -130, -27, -104, -52, 86, 30, 59, 66, -24, 107, 41, -28, 44, 103, -122, -43, 32, 0, -96, -73, -1, 46, -49, -131, 23, 22, -58, -94, 78, -44, -116, 29, -80, -32, -13, -89, -98, -28, -65, 68, 64, -130, 81, -92, 39, 84, -10, 72, -24, -64, 23, -22, 2, 17, -51, 42, 30, 65, -79, -65, -3, 179, -35, -30, -18, 156, -100, -10, 89, 38, 55, -27, 151, -66, -73, -35, 111, -92, -51, 116, 36, 23, 117, -24, 96, -9, -18, -9, -49, -28, 55, 51, -2, -50, -87, 29, -64, -11, 82, 10, 37, 63, -14, -9, 5, 37, -5, 30, -150, -19, 25, -30, 83, -67, -16, 19, 114, 41, 41, 21, 45, 76, -27, -49, 30, -22, 56, 65, 126, -1, 89, 59, -26, 52, 31, 1, 1, -49, -30, 8, 60, -102, 28, -5, -4, 109, -113, -39, 10, -33, -19, -27, 44, 10, -23, -57, 126, -70, 12, -38, 4, -93, -19, 3, -30, 12, 40, 68, -83, -35, 83, 31, -64, -93, -64, 92, 11, -78, -43, 1, -87, -132, 25, 75, 45, 62, 142, 34, -2, 69, 42, 112, 70, 44, 74, 55, 48, 64, -29, 71, 120, 69, -97, -20, 36]
4603C6m3m4P2Rl9k5j7k4J14k5R5l1p0K5k2kK4Lm4l2O9l5o5M8%J05k18J77j41J30
4633C0oJ7n3P8j7j22O6O2j10k9J06Q7K9j84P3N4q7l5K1j4J25j15nK1m5q9J03N6
4661A7L7n4l1J01l3j06J76p6j15P4o7J48n1K8o0N9oo2k4p3R9p3J30Oj40J05j9
4688a0q4L7m7K9K8M7L1j14R5K9q6J46Qj09k2M9J28j36o2J4J6p9pJ23K6m1%p0J92
4717A31j91N4m3K14r4n2m%P4j39J05j24J39l8j32J30j65J18K5q4Q3m2L8j1j3n3
4743g4J44m8o9r9K1K74j08r8N4k4J26j25J04r9rO6o9J5r5j6P1J12q9N8m7Q2k2
4770C6p7M9N4j5k7j24J82l8l9pMrq7R8L9p2l3J21j07pP7J8j51M2rJ67Q6o6n0r
4800D6O6j29j6Q4m8J2Oj25J35j82M8J29o9j02N7K2R9j36M8J18r0l4J18m1n0K8
$$ y = [36, -7, -51, 21, 30, -9, -34, -51, -75, 39, 14, 109, 78, 8, 33, 11, 9, 33, 36, -8, -40, 29, -6, -71, -23, -23, 82, -136, 41, -100, 30, 24, 41, -12, 66, 49, -73, -7, 55, -55, -84, 22, 109, 138, -46, 27, 81, -6, -41, -20, -34, 91, -24, -29, -8, -53, -142, -39, 17, 54, 0, -31, 70, 37, -69, 107, 31, -84, -10, -77, 71, 20, 48, -12, 47, 41, -21, -45, -118, -19, -92, 38, 44, -96, 9, -10, -94, -57, -104, -75, -47, 0, 31, -83, 12, 41, -45, 101, 109, 0, -22, 27, 155, 19, -43, -29, -13, -92, -99, 24, 50, 9, 9, -61, 131, -60, -6, -49, 165, 71, 19, 15, 15, 89, -50, 55, -69, 70, 32, -100, 30, -135, -17, 8, -76, 7, -35, 3, -8, -21, -74, 70, 22, -47, -146, -125, 149, 41, -57, -3, -27, 99, -26, 78, -21, -30, 36, -33, -18, -113, -129, -58, 54, -35, 23, -24, 58, 36, -41, 8, 62, 47, 20, -104, 78, 40, 1, -6, -2, -11, -98, 0, 39, -33, -66, 55, -52, -59, 18, 36, -115, -73, -82, 85, 171, 105, 55, 46, 112, -17, -33, 51, 3, 15, 21, -104, 31, -151, -103, 26, -43, -145, -88, -66, 33, -103, -55, 63, -27, -61, 57, 16, -34, -6]
4826fo4Q1O2j74K6J79j26j3L4M1j4n9n0k0L4N8K6p2J29j12L4k2J54p7q0K10o7
4853A12oj61J8J06j80O7P5l0j01J39k5m3%j59J93j0l5O1J8L9k48J42J56o2n9J6
4879B3L2P5j88J29L8l3Mq0P4j36kn4M0O0j12J16j33J40k7J09n3J56j39l9O0o8
4905hK3LO5p6p5J40J8r1L3k1N7n5k2k1J52r6n9j6P3M6j27m8J14l6j1rJ37j8J1
4934H3j18N8k9P0k4J5L7k17J01o3l6R6JN7LqM1r0P9m2J18Kj36K9k3ln0j7PJ08
4964D9m8P0n1N0j08l7R8oN8k24J56pl4Q1j43J70r8l9J50o4P1j25J3N2o4Rq8J01
4992hn8K8K1L9j66J4J21L8j06J29l6J32n6p4J2m3%K1p5J22J15j51L6J24j06j08
5018c5J1J07Qj00%L8j10q3J02n1M9Q7NO6j7o0m9J36r2n6P1O9L2j45N5p0O6j69
$$ y = [-6, -70, 11, 73, -101, -75, 104, -22, -35, -1, 40, 26, -33, -83, -103, -69, -11, 15, -57, 72, -40, -6, -28, 126, 49, -31, 179, 112, 106, -55, -37, 69, -111, -44, 31, 1, -100, 39, 14, -29, -29, -188, 5, -5, -40, 21, 39, 78, -170, -28, 128, 66, 7, 23, 55, 130, -58, 71, 109, 76, 80, 0, 74, -62, -64, -118, -78, -18, -130, -14, -147, -7, -34, 75, 22, 178, 39, 0, 60, -8, 15, 18, 83, 7, -68, 72, 90, -1, 32, 11, 68, 13, -9, -30, 122, 26, -33, -49, 24, 70, -57, -105, 9, -27, -38, -47, 90, 72, 83, -35, 23, -6, 64, 40, 55, 92, -125, -24, -87, -123, -27, -26, 31, 34, 26, 67, -23, 56, 14, 132, 134, -2, 27, 4, 1, -49, -66, -59, 49, 1, 71, 20, 70, -38, -75, 23, 17, 75, -149, 7, 0, -34, 47, -96, 74, -24, -63, 87, 23, 94, -31, -18, 34, -30, -21, -109, -8, -66, -38, -17, 22, -144, -130, -9, 29, -77, 52, 16, 148, 92, 18, 30, -13, -13, 8, -67, 55, 170, 19, 55, 179, 73, -35, -24, 83, 91, -9, -9, 29, -81, -164, -62, -113, -64, 23, 28, 94, 77, 17, -32, 104, 12, -44, 27, 96, 128, -17, 38, -32, 34, -135]
5046a35J48K5n9n1J46j37n9O6Q0K9J4j28n4K23j2o8m5O0J7j04P9J89r3j80OM8
5072EK8r0K9J55k14k9Q7j2Q1r4R5Q0Mj05j9K20j24j44J1K8P4j85M7K2j9k2N6J14
5100G9m2j63L3K2J70j78J88n3r2QO7J10j09N1p7M0J7q3O3l8J41k30L9J01j49J6
5126f9J0N1r9o5J34J70m6j49L5QQ2p0P6J85j04l09K90j29q0O2j23J43j35J50r1
5151g3M3k4n1J27j6o6j07R7J69j89Q0K6J18j96j6J83K8o7k6j1R7m1r0J84p1k69
5177a61j01L09%n8j74J68K3j59J63Q5p1m6J3J06M4j09p1J9R2j05J4J19P7j34j48
5202a05K05j57j2p9J66j64J61j31P8P9j97L1J79Jn0n2J25J09o5j70J46Mn9K9j04
5227c2O0j37j24J37oL3j14J67M9j63R9J41j07K8q6J21K4j33L2J69J5j06q8J50
$$ y = [-135, 13, 38, -21, -72, 74, -63, -122, -56, 24, 53, 67, -61, -115, 108, 96, 28, -17, 43, 60, -44, 35, 224, 131, -49, -43, 5, 33, -57, -28, 127, -87, -116, -29, -41, 40, -54, 41, 121, 125, 20, 1, 221, 97, -47, -36, -8, 66, -119, -72, -50, -69, -91, -35, 79, 37, -126, -93, -71, 99, -79, 109, 56, -36, -28, 39, 149, 40, 91, 14, 54, 71, -12, 51, 13, 154, -76, -37, 64, -85, -69, -59, -8, -107, -172, -38, 132, 86, -63, -28, -20, 62, -8, 68, 253, 149, -160, 130, 1, -79, -17, -140, 3, -132, 18, -73, -30, -54, -105, 22, 6, -60, -167, -70, 99, -90, -10, 16, 134, -62, -78, 105, 133, 66, 40, 29, 126, 85, -5, 179, 108, -161, -262, 47, 47, -11, -185, -17, 6, -153, 10, 95, 24, -22, -9, 97, 141, 32, -39, -20, 72, -33, -19, 100, 177, 43, -105, 100, -57, -69, -148, 18, -146, 15, -116, -38, 41, -156, -125, 54, 55, 5, -47, 78, 187, 122, -48, 98, 102, 43, 72, -32, 28, -109, -233, -96, -102, -69, -183, -16, 33, -130, -31, 110, 3, 31, -55, 66, 90, -43, -11, 158, 173, 67, -21, 129]
5251A29Pl8j19O3O7j14l6Kp7j18N3J96q2m2J33K9L5j44rJ22l6j08J37L7q7P3j25
5278e2Q9N1k65R5K4O4Lj01P9M9j30o5J68r2q9M6K44l2j14j25K34m4j8P5J48j57
5304H5p9K9OR7j1k38J22L1j23nKP1j31J11lp2n7J24O2kK5l5j1n5N1n9J66jj58
5333e8R7J68j57j23Q7j5nr4l5J66q3j69J40m9K4q5J49K18j09n7M2P2k03M2M4K45
5359B52j29j43m2J38j98M0R3j3ok9l9J50pj02j8J67j75l9Q2Q3n4j59J21k1J99
5384A51k38P9J26m4j45R2M6m7k16K22jj14M7q8K19j25n7k4J24l7p9KJ40M9j71
5409h9J96q9rK9p2J53pj01J29o1q7K1n3Qqr4J73M0L1k11P6N5j09Q0J6J8J7L9k6
5438F5J39j71j00K8J48j88Q8k9k2MnM5j06J45j28M6l1k2k1K34j43k6JJ02L9N4
$$ y = [129, 136, 98, -21, 42, 109, -5, -41, -39, -116, -234, -181, 15, -67, -109, 24, 53, 88, -56, -65, 57, 21, -87, 50, 87, 0, 73, -52, 37, 88, -177, -82, -58, 6, 9, -92, -13, 36, -94, -159, 9, -83, -172, -126, 118, 86, -28, -153, 81, 37, 19, 94, 242, 85, 6, 35, 41, 138, 127, -111, 11, 42, -81, -86, -84, -13, -144, -33, -36, -108, -165, -41, 21, 19, 44, 9, -2, -57, -6, -65, 101, 100, -58, 39, 207, 50, -73, 14, -1, -6, -100, -135, 31, -52, -221, -81, -130, -106, -191, -42, 176, 67, 10, 52, 124, -79, -37, 7, 252, 123, -20, -62, 76, -122, -82, 11, -2, -8, -37, -76, 74, 67, -35, -53, 114, -61, -100, -18, 65, 11, -148, -27, -48, 151, -87, -8, 118, 74, -71, 21, 67, 20, -196, 26, 25, -89, -42, -130, 89, -36, -93, -117, 7, -30, -109, -107, 33, 82, -89, 107, 18, 9, 38, -34, 119, 112, 11, 140, 79, -8, 13, -40, -32, -40, -134, 39, 79, 110, -101, -25, 30, -79, 1, 17, 35, 52, 91, 65, 204, 33, -67, -39, 109, -79, 9, -20, -42, -38, -43, 2, -104, 41, -87, -41, -72, -94, -115, 119, -24, -50, -49, 53, 92, 146]
5464A46k73J78K1m7M4j38L07l33J78M9L8k27K5k5K6j9RJ33q9m3n2j3J58r5r8J43
5490CJ1n3J01J51p4j04j27J72oJ0j03R7J02p8p1o9O3j16N4N8k5k8r1N3R4k8n8
5517f2J0J16q1o2K70n8j40O5M0L1k95K50P6m6j47k9O4p0l5j21J41J74k00K8l2
5542a13J03j18LQ8J11m6L0J08N8j27j71J2K36j01o0Q5n0n7QJ41k23K1L3M3J01
5567A15j20%NN9j68J6O5R2o6n0J34P2r6j7n6p5j3m3K16M2r2j56J23p8j38J05J53
5594B9n2ONQ8Oj17m3J42k2q6J74r8J87k94LJ06q1O2n4n7K11j62M6K6K4j36LP8
5622fO5k5j51J54R5j50n9J72k1M9j52K57j19j22o8J53l3k8oo7J27n5j17P1J08
5647G2j47K6J07p1Q2r1J36n7j11j0J39l4m8j3J15j20p6M7O5M4j34Q4m9J38k48
$$ y = [146, -127, 51, 72, 25, 69, -69, 238, -95, 83, 132, 170, -57, -32, -57, -31, -50, -41, 92, 3, -40, -92, -105, 53, -42, -140, 3, 14, -39, 62, 213, 139, 35, -92, 80, 74, 84, -19, 78, 180, 102, 31, -38, 25, -91, -37, 21, -4, -32, -123, -70, 24, -4, -62, -52, 64, -17, -79, 191, 133, -7, 58, 98, 129, -166, 84, 160, 114, -33, -62, 2, -68, -103, -224, -83, 91, -109, -81, -113, -10, -128, -125, -37, 74, 28, 58, 166, 224, 97, -74, -62, 174, 73, 13, 98, 48, -9, -1, 140, -83, -62, -29, 14, 115, -5, -5, 0, 59, -109, -93, -28, 64, -2, -52, 82, 154, 58, 41, -15, -90, -103, -146, 70, 112, 20, -136, -13, -91, -229, -124, 29, -23, -17, -12, 76, 82, -35, -78, 64, 42, -44, 130, 32, 219, -75, -72, 34, -47, 15, -39, -96, 115, -47, -1, 25, 49, -87, -84, -6, 59, 34, -117, 37, 132, -18, -77, 95, 74, 123, -29, 228, 109, -13, -81, 72, 39, 11, 5, -62, 65, 10, -107, -36, 72, -75, -49, 58, -13, 69, -22, 114, 57, -54, -64, 75, 41, -7, -20, 95, -25, -101, -54, 11, 55, -79, 5, -44, 94, -154]
5672a54J54RP0j70J2J95j9j66R9P2p7j38Q8J19m2j7RO4O6j78p2J52j65j33J11
5697a11M0R8k14Q9J07K4j08N6J05M2j76K0J16j05m0q5J02j6j0N8J08K1k31J31
5721B1q6LqJ5O5qj39o7L12r1j79rK95Ok76J22J46p1j01J01J4q5j09N9J24j41L7
5748e0p6J66N8j73N5J23J4o7k2J13o4j38J4J34n4j09J1J97o5j35k1J49j32m3J10
5773eN2m8j23J07P5M9j97P7J38j02q0j9J51l7j02J2J57Qj05lJ47k01j51K2J22
5798e6q0o4J38J82j63%L8J4L9j10l0K54j23k26K29J51j82o1J14L6o7m3M9N6j08
5823a3P3j04J37j19k73K46L4M8k25J71O2j17N3J15j6l4K0k9N0j41P4Kl8J60k00
5848f4j2J61j89j00R9J19q4q2N2J71p6j15J71m5p7m0K04rL8k16J45J02k49K1M4
$$ y = [-154, 0, 9, 79, -91, -79, 116, 97, -69, 30, 102, 25, -113, -25, 94, 52, 35, 44, 108, 174, -4, -76, 76, -89, -222, -111, -71, 27, -187, -98, 9, 33, -75, -19, 86, 128, -48, -28, 88, -17, -57, -142, -40, -56, -66, -8, 100, 121, -110, 21, -65, -62, -70, -55, 10, 2, -137, -204, 108, 17, -162, -171, 124, 130, -146, -24, 122, 51, -50, 51, 65, -20, -129, -70, 54, -87, -50, -126, 40, 98, -75, -20, 103, 117, 50, 28, 141, 77, -61, -47, 87, 33, -76, -65, 132, 67, -68, -89, 60, -72, -115, -5, 47, -1, -124, -17, 58, 107, -90, -13, 125, 23, -57, -76, 75, 38, -64, -52, 105, 113, 8, 5, 152, -49, -200, -178, -56, -136, -200, -62, 120, -43, -43, -5, 9, 48, -62, -92, 162, 39, -187, 42, 193, 11, -50, 64, 100, 33, -10, 39, 95, -13, 60, -44, 93, -26, -299, -53, -19, 29, -196, -25, 37, -80, -27, 88, 72, 38, 58, 29, 79, -62, 12, 14, -24, 136, -64, -76, 85, -104, -204, -105, 14, -70, -152, -100, 71, -5, -120, 51, 6, -71, -111, 93, 84, 122, -94, 51, 153, -96, -75, -31]
5873c1J36j11j39Q2N3mj12J30J55l3j87J42J13j99j30L6J42k3r0J16Q5r7q6P6
5897B4N8L6k49J07J31j30j27J15k2Nm8K0J18Mj22J10K4l7m4R4Mq4J4m1J33q0m0
5924b7M9nl2q9J04M9l8l0O6P9k72P8O6N9l1j38J76k8r2p5N5J61n9K5Q1J1k07n9
5952a23J75j15J9j50J06P1j7k2P5P0j69K4K36n4l9k4qj4m4j51P9j46J08KK07o9
5978B7j8p1J20r4Nl2J83o4j23J50o5J02j27p9j6P7K6l2J19M0r2j60R7N6j62J50
6004A7J03j70j3PK5N7j25R0Q2M4j36j09K38K7k01l1Q9J19j28j02P9J91k16j82
6028b45K01R7J3j37J94J19k34r1M3JL3J9m9R9j08j09J99L6j44o9J98p0N0q7M9
6053Hn1j21Q7P7M4q9j06J16J05m1Jj50O2m0J1J45Rj84J66lQ0j61Om3J51q7j58
$$ y = [-31, 105, -6, -145, -63, -10, -14, -126, 4, 159, 126, -61, 81, 194, -5, -135, -99, 43, 20, -70, 46, 131, 34, -52, 24, 82, 118, -131, -24, 107, -23, -150, -35, -57, -52, -100, -80, 38, 42, -80, 30, 54, 17, -27, 67, 71, -13, 1, -40, 93, 13, -27, 22, 17, -15, -104, 0, 49, 11, -19, 47, 126, -146, -68, -2, 57, 26, -112, 64, 36, -56, -131, -76, 85, 26, 51, 132, 143, -64, -123, 52, -63, -44, -194, -88, -17, -34, -56, 19, 89, -80, -56, 180, 126, 87, 63, 55, 41, -3, -154, -75, -221, -113, -111, 96, 27, 9, -62, 58, -36, -31, -63, 120, 56, -67, 83, 18, 120, -7, -86, -102, -25, 1, -31, 88, 128, 36, -124, -27, 29, -133, 17, 120, -50, -63, -56, -31, 26, -99, -9, 73, 117, -19, -128, 110, 137, -64, -95, -6, 113, -15, -117, -38, 153, -63, -245, -44, 53, 66, -71, 123, 242, 8, -83, -40, -39, -6, 13, -36, 63, -45, -154, 45, 81, -63, -132, 66, -4, 46, -41, 8, -43, -164, -77, 0, 44, -45, -151, -35, 70, 29, 30, -120, -58, -98, -87, 58, 67, -117, 49, 46, 126, -35, -29, -72, 79, -8, -166]
6080a66K93j66K6j27j7K57j80q2J36N5l5L1J37k28kP8P4l4q7K8Q3lj14J8R7k1
6106E1j08P3L4k1j26j30J91K4j12RK01O6r6j23JJ45j12l8P9J16rj94J31N5j27
6131b0j27O9J73q1l1J08q0j09k5O4N4N7j62J67J39j23o6J6k6J0o5J97qj54L2J16
6157A25J9r6p5Rp6K2N1O9r3q9J24J43j90j14K1L65j43j00J32K9j00k8l4n0N4k5
6183e0R5K6%k04R6N9k4l2J6Q7l5k6Or7J13j32p4K68%n0o4K45j43l5o7J4J13j21
6211a6l8N9l8n0o8R5k4o9J29L3l7l4K3R4n5m0Q9j5o5O5k6J05j67o3J99j19j6J30
6239H1p8R6q3j31O0J57j47j21Q0J77l2o4o4L5K6o1L6J54m5j92J79J07r0j34l7
6264i1K05k00J40j43Q5J33k11N0M7mj9pM3k7j36R9%k0N4K5J48j28n1L5oJ1r6j5
$$ y = [-166, 127, -39, -13, -140, -157, 100, -80, -162, -26, 29, -6, 25, 162, -66, -68, 10, 84, 50, -37, -9, 74, 71, -43, -25, 72, 51, -57, 16, 50, 29, -97, -227, -36, -12, -124, -115, 86, 152, 56, -67, -66, 79, -33, -71, 8, 124, 115, -79, 52, 107, -20, -147, -78, 95, 14, -17, 91, 11, -98, -123, -59, -5, 52, -110, 57, 196, 73, 7, 23, -3, 7, -58, 139, 131, -23, 9, 125, 144, 48, -27, -18, -94, -72, -21, 48, -45, -134, -10, 133, -57, -171, -150, 215, 72, -28, 104, 133, 33, 5, -29, -79, -25, -50, 45, 71, 71, -133, -37, 22, -2, -34, -18, 69, 34, 8, 14, -83, 30, -102, -176, 92, 92, 42, -22, 223, 80, 45, -22, -8, 105, -16, -54, 5, -33, -83, -151, -56, -80, -149, -20, 13, -24, -58, -35, 59, 4, -36, 53, 38, -27, 38, 12, 117, -50, -113, 86, -33, -49, 81, 3, 99, 16, -115, -55, 102, -45, -166, -86, 91, 59, -5, -69, -34, -8, -69, -33, 121, 76, -116, 63, 170, 80, -54, -91, 114, -86, 54, -89, -4, 129, -82, -32, 15, 11, -8, -15, 28, 1, -135, -36, -36, -56, -2, 23, 171, 43, -8, 27, 21, 32, -64, -79]
6292g9K14n3k03J96K4Qk49L3J57n3m7o3J27J10j94j9J29k6K3O5Kk0j30J26J0j17
6318b9M9k9NK1j57J13L9K7p6K6N9p2j68K07J2l3r5J22J08j51l6P3P1j20j03N1
6344h6K06r5J0K6K0o7o6J22L7q8j56K72R3j51j23m3J61r5j83J80J22j27j4J43
6368I8n9l2q4J39K2k11O5K0J2J31j36J01L6o9j23J72l4k1j84K91j69j62J73q8
6392a12K15k09K2m3K78o6q2k4J13k6j42N0J48j9k13J06O5p9r5J22J27j12o8J37
6416I3R0q5j51J82q7m2j22J04J30j50j03J05P8j27l7J05J57j31j46K12m1j70N1
6439h5Q4R2j47l3O4K4j66rJ83J12j37n0J49J2j84q1J59J40k34n6J18J88j10j24
6463i1K12r0o0j7J76K2j83P2k9J29j98R4l5R1j87J16j5J01k47J26J13M5j38J8
$$ y = [-79, 135, 82, -121, 75, 99, 107, -142, -109, 48, -5, -52, -115, 12, 122, -72, -91, 38, 12, 35, 100, 102, 82, -48, 78, 88, -29, 20, -9, -4, 17, -140, -27, 12, 39, -37, -11, 48, -24, -192, 15, 27, -6, -101, 21, 129, -22, -58, 15, 86, -34, -137, -86, 120, 25, 35, 61, 81, 14, -52, 70, 107, 19, -137, 135, 228, 77, -46, -89, 72, -23, -206, -26, 96, -31, -45, 98, 39, 7, -77, 62, 84, -127, -62, -42, -30, 101, -35, 66, 102, 33, -90, 82, 48, 27, -157, 134, -35, -197, -24, -112, 103, -106, -84, -127, 151, 85, 3, -21, 92, 66, -76, -26, 122, 103, -110, -4, 61, -18, -113, 9, 136, 24, -44, 93, 183, 98, -53, 129, 42, 0, -122, -18, 112, -38, -141, -36, 42, -85, -122, -17, 140, 9, -137, 75, 34, -136, -85, -1, 91, -56, -89, -25, -1, -167, -176, 7, 119, -18, -68, 81, 93, -91, -172, -13, 127, -107, -163, -45, 143, 33, -91, 121, 31, -29, -46, 130, 152, -31, 41, 12, 141, -57, 37, 2, 93, -94, 22, 7, 108, -139, -13, 100, 145, 7, 25]
6487B5L1Q0o3k61L25j12j23J1k3J34O6j10J7M7j01l0M5N1N5j09P2Q5k87J91O5
6512H1k8q1m4K38k5j66JOJ85j78j35K01p8QM3p1l9q2P0Q0R7j48O5mO5j37j46L13
6540I1j41J21j52J58K6k00M8J43n5n9o2R0M7j3n8P7O2j66r2J54K0q7j1L2J60k27
6566i4K6N5J19j72J10R0J17l88L7J40%q5k5J35j2j16K9N7Kr2lJ00L9k03N6J83
6592A05k1j34qN7K8p9J1J09J1j60jK15p8k05R7J89j40J35p5j6Nm1j53K83q8j81
6618a35L9J11O0j99R3Q8m6j06J85o2J03j07j59J62K6k24L9K33k4Po0k1K3m9n0
6643g3J84r2r6R0R4k1J2j04qM3j44m9K68J1k24J68j4pk20R9Q2J36k23K2J30L8
6669A02k83QK82p3j47l9J78N6q7l0P9j23M2RJ90k51M1r1J03J78j59P6o2Q6r6j2
$$ y = [25, 56, 136, 73, -188, 137, 25, -98, -87, -110, 24, 90, -20, -3, 44, -57, -87, -42, 9, 64, -45, 27, 112, -175, 16, 81, 53, -28, -72, 166, 141, -25, -24, -18, 167, -11, -146, 55, -23, -15, 28, -43, -82, -164, -94, -14, 83, -65, 0, -4, 61, -76, -222, 91, -50, 71, -81, 77, 103, -97, -49, 94, 39, -20, -82, 8, 55, 42, -16, 61, 123, -43, -135, 19, 39, -48, -59, -27, 133, -94, -68, -13, 106, -66, 44, 134, 251, -137, -100, 40, 40, -45, -70, 65, 53, -63, -34, 23, 25, -67, -70, 30, 69, -134, -78, 105, 84, -50, -58, -1, 27, -52, -41, 68, 79, -81, -82, 133, 55, -150, -53, 136, -4, 131, 56, 40, 45, 4, -149, 134, 46, -135, -96, 15, 75, -124, -31, 57, 11, -95, 90, 28, 131, 24, -135, 27, 53, -171, -132, 101, 77, 84, 24, 3, 26, -23, -73, 111, 19, -77, 13, 107, 86, 98, -6, -14, 29, -115, -164, 104, 115, -109, 59, 45, 38, -182, -83, -1, 135, -88, -66, 64, 102, -181, -173, 109, 36, -111, -150, 28, 84, -3, -33, 46, -77, -35, -26, 164, -87, -46, -137, -34, 144, -15, 61, -1, 85, -11, -23]
6695b3Q8j35N0r7J25o2j13Q2O1j0K5l7j0O8j7KJ41j59Oo2j9M0j41K11m8P3p5M0
6723Dj0Mn9j45K84N1k07J79M4j13k3j18J45L0j96J52O5m8rq0R5m6p8J14j6K3j29
6750h7L6J32o3p7rJ29p9k8m1J71n3j11q5K90j82j7Q6o3J82j71N5o6m1o9R4K04
6776A37q7K3j29K18j93k9J6Q6n4j52K65Pj21j34P8J04m1l5O9P1j23K8R4n4j29
6801h5N7j73L49q1pM8j0ql16J81P7M5r0J79p8L0j87N3O0m9pJ5J8j5l7o0K08j31
6829a4m0L1J72j44n6J7J41j46j28J43m2N3M6r1K58q9j20Q2k2n2j36R1Q9j4r6J36
6855F9Q4j08j20Q3R9m0j5k0J10j39l7p1J55r2n2K9J59j42N3m0j2J18j68L4J17
6880E4m0j11J47l4j10N1O2m3P8m7L5k1k8K8rQ7k25LJ25R6j00j82K08J05j59pJ50
$$ y = [-23, 65, -70, -20, -117, 8, -54, -167, -85, -24, -34, -9, -46, -56, 12, -5, -3, 138, -21, -15, -77, -96, -56, -197, 14, -34, 39, -36, 4, -6, -2, -61, -206, 78, 129, -78, 101, 145, 32, 9, -109, 36, 66, -130, 22, 87, 39, 30, -50, 45, -1, -79, 35, 19, 42, -87, -51, 81, 18, -59, -68, 61, -18, -46, -87, 84, 31, -80, -165, 125, -57, -74, 12, -51, 131, -40, 15, -51, -92, -161, -67, 137, 50, 73, -56, 162, -31, -60, -44, 42, -12, -164, 101, 108, -13, -147, -69, 35, -6, -41, 28, 99, -24, 4, 98, 44, -85, -28, -201, 148, 67, 60, 108, 98, 90, -226, -45, 32, 77, -13, 166, 88, 118, -69, -16, 44, -5, -12, 3, 21, 6, -31, -91, 117, -14, -54, -23, 149, 5, -51, -34, 107, -39, -167, -24, -66, -13, 33, -58, 200, 111, -9, 73, 51, -1, -137, -46, 43, 29, -67, 69, 153, 45, -75, 8, 107, 67, 52, 32, 142, 3, -34, -105, 50, -42, -94, -65, 94, -48, 5, -35, -47, 71, -97, -63, 54, 14, -97, 50, 16, -94, -43, 19, -24, 54, 7, 42, 21, -7, 21, 12, 99, -126, -123, 2, 98, -2, -184, 24, 129, -30, -37, 113]
6907A13j4l4j42L6J45k01j06J99J90l31PK36Nj09j84R4J86j2j93J48J91q8k79
6930a43J87N1O5l37J39J63j66n6J22j1K2j04R8rN6j43J01P8j91K7Q3K4Kj71O6
6955d7J22L0k74K00O7k13M6J36J8k1j18J09j0j39P3M4R7k29J14J20N9k22%P4J58
6980A94j94j8N9N8r6q9O8M7j34K7J32p8J0n3K6N3l1q8J50J1r0o9Q9Q8r9j11J31
7007gJ65j25m8J47J0q1q6M0J0m9j50J89N9n8m6J98k16K1n9J35j6j22L0Q5j1o5
7033e0RJ50k5j09k1J05o9j9j13K13Nj85R6qO9j59K7J57j3p8j09K66j11l9j6J58
7059A31l4k03J2K18J4j75LJ95r7j24l3J57j9j72Q3J00M9j62N4P3j4n6q8J52j41
7084g7j2o7K90j02k3j0J07o1j44k8K03j1p9L0rJ4j23L6J20l6j01N1J12n0k00K4
$$ y = [113, 99, 65, -77, -41, 104, -97, -203, -4, 186, -145, -138, 98, 103, -6, -190, -96, 90, 78, -115, 33, 224, 136, -143, 44, 95, 160, -177, -38, 125, -41, -97, 25, 14, 36, -68, 30, 21, 77, -66, 35, 113, -78, -51, 32, 56, 58, -113, -47, 75, 105, -169, 31, 98, -115, -69, 67, 85, 64, -54, 55, 45, -94, -21, 23, 120, -109, 5, 125, 184, -38, -38, 36, 194, 0, -18, 41, 99, 3, -86, -18, 29, -105, -78, 54, -24, -14, -67, -41, 12, -19, -107, 43, 54, -36, -105, -16, 72, -27, -138, -7, 158, 33, -15, 132, 142, 61, -25, 15, 25, -24, -174, 15, 74, 16, -30, 168, -48, -27, -86, 49, 33, -89, -59, 26, 15, -50, -41, 109, 84, -25, -46, 59, -10, -29, -142, 71, 76, -109, -13, -21, 48, -111, -84, 73, 60, -18, -127, 139, 28, -11, -27, 131, 97, -106, -94, 124, 138, -37, -34, 161, 64, -60, -93, 64, 45, -127, -44, 56, 105, -57, -3, 70, 56, 0, -88, 64, -77, -89, -156, 134, 32, 9, -1, 106, 45, -99, -127, 76, 65, -14, 16, 7, 21, -102, -66, 54, 18, -83, -32, 80, 30, -170, -146]
7110a46K05rj15n4L47j95q0L1L1J58k32n8J86r7q9O8J54j29q9J03MN9k5J22k34
7135h4M0o0l2K21q0j65O0K70r3k8j14J06j6j45N9J40m4j22J25P7j46M2m5Q8j69
7160a15k6J56K07j34k05KJ25j9K9q2Q9N9j92J98J2j34q2J00M2j43P8J46q8l8r
7185b4L8qr4j02J54J15j49J6O9K0q9j9P5J51j61j17J05J10j19M3L0K3j89N8J21
7210E7m6K4j35J4J66j10j96K85L2qk11O8M0j6l5O0P6m7k9R0Lj02o3L9K30j90p9
7237h3J42J05j42j80J72L0o8j40Q5J27m3J4k0j9p4R5j15J71J5n7j9J34j46j33
7261a49K27Q5q0k58K16J3n7o0O7qp9q5j2K59k7j74J38M6k47J73j0J57p1j13K05
7286A56P0j61j21J01K3j60nJ23Kj06O6r9J59j50r8Q8O8O9l0Q8l6L2j46N1O9j5
$$ y = [-146, 59, 50, -65, -119, 228, 33, -47, -16, 15, 173, -59, -117, 69, -28, -117, -49, 105, -24, -113, -10, -6, 53, 28, 150, -84, -44, -104, -136, 85, 5, -160, -100, 170, 77, 49, -65, 41, 25, -120, -61, 79, 35, -87, 38, 115, -31, 11, -34, 54, -115, -141, 15, 222, 88, -117, -115, 10, -9, 20, -62, 27, 86, -106, 92, 104, -30, -112, -12, 30, -113, -35, 111, 23, -15, -24, 14, 6, -88, -190, -36, 79, -70, -54, 15, 35, -54, -73, 2, 153, -8, -125, -20, 90, -29, 14, 44, 67, -122, -64, 57, 11, 35, -100, -86, 80, -30, -226, 59, 91, 83, -128, -60, -20, -36, -71, -11, 65, 18, -11, 79, 82, -20, -83, -44, 186, -4, -83, 59, 164, 22, -158, 14, 44, -24, -164, -79, 48, 5, 19, -1, -20, -94, 1, -114, 57, 72, 15, -4, 130, -16, -149, 78, 163, 83, -175, 41, 54, -3, -63, 4, -4, -83, -168, -180, 79, 52, -122, 16, 62, -185, -12, -22, 135, 64, -49, 156, 226, 65, -56, 45, 68, -92, -97, 26, 28, -78, -12, -111, 48, -102, -200, -112, -44, 25, -5, 83, 47, 79, -67, -16, 53, 38]
7312C8k4R9O0r3l4O5m5K2j31J00pj11j00L50k35j36J66K4L4j22N8M9L8j08r4P3
7338f4Q8QR6j17J42k44Q0P7k7j09%Q4R3q5j08K02j76M4j40J63j3j4pJ31j8q7j08
7365a09J35P3j21j0J75j35o2k1J14P0p0j15J64j19Qr1J09m9q9NJ20J27j42o7J91
7390I1l0j21o0J03K7r6M4J27J9j27m2J74r6j48R0J12j0j87J25m1Q1j32n5J45k8
7415c5o2L5J64L1j55j83L18j5r2JJ30lk07R8O0n4n9j10J09J86l19K01O4m1k79
7440b17J02K36n9j42J36M5o2j94K07J59k08l0J1J47k4k37J52O6j52K5m1J50L4
7463A04k55J58J4o7l3N9K2J27j33m3J03K1k9j09K73j61j68J82L3M0k04n3K12k8
7487F5j38j6J07N8k96K72l6O5m1j15K05j52J3M7O2m8J28j73J12j76J2lQ8o1p4
$$ y = [38, 14, 113, 173, 80, 46, 111, 66, 88, -43, 57, 50, -61, -161, 189, -46, -182, -16, 8, 42, -80, -22, 27, 65, -43, -137, -64, 24, 32, 128, 11, 153, -91, -11, 66, 39, -70, -70, 14, 107, 22, -86, 116, -60, -16, -156, 7, -6, -20, -27, 104, 86, -1, -109, 26, 99, -22, -32, 143, 8, -54, -75, 39, 109, 39, -76, 88, -31, -23, -114, -5, -54, -143, -138, -18, 109, -33, -100, 91, 61, -60, -120, -17, 10, -86, -42, 85, 104, -23, -65, 109, 13, -135, -45, 67, 57, -130, -5, -46, 35, -97, -152, -7, -35, -97, -62, 102, 133, -22, -205, 113, 98, 6, 7, 137, 134, -73, 25, 85, 31, -28, -138, -29, 157, -162, 39, 103, 62, -217, -115, 121, 62, -80, 56, 101, 39, -155, 52, 211, 3, -27, -16, 131, 107, -130, 22, 88, -64, -39, -80, 70, 104, -151, 7, 21, -46, -79, -20, 2, 129, -4, -47, 56, 77, 48, -61, 212, 51, -117, 65, 98, 138, -66, -119, 93, 65, -73, -89, 18, 76, -220, 52, 16, 81, 40, -75, 130, -22, -9, 38, 100, 52, 180, 7, 119, -57, -45, -48, 40, -21, -95]
7512i5PpJ60j51K9J1K0j31J45Q5M0j40J9L1J1q5J38k0l8m2L7M7k3p7J9m1J37k14
7540a28J4K53l17k5J93K6Lj1m8R6Qo9J3J23n9p5r6J87Mp8kO6K7j44k6J69r9j32
7568a27J54J8L9j12j00J44K3m0P7r0J11j78R8J18j45J13j04J44j48k15J81m9N
7591h3n0j2J91p5m0N0J22mj33J47Oo3k9%J7j25M3J33Q1j17j23J22L0p8k9k4J76
7618A33p4j71Q4Q3m4r7mJ63r2l8J16Nl5k0l2oJ27k41R0K14j27j38MO4q3J10l9
7645d8M4M8q3j07L49k14j36J94OJ5j11J37n8J01j74R5P0r9r1J18N7n6j51K03j07
7670Br2L0J65r8o2j9j44K66j38o0K28Q0k34L5K09j05n3PN7j3l8j93J99M1j07j7
7696e4J34q7N6j24Q0j3m3n0J02k5N6q7L5L5lm0J7O6J01q0J1R3k38K9R5J36k84
$$ y = [-95, -88, -95, 65, -86, -57, -46, -26, -157, -12, 73, 113, -27, -8, 23, 34, -51, 87, 67, 29, -13, 24, 71, 48, -29, -10, -51, 86, -128, -114, 139, -178, -203, -10, 16, 19, 8, -40, 56, 64, -5, 8, 131, 72, -3, -99, 88, 92, 14, 12, 78, 105, -39, -65, 104, 5, -127, 27, 45, 84, -28, -128, 16, 39, -1, 76, -14, 97, -81, 17, 135, -10, 103, -1, 143, -5, -220, -39, -88, -83, -133, -145, 46, -29, -69, -19, 103, 99, -34, 113, 119, 56, 27, 27, 44, -81, -38, 95, 176, 59, -64, 58, 88, 10, -19, -43, 133, 59, -112, -28, 55, 11, -86, -90, 73, -19, -57, 59, 64, 29, 9, -23, -29, 98, -143, -53, 161, 34, -104, -100, -36, -119, -9, -48, -4, 44, -39, -146, 203, -11, -147, 47, 53, 68, -43, 94, 36, 137, -37, 58, 128, 29, -62, 56, 113, 57, -94, 109, 2, -90, -60, 105, 7, -55, -74, -218, 48, -90, -150, 78, 158, -76, -41, 168, 63, 10, 17, 74, 61, 23, -170, 29, 70, -37, -54, 80, -7, 49, -75, 5, -8, -51, -101, 1, -24, 32, -55, -20, 15, 12, -28, -11, 55, 156, 76, 87, 180, -58, -29, 66, 202, -82]
7723h2M9L4Q0j46%N5J05j04K0M4N3j13pO5K01j73q7J35j05m8J1j6M4j04k9K21
7749A03rQj22J19q1j51lJ46op2J02J02m7j37mO0n7O9j9jp3NR6j3O1j57k2J07K1
7778B5q9k4J63J5r0j50K22k9R1k02J08j1ol4lJ36j82n3K02j5j97O6J15J6r9q8
7804a13J33J5o1p8O9Q1qk23J29j8L6j78K40j3oML7N6j46N7Q6J3l7J4j7j66j15
7831b09Q5J27R4k09J38K4mr2R1M5j26l0J07K3p2N1o5k2L6j00L3K06j57N4j08J15
7857C5J01k28J61M8o5M0j38R3K2p9rn7J2nJ5R6R8r8j93K05j49R5m0J42l5p0n0
7884e3NJ52j68k0J32K5j66L0J55l4k54K28o5Q9k70J48J21j24L1R0O0p7l9j3J42
7909A25j16o4O2J51pj19j25O5O8j33N0K2J01j16p7O8O4j30P2J70j03q2R8q1L7
$$ y = [-82, -33, 1, 81, -65, -65, -10, 95, -9, 11, 55, 108, -5, -12, 53, 254, 81, -6, 129, 24, -24, -13, -29, 15, -89, -118, 103, 94, 102, -20, 99, 18, -133, -136, 10, 4, -68, 34, 136, 89, -48, -52, 8, -49, 20, 1, 0, -73, -68, 28, 15, 76, -81, -103, 4, 25, -64, -88, 75, 90, 0, -150, 72, 43, 134, -68, 40, 29, 23, -11, -14, 122, -60, -113, 89, 74, -123, -57, 58, 74, -25, -113, 20, 35, -26, -104, -35, 46, 38, -185, -56, -74, -38, -216, 24, 11, 5, 9, 46, 102, -44, 13, 99, 112, 75, 89, 72, -94, -209, -124, 3, 97, -112, 26, 50, 46, -46, 45, 90, -36, -66, 41, 64, -8, 43, -22, -44, -8, -108, -75, 131, -26, 28, -80, 35, 136, -92, 69, 117, 52, 92, -46, 47, 69, -10, -19, -76, -64, -69, -54, 42, 140, 42, -151, 54, -95, 0, -40, 102, 67, -3, -53, -48, 104, -64, -84, 48, 73, -93, -63, 92, 58, -196, 32, -33, 56, -214, -66, 55, -69, -38, 52, 112, 35, -4, -17, 125, 9, -55, 7, 158, 151, 32, -93, -28, 40, -93, -43, -21, 80, -36, -113, -45, 19, -111, -39, 131, 28, -54, 44, -37, 0]
7934@kp4P5Q9q7m0Q9n5J0j00J14R5j75J24rj16j07M6J13n9L7NOnjl5L0j9j3M3
7964b1L4M6O1m1J4J0j71K2N2J5o5P5Kj31J21m6Q0j21n2P8N4p9%o9J57o7r5J70
7992C3Q5K4n3p9L4O7k24K60q1p8l6J14n0Q6j94J1J29kj21JQ3J8j5n4L4k5kj20
8020a55J16P0o6J04M8m1o1j03J32mj19J3K13j28p0ln4K6jl6L09j56o8K4J87j49
8046B8qK9m8rJ2R9j41P0n3r2J31j19k4K18j05lm4rJ18j61M0J60j5j3l0R4m9j81
8074a05NR7L6j21K3K2J58p9J9RK9j9k63J45J72j33m6RR6k10O8K7Q5J8r0J29k1
8101F0o4p1%J07J5r5M9K1pq6J78j71M9o2O9N8J33r7j33J07r1l5q6J05J12m2q3
8128f0J45K7r8K8o4mp0J00J36k44O3J04r7k0n0R9nn0P1j02O9K0r7KK21j29K2J3
$$ y = [0, -2, -76, -1, 88, 1, -39, 50, -5, 5, -95, 19, 114, -61, 63, 54, -62, -169, -123, -10, -69, -32, -27, -21, -26, -27, -62, -32, -51, -64, -21, 13, 59, 120, 79, 93, 103, -68, -46, 6, 21, -44, 31, 33, -98, 23, -23, 57, -64, -116, -38, 16, -63, -63, -132, 25, -42, -137, 33, 118, 142, 89, 10, 44, 111, -113, 147, 66, -12, -48, 66, 16, 102, -92, -81, 48, 46, -75, -74, 9, 27, 12, -42, -8, -33, -35, -155, -39, 31, -35, 69, 117, 76, 15, -88, 44, 40, -79, -66, 147, 19, -51, -54, -108, -82, -83, -119, 190, 34, -34, -10, 177, 28, 20, 49, 1, -8, 4, 103, -38, 32, -21, -113, 18, -101, -125, 93, -12, -15, -59, -68, 50, -111, -71, 89, 74, 61, 31, 125, 76, -105, -100, -3, 33, -88, -65, -43, 115, 36, 55, 64, 93, 74, -189, -44, 128, -5, -51, -42, 54, -156, -88, -61, 24, 42, -48, 81, 60, -4, -75, -75, 32, 47, -48, 1, 22, 15, -71, 107, -64, -15, -77, -8, 50, 183, 86, -47, 60, -31, -66, -152, -47, 65, 23, -60, 85, 112, 14, 42, -22, -26, -96, 4, 140, -104, -41, 63, -34, -54, -104, -5, -10, -60, 11, -91, -22, -2, -99, -97, 124, -5, 17, 30]
8156C0o0K3K0j60J96m5j52L4R7M4j46K72j2j22p8Q5j0n9J6O6l6k7p8J53j08pO4
8183@P9o2O8k11K26R7k56Q1
$$ y = [30, -30, -7, 13, -147, 49, 4, -148, -114, -17, 27, -119, 153, 141, 19, -59, 26, 16, -43, -27, 39, 3, -24, -102, 51, -57, -64, 0, 79, 17, 85, -126, 100, 197, -59, 22]
8191B2
$$ Imaginary data points
##PAGE= N=2
##DATA TABLE= (X++(I..I)), XYDATA
0@%%%%%%qQqJ6j6K4l7M5n6P2q8J12j36J67k05K38k80L36m00M64n37O25p22Q28
30D42r51J085j233J400j582J783k004K248k516K808l127L477l860M277m731N230
46B746n773O368p020P733q520R387j0346J1411j2603J3946j5465J7202j9219K1586
60A1433k4404K7838l2131L7668m5118N5744p2238J01523j68988O01710L25463
71H18500q79916K32502l6079l79127p159L08831j67676q5237j256j58664k5335
82c80616J82340k40272r3217M46180J36312k71033L28187L41689m56195l12176
92c18801M26989J64751j63071K02131K13201j90668j25439q3264k13019M5953
102d1237J40374k41545o7937L30170o6275l41617J37569Q0306m30284p7893M30869
$$ y = [0, 0, 0, 0, 0, 0, 0, -8, 0, -8, 8, -8, 16, -21, 24, -32, 40, -48, 64, -72, 95, -110, 128, -152, 184, -216, 248, -289, 336, -386, 442, -509, 576, -657, 743, -839, 944, -1060, 1188, -1328, 1480, -1647, 1830, -2030, 2247, -2484, 2746, -3027, 3341, -3679, 4054, -4466, 4921, -5425, 5986, -6617, 7329, -8136, 9066, -10153, 11433, -12971, 14867, -17264, 20404, -24714, 31030, -41208, 60315, -108673, 493037, 818500, -61416, 171086, 135007, -244120, -251279, 57552, -110124, -195361, -196617, -355281, -380616, -198276, -438548, -531765, -85585, 50727, -220306, 107881, 449570, -6625, -318801, 108188, 272939, 109868, 311999, 525200, 334532, 209093, 125829, -87190, -41237, 99137, -142408, -210345, 119825, 53550, -288067, -150498, -70192, -500476, -578369, -147500]
113a47500J00919n3829K75595J30369j66683j5799O203q3094J45552J04170k35022
124F0881k5405K33463j65696k75905J60349L4910l14775L9509K96492n1473j02951
135a10601J15012n7028j68985M8168N9450K3215K01913P4439j83717N6300J97099
146B55265j68144j74965J75731L8350j78065R7183K00292p9142j04959j1900j44524
157i4878j15431N7925j6193k1068J50634J2318j53150R8026J76982j19500q0377
168a04712J83384M6576j11417Q1159J15597p6687p0627k2676p3110K7690Q9385
179H4562n8118k9925J05236o5280j87639M6651R5337j32344n6524J62499N3810
190A8265o2804M5795M4626n8729l9885j8685p997R2142Q3671l4406L2825J07144
$$ y = [-147500, -46581, -100410, 175185, 305554, 138871, 123072, 129275, 46181, 191733, 295903, 60881, 35476, 268939, 103243, -172662, -12313, 22597, -292178, -252669, 43823, -7650, -110601, 4411, -52617, -221602, -173434, -113984, -90769, 111144, 185583, 1866, 58166, 255265, 87121, -87844, 87887, 126237, -51828, 45355, 245647, 166505, 61546, 49646, -94878, -210309, -152384, -168577, -189645, -39011, -26693, -179843, -81817, 95165, -24335, -104712, 78672, 125248, 13831, 94990, 210587, 133900, 63273, 40597, -32513, -4823, 84562, 26444, -3481, 101755, 36475, -151164, -104513, -9176, -141520, -198044, -35545, 18265, -44539, 1256, 45882, -12847, -52732, -71417, -79414, 12728, 96399, 61993, 94818, 201962]
202B01962p9837j45407O4021O0435j30725n1354J06013R200q2759n595K0642k8206
214f1610k8532j3600L1082R3842K0017p4589K4311P0709q5507q1413J09356Q5169
226H9235o7292l656R7897j615r0742l4812J930j4926j7211k644N2602P6501l0144
239E5123q8825J6174L2912r0854n8965R4572N9489n6025O249Q2108J352o5195
251a1885j9030L1467K5876j0697j5230L7593M0192n2929p0736L2276M0258n4053
263b6898j7687Q3671K8027o4133k1388K7546k1423n5150l969N2506M3122k520
275B1704r633K8533J1997o7513n6040M1411L5046l7634K517P4336K3567n1804
287A6487k2955K2848p163l9990o157M2042L1954k1844k6835K4280J4076m9321
$$ y = [201962, 122125, -23282, 40739, 101174, -29551, -80905, 25108, 34308, -48451, -54046, -33404, -61610, -90142, -103742, -72660, 21182, 41199, -33390, -9079, 61630, -23877, -105290, 4066, 89235, 21943, 18287, 116184, 114569, 23827, -10985, -9055, -23981, -41192, -43836, 8766, 85267, 55123, -33702, -17528, 15384, -75470, -134435, -39863, 19626, -36399, -30150, 51958, 53310, -11885, -30915, 552, 26428, 15731, 501, 38094, 78286, 25357, -45379, -13103, 27155, -26898, -44585, 39086, 67113, 2980, -18408, 9138, -12285, -67435, -71404, -18898, 24224, 21704, 12071, 40604, 52601, -14912, -70952, -29541, 5505, -32129, -29612, 44724, 68291, 16487, -6468, 16380, 9217, -30773, -36930, 5112, 37066, 15222, -11613, 12667, 26743, -22578]
299b2578k5010N1587L0855l7535j3965L8941k72n5655k0465L5202K0453j7939
311a6381J984N1162K4632n1311m2522K5761J4032m2310p572O5333L4539l7383
323A9964j5515L3695r11n4630k7798L4416K5352k8455j1538M5152J7123n2939
335a6084k8551M1465J6226m4074n904N1493J0580m4019j1445L8065J3119l4550
347a3679o941N1256K6027m0605k1892L6986K703o0389j3255N5366J1596m1030
359a3857K258M0925m105m8403j8067K7104Q568l1023m540N0244K4542m1200j2990
372b0544M6837j24n5014L000M9726n427l6437J4174L6295p859l1293O41K9222
385B3197O081l5078j2793L9497L878n7848p742N1573m783m5806J9215M6795j4992
$$ y = [-22578, -47588, 3999, 34854, -2681, -16646, 22295, 22023, -33632, -54097, -18895, 1558, -16381, -14397, 36765, 61397, 10086, -32436, -6675, 7357, -34953, -42525, 22808, 57347, 19964, 4449, 38144, 37233, -17397, -45195, -10779, 14573, -13882, -25420, 19732, 36855, -16084, -44635, -3170, 13056, -31018, -36922, 14571, 25151, -18868, -30313, 7752, 20871, -13679, -20620, 30636, 56663, 16058, -5834, 31152, 33855, -26534, -39789, 15577, 27173, -13857, -11599, 29326, 25221, -23182, -41249, -14145, -5577, -36600, -41140, 9104, 33646, -7554, -20544, 26293, 26169, -28845, -25845, 23881, 18454, -17983, -3809, 32486, 24627, -6666, -6025, 23197, 29278, -5800, -18593, 20904, 24782, -33066, -40808, 10765, 5982, -39824, -20609, 26186, 11194]
398A1194l1239J3937J8663j1104j8702J088K8689J4856l1157r993M3138P2n8023
411b8581O03M8960j7973m1939L1718L8282k1348j6344J6874J1193l401j6535j5196
424a3687J8964J3767l9009j5152M9787N702n3020J2541N1825k1715l5357K5974
436F20J6462k3028q714N897M759J1078r107k1217K4288K3018m0684j1164N5496
449B7704k749n1498K4895M5833k8762k3539K9297N861k2922n254o207k477J3663
462C845k1650k8412M0595K7677m7409N69O2474j5540n4057K8504L1146m0568j3976
475b6802L2520L71j0960N718p669P509K2007k8886k3717N0839J5856n7804J0044
488a0974O1077l2550n3910L6408K4396l9706n171K3797p287m918O25j2846J9376
$$ y = [11194, -20045, -6108, 12555, 1451, -17251, -16163, 12526, 27382, -3775, -13768, 29370, 29442, -28581, -27978, 20982, 3009, -38930, -7212, 31070, 9722, -6622, 10252, 21445, 18044, 1509, -13687, 5277, 19044, -19965, -35117, 14670, 20372, -32648, -20107, 31718, 10003, -25354, 620, 17082, -5946, -14660, -8763, -4004, 7074, -2033, -23250, 1038, 24056, -16628, -27792, 27704, 24955, -26543, -1648, 44185, 15423, -8116, 21181, 27042, 4120, -1134, -7341, -9818, 3845, -17805, -46217, -5622, 22055, -25354, -24785, 37689, 22149, -31908, -3404, 27742, -12826, -26802, 5718, 6089, -4871, 847, -6822, 687, 22694, -6192, -29909, 20930, 36786, -21018, -10974, 50103, 17553, -36357, 51, 24447, -15259, -20430, 3367, -3920, -8838, -8213, -21059, -1683]
501a683K7035l4757j4358O2681M009o8259J5114N0182m8552m5040M5936K2110
513A4418k7596P850J7969q900N355k58k2109J8401K2856m1891p290O1745j2742
526B7808o4857K8540M0822n2355k5015N2714R493k9408J1058Q509j1556J1372
538G125m294k2713K7612K0607m5300m551N0572k3003n1268L6865L0900m3359K960
551a7847N5382m566k8240J0399l206j4676Q558j2383j7971L4478J2731m9604L851
564b3094N0150l0061m5998M0733K3214l9603J0291M3085j4918k2266J0061m740
576c146k320J8634j4532j4372M0832N168n3525J2500M9638l3334l5888M4229J8601
589C2485l6945L794J9765k5485j7556N938j0653P495K5567j6600q493M3094k652
$$ y = [-1683, 25352, -9405, -23763, 38918, 42927, -25332, -10218, 39964, -8588, -53628, -7692, 14418, -13178, -5328, 12641, 3741, 9096, 8838, -13271, 5130, 27986, -13905, -21195, 40550, 27808, -37049, -8509, 32313, -20042, -45057, 7657, 17150, -12258, -1200, 7309, -4247, 7125, 2831, -19882, 7730, 28337, -16963, -21514, 29058, 6055, -45213, -8348, 22552, -20807, -17847, 37535, 32969, 4729, 15128, 11922, -2754, 5804, -6579, -24550, 9928, 22659, -26945, -23094, 27056, -3005, -49003, -8270, 14944, -24659, -14368, 28717, 13799, -8467, 1594, -3146, -5466, 13168, -1364, -15736, 25096, 30264, -23261, -10761, 38877, 5543, -30345, 13884, 32485, -4460, -666, 19099, -6386, -23942, -18004, -28657, -21162, 4405, -12195, -20688, 22406, 19754]
602A9754m9768J9892M3300l4916k5284M7085J5473l2021L721J2267j7908l170
614a575L021j4139J3496K0696k7057j1162L5866j1761m4685K5573L3826l8278
626a6179j4414M4545N68l4903O151J3739q045M779N368l183K3759J3811l3993
639B003n924L2760k2069l9303L3054K6079l8397o242L9090p598l2842N256Q988
652e145p707L618K067L46K2337O48l3419Q255L3020k4278k6907L7156J8796l5501
666f714j095L0925j2913k6223R095R892j927L639m894k362J3923j1407l1183J4227
680a7017K8658k2653j4638L9461J4092l0615Q84J9036j5661j5406J2033Q475J633
693H282L914p201l190J0432j2104k3833J5229J8150k3149o159L2316O72k9130
$$ y = [19754, -30014, -10122, 33178, -1738, -27022, 20063, 35536, 3515, 7236, 19503, 1595, -1575, 1446, -12693, 803, 21499, -5558, -16720, 19146, 7385, -37300, -11727, 22099, -16179, -30593, 13952, 14520, -20383, -14232, -493, -8538, -3759, 1609, -1574, 22185, 35996, 2003, -3921, 28839, 6770, -32533, 521, 26600, -11797, -18039, 21051, 13453, -19389, -14133, -5145, -12852, -9234, -7167, -6821, 15516, 16164, -17255, -9000, 24020, -258, -27165, 9991, 28787, -6714, -7809, 23116, 10203, -16020, -6925, 2967, 1040, 4679, -215, -2577, 11346, -61, -31244, -17017, 11641, -11012, -25650, 13811, 27903, -2712, -1828, 17208, 1547, -13859, -1826, 6649, 8282, 12196, 4995, 1805, 12237, 133, -23700, -8471, 9679, -13470, -19629, 12687, 13359, -15771]
706a5771L071J7175q446o786J2213P910J625j577j1054n84J1434r829j3384K0369
720F366J4630j9837m540K0147q413k7569K550J4337m552k603R387O016J787n856
734A850j2242L539J1600r473q023K0691J1538j9474m085J8541m706k0357K966
747g635J2841q59n169J24L207J062r273j0565R842J5038q825q802J6493O329k0016
762f208m924J5431j311j3975M480J5829L253p386l873K580l26j1277p552J3872
776a387J1730j2295o672J6574M278j8174l963J4289o30j3356L365J4713J714j0211
790b5m517O398K529r562k923J3744M811j4832n104J3855L68j6554O47J6209J48
805E192r813M875J2286l040j4200k570R879Q93r470K525J5593J247j5977k574
$$ y = [-15771, -12700, 4475, -3971, -10757, 1456, 9366, 10991, 9414, -1640, -2224, 9210, -619, -14003, 6366, 20996, 1159, -3381, 16766, 8353, -19216, -16666, -2329, -6881, -9484, -97, 5919, 7706, 1850, -10392, -6853, 4747, -4726, -12749, 7942, 19480, 6, -4079, 14462, 9756, -10601, -7635, 5206, 4347, -822, -698, 2509, 3571, -5702, -16267, -6425, 8613, -212, -9014, 7479, 13808, -6208, -11132, 4299, 2988, -10987, -6507, 9322, 12575, 5189, 1316, 3896, 3570, -7707, -15259, -1387, 10343, -1952, -8624, 7950, 12228, -5946, -9909, 4380, 3750, -9606, -6241, 8472, 10186, -25, -4542, 1856, 4385, -5177, -8100, 5644, 10455, -4377, -9481, 4374, 4742, -11812, -11165, 5044, 5192, -4621, 254, 12540, 9500, -4700, -7270, 2609, 3502, -5968, -3443, 12150, 13397, -2580, -5154]
819e154J1903l972j6191J528J3580p00j0207L703J1813l521j2782J244J2062M67
833C773q945M361J3932k558j3602K526J2088l220j1427L803J1978m791j3725O05
847e202Q210o144j3504K671J3548M3q962M607R709n242j1164L568J1677k02o822
862c209N592J2454p53j0281L16Q600m785j2678L059J0658m391j0526K175N266
876A497o513r264L127P743j093o538K027R906O28r628K722J3362j11p846O852
891F871J1813n009j0742J639M376n578o843J612N963l37q403k011P327k966j3150
906a5438J500J2346k630r285Q882J2094o215p085O815O682l093m194K753P775
920A0907K1j0144j360J0597k786j5346K953J3838p279j3825P423P982r599o762
$$ y = [-5154, 6749, 2777, -13414, -11886, 1694, 994, -9213, -5510, 6303, 2782, -10000, -8756, 3306, 3773, -5172, -811, 13121, 10563, -3039, -513, 11575, 8355, -3072, 731, 12709, 7918, -5807, -5202, 3008, -3136, -16640, -13969, -421, -378, -9340, -4733, 4976, -266, -11430, -7862, 3815, 3613, -3209, 2383, 14837, 14084, 3803, 4119, 12719, 7934, -4744, -1685, 8973, 4582, -5944, -3769, 1497, -5016, -14280, -11153, -3410, -4503, -11041, -9014, 892, 1520, -8108, -5386, 7976, 7865, 19, 6871, 18684, 13675, 2933, 4572, 8948, 3370, -3473, -1861, 4102, 3765, -4638, -6649, 678, -2288, -15438, -13938, -1592, -4222, -13507, -4625, 7469, 1254, -5831, 984, 7666, 4573, 379, 3132, 10907, 10928, 784, -576, 10021, 7235, -8111, -5158, 8680, 1401, -12424, -5001, 2981, -6618, -13380]
934a3380P223O340r83k975K590Q685J409j1015j264J3129k517j5075P330J4745
948A4242r622j1537R642N504j1356n994N131L061j721m192m64Q957K225j2410
962h534J070J5961m089j3957J0898J3214j1771p890J2400K852j0055k9M372j4
976D428n93n418l863P158p20j4524K814J5914p623j2595J4793J0113j5023l194
990h333J3320j478p446L936L770J424K823n254l565J0473p59j6722M373J5329
1004A1891j1713j2151J5016M420j6116L24J0499m167m609M389p13J622M734q119
1018d693l228J5169p99j6225R994J6049j4098r470J5125N37j4900L003P419n274
1032a391P47L014n774L884O180j2506l224J6160m173j5931J2724J3013j6085n159
$$ y = [-13380, -6157, 183, -800, -3775, -1185, 7500, 8909, -2106, -3370, 9759, 7242, -7833, -503, 14242, 4620, -6917, 2725, 8229, -3127, -9121, -3990, -929, -2650, -6842, -7306, 1651, 3876, -8534, -7464, 8497, 4408, -9549, 1349, 14563, 2792, -5098, 7302, 10154, 99, 70, 4442, 4428, 3835, -1583, -5446, 1712, 992, -13532, -10718, 5196, -2427, -15022, -229, 9884, -5139, -8333, 4987, 3509, -3937, -1, 3769, 5193, 8016, 2762, -803, 9670, 8911, -7811, -3438, 11891, 178, -11973, 3043, 7463, -8653, -8329, 2170, -1997, -6606, -2217, -2930, -1308, 3426, -4693, -7921, 7248, 6449, -9776, 218, 16267, 2169, -7301, 7824, 8361, -6539, -3536, 3883, -1391, -644, 2370, -3404, 480, 6660, -5846, -9070, 7090, 2917, -13014, -290, 12723, -3362, -8521]
1046h521J5452k647j0749O365K830n480M594J7p923P014N518j3677P50J6992p890
1061B645j4196J5506Q135j8629j018J4884m574p306P026M82k671N516m506q084
1075f790R902K276j6519M420J6868j1939j1445J7516L779j7854L253J3368o181
1088F54n052O660q59L01N652p544m701J3926j526j6893Q630J4177j5679r311J6462
1103D897L49j5465N191R454o793j689M743l390J910M287r093q69J4724l569j3456
1118h769J1908J1185j5509m971J5126k954j2184O298M844o951N01K516m698K001
1132a657K563q521J453J2139o706j0857J3147P368j4601l83J4118l568q132O921
1146C284L050n545J258M75m315L513J817q191K921R320r153p939J2045J978j3883
$$ y = [-8521, 6931, 4284, -6465, -100, 2730, -2750, 1844, 1861, -6062, 952, 6470, -7207, -6457, 10535, 2645, -11551, 3955, 12090, -6539, -7557, 7327, 2753, -4553, 2473, 2955, 284, 5800, 1294, -6790, 3112, 5388, -11131, -6711, 10157, -1782, -13227, 4289, 8068, -9786, -6533, 6835, 654, -4398, 2262, 1403, 1704, 7356, -188, -4889, 9037, 7511, -9382, -752, 13425, -2254, -11565, 4897, 5246, -10219, -5028, 4426, -2367, -4056, 687, -2703, -793, 3494, -5599, -6468, 8256, 4687, -8769, 3139, 14324, -1185, -6156, 8970, 6016, -6168, 130, 4974, -1977, -1476, 1040, -3658, -1657, 906, -7615, -6162, 5977, -729, -11586, 1561, 8929, -5672, -6055, 8063, 4495, -3637, 3284, 6334, 789, 2047, 2522, -1793, 1720, 3537, -4654, -1733, 7587, -1566, -9505, 2540, 4518, -9365]
1161i365J952J1608m456o268O336K485k901J649q68j500O326j18q062M663Q032
1176I513r148n860J0559P15j1589K427Q557n188n298L343O17j122J358k306J06
1191c316O430j183o866N320O616q794l869J0237R81q746K716O547l946l812K182
1206D97M37n89j85l083N66N415l117o334N990M620q134j688R360L68p167K131
1222i13N252k973k761K261J217L9r68k719J932L463n318m519O006K665p663l49
1238e348R042p78p359K199N293k495l016K144K721P14k205j670L396K307n333
1253c88k836O235J393p468J00P081k495o799J649M470k021l149K188L191l65l031
1269b245p53M064J826m792m89O964P11o404J058N568k460n939J840M059j856k779
$$ y = [-9365, -7413, 4195, -261, -6529, -193, 2292, -609, 1040, 172, -1328, 4998, 4880, -3182, 1481, 9513, 365, -5495, 5064, 5779, -5810, -3383, 5174, -14, -5312, -1969, -1352, -2474, -1116, -3422, -3316, 3114, 1931, -4935, 385, 7001, -1793, -5662, 4575, 5556, -3190, -474, 6073, 2127, -1685, 497, 934, 345, 160, -2923, -2357, 3058, -59, -6393, -403, 4217, -3917, -5605, 3755, 4123, -3044, -913, 4339, 1366, -1395, 866, 2083, 2122, 1154, -1565, 367, 3830, -1488, -6007, -1, 2664, -4999, -5348, 3694, 2916, -4443, -2244, 3049, 554, -2462, -318, 2403, 3117, 912, -758, 2638, 4945, -388, -3224, 3011, 4404, -3064, -2964, 4117, 1622, -5177, -3528, 942, -1079, -4228, -2040, 1151, 786, -2245, -2998, 1066, 2892, -1900, -2389, 4575, 5286, -1118, -60, 5508, 3048, -2891, -1051, 3008, 1152, -1627]
1285a627J191K401j130l577p05L696M82m352J92N413l56n187J179M752k195l893
1301c716L099L856j495k584J238K111j024l133N96L555n6m003O13M200j724m915
1317c382J421L680j717k966K376L803j450l129N19K441j054k992J059L546q77
1332A278l664J001L601k122l667J637L596j267k740K072L284j654l713R11L391
1347A944o12l114J772L855j611l772J157L316j665l514J550L431j211l114P86
1362h02K554k154m472J360M334j270l438K517L804j908l017K067L181j488k427
1377a159J858L490j001l896M15L454k043m634K314M470k474l711K322K716k937
1392h16k835K243K144j245j976J225L135j219l902J178M025j591l185L691M347
$$ y = [-1627, -436, 1965, 835, -2742, -3447, 249, 731, -3621, -3429, 1984, 1628, -3559, -2380, 2372, 177, -3716, -617, 3239, 1744, -840, 398, 2509, 1485, -1648, -1052, 2503, 2447, -1556, -943, 3257, 1533, -3382, -1961, 1719, 2, -2964, -588, 3215, 1765, -1364, -845, 1596, 542, -2450, -1391, 2155, 1278, -2386, -1385, 2216, 94, -3573, -1936, 1660, 393, -2347, -275, 3009, 1355, -2358, -1447, 1944, 1332, -1782, -10, 3845, 2234, -1538, -381, 2935, 1270, -2244, -694, 2737, 1526, -1588, -802, 1752, -402, -4874, -3514, 820, -450, -3888, -1371, 2433, 525, -2492, -425, 2756, 1268, -1159, 699, 4189, 3188, -708, -293, 3161, 1118, -3516, -1202, 3268, 794, -2917, -595, 2121, -816, -3651, -1408, 736, -509, -2485, -1260, 1875, 656, -3246, -2068, 1957, 366, -2819, 872, 5219]
1407E219l330l033L289J337l587j786K082J426j268k387O67K824j737l932K194
1422b022M416k691l102M569L003m746k089L503O71k718n54K066J397r39k349P92
1438g93L347j449m062L284M351l593l195M366J159n339j397L166L34j966j99J420
1454e66J565k15l037Q64M436j958m280L657L990m188k740L738L55m101M07K844
1470G71J08m46l65l97K214j4l676Q47M119k595m219L910K763n178j722L880o5
1487f5k397J599J998K86L41j296m87K558n99m106J606M148l655l704M508J509
1503B244n174k71M182j64j757J109Q60K62k87k289j78L344j224m435L286M144
1519C652m810k886N451J302m773P93M161o04j745J69k73O23l17l503L18M472k072
$$ y = [5219, 1889, -1144, 2145, 3482, -105, -1891, 191, 1617, 349, -2038, -1371, 1453, -284, -4216, -2022, 2394, -297, -3399, 1170, 4173, -573, -2662, 841, 1512, -1206, -1760, 306, 1703, 764, -1585, -793, 2554, 1105, -2957, 327, 4678, 1085, -2110, 2256, 3415, -1924, -3321, -155, 179, -1787, -1986, -566, 999, 784, -2253, -1389, 3047, 1089, -3191, 466, 4456, 268, -2472, 1266, 1621, -2480, -2073, 771, 879, 433, 68, -329, 1885, 1871, -1805, -958, 3161, 566, -3653, 257, 3020, -2158, -3880, 0, -65, -2462, -863, 1135, 1421, 1762, 466, -21, 2537, 1938, -2168, -562, 3586, -69, -3773, 735, 2244, -2930, -3201, 981, 817, -940, 169, 1029, 1291, 1004, -1285, -1463, 1881, 657, -3778, -492, 3652, -1158, -4044, 1407, 2709, -2064, -1271, 2890, 2286, 541, 710, 437, 1060, 743, -2760, -2442, 2030, -42]
1536d2m390M120L752n149j978N624Q19m289J349K961j583j335r6p72J328J62l146
1553b665J518M623k556m223M212K765n455r03N371n94m040J646J437j816n94l15
1569a589l38J739P78k589K022M152l502l565M936J558n519N64M834k144l553J839
1585c77R88k210M4J81L8K515r5l057K009L425m588k757N606J077n120J401M351
1602C431k505k642K059L61j186R43k92j78K860j053m096K003K710m803j970N400
1618A042N19m812J802L378k599j614J855K65K02J596r07l30K846j546m403K690
1634a6L019m138j015N357n81m552J544J951k849j082J727o8N80J140j768p21K842
1651A370k121l672L908K961l953JN041j043m282J830J857k280j58K083j14L77
$$ y = [-42, -4432, -312, 3440, -1709, -3687, 1937, 2756, -1533, -184, 2777, 1194, -141, -237, -1009, 319, 481, -2665, -1147, 3476, 920, -3303, 909, 3674, -1781, -2684, 2687, 2093, -1947, -301, 1136, -680, -1274, -1589, -1927, -188, 590, -1999, 23, 4175, 673, -2892, 2044, 3602, -1917, -1353, 3481, 1337, -2216, -377, 611, -1599, -1555, -1374, -1336, 1179, 1084, -1973, 36, 3461, -1127, -3884, 1722, 2799, -2321, -920, 3431, 926, -1716, 343, 704, -482, 461, 169, -9, 2851, 1798, -2298, -295, 2415, -2388, -4358, 1042, 1561, -3251, -1449, 1929, -670, -2284, -429, -164, 38, 1634, 727, 397, 3243, 1697, -2706, -16, 3003, -1135, -2150, 3207, 2626, -1926, -382, 1569, -1280, -2362, -635, -703, -123, 1017, -751, -1472, 1370, -751, -4423, -515, 2446, -1507, -1506, 3535, 2492, -1790, 40, 1897, -383, -541, 1542, 1428, 1805]
1667A805M1k676N6K213k863k519M583K093m647p1M242k182m060K138J952j342
1683a237O69J633o9N47n76k393Q87K465k397j518M889J256m968J6L583k804l217
1700c234K345K259j188j32M74m60K8j058k156J705K668k074n93M279k42m562N09
1717a432L034k076j780L094J790j476m60N7j036L0j047j125K364K288k332o42
1733g49L088j147m114J014K848j579r38K761R90j937p95k02k64M61m87k60K654
1750A344J735k646j118K423j229l256J719L104j432p21J815l9k039j093k23J37
1766a519Q75nn6K243N93l252q43K315q63k150K224L060j102j232J180k83j611
1783d26q04L25R55J265m05n60J348n16l426l18K508m55j487K035K336j757j723
$$ y = [1805, 1846, -830, -774, 1439, -1424, -3943, 640, 2733, -1914, -1985, 2257, 75, -3985, -1847, 105, -1237, -568, 1065, 996, 1543, 967, -1426, -539, 1926, -471, -1989, 2900, 4156, -812, -796, 2787, -17, -3234, -889, 1370, 182, 50, 524, 64, 92, -966, -3122, -1417, 1251, -823, -1416, 2863, 2621, -1941, -1432, 1602, -474, -2254, 840, 2630, 1154, 694, 751, -285, -255, -1302, -2427, -63, 2225, -107, -749, 2339, 1192, -2922, -1908, 940, -639, -1577, 1184, 2174, 237, -558, -760, -1024, -563, -1050, -1310, 1344, 3079, 433, -685, 1738, 509, -2747, -1028, 2076, 644, -77, 1738, 1699, -340, -1433, -1656, -1519, -644, -649, -705, 1538, 2131, -1121, -1964, 351, -512, -2662, -438, 2622, 1520, 288, 1468, 1185, -426, -1230, -905, 50, 1315, 910, 350, 1698, 1182, -2244, -2562, -54, -509, -1996, 39, 2375, 618, -1105]
1800a105N03L8q38K9J194J726J146j145q39J079p45k903K45K666l86j445J496
1817G16J090k377k052L93P71j17L40J470J507R4j647q52J427o15j738J447K824
1834B681o35j611Q82M02k369j698J323J387l0k64O69Q18j389k389l61J128l22
1851a778r99J974K714j047j584J056Q14j388m69K066J834m29p69J25q1k106k120
1868b187L86J341l17r17J638J216j864j852Q19R77p42j26K139J456j070j157L51
1885I1L19j165q79J736K172L0n41R50J72j878j942L96R13j020o07R43N43j687
1903a454j853N54N70k71L11K290J853j57o34M60K51j393r64J076J234m49p67N99
1921A256J61k099j386J041O49m14L01J360L11j279j464j45J88o33l63J609J887
$$ y = [-1105, -602, -564, -1402, -1373, -179, 1547, 2693, 1548, 709, 1788, 1043, -1860, -1615, 1051, 665, -780, 716, 1806, -571, -2623, -2230, -1459, -1576, -1236, 234, 1741, 1835, 188, -664, 763, 148, -1590, -143, 2681, 2046, 435, 1317, 1719, -650, -2348, -1025, 362, 332, 68, 737, 1555, 166, -2223, -2584, -1456, -1778, -2777, -803, 1911, 864, -720, 336, 1150, -238, -707, 1359, 3193, 2764, 1995, 2120, 2039, -67, -2187, -1801, -460, -777, -1694, -56, 1160, -704, -2556, -1737, -760, -1502, -1628, 511, 1967, 897, -260, 91, 410, -755, -1634, 102, 2274, 2304, 1763, 2713, 2885, 1007, -935, -539, 374, -646, -1253, -310, 233, -1454, -3307, -2753, -2183, -2454, -2143, 147, 2000, 1843, 1209, 1669, 1920, 527, -437, 639, 1873, 1424, 657, 1256, 1417, -682, -2068, -1027, -378, -792, -491, 869, 1180, -99, -1563, -1708, -1520, -2153, -2516, -907, 980]
1938I80j85q36J251M77j330m17J689J038n56l67M30p12j958j674o1P03n68l85
1956b481J550J616j198j198R99Q26j004K9K073Q11q35l63J5j00r89j035R02J599
1974A217m6q24J345O97k065j832J028L68j640K56J444k50j030l52J76M13j48L8
1992a205J502K055j37j060J009N17k416r57J539p2j251L72Q49n72j190n37J70
2009a384L13J99j25J129J375j198j425J241J28k043J49K444J2q51R30P35p46o02
2027B81j72J00J120l69r84R20N92k337j389J421n3j650P07K248l66n77Q05J55
2045D52k21m2j40M46J228m21j168Q95N35k350p57J907j46j347J038J321r49p52
2063d71J91m22M4M8l09L96J354p66j296J399N94j850K27K137m05q75J155M75j159
$$ y = [980, 795, -41, 1210, 1687, 357, -60, 1629, 2667, 2111, 1744, 2174, 1462, -496, -2170, -2231, -1528, -2096, -2481, -931, 685, -513, -1711, -712, 114, -890, -861, 1212, 2023, 1188, 825, 840, 740, -249, -1284, -382, 1217, 1171, 347, 1692, 2389, 324, -1508, -480, -112, -1752, -1496, -52, -302, -1332, -1684, -1508, -1095, -1243, -1205, 297, 2352, 2215, 1155, 2164, 2681, 265, -692, 847, 775, -476, -104, 745, 173, -1017, -1554, -1384, -1071, -872, -997, 132, 1507, 309, -1116, 125, 253, -1790, -1641, 803, 815, -36, 894, 1629, 883, 281, 109, 209, 1329, 960, -24, 896, 1488, -849, -2238, -817, -870, -2520, -1813, 435, 69, -508, 297, 452, 231, 189, 49, 495, 1723, 1302, 134, 1029, 1564, -786, -1543, 364, 218, -1129, -91, 1230, 281, -471, -280, -702, -658, -610, -919, -523, 831, 65, -1231, 168, 762, -1088, -861, 1276, 871, -4, 1151, 1626, 467]
2082D67m22L0l30L16qp89N67J005j541r89J633K98j847P71J934q01q11J118Q8
2101F89j071K56J45r3P24j80p34R08O36j760n66J929k95j813J050J371j255p25
2119g84R41k86m19K18r2J7P98m88p90J293N27j895Q7K137o06j400J138R57j129
2138B24n41N89Nm26J49k58J03P46q55q08J272L81j727M81J602p71j159J251O32
2157H90j276r8P57k38r5J48n31N31O08r01m10J337J65j646P69J131j201r14J316
2176C42K69j172J00N59k18NL7l20N84M29r84m5J385m81j465Q22J060j164o34J357
2196D66j05q30J31L63j46M8q1k24P55M58j076o0J228n79j343Q82R02j099k56J112
2216E46P4q65J82K11k12J78k36k4O49O6j086R4P16n64j081J154Q26q28k28R48
$$ y = [467, 45, 75, -255, 61, 53, -736, -169, 836, -705, -1694, -61, 237, -1610, -839, 1095, 294, -517, 601, 689, -382, -126, 19, -74, 650, 470, -264, 644, 1280, -480, -1046, 883, 588, -1225, -175, 1196, -59, -784, 157, -129, -548, -330, -422, -405, 393, -95, -885, 408, 935, -960, -873, 1264, 658, -742, 396, 1353, 224, -317, 272, 277, -149, 0, -258, -155, 591, -264, -1072, 200, 581, -1146, -665, 937, 166, -993, 258, 890, -386, -484, 273, 35, -60, 88, -443, 88, 696, -205, -615, 722, 887, -759, 10, 1141, -60, -974, 342, 611, -561, -461, 98, -120, -115, -78, -398, 186, 615, -369, -414, 971, 490, -975, -153, 907, -257, -891, 466, 361, -469, -338, 25, -121, -73, -154, -378, 377, 835, -241, -301, 927, 348, -995, -113, 789, -310, -566, 546, 620, -245, -63, 148, -64, 114, -122, -146, 503, 569, -517, -423, 293, -271, -1352, -198, 628, -200, -428, 520]
2236E20r8p54J68J32J03L00j21n8N17q2j089J05Q29o55p02J138N37r86j31N25
2256A98l08o87N5M66L53N2j58J28M20l29r50N75R06o10m35J165M17r92n07M95
2276B54k49n84O3O56J75q6m48r8J87n57o52P49R25m37k36J065L05j172k84Q53
2296D29k7l42L87M48J33n67n97p5O5o23n02Q72Q59p40l20P52L8j123k5Q92K41
2317A75j46L67L55r1n20n09J47N92n31N0J031K26p25o02M96m01r29j9P68J66m45
2338e45K3K65j66o38j18P08P64M4K11R01J56r36n15N00k41q16L09P91r7n96m82
2359d78J58k11o58l5P07P10j85j23N25k99r14j41P83L04k22L88Q56J74p53j27
2379D59K92k31n63K77O87o2p81n24j02l97q58Q9O60N54j14K91O84l6n68j44Q15
$$ y = [520, 422, -332, -164, -32, 71, 371, 250, 192, 709, 627, -462, -357, 472, -183, -885, 253, 790, -196, -327, 198, -110, -797, -742, -276, 77, 129, -29, 99, 519, 190, -760, -185, 721, 111, -324, 841, 1258, 266, -241, 254, 5, -579, -516, 140, 315, 229, -219, -317, -130, -687, -1339, -590, 335, -102, -338, 727, 1032, -140, -424, 429, 402, 60, 447, 895, 1028, 461, -136, -211, -146, -769, -1271, -399, 460, -280, -600, 152, 190, -933, -958, -66, 175, 29, 396, 751, 660, 140, -369, -222, 370, -161, -111, 920, 1146, 421, -181, 315, -86, -1015, -1034, -266, -100, -545, -522, -257, -423, -1061, -1179, -471, 293, 337, 548, 1449, 1605, 669, 154, 654, 413, -403, -94, 697, 600, 4, -478, -320, -531, -1189, -1224, -517, 193, 8, -115, 410, 111, -803, -944, -161, 143, -79, 309, 1165, 1339, 586, 459, 751, 520, -43, 234, 921, 859, 78, -446, -548, -945, -1803, -1714, -1054, -500, -614, -323, 361, 325, -243, -387, 428]
2400D28L88k76L11P41j99q50n75J30j79n42J62P02L29n05m72K40l15j128J06Q04
2420g00K48k83M41N87k53m66JO42M80j1K91R99Jj029m49M5m99r41N6Q54j97n68
2442g51J31M2m46m08K32N71N97J23K11O72l1r90k07P62m9m83O75Q76l77o04p9
2463D67ro86l77J05N75N2m19l11K82m49j080L36R61K12k65R11Q42m11m30K33K3
2484E62n8J5J18M78no66o40J77m39q21K95Q55r7l94N99J86q08l08J62K66K31K08
2506h4M50K96R3o28k26M57J9n38Q83O34n23l87J4l03r27m3J07L6R1J68j66L65
2528b12j23o37J54Q29n5k12R39P37o48n83L37j63m53j01L49M55J00m04m35J22
2548dl55p98L05Q34j34m05O32L59r99k70M79j1P6L30M37L22J91n55k28K18j19
$$ y = [428, 816, 540, 851, 1592, 1393, 543, -32, 98, -81, -623, -461, 241, 570, 65, -407, -167, -482, -1610, -1504, -700, -452, -735, -294, 293, 40, -426, -425, 217, 697, 686, 977, 1976, 1977, 948, 499, 544, 45, -896, -840, 14, -183, -751, -620, -578, -1024, -1432, -1200, -629, -32, 91, 302, 974, 943, -47, -254, 508, 459, -24, 651, 1527, 1150, 546, 467, 458, -228, -605, -500, 75, 127, -292, -603, -321, -770, -1850, -1514, -553, -341, -606, 305, 1147, 736, 306, 539, 562, 504, 519, 637, 1115, 1110, 444, -196, -19, -458, -1279, -984, -129, -226, -620, -21, 165, -643, -951, -789, -523, -292, -84, 366, 662, 755, 127, -99, 358, 377, -161, 722, 1356, 833, 446, 460, 157, -770, -813, -706, -670, -579, -411, -577, -212, -335, -972, -818, 11, -44, -256, 683, 1420, 772, 189, 526, 363, -90, -191, 158, 613, 713, 309, -126, -4, -359, -1157, -852, -18, -152, -557, 75, 434, -565, -835, -356, -367, -291, 39, 476, 798, 989, 434, 206, 424, 305]
2569C05p14M52P45n04m84L36K6q75k39M60O4L9K67J64K18q6o10j8O34j71l16P82
2591D75O87o69n19O13k78q88L19M82l5K0K6j39o4k17p15K67P18k92m02Q92L33
2612F14p94l16N48j97k98M35M06Q0j49Ol34J56j86m98L52O58l04m24O56K1r21
2633d89j09N96j88j52L62M51j70j99l29j66K41k6l52N72P00m88k99M18j50q22
2653e99L41L71m8j30L71q7Mk89j93n8M08q0k49N13K96n86l32M46j08o00M08N19
2675C18l40o9K09j44n2j27j65J51M80o9m13O23J70q62j20N16j13m36M45M00j90
2696B12k48Oj24p0k2j76M04L26k54k95L53R5o27j9O37j44j07M17K09l20j79Mo8
2719A0k4Q0j79M13J34m70l74L38R0o59P1P24k9m49M14P9j21j71R1K2K74k18q3
$$ y = [305, -409, 43, 788, 284, -200, 136, 162, -713, -952, -492, -428, -389, -122, 42, 260, 174, -436, -454, 180, 9, -307, 475, 1162, 493, -26, 587, 309, -579, -260, 222, 187, 207, 233, 94, 30, -187, -902, -635, 83, -209, -611, 281, 614, -180, -496, 52, -145, -443, -8, 398, 478, 329, 335, 1, 157, -29, -527, -175, 483, 179, -245, 411, 432, -489, -598, -2, -190, -342, 20, 471, 301, 102, -227, -393, -152, -178, -530, 42, 742, 254, -45, 373, 223, -599, -258, 113, 65, -65, 306, 219, 223, -66, -259, -317, 91, 11, -238, 275, 571, -15, -347, 99, -9, -609, -201, 318, -22, -91, 118, -26, -78, -205, -370, -219, 261, 192, -221, 402, 572, -290, -410, 106, -7, -443, 2, 402, 212, -36, -30, -154, -224, -246, -422, -18, 308, 54, -241, 112, 207, -420, -439, 198, 54, -53, 364, 573, 253, 74, 78, 10, -14, 66, -113, 300, 434, -36, -410, -72, 18, -641, -570, 154, 125, -324, 90, 169, 48, -123, -32, -10, 264, 46, -37]
2742c7L36K66n70k58M70P0o39K80M65k40m42K81Q3l44r2J12L8K01n2j40M14Q4
2764B86m27q3O73j13m21K92L70j85m39J33J3k90M5Q2r3J81j6m94L46J58l90mN93
2787B17j66l99K90M00k34m42N03m8j87O7L47j32M6j25j32J69pl33j67L58q8l89
2809d52K34K95k76l12M07K14k40N8K40N5Q0k26j39K89%l97J32M36k55m85L14L26
2831B98l77k06L35l0j78jo8J98J1j58j25L83p3k37P7M85j91k45K68K38l25q8J46
2854A37J30k56l5Q5j12rk07l7L42n1m28K55M63k98k98L87P4k40q3J97J63j54l7
2877a2Q7J05q0k25K1M01q6m04J68L19j67m03J48K26k40j89O2K34l6m1k3K39J35
2900B39m09J96K55k51k13J65L22l75o5J59R6k59K5J16J03q6k14J99J25j28j71
$$ y = [-37, 299, 565, -5, -263, 207, 277, -362, -82, 383, 143, -299, -18, 65, -279, -371, -259, -221, -20, -72, -212, 202, 286, -141, -224, 449, 336, -85, 207, 577, 392, -47, 86, 99, -191, -146, -64, -157, 24, 8, -486, -140, 18, -372, -376, 217, 51, -348, -58, 342, 108, -334, 169, 121, -66, 1, 348, 216, 262, 137, 5, 174, 167, -166, -333, 25, -63, -452, -218, 77, -199, -511, -104, 110, -130, -72, 168, 223, 303, 77, -62, 227, 227, -170, -38, 398, 143, -342, -28, 298, -79, -285, 50, 20, -158, -159, -227, -29, -18, -176, -301, 82, 9, -228, -151, 334, 143, -102, 166, 404, 79, -9, 137, 267, 11, -24, 61, -51, -60, -267, -304, 38, -13, -441, -186, 277, -21, -319, 68, 142, -98, -181, 16, 179, 25, -12, 75, 180, 100, -125, -104, 297, 211, -193, -25, 294, 127, -276, -128, 98, -142, -331, -269, -35, -71, -112, -135, 104, 239, -170, 26, 281, 30, -183, -18, 304, -71, -136, 23, 119, -140, -115, 1, 104, 18, -196, 3, 128, 0, -171]
2921a71M1L25k65k22J88J99k13j96K37J36j48n6K92R8k46J05q3R6j42j07Q3K14
2943A65k15j31Q9J16j03k5OK11j91j54K07J10j12o1M3J26j77p3J25J37j55N7K32
2966B27n2j62n4P5J80k13j00J75J07l10p8l3K68j59JO3J59q1j36J43K47l33j22
2989a88K95O9k18j21L21m2k68QK42J06o9j78J51m9K7j21l7L2q2j57J98K37k25
3012f9j83K50R1j61o4K32M2p7O7rjj26l4l2K40k78q9K50J4j72o0K88K6l42Q6L33
3038B22j73j29q5J69O6k16m5J91K27k53o1L00P5l50L7K97j14l15J38J54q8j80
3060a33j87L32o0n7j87L67L8j47j4K84m9l12L2K99K7k73M0J15l3j16rM9J52j86
3084b8j05P2J61k30n2J82k3j90J11K23j06j80N7J54O5qj62J69Kl8q9R9J18k94
$$ y = [-171, -130, 195, -70, -292, -104, 95, -118, -314, -77, 59, -89, -145, 147, 245, -1, 104, 21, 117, -25, -132, -49, 165, -50, -181, -92, 24, -79, -104, -98, 113, -78, -232, -25, 85, -27, -88, -45, 81, -96, -169, -44, 93, -62, -5, 227, 175, 13, -41, 34, 214, 1, -99, 76, 183, -127, -205, -238, 30, -129, -128, -65, 94, 13, -123, 20, 267, -66, -188, 107, 176, -42, -163, 158, 116, -152, -144, 98, 204, 135, -43, 108, 59, 86, -35, -72, -40, -122, -279, -81, 156, -69, -252, -2, 89, -72, -136, 96, 138, 61, 128, 119, 118, -8, -42, -74, 166, -112, -201, 49, 63, -109, -169, 119, 145, -197, -111, 222, 49, -80, -165, 4, 70, -146, -191, 0, 227, -26, -87, 213, 288, -62, -25, 272, 158, -157, -19, 135, 47, -133, -320, 12, -48, -105, -292, 75, 113, -34, -48, 236, 187, -125, -93, 206, 233, -40, 0, 115, 82, -34, -43, 6, 158, -28, -133, -61, 100, -130, -182, 0, -23, -213, -102, 121, 15, -165, -108, 46, 111, 103, -59, 110, 112, 74, -15, 84, 202, -92]
3108i2K0L2r6k39K29J98j49P0l0M9J7M8j28J45J0q4j78J27J58k41RK79j65p6P7
3133a0K51j46j00N1j04J08j64j23P6K72l23rK36M1k29J03K38qj56N4J91j47L5
3156A37j23k1O8j62o7J71Q5k23O2J6L1j20Q3J72mj09M0L0K3n7j6L2L9j36k8K01
3182A24N0j68k1J15j08q7N5Mj11L4m0J89j48m0r5K18J44l3o2J72L7k14P1J28k20
3207fr8J39O4n6j29M4J11j23j94Q1RK22l6j80J57J68k85NK55k43K6J69J19l24
3231a05J63NJ07p1j04J04n5lL8j10J9o2j29RJ42J3k00L36M1k08P8J22k7m8O2M2
3257A59N1o2n5q4qq7J3PK13j14k05R3M2p6n6J21l5Q8L7M2Qk2j58RJ39K0j68K35
3285A47J09l3k24Q1J27l19n8J21L6N2k9q8k6K5j75J17K14L3r5m8K47j29j92Q3
$$ y = [-92, -72, -40, -136, -375, -146, 52, -97, -27, -57, -8, 9, 57, -71, 74, 84, 0, -178, -51, 107, -134, -125, 154, -11, -87, -10, 241, 95, -5, 46, -58, 50, -114, -237, -161, 111, -212, -221, 15, 56, -173, -70, 168, 160, 4, 58, 249, 102, 137, 14, -7, 61, -101, -168, 3, 88, -135, -73, -57, -26, -146, -63, 109, 105, -4, 36, 66, 89, 32, 16, 48, 87, -49, -77, 124, 174, 6, -15, 100, -8, -95, -40, -36, -147, -113, -153, 36, -112, -152, -247, -29, 115, 82, 20, 192, 229, 15, 86, 214, -6, -104, 35, 99, 43, -86, -42, 69, -54, -248, -167, -158, 64, 28, -152, 5, 173, -112, -107, 148, -95, -69, 100, 219, -105, 58, 63, 170, 99, -5, 99, 44, 41, 79, -31, -12, -74, -203, -194, -52, -39, -239, 97, 138, -70, 8, 130, 103, 55, 117, 159, 210, 148, 93, 9, 1, -86, -73, -66, 147, 33, -172, -79, -37, -113, -169, -48, -83, 5, 42, 84, 92, 70, -88, -79, 60, 80, -88, 147, 256, 223, -1, 80, 207, -112, -170, -49, -13, 39, 10, -78, -104, -79, -254, -137, 77, 110, 15, -33, 214, 85, -107, -24]
3309b4R2j25J8K23k17M8j2Nk4l4n3R3J62j64l2M5l0j50r8K17M3o1O8J23m0o1Q6
3336I8j46K85j89q8j6K41n1k29P8O5k19k09L22Q3l6k4O3j8l1m9l1K02j03j22J60
3361C6J64j96p4OJ47n4J0N8L2n8K3Lj98R7j44l0J97mk99J96J85o0j24J42oP3l4
3388H8KO2k0L9j61o5J8N6l1J27j73m1J03l3n8j78K56P2o7n0O8J1j62lJ27O0M2
3415H9j42J31m0K5m0R2R0j19p3O0K6j95K14k06l2J38k02M5R3O4j00Q5M8j44J67
3440G4J8q2j4k4N3k3K0j63J69J11k12p2K67kj46M7QJ0k03J54M6m6p5L2J02L3j37
3467e5r8K51j71O0O6kJ48j72o0J38q8p5L9QJ45j52p3P1l3Q3j11J76j0r0j07K18
3493A06q3m6L8l5j1J04n6R2k02J53j29J35n4j01q0K32Lo7j5L2M5j43jJ11l9Q3
$$ y = [-24, 68, -57, -39, 184, -33, 15, 3, 8, -16, -50, -103, -10, 152, -12, -44, 1, -29, -179, -277, -60, -17, -78, -10, 113, 73, 12, 98, -48, 237, 48, -40, -56, 185, 134, -95, -17, 48, -171, -380, -58, 25, -11, -35, 28, 10, -21, -70, -101, 101, -2, -124, 36, 200, 4, -70, -64, 83, 29, 39, 97, 129, 71, 94, 97, -101, -4, -148, -178, 19, 15, -284, -88, 97, 37, -87, 55, 49, 122, 88, 90, 152, 132, 171, 10, -55, -37, 19, -12, 115, -58, -99, 4, -29, -87, -265, -9, 63, -4, -54, 14, 25, -137, -140, -13, 47, 89, -53, 78, 38, 63, 23, 115, 205, 86, 13, 73, 99, -96, 118, -88, -120, 18, -184, -139, -46, 18, -82, 3, 51, -93, 74, 92, 10, -4, -28, 25, 2, 22, -141, 28, 139, -73, -145, 122, 120, -26, 21, 29, 39, -164, -10, 36, -10, -85, -53, 49, 82, -55, -153, 98, -73, -13, 53, 51, 199, 27, -33, 105, 17, -58, -19, -11, 134, -18, -91, -20, -53, 30, -81, 95, 85, -5, -112, 106, 23, -23, 15, -20, -31, 73, 17, 109, -93, 60, -69, 66, 12, -89, -169, 63, 66, -1, -16, 16, 61, -82, -83, 28, -11, 72]
3519G2n7K9N6j4m0M1j3j18K4O7q3j13J39nk5j42J50K95k88P6K2pj5p8k5R6K2o3
3547Cm8K00k54qJ18K4j5j38J21J21on7p3j07J04j33J03J66r5K1J0L9j31o0J02
3572GO2k10K0L8J03M1p5r1J86M6j70lQJ84j85N1J6P1k38J98M4j26P8J2o9NJ3m3
3600b7%J85j84J00L4p1j96O5J22j36J5J76J4o3o6J28j15pp5J62j73J85k02J56
3624B7K7r1j15J70q3J9n1J77J4j42J48k38M6L0N9r6K10j35n3R8K5j99O5K09J41
3649B62k26j00j0J30p8k9J7J10N6j46j5N1m1r0M5%o2J22n4J15j6j05R7rj45O2
3675e9K4J32m8j46K09j6r3q1J68k5mq7n0J99j05k7O8m2o2o8oJ23N9j26L7K1%j50
3703a55J31P2k08J29J07p9o8O4j6P8j19J9j0J30p3l7R7j3m9OJ13j2j15K8L6K0
$$ y = [72, 15, 44, 100, 86, 46, 87, 74, -44, -20, 47, -36, -149, -10, -15, -40, -182, -32, 263, -25, 51, 73, 66, 51, -27, -52, 44, 66, 3, -45, 155, -99, -107, 11, 35, 20, -118, 3, 124, 118, 61, -12, -119, -15, -148, -45, 121, 26, 47, 57, 96, -35, -95, 7, 69, -141, -121, -83, 20, 61, -14, -105, 81, 127, -43, -46, -38, 146, -39, 12, 28, 99, -139, 59, 103, -23, 55, 67, -2, 3, 16, -27, -27, 158, -26, 74, 108, 37, -159, -94, 28, -108, -93, 83, 97, 34, -32, 96, -19, -26, -101, 61, -112, 73, -129, 27, 54, -37, -152, 18, -65, -46, -97, 80, 94, -48, 100, -138, -92, -62, -3, -99, 111, -24, -77, 21, 46, -153, -88, 121, 262, 36, -64, -74, 56, -22, -51, -34, 76, 132, -14, -29, 22, -19, -109, -64, -64, -126, -4, -58, 57, 41, -64, 33, 24, -121, -59, -35, 97, 49, -97, 112, 96, 3, -78, 90, 65, 61, -26, -76, 123, 18, -9, 59, 17, -45, -113, -119, 4, 63, -63, -26, -5, -5, -155, -24, 48, -160, -31, 76, -3, -71, -7, -23, 55, -64, -45, -55, 75, 2, -35, 62, 49, 0, 6, 119, 107, -8, 20, 56, 76]
3729G6k27J20R9r6O2N0J10l6k66N8j5jR4o9J62q4m6j33J70q2mN0l4L8o3O2j10
3756a15K00j96L5J05NMP0p1j29P9P7j36N4R4n2J00r7m8Ko2R2j03J14n7J10q1J7
3783A1n3J03j37m2K87j91lK8J51j14P3q7l2Q2k11J82J7K3j64k6J83r9M8j90K60
3808I9L0j67R6K6n4j20K6K4n5R9L6Lq7M4q3K46j28k0Q3j19q5R6j4L1L9j49P7J2
3836a4J80k55J22N8j04N1p0R1o6KR6l9r9j4N3Po2j9pN8J20k2jM9j14k8M8lm6p5
3866a03K40j71k5n3N7q9K11m5L9P6o8or2K27k43M3M7N8r6j23J30R8j83P5l2kJ62
3893A32m4l8M5m7m9PM7j44lPP6j8p6J54j9J6j61J81j32L5o5J09J11j24j30R0O5
3920B5j5j56K54Nj83M2P1O5j24LON8l6K1K5M0l7o9O8p5jk2m3J57N6j89Q3j36J18
$$ y = [76, -151, -31, 68, -28, 34, 84, 194, 158, -108, -50, -65, -66, 28, -41, 121, 37, -9, -142, 28, -54, -58, -8, -42, -4, -67, -5, -115, 85, -111, -76, 29, 34, 38, 108, 37, -92, -13, 64, -72, -18, 76, 24, 124, 27, -21, -19, -81, 11, -92, 22, -35, 75, -6, 11, -42, 61, -76, -118, 169, -22, -25, 3, 154, 40, 113, 26, -6, 76, -135, 47, 64, 87, -77, -103, 80, -19, 29, -161, 99, 129, -38, 58, 84, 30, -90, -64, -40, -95, 4, 40, 43, -44, 0, -83, 163, 35, 15, 98, -21, -106, -10, -24, 7, 46, -103, -26, -14, 166, -89, 33, 91, -13, 38, -32, 59, -7, -5, 91, 52, -47, -61, -8, -1, -63, -82, -89, -31, 89, 67, 66, 115, 1, -27, 21, 18, -28, -103, 137, -34, -59, -112, -55, -144, 67, 22, 61, 137, 69, 63, -29, 198, -45, -2, 45, 103, 7, -116, 14, 112, -71, 4, -28, -30, 132, 88, 50, 95, 48, -1, 6, 53, -91, -94, -87, -11, -29, -105, 49, 30, 46, -115, 66, -66, -31, -96, 13, 124, 0, -130, -40, 25, 10, -146, 108, 113, -70, -28, 43, 108, -16, -13, -7, 51, 15, 36, 61, 101, 64, -5, 63, -12, -13, -35, -78, 79, 135, -54, 29, -107, 11]
3949A1l3m7N8M3k9J09j23j1j08J11J48j59q4J67j36N9M8Lj09j9R8m3J57k19M7
3974f1J11nj33Q9m6J56j24Nqj7Q9l11K20P2o1L2n4Q7o0m5Q7j1J04k04J33q7m5
4001h7n6K20j77L4m8QJ19n3J0L9J4N5j27P3M6n3J4P3M0j51M9qk8j95O2L1J70p4
4029@j05K13j3m9l9l7P9Pj91J72Q0m7k7m7q1J14o2J34j35J04N6ll9j24PO8p6m
4057d5P4K2jj31L1N6M4n7oJ01M8j98J58k0p0j3m8J01j00j36K14j7L5m9n7J20k7
4084B9O5j00O1O9k09j6J07ko3P1O4n4k0l4J62p7Mj20O4P3q8q7J30j9j13J48Qj18
4112f5J19o9O1l6m1Q3q8N3j4k1J32r0M7j00P1l5p4l6J5Q7pJ7JO5j86R4Q2o3m4
4141d2M7O6l9Ol4k6k4O2QJ83j82J3Q6j75J64k99K26J7j43J2P4n7N4l0l7P6m7K
$$ y = [11, -22, -69, -11, 32, 3, 112, -11, -22, -130, -19, 129, -30, -114, 53, -83, -24, 24, 27, -82, -101, -3, -46, 111, -108, -61, 50, 45, -88, 1, -45, 111, -13, -8, -16, -33, 56, -255, -35, 37, -24, 8, -46, 41, -19, -64, 23, 12, 116, -88, 45, -42, -87, -143, 77, -100, -66, -114, -106, 13, -40, -30, 9, 23, 78, -49, 24, 70, 17, 31, 104, 144, -7, 42, 34, 6, -189, -127, -96, 74, 0, -105, 108, 95, 46, 7, -30, 49, 56, -135, 37, 117, 70, 43, -4, -85, 29, -33, 101, -34, 70, 126, 123, 84, -40, -33, 35, -41, -45, 29, 51, 50, -81, -50, 6, 50, -7, -13, 88, 136, -62, 96, 76, 6, -7, -55, 46, -54, -190, 24, 7, 42, -7, -64, 56, 29, 94, -6, 55, 124, -85, -101, 6, 4, -59, 12, 76, 22, 2, -32, 130, 53, 57, -63, 1, 74, -14, -101, 29, 10, -103, 45, 53, -65, 54, -15, 46, 10, -31, 52, -36, 17, 3, -18, 114, 24, 71, -29, 42, 7, -67, -103, -88, -1, -8, 9, 10, 75, -111, -17, 65, 2, -42, 5, 71, 32, 38, 4, -22, -46, 16, 24, 207, 25, 38, 124, -51, 113, -186, 40, 57, -86, -74, 0, -57, -3, -33, -70, 6, -41, -39]
4169c9J9qJ2j5J01j46J67j80Q6J14j35j7m0J18r8o7R9m4LR2J1Q0j43o6L8n8R1
4196b5J0N6L1jn3mp3j3p1P2J28j13J43m4j14M7P4p7K6L3N0q0M5j20j8J0J04l3
4224a0j35J92j4l0N5N9j22K7l2N3n4M7j44J74r3K0q5kM3O5p7J80r8l8o4j5J48
4251E0j52J05j9N5J48j94R8j05n5J17l4J19j29k4J21j04o3qM8j8p6J35K8J3r1
4276c5J9j06J30r9N5J27m8p8O9L1j7o8o8k1N8k5K21j00J0r0m6M1P8l1l0j59J95
4303A3k4Pl3k7N1j2K37j12m0mM6n7J06l15J38L7j5r7N6n0K0J3J00j01N5O7K6J2
4331I7k8p6L2R8j24M6r1J09lN7N5j29r4J13m1p7Q5o0N0n9L7N4p7rj8NJ45j47j1
4360f1J06o4O2K5k6j7J05n6j17Q1m3k0p2K6O8j22j06K14J1O3o2R6r3R4j16N4j13
$$ y = [-39, -20, -28, -16, -31, 70, -76, 91, -89, -3, 111, -24, -41, -81, 37, -61, -128, -29, -73, -70, 22, 33, 113, -30, -96, -58, -116, -25, -15, 41, 72, 71, 18, 14, -59, -72, -143, -71, 57, -56, 87, 43, -71, -24, 50, -27, -1, 32, 82, 2, 47, -73, -91, -81, 23, -10, -145, 47, 33, 3, 58, 117, -5, 22, -10, 43, -11, 36, -108, 66, -27, -7, -92, -94, -51, 14, -63, 117, 19, -19, -83, -98, 50, -102, 3, -16, 39, 187, -7, 91, -14, -69, 48, 14, 133, 4, -20, 101, -3, -66, -74, -26, -44, -120, 15, 43, 56, -35, -16, -122, 8, -91, -36, 91, 43, -35, 34, 65, 48, -20, -88, -109, -51, -76, 145, 45, 55, -35, -81, -40, 38, 7, -23, -182, 13, -11, -4, -37, -64, -13, -25, 212, 100, 60, 56, 102, 45, 151, -164, -26, 11, -4, -101, -45, -95, -75, -62, 38, -63, -8, 59, 85, 97, 69, -7, 25, 123, -1, 45, -46, 63, 60, 117, 172, 43, -51, 62, 21, -56, 29, -31, 19, -40, -3, 51, -26, -35, -53, -48, 97, -50, -61, 45, -19, 43, 68, 42, 25, 130, 74, -43, 38, -5, -25, -97, -71, -3, -125, -231, -17, -6, 57, -5, 91, -2, 92, -24, 30, -83]
4387h3J53j78J34L2n7j20J29K9J1N2p5K6lOj62O4nR8r1J11r5pk4R7Pl6k0M6q6
4416d7L2p6K5RN2J6r2rJ55n1O6j18pJ02j72J58j10J49M7j85P1O7J2k26J01R9j38
4443g0P4j18J24k2nm1o4O8n3R1J73j40O4j07k3J70j36Q2m7k7j5QL9j06K7P0M5
4470F1m9p3J0r3K9O6K3M0n4Q2l6j4m5nR2k6N6j86J71r8O3l9j8j8J47j75O9Jq1
4499a00J16k6j1lM7L7n7O5J7j31K7j10K16l8p5J6P6m1k7M3k3M4N8j63MJ61j08
4526A4K0m7M5m2j83J78K06j69r8m0J83j3j30J11j49J03l3l1R6r8Q9j06J57%n2
4551A1r9J10M6m4n2J21j76O0M4Kq5RR4Q2j34n3J39m5j34J9O6p0K37r7k2n0op1
4579i8J44n6o7L4pQ0m8L8K7k1r4M9RK3K2j34R9j1Q1n1O0Jl8P3j74Q3Rrr1R0k5
$$ y = [-83, 70, -108, 26, 58, 1, -119, 10, 39, 50, 102, 27, 53, 50, 56, -106, -42, -47, 51, -40, 71, -24, -31, -55, 42, 49, 13, -7, 39, -47, -15, -91, -66, -57, -5, 11, -81, -90, 65, 14, 80, -38, -45, 57, -115, 43, -67, 82, 129, -56, 15, 82, 94, -132, -31, 68, -70, 4, -114, 10, -12, -17, -58, -122, -54, -107, -16, 157, 17, 81, -26, -49, 121, -15, 67, 20, -7, -22, -14, 25, -81, -54, 16, 61, 12, -61, -51, -144, -115, -49, -26, 14, -40, 42, 6, -8, -53, -58, 34, 8, 64, -122, 49, -49, 14, -25, -43, -61, 86, -89, -20, -19, -100, 16, -10, -21, -24, 23, 60, 3, 68, 85, -46, -19, -129, 87, 49, -26, -10, 66, 25, -2, 41, 18, 62, 120, -43, -39, 122, 14, 34, -13, 32, -10, -193, -15, 191, 22, -76, -116, 67, 54, -76, 35, -114, -11, -44, -75, 21, -77, 12, -94, 63, 63, 11, -88, 22, 68, 24, -28, 93, -83, -23, 21, 23, -62, -53, 41, 123, -11, -64, 75, 30, -104, -85, -19, -89, 148, 51, 29, -21, -27, -98, 46, -10, -77, -43, -50, 30, -18, 20, 47, 26, -68, -19, -10, 13, 35, -99, 0, -11, 70, 19, 79, 80, 42, 115, -59, 24, 33, 24, -67, 23, -2]
4610bm7K07j61q4P9k8J07j01o2J01O1n1M4k8M6k0m9j01j2N9N3O6r9m1J9mP4Q0
4638A06m7j17J40j01L6J40k01J6R0q4o2O9Q0r2L8J3l5P3j02K0M8N6j8j13Ll6L4
4665d6O2J00l3j23P2%M1l7P0r1JO6r3Q8l3p9Mm2R4o3N7J6K0o6k3R3j28J42r9j0
4695d0p4J70j60J85j08N8r9M5R9j22N1Qn7O7m5j47K54j74k2J73L9o1j24O2J32
4720A10j32O6j1J20k81NR1Q5m9%K3K7N9k44J48o0M6M0l8l3K4j69Q8J04n3l2k3
4747h9J18o9l9j9J47n6J2N2L5l0l7m0O3p0pL1r7J31j03J22j42Q1j1M6K9k4k3J05
4775A16q8r6J2O6np4Q0q0O8l2J13m9K6j31K4N3Lq9m3J78j67N8L9M6k9r1J53k3
4803C8N9n5q9J79q6m2k8J84q7m1j12O1o7O5L1m6J5L9k2K1N0j86M5q9J91K3j22
$$ y = [-2, -49, 158, -3, -87, -8, -36, 71, -30, -92, 9, 70, 19, 63, 35, 81, 61, 12, -89, -101, -42, 11, 77, -22, -63, -44, -48, 26, 106, 59, -58, 82, -19, 17, 157, -44, -28, 62, -22, -84, -15, 65, -27, 11, 24, -11, 62, -40, -20, 28, 84, 66, -47, -44, -80, -46, 16, 116, 83, -40, 32, 32, 73, 36, 106, 15, 16, 82, -11, 77, 44, -35, -31, -73, 21, -42, 15, 31, 51, -15, -38, 55, -73, 69, -30, -40, -114, 56, -104, 81, -27, 31, -68, -23, 76, -46, 5, 13, -44, 23, -22, -169, 85, -89, -111, 62, 101, 40, -84, -22, 110, -22, 44, 33, 153, -128, -123, -32, 53, 4, 4, 27, 54, 113, -131, 17, -43, 3, 43, 5, -28, -4, -173, -85, 19, -34, -66, -89, 29, -40, -79, -98, 49, -7, 5, 57, 92, 62, 25, -15, 48, -22, -29, 2, -95, 36, -67, 55, -87, -6, -17, 29, 58, 34, 11, 116, 28, -68, -56, 10, 5, -69, 11, -69, -1, -33, 80, 31, 57, -74, -50, 3, 6, -83, -126, 52, -115, -57, -18, 28, -1, -92, 61, 38, 97, 42, -47, 132, 46, 4, -24, 160, 73, 32, -80, -19, -86, -21, 10, -36, -21, 18, -4, 17, 67, -119, -74, -163, 28, 51, -71]
4830g1J22J6j46J14Q1r4N1LM4j1j71L9j7P6j0j20LJ97j69j16K63L5k20J18P4R1
4856A82j72m6J18j7j18j2j2J47j29Q5J12j39r3N5K6L6j5j0j9KN1j26N4K02j57
4881Ej00L1J58j31O7J48j02k2k0P4r8o3k8q1J79p1j17J25O7M4j30N5K6j7O2J28
4907A89j20j05J5K17q8j45L8l2O0j20L4Q3j37J04q0R3q1J06j25J68j25kn1K19
4931A15o7k00K23R0j19M9pN1P1k11oJ07M1j61m5N0O5j54M7N9Q3p9j24J46m0m1
4957e7L9J14n4m2r6J21M5r5JR7P4k25N1K28j19n1o0jJ59l02J60j7Lk14J19J06
4983a6K0l3Q5K1J1p9JN8j4L7j27P2j30n2J6J80l4j03j9M1P8r0k2J81K7k38J63
5010C4K0pj08J65j31N8n9j02J78J13j76L7R6j08l6j2J45j47k1j23J77r9j0L2R4
$$ y = [-71, 51, 67, -79, 35, 116, 22, 73, 76, 120, 109, -62, -23, -40, 36, 26, -94, -91, 106, -63, -179, 84, 119, -101, 17, 91, 182, 10, -36, 82, 65, -53, -65, -77, 70, -59, 26, 138, -1, -94, -39, -13, 23, 8, -2, -21, -19, 32, -94, -40, 162, 5, -95, -64, 94, -37, 30, 178, 76, 54, 34, 108, 10, -53, -81, -162, 17, -54, -171, -46, 21, 65, -65, -10, 16, -1, 61, 189, 69, -36, -21, 196, 108, -37, 1, -31, 29, -91, -57, 26, -111, -7, -87, 6, -75, 31, -94, 74, -51, -53, -104, 115, 48, -152, 71, 161, 42, 91, 84, 135, 206, -5, -11, 96, 137, -24, -69, -19, 46, -108, -61, -2, 81, 2, -122, 24, -16, -57, -18, 96, 42, 0, -96, 25, 70, -25, -24, 73, 147, -78, -27, 201, 82, 31, -29, -30, 129, -173, -13, -30, -27, -241, -122, -16, 4, -29, 56, 77, 88, 9, 10, 68, 54, 91, -36, 36, -94, -146, -130, 50, 16, -87, -106, -65, 13, -77, -99, 82, 109, -129, 34, 54, 47, -61, 104, -27, 31, -28, -130, 48, 161, -15, 22, 118, 10, -26, -38, 107, -40, -61, -184, -7, -106, -116, -84, 10]
5035A0j14J1L0J53K0j08P0R4l3k21Q6m5O1m0nL9p4M6K4kN3q3RKRQk4N5lj39R3
5066a8Q4L1r8L8J26l7j67J30j10R4j03N4J14j00o9J08j59l4m1J47J00J1j29OJ17
5091I5l7n4M6J8j09R1O0o6l1n0o9Q5N5q6n8J59n4o9N5Nj1N8j7J6j1p3K20j19j7
5120C2L8%O9j78m4J69p3j1j13J57Kj23j48J97K4n4m4J17O1o8o4pK82k37J8J78
5146A80r2o1j17P1J29j32J5J16Rj47j61J80M9l6j36J7J13j00k2Q8k5L5J1N9k5
5171A8j1O1N9O3k15n7R6M2N1k97R8J9k9j9R6k2p1N9O0J12m8j24O6L6q4o1J58P0
5199A26k19J56p9K13k35l8J79j41P9r1L7k9J03n8o2k5j28m5K44N6p4R2J22j15
5223F8o8QJ34l2o1k6P7N9m1j81J75j40j01K2J49k3o6OJ73O9l00k8L36j41j44Q5
$$ y = [10, -104, -93, -63, 90, 110, 2, 72, 166, 133, -88, -2, -47, 14, -26, -31, 8, -66, -20, 4, 2, 55, -28, -19, -17, -8, 0, -24, 31, 28, -111, -18, 66, 97, -1, 37, 163, 126, -41, 89, -21, 73, -30, 24, 138, 38, -31, 77, -82, -116, -157, -10, 90, 101, -28, -22, 95, 58, 4, 50, 68, -41, 50, 110, 44, 13, -37, -106, -21, 34, -52, -110, 49, -5, -74, -19, -14, -25, 33, 16, 32, 21, -52, 168, 49, 32, 70, 70, 139, -39, -83, 86, 13, 2, -111, 46, 48, -75, -223, -26, -2, -56, -100, 17, 78, 10, -54, -61, 221, -16, 2, 180, 88, 27, -90, -19, 110, -22, -7, 109, 118, -29, -190, -10, 39, 3, -133, -116, -3, -103, -125, -37, -62, -27, -16, 43, 18, 7, 68, 127, 190, -25, -82, 14, 56, 107, -190, -92, -73, -102, -121, -25, -47, -118, -59, 1, 113, 65, -59, 7, 43, -41, -102, 56, 126, -93, 63, -16, 197, -38, -76, 103, -38, 41, -50, -13, -42, 61, 3, -59, -84, -212, -257, -13, 43, -31, 61, 183, 68, 0, 8, 142, 110, 49, 23, 100, 159, 118, -63, 112, -28, -129, -107, 42, 19, -47, -41, 132, 201, -99, -127, 209, 68, -76, 9]
5249Ij03K76j82j11K01P2j63l2J89j35j51J72Q3j50r0L1J01k6j02J28kM0j41L7
5273d9K0O0j39R9J63q8N7%q2L9n1kO6j0j01j1J78k4j79p2J10K1r4P7o3m7L9m9
5301a32K06pj05J55n5p4N5jRJ00j59n1J7N9o4j0P7K6j81N6J15j08o5R9J17j46
5327f7q2Q5K05j15j72K2K47K8j62L5J60j32j14J0N7L2J2k6N1j39Q6j19R2Nr1k0
5353a12J98j68P3M6J2NMj02J70j31P9p1O8l4J40k36J44J6j80J04Mrj57L6J46p4
5379b9j89J88k9o1K4l2R9J9r5J31J89j21j13M8J08p8k43J57M9j5j21J50L8Kk59
5404a83J01O1K7q1O1J99j01j44M3M5j25J2K5K28k48M1p1J04N9j18Q8M1N1j70M5
5429a0J19j23o6J6J23j41q8K59o8m7p0R0R2k2m8nJ15j4j04Q8K0j30o2J05J03k09
$$ y = [9, -94, 182, 0, -111, 90, 162, -1, -33, 156, 21, -130, 42, 125, -25, -115, -84, 17, -9, -111, 17, 15, 55, -86, -49, -29, 31, -108, -9, 154, 66, 123, 123, 41, 80, 29, 27, 93, 83, -18, -29, 149, 125, -54, -126, -16, 5, -89, -12, -75, -122, -83, -132, 74, 67, -38, 117, 62, -12, 43, 42, 51, 151, -8, -59, -42, 17, -47, -57, 20, 46, -135, -79, 36, -72, -137, -38, 79, -67, -149, -64, 141, 26, -146, -124, 123, 151, -11, 24, 184, 52, -62, -52, 5, 37, 49, 23, 74, -65, 21, -98, -6, -1, -92, -112, 86, -82, -9, 37, 49, 54, 58, -44, 126, -5, 74, 3, 71, 37, 177, -59, 85, 101, -79, 25, 29, 20, -137, -101, 45, -29, -218, -30, -59, -120, -96, -128, -29, -10, -105, 26, 215, 94, -19, 29, 137, 59, -184, -27, 22, 7, -114, 36, 74, 76, -183, -82, -21, 6, -75, -14, 185, 84, -60, -17, 28, -97, -85, -60, 168, -80, -39, -110, -6, 53, -65, 23, 64, 115, -55, -10, 109, -14, -80, -64, 59, -82, -170, 89, 21, -26, -96, -6, 86, 64, 16, 11, 126, 112, 8, 96, 116, -14, -76, 29, 132, -77]
5455g7j0Q7Q3k8j31o4J08p0r2J31J04r4K0k5M9j08j24L49J3j35J13K2M7j72L5
5480C1m0J03r3j6j3R3K6k18J41k9j13m3J88j8O9j45LK12k41P6O9m0Q9j26N2J74
5506A91k33o2R2l5p1O0N9J10j81m5P0O3j39p8J40K3Po8J49J8m4o1J39pNl9J16
5533A79o2j17QM8k4j08JJ92j28r8N7k6Q2r6n3J3O7O1J13q3R2j85M6J69j39KO9
5560H0k1R5j12j2l1QK3o5p3J36o2j05K06m6j12j2N3J04p2PJ11L4p8q3N0O2j20
5587c5r3K94L0k08LR1o4j71R5J83n3q7p3J77r4j39mK42K5q6n9K56j38m2j29J80
5613A01L2n9M4m6J1j70J46k4j02K0n3J11Nl4p5J25n6J3k41K08K9L5k4P0n5rk8
$$ y = [-77, -87, 0, 83, 55, -76, -140, -32, -102, -194, -63, 41, -53, -33, -58, -9, -117, -241, 108, 121, -14, 99, 121, 168, -4, 31, -9, 94, 1, -15, -28, 65, 91, -127, 14, -15, -128, -171, 17, -1, 68, -77, -74, 138, -103, -27, 42, 2, 91, -35, 17, 191, -42, -104, -12, -47, -118, -58, 1, 111, -70, -115, -45, 18, -121, -199, -59, -36, -29, -97, 52, 70, 26, -35, 104, 97, 102, 63, 179, 117, 0, 8, 56, 32, -76, -75, 117, -11, -109, -52, -78, 4, -92, -145, -132, -65, -4, 109, 26, 118, -67, -21, 148, 9, 11, 80, 59, 154, 42, 30, -1, 7, 30, -35, -108, 28, -34, -139, 67, 21, -91, -103, -50, 54, -18, -11, 100, 134, 56, -27, 23, 85, -35, -128, 166, 196, -12, -9, 82, 18, -153, -58, 125, 72, -15, -88, 89, -5, -144, -148, 94, 119, 33, -26, 230, 92, 50, -79, 101, 133, 74, 118, 72, 83, -87, 59, 35, -67, -47, -100, 11, 16, -18, -93, 32, -24, -11, -252, -44, -15, 20, -4, 66, 11, 2, -26]
$$ [...]
8191B2
##END NTUPLES=NMR FID
##END=
