##TITLE=1H_Pr 3513
 CDCl3, 8 sc, 
 6.2.2019
##JCAMPDX= 6.0         $$ Bruker NMR JCAMP-DX V2.0
##DATA TYPE= NMR FID
##DATA CLASS= NTUPLES
##ORIGIN= UXNMR, Bruker Analytische Messtechnik GmbH
##OWNER= root
$$ XWIN-NMR		Version 3.5
$$ Wed Feb  6 14:31:58 2019 Russian Standard Time (UT+4h)  she@DPX200
##.OBSERVE FREQUENCY= 200.1313
##.OBSERVE NUCLEUS= ^1H
##.DELAY= (6, 6)
##.ACQUISITION MODE= SIMULTANEOUS
##.ACQUISITION SCHEME= undefined
##.AVERAGES= 8
##.DIGITISER RES= 18
##SPECTROMETER/DATA SYSTEM= spect
##.PULSE SEQUENCE= zg30
##.SOLVENT NAME= CDCl3
##.SHIFT REFERENCE= (INTERNAL, CDCl3, 0, 15.7039)
##AUDIT TRAIL= $$ (NUMBER, WHEN, WHO, WHERE, WHAT)
$$ ##TITLE= Audit trail, XWIN-NMR		Version 3.5
$$ ##JCAMPDX= 5.01
$$ ##ORIGIN= Bruker BioSpin GmbH
$$ ##OWNER= she
$$ F:/spectra/data/she/nmr/H-F/1/audita.txt
$$ ##AUDIT TRAIL=  $$ (NUMBER, WHEN, WHO, WHERE, WHAT)
(   1,<2019-02-06 14:30:44.60 +0400>,<she>,<DPX200>,
      <created by zg, POWCHK disabled, PULCHK disabled
       configuration hash MD5:
       00 E9 B6 7A A2 85 ED C7 34 08 36 98 17 FE 4E 26
       data hash MD5: 16K
       B7 32 D9 1B 04 2B 4B A2 EE 87 3A 76 F6 55 58 03>)
$$ ##END=
$$ 
$$ hash MD5
$$ 49 67 DA 67 54 12 18 B8 8A 9B D7 3F E1 B1 38 7C
##$RELAX= 
##$RELAX= 
##$RELAX= 
##$RELAX= 
##$RELAX= 
##$RELAX= 
$$ Bruker specific parameters
$$ --------------------------
##$DU= <F:/spectra>
##$EXPNO= 1
##$NAME= <H-F>
##$PROCNO= 1
##$TYPE= <nmr>
##$USER= <she>
##$AMP= (0..31)
100 100 100 100 100 100 100 100 100 100 100 100 100 100 100 100 100 100 
100 100 100 100 100 100 100 100 100 100 100 100 100 100 
##$AQSEQ= 0
##$AQ_mod= 1
##$AUNM= <au_zg>
##$AUTOPOS= <>
##$BF1= 200.13
##$BF2= 200.13
##$BF3= 200.13
##$BF4= 200.13
##$BF5= 200.13
##$BF6= 200.13
##$BF7= 200.13
##$BF8= 200.13
##$BYTORDA= 1
##$CFDGTYP= 0
##$CFRGTYP= 5
##$CHEMSTR= <none>
##$CNST= (0..31)
1 1 145 1 1 1 1 1 1 1 1 1 1 1 1 1 1 1 1 1 1 1 1 1 1 1 1 1 1 1 1 1 
##$CPDPRG= <>
##$CPDPRG1= <>
##$CPDPRG2= <>
##$CPDPRG3= <>
##$CPDPRG4= <mlev>
##$CPDPRG5= <mlev>
##$CPDPRG6= <mlev>
##$CPDPRG7= <mlev>
##$CPDPRG8= <mlev>
##$CPDPRGB= <>
##$CPDPRGT= <>
##$D= (0..31)
0 1.2 0 0 0 0 0 0 0 0 0 0.03 0 0 0 0 0 0 0 0 0 0 0 0 0 0 0 0 0 0 0 0 
##$DATE= 1549449044
##$DBL= (0..7)
120 120 120 120 120 120 120 120 
##$DBP= (0..7)
150 150 150 150 150 150 150 150 
##$DBP07= 0
##$DBPNAM0= <>
##$DBPNAM1= <>
##$DBPNAM2= <>
##$DBPNAM3= <>
##$DBPNAM4= <>
##$DBPNAM5= <>
##$DBPNAM6= <>
##$DBPNAM7= <>
##$DBPOAL= (0..7)
0.5 0.5 0.5 0.5 0.5 0.5 0.5 0.5 
##$DBPOFFS= (0..7)
0 0 0 0 0 0 0 0 
##$DE= 6
##$DECBNUC= <off>
##$DECIM= 32
##$DECNUC= <off>
##$DECSTAT= 4
##$DIGMOD= 1
##$DIGTYP= 9
##$DL= (0..7)
0 120 120 120 120 120 120 120 
##$DP= (0..7)
150 150 150 150 150 150 150 150 
##$DP07= 0
##$DPNAME0= <>
##$DPNAME1= <>
##$DPNAME2= <>
##$DPNAME3= <>
##$DPNAME4= <>
##$DPNAME5= <>
##$DPNAME6= <>
##$DPNAME7= <>
##$DPOAL= (0..7)
0.5 0.5 0.5 0.5 0.5 0.5 0.5 0.5 
##$DPOFFS= (0..7)
0 0 0 0 0 0 0 0 
##$DQDMODE= 0
##$DR= 18
##$DS= 0
##$DSLIST= <SSSSSSSSSSSSSSS>
##$DSPFIRM= 0
$$ [...]
##$SUBNAM2= <"">
##$SUBNAM3= <"">
##$SUBNAM4= <"">
##$SUBNAM5= <"">
##$SUBNAM6= <"">
##$SUBNAM7= <"">
##$SUBNAM8= <"">
##$SUBNAM9= <"">
##$SW= 20.0189088683792
##$SWIBOX= (0..15)
0 0 2 0 0 0 0 0 0 0 0 0 0 0 0 0 
##$SW_h= 4006.41025641026
##$TD= 16384
##$TD0= 1
##$TE= 0
##$TE2= 300
##$TE3= 300
##$TEG= 300
##$TL= (0..7)
0 120 120 120 120 120 120 120 
##$TP= (0..7)
150 150 150 150 150 150 150 150 
##$TP07= 0
##$TPNAME0= <>
##$TPNAME1= <>
##$TPNAME2= <>
##$TPNAME3= <>
##$TPNAME4= <>
##$TPNAME5= <>
##$TPNAME6= <>
##$TPNAME7= <>
##$TPOAL= (0..7)
0.5 0.5 0.5 0.5 0.5 0.5 0.5 0.5 
##$TPOFFS= (0..7)
0 0 0 0 0 0 0 0 
##$TUNHIN= 0
##$TUNHOUT= 0
##$TUNXOUT= 0
##$USERA1= <user>
##$USERA2= <user>
##$USERA3= <user>
##$USERA4= <user>
##$USERA5= <user>
##$V9= 5
##$VALIST= <valist>
##$VCLIST= <CCCCCCCCCCCCCCC>
##$VD= 0
##$VDLIST= <DDDDDDDDDDDDDDD>
##$VPLIST= <PPPPPPPPPPPPPPP>
##$VTLIST= <TTTTTTTTTTTTTTT>
##$WBST= 1024
##$WBSW= 4
##$XGAIN= (0..3)
0 0 0 0 
##$XL= 0
##$YL= 0
##$YMAX_a= 160014
##$YMIN_a= -175570
##$ZGOPTNS= <>
##$ZL1= 120
##$ZL2= 120
##$ZL3= 120
##$ZL4= 120
##$ABSF1= 10
##$ABSF2= 0
##$ABSG= 5
##$ABSL= 3
##$ALPHA= 0
##$AQORDER= 0
##$ASSFAC= 0
##$ASSFACI= 0
##$ASSFACX= 0
##$ASSWID= 0
##$AUNMP= <proc_1d>
##$AZFE= 0.1
##$AZFW= 0.1
##$BCFW= 1
##$BC_mod= 2
##$BYTORDP= 1
##$COROFFS= 0
##$CY= 11.3945322036743
##$DATMOD= 1
##$DC= 2
##$DFILT= <>
##$DTYPP= 0
##$F1P= 18.9103706918063
##$F2P= -1.10871071338519
##$FCOR= 0.5
##$FTSIZE= 0
##$FT_mod= 4
##$GAMMA= 1
##$GB= 0.15
##$INTBC= 1
##$INTSCL= 1
##$ISEN= 128
##$LB= 0.24
##$LEV0= 0
##$LPBIN= 0
##$MAXI= 10000
##$MC2= 0
##$MEAN= 0
##$ME_mod= 0
##$MI= 1.114404
##$NCOEF= 0
##$NC_proc= 0
##$NLEV= 6
##$NOISF1= 3.799351
##$NOISF2= 2.8
##$NSP= 1
##$NTH_PI= 0
##$NZP= 0
##$OFFSET= 15.70392
##$PC= 1
##$PHC0= -9037.934
##$PHC1= 12.00004
##$PH_mod= 1
##$PKNL= yes
##$PPARMOD= 0
##$PSCAL= 0
##$PSIGN= 0
##$REVERSE= no
##$SF= 200.130013532006
##$SI= 16384
##$SIGF1= 3
##$SIGF2= 2
##$SINO= 400
##$SIOLD= 16384
##$SREGLST= <1H.CDCl3>
##$SSB= 0
##$STSI= 0
##$STSR= 0
##$SW_p= 3612.71676300578
##$SYMM= 0
##$S_DEV= 0
##$TDeff= 0
##$TDoff= 0
##$TI= <>
##$TILT= no
##$TM1= 0
##$TM2= 0
##$TOPLEV= 0
##$USERP1= <user>
##$USERP2= <user>
##$USERP3= <user>
##$USERP4= <user>
##$USERP5= <user>
##$WDW= 1
##$XDIM= 8192
##$YMAX_p= 0
##$YMIN_p= 0
$$ End of Bruker specific parameters
$$ ---------------------------------
##NTUPLES= NMR FID
##VAR_NAME=  TIME,          FID/REAL,        FID/IMAG
##SYMBOL=    X,             R,               I
##VAR_TYPE=  INDEPENDENT,   DEPENDENT,       DEPENDENT
##VAR_FORM=  AFFN,          ASDF,            ASDF
##VAR_DIM=   8192,          8192,            8192
##UNITS=     SECONDS,       ARBITRARY UNITS, ARBITRARY UNITS
##FACTOR=    0.0002496,     1,               1
##FIRST=     0,             0,               0
##LAST=      2.0444736,     0,               0
##MIN=       0,             -175570,         0
##MAX=       2.0444736,     160014,          0
$$ Real data points
##PAGE= N=1
##DATA TABLE= (X++(R..R)), XYDATA
$$ [...]
2876F84J239m359L047J647m471J553L044m048P75L507m428K95M033l681n26M150
2892B461k686j710M413k561k639M753j210l174M172q20l678L897L91m394L425
2907F40J251m495K806K022m372J585K941m335Q86L527l711J55L659l357q14M484
2923B872l022k104M443j890k602M346j429l077M198p07l626L541O73l962K951
2938F05J328m026K196J979m305J775K972m095J059L339m175k89M450l866q73M328
2954B402k721j753M240k138k698M675j547l204M204l48l795L933M10m354L549
2969H55J565m638K173K365m283J572L092m312O40L466l576m24L802l086j021M463
2985B653l114k179M808k067k608M562j679k840M266o65l676L673N08m216L128
$$ y = [684, 1923, -2436, 611, 2258, -2213, -660, 2384, -1664, -889, 2618, -1810, -1515, 2518, -1163, -1689, 2461, -225, -1935, 2478, -83, -2722, 2031, 821, -2353, 1819, 999, -2679, 1218, 1609, -2785, 640, 1891, -2604, 202, 2224, -2148, -563, 2378, -1957, -1071, 2456, -1255, -1100, 2559, -798, -1612, 2872, -150, -2254, 2189, 299, -2303, 2043, 614, -2463, 1735, 1028, -2598, 943, 1616, -2346, 605, 1933, -2093, 103, 2082, -2223, -448, 2524, -1571, -512, 2827, -1348, -1637, 2813, -1053, -1926, 2402, -319, -2072, 2168, 30, -2668, 2007, 460, -2744, 1460, 1112, -2683, 1250, 1660, -2694, 855, 2420, -2218, -45, 2320, -1963, -391, 2701, -1611, -971, 2495, -1081, -1505, 2297, -789, -1810, 2653, -461, -2640, 2168, 101, -2507, 2055, 376, -2464, 1802, 1137, -2539, 1134, 1642, -2574, 554]
3000E54J525m281K468K103m578J319L062m193J078L507m168J07M262m004p50M428
3016B439k802j657M222k100k434M593j537k970L969m16l813L680M70m324L373
3031F93J325m434K035K369l959J519K903m387J053L706m448Q5M401l820q13M726
3047B954l319j972M479j723l090M607j155l274M091k66m406M323L46m306L417
3062G06J340m528K596K335m766J631L087m019N41L770l986n3M259l656j143M453
3078B567k858k108M493j665k729M545j623l393M106j25l774L813K82m311L670
3093H90J404m607K273K585m755J926K931m559J124L603m181j24L856l199q77M284
3109B574l066j805M612k004k884M346j141l175M231l17m009M082L86m499L299
$$ y = [554, 2079, -2202, 266, 2369, -2209, -890, 2172, -2021, -943, 2564, -1604, -1497, 2765, -1239, -1989, 2439, -363, -2020, 2202, 102, -2332, 2261, 724, -2246, 1723, 1307, -2506, 1174, 1644, -2680, 693, 2018, -2416, -381, 1988, -1971, -452, 2451, -1936, -883, 2823, -1625, -1540, 2861, -959, -1772, 2954, -365, -2337, 2142, 419, -2671, 1936, 781, -2493, 1598, 1332, -3074, 1249, 1595, -2711, 706, 2046, -2482, 114, 2449, -2317, -686, 2401, -1618, -1077, 2693, -1293, -1346, 2913, -743, -1886, 2567, -291, -2399, 2094, 429, -2300, 2245, 622, -2771, 1335, 1210, -2564, 1249, 1531, -2780, 890, 2294, -2313, -40, 2545, -2210, -284, 2647, -1912, -788, 2815, -1366, -1490, 2366, -833, -1710, 2574, -492, -2297, 2315, 311, -2573, 1773, 632, -2543, 1688, 1371, -2638, 1444, 1830, -2669, 630]
3124F30J430m255K125K450m658J798L022m360N29L591l567j62M157l920r30M739
3140B619l158j898M968k519k347M728j526l550M400n11l900L657O01m235L458
3155G87J441m804K530K709n036J944K895m057R28L100l992J82L908l679n32M534
3171B858l355j625M630k279k609M349j018l213L909m35l990L927O09m616L330
3186D72J534m586K500K450m514J660L369m440N11L688l513m02L871l571q06M397
3202B620k905j993M758k238k926M669j254l683M496k86l895L499P18l810K966
3217G36J334m712K783K478m734J273L526m061N93L244l615l52M050l416r62M362
3233B527k823j873M526k146l064N089j434l286M160j89m135L770Q15m382L208
$$ y = [630, 2060, -2195, -70, 2380, -2278, -480, 2542, -1818, -1289, 2302, -1265, -1427, 2730, -1190, -2120, 2619, -539, -2437, 2531, 12, -2335, 2393, 867, -2683, 1717, 1206, -2694, 963, 1564, -2671, 787, 2228, -2576, -46, 2663, -2373, -429, 2466, -1591, -663, 2437, -1555, -1373, 2535, -1144, -1676, 2858, -497, -2122, 2508, 229, -2380, 1969, 951, -2262, 1647, 1212, -2778, 1149, 1758, -2858, 472, 2006, -2580, -80, 2370, -2144, -484, 2885, -1555, -1044, 2644, -869, -1271, 2600, -971, -1777, 2620, -285, -2278, 2480, 242, -2684, 1985, 731, -2952, 1544, 1258, -2637, 862, 1580, -2230, 736, 2070, -2642, 141, 2619, -2115, -842, 2684, -1377, -784, 2460, -1155, -1507, 2543, -873, -1835, 2527, -296, -2169, 2357, 211, -2853, 2236, 802, -2484, 1676, 1487, -2648, 1122, 1937, -2445, 763]
3248G63J509m716K685J852m414J836L385m889O86L971l825n32M149l437r52M573
3264B644k864j917M687k372k668M589j233l521M247rm126L538N24m177L457R45
3280A744m546K809K394m613J722L237m619Q86L759m237l69M317k835j377M084
3295B356k559k061M898k568k845M728r01m034M335L8m419M119Q19m300K897J694
3311B197m500K246K425m578J779L223m662N70M173m075l29M237l629j118M572
3326B531k733k016M673k353k673M719j365m089M893K21m719L552J236m269K855
3341D63J731m714K385K959m748J700K917m466O22M035m181o71M699l343j249M189
3357B328k861j632M667k078l183M944j319l819M499j06m129L906P80m582L172
$$ y = [763, 2272, -2444, 241, 2093, -2321, -485, 2900, -1989, -1303, 2668, -1157, -1689, 2460, -977, -1929, 2644, -220, -2137, 2550, 178, -2490, 2099, 866, -2655, 1592, 1583, -2543, 995, 1519, -2658, 799, 1744, -2802, 7, 2401, -2212, -490, 2747, -1872, -986, 2773, -1464, -1833, 2484, -351, -1728, 2356, -203, -2264, 2634, 66, -2779, 1949, 1048, -2986, 1349, 1387, -3032, 1087, 1906, -2394, 503, 2197, -2303, -57, 2368, -2210, -431, 2792, -1870, -1300, 2873, -1202, -1531, 2706, -923, -2041, 2531, -202, -2218, 2455, 102, -2571, 2148, 783, -3306, 1587, 1808, -2911, 641, 1877, -2392, 463, 2194, -2520, -135, 2824, -1924, -224, 2693, -1773, -1151, 2884, -1297, -1968, 2731, -612, -1861, 2328, -533, -2165, 2502, 424, -2759, 2185, 866, -2953, 1546, 1440, -2689, 1217, 1997, -2585, 587]
3372E87J761m650K188K388m428J795K940m607Q52L942m151n03M667l407j632M827
3388B569k562k652M868j908k938M737j437l506M331n4m399M255P55m666K995J819
3404B207m570K299K290m458J669L034m249Q99L806m465r3M516l327j464M217k260
3420E1k282M721j895l033M287q80l827M478l15m011L368J169m646L259J774m630
3436b412K262K510m461J429L484m586Q70L726l785q68M356l168j504M666k338
3451A81k460M799k292k857M478j122l516M161J55m364M103O33m583L258J789m448
3467b085J919L047m797J416L041m483P92L687l825l57M345l517j456M950k918
3482b41k225M725j992l061M644o72l849M336P6m476L587J194m690L305J449m478
$$ y = [587, 2348, -2302, -114, 2274, -2154, -359, 2581, -2026, -1174, 2768, -1383, -1886, 2781, -626, -2258, 2569, 7, -2645, 2223, 315, -2623, 2114, 677, -2829, 1502, 1448, -2951, 1304, 2059, -2607, 388, 2207, -2363, -64, 2226, -2232, -563, 2471, -1778, -879, 2927, -1538, -1631, 2885, -442, -1906, 2311, 51, -2231, 2490, 595, -2438, 1849, 969, -2858, 1620, 1305, -2706, 662, 1831, -2815, 444, 2218, -2412, -150, 2360, -2101, -672, 2812, -1774, -904, 2822, -963, -1831, 2525, -643, -2147, 2519, 181, -2279, 2520, 228, -2629, 1849, 727, -2789, 1372, 1527, -2837, 1266, 1899, -2684, 574, 2363, -2085, -166, 2881, -1916, -500, 2541, -1942, -1150, 2537, -1288, -1645, 2700, -817, -2273, 2677, -241, -2466, 2259, 267, -2794, 1850, 1178, -2671, 1665, 1741, -2735, 852, 2046, -2644, 661, 2110, -2368]
3498b368K376K737m937J727L017m445Q57L768l984p72M628l566j241M559k548
3513a92k184M933k115l063M467p65l757M297p1m258L688J214m990L101J773m428
3529b350K133K538m492J490L604m682L89L902l857m3M161l508j259M510k352k397
3545b213M339j508l166M798j372l745M472k9m496L926P10m311K870K149m958K258
3561b76K824m657J444L113l989K48L947l724q02M588l502j191M757k885k324M768
3577B339j778l336M464o38l849M140Mm056L725R79m575K998J648m638K543K596
3593B566m642J206L725m288J35L694l465p86M453l501j167M489k707k318M929
3608B323j744l086M558p97m131M001M93m211L307J089m273L003J734m765K292
$$ y = [-2368, 8, 2745, -2192, -465, 2552, -1893, -1036, 2732, -1252, -2024, 2604, -962, -2203, 2356, -192, -2376, 2557, 442, -2621, 1846, 1081, -2676, 1621, 1550, -2708, 980, 2194, -2796, 305, 2078, -2350, -217, 2321, -2171, -681, 2923, -1759, -1370, 2532, -1325, -1368, 2793, -715, -1974, 2536, 184, -2213, 2126, 618, -2548, 2250, 878, -2867, 1605, 1576, -2920, 1006, 1716, -2595, 275, 2424, -2534, -276, 2548, -2109, -665, 2448, -1541, -1293, 2654, -1070, -1872, 2716, -786, -1977, 2780, -105, -2429, 2339, 561, -2775, 1689, 1051, -2798, 1342, 1346, -2710, 1015, 1994, -2581, 417, 2065, -2573, -30, 2566, -2076, -870, 2855, -1433, -1298, 2396, -1069, -1855, 2598, -903, -2070, 2419, -288, -2606, 2323, 579, -2507, 2051, 1254, -2877, 1124, 1617, -2594, 713, 1802, -2471, 532, 2266, -2499, -207]
3623b07K750m672J678L229m352K81M089l884q81M293k924j659M612k602k030M721
3639B442j991l054M411n49l696L799J19m046L493Q39m125K870J568m250K487K100
3655B417m459J562K951m136K81M126l743o84M271l101j717M655k449k061M265
3670B178j862k866M450q92m113M415J64m057K959J356m526L292J721m454K000
3685b35K516m437J406L362m294M95L884l299j156M217k820j630M523k471k235
3700b174M462j913l247M603n59l895M281l38m108L436J219m062K562J649l931
3715b015J801K599m379J478L075m132O80L467l655m15L876k708j571L814j958
3730d3k267M356j615l192M446r41l388L620M57m039L193J457m630L003J778m009
$$ y = [-207, 2543, -2129, -451, 2778, -1574, -1293, 2796, -1088, -1969, 2324, -600, -2259, 2353, -249, -2279, 2442, 451, -2603, 1808, 1259, -2437, 1362, 1481, -2565, 928, 1767, -2358, 512, 2080, -2170, 317, 2417, -2042, -480, 2471, -1665, -1384, 2742, -1001, -1685, 2586, -515, -2232, 2423, -26, -2087, 2178, 316, -2550, 1900, 1008, -3105, 1310, 1474, -2583, 376, 1732, -2794, 498, 2219, -2235, -235, 2281, -2156, -750, 2612, -1682, -1187, 2697, -602, -1758, 2459, -361, -1991, 2532, 61, -2174, 2288, 375, -2872, 1731, 1172, -2723, 1558, 1220, -2888, 548, 1767, -2295, 267, 1916, -2015, -214, 2385, -1994, -516, 2559, -1573, -893, 2574, -1081, -1496, 2380, -328, -1899, 1915, -43, -2310, 2046, 431, -2761, 1685, 744, -2644, 976, 1433, -2606, 587, 2044, -2586, 417, 2195, -1814]
3746a814J842K301m211J160L121m097M57L802l579n26L854k668j630M088k118
3761a8k156M019j410k747M035q73l249L682M4l827L428R07l954K393J937m199
3777a988J661K454m026J209K834l659K54L558l550l02L770k475j615M004k290
3792a61j941L825j382k502L785p45l259L645J43l946L093J285m147K484J818m017
3808b022J948K182l632Q43K915l445J21L661l758m21M019l014j107L741k010k021
3824b000L771j414k811M284r88l096L326J64l698L110J073m021K465K013l941
3839a763J599K496l959Q83K873l355K93L111l016q00L718k506j469L569k011j956
3855b293M182j421k790L417m30k603L398Ol886K884J341l778K349J392l742J874
$$ y = [-1814, 28, 2329, -1882, -722, 2399, -1698, -1241, 2561, -1018, -1544, 2310, -358, -1988, 2100, -18, -2174, 1845, 435, -2312, 1723, 850, -2399, 1283, 1327, -2500, 928, 1835, -2119, 274, 2211, -1988, -327, 2127, -1899, -690, 2144, -1515, -1261, 2297, -1253, -1555, 2215, -260, -1875, 2129, -161, -2102, 1723, 341, -2161, 1624, 879, -2380, 1265, 1408, -2538, 555, 1840, -2307, 177, 1995, -2022, -74, 2108, -1524, -681, 2234, -1211, -1090, 2571, -1187, -1608, 2411, -603, -1710, 2031, 21, -2000, 1771, 357, -2454, 1830, 842, -2254, 1072, 1236, -2462, 648, 1721, -2300, 165, 2178, -1763, -164, 2332, -1627, -744, 2129, -1226, -933, 2178, -838, -1638, 2080, -426, -1895, 1674, -337, -2293, 1889, 468, -2322, 1095, 665, -1938, 1460, 1466, -2420, 464, 1805, -1973, 376, 1768, -1974, -100]
3871a00K455m009Q47K877l531L81K996k996k85L385k731j212L817j950j930L909
3887A923j334k579L417k88l180L011L42l387K783R36l696K108J823l771J424K541
3903B073l620P80K630l293K01L220k894n23L376k563r81L587j852j913L499j261
3919D66k483L132k83k891L347J25l518K387J529l739K073J410l230J136K611l628
3935a556O18L127l078m9L171k781j166M013k709j221L523j632k230L616j287k233
3951a874K978l15k772K612N78l440K444J253l451K181J433l371J627K104l336
3966a349O76K795l193K1L000k652n00K979k121j053L248j885j944L518q14k634
3982a908K858j43k681K904K53l137K503Q45l166K047J486l510J469K109l152M13
$$ y = [-100, 2355, -1654, -807, 2070, -1461, -1080, 1916, -1080, -1365, 2020, -711, -1923, 1894, -56, -1986, 1923, 589, -1990, 1427, 1139, -2041, 970, 1312, -2075, 708, 1644, -2052, 56, 1879, -1892, -468, 2073, -1547, -767, 1863, -1430, -1229, 1991, -903, -1426, 1950, -613, -1594, 1993, 141, -1772, 1727, 466, -2017, 1115, 832, -2059, 1288, 1413, -2105, 282, 1811, -1928, 145, 1555, -1675, -539, 2072, -1556, -938, 2189, -889, -938, 2233, -548, -1714, 2299, -410, -1631, 1892, 260, -1970, 1646, 359, -1874, 1104, 789, -1983, 629, 1207, -2233, 211, 1464, -1987, 194, 1627, -1744, -117, 1987, -1349, -673, 2122, -1071, -1050, 1950, -702, -1202, 1777, -344, -1397, 1851, -34, -1978, 1540, 726, -1908, 950, 807, -1874, 1030, 1283, -1854, 649, 1494, -1672, 375, 1861, -1649, -180, 1929, -1223, -810]
3998h10K563k709o3K780k365p79L501k447j426L447j403j904L018o52k823L346
4014A274l64l011L100M08l068J974J002l175K043J547l112J325J951l234N29K535
4030A724k376o54L083k467o75L032k278r16L255j657j749L239j360j988K753O6
4046A032k621K378L51k791K005R52k890J672J677l290J186K027k944L92K708k586
4062g42j83K688k048r55K883j737j680L460j353j872K782j075j741K596k35k981
4078b193K799M42k375J968O30k752J402J680l175J268K209l087L69K694k774k16
4094a111K689k303o57L122j957j317K819j196j946L145o90k253K427j85k297K373
4110F63N46k573J668J012k566J330J418k782J053J887k612L80K270k264o68K772
$$ y = [-810, 1753, -956, -1019, 1761, -604, -1383, 2118, -329, -1755, 1692, 289, -1615, 1403, 751, -2072, 1274, 910, -2101, 999, 1407, -1661, 313, 1315, -1860, 183, 1730, -1382, -57, 1894, -1340, -811, 1724, -652, -1306, 1777, -690, -1365, 1667, -611, -1527, 1728, 71, -1678, 1561, 201, -1787, 966, 1032, -1589, 789, 1140, -1651, 354, 1306, -1584, 88, 1765, -1525, -339, 1688, -1256, -864, 1844, -742, -925, 1763, -285, -1240, 1643, -94, -1774, 1686, 333, -1539, 1243, 168, -1573, 1023, 788, -2193, 606, 1048, -1327, 641, 1271, -1481, -79, 1601, -1574, -306, 1903, -1184, -815, 1879, -895, -1111, 1578, -725, -1382, 1740, -217, -1534, 1285, 89, -1857, 1288, 598, -1655, 772, 587, -1710, 663, 1209, -1364, 304, 1316, -1250, 80, 1498, -1284, -231, 1656, -956, -576, 1694, -570, -1238, 1534]
4126A534k105m12K530j947j073K803j327j429K453p17j874K773j37k604K022N19
4142A009k727J987J012k674J604J158k935J230J854k665N73K081k249l70K795
4157A683j908j042K662j554j263K780j335j434K298l19k072K434j43k558K426
4172F55M31k465J653R67k809J213J629k381Q30J745k590M13K451k404j45K395
4188A588j632j096K609j506j471K890j061j751K395n91j776K194Pk218J902O98
4204A181k638J622R50k311J176J387k428Q52J751k222J88J959k035k46K448k224
4220e90n26K593j188j374K036r07j580K661o71j887K313j0k223J916N66k238J321
4237B12J066k540J153J450k294N12J718k264O36J742k019n66K511j835l41K125
$$ y = [1534, -571, -983, 1547, -400, -1473, 1330, 3, -1426, 1027, 310, -1564, 1209, 1072, -1532, 490, 1009, -1718, 269, 1281, -1393, 211, 1369, -1566, -336, 1518, -1147, -574, 1507, -742, -1112, 1683, -225, -1267, 1395, -159, -1422, 1358, 23, -1411, 887, 568, -1504, 930, 787, -1771, 655, 1086, -1379, 274, 1241, -1568, -355, 1274, -1107, -277, 1468, -1122, -709, 1742, -662, -807, 1588, -44, -1140, 1469, -37, -1508, 1382, 321, -1430, 965, 374, -1402, 792, 799, -1419, 483, 1181, -1457, 165, 1115, -1196, -20, 1367, -1061, -209, 1542, -680, -492, 1467, -568, -814, 1634, -590, -1116, 1477, 289, -1085, 951, 44, -1536, 1125, 454, -1433, 880, 870, -1353, 563, 1129, -1109, 212, 1278, -1262, -109, 1341, -953, -441, 1277, -987, -351, 1391, -628, -1194, 1317, -518, -859, 1266]
4253A266j339j172K274n16j521J868n97j366J759j50j811J711M71k171J419J329
4269A454k818J183J490k367N49J982k362Q3J962j732k82K031j699o08K510j646
4285b70j108K517n28j696K225k08k151J981k16j807J657M52k182J518Q61k194
4301a149R05J499k146N66J658k100K26J982k028q9K096j655o36K443j730j024
4317a182K244m78j665K328o40j907J929Q4j861J302N82j967J609Q23k428J175
4333e2J106j841K85J763j988K06J589j791r1J844j153r80K297j394j062K217o76
4350B79j681J988L7j727J475L55k031J973k7j778J450J007k428Q02J638k442P91
4367c19J459j786J01J574j408k40J807j473q44K260j304j029K203p62j563K205
$$ y = [1266, -73, -1245, 1029, 513, -1008, 860, 263, -1103, 656, 506, -1305, 406, 877, -1294, 125, 1454, -1364, -181, 1309, -1058, -509, 1473, -889, -806, 1156, -576, -858, 1173, -526, -1134, 1376, -270, -1378, 1139, 611, -1085, 1140, 932, -1219, 762, 546, -1261, 396, 848, -1334, 184, 1045, -1149, -244, 1255, -891, -325, 1333, -767, -541, 1441, -587, -676, 1420, -235, -871, 1572, -158, -1182, 1062, 584, -1081, 1247, 607, -1300, 629, 713, -1148, 154, 736, -1231, 378, 1201, -1227, -52, 1054, -787, -502, 1261, -727, -521, 1068, -723, -814, 1030, -123, -1103, 1194, -200, -1262, 955, 279, -1402, 586, 623, -1104, 371, 726, -1305, 668, 641, -1137, 313, 1320, -1108, -306, 1332, -1110, -319, 1140, -646, -545, 1029, -379, -619, 1188, -285, -1129, 1131, -173, -1202, 1001, 239, -1324, 881]
4383H81m53j556J574L75j964J340R00k417J454O56j600O71J563k109K26J419j612
4400f52k1J720j417k44J778j426n52J967j299j035K268p29j381K067o10j355J486
4417E65J11j903J540M13j832J126J018k284J099J245j998L46J923j816J1J914
4433A478k074k73J835j357k47J921j068j126J618n80j118J980m42j667J705K22
4449H07k024J685L32j789J005P66j766R73J164j884J95J647j767J03J482j395
4465d66k02J615q88j123K135j351o09J950q09j314J729j00j737J503K62j811J520
4482C04M20j858J352P07j886R24J491k085L76J229j644K49J439j495J9J277p80
4499C9p59J658r32r04J580k73j301J581j69j562J319M04j760J491M39j813Q95
$$ y = [881, 428, -1128, 446, 821, -1143, 197, 1097, -1320, 134, 790, -810, -139, 1424, -685, -459, 960, -652, -673, 1047, -370, -614, 1164, -262, -814, 1153, -146, -1181, 1087, 358, -1023, 1044, 434, -921, 565, 676, -1227, 313, 726, -1106, 20, 1038, -1246, -147, 1098, -900, -554, 1369, -447, -436, 1478, -596, -869, 966, -391, -638, 1283, 215, -911, 707, 127, -991, 989, 547, -1120, 585, 807, -1217, 468, 800, -989, 16, 782, -984, -11, 1153, -731, -536, 1111, -656, -553, 929, -466, -668, 947, 59, -1064, 1071, -280, -889, 1061, 252, -1062, 667, 567, -1170, 333, 595, -1216, 304, 724, -1134, 218, 925, -961, -37, 1454, -631, -255, 974, -670, -421, 1018, -477, -458, 819, 39, -720, 938, 6, -898, 682, 409, -892, 689, 520, -1042, 277, 681, -1079, 412, 851, -962, -67]
4516f7Q89j563P59J052j961L45J404j214n05J736j017o55J665j062n20J419n26
4533A79j155J846o52j355J760l15j313J374R6j618J176P73j618Q16P24j688R19
4550e1J025j609L19J462j488k53J704j490m80J914j032j084J748n57j185J660
4566F03k64j300J530j41j293J224K36j385P96Q94j776R15P52j701N96J253j627
4583f88J40J439j197P0R03p86m82J494r47q75J791p81q20J614n52j468J771n9
4601E67j531J341L30j579Q50P58j525P99R99j751P13J267j744K61J127j145k21
4618d84J483j188m61J780j268p30J573n36j027J497j87j217J176L3j264J048J96
4635D24j406J271O50j675O67J039j442L80J137j648J1J341j067k43J612j323l76
$$ y = [-67, 822, -741, 18, 1070, -891, -546, 858, -356, -861, 875, -142, -797, 868, -194, -714, 705, 179, -976, 870, 218, -1137, 623, 308, -1005, 369, 465, -1153, 23, 796, -822, -6, 718, -970, -51, 974, -635, -316, 1146, -342, -595, 1109, -381, -861, 1053, 21, -1063, 685, 128, -1057, 603, 339, -961, 569, 428, -865, 359, 595, -790, 6, 900, -876, 39, 791, -910, -314, 939, -688, -548, 891, -306, -236, 667, -119, -601, 893, -54, -929, 862, 81, -739, 875, 323, -1145, 626, 567, -964, 377, 707, -872, -22, 736, -789, 10, 1009, -742, -29, 1238, -506, -245, 882, -263, -484, 999, -189, -650, 1130, -138, -868, 705, 169, -858, 639, 452, -765, 411, 444, -820, 228, 424, -982, 289, 939, -736, -69, 970, -472, -92, 1045, -603, -592, 749, -318, -561, 1051, -272, -648]
4652f48J411r36p31J731n84j079J519l84j181J452Qj664J338K44j597J178N66
4669F43j416O40Q88j410M27J089j277L3J267j339J14J037j088l13J371o37q56
4686h27J630m95j062J335l00j021J100K58j402J180J45j338R98K87j365P36Q78
4703G37j352M10J402j783K20J264j106l46J401j072n02J599q87o65J393k70j249
4720h06J277k13r22J165L8j437J131L18j214O66O96j383M33J210j612L41J208
4737H96j436M1J434j296m28J570r39n38J396p17n89J011k94j055J293M7j098R13
4755B11K39j019P98M71j327N94P78j343M18Q42j260K68J251j439N3J248j186J03
4773c00O36o15k17J099m76q42J320n43p25J057j41q41J015Nr73N91N18j176P01
$$ y = [-648, 763, -173, -904, 827, 243, -836, 683, 299, -882, 570, 578, -1086, 252, 496, -1101, 77, 643, -773, -133, 755, -655, -228, 861, -416, -383, 884, -455, -341, 696, -392, -705, 666, 29, -827, 803, 308, -754, 581, 281, -740, 360, 618, -784, 396, 541, -797, 201, 488, -877, -141, 737, -615, -205, 1197, -586, -366, 898, -208, -554, 847, -225, -727, 872, -15, -680, 713, 443, -806, 471, 258, -664, 501, 539, -898, 233, 551, -663, 3, 699, -684, -251, 959, -653, -312, 896, -540, -499, 935, -361, -789, 781, -158, -696, 700, -17, -606, 405, 111, -944, 349, 396, -702, 211, 450, -569, 229, 700, -627, -33, 745, -598, -180, 662, -598, -330, 921, -518, -465, 783, -403, -300, 336, -279, -496, 603, 127, -715, 605, 62, -663, 394, 253, -588, 427, 432, -541, 50, 568, -608, 93]
4792I3O63j250J86J200j387J58J043j168j69J650j507j32J295p98l92J413p94
4809A04o14J105m74p07J169k29j126J040m9r84J007M11j322P35N11j078K76J038
4827H13j460L31J271j229k92J279r37R0P44o91m15J023l97p55R66j52p21Q55J30
4846D53j050Q32J85j154P10M68j206Q57O36j184L88O83j148K94J174j412K94J184
4864A004r44l56J126j053m01J006k44j032J575l30q28P98K1r46R64j05o90M49
4882A4L67j008N20N86q94M98O83j113J29O84p73k00J068p64j71R07n36m55P80
4901C22l31n45J072k50r65Q52L5p40Q98J69j086P30M34j098M35R21j441M02N10
4920C24j014K75J071p68k19P33l73j05M75o19j24R22l66m78O43qr91P45K69j006
$$ y = [93, 756, -494, -308, 892, -495, -337, 706, -462, -631, 1019, -488, -620, 675, -123, -515, 898, 104, -510, 595, 121, -586, 583, 354, -772, 268, 219, -765, 242, 653, -669, 66, 577, -501, -225, 813, -647, -316, 955, -274, -566, 713, -224, -134, 610, -81, -496, 527, 130, -625, 341, 189, -532, 323, 453, -597, 235, 420, -734, -24, 444, -762, 95, 731, -453, -65, 618, -530, -236, 938, -474, -180, 1004, 60, -296, 830, -223, -624, 382, 138, -894, 681, 351, -477, 321, 342, -604, 360, 255, -435, 14, 381, -627, -107, 479, -415, 83, 766, -347, -218, 466, -307, -507, 561, -203, -374, 533, -3, -458, 322, -9, -554, 518, 268, -697, 155, 190, -550, 348, 517, -569, 161, 595, -503, -68, 853, -588, -186, 324, -690, -415, 656, -112, -331, 402, 29, -76, 399, -220, -344, 578, 212, -266, 377, 369, -622, 123, 392, -614]
4940f14P14L02r42O89M48j077L87N75q73R7R47j046k7R86q81k33J123n25n23J186
4960G13n68q32J374n59o59J013o6j063R52M9p33M46J46q96P39N32r61K63N70r07
4980d47K36Q01q24L7P41n18o54J346j031m3R28n58p68J067m11m81N54K11q07J009
5000C88O2j190P64N47r40K62P82j325M01O09r48K69R03q58O1Q09p03k56P57n18
5020a24j89Q66m97m85R04l11q80P74L38p89Q41l6r31M84M30o98L67N45r67K82
5040g6N08p11p0Q10n32k39Q39m87m98J016o78m14J042n46p50J078J09r20J126
5059F07r5r69M98L20q03O86j1n56MJ090j193K94R18j227M3Q97n88k23P86n69j24
5080b15N61j03r72J221m65o61J210k96p17P63k44m84O50k8o94K98O70j012O61
$$ y = [-614, 100, 402, -540, 149, 597, -480, -93, 482, -391, -294, 653, -393, -420, 566, -315, -548, 575, 50, -473, 713, 145, -687, 687, 128, -531, 482, 416, -647, 305, 354, -379, 67, 213, -683, 56, 588, -373, -110, 460, -447, -211, 590, -234, -197, 544, 26, -628, 718, -313, -356, 572, 14, -754, 313, -98, -579, -25, 186, -621, 388, 450, -740, 24, 571, -369, -107, 675, -650, -249, 360, -588, -319, 584, -274, -213, 596, -107, -363, 394, -124, -313, 553, 56, -429, 475, 164, -716, 58, 396, -393, 448, 412, -519, -35, 395, -303, 64, 609, -358, -76, 432, -279, -349, 461, -71, -310, 529, 42, -456, 560, -118, -532, 510, -36, -786, 292, 401, -519, 607, 512, -457, 41, 361, -442, 244, 233, -323, -319, 771, -422, -128, 790, -437, -394, 503, -85, -308, 478, -91, -215, 346, 243, -729, 492, 27, -634, 576, 280, -437, 326, 82, -402, 248, 220, -474, -176, 494, -518, 143]
5099A43K13q24K72P38r73J17Q76q33o7P23q14m5R53l87n57J113o04p33Q43J06
5119B60p81Q14K2j000P44N28j042N17J54p37K90M78n68J54N22o29J5O02o08p9
5139c44R89o03k82N82l53l29M70m1m79Q18P2r87O43J73p09L68N75j022M53M68
5159D62q97L17N44m35j14P75o53j73L50Kn61P27k91m27N93l16k05O10l77l76O37
5180A92L4p33N71Q2m20L66K27l45L6J84l75J90M24o58k9P95q24k02O57m05k61
5201d94J087p24j82M58L5o61O96M0p00P17Q6n31K99K83j029O94K82q92O54N24
5221F42j121N44K74n41L9P19r11O5O70n47j45Q73m16n77R57o32m27R53m43m18
5241d42Q03m7m41J72L14p30L63M95r60M07L98m79J39K54m82L20N74q99k16Q05
$$ y = [143, 356, -468, -196, 542, -431, -314, 562, -271, -338, 385, -429, -474, 479, 92, -465, 648, 44, -689, 154, 260, -521, 293, 315, -685, 59, 587, -455, 62, 216, -521, -231, 247, -321, -167, 355, -274, -259, 343, -265, -344, 645, 42, -240, 342, -11, -340, 130, 89, -390, 428, 500, -487, 156, 329, -380, -12, 563, -459, -6, 462, -435, -118, 426, -9, -123, 652, -1, -174, 176, 178, -383, 344, 53, -374, 219, -97, -302, 308, -69, -445, 192, 226, -507, 64, 146, -274, 92, 319, -26, 10, 194, -181, 9, 433, -225, -254, 541, -283, -485, 172, -233, -494, 593, -131, -313, 145, 180, -481, 215, 255, -445, 272, 358, -173, 126, 409, -620, 74, 356, -536, 118, 642, -479, 65, 339, -202, -163, 556, -355, -290, 380, -167, -312, 561, 145, -432, 525, -107, -534, 419, -24, -442, 361, 314, -127, 45, 359, -371, -8, 487, -473, -66, 332, -147, -8, 246, -236, 84, 658, -241, -457, 348]
5261C48n08l07Q03r3p80R52m15l18K41M3n84Q74j31l01L61J01o27N23K84j040
5281e74N05L04l78O0N10o68J40M28m23j86R17p18l89O65m25l43P85j31k83P51
5301E47m22o66N48L20o98L70K20n37N82L48j050M43L33o31rN17j48l98M69l41
5321b03l6O34k28p20R08k54n65R44m19l27M71J44j036P06K77p13N24J40o19M42
5341G0M13r10K84N22n91J23N16o75l6P86n52o9L85j76m81O36k65n37P78p9m33
5362b91M16J30q76N94J17k39K29L3n02K46K19n14M47M87r40K82M36l39J3M13l65
5383dl90N89k86l55P75j55r31J247k06n56N42K28q55M76J00m97J79L33n67L71
5403C8L42p95K10M26n03O6P11m06l34M54k39m11Q14j82m49M95M3m82M53k7l61
$$ y = [348, -160, -467, 336, 243, -537, 415, 0, -318, -77, -34, -618, 256, 125, -176, 185, 286, -341, 182, 466, -574, -69, 235, -143, -83, 427, -241, -101, 327, -96, -282, 635, -83, -472, 193, -232, -575, 210, 79, -204, 547, 125, -541, 7, 327, -371, -1, 219, -318, 264, 612, -438, 5, 338, -293, -302, 215, 67, -331, 138, -203, -239, 395, 167, -553, 355, 101, -464, 480, 61, -266, 205, 349, -687, 19, 296, -417, 107, 247, -372, 70, 483, -427, -143, 379, -212, -89, 427, -248, -284, 502, -50, -119, 266, 90, -391, 245, -20, -557, 221, 142, -291, 125, 255, -621, -27, 90, -149, 80, 113, -389, -143, 76, -438, 9, 496, -444, -162, 274, -65, -52, 361, -4, -394, 195, -91, -446, 329, 174, -757, 490, 284, -272, 270, 498, -357, 119, 219, -278, -99, 234, -333, 38, 380, -415, -205, 221, -282, -216, 495, 89, -245, 209, -30, -441, 373, 191, -258, 237, 280, -202, 251, 224, -137]
5424a37M19j44m55M64J67n74J43N72o31j19P23q51M29N64r20n7P69l08k65N89
5444C78j03n14N87k75n80N79m8l83M27N9m38M79L39q72M44%m44L14M06p07J64
5465a88O82r75M25N04o61rN31k72n11Q89l62m30P78n07l53Q48l60l45L79L33p27
5486c31M41j9l75K42L80o62O2Q59q89K34M23o89L27M63l59l04O49l76j88N42o18
5507a88j86N58J1k79M35r7p24O66j6o72N17M28p86K75M83m56M3M61n81KN11n92
5529a87j46P42k95k56M49k82k13N72l46m13O54l49m09P26j60n03O23L9o71M10
5549a5L25o46L47N76o00JL88q82L91N44n60p2P00o54J16K84k92n05O71m5o22R32
5571C82k34k68L73l24j82L93jm14N59q2m19l0N70p15M06L93q13J39Q06o76Q4N22
$$ y = [-137, 282, 138, -317, 147, 314, -260, -117, 455, -176, -295, 428, -423, 6, 570, -350, -407, 362, 54, -211, 378, 275, -239, 348, 73, -507, 72, 24, -359, 68, 127, -311, 168, 507, -365, 79, 79, -365, -51, 355, -352, -188, 494, -481, -56, 448, -213, -222, 309, 37, -474, 415, 53, -377, 401, -106, -459, 389, 29, -316, 63, 396, -331, 110, 91, -284, -42, 338, -324, -262, 597, -292, -58, 365, -324, 3, 466, 107, -197, 452, 76, -112, 430, -188, -374, 184, 195, -84, 351, 254, -470, 196, 180, -492, 25, 453, -333, -58, 425, -31, 12, 473, -108, -106, 405, -187, -333, 409, 114, -142, 307, 25, -188, 384, 38, -375, 279, -70, -479, 247, 87, -416, 207, 246, -425, -15, 310, -336, 11, 587, -13, -12, 376, -506, -115, 429, -131, -203, 497, -157, -41, 243, -49, -554, 117, 72, -550, 382, 148, -120, 253, -71, -253, 140, 139, -275, 284, 202, -217, -247, 323, -392, 14, 407, -406, -267, 539, -137, -53, 469]
5593D69m41l08P02m61l45Q78m43l62Q59n05n78O19L88p94L47L96p80L87L53p46
5613c65N94K59n91O3O24q46K49M26m80k79Q25m02o21J023m63l57P75k99q09P51
5633G7K21m74R8M14o86J72L10o02N99K96p32J78M54o48J57L32j80j52O25o18j92
5654c51Q16n66j45M71m18k03N68k2m64P42j13o23N16M5o48N73L66j090P34J74
5674C62q80M53N25q96K64N45n54M4N86m43m29N08N5m32Q54m98m1L39l87m81P98
5695B92m2o94N63N2l18m1N33p21M98M8l84jO13p37j4K94q8j7O97r53K6P28m94
5718a60m7J67J41m46O11J45q41M06K35m44N23k72m35M07L78n93R3O35o87l8O98
5739D76o47j58P01p34j07J142r34k44Q35m28l05N39k8m36M29J3k10J95J56q77
$$ y = [469, 28, -280, 422, -39, -384, 494, 51, -311, 548, 43, -535, 84, 472, -322, 25, 421, -359, 28, 381, -365, 229, 488, -103, -40, 584, -262, -13, 413, -67, -346, 479, 77, -544, 479, 16, -341, 434, 135, -674, 77, 298, -176, -78, 336, -350, -178, 132, -470, 129, 425, -307, -129, 325, -323, -166, 166, -14, -166, 459, -159, -351, 465, -101, -246, 225, -193, -396, 172, 150, -314, 428, 315, -308, 208, 253, -395, 178, 544, -546, 188, 362, -518, -65, 460, -436, -172, 373, -181, -137, 449, 6, -423, 85, 140, -292, 562, 64, 23, 362, -25, -506, 292, 250, -444, 119, 171, -147, -188, 345, -376, 122, 170, -214, -215, 398, -339, -353, -59, -147, -164, 533, -420, -394, 334, -160, -207, -40, 101, -345, 266, 411, -430, -24, 211, -233, 290, 18, -417, -10, 368, -225, -132, 503, -184, -222, 476, -171, -329, 372, -362, -469, 673, -261, -505, 330, -98, -403, 136, 108, -328, 101, 114, -96, 99, 255, -622]
5759f22O09J15n23O48j30m02J79O42q91L70M30q48J37M40l31j56P71o83k23R44
5779D76o01k98J133n25p23J044k52n86L64K56o69L98M18q05L10M64o20j1O29n20
5799a18O0L31j61m45P28p27j8R02p92j57Q80o12j14N79j60m94O95j83l55L90k59
5820c0l75N58L66q82J77O77r31N49N08q77J75L62o64J75O23l68l59Q23m68m07
5840c68P85l09l32M14j22l53N29J32o78L75K68n82N36N7p18K93N67p07K24L89
5860D00q04L09L87l81P6L26m61l61P79k52m00N90l71l84P67o8l62J90K14m46N15
5881B63m2n47L38M79p15M7O66j083Q15J97q75L55O02o51N0L84n09K66K30m69J
5902a98P16m35l68Q65l10p88O59J95j014P08L52r44N10L90q23M40P92j070N28
$$ y = [-622, -13, 102, -421, 227, 97, -305, -126, 516, -375, -5, 425, -423, -286, 154, -177, -333, 438, -245, -468, 476, -125, -423, 710, 185, -538, 506, 254, -332, 32, 288, -381, 17, 435, -370, -60, 404, -216, -227, 402, -118, -58, 273, 112, -333, 395, -332, -350, 552, -240, -397, 483, -129, -243, 336, 176, -318, 377, 194, -161, 229, -30, -405, 153, 519, -363, -186, 491, -440, 109, 617, -260, -85, 277, -387, -212, 411, 43, -316, 507, 39, -368, 417, 108, -224, 190, 68, -285, 244, 376, -302, 73, 341, -241, 295, 352, -366, -73, 494, -213, 11, 400, -404, -95, 292, -89, -13, 313, -148, -509, 270, 18, -382, 208, -163, -547, 220, 152, -210, -20, 194, -252, 263, 221, -326, 12, 491, -224, -177, 489, -594, 221, 418, -457, -102, 500, -151, -101, 283, -226, 40, 270, -199, -198, 518, 83, -285, 580, 270, -518, 141, 336, -678, 30, 382, -562, -52, 338, -485, -45, 747, -323, 205]
5921B05K58o87K96M37q98L78N20l29m39N45j39q70J011l28k65M22O1n80M33L63
5941C94j057R37km58M06K00r18M29N82j032O85K94m91o3O43p26l2P71n27l53N89
5962B71l34l02O64l11n88J064m16l01O27n4p09P92o0o06O80k46o06N74O06r19
5982a74P9K67m26P3O37n65j46N80n31J77M48j77n97Q58m64n18R09k69m39M73J64
6003C59o19N09J61o35J34N10q54M10O38q63NP31o42k81J003n58l54Q44p97o7Q06
6024D40j22p01Q53n0q11N72p8m70N84N1p52O93J09q91M52N42n98N28l2p67J98
6045b50J027j156J36Q11q89L8O59m11l85R42n26o16R04q4n33N84o0o86O98P0o29
6066c56K06L97n58J43K74m26L40M55p05J41L40m81O2O65o15k16R18o77m23J089
$$ y = [205, 463, -224, 72, 509, -389, -11, 509, 180, -259, 286, 147, -723, 288, -40, -305, 117, 178, -402, 31, 394, -663, 274, 272, -186, 220, 420, -498, -69, 513, -519, 166, 460, -31, -94, 549, -177, -209, 562, 35, -318, 271, -63, -365, 299, -12, -600, 464, 48, -253, 374, 320, -389, 403, 343, -263, 417, 171, -435, 139, 745, -174, -95, 172, -254, -181, 456, -109, -255, 325, -206, -29, 419, 242, -355, 503, 39, -479, 430, 161, -278, 195, 359, -260, 249, 410, -225, -91, 419, -435, -25, 613, -250, -245, 486, -156, -437, 566, 8, -346, 498, -299, -366, 440, 318, -383, 470, 420, -391, 181, 103, -367, 217, 268, -484, 209, 318, -573, -121, 421, -177, 351, 319, -448, -250, 777, -379, -243, 568, -321, -283, 376, -35, -420, 522, -4, -620, 284, 200, -333, 251, 191, -495, 203, 273, -356, -150, 247, -311, -168, 106, -320, 20, 475, -230, -89, 251, -230, -168, 497, -118, -334, 584, -93, -516, 573]
6086E73o38p8M72k52n61R00r6o42O66qj005Q30R9p13L28N40r96M58N16p01J1M46
6108A49m96K16O51p60j51P53m96j46Q11l17p17Q84l14n95Q41J07p78L64J79p65
6128e80P03M10q67L82L62q83J77R55j053M11M06o79n6O87m91j15M95m84j74N85
6148A91k18m36Q68l94l99N43n7o61O32K85n26L87J40p89N02K36p38L96L46p55
6168d47L29M56o92m4O55n21j70J076p27n45Q93n94j94R59j95o54P73j7r67Q97
6188B71p8n81M43M86p60L24K65m19K67K74o60l0N14l32p7N22m07k87Q03p32l12
6209e06P25k00k12L68J14o17L53J79n84N33K31n61K21L08n26Q1L07n90K89M88
6229D01q71K31O86p73j03P65m56j84M42r3l21N70n17m40Q91K5p36O22K51q36O80
$$ y = [573, -65, -143, 329, 77, -484, 416, 320, -322, 344, 336, -669, 161, 260, -453, -125, 415, -581, -123, 393, -308, -297, 149, -347, -131, 520, -240, -391, 362, -134, -280, 531, 214, -503, 381, 67, -528, 313, 420, -358, 6, 185, -580, 123, 533, -334, 48, 410, -473, -296, 659, -394, 17, 423, -256, -312, 375, -116, -231, 264, -220, -394, 191, -27, -463, 405, 11, -388, 155, 98, -563, 69, 354, -172, 215, 355, -434, 68, 304, -434, -38, 308, -447, -118, 338, -354, -398, 257, -264, -434, 642, -85, -630, 263, -331, -525, 434, 239, -415, 358, 341, -626, 271, 193, -388, 55, 541, -219, 105, 370, -49, 218, 492, -168, -198, 316, -16, -93, 429, 22, -265, 538, -194, -506, 219, 19, -193, 175, 289, -328, 25, 204, -380, 153, 384, -177, 44, 352, -174, -93, 214, -376, -87, 401, -470, -239, 447, -326, -429, 336, -120, -304, 138, 45, -276, 294, -223, -663, 228, 253, -483, 139, 390, -446, 234]
6250B34N0p31O10J65q11L65N87p25J62L10q63M31Q33o94J34K55l20l17P16m25
6270c4k98N82p4n50O67o3q17J045j74o43O11O0m56K85K21p85M15K72o74M75K96
6291C61p62J23R58p89l13R52m31m40R28k76r83J058K9q83Q21m19k44P57n8p00
6311c11M52K39j164O04O20j072M76P36r18%Q03o97nP42m52n77P94m15l02Q91m14
6332C0k91K09L76o64N64j24n69O53J75r53O18J55n83N61P9n96JP46l82l26P50
6353D29o62K28M62n06j82N61l27k16N33m92J7L90j4p36P54o4n09O06K27q78M68
6374H9N61r11L22M29o82L4Q31q97J04M15n39m3O04m87K7N22l61k00O23n71n54
6395f84R63k88l51N78K58o93J40M12o56M43R3m45M40J21p25L68L45p67P7O52j95
$$ y = [234, 284, -447, 163, 328, -483, -118, 469, -256, -94, 216, -647, -216, 617, -77, 57, 312, -8, -325, 391, -34, -332, 250, 176, -374, 293, 230, -587, 458, 284, -359, 252, 312, -144, 141, 362, -423, -8, 264, -410, 65, 361, -401, -278, 680, -109, -422, 530, 99, -341, 587, 311, -672, 386, 415, -468, 353, -66, -310, 447, 389, -311, 141, 380, -784, -180, 440, -632, -156, 580, -338, -338, 465, -232, -237, 505, 53, -524, 270, -145, -447, 444, 30, -261, -52, 324, -340, 224, 100, -469, 184, 359, -594, 24, 179, -404, 157, 236, -360, -359, 387, 5, -321, 429, -233, -5, 457, -49, -231, 330, 3, -213, 320, -172, -155, 235, 221, -515, 239, 175, -334, 272, 499, -379, 89, 650, -261, 61, 490, -192, -158, 673, -224, -120, 295, -244, -287, 317, -170, -143, 379, 18, -182, 441, -130, -684, 279, -9, -360, 218, 476, -217, -77, 335, -321, 122, 215, -230, 210, 331, -394, -26, 319, -448, -371, 281, 86]
6416H6q4K28k21j99N19m47k9L35P1m96O49j87p34P29J2n68O37M3q20N37L53p83
6438c69K89M86n77j35Q14o56K0M03k96j31N50n47j51P41l60m60N91J46n83M65
6458B40l00m87P01L04r04N00O31r66L28J76o25K86N24p03K77M13o17j4O94o10
6478a52M2L76m41m6N32k82k18N84l60l84P66l09l21L88j52r3R9K39o93L59M36
6499C70q36M05N17n83N4M94p89P3O68o09j49Q05m72j45N66l30l57O25k30l82M20
6520A15p8l99O04l0l97K17L78p05L06K30o19M29L46o48k09Q08n39Q1N28n15r3
6541a90N81n98Q8M59p29J50L87o7n89R41m18l91N38j02n03M05N74r89M14L37m28
6562a30P2K39l50L00J69n60K75J18k36R7R9j48k46O07m60k93N21m3l76N28j55
$$ y = [86, 2, 230, 9, -190, 329, -118, -147, 188, 259, -237, 412, 225, -509, 220, 232, -336, 301, 344, -476, 61, 414, -369, -80, 406, -171, -306, 508, -148, -128, 275, -21, -152, 398, -149, -300, 441, 81, -379, 212, 358, -225, 240, -60, -547, 154, 458, -446, 54, 685, -281, 47, 223, -402, -116, 408, -295, -18, 395, -222, -236, 458, -152, -110, 266, -175, -221, 311, 29, -189, 395, 35, -349, 417, 108, -213, 175, 23, -70, 29, 268, -425, -66, 370, -466, -61, 456, -127, -73, 421, -368, -295, 373, -236, -385, 420, -52, -197, 369, 39, -318, 307, 77, -305, 115, 37, -362, 242, 212, -185, 32, 410, -295, 11, 241, -378, 51, 397, -251, -460, 348, -191, -110, 418, -97, -190, 391, -207, -119, 340, -389, -239, 148, 81, -508, 433, 15, -376, 162, 60, -443, -38, 536, -453, -39, 298, -130, -58, 181, -169, 131, 300, -260, 15, 133, -103, -6, 93, -55, -301, 306, -154, -447, 74, 31, -345, 183, 28]
6583B8m36N73j02m87O20J50o16K86K64m13K50J21n28K60L76p41L65L36p02m9R48
6604E03o00k93P23n22k04Q76l17n87O67n3o71N25K68p55N58j8o28L49L67n19N04
6625A73J13o51O83Ml00j73M11o02J06L64k17q8L36Qn12M06J34n20M58J8m81M63
6647A33L3m66L48k1k41K66K06n81K32O33q75K57N14p92K67O68q11L6P99n58k28
6668a81L19l61j88O66k2o76Q68l54l86N39L20q66L44L80n92J95K33p27N56K06
6688B73l77l92R18m09m62P43l17P8L62n25l46N21M5m70P31k44n46N01J81o87Q17
6709C95m56m14O18O5n73K11L16l93K26J63l91J60L78m44j0N59m46k31N88j91l70
6730b40M46l39Q8M95j82o35N01j10m69O09J99o56L06N09q62M30M90q23PL30m55
$$ y = [28, -408, 165, 63, -424, 196, 346, -270, 16, 280, -133, 117, 238, -290, -30, 346, -395, -30, 306, -396, -445, 503, -97, -390, 333, -189, -393, 483, 166, -421, 246, 193, -478, 47, 315, -440, 118, 100, -528, -179, 188, -331, 173, 286, -365, 318, 322, 22, -151, 260, -342, -236, 128, -89, -177, 159, 167, -345, 61, 195, -325, 133, 151, -330, 133, 166, -300, 48, 27, -214, 52, 258, -323, -91, 542, -333, -76, 438, -354, -87, 581, -230, -194, 605, 47, -181, 138, -223, -411, 255, 233, -443, 425, 71, -315, 224, 544, -322, 22, 402, -190, 5, 238, -489, 67, 273, -104, -496, 422, 13, -449, 294, -23, 55, 417, -108, -454, 67, 112, -358, 373, 129, -417, 84, 265, -422, 395, -61, -475, 143, 208, -365, -154, 162, -231, -5, 158, -233, -73, 305, -139, -149, 410, -36, -267, 321, 130, -240, 206, -133, -45, 450, 268, -367, 134, 24, -445, 164, 363, -293, 13, 522, -340, 90, 580, -243, -236, 94, -361]
6751c61J40N28m58l2O21m73j44M59j33o28P63J5n31P12l76n69Q37j38k93K41n7
6772A23k81K42K87n39M12K6o13K19K16j29l0M66p64L43M77p31K97R1k87j60Q00
6793D65o71o9M64pn52L68K89o62L57J74n38L37K77l90Q0L83n12j65Q54r23P5P56
6815C90j76k55N38k91n20P01m30l22N27j55r9K70L6o47N66J97q66O48K00q03O97
6836B06K67l89p2M87p52J03O39o89q9N72k61k84M00J1n24O92k36n09O47m9m40
6857b70O19j09q20N16N77p80M52J1o16O28Kn69M64K79m13o8L21m69K8N09k58k87
6879b53M78k91p0N08l37m80Q36k33o92O73J06n29J83K59o57L94K51m23R7N30o89
6900c39L75N39q95L04K35k62k24M76l17n0O48k06o68R39l26n63O23k2o02P08j58
$$ y = [-361, -221, 307, -151, -183, 438, -35, -179, 280, 147, -481, 282, 297, -234, 478, 102, -467, 370, 232, -61, 180, 123, -158, 84, 371, -168, 244, 270, -343, -124, 92, -37, -67, 399, -365, -22, 455, -276, 21, 112, -175, -335, 465, -206, -275, 189, 182, -370, -2, 287, -375, -18, 156, -382, -45, 232, -158, -78, 305, -207, -372, 482, -441, -366, 390, 214, -41, 497, 206, -314, 387, -43, -365, 162, 7, -92, 178, 214, -433, 133, 330, -536, 112, 312, -491, 206, 473, 84, 12, 499, -253, -150, 489, -200, -289, 283, 22, -262, 138, 149, -375, 317, 81, -428, 219, 170, -270, 349, 240, -580, -64, 513, -267, 185, 196, -420, 208, 210, -359, 105, 384, -29, -97, 224, -245, -217, 292, 34, -253, 225, -66, -136, 372, 35, -445, 391, 158, -534, 139, 245, -284, -101, 158, -499, -105, 146, -277, -180, 350, -339, 36, 575, -320, -16, 219, -43, -267, 209, -108, -158, 490, 284, -384, 555, 229, -334, 289, 267, -335, 373, 215]
6921B15m60K16K58n97R1O67q07K64L49l47j00P43q73J88M84n40K83M63m87k08
6941a98M56p2m13M03j42m10O69k15k69oM94r13P19M94j215P38O3m25J93N33o51
6962a67r6N96o37J2R02q69j65O24j50j51M05j99l79N42k29k26L52J2m92M11K81
6983C77n05j8L30l50K63K26m01L8L57m97K52O25p24k59O80m52m24R44o41k95P09
7004B35k79m49P24J01n58K53L55m66K56J50q45O11K55m15J45M37p07J93K64l07
7024d7%N35n63j59M33m65J1L73l09k67R39l99j96J97J0l79L36K51o79O12K1p68
7046e13N55M44m82O0J38l10o7N65p70J08P19m59l07L04j60p2P62m04l28N36l39
7067b0m33N14K54n56O03j77m03O14l80m69J58O05q63M96N05r48K97O43p34p3P89
$$ y = [215, -245, -29, 229, -368, -277, 390, -417, -153, 196, -151, -251, 492, -381, -193, 291, -249, 34, 497, 10, -198, 258, 186, -227, 176, 34, -376, 293, 78, -191, -197, 297, -616, 103, 597, -618, 120, 183, -242, -49, 484, -167, -263, 333, -304, -292, 610, -259, -424, 200, 50, -101, 304, 105, -274, 268, 39, -187, 165, 177, -315, 96, 377, -128, -146, 184, -166, 97, 323, -78, -40, 317, -180, 72, 697, -27, -286, 394, -58, -482, 462, -179, -474, 235, -44, -493, 231, 332, -226, 27, 382, -84, 172, 322, -523, 88, 343, -72, 73, 510, -197, -4, 260, -47, -47, 488, -75, -234, 199, -266, -255, 118, -191, -458, 481, 82, -114, 83, 93, -286, 50, 301, -378, 234, 255, -513, 42, 486, 4, 64, 202, -108, -175, 390, -380, -272, 447, -12, -319, -15, -175, -247, 515, 111, -217, 319, -20, -453, 61, 315, -241, 362, 185, -218, 396, 16, -453, -295, 310, -553, -57, 448, -500, -203, 440, -294, -367, 422]
7088D22l18k60N47l51l62N33j77l62M77J17m96L45R3o18L86J8n06N85K04p67O57
7109A67J28l97J58N11r12L13O00o74J5O14l88m03P17m29o13Q84l18m00Q31l97
7129Gm77P83j07n55L33O1l47K04L20l89M6R10j214L19N85o54J18M09p75M13K65
7150B55n71p4R32m63l09N70m45lL06o6n36N73L23n36K40K57p18O3M90o46J67O77
7172D86n30k6N83q41Q7N76q07j47J024o07l0Q09m41p04Q49l12l72O87l72m20O45
7193A37J27q77O30J12n48L64J55m01K53J02k68rO34p67L21K82o13M2Q13o22m73
7214f06P22K15n68L18mk41K57o0l29L70K29p64O64J65q03N15K81p14L51K48m41
7235a95K42L78p44j17J252j033l3O10l29n45P83m12k96Q63l94l33L22K76n40L32
$$ y = [422, 104, -156, 391, 40, -322, 211, 34, -328, 149, 266, -230, 115, 208, -410, -24, -6, -512, 73, 277, -490, 167, 295, -102, 56, 567, -345, -32, 568, -106, -91, 523, 135, -268, 449, 20, -593, 291, -27, -427, 404, 7, -470, 313, 206, -349, -16, 45, -302, -98, 222, -167, -121, 789, -425, -106, 479, -175, -57, 352, -423, -10, 255, -316, -390, 542, 79, -230, 340, -105, -108, 198, 132, -404, 169, 492, -44, 196, 453, -265, -202, 288, -358, -191, 486, -44, -70, 513, -328, -241, 335, -472, -619, 405, -202, -232, 577, 136, -568, 281, -31, -403, 284, -88, -508, 137, 264, -613, 17, 129, -419, -55, 100, -301, -48, 54, -214, -223, 411, -356, -35, 247, -366, -324, 489, -133, -606, 116, 331, -237, 81, 77, -164, 93, 33, -296, 74, 303, -461, 203, 368, -435, 80, 361, -353, -2, 246, -195, 47, 425, -319, -436, 816, -217, -250, 360, 31, -514, 269, -143, -439, 424, 30, -303, 19, 295, -245, 87]
7255H7M80r74N56j52m79Q51L9q42M69K14l26n5Q47j008N7O35m64N8J73l26k99
7276d59J034n11o79Q85k80m07N49O8p68O09K07n03K26K79p47J91Q27r51M50M28
7296D48q15J16M64m00j43P14n08k76P47o96P9N40k57m28Q17j36l90L32m6o53N07
7317A6M4m06L92R3n66L76N25p00l8N68l96K6L38m09j20O32m37k24O45n06m25R77
7339D05k56o84R06k17m09M73J48o72N23j20p25P08P0m89K50M48o89K02J32j69
7359a65o7N40n58r3O12m48k39P64k11n60Q66k62p42P94J45o79L57p1l79O12p4
7380A42o95O53M47j111N92M16r17L16N96o86K9M84l63k22Q01n29l60O85l43l31
7400c96O53o4n78P82j04q54P46J4o01O44J30n44L34J62n01J44M63n58K83K04n90
$$ y = [87, 567, -407, 149, -3, -482, 369, 408, -434, 35, 249, -77, -132, 715, -293, -236, 399, -65, -7, 166, -160, -459, 575, 64, -615, 270, -10, -417, 132, 200, -568, 41, 248, -255, -29, 250, -497, -306, 521, -430, 20, 448, -367, -251, 213, -187, -330, 384, -124, -400, 347, -349, -270, 270, 13, -415, 402, 266, -124, 208, 162, -491, 16, 60, -346, 46, 139, -427, -51, 474, -226, -264, 304, -92, -66, 272, -137, -257, 375, -62, -286, 359, -147, -572, 405, 149, -535, 371, 154, -255, 218, 366, -306, 217, 97, -628, 80, 150, -339, -89, 359, -330, -128, 4, -165, -232, 308, -250, -343, 269, -179, -418, 346, 135, -425, 441, 179, -563, 231, 376, -303, 54, -17, -396, 216, 142, -553, 100, 547, -564, 28, 444, -473, -157, 439, -247, -218, 266, -97, -319, 482, -47, -407, 278, -65, -396, 257, 193, -385, 397, 293, -561, 185, 199, -402, 242, 372, -172, 162, 324, -177, -33, 430, -128, 155, 359, -231]
7421b31R8M88l27l50P61n80j28N23j1o01Q88l09o75P41J15p89O06N9o96N15K66
7442C63q60N62K97n36K00K94o99K99L32l41m71P51j82j66O82m65n75O64n9o31
7462e41O74l36n0O56j93o88P56no56N42L00r95N99L24q36M34J90m26j43O36m82
7483b40P2M90l56n06R23m11k56O86l71l80Q29k58q00O72J15o93O11Q2o55N79J74
7504C07o44M05J37l73O7P66j018K05O07m40l51Q18l11n6K66o01j63Q56n41l40
7524d04O03k31m20Q82k35o07N20N2o19O91L29o16J71J42k64M4M85o38r7O02m04
7545a4j08P07q17m7O57n73k04O21m76r8M33J95p04N56K26p70N87K39r14N46K73
7566C15q26N69K51o56R4N35n62p9P27n25o2N44m02l52R55l11o94R75m02o73P80
$$ y = [-231, -133, 355, 28, -322, 439, -141, -269, 254, 243, -358, 530, 221, -454, 287, 402, -387, 219, 278, -418, 97, 363, -497, 65, 362, -174, 26, 320, -379, -80, 252, -89, -560, 191, 9, -157, 525, 60, -515, 149, 90, -541, 133, -203, -253, 403, 210, -478, 278, 273, -383, 159, 459, -536, 63, 387, -449, -15, 175, -251, -394, 242, -240, -168, 322, -34, -540, 383, -28, -284, 402, 31, -349, 480, 222, -578, 94, 209, -484, 127, 209, -446, 133, 307, -337, 68, 205, -168, -101, 665, -353, -148, 459, 19, -332, 486, 175, 119, 385, -216, -379, 477, -64, -404, 199, -32, -452, 430, 195, -412, 108, 160, -459, 232, 561, -55, 116, 258, -6, 38, 523, -115, -212, 390, -14, -122, 585, -232, -279, 378, -195, -399, 222, -254, -352, 81, 276, -428, 128, 354, -416, 171, 410, -504, 42, 315, -511, 58, 309, -347, -253, 282, -280, -359, 368, -157, -219, 325, -77, -429, 526, 215, -479, 496, 94, -579, 201]
7587B01l3m14N51j87p08Q32J9p49O18K86o52J98M58r06L43N12o25j90N45j67N6
7608a2L62m33l95Q49n46j18O21m22k43L77Qk85P11r2q71O09Q3p63L57L99m79r
7630b92N00n38P4O18o75J21O66o19l61R51l77n43R08m24n14R05k64o15O92K4l39
7651a02J88m6n31N22J24n11M35M20q44K12M43p88L04P40j058N95L64n22k80P12
7671C77k71k53P94o75J2L99k86m07N95k45m89O80l8n66L42J51n54L75M21j005
7691f43Q16L0n70N3N94m31j56O88o77K21M40p09p2Q83p21p2Q52l92n05O88J99
7712E16o93N32l4p93Q82j49n57M28M9n20J53Q39r68K42N35j026M50R00j239k8
7732d81R27l85m98P83l88l55M48j0p17J049j64n66N76M3q25N97K00q09L86N19
$$ y = [201, 168, -246, 305, 118, -590, 242, 261, -488, 130, 416, -236, -38, 420, -486, -143, 369, -256, -446, 99, -68, -12, 350, -83, -478, 371, -175, -293, 328, -94, -337, 40, 48, -237, 474, 382, -489, 120, 203, -560, -203, 196, -283, -292, 208, -330, -256, 362, -313, -192, 474, -145, -506, 445, 68, -475, 433, 9, -505, 400, 136, -479, 213, 237, -102, 86, 40, -491, 31, 155, -356, 79, 499, -345, -133, 310, -478, -174, 566, -492, 103, 467, -55, -335, 377, 106, -147, 647, -28, -16, 383, 97, -310, 285, 40, -449, 231, 193, -373, -31, 120, -434, -59, 362, -643, 173, 203, -367, -314, 280, -151, -307, 381, -296, -75, 365, -344, -416, 467, -254, -326, 526, 134, -371, 317, 516, -177, 355, 321, -472, 410, 261, -296, 132, 181, -339, -186, 653, -315, -73, 462, -564, -114, 786, -453, -481, 446, 61, -437, 346, -42, -397, 51, 41, -676, 373, 209, -357, 219, 262, -563, 34, 234, -575, -189, 330]
7752C30p24M13L95q55M96N00p87NQ82p55j55P76n82j74R44n90j56L97p0r22J143
7773E11j38n71O57j62o06O05P9q67Q32J1p89M07L77o89L40N67o20j06N34k86l52
7794b66P66p18j32R77p16m94J012k00o08P66l33n59O09L58p29J35O98q85M35L98
7814E14q51K78M70n09j66Q68r41j43J068q29R1M92m89j06N35l8n86P13l22l82
7834c33O90j11p14N20J15p38P33J94o94L31J61m31L18L24p97K51M67n79K17M36
7854C60o54j55R81n25k67R23q21l29O81m1n78N98K34j126J252j70j013R20K40
7873E10j147N77L79n28K27N25r59J59O49o97N9Q47p89J37L54n10j01P96p93j74
7893d79J024o87q3O41j74p02N87P2o68M91L02p49L13L47o28M15K85o44N19L50
$$ y = [330, -394, 19, 414, -441, 55, 555, -232, -227, 655, -100, -255, 521, -61, -235, 709, 119, -37, 360, 290, -632, 511, 373, -198, 459, 297, -309, 296, 375, -492, 340, 351, -438, -31, 346, -343, -3, 564, -56, -162, 372, 86, -266, 500, -218, -350, 627, -89, -583, 429, 229, -379, 387, 54, -505, 104, 462, -267, -132, 566, -319, 116, 514, -337, -59, 411, -98, -264, 604, -337, -480, 588, -241, -150, 342, -147, -253, 282, 244, -342, 371, 49, -333, 357, 246, -468, 52, 167, -571, 162, 356, -338, -7, 154, -277, 41, 365, -432, -181, 286, -293, -76, 360, -294, -449, 532, 7, -260, 663, -158, -487, 194, 153, -425, 173, 407, -719, 533, 363, -650, 270, 510, -637, -60, 319, -209, 18, 543, -416, -257, 392, -305, -246, 601, -188, -51, 303, -207, -308, 488, -305, -479, 545, -142, -225, 416, 242, -460, 127, 199, -469, 22, 324, -425, -112, 235, -393, 22, 307, -337, 182, 532]
7913E32q46J36O89m57l42P82l37o01R59o22l57Q76l39n63Q87m91m77P20J85l65
7933c1K10K27o22J39N18r94N64N96j013L11N60q03K63N06o55RP54r43J95N03m78
7954a84j84P58j81n05K76L78p54O02K45o54L85K3o55N10K20n83L79M41n88l34
7974d05P69m16k85R03o68j37N77n79J45M25m00k42R60o92p47J199r7p47O93k33
7994B3n52N40K00p34N02M52j081N49M53p36K99N65q22K1O29l98j84O58o75K1N43
8015B73j96k13M99k06o25P83k95m82M92K26o46N55K75j085P07L06o08P7N53o48
8035b58L89M14j021J27Q80o65j88P89o42k66R27l64n22O84k75l55M58P7q30Q95
8055B54o2p28P22K82q46N39M91j154N09L19o86K33O26q71J44M61o16L3N89n02
$$ y = [532, -314, -178, 511, 54, -288, 494, 157, -444, 515, -107, -464, 412, 73, -490, 397, -94, -571, 149, 334, -31, 179, 406, -216, -77, 441, -553, 11, 607, -406, -95, 465, -338, -75, 431, -224, -215, 539, -404, -209, 294, -184, -368, 390, 209, -296, -20, 358, -396, 206, 451, -203, 182, 205, -450, 60, 280, -303, 76, 517, -71, -405, 364, -52, -337, 566, -102, -239, 338, -241, -96, 329, -71, -313, 647, -45, -792, 407, 310, -437, 256, 23, -529, 11, 211, -523, -21, 431, -650, -101, 352, -384, -85, 480, -342, -321, 308, -90, -274, 384, -291, -270, 273, 77, -136, 363, 157, -468, 315, 20, -462, 30, 256, -390, 165, 440, -645, 62, 368, -240, -163, 390, -258, 131, 545, -476, -349, 531, -134, -322, 467, -175, -441, 486, 122, -400, 284, 9, -346, 112, 189, -641, 254, 192, -536, 186, 468, -378, 161, 652, -502, 7, 326, -360, -127, 499, -372, -228, 233, -383, -350, 239, -263]
8075b63J45P95o53m83O32J30o55O75m7o23Q80o49m37O11L30r62L66N64p05K95
8095e4N63r77L23O77p61j7O42n02j70O88o17j92P60k90o86J062l99n34P87m51
8115a48J0N38k33p18O26K05o74M51M24r43L86N17r11O05L61p83J36Q31p51l84
8135d55Q97m05k89Q48o98m03J169q64l79P41L6n34N02p8o06N40L82r38O73M40
8155E79p63L50K48q45K92N86q22m8Q33n24j55N44m92J6M71k25m19Q25m42m58Q40
8176C91j29p21Q56k1q87O71L43j186P10L98q89M53P28r61R
$$ y = [-263, -118, 677, 24, -459, 173, 303, -352, 323, 276, -347, 533, -116, -553, 58, 388, -574, -208, 356, -349, -54, 509, -468, -145, 532, -229, -246, 396, -106, -276, 412, -205, -397, 363, 73, -613, 449, 50, -484, 303, -148, -138, 400, 167, -551, 75, 280, -394, 57, 481, -462, -76, 441, -470, 135, 496, -287, -151, 680, -71, -455, 442, 37, -252, 596, -102, -505, 664, -200, -579, 162, 198, -336, 166, 88, -518, 22, 404, -534, 139, 579, -184, 166, 414, -431, -139, 447, -375, -423, 410, -114, -269, 275, -217, -201, 270, 45, -374, 451, 9, -449, 391, 262, -459, 397, 376, -511, 160, 503, -683, 27, 425, -464, -11, 717, -244, -235]
8191b35
$$ Imaginary data points
##PAGE= N=2
##DATA TABLE= (X++(I..I)), XYDATA
0@%%%%%%%%%%%%%oJ4j6J6j6J6k4L2l2M0m8N6o5P3q8J01j13J29j48J68j89K15k43
36a28K69l00L39l78M18m65N16n71O31o97P69q47R33j027J132j248J375j517J677
55H81j858K067k305K580k910L307l799M425n244O372q025J0676j5565K7315j02475
70h4558p7191K91549j09307r5606J89479q9711j04783K05868q5410j41937J96891
81I5284l5281j53272K05737l3559k44136J78646Q5750k35465J04686J19397j91748
92a03961O7638J16682j86733O1713J47119j89474L5309J95017j86480l3654K19874
103A43050j42828q5694K29294r2787j52659J75287l5818j18271J60857o2853j50411
114a32833K08443l196k26777J51521P4618j97185J28031J08456k18307O1794J50590
$$ y = [0, 0, 0, 0, 0, 0, 0, 0, 0, 0, 0, 0, 0, 0, -6, 8, -8, 8, -8, 8, -16, 16, -16, 24, -24, 32, -33, 40, -48, 53, -60, 69, -79, 89, -100, 115, -128, 141, -159, 180, -198, 220, -245, 271, -300, 331, -366, 403, -444, 489, -538, 594, -654, 721, -796, 881, -977, 1090, -1215, 1365, -1545, 1762, -2037, 2388, -2856, 3516, -4509, 6167, -9398, 17917, -84558, -161749, 129800, 20493, -75113, 114366, 24655, -80128, 125740, 40330, -101607, 95284, 60003, -93269, 112468, 78909, -165227, 13419, 99169, -136296, -31610, 87787, -103961, -36323, 80359, -106374, -44661, 102458, -87016, -51707, 143310, -43170, -76824, 143050, 222, -85472, 143822, 51035, -101624, 73663, 37845, -80426, 80431, 17578, -132833, 75610, 72414, -154363, -2842, 71776, -125409, 2622, 111078, -107229, -45435, 105155]
125A05155j61315L2935J25443j69640M3401J76366j99655m6822K16147j25150
135c135q3274K03561r9213j29472J89812n2507j44421J72023j5104j43543J66403
146F1130l084j83440J58356N1377k09932J24509J20686j98518N1379J27487j66108
157f6158L7989J38686j70575K442J64213j48794k9504J78691j34814o6391K11870
168A17655r1667j39601J72899k9471j21083J61262k3102j47566J58622J2396j81887
179a11543J25584N4850j74235J15309R2538j97228O1057J31088j71713K3107J48822
190I7636j43800q1J51977j44673l3258J78071j17497p1513J89008q2871j14455
201i1456J71846n1955j39441J67859l21j52804J31593J6357j57748J27013M5417
$$ y = [105155, -56160, -23225, 102218, -67422, -24021, 152345, -47310, -94132, 122015, -3135, -86409, 117152, 17939, -111533, 78279, 25772, -118649, 53374, 38270, -105273, 61130, 58046, -125394, 32962, 84339, -125593, -1084, 119602, -78916, -27537, 99950, -66158, -28169, 110517, -60058, -57616, 106597, -42197, -71701, 106990, -27824, -94215, 117655, 25988, -113613, 59286, 29815, -91268, 69994, 46892, -100674, 57948, 70344, -111543, 14041, 68891, -105344, 9965, 102503, -94725, -33668, 97420, -74293, -51186, 97636, -46164, -46245, 105732, -38941, -72199, 105872, -11625, -83138, 105870, 22999, -91456, 80390, 28435, -111006, 56853, 56532, -96272, 35321, 51678, -106070, 20943, 66360]
212F6360j80169J07903J02728j77475N1645J16621j56867L6328J43530j51459
222d0855j0066J56247j25765m3672J56635j02974n9258J72364q5920j13726J61053
233F4063m0821j27393J49702n253j36872J35502J8902j63294J08185O1281j50185
244h6183Q9817Q0280j60074O5509J13025j63495J9734J43162j28104j1860J34067
255I5878j25716l4201J59229j02230p5123J60400o5975r9616J45617m8429j17988
266a08154J56999n03j43497J22932K7517j44525J05721N0667j51985R2354R1101
277I8627j58174M2589J03859j40349K7359J24921j38891r491J45274j16252n2495
288g3023J40345q2561n6049J48621p3784r8007J49433l0386j17371J30507K050
$$ y = [66360, -113809, -5906, 96822, -80653, -29008, 87613, -69254, -32926, 110604, -40855, -50921, 105326, -20439, -64111, 92524, -10450, -69708, 102656, 16736, -96990, 64063, 23242, -104151, 45551, 40298, -96574, 38928, 57830, -105464, 2721, 64002, -86183, 3634, 83914, -76160, -10651, 102374, -61121, -41387, 101775, -26329, -38189, 95878, -29838, -64039, 95190, -7040, -82163, 78237, 12262, -87354, 58263, 9834, -108154, 48845, 48342, -95155, 27777, 55294, -89231, 16490, 67157, -84828, 7526, 98627, -59547, -16958, 86901, -53448, -26089, 98832, -40059, -49550, 95724, -20528, -73023, 67322, -15239, -71288, 77333, 3549, -94458, 54975, 24589, -92782, 37725, 39775]
299C9775j17971J21475J7465j47100R9091O2212j39198O8990P4482j40198N0802
310a0175R7786j45352J4845J27823j14043j6122J18654j09412l2153J45037q6495
321i607p0432J46316m8478r0984J25184l7985j01477J40230L5j31601J08837L0191
333F0229j31097Q5631M4382j35353Q1098Q1922j45530L3511R8268j23265J8681
344c1523J10050j20757o845J32869j03353m9230J29485o8961n2478J32076o3984
355G349q8709J35648k4604j09182J14357N430j05841J04772J4237j34408Q9617
366H666N9796j27333N6892O9990j21466M2176Q4898j29924J4396J18530j01738
377b5117j9192J08827r2637l2200J27713p5985o3191J31631m0794q2088J09954
$$ y = [39775, -78196, 43279, 60744, -86356, 12735, 74947, -64251, 4739, 79221, -60977, -10175, 87611, -57741, -42896, 84927, -29116, -45238, 73416, -35996, -68149, 76888, -9607, -80039, 66277, 17799, -73185, 51999, 14014, -87463, 52767, 52802, -78799, 30038, 60229, -70868, 14763, 59145, -76208, 4890, 86812, -58718, -25207, 73061, -50204, -31523, 78527, -42230, -49075, 83794, -19559, -68789, 60696, -8265, -60743, 71333, 7349, -81360, 54288, 29684, -79498, 34859, 40289, -65552, 39220, 53457, -80951, 8666, 68462, -58871, -1979, 68011, -53455, -11279, 73619, -56305, -41909, 76621, -25117, -44309, 64518, -28119, -60319, 67394, -8591, -71782, 59849, 19055, -63033, 46921]
388D6921l1415r1092J23623J799j19772R6104L2198j18274P2114M1458j19630
399f5966O9153P3077j31253K7527R0330j09644J2949R9518j05878q040J21459
410G3232r2447m7194J20809n6224n0685J17113n2827p8212J21671k2881j00601
421f8246J04048P467r9521R1628J4776j24126P7728N6273j16581M5856O4551j06292
433e2439L6811P5563j16755J4369J10486r1303j9207J03050p9251l1869J14796
444F4251o2625n7321J15731l6408p4911R8664k7497q5129J07739Nj08459Q6556
456B0596K7746j12302O2384M4383j04799N6488O4697j13043K8457Q3189r9048
467d1252J1308R3186r2309o104J10802q4865m6066J12270m7226n2949J00014m5014
$$ y = [46921, 15506, -75586, 48037, 49836, -69936, 26168, 58366, -59908, 12206, 53664, -65966, 3187, 76264, -54989, -27462, 62868, -46776, -33827, 65691, -40187, -48227, 73232, -19215, -66409, 54400, -1824, -52509, 64604, 11777, -66435, 55236, 32355, -68246, 35802, 43269, -56252, 35376, 50152, -73974, 3754, 60027, -56554, -10698, 53853, -52439, -15628, 59935, -56820, -42451, 68035, -23268, -42475, 60575, -18676, -50545, 64251, 1626, -55695, 60036, 23628, -51283, 47381, 19884, -65245, 42494, 42499, -65960, 20596, 48342, -63960, -1576, 42807, -61992, -5504, 59193, -53850, -25393, 57796, -41252, -29944, 63242, -29067, -35171, 75631, -9234, -55300, 56970, 9744, -43205, 56809, 11795]
479A1795o9516J05365k3708r2129R4758N851r4509Q4279J8300j13610O7623N6762
491E1261j02782M1363O2817r5052L0191P1355r9829J3107R6900q6617j6891R9141
503F4964p4128m0525J02579n1143n4589J02519l2820p3773Q8088j6080p5836R0643
515B9899j372r3156Q6252K9051j09638N4003N1577r2337M4320O0124r9860K2083
527a9054P6650q7430M657Q0742q2773o332R9779p9384m4876J05964m1983n4994
539d9034R3220l2089o6724R1221j5638p8812Q6721N546q7435P5858J9750j02082
551e9498O1511M7702j00131M0134O6181r1510J3743O6452q1301J1560Q2947q0898
563b3108j2636R3974o5414l6940R3120m9090m8702J01789k7322p7345P7835m865
$$ y = [11795, -57721, 47644, 23936, -68193, 26565, 32416, -62093, 22186, 40486, -73124, -5501, 51261, -51521, -10158, 52659, -42393, -12202, 59153, -40676, -27569, 69331, -17286, -34177, 64964, -9164, -49689, 52890, 1747, -52842, 49677, 16857, -56916, 31172, 15092, -60744, 29899, 28527, -64629, 21623, 50674, -58964, -4961, 46616, -45721, -1401, 58723, -41137, -19054, 57596, -29834, -25177, 55565, -27208, -33540, 66239, -13145, -58021, 47943, 5960, -49034, 44186, 12097, -54627, 36594, 20956, -57856, 28865, 34411, -53024, 22834, 42584, -59498, 2013, 49715, -50416, -10282, 55899, -35611, -21868, 44584, -36717, -25157, 57790, -23108, -35744, 58230, -7184, -44124, 48996, -94, -48796, 52993, 25671, -51674, 26161, 21296]
575B1296o8052P3174k152q1578P6431K3181r9165N0548M5310q8333M0894O1049
587E2603r2005J5257P6109p5156k365P6608o5323r042Q2393o8952l2949R7295
599E4473m6204n7073R0867k4269o9106P8950j0917p6587P6417J4140q0348N8331
611H674J9175q2454O0140L8860r6421M2102P1241q6655O128O7748p2080L155P8532
624E8145o7718j9873Q0304n5350l2619P9584m9128m4750R5536k7643p6053P7847
636A8282J101p2162O4137J2204p0673O1711K2509q3257M8176M1437p9587L6889
648G67N4608q6831J6641P4111p7261j3584P6245n1654j8249O6200n8219k6644
660d3870Q5487m2547n0492Q3423k2336o0737P8330q280p5844P2494K3865p4858
$$ y = [21296, -46756, 26418, 24266, -57312, 19119, 42300, -56865, -6317, 38993, -49340, -8446, 52603, -39402, -24145, 51964, -23192, -25557, 51051, -14272, -23314, 59079, -9873, -42822, 54473, 8269, -48804, 42063, 17794, -51312, 27638, 16721, -59866, 16551, 30691, -49657, 8674, 27849, -54605, 5535, 44395, -52026, -9924, 61317, -25338, -19210, 48538, -23542, -20387, 58145, -9573, -29446, 50858, -4492, -37111, 42473, -6655, -51405, 44131, 16488, -59565, 18282, 19383, -52779, 11358, 23562, -47111, 14600, 37109, -46148, 2028, 43465, -36122, 767, 55375, -31456, -14815, 59296, -17965, -31549, 44696, -6958, -25207, 40993, -17226, -43870, 41617, -930, -51422, 32001, 9665, -51072, 27258, 18978, -56866, 15628, 39493, -35365]
672c5365M5835K1843p0575M9497L2837q5108L8165O0254q4301P118O4076p1060
684b6784l606P6319n9563k3456P5617m4248l3909P0273l6965l5417Q4722k8307
696A4676o6095P7984K727p3034N8028J6484o8029N2011K4518p8652L5851M0603
708C7072o9384K8268M5666p7887J6499O9677p2037j4362P5978m5494k1902O5744
720C7838m5898l0843P6915l0725m6616P2149j8033n6116O8872p006p1358O5074
732A4253K2398p3739M0453K7685o7935L6384L4978p2621L0715N5688p2905N322
744a9324O0753o2910m317P1600n5426k3887P4304l8658l8708O4649k8181l7501
756c7606P2761k2040o0583O8473K862o6515N4201J5287o5039M8396K6911p3830
$$ y = [-35365, 10470, 32313, -38262, 11235, 44072, -41036, -2871, 57383, -26918, -19800, 44276, -26784, -30390, 45929, -13634, -37090, 38527, -5721, -39630, 30643, -6322, -41739, 42983, 14676, -51419, 26565, 29292, -43742, 14286, 30770, -37259, 14752, 39270, -39382, -3531, 37072, -32312, -4044, 41622, -36265, -19766, 49911, -22126, -36488, 39490, -6004, -27906, 37838, -8060, -38903, 38012, 7287, -39329, 32820, 14787, -41329, 27543, 20537, -50821, 14253, 36651, -37088, 3365, 31050, -36885, -501, 34477, -38144, -7429, 48259, -24646, -19324, 41429, -21481, -25798, 45802, -9624, -33511, 40793, 2135, -36573, 28076, -105, -37606, 35155, 13115, -47468, 21005, 23867, -42648, 11553, 26840, -38199, 10197, 37108, -36722]
768c6722L1052M3056o3597K1083M5350o7022J0631N9891o3416j0546O9026m4689
780e903k3060O3441m0750l2402O9713k5508m5106O6381j1172n2636N8688l153
792A8533o1826N8615J8547o7723L9598K8770o5872K9829L5979o6402K2852N2070
804D2970o5173J637N6294n5109o643O3904m8980k1247O8805l6425l6999O4109
816B7143k1797m0077O5105j4266n5474N9684L416o1210M8703J7169o1150M1225
828H471K4584o8264K8833M1355o2026J5469M7417n8336M770N3756n5463r107O4588
841C6047m0744k2888O0000l3635l1604O3141k2647m3401O2138o969n2561N0644
853A7521J510n6051M9785J5661o2798L7121K9210o2563K4218L6275n8843J9419
$$ y = [-36722, -5670, 37386, -26211, -5128, 40222, -26800, -16169, 43722, -19694, -30240, 38786, -5903, -28963, 34478, -6272, -38674, 31039, 5531, -39575, 26806, 15634, -37002, 21686, 18533, -43293, 15322, 33869, -33854, 5744, 34514, -31358, -1529, 34450, -31952, -9100, 42970, -22203, -20566, 35728, -19381, -26024, 37880, -11100, -32347, 36458, 33, -36966, 27143, 5346, -34731, 30374, 16108, -39366, 20318, 23734, -37476, 11227, 28396, -32754, 8471, 33055, -35209, -6376, 34979, -27047, -11578, 35839, -22497, -17727, 36029, -19434, -28541, 36047, -4697, -27585, 32415, -1220, -32824, 30317, 7670, -35731, 26407, 19438, -33123, 17521, 19031, -37020, 12765, 28426, -34372, 2749, 31959, -30604, -6386, 29889, -28954, -9535]
865i535M7906n9767J82N5607m8279r893N7969m1086j9023O2297l5186l6139O1471
878B6524j7195m0865N6780j1099n0085N4234K650n9415M5291J9273n6323L5190
890D960K3559o1947K7505L9966n8898J2154M7146n0916J312M9233n0496q720O1250
903C6108l8458k4749N6434k7970l1282N6539k0578m1402N8108l975n1311M4372
915A1836M945m9825M4021J4801n8183L4106L0160n8078J8241L6048n1437J4785
927h580M4878n4275k567N2266m1639j2807N2280l5582j8575N8224l1584l6778
939c4739N7692j2170m0245N0107o335m6517M8435M942n5845L9670K0377n2112
951b6740L0169K3226n7851K4525L9334n5514P716M7060m5062k397M5505m4111
$$ y = [-9535, 38371, -21396, -21214, 34393, -13886, -23779, 34190, -6896, -25919, 36378, 1192, -34947, 26524, 9329, -31536, 25244, 14145, -35940, 18294, 20944, -38471, 6820, 26093, -30230, 4960, 28519, -33428, -5923, 34043, -24855, -12701, 34445, -16471, -15159, 34074, -16422, -25142, 36108, -2350, -27099, 29335, 1365, -29917, 26622, 6044, -35358, 22750, 18775, -32536, 11836, 16781, -33044, 10977, 25778, -32405, 1701, 31861, -26217, -7976, 28072, -23365, -8580, 36298, -17977, -20544, 31722, -9917, -22724, 29556, -6026, -24601, 33623, 2039, -34739, 22953, 10783, -29462, 20645, 14310, -32207, 16228, 21170, -34675, 4995, 25372, -26740, 3429, 26655, -31196, -6671, 32663, -22851, -15135, 31925, -13137, -15534, 29971, -14140]
963a4140q759N6670l4388k4627N2598k4370l0547N2447j7986m0526N3759m80n0201
976c0550L8536P400m5538L8037J4601n3349L1202K8765n4197J6803L5183m7678
988b0785J1489M4528m8674n492M9227l6409j3983M7080l0344j7951N1451k8969
1000A168l4161N4153j1198m0595M6735k361m4677M2253P438n1143L4781K1414
1012B3807m6485K5679K1671n1314K3051L6840n3177N939M6862m1836o474M3229
1024B7792l8344j1648N0843k9659k3236M6435k1742k7777M9068j6264l9230N1269
1036A7507J138m8269L6615J1397m4139L1549J7208m6223K5830K4684m9389J6097
1048e995L3672m6231Q700M1557m5089o864M7571l3276j8094M4870k2735j7961
$$ y = [-14140, -22899, 33771, -617, -25244, 27354, 2984, -27563, 24884, 6898, -33628, 20131, 19651, -30550, 7986, 15386, -30152, 7885, 22486, -30863, 339, 29104, -25093, -8290, 26893, -20785, -9296, 35232, -13442, -18934, 30293, -6116, -20099, 26981, -3363, -21314, 30137, 1168, -32993, 21160, 9962, -30633, 16102, 13741, -30936, 11317, 18755, -32388, 2393, 23807, -22678, 3001, 24672, -26642, -3591, 33249, -19928, -13989, 32873, -8963, -15437, 27792, -10552, -22200, 28643, -1016, -24252, 22183, 441, -27336, 21732, 5468, -33762, 17507, 18645, -29624, 6991, 18388, -25751, 5798, 23006, -23217, 2613, 27297, -22092, -5995, 27677, -18554, -9854, 31703, -13386, -20250, 27321, -5955, -24049, 20821, -1914, -19875]
1060a9875M3628k4817k8690N0166j0409l8054M4058k74m2998L9418R598m9543
1072b7792K8682K2911m1507J9305J9874m5446J9738L2424m8888O514M3245m0507
1084a1447o664M4345l3779j5894M7234k2555k2400M1749j7817k6537M4117j3102
1096G250l4372M5579j340m6391L6370J3778m5369K4782J9893m0529K0242K3091
1108B2984m4215J2271L2086l9138P410L7081m1687n016M7076l1340k0913M3151
1120A9750j6971k0046L8587j8525k8531M2051p760l3752L8823o18m0254L6038
1132H792J0839m6527K5440K3407m0021J6181K3924l9128J1915K9015l9531O377
1144i317L7554l8508p254M2953k9652j6628M2540k1209k3549M1264j2820k9371
$$ y = [-19875, 23753, -1064, -29754, 20412, 10003, -28051, 16007, 15733, -27265, 12153, 21751, -27792, 890, 23801, -17706, 1599, 21473, -23973, -4235, 28189, -20699, -14185, 29060, -11447, -18111, 26234, -7545, -23439, 23795, 1240, -21160, 20589, 2772, -23765, 20352, 7250, -27122, 18457, 17117, -29274, 7096, 20874, -24495, 287, 20180, -20349, -107, 22984, -21231, -8960, 23126, -16012, -8602, 28479, -13208, -18224, 28852, -2488, -23401, 19750, 2779, -17267, 21320, 2795, -25736, 16315, 8555, -25197, 13626, 13008, -27246, 8792, 19631, -26896, -1456, 21951, -18070, -1889, 22035, -17093, -5178, 23837, -15694, -9317, 28237, -10271, -17525, 25428, -4224, -20852, 21688, 479, -23070, 18194, 5374, -23997]
1156b3997L6234o523k8839L8966k087m1696L4471J3645m2314K3681J9313l9138
1168a8284J8660K4619m1308P050L0221l3040M356L1887l5672m857M0387k9555
1180e536j7193M1369j7468k1429L7847j2888k7698L6259m695l0643L4020K263
1192A4208l4912K8763Q868l9029K4948J9306m0727J4342K6275l5946O259K6929
1204A9284l3614L224L4700l2436q675L6671k4112j2991L8840k1249k1675M0263
1216A8230r800l0119L2738k294k7743L2531Q46l6329K7274J1488l6739K0846J7226
1229A8155l6066J5822K3906l7969N155L0401k9882q24L1131k7295n797L3976k5390
1242d677j4513L8107j5457k1652L4479j0473k5903L3165k682l1721K8930O860
$$ y = [-23997, 12237, 5714, -23125, 15841, 13754, -27942, 6529, 20174, -22140, 1541, 20854, -18284, 376, 24995, -16313, -9263, 20958, -12082, -7726, 24161, -11511, -16368, 24019, -5536, -22729, 18640, 1172, -20257, 17590, 4702, -22996, 13263, 8568, -22075, 11945, 14208, -20704, 8059, 16927, -22102, 2846, 22152, -18575, -4233, 22042, -13904, -7645, 19284, -14330, -11106, 23594, -8842, -17517, 19154, -4958, -17949, 20891, -358, -22033, 18230, 8430, -21689, 11049, 8755, -18988, 13543, 14389, -21940, 5334, 16822, -19917, 929, 18155, -17911, -2089, 21817, -16152, -10997, 19404, -10478, -11302, 19829, -7466, -13263, 20713, -4677, -19190, 18917, 3460, -18192, 16287, 5814, -20089, 13076, 10394, -21327, 7603, 14463]
1254A4463l1890K1629Q369l2978K1740J7803l6817J1826K5321l2064M957K6283
1266A8642k9793K17L3004k6081j1022L2152j9686j1903L2618j7422j9776L5350
1278A6300q979k8562K9994j94k7209K7413L545l2118K3028J2056l3001J6563J7271
1291A6107l0488J3139K1296l4223N090K9461k7639l651K8968k2663p409K9796
1303A7784k1281j4685L3220j2037j9534K9283q517k2994K9538j178k9289K5764
1315F074P936k8936J8171R589k9184J7353J6860l1251R022K2350k8339K907K3821
1328A6373k5804j244K9246k2484j0980K9044j5692j3144K8715j3264j7396L0245
1340A3615o564k5200K5862J393k4772K3155M891k8934J9993J1341k9665J3053
$$ y = [14463, -17427, 4202, 12571, -20407, 1333, 19136, -17681, -5855, 19466, -12598, -7641, 18642, -11151, -10934, 22070, -4011, -15033, 17119, -2567, -14470, 18148, 726, -19050, 16300, 7321, -21241, 8753, 8559, -18650, 8763, 12308, -19810, 3218, 15274, -17727, -1164, 16107, -14381, -1242, 20054, -14169, -9079, 20382, -7257, -10908, 18060, -4603, -12012, 17784, -3497, -18182, 15038, 3001, -16533, 12750, 4233, -18761, 10777, 9599, -19690, 6074, 14010, -14926, 3245, 12834, -16350, 1003, 17863, -13388, -4366, 17984, -10355, -7448, 16373, -9431, -10675, 18571, -3913, -14893, 14151, -1541, -14685, 14030, 766, -16630, 13615, 7051, -18149, 7713, 9106, -15666, 7489, 12380, -16554, 3439, 14780, -14885, -1832]
1352a832J6713k6912R731J8868k8971L719K5620k4099l897K6500j9457p499K6688
1365A5172j7305j3791K9720r999j8486K6031o046k1019K5157q13k5359K2246P396
1378A2904k6815J5649R711k6021J4111J5297k7124P447K0520k4437J226K1533
1390A4001k1303j832K5635j9615r515K6094j3810j2875K5242r899j6053K5643
1402A1713n382k2129K2216J932k2418J9685M895k5002J6521J0986k6422J1039
1414b366J6056k3623O863J7405k4090K575K2498k1216m017K3974j6481p942K3142
1427A2778j4305j2288K5734q307j7202K2948m081j9121K1151K30k2126J9523O752
1440A1686k4061J3182J0132k2548J0682J3868k3235N940J8537k1480l28J9949
$$ y = [-1832, 14881, -12031, -2300, 16568, -12403, -8684, 16936, -7163, -11060, 15440, -4017, -11516, 15172, -2133, -15924, 13796, 3797, -14689, 11342, 5296, -15723, 9434, 8621, -16738, 5508, 12904, -13911, 1738, 11449, -14572, -461, 14836, -12288, -4841, 15679, -8758, -7532, 14001, -7302, -9134, 16501, -3114, -12629, 13465, -345, -13220, 12022, 2123, -13930, 11713, 6331, -15798, 6418, 8350, -14068, 5617, 10512, -14490, 2031, 13017, -13405, -2366, 13690, -9933, -3070, 14335, -9755, -7180, 15318, -5898, -9915, 14059, -2422, -10364, 12778, -1527, -13815, 11919, 3612, -13590, 9358, 5277, -13844, 7307, 7537, -14589, 4934, 11686, -12375, 807, 10939, -11609, -927, 12941, -10294, -4354, 14183, -7297, -7625, 12324]
1452A2324j7888k701K2131j6719q606K3063j1269j2534K1916o777j4430K1026
1464I536l863j9835J9923K700k0804J6312N930k1691J3364R498k2997R271J4771
1477A2115k0336M343J5973k0308J516J9588j7938m460K1792j3577q580K0738j1185
1490c19j1260K1739o393j5590J9635k302j7477J7666J066j9382J6585O421k2018
1503a1629J1069J0685j9901P960J2775j9579M961J6010j8977p80J8526j4674l900
1516g454J9345j3452q266K0667r098j2780J8492m295j2864J7445k940j7234J7042
1529D608K970j8763J3115O790j8745J0716R479k0122O844J4032j7187K642J4302
1542A0681j6824O60J6969j5495m433J9577j1427q862J7732q024j0790J7857m150
$$ y = [12324, -5564, -8265, 13866, -2853, -11459, 11604, 335, -12199, 9717, 2940, -11490, 9536, 5673, -14162, 5761, 8461, -12343, 3969, 9899, -11792, 1572, 11070, -11927, -2656, 12115, -8221, -3878, 12095, -8213, -6697, 12891, -5047, -9507, 12285, -1292, -9872, 10866, -319, -11579, 10160, 3767, -11823, 7812, 5510, -11967, 5699, 6765, -12617, 3968, 10389, -11629, -560, 10125, -9776, -1816, 10959, -8620, -3659, 12351, -6626, -7406, 11120, -3554, -7454, 11891, -1561, -9827, 10840, 1742, -11038, 7454, 3159, -9705, 7740, 4800, -12434, 4608, 7578, -11185, 1930, 8720, -10025, 691, 10170, -9952, -3108, 10924, -6263, -3621, 10681, -6143, -5483, 11486, -4009, -8442, 11135, -292, -9154, 8578, 554, -10236, 7621, 3471]
1555C471j4027J6705o95j5834J4478J811j6663J4160N726j9467R281J1027j7454
1568g481M740J1824j5670L487J4124j6015j865J5983j2160l626J6702j1877p894
1581i728J9082p182j2403J5900j779j2212J4201j303j4705J3828L042j5797J0795
1594A739N990j6607Q667R364j7547M698J3511j4776N09J2958j2760q94J3751j1961
1608c358l494J6727r849q454J6149o548j0077J6047l189j3187J3741J229j3558
1621g821J0287J714j2829J1479M846j7056Q027J0152j5831L990J1301j3639J181
1634d199J4005j2500l112J3289r213l211J3710r932o456J5786o414j0997J4381
1647E137j098j2455J2040J057j3235J0169L590j3069Q883N362j3824P477P569
$$ y = [3471, -10556, 6149, 5454, -10380, 4098, 5909, -10754, 3406, 9132, -10335, -1054, 9973, -7481, -2741, 9083, -6587, -3100, 11024, -4991, -6856, 9127, -3033, -6659, 10043, -1834, -9728, 9354, 2172, -10231, 5669, 3890, -8322, 5879, 4576, -10129, 3699, 6741, -9056, 1739, 7729, -8878, -211, 9153, -8394, -3696, 9815, -4961, -4452, 8506, -4254, -5148, 8603, -3358, -6852, 9875, 26, -8428, 7721, 1173, -8904, 7143, 3954, -9233, 4508, 5737, -7821, 2466, 4180, -8649, 2830, 7676, -9380, -1353, 8799, -7032, -3042, 8259, -5380, -4199, 9806, -2694, -5806, 7483, -1730, -4941, 8769, -1163, -7619, 8167, 1753, -9244, 5137, 4039, -8416, 3624, 4681, -8554, 1615, 5205, -7864, 1019, 6381, -7443, 34, 7603]
1660G603j4933M848J2061j3406r03J3104j0072l069J1907r249l612J3474p773
1673b0o736J2824n797q969J4381k270j2881J2453K746j2796Q100L495j1143Q378
1687A765M691j2788O472P613j3518L730J0430j3014L69J2681j0434m224J2498
1700F271p126m813J1288o353n595J2512n620q820J3363j274j1618J1136J905j2446
1714g190Q821M373j1669O029N717j0597M663N870j2186M087J0194j2277n99J1820
1728G056r042l716J1324o845m756J1439m561o492J0282l572p577J1560j863j0507
1742g270J0955J990j2094O998M859j0523N214N216j0481M183O945j1020K471Q697
1756F140j0344N37J0599r139l325J1385o002m995J0021m082n500R844l995p361
$$ y = [7603, -7330, -2482, 9579, -3827, -4730, 8374, -1698, -4767, 7140, -2109, -5721, 7753, -20, -6756, 6068, 271, -8698, 5683, 3413, -9468, 2985, 5731, -7065, 1035, 4530, -6613, 1765, 6456, -6332, 140, 7753, -5765, -2035, 8395, -4619, -4250, 8431, -2003, -6227, 6271, -855, -5668, 5620, -733, -6328, 6184, 564, -8256, 5107, 3833, -7785, 3351, 5256, -7190, 1631, 6004, -5665, 364, 6081, -4516, 147, 6017, -6169, -2082, 8112, -4165, -4764, 7056, -1986, -5702, 5622, -1223, -5979, 5460, 899, -5593, 4689, 1117, -6460, 5100, 3237, -7270, 3685, 5675, -6419, 579, 5438, -5085, 129, 5345, -5136, -953, 5992, -5028, -2557, 6140, -4204, -3667, 6932, -2207, -5532, 5853, -149, -5144, 4877, 795, -4705, 5139, 1144, -6217]
1770f217J0774j006r506Q698J449j0665P610M197j1041N158N919r203K516O004
1784D687r316K483Q622r982j09J0085p563l579J0204n753m897J0238l752o792
1798e424R547k008p694Q880r43q320Q675J718j0350O261M237r341M618N055r408
1813d497L297O526q784Q32Q122p796p98Q946p911k560R964n205n221R018l276
1828F57n767Q604k019p314Q721K18q272P138J739q794N922L452r105M703N608
1843E491q841J728O684q629J029P776p634j188Q670o231k958Q402m742l928Q787
1858D416l476o060Q592j081p048P262K30p431O911J777q988N437L827q289L429
1873d92M733p858K270O038p886M63P185o227j439P733n933k299Q147l993m612
$$ y = [-6217, 4557, 3551, -5955, 2743, 4192, -6473, 1137, 5334, -5707, -549, 5370, -3833, -1317, 4687, -4629, -2146, 6476, -3506, -3615, 6470, -1093, -4672, 5532, -221, -5118, 5120, 1368, -5424, 4123, 2115, -5579, 3301, 2358, -5962, 2713, 4431, -5919, 342, 4579, -4762, -144, 4911, -4497, -1200, 5326, -3458, -2626, 5496, -2300, -3098, 5848, -2063, -4623, 5341, 136, -5085, 3933, 657, -5110, 3494, 1475, -5839, 2882, 3100, -5172, 1966, 3705, -5089, 833, 4285, -4820, -117, 5491, -3350, -1622, 5062, -3567, -2538, 5238, -2396, -3584, 5086, -1145, -4103, 4299, -443, -4371, 4416, 940, -5120, 3472, 2391, -4657, 2605, 2835, -4596, 2315, 4092, -4896, 541, 4368, -3921, -492, 4241, -3617, -1347, 4691, -3195, -2732, 4453, -1774, -3213, 4520, -1413, -3712, 4435, 442, -4170]
1888d170P873k399n071P139j606o729P529R59q003N655J934p200M429L274q094
1903d480L550N122p426J147O127o672J89O822o166j413Q038n079k898O937l849
1918e1l634P552k508n732P100n54o430N893R68o774N246K015p236L692M009p055
1934c499K723M416o558J640N725o595n05O875n004j653O192m219k690O755k907
1949F96m772P184j746n175O149o37o261O271J217o710M362K391o434L559L078
1964C172o672K714M831o234M49N737n849k33O040n012j896O798m295k786O084
1979B848k224l902O250j485n415O189l20n773M685J586n889M303K337o443K827
1994d26L585n819J543M396n306M09N458n642n83N966m098k162N733k933l081O375
$$ y = [-4170, 3703, 1304, -3767, 3372, 1766, -4963, 2566, 3525, -4478, 1177, 3111, -4089, 340, 3614, -4480, -930, 4192, -3234, -2087, 4040, -2632, -2443, 4379, -1787, -3200, 4838, -241, -3139, 3798, -51, -3685, 3867, 1359, -4373, 2727, 2173, -4257, 1636, 2604, -4170, 1076, 3091, -4145, -453, 3556, -3499, -776, 3640, -2918, -1278, 4447, -2148, -2653, 4222, -782, -2435, 3757, -462, -3152, 3603, 696, -4076, 3108, 1362, -3813, 2336, 1699, -4562, 1709, 2926, -3784, 578, 2969, -3465, 94, 3172, -3500, -786, 4045, -2189, -1740, 3997, -1852, -2085, 3955, -1057, -2953, 3845, -450, -3236, 2848, 624, -3278, 2972, 1487, -3928, 2261, 1941, -3832, 853, 2439, -3450, 853, 3190, -3253, -426, 3159, -2660, -1117, 3279, -2027, -1618, 3840, -1802, -2385, 3581, -517, -2679, 3054, 121, -2960, 3415]
2010C415l049l910N621n34m924N210J6n498M790J388n920L438L136o013K222L499
2026B887n441J680M274n353K12N119m776q59N722l923k456O380k980l522N289
2041B253j958l259N156j015m753N213J48n380M155J996n251K841K847n905K287
2056f25L728n120P25M253m473pM742m396j320N350k718k818N295k494k950M978
2072B150j310m231N130j55m708M200N57m771M104J672n355K613L107m965J401
2087e61L256m682J039M504m461q32M836l801j715N032k852k559N574k415l499
2102c136M838p51l716M220J96m614M072J154n223L078K421m924K309K773m934
2117b237J296L865m307j88M173l560q53M371l423j562N049k508l089N096j377
$$ y = [3415, 366, -3544, 2077, 1543, -3381, 1829, 1845, -3653, 1137, 2525, -3395, 43, 3179, -2834, -612, 2887, -2554, -874, 3400, -1953, -1741, 3378, -1398, -2257, 3465, -458, -2914, 3466, 486, -3036, 2253, 295, -2964, 2192, 1177, -3576, 1637, 1785, -3595, 560, 2556, -2695, 146, 2993, -2912, -625, 3103, -2017, -1292, 2961, -1512, -1519, 3223, -1173, -2493, 2857, 139, -2679, 2616, 122, -2828, 2150, 840, -3391, 1739, 1584, -3124, 1076, 1633, -3138, 966, 2638, -2717, -104, 3003, -1962, -561, 2695, -1987, -948, 3556, -905, -1737, 3099, -702, -2417, 2615, -237, -2796, 2778, 363, -3136, 1702, 951, -2765, 1455, 1651, -2963, 1109, 2263, -2960, 118, 2539, -2385, -76, 2697, -2237, -941, 2924, -1383, -1571, 2602, -958, -1811, 2560, -863, -2425, 2624, 116, -2973, 2123, 746]
2132G46l572M419k84m365M282O83m586L669J301m851K934K147m682J500L523m404
2148a540L53L721m205K81L932l615m43M269l032k086M789k026k899M609r93l861
2164b746L964L17l867L318N22l985K982J579m812K494K849m566J359L320m361
2179a633M30L972l961n38M117l113q93M021k826k148M958j723l419M633p79l433
2195b335L774k22m152L548J156m429L070J510l881K066K251m325J300L625m100
2210a144k71L744k904p64L669k853j756M745k477k200M014j640k690M142l52l921
2226b658L907K51l782K795J176l811K658J789m728K214K808m126Q57L262l845
2241a233j10L749l288r70M073k386j896L909j884k295M294j031l701L794K79l791
$$ y = [746, -2826, 1593, 1309, -3056, 1226, 1909, -2677, 992, 2293, -2558, 376, 2523, -2159, -659, 2864, -1540, -1187, 2534, -1671, -1390, 2542, -1073, -1516, 2753, -279, -2365, 2424, 398, -2501, 2108, 1115, -2746, 1218, 1535, -2332, 986, 1508, -2477, 505, 2084, -2728, -234, 2615, -1951, -592, 2728, -1633, -1203, 2769, -1192, -1730, 2387, -726, -1619, 2402, -424, -2572, 2386, 663, -2756, 1877, 1098, -2335, 1439, 1217, -2935, 613, 1769, -2660, 410, 1920, -1961, 105, 2356, -1969, -669, 2956, -1144, -1415, 2329, -575, -1339, 2330, -523, -2279, 2466, -11, -2211, 1803, 163, -2527, 1615, 1263, -2658, 1249, 1500, -2282, 513, 1689, -2122, 536, 2325, -2403, -189, 2619, -1507, -650, 2612, -1233, -1343, 2406, -882, -1852, 2221, -165, -2061, 1848, -36, -2331, 1963, 932, -2769, 1025, 1304, -2487]
2257b487L479N48l691K748J520m250J566K740l984J345K493l662L60L623l798
2272a450k65L792k780j161L988k047k162M115j393k689L652o79k901L473m27l550
2288b484L230J264m132K457J570l807J648K562m133J132K890l358l6L493l281
2303i85m33L696k701j487L777j497k592L798j053k546L648n87l209L209M76l922
2319b408L080Q95l851K525J962m130J191K954l826M73L217l211L02K999k921q60
2335a609L810k257j943M280j924k420L968j039l145L327Pl044L053L75l772K780
2351D47J186l883J915K332l469J019K720l895N55L319k998n07L305k659j121L827
2367B093k157j981M078j411k686L429m36l270L413p1l295L112Q08l676K442J454
$$ y = [-2487, 992, 1540, -2151, 597, 2117, -2133, -567, 2173, -1811, -466, 2027, -1635, -1275, 2348, -1450, -1715, 2077, -703, -1864, 2124, 77, -2085, 2030, 637, -2052, 1600, 921, -1980, 1493, 1066, -2484, 746, 2010, -2122, 335, 1905, -1902, -254, 2308, -1825, -693, 2197, -1161, -1197, 2296, -985, -1418, 2278, -423, -1910, 1867, 370, -2222, 1576, 523, -2023, 1625, 1038, -2171, 1038, 1514, -2408, 672, 1567, -2284, 241, 2203, -1927, -736, 2218, -1608, -1135, 2082, -1129, -827, 2172, -749, -1609, 2201, -56, -1999, 2281, 357, -2063, 1905, 866, -2279, 1048, 1055, -1989, 1064, 1439, -2333, 447, 1633, -2250, -335, 1997, -1472, -453, 2267, -1628, -1073, 2246, -752, -1259, 2046, -613, -1734, 2093, -64, -2045, 2033, 622, -2064, 1365, 929, -2341, 1072, 1001, -2294, 818, 1626, -2050, 392, 1846]
2383A846m112K252K263l941J004K826l572L61L274l229l12L771k920j411M062
2398B162k080k033L781j281k935L769k60l386L190M04l291K746Q76l820K637J447
2414A926m202J756K870m060J028L075l900R7L743l069p77L671k612j193L762k100
2430A5k052M152j556k909L878j74l521L207L61l669K637J592m103K104J591l453
2446a900J365K873l888K63L598l142m11L676l064n96L802k740j684L737j614k609
2462b334M007j176k795L769j67l721L193P63l819K556J582l791J810K133l846
2477a836J118L111l854L86L341l451j35L696l028j109L855k272j361L582j878
2492A65k378L866p48l453L890M5m002L241J183m197K800J515l872J623K595l894
$$ y = [1846, -2266, -14, 2249, -1692, -688, 2138, -1434, -1073, 2201, -1028, -1340, 2431, -489, -1900, 2162, 82, -1951, 1830, 549, -2386, 1383, 1123, -2263, 927, 1331, -1960, 786, 1662, -2158, 479, 1926, -2276, -520, 2350, -1710, -682, 2393, -1507, -1410, 2333, -736, -1513, 2158, -454, -1647, 2115, 15, -2037, 2115, 559, -2350, 1528, 1354, -2167, 1040, 1401, -2268, 369, 1961, -2142, -38, 1553, -1900, -535, 2338, -1550, -1287, 2311, -831, -1242, 2434, -630, -1226, 2576, -164, -1848, 1889, 275, -2334, 1673, 497, -2298, 1471, 1304, -2417, 776, 1539, -2280, 276, 1858, -1933, -123, 2010, -1836, -718, 2393, -1461, -1075, 2266, -1185, -1320, 2376, -652, -1761, 2094, -178, -1539, 2043, 165, -2213, 1653, 905, -2548, 1342, 1387, -2615, 626, 1809, -2388, 412, 1927, -1945, -322, 2273, -1621]
2508a621J422K567l804N32L325l402o72L932k646j391L877k229j989M002j189
2523G14l263L938n35l293L628J28l615L124J196m505K919J564l903J658K489l966
2539a722Q59L458l677J68L136l403p60M469l058j806M510k219k169L951j175k902
2555b340M036n27l750L818L1l698L078R73m045K610J915m392J557K822l765R67
2571g10L059l576J7L906l595r99M482l052j469M155k205k394M178r60l393M024
2587A468m22l651L802J99l815K857J452m151K302K290m288J443K687l622M70L439
2603B460l496q3L700l443o74M237l293j420M454j955l065M519j278l149L606L18
2619A438l821L331M79l817K985J143l980K716K154m742J458L107l837M53L346
$$ y = [-1621, -199, 2368, -1436, -904, 2421, -981, -1653, 2279, -367, -1758, 2119, -110, -2099, 1903, 714, -2549, 1389, 854, -2439, 1189, 1317, -2298, 826, 2022, -2483, 436, 2000, -1903, -245, 2244, -1722, -863, 2595, -1082, -914, 2222, -1181, -1941, 2528, -530, -2336, 2174, -45, -2214, 1737, 562, -2340, 1696, 1169, -2581, 1237, 1268, -2430, 648, 1621, -2424, 186, 2101, -2291, -734, 2088, -1677, -710, 2349, -1227, -1210, 2696, -899, -1898, 2584, -468, -1937, 2218, 13, -2381, 1797, 837, -2556, 1468, 1046, -2605, 1197, 1396, -2419, 438, 1890, -2261, 41, 2331, -1957, -514, 2173, -1449, -979, 2460, -1036, -1119, 2581, -862, -1536, 2701, -592, -2012, 2442, 487, -2578, 1941, 663, -2486, 1120, 1438, -2383, 948, 1427, -2390, 595, 1738, -2242, 474, 2628, -2114, -656, 2451, -1386, -933, 2413]
2634B413l432L0L577l189j519M587k759j774M378k208k964M477p68l509L681L86
2650A407l634L207N77l990L202J412m499K700J941l896J122L143m220L62L769
2665B603l768o13L839k966j307M587k500k213M275j405k977M357q73l238L735
2680A536N7m159L655R10m085K175J885m170K543K068m483J417L156l730m48M115
2696B442l304o17M074l331j029L977k397j928M319j799k930M558q73l740L928
2711A350K97m093L190P07m074L071J675m214J737K817m649J459L614m573L83M092
2727B789l716j020M321k760j489M228k454k070M468j884l015M376o11l763L715
2742A115M61l894K463J771m250K577J983m289K098K144m145J054L500l991P5M035
$$ y = [2413, -1019, -989, 2588, -601, -2120, 2467, -292, -2066, 2312, 104, -2860, 1617, 849, -2660, 1021, 1407, -2227, 980, 1557, -2433, 769, 2181, -2318, 382, 2323, -1573, -451, 2692, -1528, -1166, 2603, -1165, -1778, 2061, -905, -2212, 2375, -125, -2338, 1937, 532, -2445, 1912, 1039, -2199, 1536, 1593, -2566, 1089, 1999, -2086, 89, 1974, -2196, 347, 2415, -2068, -651, 2505, -1225, -1673, 2442, -862, -1479, 2595, -736, -1765, 2212, -185, -2113, 2206, 407, -2523, 2035, 1162, -2578, 1350, 1647, -2446, 744, 1451, -2623, 448, 2123, -2091, -354, 2463, -2186, -727, 2887, -1686, -1303, 2789, -927, -1947, 2374, -386, -1875, 2353, -101, -2171, 2297, 413, -2602, 1774, 1163, -2600, 1115, 1576, -2318, 145, 1916, -2334, 243, 2226, -2063, 35, 2179, -1966, -912, 2588, -1403, -1328, 2707]
2758B707l759l94L923k788j679L941j662k797M496j651k852M468p67m003L738
2773I21P65m118K908J427m076K367K211m496J960K388l956J007L275m174R0M208
2789B707l525j421M669k755j789M040j792k319M028j264l049L886j65l980L736
2804A007N05m380L457J599m316K310K180m240J638K592m469J492L446m380m8L992
2820B385l201j218M396k729j794M323j574k958M282j118l190L985n35l588L807
2835A273K57m021K909J696m553K433K088m182J619K559l780Q03L283l849J84M087
2851B806l616o44M088k937j946M452k049k500M229r59l606M003J78l936L333P28
2867A624m261L055J491m424K362K540m225J653K365l997J119L161l761j91L881
$$ y = [2707, -1052, -1446, 2477, -311, -1990, 1951, 289, -2508, 1988, 337, -2515, 1953, 1186, -2817, 921, 1686, -2432, 476, 1903, -2173, 194, 2405, -2091, -131, 2257, -1699, -692, 2583, -1591, -1501, 2707, -818, -2239, 2430, -325, -2114, 1926, 134, -2185, 1843, 579, -2470, 1416, 1251, -2729, 1007, 1512, -2868, 589, 2188, -2128, 182, 2362, -1878, -240, 2352, -2117, -625, 2821, -1559, -1607, 2385, -816, -2034, 2362, -367, -2161, 2162, 588, -2370, 1912, 794, -2396, 1589, 1054, -2534, 1273, 1530, -2491, 418, 2114, -2439, -6, 2082, -2100, -481, 2078, -1702, -899, 2384, -1465, -1281, 2806, -810, -1454, 2634, -303, -2249, 2203, 154, -2346, 1883, 924, -2682, 1321, 1499, -2437, 896, 1624, -2637, 418, 1909, -2515, -153, 2387, -1838, -185, 2180, -1817, -698, 2463, -1298, -1489, 2392]
2882B392k921j198M104k607j987M481k211k477M191j243k897L343pl707L732R29
2898A917m314K922J523m483K426K445m723J762L010l969M26L839l923l23L986
2913B521l683o92M280k577k144M558k234k280M220j316l413M293j41m080M019
2928A331J74m045L134J640m544K477K279m249J252K998m139P67L231l857o2M014
2944B401k986j267M096k654j971M614j906k973M707r43l290L686n4m019L699O47
2960A787m072K806J375m163K183K229m431J794L361m571K79L962l820j79M151
2975B691l642r74M689l116j837M406j639l207M765j020l589L951k08l760L345
2990H55L20l693L181J449m610K238K880m223O53L449m181O47L851l925m32M026
$$ y = [2392, -529, -1727, 2377, -230, -2217, 2264, 53, -2424, 1767, 524, -2373, 970, 963, -2744, 988, 1917, -2397, 525, 2048, -2435, -9, 2436, -2287, -525, 2485, -1484, -1058, 2781, -1142, -1465, 2521, -1162, -1854, 2426, -151, -2295, 2263, 29, -2251, 1969, 653, -2760, 1533, 1392, -2688, 1331, 1505, -2540, 594, 2234, -2310, 167, 2446, -1803, -551, 2447, -1692, -925, 2306, -1551, -1613, 2401, -585, -1852, 2244, -410, -2381, 2233, 327, -2646, 2061, 1118, -2172, 1514, 1460, -2559, 1140, 1787, -2285, 521, 1896, -2267, -84, 2145, -2286, -492, 2869, -1702, -1423, 2539, -1281, -1460, 2691, -951, -1925, 2764, -352, -2189, 2217, 578, -2629, 2136, 1116, -2473, 1478, 1270, -2490, 855, 1175, -2518, 663, 2112, -2498, -260, 2620, -1603, -950, 2499, -1682, -1035, 2816, -1109, -1541, 2485]
3006B485k977j170L993k596k061M636k109k730M509j386k997L745l54l730L763
3021A021O97l901K832J439m409K387K285m591J776L138m545Q44L564l840o7L692
3037B322l309r76M325l105j562M297j775k750M718j423l659M440j8l848L206R57
3053A840m383L236J380m550K459K661m774J559L267m588L49M320m010l95M161
3068B532l344j278M320k724k087M764j897k811M443q88l628L837N32m286L362
3083H47R08m139K834J891m644K477K131m465J522L239m293L14M111l957k91M044
3099B529k993j531M593l126j850M715k207k783M933j520l287M127n56l776L518
3114G86Q32m209L030J760m939K962K018m463J755L037m247M30M046m007k26M023
$$ y = [2485, -492, -1662, 2331, -265, -2326, 2310, 201, -2529, 1980, 594, -2403, 1342, 988, -2742, 1021, 1718, -2183, 649, 2088, -2321, 66, 2351, -2240, -464, 2674, -1871, -1027, 2537, -1303, -1370, 2322, -987, -1963, 2362, -743, -2305, 1992, 217, -2533, 2185, 762, -2897, 1543, 1525, -2323, 883, 1840, -2543, 693, 2073, -2477, -18, 2643, -2131, -572, 2695, -1893, -1544, 2776, -1234, -1629, 2532, -812, -2090, 2230, -494, -2581, 2183, 286, -2525, 1918, 1030, -2598, 1239, 1771, -2515, 847, 1755, -2384, 450, 2341, -2303, 174, 2305, -2160, -638, 2601, -1692, -1378, 2733, -1224, -1515, 2529, -464, -1995, 2598, -528, -2378, 2337, 130, -2653, 2280, 760, -2527, 1600, 1044, -2732, 786, 1618, -2591, 439, 2199, -2740, 222, 2240, -2223, -468, 2569, -1678, -1248, 2798, -1209, -1435, 2588]
3130B588l397q81L983k782j815M701k138l067M785j320l356M202k50m001L837
3145A089P38m564L227J766m568K328K375m273J491L214m707O78M035m138r8L925
3161B518l147j416M503k850j981M522j928k930M786j199l617M266J96m576L912
3176A059O49m073K833J824m383K147K497m591J571K964m219K11M075l796m75M642
3192B935l726j454M686k427k265M364j929k792M937j324l990M550l1m043L348
3207H39J220m546K731J985m600K216K567m515J719L070m568R88L803m021o34M303
3223B557l179j627N040k892k175M650j863k811M294j528l249M501l96m552M127
3238H97J181m833L137J696m507K478K566m845J820K972m192O51L672m029j67M493
$$ y = [2588, -809, -1690, 2293, -489, -2304, 2397, 259, -2808, 1977, 657, -2699, 1503, 1253, -2748, 1089, 1827, -2737, 490, 2256, -2312, 16, 2391, -1882, -391, 2823, -1884, -1206, 2829, -1309, -1407, 2518, -629, -2045, 2458, -392, -2373, 2149, 221, -2709, 2077, 878, -2739, 1527, 1723, -2853, 1059, 1708, -2365, 468, 2292, -2091, 56, 2553, -2038, -467, 2497, -1722, -1511, 2564, -1232, -1707, 2935, -791, -2245, 2441, 14, -2251, 2113, 184, -2608, 2329, 1005, -2985, 1565, 1534, -2509, 839, 2059, -2487, 244, 2229, -2371, -155, 2412, -2103, -384, 2686, -1882, -894, 2909, -1112, -1746, 2557, -622, -2249, 2791, -101, -2276, 2374, 511, -2300, 1994, 466, -2783, 1718, 1322, -3230, 897, 2078, -2755, 382, 2078, -2429, 49, 2615, -2230, -410, 2562, -1630, -979, 2693, -1336, -1503, 2990]
3254B990l758j489M840k516k479M443j688l002M669j288l675M119N8m088L973
3269A109J023m726L084K168m952K305K631m473J339K955m062L86M326m725p3M416
3285B731l301j507M702k692k911N332j765l161M388j053l378M425m51m007L867
3300A219J089n004L133J715m413K328K292m272J134L460m456M73L973m314K40
3315a403M145l227k057M838k266k344M394j640k781L984n54l888M471k50m192
3330b770L992O25m490L480J461m777K016K948m180Q81L251l958N00L529l605m05
3346a502L985l530r12M784l017k245M586j386l698M524j30l901M032j80m175L712
3362I47Q50m562L072J933m669K211K893m685J077L635m383L37M120l860k63M303
$$ y = [2990, -768, -2257, 2583, 67, -2412, 2031, 343, -2659, 2010, 722, -2953, 1166, 1224, -2864, 1109, 2132, -2594, 490, 2658, -2294, 11, 2642, -1831, -492, 2463, -1599, -1213, 3113, -1612, -1685, 2731, -570, -2077, 2625, -67, -2978, 2354, 589, -2572, 1816, 763, -2615, 1810, 1359, -2648, 1219, 2308, -2696, 437, 2152, -2261, 67, 2359, -1913, -779, 2681, -1775, -1302, 2671, -1643, -1403, 2742, -485, -2542, 2296, 30, -2314, 2080, 440, -2341, 1643, 1089, -2799, 1672, 1422, -2770, 1222, 1847, -2643, 837, 2298, -2479, -463, 2485, -1695, -814, 2437, -1521, -1021, 2508, -1097, -1502, 2483, -1047, -1959, 2825, -192, -2437, 2149, 763, -2935, 1589, 1459, -2442, 1590, 1410, -2765, 947, 1797, -2765, 307, 2240, -2429, -218, 2675, -2010, -933, 2702, -1681, -1344, 2776, -1084, -1347, 2956]
3378B956l908j094M649k656k658M690j404l333M699o73m111M066O4l824L540P16
3394A719m497L380J823n194K531L054m621J058L737m591M07L938l879m86M297
3409B676l595j092M433k746k075M709j537l493M302n67l711L982J52m085L589
3424I42J051m516L053J666m613K291K841m869J415L611m419K4M266l688p76M180
3440B459l009j728M771k422k790N087j681l416M747r69l813M192M9m051L415R60
3456A801m173K682J933m491K062L010n062J279L746m374L72L916l979o48M691
3471B765l642j273M521k289k670M861j547l517M543n37m029L915O15m555L670
3486H31J105m719K741K380n021K089L126m675J450L632m700L21M016l686n90M378
$$ y = [2956, -952, -2046, 2603, -53, -2711, 1979, 575, -2758, 1941, 1268, -2843, 1223, 1287, -2537, 1003, 1719, -2778, 602, 2425, -2769, -238, 2816, -1805, -747, 2990, -1601, -1194, 2744, -1135, -1621, 2676, -919, -2011, 2422, -324, -2399, 2310, 773, -2720, 1582, 1015, -2696, 1286, 1438, -2647, 942, 1993, -2523, 530, 2196, -2417, -126, 2715, -2154, -739, 2872, -1547, -1523, 2743, -945, -1721, 2459, -550, -2278, 2493, 71, -2719, 2368, 687, -2729, 2018, 1049, -2764, 1428, 1477, -2574, 841, 1801, -2372, 310, 2243, -2248, -186, 2824, -2238, -959, 2787, -1587, -1215, 2701, -1278, -1926, 2765, -877, -2150, 2371, 82, -2588, 2273, 726, -2791, 1752, 1215, -2814, 1101, 1716, -2839, 831, 1936, -2783, -42, 2338, -2683, -594, 2532, -2143, -693, 2939, -1761, -1440, 2576, -1110, -1700, 2678]
3502B678l251j470M673k532k735M786j700l069M142n86l857M297K15m743M058
3517I06J073m571K845J983m729K355K858m577J191L568m593M57L987m223l19M582
3533B793l410j412M622k804k450M632j666l078M522o57l829M145k0l782L363R46
3549A915m611K850K233m468J928K741m570J244L486m499L07M158l832o92M529
3564B719l518j405M602k530k474M797j397l230M450p74m214M618J37m651L684
3579H14J379m670K751J985m725K190K882m573J054L502m147K21M096l806p86M752
3595B919l301k027M908k222k774M437j462l093M494o28l844L829K32m398L740
3610H10J464m844K687K389m918J954K967m286R08L869m385j00M304l600j275M781
$$ y = [2678, -573, -2043, 2630, 98, -2637, 2149, 449, -2620, 1522, 936, -2921, 1376, 1591, -3152, 906, 1979, -2592, 253, 2236, -2493, -138, 2720, -1857, -666, 2902, -1691, -1234, 2753, -1470, -1789, 2793, -617, -2029, 2593, -211, -2661, 1971, 305, -2773, 1749, 1092, -2737, 1408, 1388, -2394, 969, 1915, -2696, 154, 2387, -2081, -153, 2588, -1982, -738, 2748, -1751, -1444, 2714, -1118, -1810, 2719, -799, -2204, 2398, -132, -2606, 2191, 794, -2436, 2014, 1240, -2974, 1644, 1781, -2870, 814, 2193, -2477, 274, 2259, -2466, -276, 2606, -1967, -913, 2589, -1558, -1337, 2759, -1047, -1833, 2919, -382, -2409, 2499, 277, -2497, 1940, 478, -2615, 1879, 1251, -2593, 1236, 1468, -2930, 810, 2274, -2570, 117, 2506, -2412, -458, 2509, -1777, -869, 3000, -1385, -1485, 2819, -781, -2056, 2725]
3626B725l308j514M641k287k581M456j532l152M078q19l488M098L44m342L433
3641G52J131m450K905J976m617J902K855l902M61L230l669L10L634l632n44M294
3657B636l306j387M130j792l098M533j266l102M250m69l850L818L17l816L388
3672I86J302m753K483K596m604J549L038m329O43L702l923j28L843l468q66M293
3688B364l025j471M514k304k725M824j442l102L909m37l541L696J98m056L545
3703I47Q79m196K575J926m273J516L015m261Q10L499l512k03L622l359q56M176
3719B305k756j457M313k187k417M324j546l404M265n81l193L635N6l759L267J035
3735A900m249K457K100m452J792K750l923P83L619m058q0L788l467o42L939k832
$$ y = [2725, -583, -2097, 2544, 257, -2324, 2132, 600, -2552, 1526, 707, -2781, 1317, 1661, -2681, 752, 1883, -2567, 338, 2314, -2303, -401, 2454, -1448, -987, 2243, -1426, -1116, 2518, -1114, -1658, 2636, -670, -2057, 2073, 281, -2817, 1716, 450, -2652, 1598, 1129, -2721, 1097, 1414, -2402, 986, 2288, -2465, 18, 2614, -1990, -441, 2597, -1732, -1089, 2613, -1310, -1438, 2405, -1063, -1929, 2364, -661, -2132, 2382, 78, -2647, 2177, 735, -2367, 1542, 1105, -2436, 1260, 1458, -2598, 947, 1826, -2370, 205, 2131, -2142, -626, 2389, -1872, -1062, 2437, -1075, -1278, 2344, -1015, -1871, 2305, -451, -1908, 2405, 218, -2199, 2125, 579, -2825, 1440, 859, -2334, 1301, 1357, -2402, 865, 1900, -2349, 108, 2208, -2244, -452, 2298, -1625, -842, 2777, -1281, -1361, 2427, -1040, -1682, 2257, -575]
3751e75j460M456k140k410M074j240l161L818l19l430L486J53l806K980J423m193
3767b344K578J885l908J319K723l834P80L060l430K4L398l044j023M013k923j395
3783b121M131j962k144L994j407k710L825m22l610L406O46l771K797J454m178
3798b072K273J722l909J701K793m266R85L212l806L0L730l089r03L893k813j224
3814a743L982k169k070L862j144k942L776n71l182L569K35l953K937J170l992
3829b235K399J789l668J284K759l792L73L266l290k10L550k865q40L607k397j486
3845a756L848j958k441L927j098k934L973m20l481L284N33l655K567J424m099
3860b286K290J971l989J489K675l507N11K964l390K25L335k973p43L614k182j594
$$ y = [-575, -2035, 2421, 281, -2129, 1945, 705, -2456, 1362, 1043, -2387, 1099, 1252, -2554, 426, 1849, -2344, 234, 2119, -1789, -470, 2253, -1581, -801, 2259, -1171, -1147, 2251, -793, -1816, 2197, -726, -2121, 2010, 48, -2096, 1898, 491, -2219, 1606, 1184, -2426, 980, 1626, -2145, 652, 2106, -2072, 201, 1923, -1986, -285, 2508, -1758, -773, 2439, -1367, -1337, 2393, -696, -1599, 2294, -519, -1743, 2239, 70, -2000, 1862, 718, -2224, 1552, 981, -2201, 1368, 1603, -2350, 587, 1757, -2235, 164, 1953, -1715, -431, 2328, -1464, -1091, 2175, -1115, -1325, 2225, -640, -1480, 2127, -270, -1756, 2092, 134, -2307, 1620, 522, -2412, 1561, 1141, -2340, 944, 1477, -2178, 389, 1813, -2286, 4, 1975, -2014, -525, 2150, -1357, -846, 2118, -1272, -1047, 2288, -685, -1428, 2186, 4, -1590]
3876a590L585j574k237L472q97k989L699n26l113L166K18l550L011J185m009K062
3892h7K175l728J462K177l575O20L355l419J62L013k776r87L795k614j346L801
3908B028j802k425L587n50k949L222j71l216K943P81l372K361R34l120J943J713
3924A907l425J297K432l633N82K838l000l00L421k799j008L642k151j569L423
3939A657j532k076L466q51k845L105L11l457L066K24k991K297J095l621K318J735
3955A901l482J387K132l465N17L005l035k25L200k535j031L697k665r45L288j482
3971B62k093L255q20k639L218l93k615K791K60k982K138J011l215J888J730l319
3987a523J241K299l106J83K961l098K17K963k704q54L240j874j737L519j529j982
$$ y = [-1590, 1995, 421, -1816, 1656, 759, -2230, 1469, 943, -2170, 996, 1214, -2336, 675, 1860, -2149, -87, 2088, -1640, -178, 1999, -1576, -956, 2399, -1020, -858, 2155, -621, -1608, 2187, -427, -1773, 2028, 226, -2199, 1388, 838, -2111, 1111, 940, -2276, 667, 1448, -1924, 437, 1371, -1749, 194, 1907, -1518, -221, 2211, -1422, -840, 1998, -1002, -1302, 2119, -680, -1688, 1954, -197, -1766, 1657, 125, -1951, 1515, 664, -2181, 924, 1235, -2222, 844, 1068, -1923, 374, 1469, -2152, 166, 1901, -1581, -194, 1938, -1527, -1010, 1995, -1040, -1265, 1935, -600, -1631, 2066, -599, -1544, 1744, 262, -1831, 1424, 604, -2035, 1183, 790, -1825, 966, 1226, -1756, 382, 1393, -1822, 66, 1796, -1523, -282, 2017, -1089, -906, 2055, -1043, -826, 2137, -567, -1421, 1819, -55, -1792, 1727, 198, -1784]
4003a784L423r02k670K939k16k901K922L57l202K304J287l195J593J968l336J097
4019c16K277l347P46K422k432k72K742k435p05L104j828j783L324j383j947K903
4035A070n74k339K973k68k835K891L39l084K092J193l060J660J501l076J034K275
4051A792l243O29K554k507j15K529j966r82K964j888j443L305j190k218K937o67
4067D91k254L100m09k899K787O88l331K030J185k945J598J356k934J127J963k560
4083a007L13K405k598l44L055k065j184K981j571j668L340j343j956K914m69k444
4099a641K709m2k750K410M03k900J962J118k652J206J727k780R04J763k418L48
4115f33K418k247p44L079k134j025L004j585j506K747p78k133K743m81k706K652
$$ y = [-1784, 1639, 737, -1933, 1006, 790, -2111, 811, 1168, -2034, 270, 1557, -1638, -45, 1923, -1413, -316, 1961, -1386, -640, 1782, -650, -922, 1820, -615, -1320, 1784, -44, -1827, 1497, 114, -1833, 1070, 496, -1843, 1130, 862, -1973, 918, 1257, -1827, 265, 1458, -1602, 58, 1559, -1517, -483, 1792, -1451, -822, 1732, -775, -890, 1639, -327, -1309, 1655, -233, -1676, 1629, 439, -1779, 1158, 491, -1763, 1337, 928, -1971, 816, 1504, -1827, 203, 1388, -1557, 41, 1397, -1537, -410, 1553, -1007, -694, 1711, -887, -1231, 1824, -241, -1425, 1556, -15, -1683, 1657, 314, -1642, 1272, 803, -1641, 1068, 1026, -1724, 686, 1089, -1811, 151, 1269, -1383, -177, 1550, -1230, -326, 1437, -981, -633, 1785, -462, -1206, 1873, -261, -1286, 1718, 133, -1373, 1374, 596, -1537, 1206, 725, -1981, 671]
4131F71K3k408K267P09k722J627J412l269J529J623k731O38K315k647K83K415
4147A735k327k54K379j711j118K628j428j117K577j235j543K658n91k432K445
4162F66J73k313K066K1k033J613J103k638J141J724k572N23K202k682K35K414
4178A643j917p33K531j921q24K678j532j161K711j095j665K194j63k185K481l10
4194G32k186J819P84k599J772R77k546J307J249k255N75J626k028j8K077j790
4210e04j21K143j914n96K235j167j381K549j065j417K407m85k056J980J98k354
4226a548J762Q03k458J600R84k422R18J739k987J194J898k184k52K606k186j66
$$ y = [671, 694, -1714, 553, 1262, -1460, 167, 1579, -1690, -161, 1462, -1269, -631, 1684, -963, -680, 1735, -592, -846, 1533, -178, -1296, 1332, -96, -1213, 1364, 129, -1414, 1244, 653, -1779, 666, 839, -1474, 592, 613, -1420, 193, 1296, -1342, -201, 1523, -1049, -526, 1676, -1006, -771, 1643, -274, -1007, 1524, -397, -1221, 1457, -75, -1236, 1475, 380, -1285, 909, 746, -1439, 1042, 732, -1454, 365, 1149, -1450, 322, 1299, -1247, 60, 1309, -946, -371, 1255, -773, -791, 1286, -504, -625, 1518, -396, -992, 1243, 76, -1305, 1244, 179, -1238, 1169, 684, -1372, 608, 806, -1548, 214, 1017, -1441, 159, 1143, -1279, -361, 1378, -1609, -415, 1483, -701, -953, 1653, -533, -699]
$$ [...]
8191D06
##END NTUPLES=NMR FID
##END=
