##TITLE=1H_Pr 3489 
 CDCl3
 8 sc, 
 14.1.2025
##JCAMPDX= 6.0         $$ Bruker NMR JCAMP-DX V2.0
##DATA TYPE= NMR FID
##DATA CLASS= NTUPLES
##ORIGIN= UXNMR, Bruker Analytische Messtechnik GmbH
##OWNER= root
$$ XWIN-NMR		Version 3.5
$$ Tue Jan 14 13:47:30 2025 Russian Standard Time (UT+4h)  she@DPX200
##.OBSERVE FREQUENCY= 200.1315
##.OBSERVE NUCLEUS= ^1H
##.DELAY= (6, 6)
##.ACQUISITION MODE= SIMULTANEOUS
##.ACQUISITION SCHEME= undefined
##.AVERAGES= 8
##.DIGITISER RES= 18
##SPECTROMETER/DATA SYSTEM= spect
##.PULSE SEQUENCE= zg30
##.SOLVENT NAME= D2O
##.SHIFT REFERENCE= (INTERNAL, D2O, 0, 15.7039)
##AUDIT TRAIL= $$ (NUMBER, WHEN, WHO, WHERE, WHAT)
$$ ##TITLE= Audit trail, XWIN-NMR		Version 3.5
$$ ##JCAMPDX= 5.01
$$ ##ORIGIN= Bruker BioSpin GmbH
$$ ##OWNER= she
$$ F:/spectra/data/she/nmr/H-F/1/audita.txt
$$ ##AUDIT TRAIL=  $$ (NUMBER, WHEN, WHO, WHERE, WHAT)
(   1,<2025-01-14 13:46:34.51 +0400>,<she>,<DPX200>,
      <created by zg, POWCHK disabled, PULCHK disabled
       configuration hash MD5:
       00 E9 B6 7A A2 85 ED C7 34 08 36 98 17 FE 4E 26
       data hash MD5: 16K
       29 F9 D2 80 88 3E 21 81 88 B1 4E D0 41 14 6B B7>)
$$ ##END=
$$ 
$$ hash MD5
$$ FB 50 07 12 7C 13 60 78 AA E1 D5 26 E9 36 D0 48
##$RELAX= 
##$RELAX= 
##$RELAX= 
##$RELAX= 
##$RELAX= 
##$RELAX= 
$$ Bruker specific parameters
$$ --------------------------
##$DU= <F:/spectra>
##$EXPNO= 1
##$NAME= <H-F>
##$PROCNO= 1
##$TYPE= <nmr>
##$USER= <she>
##$AMP= (0..31)
100 100 100 100 100 100 100 100 100 100 100 100 100 100 100 100 100 100 
100 100 100 100 100 100 100 100 100 100 100 100 100 100 
##$AQSEQ= 0
##$AQ_mod= 1
##$AUNM= <au_zg>
##$AUTOPOS= <>
##$BF1= 200.13
##$BF2= 200.13
##$BF3= 200.13
##$BF4= 200.13
##$BF5= 200.13
##$BF6= 200.13
##$BF7= 200.13
##$BF8= 200.13
##$BYTORDA= 1
##$CFDGTYP= 0
##$CFRGTYP= 5
##$CHEMSTR= <none>
##$CNST= (0..31)
1 1 145 1 1 1 1 1 1 1 1 1 1 1 1 1 1 1 1 1 1 1 1 1 1 1 1 1 1 1 1 1 
##$CPDPRG= <>
##$CPDPRG1= <>
##$CPDPRG2= <>
##$CPDPRG3= <>
##$CPDPRG4= <mlev>
##$CPDPRG5= <mlev>
##$CPDPRG6= <mlev>
##$CPDPRG7= <mlev>
##$CPDPRG8= <mlev>
##$CPDPRGB= <>
##$CPDPRGT= <>
##$D= (0..31)
0 1.2 0 0 0 0 0 0 0 0.06 0 0.03 0 0 0 0 0.0002 0 0 0 0 0 0 0 0 0 0 0 0 
0 0 0 
##$DATE= 1736847993
##$DBL= (0..7)
120 120 120 120 120 120 120 120 
##$DBP= (0..7)
150 150 150 150 150 150 150 150 
##$DBP07= 0
##$DBPNAM0= <>
##$DBPNAM1= <>
##$DBPNAM2= <>
##$DBPNAM3= <>
##$DBPNAM4= <>
##$DBPNAM5= <>
##$DBPNAM6= <>
##$DBPNAM7= <>
##$DBPOAL= (0..7)
0.5 0.5 0.5 0.5 0.5 0.5 0.5 0.5 
##$DBPOFFS= (0..7)
0 0 0 0 0 0 0 0 
##$DE= 6
##$DECBNUC= <off>
##$DECIM= 24
##$DECNUC= <off>
##$DECSTAT= 4
##$DIGMOD= 1
##$DIGTYP= 9
##$DL= (0..7)
0 120 120 120 120 120 120 120 
##$DP= (0..7)
150 150 150 150 150 150 150 150 
##$DP07= 0
##$DPNAME0= <>
##$DPNAME1= <>
##$DPNAME2= <>
##$DPNAME3= <>
##$DPNAME4= <>
##$DPNAME5= <>
##$DPNAME6= <>
##$DPNAME7= <>
##$DPOAL= (0..7)
0.5 0.5 0.5 0.5 0.5 0.5 0.5 0.5 
##$DPOFFS= (0..7)
0 0 0 0 0 0 0 0 
##$DQDMODE= 0
##$DR= 18
##$DS= 0
##$DSLIST= <SSSSSSSSSSSSSSS>
##$DSPFIRM= 0
$$ [...]
##$SUBNAM2= <"">
##$SUBNAM3= <"">
##$SUBNAM4= <"">
##$SUBNAM5= <"">
##$SUBNAM6= <"">
##$SUBNAM7= <"">
##$SUBNAM8= <"">
##$SUBNAM9= <"">
##$SW= 24.0689530833862
##$SWIBOX= (0..15)
0 0 2 0 0 0 0 0 0 0 0 0 0 0 0 0 
##$SW_h= 4816.95568400771
##$TD= 16384
##$TD0= 1
##$TE= 0
##$TE2= 300
##$TE3= 300
##$TEG= 300
##$TL= (0..7)
0 120 120 120 120 120 120 120 
##$TP= (0..7)
150 150 150 150 150 150 150 150 
##$TP07= 0
##$TPNAME0= <>
##$TPNAME1= <>
##$TPNAME2= <>
##$TPNAME3= <>
##$TPNAME4= <>
##$TPNAME5= <>
##$TPNAME6= <>
##$TPNAME7= <>
##$TPOAL= (0..7)
0.5 0.5 0.5 0.5 0.5 0.5 0.5 0.5 
##$TPOFFS= (0..7)
0 0 0 0 0 0 0 0 
##$TUNHIN= 0
##$TUNHOUT= 0
##$TUNXOUT= 0
##$USERA1= <user>
##$USERA2= <user>
##$USERA3= <user>
##$USERA4= <user>
##$USERA5= <user>
##$V9= 5
##$VALIST= <valist>
##$VCLIST= <CCCCCCCCCCCCCCC>
##$VD= 0
##$VDLIST= <DDDDDDDDDDDDDDD>
##$VPLIST= <PPPPPPPPPPPPPPP>
##$VTLIST= <TTTTTTTTTTTTTTT>
##$WBST= 1024
##$WBSW= 4
##$XGAIN= (0..3)
0 0 0 0 
##$XL= 0
##$YL= 0
##$YMAX_a= 335517
##$YMIN_a= -393055
##$ZGOPTNS= <>
##$ZL1= 120
##$ZL2= 120
##$ZL3= 120
##$ZL4= 120
##$ABSF1= 10
##$ABSF2= 0
##$ABSG= 5
##$ABSL= 3
##$ALPHA= 0
##$AQORDER= 0
##$ASSFAC= 0
##$ASSFACI= 0
##$ASSFACX= 0
##$ASSWID= 0
##$AUNMP= <proc_1d>
##$AZFE= 0.1
##$AZFW= 0.1
##$BCFW= 1
##$BC_mod= 2
##$BYTORDP= 1
##$COROFFS= 0
##$CY= 11.3945322036743
##$DATMOD= 1
##$DC= 2
##$DFILT= <>
##$DTYPP= 0
##$F1P= 15.6554695791079
##$F2P= 12.8336369535428
##$FCOR= 0.5
##$FTSIZE= 0
##$FT_mod= 4
##$GAMMA= 1
##$GB= 0.15
##$INTBC= 1
##$INTSCL= 1
##$ISEN= 128
##$LB= 0.24
##$LEV0= 0
##$LPBIN= 0
##$MAXI= 10000
##$MC2= 0
##$MEAN= 0
##$ME_mod= 0
##$MI= 1.114404
##$NCOEF= 0
##$NC_proc= 0
##$NLEV= 6
##$NOISF1= 3.799351
##$NOISF2= 2.8
##$NSP= 1
##$NTH_PI= 0
##$NZP= 0
##$OFFSET= 15.70392
##$PC= 1
##$PHC0= -26578.39
##$PHC1= 18.38744
##$PH_mod= 1
##$PKNL= yes
##$PPARMOD= 0
##$PSCAL= 0
##$PSIGN= 0
##$REVERSE= no
##$SF= 200.130013532006
##$SI= 16384
##$SIGF1= 3
##$SIGF2= 2
##$SINO= 400
##$SIOLD= 16384
##$SREGLST= <1H.CDCl3>
##$SSB= 0
##$STSI= 0
##$STSR= 0
##$SW_p= 3612.71676300578
##$SYMM= 0
##$S_DEV= 0
##$TDeff= 0
##$TDoff= 0
##$TI= <>
##$TILT= no
##$TM1= 0
##$TM2= 0
##$TOPLEV= 0
##$USERP1= <user>
##$USERP2= <user>
##$USERP3= <user>
##$USERP4= <user>
##$USERP5= <user>
##$WDW= 1
##$XDIM= 8192
##$YMAX_p= 0
##$YMIN_p= 0
$$ End of Bruker specific parameters
$$ ---------------------------------
##NTUPLES= NMR FID
##VAR_NAME=  TIME,          FID/REAL,        FID/IMAG
##SYMBOL=    X,             R,               I
##VAR_TYPE=  INDEPENDENT,   DEPENDENT,       DEPENDENT
##VAR_FORM=  AFFN,          ASDF,            ASDF
##VAR_DIM=   8192,          8192,            8192
##UNITS=     SECONDS,       ARBITRARY UNITS, ARBITRARY UNITS
##FACTOR=    0.0002076,     1,               1
##FIRST=     0,             0,               0
##LAST=      1.7004516,     0,               0
##MIN=       0,             -393055,         0
##MAX=       1.7004516,     335517,          0
$$ Real data points
##PAGE= N=1
##DATA TABLE= (X++(R..R)), XYDATA
0 0 0 0 0 0 0 0 0 0 0 8 -8 8 -8 15 -16 16 -24 24 -32 37 -40 48 -56 63 -75 86 -98 110 -126 139 -160 176
32 176 -200 223 -248 276 -307 339 -379 417 -462 512 -567 626 -696 772 -858 961 -1074 1206
50 1206 -1370 1563 -1805 2117 -2531 3112 -3996 5483 -8466 16829 -91901 -346140 -240778
63 -240778 -14264 123593 39672 -190380 -351675 -251823 -62258 -7627 -101484 -233619 -304260
74 -304260 -219529 -95570 -114078 -228281 -272802 -239040 -171601 -128688 -184429 -274243 -251778 -175801
86 -175801 -167140 -197252 -212659 -210551 -163503 -125229 -186324 -260839 -219989 -116633 -47902 -58243
98 -58243 -173242 -285242 -219229 -34310 59924 1661 -138417 -237544 -161075 31172 109785
109 109785 22843 -86195 -122292 -53673 80032 127209 38336 -39282 -18728 53528 134562
120 134562 153655 68721 -822 45433 125598 166587 172590 127876 70720 82649 128877 150323
132 150323 179291 198075 153224 103913 104642 122429 160840 216104 203565 129858 91189 97678
144 97678 128793 187937 202646 130897 72449 87006 118509 144111 148105 94780 47946 73772
156 73772 108428 102625 87800 54663 8841 20654 70277 77862 54937 20725 -33102 -48108
168 -48108 3441 39237 28223 2255 -49605 -100942 -78123 -16824 2757 -15728 -62650 -126101
180 -126101 -127440 -60854 -29511 -55252 -89227 -123126 -129692 -83457 -55826 -88810 -120113 -124268
192 -124268 -117792 -82960 -56256 -94786 -141361 -131123 -102152 -77364 -55719 -76206 -119328 -117644
204 -117644 -93627 -84852 -62517 -42409 -63724 -85080 -80335 -81387 -66033 -22990 -13032 -39274 -51230
217 -51230 -57174 -55124 -12172 22356 -65 -26338 -23431 -13981 12841 39894 17989 -10336 9279
230 9279 37028 44936 52805 36878 5739 21083 65088 77899 72751 58487 25980 25328 69505
243 69505 91570 80709 74320 57961 38755 57211 80844 78160 80135 79410 52740 45448 67733
256 67733 71647 65485 71865 60363 43474 55783 62967 48019 46859 47947 33794 41132 58081
269 58081 39831 17545 19543 18763 23095 41071 30800 -1 -2555 3024 -3536 6741 15964 -3764
283 -3764 -16548 -12378 -23520 -27120 -9833 -12168 -26311 -23271 -32138 -50631 -37881 -21430 -32118
296 -32118 -39922 -40327 -53648 -48688 -29955 -41401 -58530 -48952 -44313 -46959 -36909 -43035 -65810 -59366
310 -59366 -38716 -37910 -36144 -37166 -59642 -62355 -34098 -26139 -35811 -34115 -40028 -46972 -29286 -19278
324 -19278 -33052 -29459 -17185 -23452 -21659 -10434 -20582 -23974 -4921 167 -7289 -1120 -3246 -11911
338 -11911 4298 17241 4892 4241 15247 11049 12894 23671 15896 11269 28623 31209 20922
351 20922 27009 27931 18208 29512 42980 32578 28338 34592 27325 29281 44124 37485 25909 36461
365 36461 38384 28624 34829 37743 26134 31191 40419 28390 25161 33342 24360 20111 32678 28829
379 28829 16121 22335 22218 12078 18399 22256 8114 9734 18389 6533 1245 10694 4432 -2603
393 -2603 6177 2064 -9385 -2297 -1175 -13160 -8006 -2163 -15024 -16332 -7519 -16313 -20802 -11726
407 -11726 -17678 -24551 -14790 -16812 -28807 -22050 -16751 -27303 -24427 -18399 -27883 -27885 -18249 -25083 -29085
422 -29085 -18675 -22438 -30455 -19606 -17661 -28245 -22863 -16665 -24268 -19504 -11667 -22199 -23846 -11219
436 -11219 -13992 -18215 -8205 -10537 -19480 -9287 -3704 -11129 -5701 -1041 -11008 -7617 5739 -349
450 -349 -4744 4043 1270 -2659 9465 10340 213 6649 10389 2962 10214 19629 8968 6249 15520
465 15520 11307 9723 21331 17381 8105 16474 17846 9853 17270 23289 12305 12972 19826 12457 13003
480 13003 22659 15096 8494 18298 16998 8293 16657 17753 6295 9372 15492 8148 9914 16697 5904
495 5904 -33 9581 7483 3144 11991 8294 -5080 -1401 3748 -722 5805 8883 -6470 -11887 -1281
510 -1281 -1664 -2568 4032 -5588 -16576 -6853 -882 -6595 -3719 -6206 -18869 -12352 1957 -4611 -12186
525 -12186 -10797 -16692 -15108 1335 -162 -14692 -14460 -13362 -16476 -4443 3223 -9861 -14981 -8763
539 -8763 -12675 -10649 866 -4231 -11591 -3361 -4508 -13806 -6717 -50 -5721 -851 2560 -8941 -9465
554 -9465 2456 510 -2332 4528 -1328 -7667 4514 9126 -1755 -1386 1165 -2229 8202 17891
568 17891 2958 -8640 -1950 2225 9758 22674 11862 -8967 -7175 2942 8652 19895 17923
581 17923 -4069 -9280 4745 9367 11319 13403 334 -6432 7744 13543 3720 2067 -154 -4718
595 -4718 8508 18620 3882 -7961 -4853 -3460 4165 16043 5720 -9862 -4389 812 -2899
608 -2899 1406 2015 -5598 948 8781 -5017 -15975 -8938 -2153 6746 15749 -1357 -25702 -19228
622 -19228 590 10307 12655 -911 -24418 -18636 7364 11647 -321 -10054 -18660 -8354 17298
635 17298 15562 -12823 -24668 -14899 3333 24724 19819 -16375 -32280 -11281 11079 20614 14333
648 14333 -11548 -23294 -1418 15343 6849 -2420 -6045 -4488 12361 19090 -5197 -21120 -6170
661 -6170 12636 22550 18175 -9492 -26816 -4710 21590 19718 5653 -9101 -15250 5614 24908
674 24908 7377 -15999 -13022 2746 20468 25954 -1883 -33132 -20633 13944 29645 21816 -6059
687 -6059 -33623 -20769 15734 23826 6096 -9363 -17651 -8149 13909 10799 -13668 -16886 -1422
700 -1422 9557 13218 698 -24814 -23842 4963 18163 8899 -4555 -19165 -18141 4792 12521
713 12521 -4028 -10533 -3445 484 5508 1231 -17838 -18451 7020 19770 10640 -4210 -21667 -22024
727 -22024 6918 25492 11971 -4981 -11893 -12199 2936 16539 5126 -6019 1545 6605 5353
740 5353 5911 -2208 -9293 5366 19166 12060 3078 -2356 -8883 -363 16108 13768 5334 6782 2310
755 2310 -4294 2107 5888 4484 12367 15172 183 -7539 -2338 -54 7587 17078 7374 -5858 -3261
770 -3261 -1296 -2909 4692 6871 -288 1276 3596 -7619 -10614 -1747 289 2376 6858 -3231 -14827
785 -14827 -8775 -3663 -5997 -756 1459 -6506 -6596 -5042 -15147 -16238 -2562 2490 815 -1811 -16118
800 -16118 -26100 -10891 4346 3333 -1018 -9679 -20765 -13698 959 -2502 -7853 -4572 -5430 -5279
814 -5279 -44 -6934 -17018 -7409 5955 5986 3401 -4060 -16718 -10798 7376 9845 4308 2938 -3212
829 -3212 -5508 4475 5394 -920 5605 12996 7882 4618 2129 -5236 1524 18660 19159 8413 4180
844 4180 -1585 -371 14298 19592 9166 7114 9430 6046 8235 11662 5087 5778 17067 16375 7638
859 7638 5811 1338 -427 13115 19782 10331 4585 2834 -2889 1947 12203 8711 4462 7548 1986
874 1986 -5381 -570 2328 198 6005 6461 -5303 -7466 -3277 -6059 -3881 3387 -1669 -7598 -4188
889 -4188 -7965 -14056 -7390 -2995 -5899 -3567 -5056 -16645 -16741 -7953 -7926 -7442 -3862 -10605 -17131 -10823
905 -10823 -10360 -14219 -7931 -3904 -9725 -9729 -9763 -17728 -15106 -3124 -2675 -6071 -5894 -12987 -15581 -5017
921 -5017 -370 -6021 -4804 -2541 -7127 -3949 -526 -7830 -6835 4028 5459 1389 1407 -5503 -8322 4556
937 4556 12723 6838 3841 2015 -3005 4092 13346 7902 3999 9700 8838 6231 10400 7224 2893
952 2893 11282 17648 11645 9052 8417 3224 8795 18988 14657 8124 10659 8500 6787 13078 12435
967 12435 6071 10835 14566 7788 5859 7345 3582 7170 15728 10182 1452 3059 2247 1682 9430
982 9430 8594 -662 200 3246 -1276 -328 2821 -2934 -3564 3159 -360 -6813 -4522 -5520 -7630 -1333
998 -1333 -193 -8788 -9744 -7208 -11090 -9110 -3532 -7876 -11257 -6950 -10725 -14934 -9284 -7738 -11602
1013 -11602 -8234 -7933 -15659 -13704 -8122 -10982 -11272 -6680 -11041 -14093 -8169 -8768 -12830 -8025 -6229
1028 -6229 -10496 -7159 -4796 -10622 -9614 -3248 -5873 -6204 -997 -4750 -8130 -1781 -1472 -4948 716
1043 716 3065 -2482 -699 2618 -1509 749 8025 4531 1277 5897 4267 2147 8989 9419 3813
1058 3813 7008 10149 6097 8260 12430 7153 7340 13632 10947 8122 12096 10463 7045 12866 14349
1073 14349 8499 10318 12740 7909 9574 13913 9031 7768 12850 10060 5752 10212 8800 5258 9961
1088 9961 10739 2969 4110 7529 3870 4803 7669 2067 -1340 4272 3191 -1026 2300 176 -5127
1103 -5127 -368 2428 -3966 -4839 -2349 -6635 -5669 -362 -5522 -10111 -5584 -6456 -10122 -5849 -6005 -12208
1119 -12208 -9481 -6411 -11450 -11030 -7471 -12184 -12368 -6843 -10441 -14703 -9994 -9445 -12360 -8832 -8716 -14963
1135 -14963 -11634 -6291 -9556 -10359 -7525 -11455 -11155 -3851 -4604 -9838 -7325 -6686 -8522 -2579 379 -7043
1151 -7043 -6727 -1800 -3196 -1095 3613 -1694 -5200 1432 3310 1185 4972 3635 -1621 3584 8828
1166 8828 4850 4707 7775 3920 4978 11558 8566 4739 9881 9895 7159 11064 11650 6390 9597 14058
1182 14058 9489 8484 11544 8325 8746 15156 11669 5426 8746 10899 8713 12887 12077 3262 4259
1197 4259 10518 9533 8900 9572 2037 -339 8173 9561 4401 3877 712 -3295 3675 8398 1304 -2817
1213 -2817 -1720 -3680 -917 4637 -1218 -8615 -4920 -3352 -4911 -1437 -3070 -10822 -8837 -3436 -6675
1228 -6675 -7565 -5690 -10385 -11036 -5170 -7722 -12843 -8971 -7878 -10428 -7419 -8054 -14490 -11441 -4917 -7380
1244 -7380 -9832 -9233 -13054 -11962 -2550 -3350 -10696 -10866 -9504 -8454 -1536 27 -9727 -12497 -5309 -2690
1260 -2690 456 1866 -6602 -11688 -2412 4016 2744 2627 -2196 -7865 -385 8842 4960 1756 2151
1275 2151 -882 2266 10551 7392 999 4182 6492 5402 9478 8987 2226 5156 11284 8434 6727
1290 6727 8915 5799 6695 12749 9549 3465 6752 10378 8920 10589 8106 618 3628 12732 11920
1305 11920 7640 5050 -663 489 11622 13306 4153 426 -400 48 8013 10943 1211 -4004 -85
1320 -85 1677 3428 6004 -1461 -7914 -1563 2712 259 400 -2498 -9121 -5095 1281 -2024 -4331 -2555
1336 -2555 -6753 -8356 -2974 -4173 -7438 -3151 -3154 -8934 -7999 -6056 -8069 -4458 -1222 -7303 -11030 -6841
1352 -6841 -6227 -5852 -1547 -5030 -10916 -6917 -3122 -5329 -4036 -3719 -9209 -6641 414 -1549 -5186 -3606
1368 -3606 -6318 -6604 664 2354 -2947 -2855 -2809 -6142 -1372 4757 1183 -966 230 -3527 -3204 4331
1384 4331 5479 1306 1834 170 -2565 3175 7833 2634 775 2939 1153 3901 8726 3913 -1583
1399 -1583 2549 5307 5302 8019 5307 -1961 769 7133 5809 6374 6543 1127 -257 5852 5221 2764
1415 2764 5902 5555 1414 3103 3313 -478 3710 8284 3862 590 1679 -449 1170 7085 4642
1430 4642 -1778 -229 1960 1278 4183 3067 -4745 -2938 4251 4073 1656 273 -5800 -5897 3639 6417
1446 6417 453 -2293 -4670 -6397 438 5463 -569 -3713 -2028 -4190 -3340 1286 -1623 -4836 -527
1461 -527 -58 -4038 -2660 -2075 -5112 -1975 1790 -3015 -4918 -1738 -3272 -4238 -621 -2800 -5065 -230
1477 -230 480 -4548 -4174 -3146 -5172 -584 3449 -2098 -6537 -4191 -3991 -2511 3138 880 -5346 -3963
1493 -3963 -2295 -3756 -78 2078 -3411 -3485 57 -1995 -2733 825 -1284 -3055 955 1091 -2800 -415
1509 -415 292 -3268 -619 3481 415 -391 1448 -2618 -3189 2921 3794 986 2395 372 -3214 845
1525 845 4435 1625 1959 3510 175 -56 4161 1923 762 4964 4644 847 2737 2931 -331 3372
1541 3372 6687 2688 1794 3925 1653 1382 5489 3512 1225 5013 5182 1800 2793 2661 -560 3866
1557 3866 8086 3397 793 1831 -209 1248 6629 4756 -195 1250 1684 -434 2437 3596 -767
1572 -767 102 3886 92 -1617 575 -1605 -1757 3237 1916 -3490 -2015 -1155 -3189 -300 1382 -3603
1588 -3603 -3827 -727 -3021 -4471 -1339 -3313 -5015 -641 -1631 -6587 -4930 -3695 -5151 -2452 -65
1603 -65 -5416 -6734 -3485 -4870 -5003 -1647 -3456 -6599 -3154 -3209 -6763 -4066 -1829 -4439 -3400 -1182
1619 -1182 -5250 -6007 -1475 -2483 -3728 -534 -1662 -4470 -1319 -575 -3364 -1016 1077 -1593 -1087 1593
1635 1593 -1637 -2275 2359 1565 213 2989 2307 -1110 1891 3639 1249 3176 5637 2318 1514 4811
1651 4811 2935 2898 7160 5812 2238 4759 5172 2688 5979 7214 2967 3872 6726 4348 4018 6302
1667 6302 3987 2852 6889 6449 2832 4644 4167 1892 5041 6888 3024 1824 4306 1640 1694 5038
1683 5038 2784 -11 2838 2240 -1104 1232 1670 -1262 866 1919 -2153 -2657 391 -1327 -2798 234
1699 234 -2671 -5638 -1788 -1123 -4487 -3689 -3203 -5761 -3629 -1298 -5614 -7448 -4269 -5044 -5601 -1996
1715 -1996 -4451 -8896 -5903 -4188 -5670 -4508 -4088 -7917 -6646 -3053 -4830 -6034 -3437 -5650 -6155
1730 -6155 -2264 -3270 -6578 -4092 -2153 -4449 -3128 -1352 -4298 -3362 -172 -1587 -3128 -522 -1098
1745 -1098 -1668 1339 741 -2488 52 2896 1074 1923 3179 -694 180 5010 3967 2670 4228 2566
1761 2566 1123 5943 6953 2977 3783 5403 3596 5580 7954 4369 2978 6445 5839 5109 7457 5711
1777 5711 2538 5546 7679 4514 5496 6295 3229 4047 6861 4545 3086 5223 4427 2289 4966 4181
1793 4181 1134 3050 4480 1503 1472 2859 172 645 3108 499 -1916 689 194 -1686 741 -133
1809 -133 -4348 -2896 -510 -2626 -1993 -1924 -5265 -5573 -1633 -2762 -5223 -3866 -4825 -6842 -3638 -2262
1825 -2262 -6031 -6089 -5237 -6816 -5628 -2766 -5941 -7628 -5257 -5683 -6469 -3483 -4802 -7555 -5938 -4170
1841 -4170 -5889 -4821 -2927 -6073 -5964 -2684 -4131 -4824 -1749 -3043 -4433 -1858 -1557 -3588 -1479 112
1857 112 -2329 -1499 389 -1071 -841 2189 1289 -1096 1712 2274 928 3841 3676 294 1646 4552
1873 4552 3446 3871 5883 3158 1894 5579 6048 4892 5963 5263 2373 5887 7830 5244 5267 6396
1889 6396 3732 4555 8264 6160 4129 6008 4856 3847 7093 6750 3535 3836 5239 3043 4441 5937
1905 5937 3198 1899 3743 2906 1769 4401 2922 -79 1693 1597 -609 841 2208 -1026 -1535 -107
1921 -107 -2051 -2347 -28 -1381 -3993 -2735 -2616 -4547 -2268 -1897 -5544 -5001 -3618 -4965 -4921 -2815 -5367
1938 -5367 -7681 -4830 -4428 -6146 -3926 -4960 -7950 -6508 -4238 -5884 -5125 -3866 -7241 -7380 -4055 -4126
1954 -4126 -5340 -3462 -5095 -7207 -3893 -2160 -4211 -3466 -2964 -5044 -3542 -89 -1982 -2770 -1157 -2028
1970 -2028 -2797 935 933 -1499 -184 1071 -620 1399 3190 1115 796 3099 1909 1662 4724 3589
1986 3589 1976 4111 4553 2345 4577 5906 3932 4406 5949 3936 4170 7098 5606 4210 5169 4808
2002 4808 3623 6747 7119 3728 4123 5031 4091 5040 7319 4060 2246 4146 4248 3782 5396 3806 479
2019 479 2392 3891 2438 2771 2562 -321 126 3165 1679 -404 771 -1032 -2404 758 607 -2621
2035 -2621 -2073 -883 -2936 -2118 -1212 -3568 -4239 -1707 -3090 -4910 -3607 -3737 -5450 -2845 -3114 -5922
2051 -5922 -5478 -3986 -4686 -4197 -3137 -6127 -6578 -3788 -3676 -4914 -4235 -5358 -6604 -3707 -1810 -4630
2067 -4630 -5050 -4158 -4517 -3227 -806 -3007 -5086 -3033 -2344 -2813 -786 -1112 -3269 -1718 260 -986
2083 -986 -589 463 -1253 -723 2431 1203 -337 1518 1313 590 3351 3538 1056 2392 3848 2373
2099 2373 2645 4322 2709 2815 5251 4089 2420 4200 4167 3250 5558 5463 2826 3320 4754 3989 4294
2116 4294 5789 3330 2362 5005 4476 2969 4367 4145 2063 3720 4460 1939 2273 3491 1726 1669 3326
2133 3326 2025 149 2008 1449 -164 1780 1797 -763 -275 322 -1250 -840 606 -1352 -2305 -979 -2018
2150 -2018 -3093 -1092 -1417 -3548 -2329 -1763 -3957 -3283 -2323 -4014 -3448 -2121 -3367 -4415 -3009 -3878
2166 -3878 -5201 -2685 -2501 -4629 -3469 -2581 -4686 -4062 -2296 -3901 -3787 -1852 -3195 -4279 -2338 -2467
2182 -2467 -3537 -1530 -1044 -3486 -2533 -948 -2661 -1582 -26 -1490 -1926 413 -480 -1484 774 307
2198 307 -417 1154 1557 -289 495 1926 849 1606 3487 1441 567 2865 2084 1973 3484 3126 1432
2215 1432 2890 3427 1884 2618 3872 2382 2406 4192 2595 1913 3682 2985 2000 3711 3699 1957 2460
2232 2460 3237 1772 2322 3811 2281 1491 2817 1978 465 2443 2280 648 1784 1548 -395 138 1698
2249 1698 -161 176 1472 -231 -1512 598 -245 -1711 394 -206 -2167 -1043 -485 -2342 -1856 -519
2265 -519 -2047 -2280 -614 -2018 -2887 -1991 -2190 -3048 -1073 -1663 -3370 -2793 -2060 -2867 -2017 -505 -2941 -3221
2283 -3221 -1892 -2729 -2686 -926 -1867 -3277 -1750 -1044 -2842 -1869 -797 -2394 -1063 -96 -1420 -1962 -535
2300 -535 -1093 -1520 275 -366 -1529 -230 856 -1137 -603 904 45 83 1575 -150 -836 1419 1339 463
2318 463 1766 1497 -842 737 2184 1251 1376 2272 450 826 2976 2023 791 2262 1989 748 2307
2335 2307 2599 578 1380 2766 1436 1692 2388 875 412 2513 1490 393 2151 2045 484 1363 1784
2352 1784 -156 1033 2367 761 159 1550 -51 -494 1654 1175 -762 42 216 -1118 496 1037
2368 1037 -969 -891 561 -628 -552 550 -1325 -2044 -193 249 -1467 -701 -783 -2394 -877 98 -1665
2385 -1665 -1664 -773 -1686 -1865 -325 -1375 -2613 -457 -572 -2150 -1309 -867 -2245 -1088 -28 -1632 -2102
2402 -2102 -598 -1082 -1782 144 -932 -2121 -672 96 -1475 -722 -216 -1793 -1018 1031 -120 -826 174
2419 174 -540 -1031 1153 836 -1015 161 254 -231 840 1520 -337 -203 1532 570 290 1269 829 -160
2437 -160 1696 1628 -210 1415 1685 448 1370 2006 164 529 2202 1444 463 2006 1232 18 1601
2454 1601 2043 285 1108 1690 283 983 1785 962 228 1387 641 -298 1518 873 -397 452 1396 -473
2472 -473 632 863 -366 -374 997 -302 -639 726 -82 -967 434 -10 -1518 -559 277 -1151 -942 -132
2490 -132 -1247 -1192 99 -909 -1949 -302 -817 -1757 -184 -808 -2127 -1044 -558 -1848 -999 -122 -1510
2507 -1510 -1784 -178 -1312 -1835 -320 -897 -1809 -210 -200 -1537 -1003 39 -1729 -1519 320 -840 -1306
2524 -1306 280 -277 -1287 54 -9 -851 386 410 -910 -308 1028 -644 -40 1153 9 -455 1134
2541 1134 490 -229 1080 1037 -235 947 1394 235 417 1784 480 446 1819 706 188 1490 1559 342
2559 342 1584 1659 -75 907 1952 383 606 1673 798 352 2051 791 -161 1207 1223 -85 1283
2576 1283 1250 -665 365 1572 116 14 1394 -173 -381 1061 576 -586 223 332 -572 485 556
2593 556 -881 -441 644 -227 -714 462 -779 -1354 62 225 -1218 -505 -144 -1188 -804 299 -1549
2610 -1549 -1309 119 -1289 -1201 -22 -906 -1838 -414 -353 -1668 -774 -720 -1721 -890 -54 -990 -1209 -340 -940
2629 -940 -1234 87 -419 -1658 -224 -230 -1339 -460 -74 -1633 -880 752 -263 -660 266 -697 -1055 280
2647 280 7 -949 -175 161 -768 179 602 -656 -189 1084 156 -117 609 96 -793 988 723 -436 855
2666 855 958 -297 802 1683 91 337 1184 352 -27 1191 606 -257 1522 1530 83 1045 780 -23 663
2685 663 2000 499 294 1511 425 17 1667 820 53 805 969 209 804 1286 -347 2 1712 427
2703 427 39 951 -24 -358 1111 632 -847 171 522 -228 75 773 -475 -753 954 -487 -843 333
2721 333 -614 -937 256 101 -1356 -518 -299 -1003 -553 410 -1081 -1188 400 -722 -994 -106 -616 -1632
2739 -1632 -427 5 -1389 -694 -396 -1543 -992 143 -1261 -1530 -75 -909 -1514 -14 -589 -1633 -243
2756 -243 -125 -1272 -900 -60 -1051 -754 -85 -670 -853 4 -470 -943 222 340 -1027 113 436 -937
2774 -937 86 589 -283 -696 663 -261 -390 922 222 -685 633 974 -258 638 999 -140 386 867
2792 867 164 39 1308 778 78 1522 1007 -71 1305 1171 270 962 1445 672 451 1755 430 173
2810 173 1201 987 357 1134 1144 374 1032 1422 -81 366 1383 204 318 1028 191 -299 1404 461 -181
2829 -181 556 366 -418 245 803 -643 -368 823 -751 -265 700 -410 -899 237 -175 -883 -104 -171 -1382
2848 -1382 -655 190 -852 -964 -158 -777 -946 -138 -868 -1603 -281 -346 -1448 -448 -518 -1647 -964 -223 -1435
2867 -1435 -1268 -269 -1246 -1557 -14 -685 -1537 -299 -192 -1440 -116 33 -1222 -1068 429 -617 -635 378
2885 378 -358 -1000 21 22 -814 669 209 -332 200 627 -206 -43 744 202 227 1192 291 -220 981 929
2905 929 228 990 1208 301 799 1240 517 291 1262 650 553 1121 722 74 1164 1351 603 1267 1300 341
2925 341 496 1502 598 390 1184 479 125 1127 888 179 1018 652 -28 445 1151 -325 -133 912 -235
2944 -235 -441 608 -109 -639 163 205 -720 48 150 -806 -108 127 -890 -622 545 -278 -1084 -343 -809
2963 -809 -1026 -749 -236 -1623 -415 -308 -1289 -876 -277 -1441 -1399 -155 -998 -1272 -502 -833 -1701 -554 30
2982 30 -1310 -984 -394 -1315 -624 -270 -1116 -1031 -262 -482 -931 -127 -151 -1222 -53 312 -814 -324 207 -321
3002 -321 -136 963 -244 -659 674 222 -207 661 509 -592 534 1098 -60 29 550 256 327 964 189
3021 189 -48 1187 928 289 1189 1092 445 779 1335 645 743 1375 528 750 1592 916 175 1032 1044 308 1392
3042 1392 1311 -90 667 1127 381 372 961 219 -349 968 305 -132 475 132 -89 428 607 -572 -261 699
3062 699 -184 -254 275 -607 -1097 329 -339 -984 -204 -182 -1184 -549 21 -1044 -771 84 -692 -815 45 -577
3082 -577 -1567 -549 -560 -1150 -317 -384 -1442 -589 17 -1177 -1023 -220 -1103 -1193 -284 -595 -1211 -365 -474 -1103
3102 -1103 -465 85 -1115 -828 206 -884 -617 211 -452 -514 150 -9 -664 441 129 -718 291 556
3120 556 -358 124 390 303 142 608 214 -8 1156 611 260 1080 912 353 692 1408 296 482 1398 537
3140 537 659 1399 619 92 943 925 -148 868 1177 368 617 1166 289 428 1103 489 210 1168 471 -74
3160 -74 1251 841 304 548 903 -135 239 959 128 287 451 -302 -459 399 274 -324 89 44 -721 -104
3180 -104 70 -714 -251 -102 -397 -956 128 -655 -771 -169 -485 -1353 -581 -481 -1196 -756 -429 -921 -833 -33
3200 -33 -658 -1177 -347 -1108 -1171 -310 -415 -1265 -723 -326 -997 -553 -100 -1030 -986 160 -674 -830 -144 -414 -1068
3221 -1068 -180 151 -630 -122 229 -625 -198 621 -191 -469 605 -67 -252 977 260 -437 467 835 208
3240 208 549 856 -96 449 1020 -54 182 971 559 362 947 693 7 859 971 228 324 985 501 673
3260 673 1137 845 144 854 665 124 925 664 42 312 1039 239 350 718 -100 -210 350 193 -225 584
3280 584 236 -312 373 309 -391 14 485 -303 -304 365 -294 -719 101 -396 -439 -216 -291 -742 -182 -56 -903 -659
3302 -659 -91 -886 -766 50 -381 -880 -329 -792 -833 -463 -412 -1155 -629 -226 -943 -457 159 -824 -635 -155 -603
3323 -603 -584 -264 -346 -678 -273 -99 -882 -395 300 -579 -19 310 -513 -592 129 -75 -678 411 27 -125 440
3344 440 637 55 297 753 -153 66 643 254 -188 376 414 -32 786 585 -255 646 552 0 -1 898 347
3365 347 25 1142 356 -189 963 738 146 819 628 -304 436 671 21 467 747 -71 61 717 319
3384 319 -313 411 495 -348 220 156 -194 20 441 -318 -1 347 -209 114 510 201 -426 481 90 -456 -91
3405 -91 186 -382 -272 424 -371 -308 -23 -572 -690 88 -64 -702 -36 -414 -1039 -258 -53 -603 -269 -373 -645
3426 -645 -579 90 -163 -588 161 -204 -841 -200 216 -704 -36 259 -676 -515 321 -152 -708 11 -42 -250 143
3447 143 47 -564 235 -263 -619 -169 591 -92 -176 707 138 -151 456 225 -501 299 421 -63 345 809 -30
3468 -30 75 712 67 47 671 315 115 823 423 89 519 453 -324 672 910 174 167 613 176 122 594 171
3490 171 146 338 476 -419 238 657 -156 371 544 50 167 583 -181 -296 401 136 -82 491 434 -92 -162
3511 -162 259 -178 14 657 -18 -413 589 -149 -622 88 -83 -881 50 176 -637 -275 252 -145 -155 284
3531 284 -573 -603 190 -63 -960 -344 -70 -524 -290 6 -674 -356 81 -273 -215 -66 -678 -731 104 -300 -669
3552 -669 -42 236 -696 -252 -225 -629 -634 117 -588 -445 149 -195 -422 16 -84 -550 -93 146 -424 -374 484
3573 484 -233 -276 373 -360 -70 524 -109 -411 615 172 -74 242 454 -77 -275 683 57 -43 782 106
3593 106 14 705 371 -5 342 350 21 508 757 -43 98 452 158 589 314 226 80 627 379 176 538
3614 538 407 -31 416 721 10 316 548 108 175 604 224 -11 368 426 -236 471 353 -197 244 101 -231
3635 -231 6 -60 -27 -265 464 -176 -341 -164 20 -451 174 -196 -537 -130 39 -73 -268 -37 -294 -414 -133
3656 -133 -104 -865 -327 -188 -745 -207 248 -612 -600 -69 -410 -596 3 -522 -694 212 -285 -592 -41 -257 -573
3677 -573 -282 74 -836 -236 226 -585 -580 128 -153 -630 118 31 -416 -304 446 -526 -84 259 -409 -33 70
3698 70 -334 42 397 20 -219 139 83 -279 419 263 -8 -160 481 70 28 565 344 73 369 444 -204
3719 -204 228 700 -218 187 472 122 508 930 160 9 433 403 125 339 100 430 153 380 164 215 606
3740 606 196 -5 481 123 -212 345 393 24 39 558 -13 412 513 -99 -124 417 -177 -326 307 52 -341
3761 -341 343 389 -352 7 78 -375 -119 39 -281 230 194 -592 -503 -257 -181 -378 -231 -324 -796 31 -572 -616
3783 -616 -301 140 -319 -588 -44 -265 -637 -167 -250 -651 91 66 -615 -444 18 -552 -351 15 -510 -304 -121
3804 -121 -187 -631 299 61 -486 96 -74 -435 -234 197 -477 58 345 -150 2 184 64 -508 704 230
3824 230 -590 145 475 -163 76 520 -44 256 292 -201 -14 529 357 -40 336 448 -125 437 903 -44
3844 -44 285 887 75 255 691 -74 10 785 330 19 509 393 150 370 494 -42 -91 716 220 -296 437
3865 437 10 -5 558 436 -168 104 326 70 -53 335 3 -245 576 161 -460 51 38 -861 -129 107 -388
3886 -388 -221 299 -250 -414 4 -533 -349 85 -433 -750 95 236 -544 43 -38 -762 -363 -85 -522 -480 -191
3907 -191 -523 -466 363 -366 -1061 23 -361 -672 -245 4 -638 -325 -146 -365 -357 288 -233 -340 -44 -268 -528
3928 -528 -22 237 -490 150 146 -327 -86 574 -240 8 83 -27 -75 477 89 -60 351 476 -240 278 527
3949 527 53 255 411 296 151 534 267 -98 759 195 -38 364 823 3 584 547 181 182 679 91 -72
3970 -72 490 324 305 448 171 114 252 164 -114 -47 653 283 17 396 159 -512 -55 2 -299 434 356 -157
3992 -157 61 501 -200 -175 57 -269 -431 118 -206 -527 139 12 -466 -40 -209 -718 8 57 -564 -383 -162
4013 -162 -158 -572 -1 -21 -786 91 -31 -526 -30 -126 -521 -397 -129 -428 -413 68 -477 -364 -139 41 -354 78
4035 78 -274 -631 -4 80 -355 -292 -70 -53 -148 113 -65 -215 449 -109 -107 140 461 -266 -35 542 30 12 509
4058 509 -415 52 229 99 -3 238 448 -171 317 468 -120 291 311 -185 170 387 294 107 1066 199 -32
4079 -32 485 129 -161 558 387 154 304 653 32 155 515 248 18 697 430 -121 369 224 -119 388
4099 388 486 -63 399 276 -96 -431 497 86 44 650 -129 -432 71 -12 -376 -282 408 -284 -422 228 -358
4120 -358 -298 -4 -21 -171 -4 146 -372 -30 261 -427 139 156 -154 -495 523 -404 -343 -65 -6 -518 126
4141 126 14 -620 -416 213 -183 -122 184 -131 -511 386 -265 -254 231 89 -546 183 128 -490 81 42 -333
4162 -333 -130 386 -193 -307 250 -127 -368 438 4 -23 33 365 -67 -86 295 -362 142 612 -125 -275 516
4183 516 34 -61 477 336 -274 -65 227 -100 201 355 -152 -100 280 52 -78 202 261 -356 283 554 -393
4204 -393 502 79 -474 -7 408 -79 -174 463 -206 -532 494 133 -156 22 381 -124 -25 372 -35 51 239
4225 239 91 -524 485 -121 -292 -5 -45 -619 -181 -173 -214 -81 107 40 -488 215 74 -396 248 -255 -170 312
4247 312 137 -382 -104 350 45 -81 211 -502 -597 146 -115 -388 294 392 -266 225 72 -394 29 51 -27
4268 -27 -241 364 -78 -162 417 -112 -279 -8 -86 -266 329 77 -251 267 272 -115 -304 538 -2 -173 285 -37
4290 -37 -111 213 434 105 187 469 -190 -160 427 -159 0 506 -158 217 327 124 -454 165 388 -297 -36
4311 -36 228 -489 -297 146 52 -33 163 -94 -666 124 12 -487 231 175 -287 274 283 -191 -42 223 207 -565
4333 -565 333 -295 -192 50 217 -257 -67 119 -370 -102 38 -377 -335 -233 -285 -85 377 -141 -206 135 8
4354 8 -567 -234 -86 -154 -221 104 30 -422 -50 -133 -246 168 167 -564 -51 198 -573 298 310 -81 -241 308 132
4377 132 -48 -6 18 -336 2 504 -147 11 185 -113 -300 519 119 7 466 173 -217 516 276 7 135
4398 135 -18 -385 -132 573 274 208 267 -132 38 263 16 70 260 280 -53 -20 412 -179 245 49 -98 -28
4420 -28 143 -88 15 454 194 -68 185 -211 -333 170 341 -178 133 425 -342 64 -217 -430 -362 400 -246
4441 -246 -389 159 404 -18 84 145 -679 -346 218 62 -8 347 -142 -393 -234 32 -513 195 -132 -223 -182
4462 -182 94 -200 15 -132 19 -367 179 -323 -762 -35 -108 -473 -98 -103 -406 -18 220 -58 -30 39 -255 -307
4484 -307 99 -212 -465 -10 211 -300 -154 237 -59 -28 391 91 213 242 20 -213 67 324 178 221 403
4505 403 -156 -51 706 -54 96 801 220 30 416 138 -289 444 187 -2 357 133 -58 19 299 -121
4525 -121 -231 232 70 -225 -56 -17 -202 177 -31 -73 254 189 -166 64 653 30 70 297 -18 -328 145
4546 145 21 -127 370 186 -332 -15 -160 -302 -280 173 -196 -329 238 65 -699 190 -134 -477 -82 -118 -610
4567 -610 -80 16 0 -210 -32 -106 -384 -159 11 -258 87 -43 -169 -86 -139 -299 -227 91 -282 -404 -17 -267
4589 -267 -267 126 177 -337 -184 -64 -466 -140 15 -133 -77 33 -268 -110 291 31 -252 375 -237 -179 80 246
4611 246 -342 -16 349 9 -311 -43 227 -225 539 -100 -107 207 244 -114 331 445 -137 110 494 306 -71
4632 -71 400 -42 170 468 246 -225 546 503 -251 20 162 41 23 258 263 311 578 75 -222 178 -124 -209
4654 -209 227 109 -65 260 44 -151 365 165 -368 -301 8 -23 -269 271 278 -137 183 165 -9 -339 43 -246
4676 -246 -186 32 -7 -261 200 16 -382 253 -292 -401 -60 -21 -213 -355 462 -402 -325 238 -206 -386 -152
4697 -152 116 -413 -179 -130 -462 25 -14 -110 -342 33 -456 -395 325 -511 -478 -171 -72 -370 -190 130 -347 -255
4719 -255 72 103 -243 179 -174 -261 105 -294 -278 54 74 -212 183 448 -413 -135 177 130 -338 62 205 69
4741 69 204 109 169 -19 514 141 295 238 -12 213 721 169 -101 391 277 153 327 459 -43 195 189 -201
4763 -201 12 135 54 163 657 -13 -48 323 411 217 435 385 -158 -30 516 -207 303 131 -129 132 99 -57
4785 -57 -217 529 57 -46 186 -134 -332 -199 96 126 -84 3 133 -161 201 -115 -320 315 -93 -397 65
4806 65 -293 -339 -17 -268 -104 -406 -75 -648 -413 7 -168 -436 -93 -164 -328 -152 -217 -56 -328 -14 -455
4827 -455 -263 -178 -179 -597 -50 197 -332 129 -43 -343 23 297 -237 86 232 -152 -417 109 -74 -59 288
4848 288 -37 -252 64 -55 -342 171 272 36 95 68 -2 -25 665 213 -134 289 249 62 204 182 172 342
4870 342 140 279 179 440 159 49 289 160 134 -97 442 77 275 515 -59 470 380 -225 119 522 352
4891 352 -246 288 220 40 146 294 -179 193 -149 190 119 383 -31 127 258 -83 -293 234 156 -84 -135
4912 -135 96 -394 65 119 -514 -388 87 -205 -403 82 -64 -248 92 -190 -296 -105 -19 -571 -9 -34 -413
4933 -413 -178 -211 -160 -221 -98 -148 -270 -236 -330 -400 -139 145 -254 -85 -44 -491 -4 83 281 -251 -3 134 -629
4956 -629 21 180 -282 17 161 -86 -203 333 -497 -391 171 118 -292 49 -55 279 -6 123 181 220 334
4977 334 73 -444 279 34 -188 257 241 -125 358 198 -65 -46 389 210 6 107 -14 -169 296 135 -109
4998 -109 440 -192 156 139 136 -194 350 197 220 -181 187 46 79 548 24 173 115 355 -150 48 16 -69 -4
5021 -4 328 160 -221 152 -168 -52 319 -151 -346 -208 -37 -241 -298 -143 -111 -343 -354 -433 -481 -256 -251 -327 -83
5044 -83 12 -453 -253 210 -252 -161 426 -384 14 305 -385 -264 149 -258 -368 107 -110 -400 -111 129 -137
5065 -137 -103 27 -327 87 -148 -98 -22 206 -76 -215 245 149 -212 111 117 -332 -180 60 -311 81 -3 139
5087 139 -180 317 410 -144 150 155 252 122 40 -116 -85 75 342 -277 104 122 149 428 272 -117 599 301 314
5110 314 257 422 -38 -130 410 385 167 329 169 -143 25 378 134 298 347 -6 -59 147 -195 148 77 74 -56
5133 -56 37 264 -46 296 257 -473 290 2 -98 -86 353 -335 -358 31 212 -381 -6 -21 -414 81 -120 -277
5155 -277 -159 301 -315 -88 152 -92 -125 -124 84 -181 -22 -141 -267 6 275 -221 -315 -61 -208 -171 42 -79
5177 -79 -276 -115 -70 -206 -104 -42 66 -136 -79 -519 -244 6 -66 -301 220 156 -199 -123 -213 -106 21 -252 -291
5200 -291 -56 184 -54 3 137 -130 -132 158 331 26 195 13 60 -75 32 -127 -170 240 227 176 45 121 17
5223 17 87 493 -181 507 107 248 -47 101 -40 181 375 39 -150 343 239 -326 98 37 -244 31 91
5244 91 -169 179 66 334 108 39 89 166 5 253 -281 220 116 -151 28 305 59 -60 -27 -218 13 386
5266 386 324 -143 98 -269 -139 149 155 -174 -91 -136 -197 221 -91 75 -92 -18 -23 -115 -36 -267 -293 37 184 55
5290 55 107 51 -47 -24 134 -255 44 138 -49 -283 -75 381 -427 118 200 -398 -79 25 -92 19 76 24 56
5313 56 32 -119 101 -5 -102 -72 241 340 -173 42 247 25 -88 481 -115 -350 219 -32 -244 -56 55 147
5335 147 -148 26 26 36 375 127 68 161 -72 44 434 16 -111 117 281 85 349 193 558 51 -9 236
5357 236 67 -136 67 2 140 407 -80 -47 449 -57 45 260 308 277 165 -418 -214 45 -211 -123 146 -39
5379 -39 -160 -112 515 -17 31 -66 -215 -65 271 -157 -257 52 145 -72 -135 -16 -242 101 182 -22 -249 39
5401 39 -252 92 87 -143 -554 9 -80 -320 157 205 -307 175 366 -113 -123 95 56 -186 236 147 -84 -140 -227
5424 -227 -242 -165 313 11 203 199 -86 -285 111 -132 6 293 117 -152 178 -42 144 -154 154 -164 200
5445 200 44 -45 -37 78 -109 -262 350 230 -49 -234 343 -128 80 449 252 -137 326 63 -11 161 122 -135
5467 -135 -53 290 -167 -228 544 -293 302 373 0 -106 354 -97 -164 179 233 97 98 238 15 15 219 -137 -372
5490 -372 169 33 -136 73 -125 -244 152 70 -57 -288 522 -77 -39 -103 -153 -144 -111 -158 -448 48 -5 -326 -166
5513 -166 110 -132 -157 123 -193 -154 -8 -218 -218 353 -111 -122 124 -71 -137 53 79 -455 30 -127 146 -105
5535 -105 -132 -460 -81 10 -50 -50 67 -221 -336 -112 136 -381 -39 18 -51 6 -97 -187 -120 27 -219 -189 -399 190
5559 190 -428 162 207 -303 -66 64 83 -192 -119 109 -45 221 261 -83 143 165 -234 55 172 -10 49 348
5581 348 41 -78 311 -146 355 440 39 -213 -55 665 -129 -270 123 -252 177 249 202 126 374 -75 -283
5602 -283 117 31 -95 73 8 -175 90 -59 -16 -168 32 279 61 280 -9 -219 -31 -224 -334 -146 96
5623 96 -21 -295 11 38 15 66 -55 -436 215 131 -479 100 172 27 -91 -97 -282 348 329 142 70 -47 -110 -292
5647 -292 16 -259 -200 219 -81 -409 -57 174 -130 -53 290 -350 -525 89 -85 95 136 256 125 -158 171
5668 171 -393 -146 126 -1 81 -205 -49 100 217 292 -219 34 70 -299 280 258 -173 18 -30 244 106 408
5690 408 -387 50 82 -184 -117 142 163 77 -70 80 49 -105 206 -69 -334 210 18 32 232 300 -226 139
5712 139 490 -126 112 214 -245 -96 6 234 10 486 88 -19 35 76 -40 -91 199 -102 -26 46 109 -338
5734 -338 172 -390 -193 33 123 -345 85 78 -29 214 389 -509 120 342 -133 227 26 264 333 20 -205
5755 -205 13 6 33 -163 -160 51 -8 -277 2 -67 -213 59 231 107 243 -122 -153 -326 271 54 -152 192 -441
5778 -441 -119 31 66 -161 -68 229 -565 142 221 -97 199 68 104 -25 527 3 -133 205 194 -6 124 97
5800 97 -121 206 244 -235 67 306 45 -22 347 -129 -36 194 -269 -327 -27 122 -155 15 276 -177 352 485
5822 485 -95 -116 369 183 -34 95 347 -118 -19 -54 -245 170 -20 -51 -172 188 -140 314 -86 -109 -183 -9
5844 -9 -284 -583 -25 45 -87 69 327 -287 -362 -174 -98 -18 24 -91 -211 -107 -203 82 51 -27 -137 -30 292
5867 292 292 -71 36 4 -176 27 -21 -248 -169 59 -230 121 152 -26 -265 123 -49 -110 288 -68 -284 -12
5889 -12 60 114 145 -203 -381 -44 303 -289 61 -34 -58 -92 75 -89 -273 433 10 -36 98 226 28 -20 293
5912 293 -285 101 207 176 87 3 118 -24 260 196 -95 -50 355 139 86 143 -126 -290 211 -256 -290 -26 30
5935 30 98 -129 56 -43 -28 330 125 205 -91 58 -76 34 401 -184 -152 -12 -294 299 -318 -284 126 57 -132
5958 -132 55 142 -157 -56 -26 55 -500 34 177 -152 -197 -90 -121 89 -7 -329 57 211 95 -232 -98 -118
5980 -118 -440 -132 35 -325 79 227 -85 -65 0 -68 -352 162 -264 -219 -97 341 -9 -123 336 5 -214
6001 -214 261 -31 -184 -20 -111 -63 255 99 -513 1 -125 -89 -109 75 105 139 107 -67 145 145 126 60 -18 147
6025 147 -83 99 299 -253 -79 10 55 -123 247 217 -47 199 1 -156 -79 21 -252 -117 21 -123 14
6046 14 341 -403 -100 -23 121 25 -72 -65 -84 460 1 49 54 162 -32 -118 130 -534 -227 197 -233 -85 278 -23
6070 -23 -259 20 -92 -200 -169 -69 -162 -123 373 -204 -89 72 32 -155 12 -414 -338 -85 -5 -170 -93 104 -272
6093 -272 -90 64 -106 25 28 -406 68 98 228 -17 -324 47 -211 3 120 -31 19 237 -141 -50 253 85
6115 85 73 264 78 -210 500 -4 39 436 309 -20 -69 -47 -264 -154 134 -370 -360 6 70 -137 101 160 24
6138 24 143 -234 9 252 364 47 29 -227 141 -241 68 -138 87 -64 167 -127 -192 395 -42 79 182
6159 182 186 -136 158 -210 -157 -99 -13 -215 -25 91 269 -415 -77 5 -20 25 -50 142 140 -10 287 267 -84 -122
6183 -122 -209 92 220 22 63 -132 -136 -60 93 -207 -105 -116 -353 -49 166 -273 71 336 -7 -136 300 160
6205 160 -130 -120 -9 3 51 -14 -85 -229 -92 67 -482 45 -253 88 79 65 -271 44 120 116 16 151 -59 -44
6229 -44 299 46 -43 286 71 101 279 -131 -269 417 271 9 37 415 100 -151 -229 154 -180 -208 183 -90
6251 -90 -204 18 -239 124 379 -285 -228 17 -281 -44 282 -254 -122 -147 -143 -146 -27 523 9 31 114 -303 -70
6274 -70 361 199 22 -28 212 -58 -259 -34 120 49 116 -39 -15 49 -204 -244 -73 92 -341 90 -21 -136
6296 -136 198 -189 128 -331 29 -529 -326 -39 80 2 191 -127 53 -65 54 -119 181 330 183 143 155
6317 155 -271 -114 125 -145 -47 -77 186 56 136 50 -232 -86 49 -90 127 336 64 -85 77 35 189 172
6339 172 194 16 -50 375 -246 -181 200 -268 -104 103 -44 14 129 -112 -163 230 159 81 -34 -52 162 179 210
6362 210 -108 -17 283 -109 16 160 -66 32 224 412 -421 140 214 -59 -210 186 -324 45 158 -47 -139
6383 -139 180 184 -182 226 298 170 -103 115 -79 19 98 -132 -255 -86 -57 19 169 29 -116 -111 117 -388 192
6406 192 46 -243 53 0 -35 -26 -133 -25 -258 196 10 -105 -65 -198 -347 -143 184 -273 -58 470 1 -362
6428 -362 365 -37 -220 -106 90 -182 -81 -52 98 -182 92 -556 -33 239 92 129 -35 -88 -182 -117 317 -257
6450 -257 81 28 1 13 301 101 -114 -89 88 -243 92 -61 -66 -17 211 -251 140 212 240 132 223 283 -15 137
6474 137 -7 -495 10 -200 192 349 128 -69 -99 127 -86 40 164 -337 -65 59 131 -118 207 -60 -148
6495 -148 134 133 198 37 325 25 -234 329 176 -189 31 254 176 46 352 -123 -107 -70 -439 -95 178 -167
6517 -167 -106 151 162 -333 17 174 -123 -38 -206 -64 -198 70 -317 223 -60 -142 -6 44 -32 -255 8 305
6539 305 -260 152 -18 84 -51 277 293 75 137 64 155 79 238 -303 -96 -259 -317 -267 263 -284 -252 110 -13
6562 -13 -340 250 187 -256 -243 -163 -217 82 -77 78 38 -50 -13 -319 249 -67 17 -95 -19 67 134 312 -212 113
6586 113 106 14 -246 -107 -115 -343 171 85 -239 271 -82 -34 90 -143 -156 176 239 -259 32 60 -213 109 -167
6609 -167 205 -113 188 -144 -197 12 -64 63 -181 123 -55 70 68 -59 -135 68 107 -354 311 148 -28 33
6631 33 82 351 153 368 326 -218 -273 -344 46 -55 -216 -2 -48 -286 82 146 211 -201 -55 127 -381 -77 -148
6654 -148 77 -149 -206 83 -116 -85 -10 -417 -178 -197 111 -57 -103 7 19 383 -128 -252 -30 -332 -207 -214 -52
6677 -52 -28 -85 311 21 -105 -140 74 -351 -151 150 -199 331 -48 -44 -157 81 100 -167 -88 -29 -491 53 -3
6700 -3 -99 -31 171 -98 -3 -10 -273 -361 59 156 -97 286 331 -88 -112 -1 -179 97 -26 -78 316 398 -309 195
6724 195 175 -42 27 116 283 -220 402 -29 204 284 -186 -208 -85 227 70 -38 298 -154 -472 164 182 52
6746 52 572 284 184 510 150 -181 -254 151 -102 54 18 -73 -180 -237 78 -213 173 365 -94 70 107 -120
6768 -120 -131 -63 -415 -26 48 -316 -54 119 -102 -221 -100 215 -75 88 17 -251 -149 77 -182 -96 61 54
6790 54 -373 188 -66 -132 14 25 -92 402 92 -342 -309 -11 39 280 25 -245 -296 -101 316 -234 -258 243
6812 243 8 -61 43 109 -41 224 208 -80 207 205 -216 68 -20 -20 366 -53 52 -89 47 40 22 439 61 -292
6836 -292 -52 179 77 279 199 -321 -40 463 47 -93 115 72 45 16 236 -97 240 186 -105 -77 192 142
6858 142 -92 198 27 -33 224 -362 96 -4 -76 51 -163 -111 89 96 20 -213 158 238 -104 -168 414 33 -171
6881 -171 195 425 -213 61 197 -118 149 -109 45 -46 45 -243 -329 105 -307 -292 -119 49 -22 28 84 -198
6903 -198 -222 113 -232 -113 -18 -267 -146 262 -185 -464 90 -332 -258 -228 103 -125 -229 -33 103 -437 167
6924 167 -37 -74 191 121 -141 58 -245 130 -15 -99 16 -264 177 -145 -5 148 -238 36 305 138 -154
6945 -154 -199 -15 -192 252 197 -152 -68 126 8 -410 143 -124 -92 288 158 113 10 153 -55 -31 -79 -143 -155
6968 -155 289 44 14 110 17 -148 23 3 -132 108 389 -118 -13 17 23 -116 54 139 -268 471 -32 127 20
6991 20 1 121 -12 447 -134 -87 307 59 92 168 134 -209 93 -27 -295 295 97 -465 241 -225 63 -102
7013 -102 278 -407 -151 -21 -86 -41 2 -30 -375 -282 184 -260 -40 76 -273 13 -56 -78 -89 62 43 -81 -343
7036 -343 21 -82 101 128 -259 -105 -156 -317 -111 -164 156 -76 -211 122 -169 -120 -105 141 255 343 -71 268
7058 268 160 -180 -327 -125 264 -210 276 -171 -59 91 -142 58 -79 224 105 -167 12 18 -15 186 216
7079 216 75 125 139 -142 -28 149 180 -148 169 122 -2 246 224 60 435 91 -15 -44 78 -75 52 198
7101 198 -83 282 49 189 67 -250 -158 70 325 106 -54 93 -12 8 -237 178 -163 162 157 31 14 262
7123 262 144 -41 -5 160 105 -373 145 -143 160 95 -131 -145 379 -340 -226 -316 -386 -201 62 -219 -458 -210
7145 -210 -374 -510 -78 121 -155 3 113 -46 -258 19 -22 -223 192 266 53 83 410 -127 -82 80 -34
7166 -34 -483 321 252 -63 -230 -245 -316 241 123 -250 -261 213 -80 -203 133 154 -243 69 704 -165 -137 68
7188 68 -234 121 -113 -139 232 48 -331 -73 -35 13 -129 -193 54 -214 -182 200 -208 68 235 31 173 -24
7210 -24 -91 -89 315 146 66 154 225 -10 -173 153 176 -156 239 302 -85 203 153 -80 -24 -169 -200 -67 -86 49
7234 49 -11 616 -56 -20 479 95 -103 -235 0 -240 347 115 -276 55 254 -120 -42 -75 -161 -243 74 18 52
7257 52 321 -102 -97 207 323 -179 -224 36 -225 -133 175 -323 -123 106 5 -172 -210 32 37 308 120 -298 30
7280 30 329 97 -56 113 -285 -213 81 -12 -361 284 -122 37 185 302 60 -180 156 186 77 143 -158 -192
7302 -192 179 -61 0 3 -67 -139 -246 135 -235 -146 352 -325 267 -92 176 -6 58 -230 0 191 307 -215
7324 -215 119 280 -140 -75 165 67 -96 223 112 -297 -11 -49 -246 224 236 38 -175 178 -74 -234 46
7345 46 -64 -400 291 -56 -180 103 128 -111 101 236 -385 100 84 147 -13 266 96 388 -4 21 49 300
7367 300 124 18 270 -11 -245 -325 124 177 -89 59 91 -118 199 81 -256 341 -2 -57 2 229 191 -400
7389 -400 -51 -46 -82 152 -42 -88 -99 200 -13 -87 -88 -20 -163 225 -14 -53 109 -278 73 176 -120 1 -95 -81
7413 -81 -133 -341 166 -227 -213 -56 -59 186 119 17 7 163 326 -256 -31 119 -38 23 198 -240 -324 135 337
7436 337 -454 328 155 18 341 47 -127 377 247 4 230 -204 207 238 119 -110 -99 1 230 -369 171
7457 171 -67 71 -186 123 -238 -401 228 -50 85 -29 -143 139 -69 -152 -204 -48 187 -206 266 53 -219
7478 -219 -271 -58 -89 -20 142 -174 -246 78 -35 -479 326 301 -66 139 323 145 -276 -29 247 -240 307 -22
7500 -22 -96 39 103 -82 -146 -316 -86 -416 38 33 -197 67 -161 -225 -62 132 -62 267 267 -81 61 175 193
7523 193 325 70 -284 27 188 107 -334 284 56 -189 155 261 -27 59 270 -43 150 -146 194 12 -38
7544 -38 46 -214 363 14 -192 -62 94 376 -156 -73 55 60 425 80 -177 73 -473 -98 -38 316 182 -187
7566 -187 47 293 254 -459 -75 -68 165 23 -448 29 60 -317 342 33 64 -423 90 -339 -73 155 -105 -160
7588 -160 139 -169 -5 258 108 -268 3 32 -96 -186 118 28 -51 47 -20 -25 90 94 -92 89 95 -61 -72 200
7612 200 -407 157 75 229 -70 -247 144 83 -141 -103 -36 51 -5 -509 -120 -49 -214 -184 54 144 -27 -59 85
7635 85 61 -181 80 138 326 127 -135 -218 343 20 -129 35 -102 -470 326 238 -208 127 128 -272 18 30 1
7658 1 120 -178 1 40 1 -348 -103 498 334 -204 -223 -145 -205 208 305 -6 -117 295 2 69 96 -45 -184
7681 -184 47 60 -297 -186 174 -66 207 -172 9 9 427 157 20 134 166 -98 331 189 -50 -39 87 3
7703 3 -1 -81 -59 157 72 -26 -143 84 -98 56 -24 -36 37 61 79 121 -23 20 203 -11 -44 206 -110 46 115 184
7729 184 -60 113 -305 68 153 -177 -34 -177 108 -60 2 90 -533 191 -74 -37 142 231 -26 61 -12 18 -50
7752 -50 -21 220 -349 -186 74 55 88 162 228 6 194 -11 -337 7 167 -149 -27 -64 66 -92 194 -183
7774 -183 1 128 -177 223 -87 -52 -199 -45 208 -112 -8 34 -172 -96 103 -545 27 66 -131 -89 139 49
7796 49 176 41 -158 -151 -49 279 -69 -45 -191 -345 198 -116 -94 101 -217 -163 -38 -58 -82 -282 190 -218 88
7819 88 -88 -170 137 -411 305 -76 253 58 169 76 287 171 -502 140 -56 -191 14 424 303 -152 66
7840 66 -19 -75 260 -237 -516 152 -70 296 127 148 -249 -98 -185 -203 -164 -77 142 -317 103 239 -320 61 245
7863 245 165 51 162 -206 -95 -14 -25 -96 167 2 -70 189 275 -361 123 425 94 -108 189 -118 -79 52
7885 52 247 -46 237 48 63 25 59 228 242 243 -148 328 379 -287 23 -56 -542 -148 -10 -270 -482 193 261
7908 261 -176 -29 12 -176 -288 -261 1 -155 91 -11 -138 -389 -7 -182 -23 216 36 87 -27 -282 -131
7929 -131 -17 -58 -40 81 161 -113 -46 213 -88 -122 176 108 63 322 302 44 -18 -215 45 63 -55 -265 -52
7952 -52 -78 -316 -191 -179 -179 -145 -47 -44 157 168 99 -206 -288 20 -353 -266 303 -252 -188 20 -43 98 -78 -192 -58
7977 -58 66 39 -59 -54 -322 -215 184 -83 49 62 254 -241 -57 -25 28 166 19 -10 -19 170 20 117 63 210
8001 210 294 -145 -10 -11 160 -159 243 -434 -37 209 273 264 -66 -35 -2 -122 -376 172 43 -58 -451 22 -80
8024 -80 -173 -131 172 -162 313 -15 338 -134 248 90 -361 486 43 -98 94 -115 -246 287 -13 -520 90
8045 90 192 -111 -37 406 -99 -69 -45 -96 -211 -407 7 13 42 -69 -51 186 115 -14 -208 50 -266 90 66 -62
8069 -62 135 65 376 -223 256 171 111 -23 276 -61 -350 355 -83 -194 49 365 249 140 5 -63 -32 -143
8091 -143 -198 -325 142 -46 23 36 -137 -190 352 -222 -313 356 147 112 70 157 -214 202 175 -37 -37 301 -90 -172
8115 -172 157 144 -305 -66 70 -16 101 -139 57 -269 154 -104 101 64 60 -96 15 34 -123 -18 501 87
8137 87 -1 28 -32 -237 166 -14 -187 139 -130 -69 -3 144 61 126 -42 -67 9 -81 -190 -124 69 62 153 -277 311
8162 311 -250 78 -159 -121 -24 -77 -459 -308 218 -351 -31 59 -88 -185 67 288 -156 7 -52 -333 -52 133
8184 133 -6 -181 124 -148 77 -143 -137
8191a37
$$ Imaginary data points
##PAGE= N=2
##DATA TABLE= (X++(I..I)), XYDATA
0 0 0 0 0 8 -8 8 -8 8 -16 16 -24 32 -40 48 -56 64 -80 96 -112 136 -158 182 -213 245 -281 321 -367 416
28 416 -471 534 -599 677 -758 847 -947 1054 -1173 1303 -1444 1602 -1775 1965 -2175 2407
44 2407 -2669 2962 -3287 3663 -4093 4594 -5184 5892 -6759 7855 -9285 11245 -14106 18706
58 18706 -27333 49275 -228358 -364717 6357 27208 -92698 -336689 -393055 -251702 -38369
69 -38369 -40460 -141169 -223897 -198144 -103740 -12056 -81061 -186946 -168580 -43143 38068 45855
81 45855 -43592 -131948 -90941 30700 66829 49506 45661 47904 54688 64123 21843 3337 100591
94 100591 219112 223724 133608 10897 -37937 93247 295737 335517 199128 45744 -1264
105 -1264 111317 287504 318976 190765 91250 102737 176141 251786 238241 130968 84051
116 84051 157639 236344 246581 187434 77244 30120 120439 223202 225302 164203 81360 15709
128 15709 38088 109725 137233 136345 118533 43826 -25936 -16839 25514 63910 95700 60361 -35496
141 -35496 -80561 -58158 -23149 16042 19519 -49310 -102385 -79655 -54427 -60494 -73128 -103627
153 -103627 -120045 -77244 -47432 -87998 -133854 -154280 -159800 -116257 -52947 -61340 -120635 -165955
165 -165955 -191238 -170189 -91030 -45475 -78093 -125854 -167172 -190742 -142002 -60659 -42769 -77761
177 -77761 -119547 -156059 -139484 -66801 -35165 -66541 -87187 -86703 -75836 -40059 -25267 -62706
189 -62706 -78705 -42891 -8597 14613 17777 -30939 -70526 -31642 29746 55795 58589 27349
201 27349 -18803 -11735 32746 55058 72651 87008 59668 26829 33617 46743 64798 103623
213 103623 110308 73306 53610 55156 59516 90826 118273 92509 62901 72646 83031 87415 93721
226 93721 72293 50383 79418 109319 94645 71261 48733 26849 51157 99980 99883 65319 36660
239 36660 10215 13553 59429 78347 50915 29515 14391 -4133 7795 31206 23699 14363 13245
252 13245 -9911 -24163 -6522 -4247 -18060 -13359 -15005 -31075 -25964 -22620 -43678 -49125 -37144
265 -37144 -39749 -35504 -24168 -46758 -75333 -66842 -51323 -44474 -31035 -40646 -73428 -76293 -58951
278 -58951 -58472 -49871 -36036 -51159 -66238 -58802 -60716 -63181 -42281 -35456 -49010 -45707 -45492 -59389
292 -59389 -47422 -24967 -31535 -39116 -29964 -33228 -31897 -15372 -22349 -36301 -18108 -929 -6032
305 -6032 -4193 -7549 -24843 -13429 16623 19351 11795 10455 -3756 -4756 25278 35888 20901
318 20901 20710 23127 17833 29840 39370 25095 25862 43266 40022 33470 40736 33275 26348 44842
332 44842 52271 39619 39739 40656 30134 38705 51334 37943 31990 44204 39836 31971 37745 31961
346 31961 23555 38018 42408 25490 23912 26290 16079 21118 33999 21372 10362 16581 11617
359 11617 6481 16807 11955 -3380 4929 10292 -3609 -4197 -100 -10777 -9614 1210 -9662 -19018
373 -19018 -10750 -15661 -23778 -12508 -12377 -27118 -22943 -18502 -28933 -26486 -19221 -30207 -31166 -19435
387 -19435 -27970 -36466 -25893 -26302 -34938 -25646 -23429 -34880 -29771 -22843 -32869 -30085 -19093 -27469
401 -27469 -30936 -18762 -22698 -29105 -18271 -17559 -25088 -15471 -11603 -22395 -16914 -6440 -14661 -14313
415 -14313 -3375 -8898 -11752 -81 -2275 -9008 1904 4396 -4447 4503 10338 131 2959 13285
429 13285 7717 8154 17353 10003 5392 18358 18778 10234 18480 20100 10536 17723 25746 16751 16797 23357
445 23357 15617 15567 28374 22964 12749 20674 21205 14817 23359 25030 12198 14462 21505 13458 15262
460 15262 23966 13558 6329 16056 14459 8009 16234 14120 1883 7375 11945 2339 5235 11771
474 11771 802 -2883 6021 1017 -3571 4476 -175 -9547 -1591 765 -9575 -5167 -1428 -12606
488 -12606 -11953 -2278 -8537 -11772 -4360 -12617 -19483 -8509 -6547 -14192 -8590 -8897 -21489 -17418 -7095
503 -7095 -11351 -10406 -5896 -18907 -22985 -8537 -5631 -11315 -7234 -12246 -21446 -10435 -193 -8790
517 -8790 -10298 -7767 -15462 -9764 5015 -1541 -13487 -8888 -6863 -5680 7249 5793 -10565 -10059
531 -10059 -1396 -1498 5253 12099 -1323 -8213 2270 3021 1842 10859 8100 -1083 5537 8651 -739
546 -739 4276 13226 7110 6224 11007 2103 -22 13027 11846 4344 8961 7521 1001 10168 15238
561 15238 2356 -87 7939 6718 10874 16731 1929 -10609 870 10473 11677 15980 4763 -14527
575 -14527 -8832 8174 11069 11675 7138 -12201 -14187 4891 9639 2686 1170 -6805 -11499 3093
589 3093 9319 -4969 -9843 -5519 -6099 2843 10330 -5479 -18896 -9510 -2265 1301 7479 -1682 -17411
604 -17411 -10258 789 -3561 -3858 -557 -6013 -3274 4531 -7632 -17668 -5496 5090 6823 8170
618 8170 -6702 -25072 -12325 12210 14912 5859 -6370 -20561 -9835 16774 15967 -4747 -11941
631 -11941 -8409 3368 22051 13955 -16496 -21853 -172 18181 25216 12000 -20231 -27443 3879
644 3879 25746 20312 5388 -13952 -17757 6977 22486 6246 -7611 -4341 2306 13143 14499
657 14499 -8674 -21234 46 20128 17678 5208 -16154 -24177 2241 25920 13213 -8255
669 -8255 -15062 -10521 7885 19867 -1258 -24469 -12525 10253 18817 11599 -15036 -36022 -13596
682 -13596 23334 26293 3579 -21092 -33108 -11462 23397 21944 -6418 -19654 -14623 -954 15193
695 15193 7760 -17488 -17156 5945 14139 8046 -5870 -22283 -15372 15084 22968 3463 -11047
708 -11047 -14330 -7063 12563 16833 -4154 -9966 3405 9204 7069 1616 -11605 -8648 17153 24803
722 24803 5916 -10258 -15308 -7487 18585 29889 7540 -12094 -9141 -381 11399 18678 4307
735 4307 -8860 1865 10933 6006 1922 -2460 -6870 6104 18149 6884 -6198 -6721 -6607 168
749 168 13225 8186 -4789 -3430 -3192 -8168 -2836 2765 -666 1946 3695 -9294 -16036 -6042 -760
764 -760 1119 5330 -4137 -16767 -10807 -3263 -5961 -2954 -171 -8006 -7814 -3046 -10513 -14473 -3583
779 -3583 -689 -3321 -1191 -7266 -16381 -8632 35 -4100 -2805 532 -5869 -7372 -2635 -9007 -9455
794 -9455 4295 9042 1319 -2990 -10196 -14073 2327 16824 8954 -983 -4526 -8188 732 14349
808 14349 9131 -1353 3212 6995 5930 9023 4672 -3730 5771 19629 14945 6833 2560 -3982
822 -3982 3287 20040 18965 6973 5122 4579 3386 11433 12740 4668 7575 15342 9023 2890 3060
837 3060 558 5409 18720 15430 20 -3244 -1406 953 11545 13171 -353 -4089 2056 530
851 530 -595 2517 -3261 -4787 4836 4070 -7199 -9010 -7822 -8278 1097 5708 -6664 -14062 -10421
866 -10421 -11490 -8160 170 -4230 -12196 -9244 -10134 -16038 -10513 -5300 -9522 -7724 -6018 -15048 -16846
881 -16846 -8350 -9162 -10180 -4250 -7193 -13980 -9564 -8113 -13273 -7397 -1269 -5998 -6438 -4948 -12285
896 -12285 -11237 85 818 -3224 -456 -3827 -8599 -1214 2492 -2134 1512 6616 1140 -170 2958
911 2958 -909 640 11859 11338 3665 4551 3159 1477 11355 15304 6767 5781 10513 7695 8815 13085
927 13085 7257 5929 15795 16734 8879 7860 6334 4942 14841 20740 10664 4413 6824 5611 10034
942 10034 17390 10529 2974 8017 9898 5800 7445 5916 848 6838 12622 3987 -1326 1397 -701
957 -701 1600 9306 3316 -5709 -2598 -929 -3901 -52 -183 -7464 -4838 430 -6342 -10083 -6253 -8022
973 -8022 -7167 -403 -6455 -15246 -12038 -8061 -9668 -5597 -5608 -15140 -14656 -7553 -10215 -11657 -8079 -11911
989 -11911 -13688 -6585 -8008 -15031 -11767 -8970 -11452 -6898 -4871 -12100 -13154 -6601 -8504 -8478 -2647
1004 -2647 -5912 -10059 -4807 -4066 -8419 -3171 765 -4268 -2037 564 -4476 -3218 4180 1978 -678
1019 -678 4004 2360 -893 5182 6694 1851 5253 8667 4289 5781 10453 5445 5391 11738 10118 7031
1035 7031 11852 9948 5750 10788 12975 8497 10756 14428 8368 8118 13200 9729 8893 14684 11335
1050 11335 5856 10448 10962 6947 11697 12480 5026 6301 10613 6449 5751 9428 4713 2374 7985
1065 7985 6334 828 3821 3705 -811 2610 4828 -2274 -2220 1946 -2657 -3768 564 -3486 -6971 -2171
1081 -2171 -3374 -8813 -5526 -4228 -8826 -6680 -4793 -11601 -11635 -5989 -8785 -10747 -7005 -11176 -14676
1096 -14676 -8184 -6961 -12881 -11031 -10081 -14411 -10450 -5657 -11813 -13587 -8719 -10813 -11490 -5723 -8547
1111 -8547 -13703 -8273 -6134 -9788 -6659 -5057 -9923 -7789 -1799 -5443 -7083 -1721 -4049 -5113 617
1126 617 -873 -4838 42 2995 -1192 1646 3584 -1035 1494 8137 5029 2057 5891 4430 3557
1141 3557 10760 10569 3662 6099 9359 7095 11062 13507 6644 5307 12299 11783 10395 13182 9802
1156 9802 5496 11846 14666 9896 10668 10615 6132 8950 14771 9405 6364 9812 7346 6212 11139 9270
1172 9270 3126 6597 8021 3668 5332 6539 1327 2161 6745 1973 -1374 2002 213 -1633 3037
1187 3037 478 -7086 -3802 -10 -3280 -2540 -2657 -10170 -9786 -1850 -3154 -7499 -6733 -11048 -12890 -4438
1203 -4438 -2602 -10519 -11942 -11338 -12741 -7290 -2882 -10763 -15957 -10846 -9773 -8937 -4895 -8897 -16239
1218 -16239 -11207 -5846 -8493 -6970 -7281 -12837 -10440 -2999 -5589 -8476 -5110 -7154 -7683 -2046 -2270
1233 -2270 -7920 -3603 153 -2836 -1887 -131 -4549 -1681 5688 3237 -1484 886 609 1678 8868
1248 8868 8292 -229 265 5911 7021 10380 10641 1671 -475 9377 12750 10975 10160 3647 342 10518
1264 10518 16666 11245 7567 5518 2445 9195 17456 11576 4189 5783 5952 7889 13815 9932 1814
1279 1814 4578 8923 6983 6921 6939 1001 2398 9059 5665 494 3178 2136 519 5033 2528 -4632
1295 -4632 -1345 3634 652 -1006 -2136 -7773 -4827 4550 1823 -6573 -7818 -8776 -7197 2742 2262
1310 2262 -9191 -12807 -8402 -6387 -1690 -386 -9863 -14846 -7617 -3987 -4934 -4216 -9281 -14209 -6879
1325 -6879 -1040 -5418 -7916 -8136 -11352 -7434 -142 -3781 -8434 -5739 -6904 -7908 -1976 -1631 -5596
1340 -5596 -3026 -1363 -6416 -5471 -721 -2029 -446 2857 -2763 -6174 -417 2555 915 3716 1664
1355 1664 -4097 390 6256 3095 1907 3098 -172 1845 8628 6209 738 2561 3143 2837 8783
1370 8783 9576 2713 1731 4241 2805 6143 11477 6679 1642 3936 3021 2773 9426 10104 2960 2230
1386 2230 3430 1746 5960 9774 3209 -29 3496 3563 3373 6883 2416 -3061 2092 6401 3373 3273
1402 3273 1512 -3970 -1529 5924 3828 294 334 -2809 -4157 2084 2768 -1872 -118 660 -4439 -3048
1418 -3048 -579 -3526 -939 3045 -1830 -6588 -3670 -3106 -2504 1977 -492 -8093 -5442 -1108 -2369
1433 -2369 -1780 -2057 -7597 -6021 1726 1087 -4581 -5268 -7120 -6135 2587 4531 -5156 -8127 -6018 -5257
1449 -5257 643 4446 -2674 -7555 -3635 -2777 -2885 1429 -290 -5167 -1216 443 -3798 -3000 -107 -2542
1465 -2542 -855 2558 -1680 -4617 -208 -240 -1946 1162 468 -2898 1071 2752 -2301 -2370 972 379
1481 379 2018 5321 -181 -5030 -318 2444 2270 5753 2964 -3569 -2083 3014 2209 3299 4808 78
1497 78 -1266 3722 2707 387 4135 3059 173 3597 4503 118 1574 3595 798 2682 6522 3052
1513 3052 274 3043 1348 387 5632 6433 1563 1616 2019 -1279 2836 6914 3258 943 3150 726
1529 726 -410 4146 3096 435 3283 3754 -988 457 2379 -474 1404 4944 156 -1912 897
1544 897 -212 -1283 2517 1081 -2689 290 1841 -2910 -2746 -470 -2622 -685 2975 -1807 -6346
1559 -6346 -3157 -2361 -2749 1409 -294 -6343 -4551 -2027 -3679 -2047 -735 -4702 -5027 -1271 -3676 -6234
1575 -6234 -3110 -3223 -4599 -948 -1517 -7242 -5619 -2482 -4014 -2736 -386 -5233 -6035 -1954 -2860 -5019
1591 -5019 -1605 -1596 -4029 -892 -638 -5488 -3591 50 -1393 -723 1404 -2505 -4624 370 979 -680
1607 -680 2294 1895 -2140 589 2751 -478 983 4673 1727 1427 3708 1184 295 4707 5052 2219
1623 2219 4910 4614 1252 3545 5883 3113 3735 6817 3893 3070 5722 4122 2128 6708 6738 3247
1639 3247 4842 5178 1774 3693 6974 3633 3638 6093 2889 966 4295 3700 2171 5042 4071 -572
1655 -572 1149 2997 835 2083 3284 -688 -1054 2192 102 -1548 759 -706 -3119 661 376 -4153
1671 -4153 -3221 -1479 -3553 -1848 -36 -4292 -6160 -3214 -3929 -5011 -1932 -3609 -6849 -4581 -3500
1686 -3500 -6845 -5395 -3138 -5914 -5573 -3541 -6473 -7870 -3865 -4152 -6047 -3666 -4450 -7474 -4001 -2355
1702 -2355 -5762 -5180 -2838 -4605 -3714 -856 -3714 -6099 -1792 -857 -2133 -29 -1356 -5001 -1724 1943
1718 1943 -86 -91 1504 -1242 -735 3644 2251 -335 2540 2641 902 3769 4394 1244 2985 5879
1734 5879 3735 3674 5886 3362 3082 6795 5933 3095 5959 5992 4138 6511 6879 2982 4780 8097 5841
1751 5841 5054 5765 3732 3536 7717 6757 3097 3910 4155 2346 5437 6664 1712 1552 4122 2419 2944
1768 2944 4644 1087 -1189 2424 2432 103 1184 457 -2659 -602 1747 -1709 -2612 -797 -3433 -3603
1784 -3603 -525 -2651 -4960 -2586 -2824 -5565 -3532 -3182 -6208 -4919 -2671 -6172 -6498 -4033 -5598 -6575
1800 -6575 -3770 -5345 -8161 -5200 -4106 -6470 -4819 -4623 -7969 -6465 -3177 -4906 -5724 -4208 -5933
1815 -5933 -6388 -2228 -2798 -5517 -3946 -3566 -4700 -2110 256 -3975 -3912 -1488 -1798 -1413 1273 -684 -3345
1832 -3345 121 1199 -180 1593 2397 -1012 841 3999 2138 2484 4476 2270 1517 5249 4581 2798
1848 2798 5548 5238 3192 4950 6326 4087 4967 7204 4825 4399 6861 5627 4507 7081 5919 3562
1864 3562 5637 6725 4841 5998 6515 2868 3653 6849 5314 3920 5297 2697 1250 5126 5513 2267
1880 2267 2701 2790 11 2088 4535 827 -484 1284 -448 -445 2066 246 -3183 -1435 -795 -2974 -1219
1897 -1219 -738 -4467 -4045 -2108 -3755 -4037 -1926 -4449 -6260 -3780 -4017 -5833 -3868 -4053 -7175 -5910
1913 -5910 -4179 -6306 -5854 -4128 -6339 -7275 -4848 -5718 -6522 -4292 -4905 -7202 -5130 -3764 -5556 -4293
1929 -4293 -3190 -5825 -5649 -2539 -3231 -3786 -1733 -3158 -5024 -1938 -806 -2158 -1020 -720 -2803 -1187
1945 -1187 2043 574 -330 1236 -360 -515 3293 3643 1538 2681 2726 1134 3637 6250 3171 3096 4378
1962 4378 3380 3883 7072 5441 3006 5014 5080 4704 6829 6802 4143 4423 6620 4422 5415 7115 4844
1979 4844 3941 5829 5138 4062 5558 5565 2730 4274 4978 2806 3640 5143 2561 1489 3342 1599 1430
1996 1430 3419 2248 -748 337 963 -1001 822 1524 -2160 -2595 -663 -1541 -1428 -48 -2909 -5166
2012 -5166 -2541 -1876 -3501 -2896 -3674 -6577 -4478 -1715 -3858 -4917 -4573 -6035 -5952 -2914 -3678 -6612 -5330
2029 -5330 -5240 -6259 -3916 -3202 -6111 -5899 -3716 -5004 -5328 -3420 -4727 -5460 -2480 -3464 -4966 -3457 -2645
2046 -2645 -3517 -2029 -888 -3831 -3296 -272 -1035 -1279 197 -1734 -2490 1393 1912 -531 289 994 -4
2063 -4 2252 4326 1158 111 2719 2372 3453 5110 2904 827 3470 4695 3799 5031 4581 2205
2079 2205 3763 6279 4838 3815 5166 3935 3728 6166 5123 3000 4465 5195 3712 4406 5279 2427
2095 2427 3100 4762 3052 2755 4316 2934 1763 3627 2764 236 2081 2896 937 1924 1880 -497 -627
2112 -627 1520 736 -744 299 -1241 -2552 -164 -301 -2575 -1677 -1033 -3114 -2659 -1215 -3326 -4175 -2227
2129 -2227 -3343 -3979 -2168 -3445 -5295 -3431 -2813 -4463 -3459 -2880 -4942 -4765 -2646 -3888 -4420 -2469
2145 -2469 -3587 -4964 -3129 -3404 -4360 -2713 -2139 -4105 -2885 -1858 -3814 -3264 -1206 -2313 -2510 -713
2161 -713 -1497 -2607 -662 -651 -1866 57 757 -1123 -877 1094 59 -9 1781 1231 664 2213 1688 550
2179 550 2070 3006 1689 2766 3580 1139 2210 4202 2790 2918 4395 3082 2075 3769 4040 2448
2195 2448 3915 4293 2581 3214 4467 2565 2578 4042 3175 2948 4114 2687 1014 2843 3132 1480 2898
2212 2898 2818 317 1158 2572 1121 675 2214 759 -10 1464 685 -802 401 626 -682 -298 207
2229 207 -1997 -1544 -132 -1682 -1897 -718 -1657 -3007 -1222 -1792 -3154 -1712 -1428 -3354 -2230 -1900 -3747
2246 -3747 -2902 -1267 -2533 -2989 -1635 -2828 -3678 -2105 -1782 -3289 -1791 -1524 -3982 -2784 -1277 -2914
2262 -2914 -2631 -909 -2642 -3043 -664 -1169 -2936 -905 -389 -1395 -737 60 -1804 -1635 521 -557 -351
2279 -351 1083 -358 -1354 743 694 -312 1047 1435 -229 740 2224 517 740 2502 1044 769 2601
2296 2601 1652 536 2260 2018 1061 2610 2759 690 1671 3343 1423 1092 3129 2051 1388 2812 1297
2313 1297 598 2269 2955 1280 2092 1954 -171 1223 2970 1252 538 1656 600 -80 1725 1638 -431
2330 -431 812 1285 -220 878 1063 -1333 -366 1357 28 -963 174 -512 -1462 141 28 -1727 -626
2347 -626 11 -1522 -1345 -280 -2032 -1396 537 -853 -2209 -1404 -1437 -2236 82 -433 -2828 -1832 -875 -1789
2365 -1789 -1232 -351 -2153 -2707 -521 -1137 -1844 -635 -1253 -2318 -774 -121 -1667 -1408 -621 -1801 -1039
2382 -1039 480 -1036 -1426 130 -282 -1553 444 32 -1126 54 842 -940 -350 1025 -243 -60
2398 -60 1568 -253 -862 1287 1027 233 1290 1078 -509 922 2107 488 594 1606 170 830 2652
2415 2652 1429 191 1547 1499 611 2009 2156 -166 954 2009 919 1267 2178 416 231 2046 1251
2432 1251 272 1677 1357 -142 1254 2000 -163 591 1625 272 94 1164 -88 -676 831 596 -739
2449 -739 631 442 -1102 217 1055 -917 -762 29 -690 -898 143 -846 -1660 85 -283 -1584 -297
2466 -297 -443 -2324 -1444 -115 -1221 -1493 -392 -1659 -1876 -192 -1142 -2037 -653 -911 -1857 -855 -346
2483 -346 -1868 -1418 -297 -1580 -1119 -153 -1112 -1434 -124 -611 -1574 -100 82 -1296 -307 478 -1164 -207
2501 -207 576 -393 -642 859 -24 -827 965 420 -431 753 854 -605 1056 1487 -230 510 1395 274
2519 274 211 1601 1008 -292 1479 1677 196 1197 1754 366 1236 2257 373 553 2167 818 332
2536 332 2063 1108 449 1566 1516 333 1002 1604 48 495 1637 267 -122 1791 723 -560 1208
2553 1208 440 -575 671 677 -200 451 558 -637 -317 986 -227 -770 721 -219 -1190 287 -363 -1483
2571 -1483 -196 522 -1130 -537 -336 -1218 -1364 331 -716 -1409 91 -917 -1693 44 -209 -1874 -672
2588 -672 27 -1257 -1148 -94 -1601 -1741 182 -985 -1488 -94 -801 -1931 -294 113 -1554 -1063 -72
2605 -72 -929 -993 317 -1066 -1155 0 -219 -1040 129 -83 -1185 241 890 -818 -67 235 -1094 -266
2623 -266 1109 -235 -611 436 153 -218 774 630 -941 629 1303 -33 302 955 -199 459 1516
2640 1516 647 172 1195 693 122 1331 1238 -496 580 1555 400 648 1507 -17 340 1799 1069 52
2658 52 1282 809 -389 1285 1627 182 457 1124 366 455 1318 371 -90 1130 530 -197 695 799 -624
2677 -624 546 1429 -393 63 496 -370 -81 644 123 -693 311 -194 -792 498 227 -1273 -554 359
2695 359 -778 -470 508 -1280 -960 299 -418 -1280 -99 -787 -1337 -120 -174 -1913 -906 -31 -1196 -966
2713 -966 5 -1164 -1339 43 -583 -1409 -217 -301 -1806 -407 -210 -1416 -1100 4 -1329 -942 278
2730 278 -1260 -921 268 -249 -1173 -164 41 -1352 -111 463 -732 -508 204 -706 -599 827 -249
2747 -249 -902 908 221 -445 835 494 -115 255 1187 -34 175 1040 231 -51 1188 879 -257 1015
2765 1015 755 85 962 1108 7 792 1572 323 576 1382 369 130 1383 927 -64 1120 1403 18
2783 18 1281 1294 44 583 1585 538 109 1231 77 -99 1229 744 -557 656 935 -612 586
2800 586 769 -321 -190 865 -317 -429 815 -245 -877 229 -31 -1320 -143 348 -899 -400 216
2817 216 -566 -781 64 -750 -762 82 -497 -1173 -429 -445 -1374 -463 -427 -1583 -850 -216 -1335 -1386 -379 -877
2837 -877 -1533 -125 -580 -1268 -317 -287 -1395 -818 -531 -1192 -1019 161 -979 -865 -30 -383 -759 280 -28
2856 -28 -1250 -45 754 -269 -230 628 -688 -299 826 -210 -546 526 145 -142 806 777 -414 515
2874 515 920 347 590 1075 -111 274 1755 462 470 1252 890 231 1084 1565 252 933 1318 223 820
2893 820 1711 462 265 1376 738 497 1492 1059 22 1450 1366 168 787 1147 304 244 1565 117
2911 117 1 1102 107 -311 545 131 -615 396 776 -314 -292 668 -650 -426 545 -494 -937 -117 -555
2930 -555 -909 -287 -431 -1253 -581 -220 -1020 -795 -369 -992 -1574 20 -601 -1386 -511 -936 -1478 -541 -397 -1293
2950 -1293 -665 -216 -1362 -963 -162 -896 -1146 -365 -698 -1163 -572 -578 -1296 -278 -155 -1174 -838 59 -622
2969 -622 -347 149 -285 -544 334 -151 -874 309 386 -370 352 1224 -223 89 1049 215 108 832 391 -95
2989 -95 1231 599 180 1354 1041 244 923 1235 65 614 1438 645 501 1409 639 -38 1269 1115 546
3008 546 1153 1313 105 817 1524 564 324 1135 400 157 1513 465 -197 699 889 -142 567 602 -289
3027 -289 187 987 101 -7 753 -253 -615 143 -124 -1040 -22 115 -754 -450 151 -1071 -625 67 -685
3046 -685 -1021 -277 -625 -1455 -84 -375 -1197 -997 -421 -1403 -871 -301 -1410 -1030 -304 -901 -1006 -542 -696
3065 -696 -1544 -333 88 -988 -849 -295 -1115 -686 -7 -848 -746 106 -862 -777 247 -284 -989 143 120
3084 120 -664 -308 462 -650 -89 597 -2 -239 686 -22 -175 895 436 -110 609 762 -242 414 959
3103 959 37 232 1036 472 584 846 644 155 1280 1205 1 927 1087 528 704 1408 197 220 1297
3122 1297 716 547 1371 795 -10 1013 1078 267 617 1012 262 536 1059 533 -70 721 122 -263 525 351
3142 351 -333 107 371 -217 128 446 -75 -217 609 -424 -536 356 -160 -856 -204 -98 -1091 -150 -131 -954
3162 -954 -558 -453 -937 -879 107 -686 -1302 -480 -818 -1245 -519 -477 -1600 -1044 -132 -1024 -1114 125 -920 -1070
3182 -1070 -46 -991 -921 -132 -525 -1180 -162 -136 -714 -118 -73 -589 -544 365 39 -397 245 -98 -700 250
3202 250 265 -96 270 698 -353 130 441 58 141 855 394 13 872 706 112 835 707 135 902 1203
3222 1203 314 574 989 254 444 1339 612 40 906 802 132 704 1149 445 918 976 390 666 1022 384
3242 384 18 900 358 40 820 517 -188 307 730 -144 213 691 27 -174 418 -230 -374 282 -199 -889
3262 -889 -90 -8 -593 -265 42 -947 -582 125 -629 -637 -250 -379 -1120 -25 -353 -767 -64 -106 -876 -597 -20
3283 -20 -841 -800 -60 -1010 -795 -167 -400 -1081 -235 12 -887 -328 -233 -1014 -447 -110 -742 -459 -173 -189 -550
3304 -550 148 -378 -295 -18 50 -682 -1 118 -299 233 544 -25 -199 883 -161 -286 451 409 -440 591
3324 591 826 -142 388 732 -219 441 1050 230 141 1023 289 -30 653 410 96 993 484 -309 673 994
3344 994 37 447 955 172 460 426 587 238 874 352 -151 262 719 -154 125 830 -14 -314 721 187
3364 187 -381 637 8 -347 63 530 -662 365 508 -389 -418 115 11 -422 39 -217 -464 207 -145
3383 -145 -960 -479 61 -640 -196 318 -590 -641 161 -432 -901 138 -395 -578 -7 90 -711 -523 -423 -888
3403 -888 -449 -146 -636 -315 -42 -429 -402 -401 -309 -672 -191 218 -663 -50 87 -818 -333 423 -31 -370 402
3424 402 -114 -668 609 259 -592 273 404 -588 152 661 -114 100 704 -195 -62 611 334 -283 531 487
3444 487 -337 449 701 -35 358 649 152 141 581 202 -102 454 229 -137 472 598 1 138 368 -70
3464 -70 454 395 -79 236 446 325 219 761 322 -100 461 374 -8 284 420 -159 -150 159 36 -388 225 126
3486 126 -269 390 278 -430 134 222 -785 -68 254 -642 -206 488 -188 -595 31 -493 -647 -87 -552 -742
3506 -742 -291 201 -1018 -238 -117 -643 -525 -218 -649 -598 15 -164 -644 -69 -64 -1053 -157 51 -761 -531 -76
3527 -76 -479 -409 117 -189 -715 200 176 -318 -237 96 -203 37 174 -316 -284 394 -9 -84 333 52 -649 357
3549 357 238 -156 458 127 -88 307 418 170 104 581 402 -44 485 460 -29 444 685 42 109 542 304
3570 304 177 1041 90 -172 506 457 79 759 578 -78 841 498 251 242 662 212 -114 465 270 -44 396
3591 396 401 -14 512 296 20 62 515 -65 377 423 -76 -54 415 125 -332 559 -134 -508 633 286 -388
3612 -388 65 232 -613 -332 236 -455 -654 319 -336 -366 -200 -454 -591 -181 -79 -499 -215 -188 -655 -442 55
3633 55 -564 -582 -278 -661 -417 -195 -302 -787 -413 296 -739 77 -179 -801 -583 -315 -295 -400 145 -257 -660
3654 -660 113 47 -391 -290 339 -532 -33 137 -260 -705 32 -267 -633 36 299 -152 234 444 -329 229
3674 229 533 -320 124 581 0 -73 259 171 127 593 60 -64 171 855 17 90 634 18 443 826 38
3695 38 111 648 201 233 375 493 77 463 670 -15 326 688 100 152 507 -80 -204 471 703 -285 192
3716 192 120 -398 229 274 -36 280 197 240 -70 343 159 -45 397 279 -413 -205 -99 -322 -178 25 -265
3737 -265 186 38 -465 -256 -157 -193 -811 -180 -76 -816 -448 3 -553 -240 -341 -542 -508 -75 -571 -438 -154
3758 -154 -277 -593 -195 -66 -535 -54 230 -577 -208 113 -390 -434 147 -276 -395 190 -175 -707 -62 -40 -408
3779 -408 -61 540 -570 -326 290 -148 -322 288 -142 -124 299 -64 -372 -44 353 -204 240 548 29 -171
3799 -171 483 86 -40 641 94 -175 324 517 -81 364 760 26 321 595 319 201 504 226 -22 253
3819 253 476 185 524 766 9 21 690 149 199 444 99 -240 550 232 -278 573 456 -177 294 483 -77
3840 -77 159 748 -178 -218 440 -101 -177 364 4 -506 0 218 -620 -46 239 -332 -101 237 -154 -277 -168
3861 -168 -181 -409 61 -39 -633 -254 -209 -583 -50 -166 -411 -32 206 -243 -663 -111 -428 -468 -223 -163 -371
3882 -371 -287 86 -536 -357 -149 -533 -452 208 -472 -587 27 -251 -413 141 38 -538 -138 -350 -302 -112 59
3903 59 -465 -243 8 102 -353 335 -35 -271 15 376 -142 362 300 -112 338 697 225 -119 632 388 -219
3924 -219 144 638 146 611 672 -19 456 423 -79 148 803 317 94 356 542 62 673 507 90 314 740
3945 740 -195 436 750 -96 167 435 343 -45 343 100 31 536 64 -518 323 469 -285 85 417 -254 97
3966 97 224 93 -131 78 129 -634 16 -15 -364 -85 393 -484 -196 199 -287 -766 244 -46 -674 66 -218
3987 -218 -286 -332 107 -430 -241 46 -534 -615 134 -439 -411 73 -119 -839 64 -24 -686 -403 122 -526 -646 -73
4009 -73 -715 -216 142 -47 -493 330 14 -126 321 -6 -283 -58 59 -122 -143 582 75 -312 484 224 -150
4030 -150 465 345 169 433 709 -175 137 410 40 246 707 388 236 505 195 -418 554 469 -57 341
4050 341 589 -92 362 481 -36 204 465 200 155 366 329 -118 845 303 -97 593 566 165 166 364 -4 -273
4072 -273 257 208 -451 253 288 -359 269 428 -389 -202 411 -305 -142 -10 -388 39 254 -170 -414 275 -10
4093 -10 -229 -113 -99 -436 -329 120 -68 -153 249 59 -368 178 -3 -320 -71 -98 -533 -181 -184 -492 -200 289
4115 289 -506 -422 105 -117 -397 161 -15 -447 142 75 -412 -126 -95 -230 -169 42 43 -182 -17 176 61 559
4137 559 -12 -480 -21 163 -271 -159 185 -183 -176 124 -397 -207 321 220 -49 286 145 -67 236 325 172
4158 172 -56 285 73 -88 636 111 -326 71 12 -69 103 104 -180 -40 448 -1 -157 171 26 -189 177
4179 177 96 -414 348 194 -319 -104 211 -237 -289 447 -298 -130 372 203 -74 151 132 -527 -388 -152 -310
4200 -310 -106 367 -6 -125 76 -276 -285 361 210 -29 333 450 -263 -25 292 -260 18 113 -461 -168 308
4221 308 -151 -299 157 -189 -433 -205 176 -323 -27 271 -51 -65 228 -72 -309 402 -33 -54 631 -69 -415
4242 -415 103 302 -481 -274 179 150 223 -118 26 372 305 -113 -238 415 147 -225 126 223 -96 56 -18 -48
4264 -48 24 386 -160 -92 592 246 -91 223 -9 -667 295 245 -317 96 382 -128 142 396 231 -229 404
4285 404 91 -56 -161 -9 -177 -70 444 -391 19 312 4 -191 99 107 -101 96 -113 14 266 -64 -381
4306 -381 -181 168 -468 -30 210 -143 -484 311 -150 -265 229 54 -512 123 -224 -186 -431 293 -269 -180 -49
4327 -49 62 -316 232 177 -100 215 227 -340 -137 346 -404 3 419 -261 -251 142 -250 -167 297 46 -524 392
4349 392 133 -506 360 392 -397 -74 276 81 -139 295 -272 -90 358 275 -223 32 131 -342 276 438 -423
4370 -423 -129 207 -12 144 464 102 -34 386 -22 93 38 478 -93 174 -170 88 77 322 -211 -159 110
4391 110 81 -223 407 322 -349 116 418 -55 0 456 -387 -119 126 -2 -447 35 27 -330 348 467 -337 -280
4413 -280 420 -174 -302 317 -118 107 244 11 -706 348 -19 -435 -144 -265 -98 72 128 -296 -221 166
4433 166 -476 -313 -111 29 -436 -208 83 -265 178 339 -378 -160 -173 -291 -266 393 25 -489 15 -161 -465
4454 -465 281 32 -53 -145 314 -171 -157 191 -197 -41 371 -94 -304 311 159 -120 288 -71 -186 246 183
4475 183 -217 -197 440 52 -205 181 241 -186 254 393 -313 209 433 -373 -217 490 155 -205 545 -166 61
4496 61 189 318 55 492 185 -88 401 477 -270 -166 380 -276 -167 314 -59 -1 506 -37 -40 58 467 -420
4518 -420 -181 105 -456 -146 403 -140 -156 294 -79 -337 155 82 -416 -23 151 -186 -107 66 -293 -21 43
4539 43 26 -350 -171 7 -538 -319 14 -474 -231 173 -341 -39 51 -238 105 -89 -98 -292 -239 -113 -123 -51 75
4562 75 -268 -191 -45 -124 -595 -35 -323 -139 429 -173 -233 222 -197 -202 -36 119 -150 -119 175 -34 -158 249
4584 249 267 -435 119 -13 -447 231 -107 -260 -48 253 111 155 319 -350 -396 285 103 -205 93 69 159 471
4606 471 621 -265 188 421 163 35 306 434 62 231 -1 197 343 242 -334 309 472 140 -289 452
4626 452 99 -198 399 270 141 125 155 -187 440 23 -171 119 187 -86 -66 243 130 -550 381 -466 -283
4647 -283 291 379 -258 -73 -270 -613 -455 93 -420 -177 168 -153 -325 -6 0 -273 312 -181 -555 137 284
4668 284 -456 -415 -97 -344 -451 -94 -291 -127 -276 -241 -218 -40 -52 -520 -29 116 -169 -86 316 -462 -416 140
4690 140 -224 73 51 63 -240 -2 67 -187 -8 438 -254 -176 433 -344 -140 324 57 -190 192 83 -61
4711 -61 79 -1 -42 -73 172 3 -47 162 124 -136 335 351 -116 239 308 -22 221 345 -30 -18 114 44 331
4734 331 415 256 13 187 462 195 202 375 -33 356 302 112 229 204 31 15 613 126 103 226 153 -175 -43
4757 -43 338 2 188 439 -155 -345 75 -115 -240 20 -23 -401 -234 14 -428 -394 99 -380 -295 205 -310
4778 -310 -446 20 -296 -393 -180 -54 -272 -134 160 -509 -26 -102 -513 -423 -398 -263 -469 233 114 -562 164
4799 164 -123 -40 -54 -269 -441 28 -160 -116 -198 109 210 -167 87 -53 -346 284 -43 1 -95 -6 32 -59 159
4822 159 95 14 526 409 111 344 114 -132 336 374 49 224 116 57 216 414 -239 85 489 142 234 477
4844 477 18 -91 194 331 409 326 143 98 -98 350 320 1 392 -173 182 567 238 108 270 274 -189 25
4866 25 367 49 -73 241 -213 -233 139 199 -321 131 127 171 -16 55 -16 -113 217 -263 -210 -37 -248 -419 159
4889 159 -113 -203 -119 -336 -234 -115 30 -351 -342 80 -178 -241 -92 -54 -287 261 -110 -640 -67 320 -482 -187
4911 -187 368 -399 -216 -79 -93 18 20 -202 -244 116 -166 -275 -246 22 -179 -150 -132 -192 -202 227 -165 -120 225
4934 225 55 -103 316 64 -303 -119 93 64 -8 109 128 37 54 170 90 244 540 -13 -52 323 238 -9 415
4957 415 191 232 397 541 238 378 33 14 92 205 98 256 662 27 128 365 -58 -58 283 66 67 459
4979 459 270 89 402 -72 57 145 154 163 -206 464 -253 -155 146 149 -158 147 68 -385 -327 109 -36 -215 98
5002 98 -191 -29 144 127 -240 -177 41 -467 56 -214 -475 -125 -265 -186 -54 186 -116 -344 198 -487 -246
5023 -246 -44 -81 -356 115 -127 -516 -118 147 -314 157 -190 -158 -280 -122 -196 -126 205 -17 -116 -142 148 -378
5045 -378 114 131 -480 -50 392 -199 -487 71 -162 -361 166 191 -296 354 359 -72 366 58 72 1 236 27
5067 27 151 354 -253 74 -101 168 -105 235 393 58 179 5 84 -66 475 122 -130 179 277 -157 114
5088 114 480 -155 -135 133 112 -73 41 133 -49 400 2 -62 97 230 -319 261 78 105 -197 38 -49 -97
5110 -97 103 129 -136 77 -149 30 -34 129 -131 -361 62 -133 -219 171 -330 -151 -43 -74 -280 -157 87 -383
5132 -383 -143 55 -322 -111 313 -228 -241 -66 -247 -260 224 -163 -267 81 -33 -184 -48 29 -116 147 169
5153 169 -125 -387 126 49 -69 -453 -126 -436 -16 238 117 -238 126 -148 -172 103 -395 -377 36 -104 -71
5174 -71 248 -64 -205 105 350 -49 -11 444 -378 107 -42 -91 14 181 41 -211 318 328 -141 343 63
5195 63 111 98 380 -173 -25 301 23 106 151 89 -194 191 356 -329 66 205 -202 -31 132 91 -125 483
5217 483 -65 -261 312 291 -98 -16 328 -217 69 -127 -7 61 -36 -2 -77 328 -11 -456 149 10 -339 45
5239 45 248 -62 163 61 100 -229 96 -531 -155 126 20 -304 -178 18 -306 107 -32 0 97 -63 1 -156
5261 -156 89 319 -275 -82 309 -302 309 264 -198 56 18 229 -114 510 -299 -388 133 -44 -212 367 -204
5282 -204 -187 -329 -19 -325 -260 326 -54 -213 305 -106 -63 64 12 -530 -97 -3 59 -54 -168 -130 199 427
5304 427 -58 -87 191 -29 -182 188 -145 -686 270 461 -270 145 103 -77 111 296 -20 -88 390 -429 -44
5325 -44 152 266 79 383 13 -166 112 125 -160 -166 269 -68 -73 232 -57 -214 111 -61 -146 56 57 -146 -56
5348 -56 518 -202 51 192 172 117 153 147 -224 145 -130 -227 208 147 -110 -414 414 -47 118 34 166 -317 -294
5371 -294 39 -127 419 -25 -336 116 150 -118 -106 73 93 -56 158 -5 -663 -22 -183 -322 144 304 -405
5392 -405 231 20 -275 -292 331 -131 -322 340 -185 -152 -140 33 -371 -274 68 -637 -85 158 -62 83 -195
5413 -195 117 -104 147 243 -89 108 -142 -34 51 28 -271 8 244 20 -38 254 163 -54 330 -60 -343 -5
5435 -5 406 -30 -244 498 -2 25 174 0 -192 495 -26 -232 363 351 -112 192 176 -207 183 176 -51 -14 33
5458 33 -142 36 102 8 59 123 -172 50 314 -122 -348 69 130 -245 -89 236 133 228 155 214 -281 233 462
5481 462 -322 -214 -81 -432 140 238 -239 -304 -186 -31 -279 136 -310 29 -100 184 -175 21 90 -64 -212
5502 -212 -350 147 -344 -128 -238 49 -244 188 -322 -429 -368 -155 -147 137 -171 -258 41 -169 -270 -157 -74 -248
5524 -248 86 -80 -175 73 153 -232 -310 39 39 -309 331 -269 0 61 462 36 1 214 34 -2 149 -197 30
5547 30 239 -71 71 257 -115 -191 275 -24 16 93 170 -154 337 128 188 -409 80 -24 -129 49 152 -108
5569 -108 29 238 -333 -30 200 -93 134 220 74 -42 275 266 75 175 220 -74 155 -23 -315 54 408
5590 408 157 -114 33 -38 -269 188 -118 -148 472 -371 -447 18 96 -264 -16 140 -294 29 4 -328 -350 -159
5612 -159 -361 -121 71 -229 -164 216 135 -550 -100 180 -206 48 55 -208 -359 -65 100 -109 26 426 -184
5633 -184 7 89 -256 -238 61 -180 -83 73 -157 -12 228 189 -165 -255 152 55 130 -92 -206 -298 323 -19 -66
5656 -66 372 -189 61 -31 143 222 191 167 -171 -140 64 -59 2 133 219 22 183 -152 -6 139 26 -60 320
5679 320 220 115 -72 -6 7 71 240 -14 -293 29 132 -335 213 300 -127 286 -70 139 -404 174 250 -159
5701 -159 120 39 -329 22 -72 -124 63 197 -240 -318 -6 169 -73 132 -33 -82 -25 200 -53 -97 -172 -693 -119
5724 -119 9 -27 -11 198 -70 7 203 -62 -251 113 159 -100 46 -75 -39 148 450 -52 -434 354 -79 -143
5746 -143 462 0 -360 371 -117 -67 -130 53 -306 -241 254 -231 193 -198 -306 -219 431 21 -157 237 90
5767 90 -373 199 168 -144 -1 -130 -20 211 318 21 -293 175 332 174 -118 478 -251 229 162 -265 46
5788 46 -127 138 41 76 144 -28 179 154 -140 -136 311 109 78 246 -211 -139 282 -52 -284 -84 179 -464 34
5811 34 77 -145 225 171 -84 -164 314 -132 -262 256 270 -187 332 -55 -196 203 342 -156 -42 16 -315 -67
5833 -67 165 -263 -592 297 30 -165 260 289 -216 225 197 -176 -22 -89 239 -199 351 -183 -107 -83 -193 -249
5855 -249 -5 205 86 106 -242 -195 -109 389 50 -200 -34 -58 -48 298 238 -340 98 222 -290 -56 199 -51
5877 -51 -1 211 29 -75 147 -115 -273 75 252 -128 -88 37 -364 11 23 14 -237 223 153 44 337 -36
5899 -36 -98 -316 -178 -233 53 154 -39 136 295 -223 -183 -51 28 3 231 -105 -598 42 -177 -66 -198 322
5921 322 -128 -32 556 -92 -39 -225 316 -289 -81 28 -152 -32 44 -275 -188 87 -384 -32 137 -134 -84 -8
5943 -8 -125 -522 -59 42 -457 -24 87 -166 -32 54 -175 -88 15 46 -245 176 -181 -47 -2 -22 -272 -10
5965 -10 304 -51 -49 191 -76 -322 47 -55 -142 114 34 5 173 293 -53 33 139 19 186 230 232 -84 240
5988 240 129 24 -258 326 -273 166 190 -432 -384 231 -43 165 247 -22 -33 -53 294 -114 151 92 -109 200
6010 200 175 258 -186 196 -144 -76 345 -340 -234 183 166 -191 -67 11 13 -5 246 -92 -161 130 154 -336 64
6033 64 -176 -420 222 46 232 -165 262 -230 -182 -23 -252 -189 70 -48 -250 304 194 -451 -11 109 -64
6054 -64 26 38 23 -93 121 197 -30 11 -233 63 -103 219 181 -129 142 35 -258 243 -85 6 633 -297 38
6077 38 76 13 11 287 -59 -107 55 132 65 196 328 -11 76 231 79 -100 224 -119 244 433 457 -275 -99
6100 -99 279 -6 99 223 -162 120 -8 -13 20 -175 137 -268 -3 82 -26 -20 200 -52 -117 138 -22 -430 222
6123 222 -228 -140 160 -375 -299 35 144 -241 484 258 -164 -156 342 -85 -353 128 202 -151 -189 210 78 185
6145 185 30 20 148 99 -363 -258 272 -123 -223 238 213 0 -192 265 -404 -48 246 -299 -81 -155 -9
6166 -9 39 -134 -18 -133 -67 223 -11 -247 -155 -259 -141 146 225 -123 263 -45 -208 373 -181 -57 -111 -198 -99
6189 -99 427 35 -24 -213 136 211 418 41 15 -136 59 121 -309 204 323 -209 94 75 59 -77 421 -245
6211 -245 -33 496 3 300 156 -114 -235 6 -80 -42 -152 518 -56 -194 261 302 138 130 -237 -492 131 119
6233 119 -110 -127 -135 248 -38 202 -78 110 309 -154 5 52 -85 -342 -26 40 -14 290 130 -114 186 38
6255 38 199 -96 9 -348 -192 -77 -112 -88 283 -198 -105 -153 21 -74 95 -60 -57 -245 226 -34 -314 -155 14
6278 14 -273 18 197 -14 -326 238 -150 -97 -79 -24 -97 37 74 -320 -111 202 76 -441 50 -473 77 327
6300 327 -94 252 222 153 14 -278 29 -177 239 110 -45 -192 -26 -92 39 -17 -119 -84 220 159 -291 -126
6322 -126 170 25 -277 35 -158 72 528 37 134 252 81 50 23 356 -20 257 102 -4 -250 266 87
6343 87 177 8 190 52 -177 -292 188 -19 155 -148 299 188 255 52 417 -172 -45 -182 -261 273 -20
6364 -20 319 -132 79 289 92 260 -87 -253 40 176 -299 -250 82 -55 -78 -20 -48 -65 300 90 -189 127
6386 127 279 -4 8 211 -258 -164 313 75 -106 132 -53 -72 104 -277 -179 -142 91 114 -289 320 -39 -105
6408 -105 372 -179 -176 -115 321 -218 -114 347 -186 44 -136 -139 -312 125 6 -439 167 35 -264 237 22 -188
6430 -188 -50 -253 120 -168 -18 25 -52 187 -77 -211 43 163 -121 -11 61 -109 275 60 -187 18 104
6451 104 81 36 315 146 -107 -82 241 -323 -123 -63 -90 291 -70 -143 -135 -6 -28 -45 379 166 -234 174 41
6474 41 -235 -199 247 -294 294 392 227 -351 -55 -86 180 40 191 -230 -86 102 -131 218 231 137 159 -291
6496 -291 106 -419 80 97 -65 33 -91 -371 -181 -253 -310 205 38 -4 129 361 69 -59 74 68 11 -144 56
6519 56 214 -147 -147 93 160 270 -221 -155 117 21 -17 -129 132 -229 310 129 -132 6 289 -284 62 -16 -215
6542 -215 -135 41 -122 -114 35 166 230 241 86 -148 279 -18 47 182 129 95 39 126 -194 7 188 -532 64
6565 64 80 182 -23 230 267 -220 -153 81 169 23 67 -57 -114 -95 205 -127 7 125 -19 -188 171 -225 260
6588 260 390 154 -86 311 -20 -239 -54 72 257 12 195 69 -185 460 117 -12 32 127 -153 115 -30
6609 -30 -147 -184 131 42 -175 41 292 -121 61 680 -135 79 -50 -295 -37 43 -89 116 26 -397 -327 109
6631 109 -134 -248 72 -140 -334 47 159 -169 -223 -1 -520 16 254 -361 150 -219 -289 107 119 -238 -73
6652 -73 -309 -158 74 226 90 1 -300 -152 -238 266 107 67 11 331 36 -238 74 -90 -243 118 115 -189
6674 -189 -74 151 230 -66 454 -280 -6 34 189 -15 -47 294 -182 -272 145 -193 -93 339 214 -16 248
6695 248 174 -62 237 57 -191 253 457 -134 166 159 -10 54 187 -201 -149 358 -86 -60 -191 202 27 -57
6717 -57 143 17 60 116 -85 184 62 188 -207 79 -182 -130 145 -58 -141 -100 100 -192 92 324 -55 -199
6739 -199 196 -321 -22 177 119 -352 58 -34 2 81 -27 -42 -99 116 -202 -74 49 -79 -405 64 -146 -15
6761 -15 -178 -55 -175 -20 36 -92 100 56 -123 -284 134 -97 -143 50 109 -10 -124 2 -187 -51 65 -110
6783 -110 -415 -50 -157 -156 -155 -306 148 153 106 -281 144 10 -147 -48 283 -35 -148 266 -247 -178 43 240 -107
6806 -107 83 -20 -29 65 -72 0 113 248 -33 -176 -82 204 -14 185 164 -197 -104 321 78 -361 55 54 -285
6829 -285 120 173 -121 -207 61 -350 -139 -208 -266 10 58 284 -70 39 6 -122 94 45 -123 -69 -169 -104 -9
6852 -9 229 9 -224 -120 -342 42 -63 -56 -173 278 -105 112 183 89 -285 -258 41 -312 -109 36 -392 96
6874 96 -95 -44 -159 10 -272 67 -138 -253 -121 -162 130 -483 76 -49 57 48 207 -252 -50 -230 -143 -26
6896 -26 -100 204 -75 -59 -20 -43 -191 72 -103 155 571 -113 -179 52 -50 -113 -181 228 -128 -263 9 -169 -54
6919 -54 -72 -53 7 57 197 221 363 25 -248 -350 175 118 -125 228 -66 43 78 -67 -188 -235 469 44 234
6942 234 188 -47 281 259 -65 173 209 -64 -135 61 116 -187 35 249 -128 -70 -134 -42 -97 212 -260 -141 369
6965 369 133 -48 127 -1 -325 179 -25 159 119 -1 -144 39 -178 -315 -76 253 -39 -441 2 296
6985 296 -223 -122 108 6 -95 -78 -140 -50 -246 -123 235 -185 193 -224 33 -54 -275 40 18 -203 64 215
7007 215 -229 -123 -83 76 -32 315 63 -164 -13 178 -257 -178 239 -77 -247 124 -39 -318 33 70 -236
7028 -236 62 -214 -415 -216 -155 -357 -150 255 -108 -16 279 -78 -255 287 27 235 69 114 269 -291 106
7049 106 4 -107 345 162 -45 201 -77 -341 345 -60 145 386 149 295 256 385 137 -227 52 -119
7069 -119 -82 -29 -328 -13 51 104 -63 147 236 -114 42 -107 -288 -34 70 -79 -93 147 -169 -447 -218 491
7091 491 -199 -28 192 -209 -128 -18 -95 19 339 162 87 52 -45 5 338 -39 -88 19 40 14 22 429 39 116
7115 116 279 24 -302 -136 -27 -351 -200 17 -38 64 -30 38 -203 37 -351 33 128 -121 -78 -290 50 -182
7137 -182 34 34 139 46 241 -311 -310 351 -151 -179 178 -103 -223 -154 13 133 11 111 380 11 61 -329 -49
7160 -49 -78 53 61 213 -110 -58 -114 208 -230 -284 463 35 42 -134 332 -200 159 -377 186 265 -79 -208 -10
7183 -10 344 264 50 112 19 13 103 -108 -105 297 209 -289 298 99 -132 -177 115 -165 -22 -87 -273 -253 -36 -84 -67
7208 -67 241 -358 -283 153 -18 -232 -133 81 -195 -1 -144 18 -313 10 -302 -106 -244 196 -58 100 85
7229 85 -519 90 -269 -307 -60 76 -239 -57 -167 -37 133 25 -94 -115 422 -53 13 -219 13 334 -231
7250 -231 97 -41 184 190 108 -318 152 154 -288 -31 325 -305 -311 57 -154 -262 181 119 -232 306 320 6 60
7273 60 -120 40 93 256 -21 -254 -86 -282 210 262 409 -306 94 -78 -648 19 63 -291 202 168 -82 -116
7295 -116 112 -292 -380 39 6 -26 308 -73 -444 -154 119 -309 -362 342 33 -424 104 132 -135 172 271 -119
7317 -119 -190 114 -84 130 219 -63 -37 211 67 -380 110 -74 -77 216 242 -104 397 214 -494 99 121 -153
7339 -153 91 162 -178 -235 229 349 -126 79 200 -89 86 -31 6 -125 -27 -212 -188 -289 -276 -172 69 -295
7361 -295 -302 111 18 12 -121 33 27 196 270 8 -32 90 -107 -212 94 -213 143 184 59 47 -144 -19 -142 -126
7385 -126 78 219 -282 305 -282 -154 -293 -57 -48 141 136 -62 205 223 -267 -405 208 106 95 -164 431 -15
7407 -15 128 -140 22 74 459 -220 -26 149 -227 15 257 -62 -307 59 -61 -78 283 206 -108 217 441
7428 441 -191 -209 221 -292 -124 -190 -224 -132 137 314 -167 -54 9 -206 -8 -167 -276 -78 179 -119 -37 171
7450 171 -176 116 250 204 -64 352 463 -192 -286 -24 -291 -107 352 -128 12 -125 -123 -52 153 86 -176 -21
7472 -21 106 -89 -1 177 -13 -366 215 -287 -337 170 -101 -76 -110 -134 -133 -125 188 -89 -156 289 71 -118 259 2
7496 2 62 -94 215 -366 258 126 -53 56 -75 -111 -51 98 -109 -193 241 194 -83 267 88 10 -139 229 -41
7519 -41 -164 -188 46 165 -31 -117 -188 149 -119 -143 176 270 138 -119 16 -99 -106 87 -283 -51 48 217 -352
7542 -352 125 286 -161 28 223 26 87 119 47 -234 -101 35 -299 191 140 -158 -388 288 -306 -441 -174
7563 -174 102 -125 36 -7 -228 -37 145 -24 -144 -96 -242 42 -206 56 265 219 -20 -42 85 235 121
7584 121 127 7 -115 244 269 -248 175 64 -170 -137 -94 -115 -161 141 132 -307 12 -57 -122 157 317 5 -258 114
7608 114 -178 -228 68 -242 386 35 85 -89 108 94 -174 61 16 -168 138 250 -176 -345 46 49 -4 155
7630 155 106 -213 93 -39 -93 87 -98 -410 -244 224 -97 -140 130 276 -383 50 -11 -33 -113 -29 -9 -85 150
7653 150 -187 151 62 -50 103 180 -112 -167 43 331 -327 165 8 48 169 -3 -298 -342 151 111 112 -3 49
7676 49 -108 51 -15 -360 4 -86 -114 226 105 250 -543 210 -27 -398 67 -27 63 168 5 -197 157 266
7698 266 -411 -227 209 -78 -256 275 -313 -162 138 21 -163 -145 -219 -219 141 -22 -89 194 245 -109 -165 -36
7720 -36 15 39 271 333 -140 69 31 -232 -12 295 -127 22 24 222 158 41 81 -215 188 -83 -86 -80 153 -271
7744 -271 -69 -30 -314 8 1 -164 -192 290 122 -40 -151 -27 -101 49 -210 100 58 57 49 -199 144 277 -243
7767 -243 36 144 -220 7 141 -390 144 222 86 -85 69 0 -36 120 -113 -459 184 -23 113 147 234 143
7789 143 -78 -150 -85 -202 83 -19 -210 10 344 -347 -93 298 50 214 -46 135 -52 -123 108 -152 101
7810 101 -121 59 261 91 -222 38 172 126 -2 68 -341 63 665 -23 -518 -166 -30 -151 -134 236 -216
7831 -216 241 -96 -91 -47 -8 -99 -45 106 -209 -198 187 308 -32 -177 48 -246 62 384 167 326 41 -175
7853 -175 108 142 -248 -32 31 188 -225 -117 329 -350 276 97 86 -82 -137 -314 -519 37 250 -45 115
7874 115 82 127 192 365 -232 225 38 -270 -223 -304 -36 23 401 -49 -262 -220 -7 -200 -103 -106 -268 36 334
7897 334 -116 -283 248 -106 -232 5 125 -263 176 526 -137 -187 23 -233 -87 -161 -292 -345 83 -19 -421
7918 -421 159 -119 -43 191 162 -78 -172 122 -56 106 -21 -210 96 116 -196 116 -115 200 -259 -170 -34 -152
7940 -152 84 178 124 -161 235 26 2 421 -51 77 150 149 71 -261 115 -187 -122 270 -102 -46 175 26 -91
7963 -91 -85 51 -282 -181 -33 36 -1 167 -171 -314 -341 68 18 47 188 -131 -121 216 -161 -92 374 -152 230
7986 230 173 -91 -286 -66 -175 -45 63 158 -108 20 162 20 207 403 207 138 -54 -310 -39 -418 -242
8007 -242 -432 -13 -86 -4 -55 280 -267 38 -81 -294 -279 66 -33 -251 -79 26 65 -165 156 99 95 92 -238 -85
8031 -85 -74 -255 36 354 -114 -83 -65 91 -276 -78 220 -312 46 183 293 114 350 81 -357 194 192 -236
8053 -236 147 75 -289 129 -35 -207 264 3 -140 -35 -82 49 131 170 172 375 -18 -75 -47 -8 26 3 -168 186
8077 186 255 -121 84 138 -27 116 -97 -199 -75 94 -381 -99 127 -194 -270 541 -101 -101 102 176 -104 -154
8099 -154 84 -210 103 -73 -47 23 47 -108 -203 -78 100 -105 97 -184 51 170 -38 -117 -281 24 -56 14
8121 14 60 -173 58 -46 19 -127 164 255 -111 274 -16 23 -297 14 206 -145 22 -282 -115 -440 55 -50
8143 -50 115 86 -168 42 313 -241 102 133 78 34 25 207 4 215 195 -107 -47 112 -166 -313 224 -105 -373
8166 -373 181 -162 -186 183 147 -145 66 -11 -176 -160 -122 409 136 17 -98 -273 307 301 136 299 -88 -263
8188 -263 161 -41 -186
8191a86
##END NTUPLES=NMR FID
##END=
