##TITLE=1H_Pr 3374-20
 CDCl3, 8 sc, 
 4.9.2020
##JCAMPDX= 6.0         $$ Bruker NMR JCAMP-DX V2.0
##DATA TYPE= NMR FID
##DATA CLASS= NTUPLES
##ORIGIN= UXNMR, Bruker Analytische Messtechnik GmbH
##OWNER= root
$$ XWIN-NMR		Version 3.5
$$ Fri Sep  4 09:25:43 2020 Russian Standard Time (UT+4h)  she@DPX200
##.OBSERVE FREQUENCY= 200.1315066352
##.OBSERVE NUCLEUS= ^1H
##.DELAY= (6, 6)
##.ACQUISITION MODE= SIMULTANEOUS
##.ACQUISITION SCHEME= undefined
##.AVERAGES= 8
##.DIGITISER RES= 18
##SPECTROMETER/DATA SYSTEM= spect
##.PULSE SEQUENCE= zg30
##.SOLVENT NAME= CDCl3
##.SHIFT REFERENCE= (INTERNAL, CDCl3, 0, 15.7039)
##AUDIT TRAIL= $$ (NUMBER, WHEN, WHO, WHERE, WHAT)
$$ ##TITLE= Audit trail, XWIN-NMR		Version 3.5
$$ ##JCAMPDX= 5.01
$$ ##ORIGIN= Bruker BioSpin GmbH
$$ ##OWNER= she
$$ F:/spectra/data/she/nmr/H-F/1/audita.txt
$$ ##AUDIT TRAIL=  $$ (NUMBER, WHEN, WHO, WHERE, WHAT)
(   1,<2020-09-04 09:24:34.04 +0400>,<she>,<DPX200>,
      <created by zg, POWCHK disabled, PULCHK disabled
       configuration hash MD5:
       00 E9 B6 7A A2 85 ED C7 34 08 36 98 17 FE 4E 26
       data hash MD5: 16K
       5A A0 53 45 25 A4 05 FC 16 47 1B 7B 76 DA D7 FA>)
$$ ##END=
$$ 
$$ hash MD5
$$ 61 5F A6 03 A4 B1 A4 92 42 79 05 A0 D9 ED DC D1
##$RELAX= 
##$RELAX= 
##$RELAX= 
##$RELAX= 
##$RELAX= 
##$RELAX= 
$$ Bruker specific parameters
$$ --------------------------
##$DU= <F:/spectra>
##$EXPNO= 1
##$NAME= <H-F>
##$PROCNO= 1
##$TYPE= <nmr>
##$USER= <she>
##$AMP= (0..31)
100 100 100 100 100 100 100 100 100 100 100 100 100 100 100 100 100 100 
100 100 100 100 100 100 100 100 100 100 100 100 100 100 
##$AQSEQ= 0
##$AQ_mod= 1
##$AUNM= <au_zg>
##$AUTOPOS= <>
##$BF1= 200.13
##$BF2= 200.13
##$BF3= 200.13
##$BF4= 200.13
##$BF5= 200.13
##$BF6= 200.13
##$BF7= 200.13
##$BF8= 200.13
##$BYTORDA= 1
##$CFDGTYP= 0
##$CFRGTYP= 5
##$CHEMSTR= <none>
##$CNST= (0..31)
1 1 145 1 1 1 1 1 1 1 1 1 1 1 1 1 1 1 1 1 1 1 1 1 1 1 1 1 1 1 1 1 
##$CPDPRG= <>
##$CPDPRG1= <>
##$CPDPRG2= <>
##$CPDPRG3= <>
##$CPDPRG4= <mlev>
##$CPDPRG5= <mlev>
##$CPDPRG6= <mlev>
##$CPDPRG7= <mlev>
##$CPDPRG8= <mlev>
##$CPDPRGB= <>
##$CPDPRGT= <>
##$D= (0..31)
0 1.2 0 0 0 0 0 0 0 0.06 0 0.03 0 0 0 0 0.0002 0 0 0 0 0 0 0 0 0 0 0 0 
0 0 0 
##$DATE= 1599197073
##$DBL= (0..7)
120 120 120 120 120 120 120 120 
##$DBP= (0..7)
150 150 150 150 150 150 150 150 
##$DBP07= 0
##$DBPNAM0= <>
##$DBPNAM1= <>
##$DBPNAM2= <>
##$DBPNAM3= <>
##$DBPNAM4= <>
##$DBPNAM5= <>
##$DBPNAM6= <>
##$DBPNAM7= <>
##$DBPOAL= (0..7)
0.5 0.5 0.5 0.5 0.5 0.5 0.5 0.5 
##$DBPOFFS= (0..7)
0 0 0 0 0 0 0 0 
##$DE= 6
##$DECBNUC= <off>
##$DECIM= 32
##$DECNUC= <off>
##$DECSTAT= 4
##$DIGMOD= 1
##$DIGTYP= 9
##$DL= (0..7)
0 120 120 120 120 120 120 120 
##$DP= (0..7)
150 150 150 150 150 150 150 150 
##$DP07= 0
##$DPNAME0= <>
##$DPNAME1= <>
##$DPNAME2= <>
##$DPNAME3= <>
##$DPNAME4= <>
##$DPNAME5= <>
##$DPNAME6= <>
##$DPNAME7= <>
##$DPOAL= (0..7)
0.5 0.5 0.5 0.5 0.5 0.5 0.5 0.5 
##$DPOFFS= (0..7)
0 0 0 0 0 0 0 0 
##$DQDMODE= 0
##$DR= 18
##$DS= 0
##$DSLIST= <SSSSSSSSSSSSSSS>
$$ [...]
##$SUBNAM2= <"">
##$SUBNAM3= <"">
##$SUBNAM4= <"">
##$SUBNAM5= <"">
##$SUBNAM6= <"">
##$SUBNAM7= <"">
##$SUBNAM8= <"">
##$SUBNAM9= <"">
##$SW= 16.880792210976
##$SWIBOX= (0..15)
0 0 2 0 0 0 0 0 0 0 0 0 0 0 0 0 
##$SW_h= 3378.37837837838
##$TD= 16384
##$TD0= 1
##$TE= 0
##$TE2= 300
##$TE3= 300
##$TEG= 300
##$TL= (0..7)
0 120 120 120 120 120 120 120 
##$TP= (0..7)
150 150 150 150 150 150 150 150 
##$TP07= 0
##$TPNAME0= <>
##$TPNAME1= <>
##$TPNAME2= <>
##$TPNAME3= <>
##$TPNAME4= <>
##$TPNAME5= <>
##$TPNAME6= <>
##$TPNAME7= <>
##$TPOAL= (0..7)
0.5 0.5 0.5 0.5 0.5 0.5 0.5 0.5 
##$TPOFFS= (0..7)
0 0 0 0 0 0 0 0 
##$TUNHIN= 0
##$TUNHOUT= 0
##$TUNXOUT= 0
##$USERA1= <user>
##$USERA2= <user>
##$USERA3= <user>
##$USERA4= <user>
##$USERA5= <user>
##$V9= 5
##$VALIST= <valist>
##$VCLIST= <CCCCCCCCCCCCCCC>
##$VD= 0
##$VDLIST= <DDDDDDDDDDDDDDD>
##$VPLIST= <PPPPPPPPPPPPPPP>
##$VTLIST= <TTTTTTTTTTTTTTT>
##$WBST= 1024
##$WBSW= 4
##$XGAIN= (0..3)
0 0 0 0 
##$XL= 0
##$YL= 0
##$YMAX_a= 184127
##$YMIN_a= -148731
##$ZGOPTNS= <>
##$ZL1= 120
##$ZL2= 120
##$ZL3= 120
##$ZL4= 120
##$ABSF1= 10
##$ABSF2= 0
##$ABSG= 5
##$ABSL= 3
##$ALPHA= 0
##$AQORDER= 0
##$ASSFAC= 0
##$ASSFACI= 0
##$ASSFACX= 0
##$ASSWID= 0
##$AUNMP= <proc_1d>
##$AZFE= 0.1
##$AZFW= 0.1
##$BCFW= 1
##$BC_mod= 2
##$BYTORDP= 1
##$COROFFS= 0
##$CY= 11.3945322036743
##$DATMOD= 1
##$DC= 2
##$DFILT= <>
##$DTYPP= 0
##$F1P= 16.9975609425685
##$F2P= -3.02152046262296
##$FCOR= 0.5
##$FTSIZE= 0
##$FT_mod= 4
##$GAMMA= 1
##$GB= 0.15
##$INTBC= 1
##$INTSCL= 1
##$ISEN= 128
##$LB= 0.24
##$LEV0= 0
##$LPBIN= 0
##$MAXI= 10000
##$MC2= 0
##$MEAN= 0
##$ME_mod= 0
##$MI= 1.114404
##$NCOEF= 0
##$NC_proc= 0
##$NLEV= 6
##$NOISF1= 3.799351
##$NOISF2= 2.8
##$NSP= 1
##$NTH_PI= 0
##$NZP= 0
##$OFFSET= 15.70392
##$PC= 1
##$PHC0= -9983.848
##$PHC1= 27.60089
##$PH_mod= 1
##$PKNL= yes
##$PPARMOD= 0
##$PSCAL= 0
##$PSIGN= 0
##$REVERSE= no
##$SF= 200.130013532006
##$SI= 16384
##$SIGF1= 3
##$SIGF2= 2
##$SINO= 400
##$SIOLD= 16384
##$SREGLST= <1H.CDCl3>
##$SSB= 0
##$STSI= 0
##$STSR= 0
##$SW_p= 3612.71676300578
##$SYMM= 0
##$S_DEV= 0
##$TDeff= 0
##$TDoff= 0
##$TI= <>
##$TILT= no
##$TM1= 0
##$TM2= 0
##$TOPLEV= 0
##$USERP1= <user>
##$USERP2= <user>
##$USERP3= <user>
##$USERP4= <user>
##$USERP5= <user>
##$WDW= 1
##$XDIM= 8192
##$YMAX_p= 0
##$YMIN_p= 0
$$ End of Bruker specific parameters
$$ ---------------------------------
##NTUPLES= NMR FID
##VAR_NAME=  TIME,          FID/REAL,        FID/IMAG
##SYMBOL=    X,             R,               I
##VAR_TYPE=  INDEPENDENT,   DEPENDENT,       DEPENDENT
##VAR_FORM=  AFFN,          ASDF,            ASDF
##VAR_DIM=   8192,          8192,            8192
##UNITS=     SECONDS,       ARBITRARY UNITS, ARBITRARY UNITS
##FACTOR=    0.000296,      1,               1
##FIRST=     0,             0,               0
##LAST=      2.424536,      0,               0
##MIN=       0,             -148731,         0
##MAX=       2.424536,      184127,          0
$$ Real data points
##PAGE= N=1
##DATA TABLE= (X++(R..R)), XYDATA
0@%%%%%%%%%%%%%%Pj5J6j6J7k5L2l8M6n5O4p3Q8j04J21j43J65j89K19k49K82l17
36a67L57m04M52n07N69o34P06p86Q72r65J067j178J300j434J582j743J918k111
54a106K324k561K827l126L464l849M292m809N422o157P058q184R610j1434J3523
69G294k1850J98683k88343N7858J64737k50399K01032n3875n8955J30536j50793
80f4075J05199K297j39428K23972j67103k4560J80111k12668J01646O7890j57070
91h3789J32080o7670l142J14931j71983J08441M4011j62474J74105p7645p4511
102f7646J72099j42440j974J11650j21225N8512P683n9774Q5359q2553M3114L8723
114D1528j22412J28499l4080q2142J32067j05026J2474J00976j48592Q7452J9877
$$ y = [0, 0, 0, 0, 0, 0, 0, 0, 0, 0, 0, 0, 0, 0, 0, 7, -8, 8, -8, 9, -16, 16, -22, 24, -31, 33, -40, 48, -56, 65, -78, 87, -102, 117, -132, 150, -167, 190, -214, 238, -269, 300, -334, 372, -414, 458, -507, 560, -618, 682, -752, 830, -913, 1005, -1106, 1218, -1343, 1484, -1642, 1822, -2027, 2265, -2544, 2878, -3279, 3779, -4405, 5205, -6229, 7294, -14556, 184127, -104216, -46358, 118379, -132020, 69012, 15137, -43818, 86718, -64075, 41124, 43421, -96007, 127965, -39138, -63698, 116413, -96255, 5391, 73281, -83789, 48291, -19379, -22521, 92410, -79573, 28868, 72879, -89595, 84510, 6865, -67646, 104453, -37987, -39961, 71689, -49536, 8976, 16659, -43115, 42244, -40309, 2805, 41528, -80884, 47615, 13535, -68607, 63460, -41566, -29092, 71884, -76708, 10744, 30621]
125C0621r5919J21494r4082J3332R2639j44680R1162J7684j02751J22543o7099
136a5056l2361R6151r6598O0535M855p0112R7712p1696J7812N5488j04361R0793
148C3162o988q8710J15143n8487k0201P9246j00743N8130K2779p1953P6131m5727
160h218r646O1912o9838L6005J8878o1436O5780l2872k0091N8079n7788K9849
172A0614K801m1691O2190l5194j6960N0692n4712K7967K3312o4499N8156j3790
184H886l0494M8533m2300J2260K2388l9338K8463p008j8375L7198l6561P394K5620
197A6666l8620L0802j1637j6506L5349k3964K6J4409k1940K1403j705k1563K7220
210I940j7929J929J5224k4615J9385j081j3771J2975o324J263J2558j7952N094
$$ y = [30621, -65298, 56196, -37886, -24554, 68085, -76595, 14567, 32251, -70500, 52043, -15056, -47417, 48734, -47864, 12671, 17526, -52586, 45126, -26570, -8758, 46730, -57631, 33162, 26174, -62536, 52607, -5880, -26081, 53165, -47578, 10552, 33331, -38622, 37509, -8218, -17864, 44048, -25790, 10215, 29093, -32343, 33437, 565, -19526, 38553, -19235, 10614, 13415, -28276, 33914, -1280, -18240, 32452, -22260, 5707, 29019, -35480, 22676, 8886, -21608, 26925, -15375, -3115, 19273, -20065, 8398, 1390, -16985, 20213, -16348, -8954, 16666, -21954, 8848, -2789, -19295, 16054, -7910, -7884, 6525, -15415, 5988, 4283, -17280, 9940, -7989, -6060, 9164, -15451, 3934, 2853, -10918, 2057, -4267, -3004, 9554, -8398, -3304]
223c304P957j0726J4591r829m217J1071m553k341M057M13l289N638o264J16P703
238G023k056n692K146L10K70M966r263N136k914L087L199j1891J3497m636n996
253b814J1685j3064M494J4470k5857J2778N936k0949K7799k0586m920K5419k5949
266a1558J1331P063k0832K2431o838j3084K2176k1072J2057N394k4806K6462j4334
279e610k902J8524k7771J7799J0023l0652K8456q336j5348L6523l6187R115K3800
292A7434l7832K8856l092k5625L6665k0968p647L0877l6041K3095O103l3251L9672
305A8246k2563j54K3772m0990L1979K704l4562M5364l1673l518M3457n9115L7252
318A0199R994m8920N8291l3616j1632M8498n2029K4000J3501m6506N3286k6927
$$ y = [-3304, 4653, -6073, 8518, -1311, -5528, 5543, 990, -1351, 2706, 3119, -170, 5468, -796, -680, 7023, 4967, -725, 1421, 1731, 2001, 6967, -2296, 2840, -74, 3013, 6212, -5679, 7818, 3182, -2814, 8871, -4193, 301, 14771, -11086, 1692, 7628, -13321, 14478, -6108, -11028, 14391, -11558, -227, 6836, -13996, 8435, 1597, -11487, 10689, -10383, 1674, 7068, -17738, 8724, -5610, -8512, 10012, -17759, 40, 10063, -20589, 7867, -469, -15817, 20706, -15481, -6366, 17434, -20398, 8458, 5366, -20259, 16406, -4562, -12209, 18668, -17373, 5722, 11825, -21426, 18246, -4317, -4471, 19301, -21689, 10290, 12994, -21568, 23796, -7877, -11395, 32062, -27053, 10199, 20193, -28727, 29564, -4052, -15684, 32814, -19215, 4785, 18286, -28220, 25066, -1861]
330a861j5056M3489n0667L5140J176m0745N5650l4813n459M0738n4496L5078J0090
343A8264n2227N8523l0176j5268N0896n5443K4340J7487m3699M3336j7961j9071
355b0999M4646l9987J1694J9469m0905M3969k0215j9060M4708m1388J4964K0092
367A6988m4846M3546r764l1906N3322m2338P512L5167n6530M1941l543l3884N2002
380B7667l8600j63L8542n1252L4328J219l7142N6401m2344J258L9111n4291M1763
393A6497n309l7889N6796l8273k406M1049n7879L9840L287m4242N7773l7985j969
406a0710L8945n3978L3815O965l9505M6525k9720p029M1838n0516K8505O666l7547
419b5746M8016l0358n996L7211m3585K3545R777l9212M5681k2266j5671M1676
$$ y = [-1861, -16917, 26572, -24095, 11045, 12221, -28524, 27126, -7687, -13146, 27592, -26904, 8174, 18264, -33963, 24560, -5616, -20884, 30012, -25431, -1091, 16396, -27303, 16033, -1928, -20999, 23647, -16340, -4646, 14823, -26082, 17887, -2328, -21388, 23320, -18068, -3104, 16988, -27858, 15688, 5924, -25982, 27340, -14998, -7486, 27681, -28849, 13092, 9549, -24335, 27667, -10933, -11096, 27446, -23806, 10522, 11741, -25401, 31000, -11344, -10086, 29025, -25266, 16497, 11188, -26701, 30095, -8178, -10584, 30465, -27414, 12426, 15713, -28529, 29244, -8741, -10710, 28235, -25743, 8072, 15037, -24468, 22057, -7663, -14692, 27146, -23370, 5135, 11801, -25746, 22270, -8088, -14084, 23127, -20458, 3087, 12864, -26348, 19333, -2933, -18604, 23072]
431B3072m4270K2122J3742m1300M0631j5452j5589L7231l6590J3182K0896m0498
443b2823L5892j2532j7092L9272l7941J3175J7645l5551L2924j0446k0093L9039
455B1469l1382N179K2863l7940L2654o457k2378L4942k6807N559J8300l1478K4127
468H651o92k2240L1410k3874K464K2421l3723K3321j076j8656K7667k0464j847
481f638K1475k6134J5099L230k1542K8010j7262l305J9338k4148J6355O82j8272
494a3112K2544j1348o008J8482k2124J1966O852k0717K0487j0477l305J5541j7914
507i133P945O216j3877J3703o366o466J7080j6409N789N877j3775J5123p054n506
521f853J2462r054K007O396j2118J0347j99q030J1178r540M269M727j0081P848
$$ y = [23072, -21198, 924, 14666, -26634, 13997, -1455, -17044, 20187, -16403, -3221, 17675, -22823, 13069, 537, -16555, 22717, -15224, -2049, 15596, -19955, 12969, 2523, -17570, 21469, -9913, -4734, 18129, -19811, 12843, 6386, -15992, 18950, -7857, -2298, 16002, -15476, 8651, 7959, -14281, 17129, -6745, -4281, 18140, -15583, 7738, 6662, -11994, 15673, -4791, -6638, 14837, -11297, 3802, 7032, -14510, 13500, -3762, -7067, 12271, -11877, 4478, 5160, -13112, 9432, -1916, -7924, 10558, -11566, 400, 7252, -13465, 7022, -3455, -6760, 8781, -9133, -1188, 5028, -8849, 4854, -1512, -7978, 9102, -7307, -1518, 4359, -9416, 5707, -1347, -6853, 5609, -3445, -1438, 4958, -7160, 3187, 2988, -5042, 6136, -3404, 865, 5592, -4489, 3359]
535C359j463l830O519n792l36P634q596M489K07m321Q196o613L04K979k779K090
551B047K20l716M206r42k461L248m106M024j355j949Q90l07J363j375K60k053
567b006K520n95j785J628j203P14J010k431m0M187n548L680j138k785P178o502
583c116J292K417m299M865j589m905P677m547m04N310q976Q948j882n677Q970
598D084p599L259M362r086O661J483p996J0327p249k57R395j2164P471k9o732
613d070J0406o715k172R385r395L831M137j1571J2978n441m951J1107j1861O147
627A815L809j1838J0620k191p308J3335j3020L369R561j6765J3933m193q152J5635
641H610j3568J557J0211j5018J1454r80j2702J9220j3704J261J0840j8216J5840
$$ y = [3359, 1896, -1934, 4585, -1207, -1543, 6091, -2505, 1984, 2191, -2130, 6066, -547, -243, 2736, -43, 2047, 2267, -1449, 2757, 1815, -646, 2602, -1504, 2520, 1165, -784, 106, -201, 1162, -213, 47, -2006, 514, -81, -1866, -238, -1441, -727, 283, -2148, -2188, 1999, -3549, 131, -1007, -3792, 3386, -3116, -1824, 593, -3706, 1159, -430, -5335, 2342, -2205, -2609, 2701, -6275, 2673, 791, -4886, 4084, -3515, -256, 4106, -4980, 1681, 3164, -4832, 5495, -1754, -2011, 7384, -4780, 2691, 2662, -4070, 6336, -379, -2551, 6834, -2561, 1270, 5407, -6164, 6814, 1373, -3578, 7529, -4332, 1815, 5624, -6214, 4406, 2215, -5093, 8242, -4778, -1409, 8152, -8613, 5320, 1127, -7025, 8610, -4958, -3401, 6810, -8208, 3246, 2266, -10436, 8784, -4920, -3659, 7181, -11035, 4805]
654D805l400j1156J7379j3040J213J2441j9832J4439J093j5648K0637j4555P40
667d884J4274j9113J2503P76j2629J7352j0984l058J5736j8263J0888K126j4797
680a0073K0371j2576k260J4436j6938R915M060j6429J8132p721o843J7498j9100
693g528R693N978j7360J7639q521n091J6213j7001N584R179j8043J6768o341r111
707g942J9805j8733O716P129j6647J6345n991r207J7769j4760L569J0158j9954
720a1743J7504m468j0439J8213j6185M835R438j7612J3318j085j0897J7593j4354
733e882J669J2969j9073J4350k703j0230J7441j3359O63J1204j5447J1209Q74
746C685j3445J8195j1734l65J2382j7675J2867J34j1709J5126r286j387J2570
$$ y = [4805, 1405, -9751, 7628, -5412, -4199, 8242, -11590, 2849, 3942, -11706, 8931, -5624, -4884, 9390, -9723, 2780, 3556, -9073, 8279, -2705, -5763, 9973, -8290, 2598, 4724, -10073, 10298, -2278, -4538, 9898, -7040, 2875, 6935, -9494, 8638, 917, -5926, 11572, -7528, 2165, 8143, -9217, 8422, -99, -5190, 11023, -5978, -394, 8785, -9258, 7510, 1169, -7942, 11863, -6870, -154, 6975, -9672, 6673, 682, -8525, 9244, -5516, -1947, 8211, -11743, 5761, 1293, -9146, 9067, -7118, -2283, 7155, -10457, 2861, 1776, -9121, 8472, -5882, -4213, 8756, -10317, 4033, 1330, -8900, 8541, -4818, -4155, 7049, -8398, 2811, 3685, -9760, 8435, -3299, -3664, 8718, -8957, 3910, 4044, -7665, 7461, -1825, -3212, 9358]
759I358j6362R447L595j4055J6911j0944j180J2907j5601Q395K426j0928J3408
772G377p305m826J3904j4402O956L847j3496J5127p774l564J1346j2324N939M688
786E493j2888J1795l373o529J2836j3108N276N593j2472J0893m147m259J0410
799E520r228J006O831j0738R245k276o849J2073j0302L316M470r470R181j997
813G82o640J0019o584P9P245j1232P967K52p075R397o729J074N531p242M149Q75
829A868n002P211m862j020O908q125N487q23m439P494m631j209M720m996K305
844H86K978p061O385j873k734N201n605K785J328l624K726p62j910L849l735N40
860f26L016m805M504k780j238M158l644Q27J034k185J673P96l902M277k402k16
$$ y = [9358, -7004, 2443, 6038, -8017, 8894, -2050, -3230, 9677, -5924, 2471, 4897, -6031, 7377, 72, -4754, 9150, -5252, 1704, 5551, -7945, 7182, -592, -4156, 7190, -5134, 805, 5493, -7395, 4400, 1027, -5502, 7334, -5774, -498, 5095, -7377, 3516, -631, -4890, 5520, -3708, -2702, 4129, -6609, 2636, 360, -6489, 5584, -4718, -1402, 3068, -6402, 2779, 782, -5858, 4161, -2423, -2344, 4901, -6331, 1636, 1888, -5187, 4210, -2519, -1445, 4086, -3156, 993, 1868, -3134, 4077, -785, -1805, 5103, -3022, 2465, 1642, -2797, 4697, 66, -1143, 3577, -1419, 886, 3864, -3197, 3188, 1315, -1419, 3782, -1823, 962, 2290, -1334, 1392, 630, -1280, 2569, -1166, -626, 2390, -2415, 2089, -691, -1929, 2229, -1415, -588, 446, -1739, -66, 730, -3172, 1105, -1297, -1513]
876a513K341l356K573m05j143N74L7k21J088r15o53J574j212J638j622L99J145
893C29n27%m18N49j71J263k186J554K85j341J601j261K51J105l32j072J977j605
911AJ049J119l584L560j677K19J016k048J031J404k675J294N80j558L170l981
927a080J876J169l198L424k278p92K631k315o54K843l919L186j69l819N402l499
943a192O18J656l710L050J97l259L129j334j292M404n653L369Q65m351N518m038
959b023K99L497m035J698J864m739N678k274l183O300n622L363O60n023O018k422
975E6k034M591m352J594L583o747O037j938k899O427o836L270K337n583M849j203
991A152l372O668n341J7N013p257O445k255l785P086n690J329K958n893M704K05
$$ y = [-1513, 828, -2528, 45, -360, -1503, -929, -892, -1113, -25, -940, -1593, -19, -1231, 407, -1215, -816, 329, -198, -198, -616, -67, -238, 1025, -1161, 393, 678, -663, 938, -323, -72, 1033, 701, -371, 1606, 1, 1050, 2169, -1415, 2145, 468, 687, 1703, -345, 686, 2090, -585, 709, 1289, -269, 2901, -1080, 796, 1965, -1233, 2191, -87, -879, 1752, -563, -1217, 1626, -2293, 893, 724, -3095, 2307, -1192, -574, 1082, -2628, 422, 619, -2640, 489, -845, -2137, 2267, -3386, -17, 848, -3503, 2015, -2023, -1724, 1773, -2262, -564, 1300, -3439, 2239, -35, -3218, 3082, -2540, 823, 1483, -3540, 2478, 56, -1978, 2613, -1739, -145, 3438, -3309, 2728, 790, -2109, 4318, -2518, 752, 3089, -2494, 2355, 1152, -2220, 4448, -893, -876, 4137, -3120, 3325, 1070, -2715, 4371, -1319, 10, 2968, -2925, 1779, 1984]
1007A984n630P348m993L5N368q301N950p15m259N994m584K0N036o791L690J414
1023A566o110Q231n689q35O387p912M812K63m841O471k818k875O344o684L704
1038A4K468p287P935m149r91N519o785L371K364o010N679k036l073P506p484L023
1054F4K898o555P070l438k235O170n084J002L607o617N828j064m808P818o388
1069a732K168L342o871N559q34l817N343m061n7M632o497M626m68m056O818o147
1085b052J470L289n256L741k77m217N966l462j498N186o449M719m45m679O116
1100B152l482R7L018m591K699J413m883N486l114o62M622o178L695L31l120M329
1116A812k805r91M344m201J235K447m682N048k203j866M321m100K344N18k918
$$ y = [1984, -3646, 3702, -1291, -1256, 4112, -4189, 1761, 1046, -3213, 2781, -1803, -1783, 3253, -3538, 152, 1566, -4544, 3687, -2002, -2837, 3550, -4362, 450, 713, -4128, 2343, -475, -3350, 2994, -3690, 14, 2482, -4805, 3130, -1019, -2010, 3509, -3276, 95, 2459, -3551, 2128, 92, -2981, 4525, -2959, 64, 2962, -3593, 3477, 39, -2196, 3974, -1110, -108, 3499, -3118, 2710, 1646, -3162, 4656, -1732, 436, 3778, -3093, 2466, 1632, -2185, 3158, -903, -960, 3672, -2825, 1801, 1333, -2723, 4095, -2052, -582, 2707, -2549, 1192, 915, -3302, 2664, -798, -2296, 2890, -3559, 1160, 715, -3964, 2152, -1330, -1233, 1785, -2806, -107, 1306, -3577, 1909, -1205, -1867, 2755, -3423, 272, 603, -2517, 1812, -993, -1984, 2360, -1841, -606, 1841, -2841, 2207, 4, -1862, 2459, -1641, 703, 1221, -1697]
1131a697L415r91k216L770l327J415K175m751M658k135q57L212l802J529J796
1146B194l350K460L4k893M552l670M14K157l500L131j247j362K248j071n29J780
1162A348l068K020N27k839L319k613P96J453k844J908k5j204J370o42j120K891
1178A277k867J032O79k061K774j744J7J162r79K57P01j484J228J98j581K131j722
1195i82J174J55j029J133l30j4K26n64j55J556j321Q65m8r41J579j229J20K20
1213D15M52l79J55k03n8M64r08J050r47N52J26n59J89p5L09m07M34j005J372o26
1233C51l93N30j032P40K5o04J27O20j059Q31m83l02J607k114J258o27j15N76p81
1252h45rP59o10j78J098j832J997q19j068K033j544J172l37p26P71L13q20J282
$$ y = [-1697, 1718, 727, -1489, 2281, -1046, 369, 2544, -2207, 2451, 316, -541, 2671, -1131, 398, 2194, -1156, 1304, 1338, -1555, 2997, -673, -259, 1898, -1602, 1529, 282, -1080, 1168, 97, -432, 1348, -1720, 300, 827, -2012, 1307, -1306, -510, 943, -1901, 7, -18, -1222, 148, -494, -1614, 1277, -1590, -558, 121, -1940, 834, -910, -893, 269, -710, -453, 248, -1236, -8, 190, -1391, 740, -982, 192, 347, -682, 451, 121, 107, 333, -231, -386, 1170, -151, 714, 666, -275, 1304, 75, 195, 415, 867, 488, 643, 440, 382, 846, -62, 988, 41, 593, 719, 160, 349, 274, 583, 176, 610, -395, 977, 351, -42, 488, -544, 196, 221, -383, -256, 364, -695, 136, -347, -649, 958, -1156, 102, -525, -640, -64, -845, -854, -95, -705, -883, 215, -1617, 380, -439, -1507, 526, -1018, 154, -183, -909, -138, 175, -645, 637]
1270F37j403K8K025k541K007o62n34J328j227J67R76r85O30N45j908K704j791
1287dk24J716k325J925l33j367J650q38l57J759k350J273J160k762K588j641q4
1304b14J714k652J705n4j333J858r47j239K785k743R28R53k884L442j733l56J608
1321H38k131R11J011k192J612L8k001L068k802J247J248k704K390r62o14J629
1337E86j477l16K168k536K120l10j927L498l146J120J085k313K202l47j700K283
1353I90j125l15K320l517K783k59k134L306k717P10J434j947Q77R56k414K828
1369A776j522r04L036l472K134l84j628K671j969j94J775j963R04Q79k906L003
1385A236j481o93K319l129K195k2j792J911o74r37K257k523P43J698l215L068
$$ y = [637, -766, -738, 1287, -1254, 753, 91, -443, 885, -342, -175, 801, -184, 446, 991, -917, 1787, -4, -228, 1488, -837, 1088, 755, -612, 1038, 200, -157, 1602, -748, 525, 1685, -1077, 1511, -130, -214, 1500, -1152, 553, 499, -834, 1024, 77, -1162, 1623, -1120, -192, 761, -2123, 1319, -414, -770, 838, -1293, -382, 629, -1563, 49, 87, -1914, 1154, -1648, -401, 847, -1857, 533, -429, -1043, 586, -891, -1207, 961, -1575, 545, 235, -1692, 1806, -1340, -220, 865, -1448, 754, 407, -1293, 990, -135, -450, 1870, -1647, 1136, 877, -1257, 2049, -668, 42, 1476, -471, 406, 1362, -1052, 1776, 254, -650, 2386, -1086, 1048, 664, -964, 1707, -262, -456, 1319, -644, 260, 1139, -1767, 1236, -245, -938, 1381, -1748, 447, 425, -1367, 544, -130, -1067, 1190, -1333, -590, 1108, -2107, 961]
1401I61j618o31K402k477R51P58j504J525k63j802K745j989M39J569l122L028
1417I72r39q21J905j751N54J370k418J315M46k007K739k080O92J172k127J946
1433I68n80r41J671j082n15K012k109J341J51j838K625j745K28R29j591J085K11
1450H20j345J221l10j008K003k287J224M84j794K123j556J47R34j188L90L99j307
1467a050J575m92j175K030k008J142j58j076J461n42o70J033o39j03J035j710
1483a347J490l23o77J304j523J197q0o29M95L0n26R52n06l74J318j574J259n86
1501a00j94R10q47N03j8j03O8M30r78J138l25n91J054j130J086n69J18r2r3k5
1521B42L24m10l8O97r23Q02p76j63O62m22L84n10M42r0l10k36M85k63q4K60p73
$$ y = [961, -657, -1288, 1114, -1363, -412, 346, -1158, 367, 104, -1698, 1047, -942, -503, 1066, -2056, 972, 33, -788, 1117, -634, -80, 1290, -1128, 187, 633, -1374, 1365, -715, -23, 1149, -978, 968, 388, -553, 1118, 36, -479, 1533, -576, 765, 916, -922, 1703, -42, 186, 1115, -476, 609, 820, -525, 696, 386, -622, 1381, -906, 318, 802, -992, 1131, -425, -278, 656, -532, -142, 257, -1050, 525, 33, -1142, 888, -1120, 22, -136, -1212, 249, -293, -963, 70, -569, -672, 363, -1347, 143, -180, -857, 447, -1076, 121, 41, -588, -93, -63, -589, 363, -143, -517, 801, -773, 486, -100, -294, 616, -231, 272, 254, 151, 219, 649, -329, 809, 484, -107, 947, -183, 903, 334, 452, 360, 267, 242, 566, 156, 118, 815, -108, 694, -82, -245, 417, -5, 379, -131, 311, 221, -89, -325, 160, -103, -187, 73, -700]
1542g00R30m38L13n60Q3o6K13n8n47R43p90O85n94M12l5l02K08j60M81p31P46
1563C3k45o6L74n16N44p58N81J1J48l72L34pK32J61o29N96n51L56l2l4L80j68
1585C72r1J6K61m44P88j048O15J10n15O89q86O50j25m20J24N08q55P09j62q88
1605e92J491j196P96m08m80P45k41l00J97j20k08O54r38Q38l50o76J224j318P68
1624a14O4n47L58o2m91Q84l84m71J106j058Q24l71o07R74n23M7N34p25L28N35
1644C01j006J374p90KP73j423J149j37l35M81m48j73O34m73O2R03j334J288o46
1663B02l28J261j360N69Q8m98O36k50n74J049p60j2Q34j600J644r18J65J78p67
1682d41P14M3o18M71Q8j035J511j318L39O71j279J244q63N9L89n10l5Q80j257
$$ y = [-700, 230, -208, 105, -455, -372, -438, -225, -283, -830, 113, -677, 8, -586, -174, -209, -511, -303, -463, 18, -713, 33, -212, -278, 96, -420, 124, -634, -53, -42, 106, -266, 68, 61, 293, 454, -175, 421, -130, 226, 194, 160, 540, 372, 281, 297, 558, 114, 902, -146, 469, 579, 64, 753, -133, 517, 392, -28, 96, 604, -251, 458, 296, -592, 899, -297, 499, 91, -389, 356, 115, -185, 12, -108, -316, 338, -600, 238, -112, -788, 436, -882, -114, -50, -597, -239, -301, -792, 92, -292, -763, 343, -715, 109, -262, -869, 105, -418, -371, 163, -562, -234, 301, -705, 669, -121, -119, 654, -769, 380, 243, -92, 389, -59, -232, 402, -71, -9, 894, -440, 848, 202, -126, 1135, -225, 344, 432, -66, 570, 320, -254, 795, 35, 23, 857, -743, 901, -17, 148, 326, -441, 273, 316, -302, 169, 257, -778, 733, -585, -246, 425, -854, 390, -473, -414, -25, -535, -570, 310, -947]
1701i47Q12L7j003J644j097L54L37r15J069n20m28Q72j91l93R12j351J023k22
1719gp51J530j379O78J88n42M47J99o76Q14j44n34J024j127R79k95j109J531o49
1738A77J97N6p87P22L32j082Q87j69m52J073j407O86Q2k48J11k6n25Q36n32l85
1758d54Q82j152J151n38m86J123p94L68k89m4J31J04o05Q07n29j0N36j005Q80
1777G6o32L06L39q82N71K38n84J45N03q73J091p65J10N21o82J031r59L01J45%
1797@j53O05o05K00J80p55J291q42M20Q0n14M58j69J23J38k12j92O30o67K52O6
1818C34m57P79p99L95k59K83j2K9l73L42n9l06O34p16L63o6l74N72m78L99j71
1839F0j71k43M64n51K06l3j5L58m81L84m36M90l05j92J93j66O29q23N43k84K13
$$ y = [-947, -135, -98, -1101, 543, -554, -200, 137, -778, 291, -229, -657, 215, 24, -369, 543, -808, 215, -7, -758, 772, -607, 71, 259, -283, 164, 363, -313, 501, 357, -177, 847, -280, 699, 404, -705, 826, 177, 374, 430, -357, 365, 697, -385, 502, 333, -119, 954, -453, 233, 315, 67, 178, 152, -373, 463, -69, -454, 428, -724, 427, -111, -597, 526, -268, 100, -189, -233, -102, 2, -603, 204, -325, -335, 201, -804, 76, -556, -250, 89, -793, -222, 16, -568, -423, 80, -793, 298, -467, -357, 164, -518, 513, -446, -145, 0, 0, -153, 452, -153, 47, 227, -528, 763, -79, 341, 421, -93, 365, 196, 319, 457, 245, 53, 683, 16, 268, 334, -123, 656, -143, 252, -7, 276, 264, 293, -80, 262, 203, -103, 531, -185, 178, 112, -262, 310, -168, 231, 60, -111, -354, 110, -441, -235, -268, -283, 75, -406, -22, -458, 32, -273, -465, -272, -438, 191, -632, -89, -373, -160]
1860a60k2N3J49m22M15n31M58l17M70l83M84J34l38K35o51O33j88K95l79P1K07
1881B13j71N92n52L97n06K63lj55L49l99N47o02M67n62M21k73P9K09j93K48l67
1902BN12n31K04j36R1q7l28N29n92N17l97K37l13Q3K74k71K15l44M75m33M56l49
1924a86k44L98l61K75j87j70L97j4k58K54l8j61N57q25O52l40J99R7k02L60l00
1945i7K60l88J60k25O44l58O7j87j74R32n81j71L77N9j51K90m04O6M93q42N83
1966C53l91K71L22o38L71r1j20K33j93p7M52o49J23M12o25O16p34O80m26j5M30
1987C04k54j41J19o3m65Q99j006O16J05p08Q60o11K84J15k16j82K64k07L00J6
2007B9k59N59r97N73m6l8Q6k29K09K59l61j27O20n87N22l91P5N10n97O23m96J
$$ y = [-160, -182, -129, 20, -402, 13, -518, -60, -377, 93, -290, 194, 328, -10, 225, -426, 207, 19, 314, -65, 6, 213, 42, 634, 82, 479, -27, 236, 233, 78, 427, 28, 575, -27, 440, -122, 299, 26, 105, 314, 121, 369, 2, 514, -17, 187, 51, 142, 55, -273, 256, -336, 181, -216, 21, -292, -209, 65, -206, 9, -335, 140, -293, 163, -186, -430, -32, -393, -118, -305, -475, -78, -92, -350, -96, -134, -295, 262, -563, 89, -251, -52, 45, -157, 203, -97, 163, -225, -65, -290, 354, -4, 63, -124, -298, 634, 53, -118, 259, 318, 167, 457, 53, 119, 612, -230, 353, -38, 233, 555, -83, 288, 197, 77, 310, 117, 40, 492, -157, -34, 378, -247, 369, -365, 315, -111, -126, 304, 50, -91, 28, -35, -500, 399, -607, 9, 114, -594, 266, -345, -61, 54, -162, -344, -80, -287, 13, 29, -230, 329, -668, -95, -141, -179, -93, -322, -113, 146, -215, -342, 278, -309, 213, -178, -103, 407, -190, 433, -63, -62]
2029f2L29j25j9J04k58j33P07p29O86m29J71K18o01L27o2KL6O4l31N67m26k18
2051a82K70k18M19n28J82k6K33j63J27l21q7O01o86Q71p51J05K85n72M72n18N13
2072B6l92L83q4L36m53J72J07n84P70q45M51J82n85N18k7k89K04L25p48Q41p41
2093d33M33L4l60O15o02M61n2j07m3M08l95J77j18j46N18o40L65o1N6L17n17M39
2115C49k21J32l89N84m66R7R6l65O90m23K83k87J75m42J68Q4j08J19l84P25p98
2136c81O02l40J7K18k84K55l68J65q7J62m38N15n1k90J83l49O04l15q3J11K8j76
2158c02J39K98m08M73n84N55m56L23L56m79J94n09N81m64M09m14L82K01k41K44
2178B98l69M26n04L66j31K2J30j44J48l48N87n65M31l27kM06p9j20r5J32j53J11
$$ y = [-62, 267, 142, 123, 227, -31, -164, 543, -186, 500, 71, 242, 460, -141, 186, 124, 126, 162, 226, -105, 462, 36, -182, 88, -130, 289, -239, -57, -83, 150, -13, 114, -207, -294, 307, -379, 492, -259, -154, 131, -441, 31, -487, 26, -366, 17, -67, 269, -184, -12, 95, -489, 281, -564, -113, 69, -516, 2, -25, -314, -110, 215, -533, 308, -433, 0, 34, -326, 289, -313, 148, 96, -11, -54, 354, -41, 136, 18, -128, 390, -250, 115, 54, 110, 427, -90, 349, 128, 260, -129, 455, -11, 86, 182, -183, 507, 84, 367, 80, 255, -187, -19, 65, -43, 76, -308, 417, -381, 221, -119, -102, 116, -168, 87, -281, -116, -203, -41, -479, 36, -15, -305, -122, -471, 133, -182, -265, -154, -126, -302, -163, 135, -273, 200, -384, 171, -285, 38, 394, -85, 109, -400, 181, -283, 126, -288, 94, 295, 54, 298, -71, 355, -149, 217, 86, 108, 238, 94, 242, -106, 481, -84, 347, 20, 18, 424, 345, 225, 130, 262, 109, 220]
2200B20j32J05l0k25L51m33N34m27J34k25J50q5l84M71n09N44k27R6q2J4J50k62
2222b52K56k39N6NJ57m21L05Q5j24N00q12M53m10J39J52k2L30l69L33o84N55r0
2244i7%J6p3K51o5K42l41K75k81L72m22L46J4k14L91o81N38l0l21K09Q7l2k6P
2268A65r2Mj17J60j03K53M0k31J74l62K26j01K00n23L80k75P5L65l84J54k03j46
2290c41L7K21J83n34L89j85M27o31L83m3o6K60l53M59n88M33k97OJ4J55J15k48
2312b04M63o59P69n37L1K10k85K41n8j81m1M13n68N67j91j3K90k67N78l76R1k69
2334DK20l58K65J40k42M4k31P59l72j06l5O1K2K9q4r9L06n02M48l89K64r2k08
2357a56N08n40J88K04j11j72Ko3J29p8nM16m92K84p6r0J99l31L1J48J85m23M2
$$ y = [220, 88, 193, 163, -62, 289, -144, 390, -37, 97, -128, 22, -63, -447, 24, -485, 59, -168, -72, -154, -140, 10, -252, 4, -235, -179, -174, -17, -438, -133, -48, -172, 328, -484, -31, -441, -302, -150, -172, 158, -211, 122, -562, -7, -97, -97, -81, -154, 97, 32, 274, -67, 208, -73, 299, -123, 223, 237, 23, 414, -267, 271, 241, -80, 129, 216, 184, 158, 165, 73, 77, -40, 120, 17, 270, 310, 79, 253, -109, 117, 16, 216, -307, 73, -202, -127, 238, -146, 8, -195, -341, -304, -83, 100, -434, -45, -230, 197, -434, -51, -94, -160, 100, -253, 206, -382, 51, -246, -240, -226, -71, 44, -204, 259, -400, 369, -168, -137, 73, -212, 29, -29, -210, -251, 162, -406, 161, -30, -43, 247, -20, 558, 182, 273, 4, 224, -134, 131, 271, 29, 73, -158, 601, 229, 123, 88, 149, 171, 200, 116, 17, 323, -179, 269, -120, 144, 52, -156, 352, -188, 0, 204, 93, -79, -77, -140, -11, -89, -94, 322, -170, 114, 38, -52, 147, -184, -153, -5, 180, -243, -201]
2380b01q0M20qn81N30l56K44q5nj11L06k39m6J77j08M10l67K30l6qn5q9P7Q5J16
2405B20l65N61k83p5J64k43L68m09M01j77K39k04p2k64K16O6r9K42m47M31k56
2426A4LM0j91L29l50K51j81J76N0j40M5l07K73n40O54k36j6q6k75N46j86K45l22
2449b04M05o40O41l82K20L2m33N16n29J46n9K54k7j16K78l00L63l17N31o07K40
2470A2P9m70L55j40K60j7l2k27L65m75K77j12L01J55o44N33k24J29km6J63j64
2492G6Q3k84M32m17J79k42J06L64n53O30n64M36k33kl0J37p0o6K66l44N1j38J36
2515d7k39J55J67m24N45m56M27l04J23j59K1p1J52K77m26L61o77P37k89j28J62
2536i3k08L29l84M61l55K16l4j48M28n62L36j51L63l55J68k01K71l3o3K66l07
$$ y = [-201, -281, 139, 131, -450, 80, -276, -32, -117, -122, -233, 73, -166, -212, -35, -143, 267, -100, 130, 94, 86, 31, -58, 19, 104, 220, -145, 416, 133, 58, 222, -21, 347, -62, 339, 162, 401, 197, 125, -139, 77, 143, 44, 286, -161, 270, 14, 17, 57, -134, 195, -155, 96, -85, 91, 141, 1, 46, -261, 12, -528, 126, -110, -126, -212, -487, 59, -127, 118, -204, 201, -439, 202, -180, 40, 72, -361, 155, -374, -228, -287, -33, -60, -176, 102, -198, 165, -152, 379, -228, 12, 91, -379, -24, -164, 96, 79, 47, -180, 185, -290, -13, -125, 176, 331, -313, 220, -4, 125, 123, 77, 240, 76, 159, -125, 307, -110, 69, -173, -67, 297, -256, 374, -190, 246, 13, 11, -19, 118, 48, -18, 248, -96, -45, -183, -47, -286, -131, 36, -388, 157, -299, 128, -176, -53, -212, -191, -262, -110, 167, -259, 102, -575, 162, -127, -255, -93, -301, 28, -356, 105, -250, -34, -68, -216, 212, -350, -14, -165, 198, -157, 11, -190, 81, 48, -15, 251, -56]
2557e6L61l47Q0j7J09J59l45M10j95K6m3R0j19k42L77k34J86j36J28j38Q5j92
2579e3J9K31k86P6J39K7j93R8l6q8J90l27M37l67J08nnk74Q6K43j87J01k12L39
2603F1k24K36jk20L06l91K24K7O5l29J78l9J31k3k4J20k57L9K1K51l38K76l4L5
2627I0L33m87J90l00L42n1N0N6k2j8l14L44j83J54j72J17p9L9J39j63J25l35L38
2650A93m22K92K1o5O9j34L38p03L37K0r2K22k00L18l91J71k63O13l69J7k46K77
2672Cj25Q7J63k18J80l02K5N8P3L6k30L46k35O2O8l15M24m25N76m04K39l57K61
2695a0K26j65j17KM0j64M35k86P9J81k40K66j1k21k11L46j02K50j23k10L22j16
2717A71K31m60K99j43K31n91K93J04j99L97k93P9p6P5j75L0j19j98N22m03L15
$$ y = [-56, 305, -42, 38, 21, 130, 289, -56, 354, 159, 185, 142, 232, 113, -129, 248, 14, 200, 64, 192, 54, 139, -53, -34, 197, -89, -13, 126, 153, -40, 58, 22, -66, 124, -203, 234, -133, -25, -30, -35, -309, -223, 20, -167, -66, -278, 61, -163, 73, 72, -148, 158, -233, -9, 18, 83, -246, -68, -107, 24, 1, -23, 97, -160, -121, -100, 151, -187, 89, 55, 90, 423, -64, 126, -174, 168, 117, 167, 223, 201, 183, -131, 213, 30, 184, 12, 129, 50, 89, 228, 65, 190, -145, 193, -229, 63, 84, 19, 88, -46, 292, -411, -74, -54, -146, 76, -124, 194, -197, -26, -289, 324, -45, -28, -274, 3, -122, -35, 128, -90, 90, -212, -187, -129, -56, -20, -250, 96, -139, -77, -9, -324, 100, -325, 251, -153, 86, -271, -10, 216, 51, -66, -64, -24, -188, 247, -39, 40, 221, -19, 247, 236, 15, -196, 150, 48, 298, 175, -35, 287, 171, 402, -58, 241, 98, 329, -262, 31, 135, -64, 333, 40, 119, 43, 118, -57, -27, -146, -344, 178, -225, 90]
2738I0j59J00K90k21P9n43N59l25O2j45J74j06j15P6J54J88l21J98m4n5j61J67
2760e8L24l23L3l5r7J29N8r6j77J49mK59l16K82k57O4J43k32N4J96j5o0J97k11
2784GK37J78k92L8k19L62j80j73k95M11N3m6J14k90L80l87L82m14J22J86l12K82
2806A44j80K87l53K89l62K94k26j0J20k98K65j82P0p6j0P9L5M9k47J84k73L28
2828g3j0K23j43j43J41k34M43j30P3Qj9k7l03K99k01K02l22M21p8k28K22n6J70
2851B35l31K74k10L5j25J03J66j52J34k12N91o53K18j35L25J49l35J48n91M59
2871I3r8K37k49K60j70k41L99l15L21l77J61k44J64J16n4j21L1L01l49j56K83
2892hrj60r6L58j19k3q6M8RL3P2j96M0q2J93q3J63p0k25L9P9J19k76M69k57J76
$$ y = [90, -69, 31, 321, 100, 179, -364, 195, -130, -68, -213, -39, -145, -260, -184, -30, 158, -163, 35, -9, -64, -225, -58, 266, -57, -24, -59, -156, -27, 31, -65, -242, -93, -97, 162, -154, 128, -129, -65, 78, -154, -100, 96, 81, 21, 218, 7, 244, 422, 130, 168, -51, 311, 131, -42, -337, 74, 127, 81, 195, -95, 285, -102, 280, -134, -12, 174, -138, 144, -36, 251, -102, 187, -175, 119, -107, -117, 3, -295, -30, -212, -142, -218, -228, -149, -114, -65, -312, -128, -401, -73, -83, 140, -3, -146, -5, -239, 204, 74, 147, 155, 136, 109, -194, 105, -96, 106, -216, 205, 127, -101, 121, 65, 235, -96, 178, -32, 3, -122, -19, 147, -5, 129, -83, 508, -145, 73, -62, 263, 412, 77, 225, -366, 93, -5, 232, -17, 243, 73, -168, 231, -84, 237, -140, 21, -223, -59, 57, 3, -118, -87, 214, -135, -291, -8, -17, -177, -273, 85, -34, -57, -143, -95, -86, -53, 19, -177, -137, -219, -26, -109, 54, -16, -241, -202, -123, -4, -280, 189, -68, 108]
2918A08j80L5n9J73J50k79K58m32M5m8K34R8k0j1qJ43n27L65O7q5j1q4J09OJ65
2943B12k00J51k11K32ol24K78j65M26n98L00j42j6L32r7j74j43K44j34J09q6N3
2965D1M7k79J42q7J78k73P8p0J58J6K55k19j14J79o5o6r7K89k55n8J02k04L07
2988Ej88L22k15L52k08k4O3q2O5j01n3L7L8J6J75m9l54K97Q0q1L9l04L37l92M75
3013B50j82j37J07J31l10Q1J93q1K54m90L21j95K39k46Q2k10L68j44p5K51k26
3034a9J51l16K85J9j53Q5k47L98j04p9j5m2j3j31K92m03K81l26K16O6R1M2k48
3057a70J20n1J46j57O6J36m6N4k9p5n6q3L7K47j99J16j4j09K15k51L61n41K60
3080b3J34l16L24%l2r3J52j07J29j59L7L06k64j79n2L38j03k67J45p8K27j16k4
$$ y = [108, -72, -37, -96, 77, 227, -52, 206, -226, -181, -229, 5, 103, 83, 72, 64, 207, -320, 45, 112, 27, 16, -68, 41, 47, 212, 12, 163, -48, 184, 178, -146, 132, -33, 393, -205, 95, -47, -63, 269, 172, -2, -145, 99, -35, 74, -12, 41, 88, -191, -49, -136, 42, -231, -153, -223, -65, -49, 206, -13, -127, 52, -13, -79, -176, 113, -142, -200, -98, -302, 5, -183, 139, -76, 276, 68, 44, 107, 25, 90, -11, -64, -27, 11, 27, 202, 153, -201, 96, 176, 95, 134, -170, 167, -225, 250, 68, -69, 38, 169, -141, -60, 133, 52, 306, -184, 137, -58, 181, -65, 17, -193, 175, 31, -44, 207, -19, 132, -184, 101, 120, -33, 52, -195, 203, 99, 20, 5, -37, -50, -181, 111, -292, -11, -337, -121, -55, 36, 78, -170, -50, -101, 45, -112, -46, 90, 44, 98, 69, -6, -62, -145, -108, 139, -60, 56, 42, -67, 148, -103, 258, -283, -23, 111, -205, 119, 119, 87, -6, 146, 39, 168, 9, 46, 352, 88, -91, -143, 195, 92, -175, -30, -108, 119, 3, -21]
3103b1p1J07rk47K34m8J7l80M51n75N72j63l5n4J04K62l43J90k47M00m32L65j21
3126d4k13L97k57J04JM5l29J37J37n6J26n77O76l35K05o7M1P2p3P8l06L05k07
3149a40R8j30M9J19rl9n8K95k47O6k52K13K88j65M4n0J02j74J60j81L5J2p0n2
3173h6L9K98m38L15j09rJ40k97L86l47M4Q3K23k14J2l7k06M14m09M56l76pkKJ20
3198ej29J65m43K80m1J2oL4J64mk5K0r7n3K33k50K33j9N4M5k91L67k25j50K25
3223I4k39K10l4K9K5R0k46J53l3N7r2PN6n8K83l63K83j41p5J44J4j12%J55k58
3248e1J4J51j86J97j87J65j28J8M0j69j49N93l99k12K27M6q3J5K26j96n4K9n7
3271a50J94j02K81l34n7K07k6R8l60M31k98L58m68K89r2K44j75j60M7k5K91j02
$$ y = [-21, -92, 15, 6, -241, -7, -55, -38, -418, 33, -542, 30, -133, -168, -222, -118, 144, -199, -9, -256, 144, -288, 77, -44, -257, 140, -117, -13, -12, 33, -296, -159, -22, -78, 48, -529, 147, -188, 17, -50, -9, 63, -10, 68, -238, 67, -140, -42, -172, -123, -4, -13, -52, -110, 185, -62, 4, -248, -35, 253, 88, 132, 82, 184, 10, 170, -11, 24, 36, -34, -86, -47, 251, -187, 128, 19, 10, 150, -147, 239, -108, -64, 19, 242, 28, 40, 3, -203, 211, -198, 258, -118, -125, -127, -125, -5, -134, 31, -412, -132, -173, -161, -167, -133, 31, 27, 2, 22, -75, -128, 105, -145, 88, 69, 123, 168, -123, 244, 19, -131, 94, -145, 65, 31, 60, 85, 175, -71, 82, 49, 106, 14, 21, 77, 19, 302, -61, 222, 81, 6, 150, 164, 52, 52, 207, -51, -37, 114, -72, 125, -62, 103, -25, -7, 33, -136, -285, 308, -91, -303, -76, -30, -113, -98, 128, -68, -122, -93, -150, 44, -58, 223, -111, -168, 39, 13, 111, -249, 182, -116, 242, -226, 63, -29, 215, 40, -120, -73, -98, 193, 91]
3293I1M8j14Rk17K84k44J41j24PK95l13L58j43k10L11j48J24o0oRm6R4l80K07
3317b7j72M55l85P1J28J19o4k40rM6J02p9J28M7j50j12J27j27j04K22j86J79P1
3340D0K39k73j11K28k65L05k88L03l43k3J81j41J77j63K85j55j76J75P1p6M1j92
3362a61J93M9r2n1N4mP0p4J09k4Oj17K31l22K67k50J32K74k82K20l62K24k60K23
3386E3R4n3K00k95M9k14M56j65j51J08j65L11m27L86n10L09L9LQ8j24J02k74L39
3409A59j17J68k97J09p3j58P6K4J59j03J06l35J03J2Q9J47k02K50j13J46j70P1
3431E1j7J47j15J60j29p8j42m0Q3j17J65J33j45N8LR6R3j04j61J72o3j64J15j16
3455a15K33j43J82N0l26J4L1J53j34M7J92M2j40q4J14k03K26k58l0L09j51j3k59
$$ y = [91, 139, 25, 34, -183, 101, -143, -2, -126, -119, 176, -137, 221, 78, -132, 179, 31, 155, 95, 89, 98, 52, 146, -234, -27, -199, 256, -129, -58, 70, 189, 125, -115, -124, -78, 24, -55, 73, 120, -30, -142, -15, -142, -246, -24, -210, -31, 40, 279, 6, -105, 123, -142, 163, -125, 178, -165, -188, -7, -148, 29, -134, 151, -4, -180, -5, 66, -10, 31, -161, 32, 81, -11, -62, -8, -12, 58, -16, 93, 69, 75, -42, 189, -133, 134, -116, 16, 290, 8, 228, -134, 90, -170, 53, 147, 94, 294, -1, 48, -166, 290, 125, -26, 82, -83, 228, -199, 187, -323, -14, 25, 28, 116, -8, 94, -180, 159, 42, 210, -87, 22, -51, -209, -133, -109, 50, -53, 53, -282, -179, -167, -78, 69, -133, 117, 4, 150, -20, 51, 34, 181, 66, 226, 97, 19, -123, -163, -80, -197, -32, 101, -44, 14, 17, 113, 206, 102, -59, 113, 50, -114, 1, -115, 118, -25, 157, 207, -119, -105, -74, 79, -55, -8, 184, 226, 86, 2, 116, -87, 139, -119, -149, 160, 9, -4, -263]
3478b63J91Q8O0n0%N9j80J92J74k78l2Pj04j5J2P5q5MK59r1K54m15J90l01M8L83
3504A82k7j27p6K45k56kkk2j0O1K47j68Pj74J48J67jrm65L87j95Q6lM0O0J48k23
3531A8r3K29l25K3O3m1L37k24l5qp0K7L8J20%o7MJ60Ppj45J87l75l1j42N30K3
3558B03k40O1P7J4K6j01no5J28j22J20k52L8k2J12p9K3J38j63J33Qj39J84J92
3582B69l53K9RO5k3j63N7r1K21m8J8j28Q1K1RO1j46J85O2M8j87J92j1j30k5n5
3608c3J56j28n2Q1J49O2l01K99l53N7pJ29L05l03K4k55L79j32m8j24P8J99o9q7
3632B6J9lN6N9k06K01j08j5pJJ05m07K04j7o8J63J6n7j33L90k91k49N06k67K17
3657A35j42J08j31J91j80L3j1o0K4j27L50k52J25j29p2K69J7J8j26J03j58J22
$$ y = [-263, -72, 16, 76, 26, 26, 85, -95, 97, 271, -7, -39, -32, -136, -151, -139, -64, -149, -145, 114, 23, 277, -138, 52, -249, -201, 182, 155, 28, -48, 197, -59, -61, -63, -85, -95, -34, 213, 45, 52, -122, 26, 193, 192, 183, -282, 105, -90, -4, -7, 33, 93, 241, 18, -75, 154, -171, -148, -85, -126, 211, -13, -48, -56, -126, -99, -61, 59, 59, -8, -4, 156, 163, 156, 11, 198, -177, -208, -350, 180, 203, -37, 24, 101, 115, 141, 40, 35, -30, 98, -24, 96, -156, -118, -140, -28, -107, -84, 54, -109, 24, 32, -107, 77, 269, -84, -55, -46, 19, -4, -167, -110, -201, 20, -28, -10, -138, -57, -36, -27, 34, -112, 73, 135, 183, -4, 188, 177, 47, 22, -33, 123, -5, -57, 24, 173, 235, -66, 233, -120, -63, -70, 59, 364, 61, 85, -170, 209, 77, 29, -95, -17, 182, 113, 26, 45, 42, 98, 157, -49, 152, 44, 29, 22, 23, 128, -279, -75, -92, -160, 3, 19, -38, -171, 219, -72, -321, 185, -82, 135, -7, 101, -30, 161, -19, 14, 3, -57, -33, -160, 190, -62, 63, -66, -138, 131, 148, 166, 40, 143, -15, 107]
3679A07o0%o6j28J61M4m5j36J53O6q5j14Q1L4Q0M8k31J64j95L12j43r6M5M0Q5
3704A21j98K35l56M1L57j36J26r4n6p6N4j41L17j47j8m7k29r2M33m9k90N0K00
3727Ej78K99k35J59q9J46o2p4L15n27K49nP0r6K6k10J56p8Q8j30K01R2j45J26
3751A03j38K8j03o3K58J1j8p3K94j43o8j18K16l14k5M44k42ML7k48R9M8j41J83
3775C1M7j73lj99L28k8k08J94j12J14j77L53k28P8j85m6M22k73R1l4m3J36m4j39
3799i8J79L5l26J41Q3LNP2pj71J68q4M0l06P9J82k0r2j10K25j57K71o7J04k26
3824g7j46K02r7J33J34j26j8J17j01l1P4j6K17k30Q8k25K64m0m9j03J75p1j86
3847a12J41j44K30k19j74M79l41m0J32K14k34K3Q6j49rM2J01N7k15KL2K39j9r7
$$ y = [107, 47, 47, -19, -147, 14, 58, 13, -123, 30, 96, 11, -103, -22, 12, 92, 140, -91, 73, -122, 190, 47, -49, -4, 36, 121, -77, 158, -198, -157, 200, 64, 190, 96, 40, -36, 18, -123, 194, 47, 29, -18, -247, -339, 94, 45, -245, -195, 5, -173, 126, -109, 50, -39, 107, 45, -29, 286, -241, 8, 3, 73, -23, 3, -207, -51, -129, -41, -171, 30, 122, -23, 103, -35, -7, -110, -173, 85, 96, 78, 5, 299, 156, 88, -30, 186, -128, -153, 291, 49, 53, 90, -158, -59, -11, -152, 31, 78, -95, -98, -297, 31, 3, -205, -11, -123, -9, -186, 167, -61, 17, -168, -214, 208, -65, 26, -8, -51, 85, 41, -98, 81, 116, -210, -69, 14, 17, 22, 94, 87, -84, 84, 0, 40, -266, -187, -5, -25, -117, -227, -2, -159, 112, 45, 149, -77, -223, -21, -118, 15, 149, 23, 5, 122, 21, -10, 64, 48, 265, 35, 123, -102, 162, 122, 73, -30, 145, 74, -112, 29, -115, 115, -104, -278, 201, -140, -180, -48, 166, -68, -45, 41, -108, -117, -75, 26, 83, -132, -130, -98, 141, 122, 25]
3871B5o5J92k88K64j94J69l17J26M71k94j51Q3P1j19J32k21J09N2o5J66j87K04
3893A63l64K50J42l54K36m2m3j18L77j32j47K04l6j45K3J27qO0r5R2j56j7J40
3916A57l76J60J12j83M7L12k32R8r2P6j72K2K1J06o6J00M7l10m0J1j67M90q7l7
3940cM0rj6k51L88j49J54j74J18J40k58l42L83J18k52N6k59K90k02K13J64l31
3962a82K71j45k51N02k50q1o8J56O0l7m5K19k85K11j68j26J02L4Q2j46K51j69
3984f5J16j1J79l1o0k12L05k28J21j37L7%k2j44K08Q6r4r5L36k08Lr3J83p5L1
4009A30q2ok29k12N24j99p7J02l3L07m49L31j27K5r7j38J55J48j68J63J08L5k00
4032A1lj9J45q0k73J99pK35q3j01k64L30k43M11n45L81L8j66J68k39K45j10l09
$$ y = [25, -40, 152, -136, 128, -66, 103, -214, -88, 383, 89, -62, 21, 92, -27, 105, -116, -7, 45, -20, 146, -41, 163, -201, 49, 191, -163, 73, 31, -12, -130, 247, 115, -32, 172, 136, -9, 14, 141, 133, 193, 98, 190, 34, 17, 157, -219, -59, 53, -130, -83, 229, -3, 95, 3, 79, -93, -71, -50, 56, -10, 90, 137, -173, -213, -202, -369, 121, 34, -3, 37, 28, 12, -239, 149, 0, 154, -20, 98, 238, -20, -362, 21, 139, -113, -57, -316, -26, -228, -15, 149, -182, 89, -56, -307, 195, -55, -136, -204, -48, 12, -25, -70, 149, -136, 75, -93, -219, -117, -83, -1, -147, 104, -65, 51, 40, 219, 188, 128, -84, 221, -7, 114, -23, 14, 14, -8, -152, 56, 142, 48, -47, 289, 81, 84, -9, 174, 99, 130, 48, 42, -187, -399, 125, -74, -151, -49, -82, 225, -224, 107, -20, 5, -92, -230, -75, 73, -95, 68, 176, 211, 11, 8, -11, 134, 54, -219, -20, -27, 208, 125, 24, -240, 90, -153, 258, -287, 94, 132, -34, 134, -105, 140, 30, -279]
4055b79L99R9m16J44M8M4Q1k90J82Q8j1J14JL8j82j14j57K17k61K02J05n3j6O5
4079D8k06J69lr0J82m6l1J9l42K89j07j02R9P3lo1J69j18l7J07K01l35m0J44J17
4104I6r7k06K54j65J27R6j15J48k07J93O9q8kJ14l36p8J60k3K01j66j95M2M23
4127B45k38J05j85K49j82Q3rm8Nj5J02j00p4J29l16J84j07L31l54K67j01O8Qk11
4151a64J45p8K87j34J33k96J97j01n1K98l41N32n52L92l46K06k45r7K24J34P6
4172B19l25J15J35j22k3L3J28k89O9J41J26j28l17L58k63J86k53J62M6J23k10
4193h9J03j10L09m2o7n8p7j05N4Q8j6j96K85k82K25p6J24j07LK17j57j7j47L3
4217a05J39k76K50Q9J62j59k76M21k95j2J46J88m33J2o8K86j40N2Rm3j12M26j60
$$ y = [-279, 120, 219, -197, -53, -5, 39, 120, -170, 12, 100, 89, 203, 204, 242, 60, -54, -211, 6, -255, -53, 52, -1, -17, 48, -158, 11, 8, -82, 100, 54, 23, 42, -300, -11, -118, -220, -121, -48, -51, -112, 57, -61, -98, 9, 210, -125, -165, -21, 96, -1, -207, 47, -118, 9, 105, -10, 138, -69, 124, 193, 105, 103, 217, -119, -197, -37, -60, 141, -25, -220, -178, 245, 7, 112, -73, 176, -6, 77, 68, 20, 25, 10, 112, 12, -62, 67, -249, -65, -172, 159, -195, 72, -29, 39, 47, -164, -19, -97, 190, 56, 189, -107, 90, -11, -62, 236, -105, 427, -125, 267, -79, 127, -118, -215, 9, 143, 219, -106, 9, 144, 22, -1, 32, 160, -129, -60, 81, 207, 79, -238, 120, -143, 43, -210, -48, -2, 121, -89, 14, -96, 213, 171, 104, 46, -31, -136, -82, 6, -10, -206, 79, -203, 22, -54, 70, -37, -34, 183, 26, 9, -138, -105, 34, -242, 8, 97, 259, 100, -176, 245, -50, -62, 84, 272, -161, -149, -217, 69, -71, -19, -10, -53, -165, 261, 101]
4240A01k60K08mj59J40J17k87Q2N3j30K05p9pK0n8Q1j06K64r8l2J52r7l23J81
4264c6K38l00J80l11N41l76Q3p4J5K35k72q5K71j69O6J05r1j4L9j39K8p6K33O1
4288A52j65O0J18p2j40J26k07J60n0R5n4P5k18J85M0j40k09J76K16r1Q8j83l4
4311g2P4J35l1k49P5P2P2o0q5j00j1K23J68m2j86p4K08m1j54J07k02K58k5O2l6
4336H6J03n5k47J24K3k1m1J29L4k78jj18K97j33J88l7j59L31k91lK57j97nO8J5
4361F9Qk30J50K68o0k91J5n1L11k14R6k01K04j82m4L54J8j04j86J05m2jn4n7L08
4386A89l56K18pm6K12k73j3K5N7O8r7K41m06K72o8M6k53J40k25J91K24j53PJ73
4410A66k42k24N07l11L30k05k43K41m2K91k98J73K23k66k6j12K04k14O0On4N5
$$ y = [101, -159, 49, 45, -114, 26, 143, -144, -62, -9, -139, 66, -13, -20, 0, -58, 23, -83, 181, 83, 51, 203, 106, -217, -36, 202, -98, 82, -229, 312, -64, 19, -55, -40, 195, -77, -162, 109, -60, 6, 111, 20, 6, 45, -94, -66, -142, 91, 152, -13, 47, 165, 93, -47, 79, -128, 32, -18, 77, 23, 98, -120, 65, 105, -35, -244, -68, 148, 57, 145, -38, -72, 2, 137, 106, -143, -68, 4, 76, 16, -69, -169, -180, 43, 211, 169, -17, -91, 117, 76, -78, 29, -173, 85, 60, 122, 86, 189, 134, -113, 11, 34, 13, -28, 101, 135, -143, -144, -262, 35, -98, 90, 53, -106, 225, -66, -69, 188, -9, -14, 54, 69, 77, -153, -3, 265, 205, -86, -71, -122, 189, -25, 71, -130, 74, -108, -152, 202, 220, 116, -70, 35, -7, -8, -62, -119, 189, -167, 51, 44, -2, 210, -63, -76, -51, 6, 74, -23, 218, -188, 84, 16, 62, -191, -51, -276, -85, 139, -14, -7, 166, -76, -300, 207, -104, 226, 21, -222, 19, -23, 268, -30, 143, 366, 100, 74, -38, 166, -48, 12, 18, -36, 19]
4432A9L10k74q1J2j39K17Lk89K13R2k3J51J2k39K90k26J21k45J12Q8j9J13j75
4455D3k10k13M24l2R1N8j32J1q4J3J82k0j38K6n2J88j28o8MK3L5J38l11J32j7
4480c7m3MK01j96L7p3J31N7Q1j33O9p8q1J05k21L35l27J89J93l21J60p5O5p6j68
4505b02L23k91J17Q9K85k76Q0j28j71J46P1p4n5K60k04K50k66M1j09R4j47L84
4527B17j52j96J56K4J50k62K25m1k7m84L57P2R7r4j09K26k26m8K1K15Qk91L86
4550B24k68K4J39j43QM8M3l33J40J45m1Q1k0o4n8J44j77K78q6p3k8rj9O5K1O1
4576A02J39L2k38j33K62j76J4J87k03J72j36K65k36L7j94P9K62j48j04J74j62
4597el7p7K06r7J3j32J17n8R1M1j44M1k18M60m01K08m6k5J47k6n8Lj62K20N9j37
$$ y = [19, 329, 55, -26, -14, -153, 64, 67, -222, -9, 83, 60, 211, 223, -16, 274, 48, 169, -76, 36, 124, 105, 218, 43, -167, -380, 44, 12, 103, 161, 29, 40, -44, -31, 151, 131, -7, 19, -33, 155, 27, -41, -37, -14, 21, 159, -152, -20, -37, -80, -76, 125, -71, -34, -107, 24, 81, 162, 29, 98, 20, -61, 44, -177, 158, -169, 20, 213, -108, 52, -23, 42, -34, -202, 121, -170, -53, 36, 321, 45, 125, -3, -174, -28, 43, -31, -86, 174, -30, 220, -46, -5, -114, -20, -167, 217, 65, -131, 25, 49, 199, -63, 162, 121, 94, -390, -33, 39, 136, 42, -67, 159, -67, -115, -94, 121, 129, -162, 224, -44, -20, 119, -24, -16, 32, 75, -258, -118, 27, -14, 67, 47, -17, -75, 69, -108, 170, 84, 11, -17, -26, -45, 20, 41, 102, 241, 273, 35, -98, 164, -12, 2, 189, -14, 158, 22, 287, 51, 88, -106, -27, 235, 87, -17, 157, -5, -42, -119, 87, -10, 3, -129, -12, -70, 21, 62, -82, -41, -259, 201, -200, 8, -38, -63, 84, 58, 0, 3, -159, 61, 120, -17]
4623a7J42j33J56l8k31K9PL82m19J48j21J07K68q5j65p3K00k23J39K07P0j50k93
4646i3l3P5J79j82J96p7j35J73k37J39PJ4kp9J68k74K23L8j58J37o6j08J07J45
4670A57j53Q2p9N9k11J28n2J10M5J38l7j47Nk69M96l33J82k72J48k43K78j73L4
4693a07J38o9J47l53J31K01nj66R7j40J6J81k04K61q6p6k2J15J94l34K00p1j16
4716f8J28J08j7j24R2k35K48p7j14K69k28P0q8J33o3J50j82PKk00K70j70K80j15
4740G6j10qM6J7j08J15q0R0k6J31m3p4Q6k8j24j6L7O5j74j29J62J06lJ6L8p5r3
4767a06PrK81k42K05j42J67l5j89P7j13J28Jk7r0L45l19N0O1k8l64K82j58L07
4791H9Pj20J38m2k52M48k09k38K52K34q1p9j46mR0O7j33P1k37J12J59l95M27m03
$$ y = [-17, 125, -8, 148, 110, -121, -92, -85, 297, -122, 26, -95, 12, 280, 195, 30, -43, 157, -66, 73, 280, 350, 200, -93, -126, -51, 128, -54, 142, 65, -70, 103, -134, 5, 12, 26, 24, -55, 113, -161, 62, 100, -58, 79, 13, -95, 12, 157, 4, 86, 7, 66, -145, -17, -69, 41, 86, 224, 187, 40, 45, -224, 272, -61, 121, -151, -3, -246, 32, -141, -107, 31, -38, 109, -244, -113, 88, 83, -83, 14, -126, -110, 71, -133, 128, 42, -34, -56, 59, 253, -81, 119, 48, -68, 60, 168, 151, 27, 119, -116, 132, 55, -59, 210, -18, 52, -36, 97, 34, 184, 2, 9, 11, -189, 81, -89, 191, 76, -34, -42, 4, 21, -87, 28, -52, 38, 12, 143, 100, 26, 112, 84, -40, -56, -19, 46, -128, -257, -95, 11, 8, 24, 62, -13, -106, -99, -108, 173, -69, 136, -6, 161, 126, -63, 14, -99, 29, 30, 3, -87, 258, -61, -11, 50, 22, -342, -60, -218, 89, 96, -24, 114, 72, -180, 268, 59, -179, 73, 307, 226, 147, 1, -3, 87, 154, 21, 92, -145, -33, 126, -269, 158, -245]
4815b45L43J12k2j72Q9l3l8J23k88K06Kp0j35K09o3r1J30j45N1J75k61J68j35
4838i0P5Oo8K09j4M5l82O1J86O0q6R6k15m3J06J45qjo9j21j47L65kj6JK7j9k71
4866a70L31p8j93J41n6o2P4j16K35m5j10Q6J6k01K27j37J29P4j58J06k51j97J92
4889a63L65%j47k8j49L0O9J29j07j0P7J1k71K15l8L6J81j41Qj44Qn3J20P1o2j25
4915a18J40r9K21k40L6J65k36K32lj86j69K72j50QP8K19j72p1PN0J27j08k7j9
4939d3N3o0K19j72j70J24K4k6J29r1N3J31l00J12q5J70j6j94q2M68k80KJ12l11
4963b33R3K98j62j04J60PmJ50j01l03K19N8j0j06K97l65J59j60M9K81l23J59r0
4986c1oJ33Q9l51K65m3k15K7J03J4o0L01k26M2Q4R6m23q2L3K24L17l86K8l4J63
$$ y = [-245, 98, 210, 188, 16, 105, 72, 34, 157, -131, 75, 77, 7, -128, 81, 18, -73, 57, -88, -37, 138, -123, 45, -90, -15, -9, -77, 132, 118, 163, -219, -158, 28, 88, 2, 98, -117, -160, -54, 91, 83, 82, 13, -108, -255, 110, 108, 92, 93, 120, 101, -170, 161, 83, -110, 31, -25, -87, -13, -129, 106, 61, -49, 37, 53, -148, 79, -58, 71, 145, -13, 93, -158, -355, -163, 202, 202, 55, 27, -122, -92, -23, 106, -1, -11, 66, 77, -194, 21, -17, 19, 200, 59, 67, -77, -69, -122, -2, 69, 7, -118, 22, -77, 144, -96, -60, 105, -131, 101, 98, -88, -257, 15, -135, -127, -49, 170, -2, -73, -66, -16, 111, 3, -24, -43, 10, -50, 169, -3, -173, -49, -25, -51, 78, -13, 40, 171, -129, -17, -102, 68, 52, -142, -224, 244, -36, -34, 78, -233, -140, 158, -4, -108, 52, 59, 55, 205, 104, -199, 20, 78, 68, -38, 259, -106, 53, -107, -58, 223, -100, 59, -31, -37, 96, 185, -166, 99, 56, -159, -132, -29, -15, -75, 226, 0, 42, 126, 222, -201, -283, -250, -26, 291, -95, -67, -101, 62]
5011F2J55qj30j31J35j75K1Q0n8j24J15J91j31m4J9j72J60J40Pj70J27n1j36R9
5035a9J13l28J04K02P6k46%Mj21L1J20lP2j32J50O2J17j47M2j75K04j82J07k11
5059a60L3K56k0J1k32M0J78k31J29j64J65q8K01j68J45nNOL2k04j0N4R0r3j23
5084a53j4L95k33K27l37J97n9J01j69M29n56J72Q8j79k9J43j08n2J06K31m28O9
5106a59L79k04j12l0J52l8m1K2o1J87j41q3L94j64o5j43J52j32J07k55J98K29
5128A92j97k0J02Jq7j74K29kJ04l56k6M57k53n0M9K05O4j31k74J76J11j42K38
5151B16j06k94J49n3L34j85k99K71j67J86jM8j14Oq4m4R5J40O2k01K05m6o0k1
5175C7K3J55l06K56k54K60k16J83k09N0n2L85k62k38M91k93okr0J28R5k99K2J2
$$ y = [62, 217, 209, 79, -52, 83, -92, -71, 9, -49, -173, -58, 133, 2, -42, -23, -195, -35, 105, 112, -58, 69, 18, -118, -19, 94, -234, -130, 72, 148, -98, -98, -94, -215, -184, -64, -67, 5, -127, 23, 85, 202, 55, 97, -78, 126, -56, 51, -160, -127, 129, 109, 120, -112, -72, 106, -125, 4, -160, 5, -83, 118, -50, 95, 90, 95, 101, 133, -71, -81, -27, 63, -30, -153, -167, 228, -5, 222, -115, 82, 23, 124, -45, 384, -172, 0, 88, -91, -120, 23, -85, -137, -31, 200, -228, -159, 220, 16, -96, -126, 26, -12, -53, -31, -92, 95, -46, -129, 265, 101, 36, -107, 45, -87, 20, -235, -37, 192, -5, -25, 77, 78, -9, -183, 46, 44, 148, -208, -234, 223, -30, -80, -31, 174, 238, 107, -167, 9, 120, -22, 216, 110, -184, -35, -88, 246, 61, -238, 33, -134, 52, 51, 99, -15, -9, -93, -137, -42, 98, 160, -41, 164, 118, 58, 37, 60, 215, -91, 165, -89, 171, -45, 138, -71, -21, -73, 312, 50, -188, 303, 10, 4, 2, -88, 40, 135, -164, -142, -130]
5199a30K11j15k94L24O9m8J16m8J6J31l10N8j4j61O9JJ2r3J66n0J89J42k52J57
5223A46j79L0K07o7J7j95J34k23n3J55J78j37L65m18k7K2K9l6k7K93j08O7Kj40
5247C5k81P6L24j40r8K33j50L11j01l10N8J08l5L6j09M2r4L2j39J92J6M3lM8k39
5272a45L17l89J32J64j92K39k90j9J83o7J33Mj36Q5p6J50j31j94K91k15K03J80
5294B27k77j14Q6J01m0J09l26J88J52k18J68K3q1O8K7l47M03N5l16K04o5p4mn8
5318a09J76Q5j15j09N3R4j71K80j72j21o5J27O6m5K9j9j13K07k75K7L33l03J06
5341c4q2N3K4r3L10J65l34mj11K18o0q1l4R5K1j22J67j00J54m2k22J29q6q4K15
5366F2Pm7K0j36K11J80l25k29K62J50k46N9q1J52k05J53J2J73m59N88j48M7k79
$$ y = [-130, 81, -34, -328, -4, 65, 17, 133, 85, 101, 232, -78, -20, -34, -195, -126, -125, -113, -206, -40, -90, 99, 241, -11, 146, -33, -3, 204, 137, 154, -41, 93, -130, -183, -28, 150, 13, 378, -40, -67, -45, -16, -52, -79, 214, 106, 173, 175, 35, -246, -170, 154, 14, -84, 149, -1, 310, 209, -101, -43, 65, 30, 66, -43, -1, -95, -63, -202, -10, 6, 49, 46, 94, -145, 172, -217, -85, 79, -113, 126, -164, -183, 0, -67, 66, 70, -66, 19, -57, 93, -38, -232, 59, -156, 47, 227, -50, -164, -78, 23, -17, 92, -234, -46, 106, -112, 56, 79, -2, 66, 93, -254, 149, 204, -112, 92, 27, -47, -51, -109, 67, 152, 37, -72, -19, 75, -96, 184, 12, -109, -174, -47, 19, -26, 3, -16, -129, 78, -197, -170, 163, -140, -34, -116, -63, -39, -132, 178, 343, 9, 5, -106, 112, 52, -29, -63, 32, 53, -69, 98, -2, 152, 110, -112, 17, -69, -153, 62, 69, 22, 42, -94, 117, 297, -28, -257, 5, 155, -91, -32, -113, 39, -166, -13, -1, 172, -287, 301, 153, 200, -79]
5389g9J77k10K63j49J07qj25M0O7Rj49J41j75mj9O8J09J37j50R9q9m1j4o5M1J39
5415A20j48J44k01J69k03N7o0L65o5j47R1k20j6K6k4O7J34j16J35m4oj24Q5JL3
5440E3K5k57%J91Jq8Q0p7J21J41k92K69k35RK3K20q3m02L89j43Q8J57k41L7J26
5465A12r8j37K94k48k00K00k41N32m9m7j12R3K9j54k1J52q7p4p8O4m9J97l37K72
5489A3r0L7L25l99K48j50O3l15L30r9l3J66qn1k39J28j1J31j56K19j20L8K2r1
5513d2K7j41L37k15J37k68K68k00K65K8p5K5q8J23k27K61k97J65k21R9j57K88
5535I2P3Q9k30o8J50k28N0J71k60L89n08M40o6j13J47J0q1J5m3r0K77j25o9j70
5559a48J86k22L06j94J95k43Q4J67l12K18K00k67O3K57k11q7K26k02jJ20j10k52
$$ y = [-79, 98, -112, 151, 2, 109, 101, -24, 16, 83, 92, -57, 84, -91, -95, -114, -46, 63, 200, 50, 149, 60, 19, 5, -60, -19, 120, -28, 116, -85, 84, -119, -62, -122, 243, 178, 31, 122, -98, -114, -88, -112, -45, 89, -27, 108, 64, 58, -66, 19, 20, 53, 78, -179, -179, 12, 13, -75, 5, -72, 49, 190, -102, 167, -68, -59, -36, 184, 101, -301, 88, -55, 33, 190, -51, -14, 112, 14, -123, 171, -77, -277, -77, -318, 214, 165, 118, 6, 99, 128, -26, -47, 105, 18, -56, -134, -70, -119, 78, -259, 13, -77, -40, 285, -114, 134, -16, 47, -268, 62, -37, -70, 96, 88, 37, -202, -74, -85, 46, -110, 109, -11, 27, 49, -42, -15, -156, 181, -34, 103, -165, 103, -97, 168, 196, 121, 146, 58, 181, -46, 215, -82, 83, -138, -39, -196, 92, 165, 254, 24, -44, 106, -122, -72, 99, -161, 228, -280, 160, 94, -19, 128, 138, 57, 72, 29, -61, 216, 91, 22, -148, 38, -184, 122, -72, 123, -120, -36, 131, -181, 37, 237, -30, 33, 290, 79, -8, 218, 16, 15, 135, 25, -227]
5581b27L30o1%O5j74Q3L3q9J51O3k85J76M9l61K84k25M61j49j51j4M3J52r4r3
5605c3j8N8j5k16J42J47j95J68j41M8m4L58j95j13j23J52o0K2R2p2N4j18L72l99
5629a29J73L7NJ50k95K83k17o3J56J51j56n8j80K18j37K00j90K3J34O3j74o8J02
5652B8n8K9J40k20K78k04O1J16j47j14l8O8K59j96lr4O6j70K11onN2o8m8j68L95
5678A64k69k1J11M1L1l7j40J31q0J18k92J63K50j01J06O2j39k24P3J47K94k70
5700A18p4l9j41L04j89j35J19PN3J10o7j64J20l3J65k03m1J03R1j41J61k32K19
5723A11q3k56L48k72J13j40K64n2q9Ln4K33j35p5J33k10K67k69K12r7M8j87J09
5746g8Q1k52K60K87j79k47m7L35l33L85p2LL0j73j05M7q8k64N20k21R1P3M2j2
$$ y = [-227, 103, 42, 42, 107, -67, 16, 49, -40, 111, 174, -111, 65, 114, -247, 37, -188, 273, 124, -27, -41, 2, 154, 60, -33, -51, 7, -8, -224, -82, 65, -130, 38, -103, -55, -99, 259, 64, -49, -172, -20, -80, -58, 34, -38, 16, -102, 270, -129, 44, 81, 86, 236, -59, 224, 7, -56, 100, 251, 95, 37, -143, 75, -62, 138, -52, -29, 105, 168, -6, -74, 28, -30, -1, 139, -81, 197, -7, 54, 170, 23, -91, -129, -61, 198, 2, -1, -95, -29, -199, 12, 6, 1, 53, -15, -63, -231, 164, -105, -126, -15, 26, 57, 20, -120, 11, -69, 49, -243, -80, 170, 69, 175, 237, 98, -126, -53, 94, 388, 118, 44, 5, -136, 168, -21, -156, -37, -30, 23, 133, 66, -98, 22, -11, 154, -49, -90, 13, 104, -37, 124, -108, 111, 28, -228, 120, -152, -39, -179, 85, 33, -56, -53, -107, 126, -9, -84, 49, -161, 106, -163, 49, -48, 0, -187, -78, 3, -249, 11, 298, 119, -128, -175, 160, -173, 212, 140, 143, 173, 0, -105, -58, -146, -410, 110, -111, -20, 53, 95, 83]
5770H3j10q2L1%K25l39M69k46qK16q0l67M75l27L1kn5J11k10K42J1j94M05j36
5794A43r9j3j87K30j8J97k20j42M50j72m50J45M9K0l3K10J48k95q3J65J42k21
5816c4N0O2k14J27qK60k61J75j68m9J9N5%k23j1K60n9K11j58k13K97j37L1J82
5840A94j83J42j26J6j65O9N9j11J25n2p0J23K07l01K8Q4p0l2j16L18R9l23K12
5863A27l4R6m9k89R9J19p9P7J54k77Q5J69l67L10k15J51k56J3K49M7j45j67jK73
5887I0l4q1J25k8P2j92J84j10O3j42N1p4O1J21J5j55J09j06j54K16o2Rj58P7l0
5912a33r7K68O7l15K25k26K71k2o1j03J24j66M1K42k46L8J82k43J18P1r6K29k17
5935d9j0M4o4j9J64J4j82K42J3l41M39l43j19L05M9j39j05p4K40k14j10R4J40
$$ y = [83, -27, -109, -78, -78, 147, -192, 277, 31, 23, 239, 159, -208, 267, -60, -29, -31, -86, 25, -185, 57, 68, -126, 279, 143, 44, 31, -156, 74, 56, 253, 33, -109, 341, 169, -281, -136, -87, -67, -100, 110, 258, -37, -120, 45, 187, -34, 16, 78, -136, -9, -17, 243, -18, 157, -11, -60, -41, 14, 14, -209, -220, 40, -19, 192, 34, -179, 118, -19, 12, 194, 11, 153, 27, 43, -122, -53, 6, -105, 20, -32, -102, 21, 228, -73, -45, 39, -31, -63, -179, 139, 238, -85, 127, 93, 189, 140, -149, -50, 69, -10, 67, 221, -56, 29, 198, -169, 141, -74, 77, -179, -166, 83, 130, -15, -182, -183, 90, 56, -25, 100, 72, 144, -48, 136, 26, 89, -53, -2, -76, -15, 106, 121, -34, 75, -31, -185, 31, -31, -22, -180, -103, -133, -230, 38, 105, -210, 15, -211, 60, 38, -23, -126, -2, -168, -127, 115, -131, -93, 89, -154, -36, 35, -61, 168, -49, -59, -15, -79, -98, 66, 80, -102, 140, 153, -188, 251, -92, -211, 94, 143, 4, -101, -175, 65, -149, -259, -165, -25]
5958b5R6k2qK1L0k35J79K07k11k04R1j14J74Q2k88K63Q7k18J71jj94J36m03M01
5982A5J12j25J27k68L29J84l43M3j65J63q4J93k49J74n2K4J2l1n5j2J37j15j24
6005a10L6J69Q3k57p2J09m3J93j96%J9J86j1k98L89R8j91j67Or8K3K81k79J01
6029b9J00k7q4q6J8J11j85L23J23k41R3k6j32m3j10K92m6j34K01q6J58m2j93l3
6053g8J32o0j49K11L56m04N0M2n8q0J21l7L4R8j97k6nl8J99k11M7K00l14J91j01
6078g7P2j99K17j33K29l11J17K44N1l39R0J24j30J02o8K34l06M5P1k06L81l76
6100a68K79p5j53Q7L60l12Nl4l78M85k41J88k30K40k93M02j5j91J31r3o7p3K27
6123H1M1j67J60j45j35o3N25l46K27j23j41J4J82k03J02R3n6j05J57J64l52L98
$$ y = [-25, 71, 49, 41, 62, 92, -143, 36, 243, 32, -172, -81, -195, -21, 61, -227, 36, 123, -95, 76, 75, -119, 17, -386, 15, 127, 2, 129, -139, 190, 374, 31, 74, -91, 72, -12, 181, -68, 106, 54, 78, 90, 59, 4, -8, 129, 14, -110, -74, 95, 178, -79, -151, -42, -85, 108, -88, -88, -69, 117, 106, -192, 197, 295, 104, -63, -57, -155, -132, 149, -130, -29, 71, 44, -40, -126, -108, 3, -182, 141, 264, 23, 116, 90, -42, -85, -195, 97, 51, -83, 118, 32, 190, 148, -45, -78, 54, -6, -155, 56, 412, 8, 58, 100, 42, -38, 83, 46, 80, 178, -19, -45, -50, -88, 111, -100, -53, 147, -167, 24, -77, -5, -204, 13, -120, 109, -202, -85, 159, 210, -129, -39, 85, -45, 57, -11, 223, -83, -38, 33, -173, 208, -168, 111, 36, -117, -30, 330, 18, 23, -11, -389, 96, -145, 43, -187, 53, -240, 162, 147, -44, 87, -6, -73, -146, 81, 122, -45, 115, -30, -165, -228, 297, -49, 178, 55, -86, -72, 110, -93, 9, 102, 46, -59, 98, 262, -90, 308]
6145C08k61P8k16L11j84J20k46K61j34k2J1J37m6k80m0OJ68M3o1o3K91j53J06
6168A34j85j38K45jj6m9k3K17k15k6o1O1J31L2k3k38R9q6J33M0j47J01r4K75k4
6193A42m25K23J56J43j94O9j30j3O9K2k80K94k19M70k35Q1k37K11j24j35L41l19
6215i0K27j36Lk6J06l6p4Q5lp8J05r0j45R4R8k55J93J02R2k71L43k20L9k40K97
6240A20K7j90J55J74k92j83L96k85K33o1j95J60j72J50j74K92m82K58m1Q7P9K
6262E8j63J86j58n2J15j59L06j33j30J00o9K43q2n6J6j95J23J12m0N1k39K61j24
6285b9q1L10j42j42J18k9p5k0J25J27j61Q2O9k54p5J64K59q1j34J21k80J71Q2
6308A25j19j14J89j79J1R4q9K66j96l4K22j60o6O6K18j29l87L26n8L0J77j43K00
$$ y = [308, 47, 125, -91, 220, 36, 156, -90, 171, 37, 15, 26, 163, 117, -163, -203, -197, -29, 14, -47, -110, 181, 28, 134, -51, -189, 56, 55, 39, -10, -33, 184, -31, -57, -118, -57, 74, 106, 83, -155, -56, -142, -9, 31, -116, -15, -109, 166, 142, -283, -60, 96, 239, 45, 114, -16, -29, 40, 62, -218, 76, -143, 327, 92, 173, -64, 147, 23, -112, 229, -90, 137, 1, 4, -22, 84, 48, -26, 59, 56, -22, 83, -7, -152, -58, 40, -215, -22, 80, 172, -99, 244, 24, 63, -177, 120, 147, -43, 112, 286, -6, -189, 207, -78, 155, 94, -101, 59, -113, 37, -137, 155, -327, -69, -110, -23, 56, 58, -105, 81, -77, -129, -14, -173, 133, 0, -130, -30, -99, 144, 62, 6, 22, -173, -50, 62, 22, 73, -166, 95, -29, -110, 200, 58, -84, 34, 5, -70, -90, 35, 162, 1, 83, 152, -102, -177, -13, 246, 165, 31, 152, -128, 43, 125, 6, -108, 81, -98, -87, 7, -82, 184, -12, -46, 176, 16, -50, 16, 234, 105, -282, 44, -14, 16, 193, 50, 250]
6331B50j39l9l14L72j81Q7q7n6L8Q9r2P9K56k57K24k41J36k96L70j6j89k7p0L05
6355B02o2j73l4J01j8j68J81l8R0J2m7J92l42L26k31K8j00J64J63l00j21K32J15
6378A72J27k60J33r5j10J35M3j40R7k30M7K24j19P9m5J21l87J11J8L3q5J15J03
6401H7n2P1k30M5J64jj86J04l9N4j8l29K32J35J44k40O8j57J45M0K43m97J79N7
6425A9L00k48j95J01P1J13j61Q5m7j66J58J46k71J63j8k44J75J39k64K61K5j88
6447d6j7K0J76k40J21j7Q7k4n6l9L1P0J81%k14j44K03j32K75k38n1J82j53j21
6471a46O7o7J51O5k18K23k49L96j95o1j89K53l52L54k17K33j5P6k37K48l28K81
6493G3k9j65J91j9K5j60K43m54M74j04J54k61o3Q5P3J89l64K6o5K53j18j26K38
$$ y = [250, 111, 72, -242, 130, -51, 36, -51, -107, -69, 20, -72, 7, 263, 6, 230, -11, 125, -171, 199, 183, -6, -33, -103, 202, 140, -33, -67, 34, 16, -152, 29, -9, 81, 93, 46, 238, -104, 222, -9, 19, -81, 83, 246, -54, -175, 57, 172, 299, 39, 172, 77, -33, 102, 145, 5, 102, -128, -81, 143, 24, 103, 58, 179, -208, -97, -79, -46, -131, -16, 87, 35, 106, -124, -79, 85, 84, -102, 2, -37, 17, -1, -330, -98, 37, 181, -59, 9, -148, -3, 37, 280, -217, -38, 19, 319, 71, -124, -23, 48, 161, 0, 85, 38, -128, 30, 176, -95, 68, 50, -194, -19, 120, -144, 117, 142, -46, -63, -43, 133, -107, 14, -3, 84, 60, 4, -35, -4, 66, 247, 247, 33, -111, 92, -40, 235, -3, -54, 128, -25, -146, -79, -146, 5, 70, -148, 75, -174, 222, 27, -34, -223, 30, -322, 32, -185, 48, 33, 109, -128, 120, -208, 73, 44, -121, 70, 51, 76, -84, 159, -295, 179, 75, 229, -32, -95, -10, 63, 252, -112, -86, -151, 102, -16, -142, 96]
6516I6q6J33j60p8o9K01J62k3l31N12l14r1K27k98J1K04j03j28KJ09K85m38J50
6539b7j35K86r8j06L50l72J74r0p2J35J2p8M4o3K01M3j70K26j97r1R8J77k99L9
6563a3J21q2j09J13R2K3k39KK44k09K55k20j10J18M4Q2k67J13K48L1k94k1L4O2
6587A8Nr0J63j77K15Ok10J50j11j74K93p9j12J45j20J80k14K77k30J47J9j82J27
6610D6j64J42m7O1Q8j88k3P8J38k11M4K6j90K23J9L8J13j44j9j18L47k91K26k59
6634f5O8k0R4k37M3K92k08k5K40j03j50K50j94j25n3J60p6Q6J72j51NM1j5M9o
6659G2N4l3Jq9J33l19J37J05Nj9J34l2p9J71p7l35K82n9k13J70j93K21Q9N5m6
6684A35j09J43P3j17r9l43L45j7J37n3j23Q8o7j24K31J24j19j89J65R2l01l3Q8
$$ y = [96, 10, 143, -17, -95, -164, 37, 199, 176, -155, 357, 43, -48, 179, -119, -108, 96, -7, -135, -133, -24, 261, -177, -27, -162, 124, 26, -80, 270, -102, 72, -18, -90, 45, 57, -21, 23, -40, 161, 204, 34, 260, 63, -28, 70, 247, -52, -13, 108, 26, -83, 30, 122, 145, -94, -92, 152, -57, 198, -22, -132, -14, 30, 112, -155, -42, 206, 237, -57, -78, -44, 18, 23, -67, 96, -81, 134, 140, -70, 80, -31, -205, 88, 9, -103, 42, -78, 102, -112, 165, -65, 82, 101, -81, 46, -118, 24, -23, 38, 126, -62, -85, -7, 131, -80, -36, -10, -200, 23, 42, 80, 193, 49, 30, -88, 259, -32, 194, -65, 3, -17, 77, -160, -117, 175, -33, -58, 182, 79, -71, 179, -15, -140, -193, -33, -109, -23, 149, -2, 3, 44, 29, 78, 72, 126, 93, 94, 5, 138, -181, -44, 61, 66, 47, 181, 149, 70, 241, 164, -171, 111, 52, -161, 9, -184, 37, 126, 181, 135, 26, 169, 242, 125, 26, -317, 28, 11, 148, 95, -28, 60, -7, -131, 100, 224, 105, -84, 81, 173, -128, -161, -73]
6707g3R7j69J35kl3qr2L15j35o0J8j70J27J90j79p1r5L22q0j49m7J15j24L8l6
6732a66K46l0l06L16j44O2J36j02KnL9k9M3K3K5j58J82n4P3N4l03K36j41K33n5
6757A77l43L84K6J12j42k67J85k56l3O7J90j75O1P3j29q5K39j16J16q9n8J54j41
6780e0Q8l17J72n7O6J23K61k76P0jQ4k09R5J10q1K70j35m42J80J24j33K50k40
6803d8Q7M9o7N8j19J65J65l87k17M32k57J42J68q9J40n8k0o6j44RJ18j59O3K92
6827B57m13J82j2J07j38l1k2J75M7j50J4P1O5o6j19J60J10j6j27k98K3K23K47
6850B89l82L67l51N8L4j27j33J03K43k28L45k83K6J55j49j01k0M05k27l2p3R5
6872A4J58k75J00L2k37J17K3L18j84m13J79N3m5J43K19k84K14l20K88j6j83J51
$$ y = [-73, 24, -145, -10, -12, -45, -53, -145, 170, 35, -25, -7, -177, -50, 140, -39, -110, -205, 117, 37, -112, -159, -44, -168, -130, -166, 80, 50, -256, 60, -84, -22, 114, 12, 14, 9, 48, 19, 62, 85, 110, -48, 134, 80, 153, 207, -96, 140, -1, 232, 177, -166, 218, 244, 356, 214, -53, 132, -124, -157, -90, 100, -75, -14, 59, -70, -155, 84, -32, 84, -5, -63, 91, -50, 38, -279, -107, -164, -98, 25, 286, 10, 80, 79, 163, -46, 49, 159, 78, 348, 213, -229, -49, 75, -58, 192, -48, 39, 88, 21, 79, -40, 125, 290, -97, -314, 118, -139, 3, 171, 82, 222, 164, 144, 78, -66, -57, 61, -98, -35, 257, -156, 26, 14, 121, -17, -48, -70, 105, 152, 2, 16, 87, 152, 86, -33, 127, 237, 221, 94, -204, -181, 42, 289, -93, 274, -77, -19, 15, -112, -245, -142, 101, -127, 218, -65, -39, 116, -33, -134, -154, 251, 24, -8, -81, 14, 172, -103, -3, 29, -208, -91, -68, 250, 66, -347, -168, -115, -160, -17, 202, -82, 132, -188, 100, 84, -99, 52]
6894E2K6K8j72J15j77P5J22N2J21l49j45K03J41p8k27R0n0QK18j99J11O0J28j43
6918A0M3%M7n1j12k33K21O6j07K14K0k3k95O9j31K50RN6p5P3l1J54q1j02p7K06
6944A20r2J45k99K07j80N8QJ18R3k53L71m17J55Q0k46J36n7k0J17j37J6J33q5
6967b9R9j13J48R2q0o2Ok84K11k40Q8J48K35k33K36l98O8M5kj8n6Q8N3n1P7K11
6993B39k61J2K6K8J53k77n2J1J95lj27J24k17J93P3J9K6m21L05J4l18L39m2K3
7017F2k86K57j26J57N9l28N8O4j8J20J04P9j16k44N9O7L1J35L3m80L88j16r4M0
7041i5J91J90k77M7k54J96n3J80pk17n9K51jn5J25k70K00l61N9J84J6M0l6M6j90
7066a50K47j33J75p6n2J91k8o29M11n5J45mR8j07J52j84j59J59j07K38n4j23R0
$$ y = [52, 78, 106, -66, 49, -128, -53, 69, 121, 242, -107, -252, -49, 92, 14, -213, -123, -173, -165, 53, -146, -35, 25, 153, 10, 53, 53, 100, 49, -63, -296, -75, -9, -116, 98, 118, 95, -200, -131, -262, -12, -3, 53, -22, 51, 20, 174, 93, -9, -86, 120, 28, 173, -126, 81, -99, -41, -33, 85, 178, -75, 296, -121, 34, 114, -132, 4, -53, -73, 44, -93, -77, 56, -29, 70, -43, 105, 197, 117, 55, 61, -223, -12, -252, -164, -16, 219, -14, 222, -176, -108, -63, -65, -83, -139, -51, 2, -49, 28, 239, -22, -10, 16, 44, 197, -80, -132, -121, 74, 71, -56, 68, -149, 44, 117, 136, 162, -259, 46, 60, -258, 81, 39, 62, -224, 33, -93, 64, 123, -205, -147, -83, -101, 19, 123, 202, 86, -158, -99, -32, -1, 134, 167, -313, 75, -41, -135, -95, 96, 286, 9, 56, -198, -2, -55, 125, 118, -99, -158, 93, 92, 37, 162, -108, 92, -269, -210, -26, -10, 30, -6, 40, -150, 97, -36, 139, 63, 11, 202, 174, -455, -44, -99, 46, 42, 140, 33, 185, 1, -158, 1, -106, 132, 78, -45, 45]
7089D5O4o8O1J58O9l08P4m5k87K05L78l11n5q1J86J01k78J55L4N4k60J16QKR0
7114A07QK5r9j25ll05L37j5r2L58k06J93k93J59j07J92l52L09q3n8o7OK26l03
7138a88PL05j09j4J22M4P9j32k89K08n7R6J74l97n6J48M3J45j73PK68j74j89L0
7162a02L4N6J46l29J36nK73k35k2K19k46J1P9N3k74J85J79k60K23r6J23r1j28
7185g1Nk7J47p1J0q6J98k02K87j51k72J53j15M04j90r0qNK24j34n4R0K78k47j57
7210g4J11q8j36J78j66l7K12J54l8m2j13o5J21oJ02k08J00q4j71K83l8R8r3RR4
7235A03j73n5j34K99M3j03J78k3j5j43j85J37K41j03N7j7k5k29j9K21o4op3K66
7259A78l45K75r4j47J82m5l7n1N36n76jL69j09j57k3P9l54L50l2J6n5M2o7K60
$$ y = [45, 109, 41, 102, 260, 329, 21, 95, 50, -237, -32, 346, 35, -20, -101, 85, 186, -92, 63, 97, 151, -109, 7, 15, 17, 107, 115, 140, 41, -84, -87, -392, -55, -70, -162, 196, -10, 183, -110, 49, -58, 134, -218, 91, 8, -50, -117, -111, 115, -188, -181, 124, 15, 1, 123, 167, 246, 114, -175, 33, -24, 72, 246, -151, -207, -59, -16, 129, -44, -37, 231, 57, -132, -102, -68, -12, 134, -195, -59, -64, 209, -26, -48, 171, -75, -64, 15, 68, -206, -21, 158, -102, 121, 25, 148, 57, -71, -66, -93, 54, -17, -7, -93, 105, -97, 190, 39, -233, -80, -195, 209, 19, -71, -79, -74, 150, 16, -38, 52, 330, 83, -74, 37, -51, -187, -9, -175, -212, 0, 154, 116, 74, -39, -104, 17, 11, 113, -95, 5, -79, -250, 33, -5, 93, 0, 9, 103, -70, -125, -259, 40, 83, -20, 158, 135, 120, -23, -208, -71, 170, 67, 124, 107, 82, -147, -166, 55, -9, -15, -88, 178, -167, 108, 14, -133, 49, 4, -33, -84, 452, -124, -125, 244, 135, -22, -45, 34, -320, 30, -2, 14, -41, 1, -66, 194]
7283A94l6q9k37N2R5L6p3pJ26j60j74K38K72k45M6k73L63k31J20nK08k71K22k00
7307b9O9k64K55j98P1M8j4Q4O1J44k20L6k7j04j50J36K06j79j02L88k48J12j30
7330e5J90j68k01K99j29m4mR2l6J37j10nk04M13r6j07J50m0r2m0K09p0k50J65
7354Dl1K1J8K48l42L2K41l52L12k40M4j0J82r6j41J07R1j57Q5q6J38J3p2qn1K6
7380b4p1J11l2j39J29k6j54J92o0j26K67n1P1q7j43L49m31L05Q7k01j02K43n0
7403E7j81o5J80N7j68KJ76k86K14m0l8Q6K4o5m7K01j17q7J6J91l8j74K01k92K89
7428I6Kl75L16O8J30k84J39J84m77K43k40K8K09j53J11K9j69j0L29j34m5J61p8
7451H0k40J91o0K09j29J06j57n7J34j16j10N70n98P2L66k18n3M9J03l10J29l2
$$ y = [194, 158, 69, -168, -116, -21, 15, -58, -65, 61, -99, -273, -35, 237, -8, 38, -235, 128, -103, 17, 12, 220, -51, 171, -29, 40, -224, 31, -167, -96, -48, -62, 22, 83, 227, 7, 43, 16, -88, -238, -102, 104, -75, -177, 211, -37, 75, -55, 135, -33, -234, 65, -64, -108, -112, -20, -56, 81, -29, -34, -238, 175, 79, -28, 122, 82, -10, -50, 159, 89, -161, 4, -27, -6, 12, 260, -82, -50, 191, -161, 151, -89, -45, -55, 127, 31, -110, -3, 88, -69, 16, -70, 68, 81, 9, 1, -50, -24, -95, 16, -16, -155, -26, -52, -206, -14, -74, -200, 67, 16, 87, 0, -143, 206, -225, 80, 167, -34, -136, 107, 57, -124, -189, -9, 48, -120, -118, 58, -228, -14, -54, -92, -6, 18, -47, -94, 107, -10, -97, -81, 110, 72, -102, 99, -193, 96, 98, -277, 39, 107, 237, -47, 92, 276, -201, 42, -198, -170, 39, -114, -3, 26, -143, -153, 176, 42, -3, 158, 80, -160, 31, -29, 180, 51, 157, 0, -57, 77, -39, -149, 421, -177, -105, 261, 43, -10, 39, 142, -168, -39, -71]
7473g1K1n3L52j67qQ7k66K33l9qL5k31L29k58J3j78K43j37L36k26J71q1q2r2J95
7498A18l01K27k4j3n3J73J6j45R0k75O2kJ78O7j36p8J17L3l5P2O0J19k27k48K53
7523D8m1m4p9O2j09K14Q5N2j00M0q2r8J25r5j41J43p2N1L56k05j58J44q2j17J11
7548Hj19J5j83K73R3J88j82j11MJ1j86J19o0O0J20J7O6j1j85K01r3k2P3j07K5
7573A4j6k4k51L46K52j90j30n0K57k8k00K22k61K35k97L54l06J43P6n23M76j81
7595h2P2J62m87N01r0l57N16k12j51J92j23J53j55lR1j67K20j12J63k77K18l2
7617D0jlK5K5j2j09K88k80o9J99j84pJ92j84J17L3l4j20J61pj97R3J07N8l73J82
7643f0j26K08m3K07j92Q3o6J43j25k80J05M2J49j07q0J96j74j04J32O3M4j6j32
$$ y = [-71, -50, -103, 249, 82, 74, 161, -105, 128, 89, 81, 116, -115, 214, -44, -31, -209, 34, -103, 233, 7, 178, 97, 15, -77, 118, -183, 44, 20, 7, -46, 127, 143, -2, 88, -187, -125, -127, 51, 118, -18, -96, 21, 54, 19, 91, 151, 270, 43, -205, 48, 7, -37, -116, -54, -163, 51, 136, 188, 88, 128, 46, -52, 73, -22, -163, -20, -92, -41, 315, 110, -48, 96, 14, -103, 8, -111, -96, -279, -6, 87, 275, 93, -18, -14, -3, -189, -70, -130, -70, 50, 67, 133, 122, -63, 138, 45, 23, 96, -11, 14, -2, -26, -277, 69, 321, 131, 1, -49, 208, 180, -20, 202, -59, 176, -121, 233, -73, 70, 146, -377, 99, -82, -10, 152, -335, 166, 76, -281, 235, 23, -128, 64, -59, 94, -61, -64, 27, -140, 80, -32, 131, -146, 72, 40, 39, 36, 61, 86, 74, -35, 253, -27, -96, 103, -81, -88, 104, -80, 37, 70, 36, -84, 77, 70, -127, -34, 73, 131, -242, -60, -186, 22, -21, 186, -6, 77, 11, 154, 29, -251, -146, -104, 45, -62, -142, 54, -120, -224, -92, -29, 15, -1, -133]
7666a33J33o8K16k46P2K16n6m2l07J74J01Lp2l5k15K79M8l42N60k22n4K13l50
7689a27O0j8k0J99m6k46N9R3q4K26r5K33k21k32K80K17l94L16k22p5N5L7m8J09
7713E6O5J4r8q2N9j41rJ10j68K19j14k4k2L8J6J20J97k56p6L2R0Q4j40R5L4k01
7739a02K6K10r4m6R8J4n3j30O7k16K03J08l03J88p9N8j47M0O4J47J10L4j0j72
7763A5k8j00N1p7K24k32M79l05j0n3J79l13P5j93L10M1j85J75K79k79J05P5j39
7786I4M3l54K04K8J47j75p9J3J38j0k26J79Q3k15J88l11L46j5k10K44J03k66j85
7809b36K66n3J51J9j15l2J16j63J19j54K14J3k05M03l84n0K53J27l06o7O8M7Q2
7832A13j20o1J84r3L0r4q6J58P3K2k76j9L0J54p2k51K99K9j21J84Q5j69K02k42
$$ y = [-133, 0, -68, 148, -98, -26, 190, 134, 92, -215, -41, 60, 63, -9, -44, -259, 20, 68, -274, 286, 64, 10, 223, -127, -67, -85, -105, 94, 48, -198, -139, -46, -130, 96, 1, 234, 13, -219, 61, 278, -116, 200, -22, -97, -42, -5, -53, 56, 121, 135, 37, -45, 14, -127, -136, -26, -194, 25, -89, -113, -135, -97, -81, 39, 236, -20, -96, -64, 26, 110, -30, 65, 99, -102, -76, 134, 40, -6, 92, 106, 53, -77, -10, -226, -23, 85, -218, -30, -109, -51, -198, -158, -94, 53, 163, 197, 187, 15, -13, -113, -62, -139, 85, -147, 332, 27, 17, -36, 143, -170, -95, -288, 22, 63, -122, 53, 332, 53, 158, 233, 94, 137, -217, -13, 15, 162, -13, -92, -79, 59, 49, -177, 2, 85, -130, 58, -253, 93, 78, -132, 112, 215, -51, -236, 30, -23, 128, 147, 32, 0, 116, -47, 72, -82, 132, 145, -60, 343, -41, -91, 162, 289, -17, -84, -16, 31, 113, -7, -68, 116, 23, 53, -41, -127, 31, 104, 126, -150, -169, -139, 15, -57, -308, -9, 20, -101, 83, 168, -1, 201, -41]
7856d1k3L6m7k0PR9L9R6O4l32J33P7p0l4l7M15l96r1L06k63L3o5K72k04k22M4
7882b24J87O0l1K70m14Q2K58k11R3K7LM4r8O1Q3j71j40J24k7rK79l68K44l57J59
7907g6L96k85p5J34k05J39J07j74j26J47R3p0q9J0l1R4J55Oq3J0o2o0NR1l08J6
7933b41J82L45m36L02j73j02L38q1k01J18p9J91j90j6K85j41nl23J00K81J28k89
7955gJ37l09K4K93r8j20J97j7j17m8K17m26L15j22J21M7k17K08J99n9j79P5pk2
7979H5j21J13o9J54k1r2J10j81J73k03k7Q9j16Q0O1j75J08P1o0R4n3j32J11J07
8003A06k32J01R9j2j77L91q4k18J96p3j96kM4M4P1mM5j80M6M0J81l48P1J34k35
8028a92K87k74J12N4oJ40j0k6j34K54j32J67l1k96J52mm6k0%P7n9j18K84r9n7
$$ y = [-41, -64, -28, -75, -95, -88, 11, 50, 146, 210, -122, 11, 88, 18, -16, -53, 362, -34, -125, 181, -82, -49, -114, 158, -46, -268, -224, -37, 23, -8, 262, -152, -70, 188, -23, 70, 97, 100, 144, 46, 107, 190, 19, -121, 3, -24, -33, 246, -122, 122, -235, -76, 320, 35, -40, 94, -111, 28, 135, -39, -165, -18, 75, 5, -84, -74, -105, -11, 144, 150, 67, 77, 15, -45, -40, 51, -257, -241, -59, 286, -150, 152, -21, -123, 215, 134, -67, 51, -28, 163, -27, -43, 242, 101, 96, -227, -127, 154, 282, -7, 130, -179, -155, 138, 40, -80, 117, 100, -17, -65, 152, -274, 41, -81, 40, 87, -130, 78, 277, 218, 39, 114, 107, 85, -36, 77, 8, 162, 141, 49, 159, -22, 151, -52, -79, 10, -106, -26, 35, -140, -32, 39, -21, 73, 20, -112, -1, 106, -126, -25, 74, 62, -115, 276, 192, -26, 170, 97, -99, -101, -57, -13, 58, 54, 99, -81, -35, 5, 186, -162, -91, 43, -192, 95, -179, -67, -13, -19, 121, 111, 85, -49, 205, 73, 240, 209, -87, 65, 61, 15, -5, -5, 72, 13, -105, 179, 80, 23]
8053B3j78J44J23j07J49j12M7nm6Pn7m1K17l0k13j00J80k9n8J43k09N1J08l5P
8078b1J98kk39l4r1L93k42l7Q6M4m0k09J78jJ38J81q0l46K1J6J85k10K41p5q3
8103b9k04MK55j15J71j00J1j79Q4J30o6q6J46j07J40J2J90j94m9j20K13l49K03
8126c9j6j61K38J00j57j22K71k46O5R6m1R4k53J22J56k7j11O1R3k11J67j73qP5
8150b7O0j64M55k12j42J16j69J90Q6j28j87L88k51m9J1j20K96l15K42J08p6k26
8172a14K34l9j90K68j74R2j2O7k64J74j2j2k83M66j91j92J09j1j57
$$ y = [23, -155, -11, 112, 5, 154, 42, 89, 84, 38, 45, -12, -53, 164, 134, -79, -179, 1, -28, -86, 57, -152, -101, 7, -28, -21, 177, 175, -64, -98, -189, 204, -38, -75, 11, 55, 15, -194, -16, -17, 121, 302, 222, -124, -103, -87, 98, -112, 129, 54, -29, -233, -229, 26, -89, 82, -18, -7, -186, -102, 28, -38, -124, 22, -85, 55, 67, 257, 63, 14, -106, 107, -242, -39, -55, -216, 22, 122, -35, -157, 114, -132, -67, 29, -12, 82, -171, -49, 107, 80, -31, 30, 123, -88, 79, -94, -102, -27, 33, -131, 324, 112, -30, 86, -83, 107, 193, 65, -122, 266, 15, -34, -23, -143, 153, -162, 80, 188, 112, -114, 120, 81, -109, 159, -15, 77, 65, 132, -132, 42, 30, 18, -265, 201, 10, -182, -73, -84, -241]
8191b41
$$ Imaginary data points
##PAGE= N=2
##DATA TABLE= (X++(I..I)), XYDATA
0@%%%%%%%%%%qJ6j6J6j6K4l2M0m9N7p2Q8j04J20j44J68j92K24k60L00l44L92m46
33b38N06n70O42p21Q07r03J009j123J246j381J530j692J869k063K275k507K761
50A447l039L346l688M068m494M973n514O135o854P698q707R933j1463J3433j6071
65h797J9795k5474L5240n6366J75690r4916j93903L31348k58224P2313R9083j74211
77g8422J37433o7409l2679J32995j86198J54797j2452j67146K30262j28815m7616
88f5250J83826j85488O2780M8603j03570J33544j07359j6063J51190j83647R0883
99I449N5017j65076J64614n0354j07183J61721r0032k4031Q3853r1857O3557j4569
111d891l9862R6400j11794N6642O3492j39269J14099j6201q2867J38997j07449
$$ y = [0, 0, 0, 0, 0, 0, 0, 0, 0, 0, 0, -8, 8, -8, 8, -8, 16, -16, 24, -25, 32, -40, 48, -56, 64, -80, 88, -104, 120, -140, 160, -184, 208, -238, 268, -302, 340, -381, 426, -477, 532, -591, 655, -726, 804, -888, 981, -1082, 1193, -1314, 1447, -1592, 1754, -1934, 2134, -2360, 2613, -2901, 3234, -3620, 4078, -4629, 5304, -6159, 7274, -8797, 10998, -14476, 20764, -35602, 140088, 45172, -148731, 182617, -75607, -3294, 95789, -78422, 59011, -8398, -41077, 91918, -94280, 60517, 48065, -119081, 111181, -17634, -65250, 118576, -66912, -4132, 44471, -59099, 74445, -32914, -48977, 102213, -81434, 9449, 64466, -100610, 64004, 13650, -93533, 68188, -21844, -45875, 37978, -53879, 9678, -4891, -44753, 51647, -60147, -3505, 59987, -79282, 34817, 18616, -64251, 74746, -32703]
122c2703r944J12898j32412P8603J270q2594J33610j06129J345J08207j30845
133e8694P5570K2686j04607J15599n1446k2797P5872r8563O9282k699n9450R4042
145E4795q4226K0988O8063j17470Q0854J7458r0916R7784n8781j3981Q3338r3048
157c5142M3330J3230n9698P4824m2401j6486O0639o7745L2941J9990o0529O5278
169B8231l0667j7587M4460n3418M0026M535n1828N7085k5922j7153N4491o1931
181b9678K3071L3259o0728M6928j2871k2986M3917l6783O619K0926l2848L0497
193I323j0129k1872M3639l3072O274J8855l3575L3385p461k0397K6135j5908L952
206h51J5442k8643J9402J958j8161K5220k0124M243J4535k1957J1692K697p385
$$ y = [-32703, -42647, 70251, -62161, 16442, 17712, -64882, 68728, -37401, -36056, 72151, -58694, 16876, 39562, -65045, 50554, -892, -23689, 52183, -46380, 22902, 20203, -39247, 54795, -29431, -8443, 59620, -57850, 23004, 40462, -50454, 47330, -11451, -25432, 57906, -35142, 8188, 21418, -38280, 36544, -5857, -22343, 38296, -29449, 3492, 23482, -37047, 28231, -2436, -20023, 24437, -28981, 11045, 15580, -36248, 20837, -5085, -22238, 32253, -29678, -6607, 26652, -34076, 12852, -19, -23005, 20912, -15871, -9252, 11674, -21174, 9323, -806, -22678, 20961, -12111, -5837, 13018, -20557, 12828, 5367, -15030, 11105, -4803, -851, 14591, -14052, 5350, 7308, -10853, 14367, -5757, -1514, 13021, -8936, 2756, 5453, -1932]
219a932J2533j0785n228J7885j2202N892J176j2988J4226l116n687L169J657n212
233f12K915j097m025Q500k533n673R52M770k462L607o036q83N276m752O544j1455
249f964O123M924j3609J1685m401o003J7761j6751l376K2324k3951J5142J487
262D391k3744L0974j5477p646K1233k1762J0200R897k3940K0985n511q380K1681
275A2901k6864J5511O411k1003K3955j7019j308K4466l0292J0962J6544l0992
287a6728L1230j1660j9835M1426l2024M650K2827l6412K5985K960l0080L5186
299A7525j9782p177L1531m0312K4575O647k8611L5170k8476M129L0556m5135K8243
312H883M190l7498N2236l6949o915M8770o1270L4565R638m7645N6592k8431j5763
$$ y = [-1932, 10601, -184, -5412, 12473, 271, 6163, 7339, -5649, 8577, 5461, -226, 2943, 4600, -612, 2303, 1206, -2819, 5681, 3148, -2525, -1573, 3197, 735, 4342, -1694, -2577, 2699, -2053, 4491, -6964, -841, 4083, -9526, 2159, -2242, -8245, 9516, -7235, -10611, 11713, -12238, 2904, 4391, -19353, 11621, -3856, -11502, 9731, -12031, -1831, 8066, -15874, 5111, -400, -8780, 12901, -13963, 1548, 7959, -13044, 10911, -6108, -7416, 17050, -13242, -2280, 14264, -16728, 14502, 2842, -16993, 24433, -7591, -2941, 19886, -16526, 9459, 12419, -17661, 17525, -2257, -9434, 22097, -18215, 6360, 13007, -15604, 19566, -8910, -4781, 25775, -19360, 8883, 13073, -24425, 27811, -9138, -16053, 32717, -28553, 6012, 15650, -31995, 24597, -3834, -19597]
325a9597M5853m9809K6871J4340m8938N1564k7940o858L9187n4747L7949L686
337A1561m1736N2808l3269n411M5991n9515L2698J5352n1481N7255k9631j6217
349b1595M9019m8245J9692J7349m2431M2786j3964k2553M3560l8913J7117J7021
361A8843m4786M5200j6425j9977M2535m1060J4512K5340n0835M2261o063l2762
373b3217N4932m4997N433L6413n2956L9165l665l5988N2827l5602l837L8428n2141
386b5205L8484k746l9099N8079m0731K804L4692n5250M2311n37m0844N4968l8641
399a1715k188M3364n9882L9321L224m1963N4772l7450k462M0703n0245K8687O640
412A0806l8173N0513l0442r178M0790m8005L0302M175l6840M6901k6877q740L7049
$$ y = [-19597, 26256, -23553, 3318, 17658, -31280, 20284, -7656, -14514, 24673, -30074, 7875, 11561, -30175, 22633, -10636, -16047, 29944, -29571, 3127, 18479, -33002, 24253, -5378, -21595, 27424, -20821, -1129, 16220, -26211, 16575, 2611, -19942, 23618, -15295, 1822, 18843, -25943, 19257, 2832, -17145, 25390, -15670, -1158, 24182, -26653, 15608, 9545, -23217, 31715, -13282, -7849, 28564, -24392, 14773, 11108, -24880, 27947, -7655, -11492, 26936, -25205, 13279, 10533, -28566, 29513, -11218, -8414, 26278, -28972, 13339, 12802, -28042, 26926, -11715, -13903, 29461, -30421, 8900, 12124, -29839, 24933, -12517, -14979, 25724, -24521, 4166, 10806, -27367, 23146, -7296, -16474, 24316, -23689, 6613, 10788, -26052, 20849, -6028, -14768, 22281]
425B2281m2954K3769J3264m3227M5616k0878j3446M0571m4488K0591J6009l8214
437b1106L6746j4411j6913L9910l6922J1050J9950l8293L7434j4961j7398L8259
449B3345l4951J1504J7106l6393L3142p307k4146L8673l0533O769K2049l8767
461a9509L0099m612j9567L1246k5769L261K1159l2172K2558q08k1783L2795k5744
474h846J362K2005k9657K0971j786j9541K8188j6752m382K0651k5996J7020K744
487E981k1777K6440j6338j027J6954k3592J4963M582j8778K0279j0552n536K1128
500A2727k3156J0758O115j7119J9027j0898l903J5662j4726N541O015j4700J5701
513G044o010p506J6023j4902P391M050j3220J3126l272o235J0290r277K499Q012
$$ y = [22281, -20673, 3096, 16360, -26867, 18749, -2129, -15575, 24996, -19492, 1099, 17108, -21106, 15640, 1229, -15684, 24226, -12696, -1646, 18304, -19989, 17445, 2484, -14914, 23345, -11606, -102, 17004, -19389, 13753, 6446, -17700, 20973, -9560, -2791, 19258, -19509, 10590, 5978, -13589, 17657, -8112, -4851, 16308, -15864, 6694, 5886, -15897, 16898, -8846, -7484, 14521, -15136, 5835, 4049, -15492, 12696, -4056, -8438, 12213, -13783, 3237, 5981, -15796, 10644, -5694, -6721, 10233, -13359, 1604, 6186, -12592, 7687, -2865, -8401, 12727, -10429, 329, 6444, -10675, 8352, -2546, -6449, 9213, -5513, 28, 6043, -8657, 7044, 1034, -6472, 9551, -5351, 2040, 6090, -7130, 5996, 2724, -3511, 6779, -2498, 1, 8013]
527H013j3423R354j550n251J0313j0405K959M893p696M959o59n305Q753n716j785
542b546O680p986O631j823m601N992l213M89J858m111K172J910m700L414j808
557a642R0K395m534K464j41N65j240L59l81J162J487l392K078j39O5P06q89j448
575b435M359l028r66L999n707O716k866l340O474m689J798K063n508N026J039
590B935n986P501n681J397N871j0414Q230j976l905Q253p920J103P049r398N188
605B247J472q421J2164q714j140Q473j0200P140k70p953R972m310m162R595j0950
620e057N406M877j3159J2545n533l349J0606j2464M487O335j2004J0031k718q336
634h333J6414j4255L090R254j6107J4525l890r702J6058j1404M65J0531j6706
$$ y = [8013, -5410, 3944, 2394, -2857, 7456, -2949, 10, 4903, -2793, 2166, 1507, -3798, 4955, -761, -2546, 4134, -3852, 2779, 956, -3645, 2347, -866, -377, 1481, -2630, -458, 1452, -3248, 166, -1642, -1552, 843, -3691, -1227, -1368, -803, -2043, -1684, -2065, -903, 584, -2808, -730, -869, -804, -98, -987, -2435, 1924, -1104, -2070, 1929, -3778, 2938, 72, -3268, 3206, -1483, 315, 2378, -3130, 1896, 2935, -3051, 4450, -1231, 166, 6037, -4377, 3853, 1877, -2028, 6225, -1695, -592, 6457, -2941, 2247, 3719, -4702, 7462, -1252, -2392, 6081, -4119, 3021, 2751, -5202, 4770, 460, -3702, 5893, -5057, 349, 5226, -7933, 4612, -921, -4270, 6336, -6128, -1641, 4694, -7310, 2721, 3, -8333, 8081, -6174, -3084, 6170, -9937, 4588, 698, -9004, 7054, -4350, -3885, 6646, -10060]
647a0060J3184O5j3136J8394j4151L580J0393j8225J4482j235j1497J7547j3338
660c997L69J5163k1334J4115L66j4180K0921j4604m34J3715j7099J1140J422j3884
674h321J8281j0491l977J5157j9079J2869J511j5119J8499j0675k764J4236j7582
687g455Q870O191j7650J7924q436n961J7934j9924Q801N465j5473J6454p595p300
701h155J7481j6321N488Q757j9042J8732p260q811J8510j7182O805P051j7547
714a1494J6323l737j0614J8373j6044M576J1422k0307J6692m432r128J8035j5863
727f198L413J0910j6940J2920j245j2008J9535j4646J283J1671j7430J4666k638
740C293j0659J6443j1195o38J2125j7284J2123J321j3892J7771j2276P01J1986
$$ y = [-10060, 3124, 3189, -9947, 8447, -5704, -2124, 8269, -9956, 4526, 3291, -8206, 9341, -3997, -3628, 11535, -9799, 4316, 4682, -9498, 11423, -3181, -3615, 10100, -6999, 4141, 5563, -8321, 9960, -531, -4508, 10649, -8430, 4439, 5950, -9169, 9330, -1345, -4109, 10127, -7455, 1415, 7606, -10044, 7880, -556, -6517, 11417, -8507, 294, 5759, -9714, 6740, -855, -8155, 9326, -6995, -1507, 7250, -11792, 6940, -320, -9131, 9379, -7803, -998, 6053, -11494, 4829, 1092, -9522, 8851, -7193, -2617, 8805, -11502, 5190, 758, -8370, 9665, -6198, -2785, 8125, -8815, 4105, 2860, -9148, 10387, -4259, -2976, 8695, -8735, 5931, 3293, -7366, 9077, -2118, -2756, 9369, -7915, 4208, 5529, -8363, 9408, -2868, -2167, 9819]
753I819j7086J0860J063j1371J4911r691k988J4584j7237R503K550j3516J6949
766H350j0714k261J2064j3681P765K736j2701J4368o520n287J3496j5015Q442
779A042L122j2878J3533o771l163J1020j2346M729O743j3048J1772m394n925J3469
793F905j2465M328N058j0225R893l373n656J0669p969J315O384j1507J0637l000
807I94n756J0805r424L367M804r796P406K49p017J0204p651K31Q069j0917P387
822B955p92m896P936n575r22N518o346M035P75o626Q650n258l85M979p545N893
838B396m00n129N851k960j609N473o330K258L537o790N591k910j151M138l902
853a937J032J581k908K803q17k827M762l891J015J717m090N001k017j676K750
$$ y = [9819, -7267, 3593, 4656, -6715, 8196, -1495, -4483, 10101, -7136, 2367, 4917, -8599, 8350, -2364, -4625, 7439, -6242, 1523, 4259, -8442, 5926, -594, -5881, 7615, -7400, 1042, 4164, -8714, 4819, -1952, -5115, 5905, -6441, -1712, 5031, -8017, 3755, -639, -6564, 6905, -5560, -1232, 3826, -6399, 3494, 121, -5535, 5134, -2835, -1520, 4864, -6643, 3994, 994, -4762, 6043, -3381, -14, 4790, -5006, 2400, 2649, -4368, 5836, -1815, -1584, 6485, -4432, 2955, 2163, -2733, 5203, -372, -1294, 4224, -2122, 1913, 2688, -3938, 4712, -546, -931, 4048, -3497, 2396, 1996, -3133, 2718, -242, -1851, 3622, -2708, -450, 3087, -3703, 1888, -1022, -2173, 1965, -1937, -905, 676, -2232, 571, -246, -3073, 1689, -2202, -1187, 530, -3560, 1441, -576, -2252, 498]
868D98j937L29K176l368J989J390l560L752k636R23J581k249J143J1J00M04O4
885F10j537K120j065O40l68p67K177j475L96k57O87k87O5m08m13J782j860J198
903A238m57r41J479k0j701J424N2j666L080m044J977J135k674J915j138L2J258
920I49j627p03K400k555J962q89j696L989l905J809L90k377L191j072k251L119
936G34j968l91L387n391L775K29k966L987l496J336K374l564J449J326k965L902
952A758k692j059M835n180L264j89k961M875l027p38L885m215K110K611o335N986
968B928k063k364N458o374L847J416n092M725j576k441N587n478J383L768p047
983c323O470k916k259O132n915J936K231n334N208j175m702P339n693P87M182
$$ y = [498, -1439, -1110, 1066, -2302, -313, 1077, -2483, 1269, -1367, -444, 1137, -1112, 31, 42, 142, 546, 610, -927, 1193, 128, 768, 400, -367, 1810, 335, 731, 474, 1161, 874, 939, 531, 118, 1900, 40, 1238, 781, -160, 1319, 1299, -402, 1022, 1074, -592, 2488, -1556, 421, 1556, -1118, 797, -341, -309, 949, -678, -1381, 1019, -1536, 426, -463, -2159, 1830, -2075, -266, 124, -2253, 938, -134, -2385, 734, -1234, -1625, 1762, -3629, 146, 375, -2591, 1396, -2100, -764, 1610, -1954, -505, 821, -2144, 1758, -934, -1993, 2842, -2338, 926, 737, -2224, 2651, -376, -1114, 2771, -1444, 666, 3277, -3058, 2928, 865, -1499, 3959, -2415, 1432, 2848, -2244, 2481, 905, -1536, 4051, -1427, -44, 3724, -3323, 3147, 231, -2028, 4104, -1811, 125, 2356, -2978, 2230, 1055, -3647, 3692, -2001, -1214, 2968]
998B968p572O801j927l414N656m898P59M265o780M548J029n927P677n783M51N317
1014C170p210N043p52m100O565m050j587O180p268M860R30o460Q366m918o35N060
1030C194o649M602J275o013O409k770k263O971p885L944K265o500P179m302r19
1045a462N664o140K012L159o182O204k131m084P955p166L040K014o068O316k416
1060G15l059O028n341J132M249p818O340j571l458O720o636K171L065n740M155
1075I52l81l610O026m935K0M778o916N679j681l671O667n063Q28L215n222L922
1091F08N70n285O666l898o74M957o626M658J2l558M498l213k01M199m810K381
1107B84J736m845N903m001m29M771n315L202J7l416M532j812k228M566m524K416
$$ y = [2968, -4604, 2197, 270, -3144, 2512, -2386, -1627, 2638, -4142, 406, 1435, -4492, 3185, -2598, -2147, 3170, -4040, 1003, 251, -3849, 2716, -1334, -2921, 3259, -4009, 851, 1781, -4679, 3687, -1231, -1866, 3194, -3455, 1147, 2422, -3591, 2818, 48, -2215, 4756, -3129, 815, 3080, -3420, 3759, -543, -1462, 4202, -1938, 74, 3233, -2949, 3255, 1124, -2960, 4995, -2171, 869, 2883, -3185, 3131, 715, -2344, 3684, -1657, -525, 3724, -4094, 2246, 675, -2783, 3937, -2699, -528, 2537, -3203, 952, 571, -3039, 2987, -1948, -1928, 2850, -4066, 1613, -68, -3739, 2928, -2135, -1307, 1908, -3314, 608, 1178, -4107, 2559, -1339, -2013, 2944, -3682, 976, 988, -2570, 1928, -1285, -1486, 2713, -2097, 284, 2020, -2825, 3078, -923, -1352, 3419, -1896, 1306, 1323, -2093, 2439, 627, -1601, 2965, -1559, 857]
1123H57J788n348N398k608n25K963l907K037J391l766K904k18k741M851m706J562
1139f8K047l765L810k661p92L182k492j66K299l515L181n62l018M367l424J234
1155c43J077k699K448k91j513J832j389k00K226l386K232K2j984L318l025J035
1171f40J272j792Q81N88j708K241q22j377K976k609J687o5j787K217q97k36P07
1188F36l31k06J539k234J462k23r76J707j670J034K84n47N87l68o18R73m69r80
1206d00J488j449J350m83p02J057p08K62m26K85n33J126j328N26o9l63Q03j206
1224g70O55k60J67m66M74m43l1O61j226J332r29N69O1p73L36O84m60l20P79j101
1244a061J595j130k62J252j419J489n52n31Q50J6r93J282r65L09J311k195J678
$$ y = [857, 2645, -2703, 2695, 87, -438, 2525, -1382, 655, 2046, -1720, 1184, 966, -1775, 3076, -1630, -68, 1979, -1786, 2024, -637, -1429, 1753, -739, -905, 1394, -2121, 1060, 498, -2520, 1847, -1577, -343, 734, -1965, 483, 192, -1321, 511, -878, -1078, 1148, -2238, -6, 16, -1968, 1350, -1675, -640, 632, -1160, -279, 309, -1399, 842, 20, -1357, 1619, -990, 697, 632, -1155, 1062, 165, -71, 636, 305, 99, 1638, -596, 866, 643, -333, 1374, -296, 738, 1022, 475, 1062, 694, 76, 1049, 580, -400, 1088, -361, 989, 506, -196, 861, 153, 415, -11, 274, -259, 867, -461, 65, -4, -367, 436, -770, -115, -375, -208, -674, -200, -643, -674, -13, -1239, 93, -836, -267, -206, -979, -643, 41, -419, -739, 40, -1061, 534, -596, -858, 394, -1025, 464, -88, -619, 231, 247, -746, 536, -429, -120, 1191, -1004, 674]
1261F74p38N8R79j617P30R97j022N01L89j664K618k237M96J214k179K389j206
1278C82o41J605j054n02J753k392J504L04k234K830k157N11J248k356J482J13
1294C96j192J459r92q05K439k766J241M08j898K930k244N6J344j386P20M94k152
1311a948K421m41j534K437k755K070K04k626L080j565n6J242j541N23J664k568
1327a393K115o25j421L354l217J427P61k300K328n87j337K334j704O3K083l305
1343a424K824o56j593K940k720J044R68k238J696J44k050K703k045pK348l322
1359a388K725j290q80K570k319m7J813k268J278M67k424L115k135j69K170k826
1375a608K204n24j607K068q58r30K114k291J156J159l353L480j927K41J802k868
$$ y = [674, -64, -6, 973, -644, 86, 1083, 61, 562, 951, -713, 1905, -332, 164, 1378, -801, 1588, 382, -259, 1346, 292, -210, 1543, -849, 655, 959, -1275, 1555, -602, -91, 1157, -1199, 283, 396, -796, 663, -329, -1134, 1305, -1461, -220, 188, -1710, 1220, -1024, -968, 376, -1010, -290, 204, -1948, 473, 32, -1502, 935, -1820, 250, 454, -2172, 908, -657, -713, 529, -1012, -489, 1175, -1393, 722, 97, -1324, 2030, -1187, 240, 1001, -1299, 1029, 442, -895, 1439, -265, -202, 1881, -1424, 1400, 744, -849, 2091, -629, 415, 1383, -855, 841, 985, -1065, 1638, -407, -414, 1934, -1388, 1337, 47, -833, 1737, -582, -629, 1184, -1084, 194, 661, -1763, 1352, -783, -952, 1218, -1608, 596, 72, -1535, 533, -325, -1255, 859, -1432, -276, 883, -2470, 1010, -917, -676, 1126, -1742]
1391a742J750L84j915K174p24j568L191k831Q55J107k171K841j648l11J626j735
1407g17O77J048k047K144m23j878K954k637J354Q13k486K477r73q31J729j099
1423A05l80J959k215J491l51j316K636k500O99Q59j533J355l78j476K050j006
1439am78J857k615J877n3j786K064j582M67Q46j647R04P07j734J695j084n08J874
1457H03k232J508l35r16J565r68j56Q52q49K03R70j854J985p98m43J376j866J534
1475C79m63n21Q86k70m02J133j378M51J029j701J712j145mJ126j222R06q1o8J23
1494D90L46j260J451j004k0Q94j443J433p27j04L40j5k88M27o78J45Q22j190Q72
1513D91n38J26L23p52N01l81J75No1n17P79n91J90R1n87R42n31J8k8K59p5j45
$$ y = [-1742, 8, 392, -1523, 651, -73, -1641, 1550, -1281, -426, 681, -1490, 1351, -297, -608, 1018, -717, -40, 1008, -1039, 1105, 682, -1196, 1758, -879, 475, 1288, -1198, 1279, 306, -525, 1204, 105, -275, 1684, -531, 960, 609, -707, 1929, -571, 128, 987, -546, 809, 431, -1045, 1005, -1, -479, 1378, -1237, 640, 587, -1199, 865, -717, -250, 596, -1051, -147, 560, -1174, 521, -563, -1071, 803, -1429, 79, -256, -1172, 393, -575, -731, 121, -728, -525, 445, -1409, 576, -222, -665, 711, -1155, 379, -84, -605, 281, 11, -391, 742, -636, -185, 844, -857, 855, -290, -294, 832, -390, 516, 435, 367, 490, 836, -424, 1027, 23, 3, 897, -546, 887, 160, 56, 396, 381, 93, 520, -158, -13, 809, -381, 491, -47, 79, 402, -350, 151, -230, -55, -50, -111, -628, 151, -440, -250, -159, -746, 196, -335, -317, -345, -86, -161, -306]
1535c06Kk68P27r88J081q30N40j93k00N97p02N27k61L71l63L10N3j7R5n34P05
1556C46l83J50l06L63J11PP3o47R62o77M48l67O3M14k58L9k52N98p08P64o86O17
1578F71m08l86O35p72P49l44J84k5O1n70L03M4n35R93j008M33m03P4O84o53j2
1599b85K75L16o88M73q09R86n91k94P96r00P82l51m30M39O7m98Q45o09j50R03
1619B77j362J405q23M3R66j019M83J69j59J5K76o57R90q27K30O35j362J225l91
1638A14o4N06r3l66O42j058M07Q43j507J404p73k55J174j115Q20o83j17O71l58
1657A92o29J174q54K56M73j262J410r49J84M12r31N12J22o22N42P4q84J178j277
1676h79R01K38j203J136p93K67P12r39P3P12j136Q77K50j227J600j751J046%p03
$$ y = [-306, -304, -572, 155, -833, 248, -582, -42, -235, -435, 162, -540, -13, -274, 97, -266, 44, 97, 80, 175, -359, 346, -37, 113, -193, 170, 281, 288, 361, -286, 676, -1, 447, 80, 143, 557, 299, 338, 86, 684, -24, 740, 54, 671, 263, -123, 512, -260, 489, 145, 329, 304, 365, -205, 98, 142, -393, 600, -408, 25, -378, -304, 380, -273, -285, -10, 306, -382, 91, -718, 268, -323, -617, 179, -721, 61, -290, -720, -281, -214, -712, 133, -476, -626, 277, -1085, 320, -503, -460, 506, -513, -30, 139, -20, -5, 271, -386, 604, -223, 7, 642, -720, 505, 114, 50, 556, 463, 97, 739, -319, 88, 931, -576, 828, 55, -200, 974, -141, 679, -4, -121, 550, 192, -437, 737, -117, 139, 612, -650, 760, -189, -5, 407, -524, -12, 110, -512, 30, 104, -780, 398, -879, 22, 260, -943, 193, -600, -333, 379, -560, -487, 225, -911, -34, 216, -1011, 589, -1162, -116, -116, -819]
1695h19R39j45m84P34l71k71R80j585J279j12o03J318j444N34N00n53L84j5m92
1714b26R53o28l53J146j470J494n29l76P37o93J78K46n55M10L39j189J410q30
1732F4k23J106j434R25j76n59M57m15L86K85o01J68N46j284J503j047lQ83j270
1751f89M93p1k30J47J78n68Q79o28L92K83j099R68l82m4L90n63O76mm85oM60p14
1773f17Q07m95K15N64j113J127q17J38M26o4k00O29p28L01K81p37P02o17P84l71
1793B15j14M07l37q2M30m46j38J045r46J67J4k97R16q78L32mK7k15Lj81K00J00
1815B18l69N84o33N44q1q92P69m79K88k76J9j14O13n24M03j97j64M68p38O15l12
1836b58j38J26m9P2J09J20m75N81k77K14k21j83N03k99N08p32L34k05M93k71K63
$$ y = [-819, 120, -25, -509, 225, -146, -417, 563, -1022, 257, 145, -458, 860, -584, -50, 450, -103, 281, 266, -226, 727, 99, -254, 892, -578, 916, 387, 11, 748, 55, 233, 479, -76, 334, 673, -516, 894, 64, -159, 947, -487, 438, 262, -297, 160, -255, 131, 416, -185, -17, 529, -755, 748, -299, -302, 581, -689, -196, -267, -497, -350, -172, -740, 139, -489, -97, 186, -913, 55, -327, -371, 19, -544, 132, 128, -357, -363, 97, -617, 190, -305, -90, 474, -639, 488, -329, -191, 235, 171, -29, 600, -128, 173, 454, -283, 419, -198, 586, 215, 101, 508, 171, 89, 519, 73, -65, 980, 34, 201, 215, -82, 834, -44, 288, 284, 311, 96, 99, -82, 118, 218, -151, 433, -200, 344, 263, -629, 140, -339, -51, -327, -308, -422, 191, -333, 70, -127, -291, 177, -561, 54, -258, -396, -270, -319, -247, -138, -18, -493, 88, -189, 25, -196, -379, 124, -175, 333, -399, -65, -270, 223, -48, 215]
1857B15J1k54N60o37N49n57L95k21l9J47M8J28k87N95p15K84j53K27K1k08J62
1878B71k63J33j14K00k65m4K43J7J38n76N92o06L27l3k69M12m65L33o01O07n13
1899d76L84j11K05j55K81k89k8J72m37L50p15O96o9j59K83j37J64k09J84l12J70
1920b08k4P4K74n15M95m08O22m09k01L68j53J32J2L22n65O93p49L94j33j28N74
1941D67m28N70l89m5L21k33j94K03L16o77P92j160Q29j76k95K38j41K59j70J95
1961B82k71M76o40M35k96m66O49q39O36J4j17q6J07k20J87J39k98K13p18P90k9
1982e2m05L05j44M60l47L9k75K61m69N69p4k17O50r58Q25n12K50K47k13j4J53
2003G9j00k20N26m98N30m05q8Q80q98M59k07p8J69J42l23L92q1q5K64q26Q89n11
$$ y = [215, 226, -28, 532, -105, 444, -113, 282, 61, 22, 169, 217, 345, 58, 653, -62, 222, 69, 296, 317, 109, 271, 8, 141, 27, 227, -38, -82, 161, 178, 316, -260, 332, -274, 53, 20, -249, 163, -302, 31, -570, 37, -476, -92, -203, 2, -153, 128, -161, -189, -17, -454, -104, -819, -123, -192, -351, -68, -205, -41, -250, -66, -378, -208, -232, -158, 116, -399, 96, -312, 310, -99, -300, 68, -85, 47, 59, 381, -184, 509, -240, 154, 21, -107, 467, 39, 609, 220, 175, 496, 263, 69, 272, 588, -89, 703, -457, 372, 196, -99, 139, -2, 257, 87, 282, 11, 487, -153, 282, -14, -480, 169, -670, -34, -20, -137, -223, -116, -336, -149, -10, -308, -95, -813, -23, -52, -457, -152, -296, 164, -183, -144, -419, -158, -627, -58, -132, -349, 301, -657, 168, -344, -94, 153, -60, -74, 79, -21, -241, 285, -213, 317, -88, -176, 704, -194, 265, 58, -20, 149, 291, -32, 360, 279, 194, 458, -368, 521, 10]
2025A0K6L40m43M61l23Mo9K74n04Q42q41K28L19o31O67n50q6M48m8j84N2m84L94
2048i8J60l14M28m69J50J97p35M99k92N34j49q5r7O75n90J0M1k48O06o57M19l46
2070c61M11p2M9l38K48K90k69K04m01M39mk46M03n07K16J14k55j9N26m43N14N9
2092E58m30M46o37L45k6P7J11l21j83K45J68m37M87l86J53m8j96L46p16M53Q1
2113I0N3k1j35k73K94j91r3N75q04N35l08J6K40q2l6k04M2PJ36M6J17k30M3J19
2137f4k06K88l43K21j0j73K60M6j93k0J50l87L03j68M87k36n4K36lJ76n07M88
2159B91k49M39n68J39J64l12N28l90M56o26L02M9j76L15k70N12n98K21k34K16
2179B09R3l67J73J02K02l72J51k86L38l45j20L65l67N44l67K77k82R4j18q3J08
$$ y = [10, 36, 376, -67, 394, 71, 75, 6, 280, -224, 618, -223, 5, 324, -307, 360, -190, -276, 172, 124, -60, -8, -492, -98, 62, -252, 176, -293, -143, 54, -681, -182, -474, 60, -89, -174, -271, 404, -186, -176, -135, -383, 223, -434, -15, -361, 50, -22, 27, -311, -63, 227, -42, 162, -239, 200, 196, -50, 353, -154, 62, 176, -79, -98, 428, -15, 499, 558, 128, 574, -63, 282, 256, 333, 444, 123, -60, 185, 353, -84, 403, 17, 170, 122, -74, 272, -444, 9, 90, 143, 122, -13, -286, 8, -183, -276, 299, -505, 30, -278, -262, -22, -104, -140, -344, -302, -295, -159, -113, 4, -226, -183, -64, -270, 18, -325, -104, -114, -287, -27, 19, -174, -194, -44, -431, -128, -296, 191, -45, -99, 137, 134, 310, -197, 291, 42, 481, -87, 52, 216, -96, 432, 42, 498, -128, 174, 223, 47, 362, 92, 604, 6, 227, -7, 209, 302, -65, 108, 210, 412, 40, 191, -95, 243, -102, -222, 143, -224, 320, -47, 230, -52, 42, -76, -159, -51]
2200e1k95N46m32J58m17M35j49j17J88j15K13l57K53j42L81m81L55j50j18M88
2220A93l41L21r8j43k4J21K41p91P78n56M19k91J77J18j40J59k02J34k5L89m52
2241a3N80m78j8K56k79K50m54M50j01J67K2l75J15k93N62m20M08m47Q9j6L8m3
2263@j91Q8k4K44l28Q4J6l00M44l30M27k17n5q1L5q2p1L62j06J06n88Q24k94q7
2287a24J26m8J10k14M4r7J89k41M12j33mJ52m84N03j96J48k54j56L54Q9k34K50
2309A92J03l28L96l49L03Q4l91L37l40K48k12J41k19J43k38L12o9k04R6k26M81
2330B60r1J5q6Qk8p5M2k45M50l58J97K1l23L31l13K93k49R6K62l07J72k42J89
2353A9l19M43l61K72l55j9M06p3J09l70K42k91M56m08M8L6J09J35k06K33j87M8
$$ y = [-51, -346, 200, -232, -74, -491, -56, -205, -322, -134, -249, -36, -393, -140, -282, 99, -382, -27, -177, -295, 193, -148, 173, 75, -68, -92, 29, 270, -521, 257, -299, 120, -171, 6, 124, -16, 143, -59, 75, 50, 439, -13, 567, 89, 71, 327, 48, 298, -156, 294, 193, 360, 382, 7, 122, -171, 391, -29, 379, -68, 21, 5, 43, 0, -191, -103, -127, 117, -211, -127, -111, -411, 33, -297, 130, -87, -142, -223, -188, -270, -341, 21, -85, 21, -567, 257, -37, -124, 2, -46, 64, -150, -106, -203, -14, -255, 157, 24, 20, 172, -312, 191, -5, 143, -111, -267, 87, 176, -58, 192, 295, -33, 363, 14, 317, 401, 10, 347, 7, 255, 43, 184, -35, 108, -130, 182, 113, -91, 5, -221, 260, 169, 184, 98, 106, 78, 3, 45, -200, 250, -108, 89, 110, -213, 118, -195, 98, -151, -55, 207, -100, 72, -170, 19, -300, 143, -218, 54, -301, -320, 86, 13, 122, -248, -6, -297, 159, -249, -201, -165, -56, 79, -127, 106, -81, -33]
2375c3r9q1L05l56K65k33N12l05J10k44J25J33k69N69n19K36PL32l22q6m7mJ43
2398A39l6J12k70K13j11r6L15k7n4k71K21m39N97l41k47M40m35O16n38J87qL7
2420Dk04L79k68R7P3l77J97j3J49j10q8K66l94M49k42k9k85M17k04k61K37J9J61
2443b7j10K07l24L26k15L40k76J7K26o06Q38l75LO4Q2M7j71J01m79N43k63N04
2465D52k15j96K7o7M62p16N13m74K16J49r6%j9K25l18L78m70L77j47j40O3l61
2487c57N71m60M34k97K4oL4K20l42N1r3L33l75K3J28j27J77r9J76k39L00k23l8
2510a85j29J7J72j54Q5K9K93o16P89l53N9l17L4N20p18O02j57K22j53O9K80m24
2532c5L30l50K19k89K32j2m5O2ROj38j77J45M52l85K49J9j71K5k82L13j59J97
$$ y = [-33, -132, -213, 92, -264, 1, -232, 280, -25, 85, -159, -34, 99, -170, 399, -120, 116, 123, 455, 133, 47, 0, -4, 139, 103, 215, -55, 158, 47, -49, 266, 239, 185, -86, 135, -304, 293, -48, -295, 145, -290, 326, -212, -25, -33, 4, -200, 179, -89, 8, 81, -296, -99, -112, 37, -73, -161, 105, -289, 160, -82, -111, -396, 21, -183, -444, -207, -188, -27, -137, 70, -254, 72, -143, 197, -79, -62, 164, -442, 396, 21, 24, 88, 170, 217, 46, 147, -332, 211, -52, 452, 237, 41, 68, 1, 463, -253, 260, -214, 2, 151, 55, 55, 36, 261, -57, 321, -149, 228, 81, -59, 4, -357, 214, -246, 188, -109, -85, -91, -57, 163, -179, -128, -221, 112, -263, -240, -112, -239, -62, -161, 15, -224, 76, -147, -185, -314, -297, -125, -279, -194, -165, 128, -488, 301, -52, 7, -310, -276, 244, -474, 128, -29, 193, 40, 109, 389, -35, 295, -55, 164, -125, 107, 95, 50, 112, 121, 127, -11, -188, -43, 409, 24, 273, 292, 121, 146, -136, 177, 18, 215]
2555B15l61M10M9m58K10j38K29j9O5l29K11m9j76K15m88N56m01K62k3q6K74m51
2577b83L40n36M45q9NL9L1J63k11J11l54K47l9J25j12J16R0j03J60m19K73J7r
2600Gj52n4K82j93K29J08J76l58K43l37M8R9J6K35o08M38k03K62k17j67K24J4
2622I2M8k06M09l87J66RJ2j07p8J70j96J46M4j7k85l3M26j19Q1l96J26j03L45
2645A47k75j3k2r9J77r0J70q9J35j64K16m2k79K09j30L66n23J81J97l89M17m17
2667c17N59k98j60%R1J0L6M00m06R1k3J67m91L33J79j9P3l60J62qL75m02m5K45
2691A92J76k57j35J31j71M22l73K1j59L54n3j15K66l64J95j15R5j78N1O7q6J62
2713A26l03L22k7j7P3n39L95j94L21k81r6N3K58k58Ln9n2K07m3J04j39Q8m9L11
$$ y = [215, -146, 264, 313, -145, 65, -73, 156, 137, 202, -127, 84, 35, -141, 74, -414, 142, -259, 3, -20, -106, 168, -283, 57, -479, -34, -123, -118, -79, -48, 115, -96, 15, -339, -92, -131, -6, -118, -2, 88, -15, 145, -274, -1, 16, 7, -145, -199, 83, -110, 119, 227, 403, 45, 288, -49, -1, 98, 114, 349, -259, 179, -24, 238, 21, -146, 78, 92, 140, -66, 343, -44, 122, 131, 143, 36, -42, 128, -68, 78, 122, 105, -180, -213, 213, 94, 175, -221, -95, -198, 147, -128, -141, -163, -262, -85, -175, -5, -94, 41, -123, 93, 51, -228, -19, -149, 217, -306, -125, 72, -317, 100, -317, 242, -56, -216, -216, -125, -115, -79, 321, -85, 6, -17, 150, -341, -8, 171, 152, 225, -135, 27, 19, 394, -8, -53, 192, 368, 111, -24, 107, -64, 358, -15, 6, -153, 201, 148, 33, 299, -65, 130, 15, 110, -68, -17, 50, -36, 126, -177, 145, 118, 101, 174, -365, 30, -164, 157, -124, -220, -167, 91, -167, -164, -223, -275, -68, -111, -7, -146, -58, -107, 204]
2737B04k86R5J39k54J77o3J52l17J45J24l00L41l90K68m7R7j59N9Q9m4J72j67
2759C5J55j77M2K45k33J66m89M27l11N41l88J29R3k05L13k34J66l04K79l79J53
2780B4j1k72O62l96K07o96O55j43j26J95k45J99k02n7J2N9P1J59j82j77M10k10
2802f4J08k17K30M0k61J04m5N4j01K97k38N7q6L06k10k97M64j81K80n30M53m21
2824b58M44l66J57O4l17N96l86M5K25p5j74om6r4M63k89J34O4J07j52k19K40j19
2847C8k02J87Q0k22K70p0QP6r2n5J17l4nj17K53l85J81o3J73l43M50l15J56k40
2871a54J04R3k88L62l30Q9j05Q2r8N0K06j19Q9j21K75l05r0L56j57J36k82K18
2893A1k59L48p1m6K33k59K51l15O4J20j46O6K58j35J6K0k37K53k42K56K5R7j97
$$ y = [204, -82, 13, 152, -102, 75, 12, 164, -153, -8, 116, -184, 157, -233, 35, -12, 85, -74, -15, 74, 30, 202, 35, 190, 13, 55, 300, 67, 233, -256, 171, -140, 401, 13, 142, 235, 30, 343, 109, 275, -29, 250, -129, 24, 13, -259, 403, 7, 214, -482, 173, 30, -96, 99, -146, 53, -149, -206, -194, -135, -64, 95, -87, -264, 146, -64, 44, -173, 57, 97, -164, -60, -105, -51, -152, 145, -93, -36, -122, 184, -26, -323, 141, -40, 240, -290, 163, -258, 186, -180, -23, 41, -276, 320, -66, -21, 204, 129, -45, -51, -97, -191, 272, -17, 117, 181, 288, 136, -83, 157, 38, -164, 23, 103, -119, 151, 81, 89, 165, 73, 18, 135, 101, 96, -21, 232, -153, 28, -35, 138, -205, 245, -70, 86, -154, -50, 43, -245, 117, -213, -124, -229, -147, -245, -195, 11, -108, -19, -140, 135, -170, -260, 96, -61, 75, -207, 11, -248, 100, 29, -17, 216, -43, 208, -107, -43, 77, -69, -3, 255, 120, 136, 156, -81, 172, -70, 186, 211, 308, 111]
2916A11j16J74k62N46m31J27J75k37l6l0Q8k81L22k04m9J54J60k16k01M43l09
2937g2M15l81K11j61p3J69j45Jj65K90j74J49p1r7L9k80M48m77N12l21J08j79
2959b54L38k4j20J05k97l0R3L24j89J55P1j97J78j70J24l0l9k37K04k3L3J42j52
2982EJ78k84L94l17J24j4Kq4KL03k47j23m4R6K62j92l6k12O06p02J34J25j93K38
3006B1j97J33n2L07k78j0K3K76l4r1k03j61M18m48L56j87n3J5Q8J40j8k74q5J41
3030a73K27k01L45m26J76J14j26J48o2J05j96pK71m14L9L21k90K87j13j21K52
3051A56j98L35m39jJ52J14n9r7K00k96J08j0J41j63N8K74j51r7k58M42m99N49
3073B61n24M15k10K0K12k89L23j89K28m62J50k9J05l9j17K67k85J39O7K3j63J05
$$ y = [111, -5, 169, -93, 453, 22, 149, 324, 87, 51, 21, 109, -172, 150, -54, -103, 51, 211, -5, -206, 237, -72, 343, -38, 173, 12, -61, 108, -37, -36, -201, 89, -85, 64, -7, -104, -65, -345, 103, -374, 138, -183, -75, -254, 84, 60, -60, 45, -252, -282, -189, 135, -54, 101, 172, -25, 153, -17, 107, 77, 38, -199, 5, -18, 15, 157, 5, 183, -101, 293, -24, 100, 86, 88, 4, 6, 309, 62, -61, -105, -9, 253, 61, 25, -187, 419, -283, -149, -24, -217, 21, -176, -43, -95, 212, -66, -76, -53, 223, 189, 98, -105, -266, 152, -296, 60, -127, -180, -165, -77, 63, 45, -229, -314, -173, 54, -147, 198, -228, -52, 62, -64, 84, 22, 127, -69, -76, 195, -219, -180, 141, -149, 138, 25, -96, 156, -42, 293, -146, -147, 5, 119, 60, -37, 163, -133, -25, -35, 106, -57, 1, 275, 124, 27, -231, 211, -288, 261, -263, 152, -58, -38, 174, -115, 208, 19, 247, -215, -65, -94, 11, -28, -145, 122, -163, -24, 43, 66, -97, 8]
3095Hj7j4K05m77N03l66K85j5j47K62m39Q2k61N49l29J80j98J06K49j26o0O9k3
3118B6k00K50k0L2j21j41K97m39M23k02J91p7pK6j31J87j97L81k47P8j09J50j
3141A49p3J58l5Q4m99K88m2j12J47L6K18m59J66Q5Q5n0rp1k84L9K41o6r0K14r8
3166B2L9l9j6K4l53K22N2j87J50NK0j89M00m26L99j64r6r1O6J53j18k8L5L32j30
3191H2j34o8j28L55k41L34j36J0J08q8j39p6M09l61K95k35J67o9K66o18K77J01
3213A11j54J95k88K15j0K37l11J30j03n1J93k85L70j2j93j44J81J84m43L46k14
3234d6K52j52O1l44J24q5OL98l67K78l63L62k41k8N0J33l5k19J91j53K53J80n87
3257c32L14r3J57k22K06k28L2m4O4L55n27K22j63L81M6j60j75K94J4k12P4p0N6
$$ y = [8, -9, -23, 182, -295, 208, -158, 127, 112, -35, 227, -212, -130, -391, 158, -171, 9, -189, -83, 166, 40, -20, 49, 26, -174, 76, 56, 88, -33, -174, 123, -316, 107, -95, 96, 19, 12, 38, -93, 94, -103, 278, 31, 109, 0, 150, 149, 76, 234, 199, 283, -216, 72, 30, -82, 65, 101, 319, -140, 26, 111, 196, 146, 137, 66, -218, -179, 62, -4, -94, 120, 22, 61, 22, 6, 30, -323, -101, -49, -236, -86, -81, -61, -250, 150, -276, 123, -41, -137, -228, -162, -9, -127, -155, -120, 212, 82, -52, -120, -248, 107, -134, 200, 64, 74, 182, 94, -45, -121, 288, -73, 222, -13, 154, 85, 351, -267, 10, 111, -43, 152, -136, 79, 69, 306, -5, 125, 22, -29, 164, -121, 249, 237, 44, -100, 81, 265, -178, 168, -46, 206, 54, 115, -229, -105, -190, -184, 214, -153, 125, -238, 124, -117, -145, -95, 38, 3, -216, -25, -178, 75, 255, -332, -18, -111, 46, -176, 30, -198, -166, -210, -146, 209, -318, -96, -259, 122, 168, 8, -167, 127, 141, -71, 3, -67, -11]
$$ [...]
8191B07
##END NTUPLES=NMR FID
##END=
