##TITLE=1H_Pr 33-fh
 CDCl3, 8 sc, 
 21.8.2019
##JCAMPDX= 6.0         $$ Bruker NMR JCAMP-DX V2.0
##DATA TYPE= NMR FID
##DATA CLASS= NTUPLES
##ORIGIN= UXNMR, Bruker Analytische Messtechnik GmbH
##OWNER= root
$$ XWIN-NMR		Version 3.5
$$ Wed Aug 21 15:15:36 2019 Russian Standard Time (UT+4h)  she@DPX200
##.OBSERVE FREQUENCY= 200.13155
##.OBSERVE NUCLEUS= ^1H
##.DELAY= (6, 6)
##.ACQUISITION MODE= SIMULTANEOUS
##.ACQUISITION SCHEME= undefined
##.AVERAGES= 8
##.DIGITISER RES= 18
##SPECTROMETER/DATA SYSTEM= spect
##.PULSE SEQUENCE= zg30
##.SOLVENT NAME= CDCl3
##.SHIFT REFERENCE= (INTERNAL, CDCl3, 0, 15.7039)
##AUDIT TRAIL= $$ (NUMBER, WHEN, WHO, WHERE, WHAT)
$$ ##TITLE= Audit trail, XWIN-NMR		Version 3.5
$$ ##JCAMPDX= 5.01
$$ ##ORIGIN= Bruker BioSpin GmbH
$$ ##OWNER= she
$$ F:/spectra/data/she/nmr/H-F/1/audita.txt
$$ ##AUDIT TRAIL=  $$ (NUMBER, WHEN, WHO, WHERE, WHAT)
(   1,<2019-08-21 15:14:47.14 +0400>,<she>,<DPX200>,
      <created by zg, POWCHK disabled, PULCHK disabled
       configuration hash MD5:
       00 E9 B6 7A A2 85 ED C7 34 08 36 98 17 FE 4E 26
       data hash MD5: 16K
       2F 49 57 1D 8D 79 5F 95 19 BD 11 34 A7 79 22 06>)
$$ ##END=
$$ 
$$ hash MD5
$$ 0A 45 F4 53 34 CC 95 C1 F4 B5 AC CD 83 25 CD DA
##$RELAX= 
##$RELAX= 
##$RELAX= 
##$RELAX= 
##$RELAX= 
##$RELAX= 
$$ Bruker specific parameters
$$ --------------------------
##$DU= <F:/spectra>
##$EXPNO= 1
##$NAME= <H-F>
##$PROCNO= 1
##$TYPE= <nmr>
##$USER= <she>
##$AMP= (0..31)
100 100 100 100 100 100 100 100 100 100 100 100 100 100 100 100 100 100 
100 100 100 100 100 100 100 100 100 100 100 100 100 100 
##$AQSEQ= 0
##$AQ_mod= 1
##$AUNM= <au_zg>
##$AUTOPOS= <>
##$BF1= 200.13
##$BF2= 200.13
##$BF3= 200.13
##$BF4= 200.13
##$BF5= 200.13
##$BF6= 200.13
##$BF7= 200.13
##$BF8= 200.13
##$BYTORDA= 1
##$CFDGTYP= 0
##$CFRGTYP= 5
##$CHEMSTR= <none>
##$CNST= (0..31)
1 1 145 1 1 1 1 1 1 1 1 1 1 1 1 1 1 1 1 1 1 1 1 1 1 1 1 1 1 1 1 1 
##$CPDPRG= <>
##$CPDPRG1= <>
##$CPDPRG2= <>
##$CPDPRG3= <>
##$CPDPRG4= <mlev>
##$CPDPRG5= <mlev>
##$CPDPRG6= <mlev>
##$CPDPRG7= <mlev>
##$CPDPRG8= <mlev>
##$CPDPRGB= <>
##$CPDPRGT= <>
##$D= (0..31)
0 1.2 0 0 0 0 0 0 0 0 0 0.03 0 0 0 0 0 0 0 0 0 0 0 0 0 0 0 0 0 0 0 0 
##$DATE= 1566386086
##$DBL= (0..7)
120 120 120 120 120 120 120 120 
##$DBP= (0..7)
150 150 150 150 150 150 150 150 
##$DBP07= 0
##$DBPNAM0= <>
##$DBPNAM1= <>
##$DBPNAM2= <>
##$DBPNAM3= <>
##$DBPNAM4= <>
##$DBPNAM5= <>
##$DBPNAM6= <>
##$DBPNAM7= <>
##$DBPOAL= (0..7)
0.5 0.5 0.5 0.5 0.5 0.5 0.5 0.5 
##$DBPOFFS= (0..7)
0 0 0 0 0 0 0 0 
##$DE= 6
##$DECBNUC= <off>
##$DECIM= 24
##$DECNUC= <off>
##$DECSTAT= 4
##$DIGMOD= 1
##$DIGTYP= 9
##$DL= (0..7)
0 120 120 120 120 120 120 120 
##$DP= (0..7)
150 150 150 150 150 150 150 150 
##$DP07= 0
##$DPNAME0= <>
##$DPNAME1= <>
##$DPNAME2= <>
##$DPNAME3= <>
##$DPNAME4= <>
##$DPNAME5= <>
##$DPNAME6= <>
##$DPNAME7= <>
##$DPOAL= (0..7)
0.5 0.5 0.5 0.5 0.5 0.5 0.5 0.5 
##$DPOFFS= (0..7)
0 0 0 0 0 0 0 0 
##$DQDMODE= 0
##$DR= 18
##$DS= 0
##$DSLIST= <SSSSSSSSSSSSSSS>
##$DSPFIRM= 0
$$ [...]
##$SUBNAM2= <"">
##$SUBNAM3= <"">
##$SUBNAM4= <"">
##$SUBNAM5= <"">
##$SUBNAM6= <"">
##$SUBNAM7= <"">
##$SUBNAM8= <"">
##$SUBNAM9= <"">
##$SW= 24.9336996594482
##$SWIBOX= (0..15)
0 0 2 0 0 0 0 0 0 0 0 0 0 0 0 0 
##$SW_h= 4990.01996007984
##$TD= 16384
##$TD0= 1
##$TE= 0
##$TE2= 300
##$TE3= 300
##$TEG= 300
##$TL= (0..7)
0 120 120 120 120 120 120 120 
##$TP= (0..7)
150 150 150 150 150 150 150 150 
##$TP07= 0
##$TPNAME0= <>
##$TPNAME1= <>
##$TPNAME2= <>
##$TPNAME3= <>
##$TPNAME4= <>
##$TPNAME5= <>
##$TPNAME6= <>
##$TPNAME7= <>
##$TPOAL= (0..7)
0.5 0.5 0.5 0.5 0.5 0.5 0.5 0.5 
##$TPOFFS= (0..7)
0 0 0 0 0 0 0 0 
##$TUNHIN= 0
##$TUNHOUT= 0
##$TUNXOUT= 0
##$USERA1= <user>
##$USERA2= <user>
##$USERA3= <user>
##$USERA4= <user>
##$USERA5= <user>
##$V9= 5
##$VALIST= <valist>
##$VCLIST= <CCCCCCCCCCCCCCC>
##$VD= 0
##$VDLIST= <DDDDDDDDDDDDDDD>
##$VPLIST= <PPPPPPPPPPPPPPP>
##$VTLIST= <TTTTTTTTTTTTTTT>
##$WBST= 1024
##$WBSW= 4
##$XGAIN= (0..3)
0 0 0 0 
##$XL= 0
##$YL= 0
##$YMAX_a= 45076
##$YMIN_a= -76357
##$ZGOPTNS= <>
##$ZL1= 120
##$ZL2= 120
##$ZL3= 120
##$ZL4= 120
##$ABSF1= 10
##$ABSF2= 0
##$ABSG= 5
##$ABSL= 3
##$ALPHA= 0
##$AQORDER= 0
##$ASSFAC= 0
##$ASSFACI= 0
##$ASSFACX= 0
##$ASSWID= 0
##$AUNMP= <proc_1d>
##$AZFE= 0.1
##$AZFW= 0.1
##$BCFW= 1
##$BC_mod= 2
##$BYTORDP= 1
##$COROFFS= 0
##$CY= 11.3945322036743
##$DATMOD= 1
##$DC= 2
##$DFILT= <>
##$DTYPP= 0
##$F1P= 20.1720416913024
##$F2P= 0.152960286110954
##$FCOR= 0.5
##$FTSIZE= 0
##$FT_mod= 4
##$GAMMA= 1
##$GB= 0.15
##$INTBC= 1
##$INTSCL= 1
##$ISEN= 128
##$LB= 0.24
##$LEV0= 0
##$LPBIN= 0
##$MAXI= 10000
##$MC2= 0
##$MEAN= 0
##$ME_mod= 0
##$MI= 1.114404
##$NCOEF= 0
##$NC_proc= 0
##$NLEV= 6
##$NOISF1= 3.799351
##$NOISF2= 2.8
##$NSP= 1
##$NTH_PI= 0
##$NZP= 0
##$OFFSET= 15.70392
##$PC= 1
##$PHC0= -9221.999
##$PHC1= 31.00096
##$PH_mod= 1
##$PKNL= yes
##$PPARMOD= 0
##$PSCAL= 0
##$PSIGN= 0
##$REVERSE= no
##$SF= 200.130013532006
##$SI= 16384
##$SIGF1= 3
##$SIGF2= 2
##$SINO= 400
##$SIOLD= 16384
##$SREGLST= <1H.CDCl3>
##$SSB= 0
##$STSI= 0
##$STSR= 0
##$SW_p= 3612.71676300578
##$SYMM= 0
##$S_DEV= 0
##$TDeff= 0
##$TDoff= 0
##$TI= <>
##$TILT= no
##$TM1= 0
##$TM2= 0
##$TOPLEV= 0
##$USERP1= <user>
##$USERP2= <user>
##$USERP3= <user>
##$USERP4= <user>
##$USERP5= <user>
##$WDW= 1
##$XDIM= 8192
##$YMAX_p= 0
##$YMIN_p= 0
$$ End of Bruker specific parameters
$$ ---------------------------------
##NTUPLES= NMR FID
##VAR_NAME=  TIME,          FID/REAL,        FID/IMAG
##SYMBOL=    X,             R,               I
##VAR_TYPE=  INDEPENDENT,   DEPENDENT,       DEPENDENT
##VAR_FORM=  AFFN,          ASDF,            ASDF
##VAR_DIM=   8192,          8192,            8192
##UNITS=     SECONDS,       ARBITRARY UNITS, ARBITRARY UNITS
##FACTOR=    0.0002004,     1,               1
##FIRST=     0,             0,               0
##LAST=      1.6414764,     0,               0
##MIN=       0,             -76357,          0
##MAX=       1.6414764,     45076,           0
$$ Real data points
##PAGE= N=1
##DATA TABLE= (X++(R..R)), XYDATA
0@%%%%%%%%%jRj6J6j6J7k5L2l3M1m9N7o8P7r0J06j21J37j57J79k02K28k58K90
33A53l24L62m03M49m99N54o14O79p52Q34r24J023j133J257j399J562j749J966
51A042k225K539k929L429m099N046o500R048j4831N4556j0509p5035K8365L9073
65B6970J3164k4883p396o130l325J153J9175N268j6794k3405J022J6976J3384
78A5179q330j4235j303J3951J496j6300p658J9964J3982j7156k1847Q859K0748
91G350K499j1831n499m27j926L448J2240M220j3312j2498P051J5666L682q052
105B611q065l97P487P718j050o537j368N565K004m556j817K593K394j595k886
120B101k538o61L241M019k699r688m821O297O723k332n733k547q94J322M201J416
$$ y = [0, 0, 0, 0, 0, 0, 0, 0, 0, 0, -1, 8, -8, 8, -8, 9, -16, 16, -17, 24, -25, 32, -36, 41, -49, 57, -64, 73, -84, 95, -107, 121, -137, 153, -171, 191, -212, 237, -262, 292, -322, 357, -395, 439, -485, 538, -595, 662, -737, 825, -924, 1042, -1183, 1356, -1573, 1856, -2243, 2803, -3697, 5351, -9480, 45076, 34567, -40468, -12103, 26970, 40134, 15251, 7855, 1725, -1600, -447, 18728, 23996, 7202, -16203, -15181, 1795, 15179, 6849, -7386, -8689, 5262, 6758, -9542, -17200, 2764, 16746, -410, -22257, -13398, 7350, 9849, -1982, -7481, -7908, -9834, -6386, 5854, 10074, -3238, -15736, -8685, 6981, 10663, 2611, -5454, -5851, 1636, 9354, 8304, 1767, 399, 5964, 7968, 3412, 1595, 4188, 6582, 4987, 2101, -437, -1098, 2143, 6162, 3463, -6225, -11046, -4749, 1974, -358, -6091, -8638, -9532, -8210, -4009, -2593]
136b593o463n173L267O831o47n353j780L915L761j305n512k847N249Q503o76j0007
152a0830m095Q223Q391j513l631j396j803k44R051Q350o100j1820N58J2336O800
167A2277m455p080j848M021N233J063n605m214L802M654l964m836L022L234l683
182A621k778L513j230o279J409R888R81j2665o497Q560R136j397o891m203K59
197f573M151N255N26o149l993K260L034J266K439p25o160l302P405P373l735p082
213d010K113N800j523k740M618M072m993m314L521N708p1l403j109P0k09K565
229F095K275k499m378p92K005R94N03o45l975l092K393M919j040n623j708K616
245a952P44j489J021P29k388j856K142K474j398j626R87P93j390m26K451J398
$$ y = [-2593, -9056, -14229, -10962, -4131, -4778, -10131, -11911, -7996, -4235, -5540, -11052, -13899, -8650, -147, -823, -10830, -14925, -6702, 1689, 176, -3455, -4851, -6654, -6898, 2153, 10503, 4403, -7417, -6859, 5477, 12277, 7822, 742, -1106, 2915, 8148, 9211, 3606, -608, 3194, 7848, 3884, -952, 2070, 5304, 1621, -1157, 2356, 1126, -5153, -3744, 6144, 7125, -5540, -12037, -3477, 5659, 4262, -2629, -6832, -6573, -2422, 2833, 3359, -2790, -6783, -4523, -1489, -223, 2216, 1491, -4669, -7971, -566, 6807, 3072, -4010, -1897, 3903, 2380, -360, 4258, 8330, 3337, -977, 2544, 8252, 8181, 4778, 3669, 3739, 3530, 6095, 8370, 5871, 1493, 701, 2706, 3700, 4203, 3558, -417, -3509, -1116, 3803, 2763, -2860, -4568, -1952, -1208, -2697, -1676, -947, -3335, -5191, -3049, -575, -1973, -3599, -2612, -1819, -3209, -3635, -1184, 214]
261B14j597j185n8J090J933J594o78k312l58K315K436M16m15j375j284J448L757
278E941R47l174k537J970K140J71q14j146j731j076J660K014j755k612n82J87
294c97O33M38r94k044j846J360J588q94j625K94K85j072n19K235N20k197j059
311e294K165N14j504J061K029r49j812J008J748M35m28J150j33j429J109L025
327B695R22k421r97J888J150L7R92P61k391j507K256K520j480k289k4O63o33J02
345B244J135j238k251l40J319Q6j889n77J141j602j603J345J458j912j760Q27
361c617Q39j369O22R48j40j890P4J955O14q82m23J172j17l27J348J389j513l75
379a692J134J787m74n61J397M13m61J99Q43P8K49j66O53J75q33M90J79j51o84
$$ y = [214, -1383, -2568, -2626, -1536, 397, 1991, 1313, -999, -1357, 958, 3394, 3810, 3395, 2020, 736, 2184, 5941, 6888, 3714, 1177, 3147, 5287, 5458, 4644, 3498, 1767, 691, 2351, 4365, 2610, -2, -584, -397, 236, 674, -320, -2364, -4210, -2850, -1262, -2156, -3781, -3487, -3202, -4274, -4793, -2558, -2038, -4235, -5294, -3129, -2615, -4119, -3058, -1029, -1978, -3790, -2782, -1034, -599, -1027, 123, -10, -1439, -330, 2695, 3617, 1196, 199, 2087, 3237, 3274, 4266, 5027, 2636, 1129, 3385, 5905, 4425, 2136, 2112, 2775, 2142, 2244, 3379, 2141, -110, -450, 869, 955, -934, -1511, -370, -1972, -3575, -2230, -772, -2684, -4444, -3617, -2778, -4147, -3525, -2577, -2717, -4607, -4533, -2578, -1964, -2846, -3269, -2097, -2214, -2541, -1193, 196, -1317, -1692, -558, 1229, 755, 194, 1591, 2004, 1543, 1742, 2585, 2663, 2912, 2746, 3399, 3574, 2741, 3231, 3410, 3259, 2575]
398B575L6J78j189l83n5L32j097q02L17m61r81J2K20k57q81l12l79N40m01p25
418c713K55J64k38L82J95no77O27L84Q6Q8J89P83L15L25q4O77J113k56J56O39
439A405r4J27J064O53q6m42L45P96J21q1p61K68M40m89J46j49o89k73N79j00j566
460A214r2R9Kp24n86k36O4o49J48n44r07k23R9Q58k97p29r7K64M05l10j17k30
482b588j06J154L97J58r36Q03Q29O26j13OK59R13Q1o6P45p3l20Q43N66k90Jl1
504B858O68k28m4m09n61L84l55k28m61k68j87J19r1j483m97N41L48j318j019K08
524b023K52l44m56k68q45k43L66P77l64j005Q2J390p7q09J19K97M16Q81M19m29
544a864r29J086K344M82k076l04J261J944J96q91L6l86N08J624Q27j140j775R38
$$ y = [2575, 2611, 2789, 1600, 1217, 1162, 1494, 397, -405, -88, -549, -1530, -1518, -1298, -1555, -2436, -2748, -3127, -2587, -2988, -3713, -3458, -3294, -3532, -3150, -2955, -2960, -3637, -3010, -2626, -2540, -2452, -2263, -1480, -1165, -840, -924, -247, 866, 610, 766, 1405, 1311, 1438, 2502, 3155, 3069, 2627, 2972, 3768, 3889, 3808, 3047, 3315, 3755, 3266, 3412, 3263, 2574, 2301, 2880, 2780, 1214, 1122, 1221, 1223, 499, -87, -323, -259, -908, -760, -1304, -2211, -2434, -2335, -1477, -1774, -2503, -2600, -2336, -1931, -2241, -2358, -2588, -2694, -1540, -1143, -985, -1921, -1118, -289, 337, 224, 230, 489, 1402, 1483, 1417, 2162, 2089, 1769, 2612, 3178, 2888, 2889, 2858, 3526, 3298, 3254, 2845, 2284, 2668, 2313, 2085, 1624, 1356, 1169, 1288, 1197, -286, -783, -242, 106, -1212, -2231, -2023, -1771, -2115, -2571, -2839, -3684, -3927, -3561, -2784, -3148, -4153, -4071, -2681, -2758, -3567, -3448, -3151, -2735, -1854, -1435, -1864, -2793, -1707, 637, 1119, -957, -1261, 0, 1944, 2140, 1249, 1285, 899, 1407, 3031, 3858, 2718, 943, 1881]
562A881J915Nj140q30m94J94J312L19j868k163J027J683k88k311o57J209l33n53
580a092m72j65r31m07J323Q8j544r60J059J089j77o60l93m48J337J299k15k026
598c295p8K332J553j174o29R00Q01Q2j84R52L39k77L20N38J28j0L27M11o13j12
618B311M20k30M74K36n92j308j81J825O65k405k203R60J657K88j356k096q47J456
636i26J087m33k026j248O69J538K42j105j265r82J312J951J000k929k353K121
652c347L553J33k868j444J303K598J053m30k225m49K450K832p77k087l85J270
668A180J191J372r8k121j609J893M103j209l744j529L376K122j234k416j062P47
684I62J257R87j357k421q99K120J049j206j434k11k79l61K050L92l088j917K425
$$ y = [1881, 3796, 3801, 2661, 1831, 1337, 1531, 2843, 3162, 1294, -869, 158, 1841, 1553, -758, -1415, -206, -539, -1092, -1564, -1729, -2660, -3067, -1744, -1656, -3200, -4160, -3101, -2012, -2189, -2849, -3242, -3690, -2353, -1054, -1269, -3295, -3373, -1041, 512, -662, -1291, -391, 410, 492, 308, 1260, 1599, 1322, 1642, 2180, 2308, 2298, 2625, 3036, 2423, 2311, 2731, 2501, 2975, 3211, 2619, 1311, 1130, 2955, 3620, 1215, -988, -28, 1629, 1917, 561, -1535, -2382, -926, 161, -272, -2298, -3546, -2877, -1339, -1097, -2202, -3467, -4449, -3137, -1186, -186, -3115, -5468, -3347, 206, 339, -2529, -3973, -2670, -72, 981, 551, -1674, -2123, 327, 3159, 2382, 295, -90, 1180, 2371, 3743, 3645, 1524, -85, 1808, 5911, 4702, 958, -571, 2805, 4927, 3693, 1277, 215, 962, 2219, 3206, 1849, -572, -1471, 649, 1698, 492, -942, -1153, -1432, -1793, 257, 649, -2439, -4356, -1931]
701a931K594j811k636J014J900J88j707L87J014m76M6Q31k20l79J216N98r96k04
719e72J050J086r97P1J417n70j220J246J764ql026k96K937J069k132j798J395
736A416O60j41m18r77j113R51J450j033k345q4J404n2p02J98o83j832J47L067
754h7R48l208k969J446L612L78k154j734K21J363J912N70k470j302J672J510L06
771A4J8l09n84m90J773K382j215k241K36K462P35j436n48N44N73K77r6j183q10
790A02J314J597j417j810M40J230r08J06M39n92k057j98K162Q85j892k452M56
807b595J705N52n29j093r22J72J867O9j115P1Q46q94o35K148J600j910j834J320
825a177K664l05j618K62J782j51j274Q18J598k15j081L51M45O5N84L07j107k51
$$ y = [-1931, 663, -1148, -3784, -2770, -870, -682, -2389, -2002, -988, -1464, -1418, -587, -807, -1186, 30, 628, -368, -572, 478, 1564, 567, 638, 2055, 1485, 265, 1511, 3275, 3267, 241, -55, 2882, 3951, 1819, 21, 1416, 2076, 1935, 1517, 540, -573, 378, 1828, 795, -1550, -1634, -230, -282, -984, -786, -1469, -3301, -3154, -87, 861, -2347, -5316, -3870, -258, 120, -2034, -3768, -3547, -2184, -272, 298, -2172, -3474, -1802, -292, 14, 32, -277, -861, -1351, 422, 2804, 1589, -652, -416, 2046, 2781, 1345, 797, 1341, 1914, 2191, 2095, 912, 102, 1416, 3013, 1596, -214, 226, 1456, 548, 654, 1093, 501, -1556, -1754, 408, 1293, -599, -3051, -2595, -890, -338, -867, -1960, -2882, -2710, -843, -774, -1889, -1818, -972, -1866, -2501, -353, 1247, -663, -2497, -1177, 1487, 1182, -436, -174, 1608, 1457, 183, 1001, 2599, 2384, 1303, 1654, 2099, 2164, 2748, 3055, 1948, 1697]
843A697P36k72r42L86J394p81k325K56J861M51k398o71J130o28j313R03J461j299
861c54k813N56J928J6o08k47r70q13R55J619L23j971n20O46P69M22J344r00k111
880b729O91K192J694j548n95L78P0L14J190R70j337j352J075K090l12j503M22
897A710N44k78j67O76l92r29j82J083j09j002l83Q9K71k11l42j126j195J325J308
916F90q22j998l94J399L33q40Q3k44q87k66J831K60j094q03M55P95K65p8L02m1
936a054m0M45K7l06P65J269j33j225m14J627J148m33J62o48q59N16J952R95j409
955B385k069L19J421Q00l67p91q12j153J013J148n78j378m0l81k82L41P01k69
973Hk055n15R83Q64j166O22O78j292j600P65K468J8j564n15K56K63N70J340l60
$$ y = [1697, 2433, 2161, 1219, 1605, 2999, 2218, -107, 149, 2010, 2461, 63, -608, 522, -106, -1419, -516, 945, -354, -3167, -2611, -683, -667, -1275, -1522, -2492, -3305, -2350, -731, -408, -2379, -2899, -2253, -1484, -1062, 282, -618, -2729, -2038, 154, 1848, 300, -295, 83, 153, 467, 1657, 2627, 1290, -62, 1013, 3103, 2791, 1288, 1710, 2254, 1976, 1809, 2485, 2093, 1164, 982, 2065, 1956, 954, 571, 660, 931, 720, 378, -748, -1943, -618, 690, -132, -2130, -2524, -1125, -792, -1632, -1549, -1793, -2680, -2946, -1115, -855, -1949, -2752, -2297, -1502, -1237, -1315, -1013, -1054, -1094, -649, -622, -928, -163, 1106, 973, -252, -666, 961, 2109, 1676, 1838, 1190, 331, 847, 2799, 3794, 2385, 316, 635, 2056, 2856, 2489, 1698, 886, -267, 746, 1894, 1316, -62, -102, -483, -765, -424, 277, 8, -2047, -2562, -1579, -715, -1881, -1259, -581, -1873, -3473, -2708, -240, -222, -1786, -2301, -2045, -1782, -1212, 128, -232]
992b32j675l12J532J297k88K91k14r31N12J630P45p43q41P38j7o84Q89J010j41
1011B566j849k32J202O37n70o9k34r04r08J238J164p09j949o60J68Q54O10j61
1029A94j360j604O25J592M97j354m20l13l28N36J325N6j684m16P70O21L0O31J23
1048d79n16l40N11J294q4k76j69M68j53N56P01L34r04RL77P10k91L49l73l96k73
1069A055Q27L0p16m74P14l60n76N9O9m01l72L13J47n64p12J62J14m43M5J01p29
1090a711l04P88N19q03l19r0O85l6J60L25j61n52M23Q78L81n88J36L48J9K15N60
1111H73O24l28n00P28L78m96O50M79j01r45O93M60j12m77l39J73m36j30P60j58
1131A796q71o31M69L64o05p6j03r46l62K37N78m87r08J93K25l35M0J78k64l95
$$ y = [-232, -1907, -2219, -687, 610, 322, 613, 399, -532, -20, 1610, 2355, 1612, 771, 1509, 1492, 808, 1697, 2707, 2566, 717, 485, 1687, 2324, 1754, 1685, 1451, 547, -361, 877, 2041, 1332, -617, -1277, -1109, -255, 355, 194, -1166, -2770, -2145, -553, -56, -1410, -1830, -2143, -2471, -1935, -610, -554, -2238, -2654, -1884, -1263, -1233, -602, -479, -995, -1335, -824, 470, 386, 110, -59, 409, 256, 812, 1513, 1847, 943, 952, 1329, 2039, 1748, 2097, 1724, 1328, 1055, 1882, 1912, 1196, 722, 1436, 1076, 500, 559, 628, 227, -145, 168, 315, -249, -961, -799, -685, -1128, -1083, -982, -1711, -2015, -1227, -708, -1511, -1830, -1920, -1235, -1271, -1111, -786, -947, -1499, -1076, -198, 183, -405, -269, 79, 98, 313, 873, 1497, 1169, 669, 1397, 1775, 1279, 1929, 2408, 2307, 1362, 2055, 2515, 2403, 1926, 1587, 1760, 1324, 1194, 1954, 1796, 925, 294, 763, 1127, 522, 446, 343, -603, -965, -728, -150, -637, -1545, -1352, -1127, -1462, -1422, -1244, -1508, -1903]
1151a903l26Q50J66k27M43J47m73l1O21L87k15k6L1M82P5K79L21O3o76K50N01
1172G39J04M10p0n1J85Mp1L52o04k50M41K29m02k85r3Q0n57J82j43n27O4j43m9
1195d55r4m15k42o4j69j63L0K76l41k24K55l13J83J99n2j85J4K81K02K53o2j06
1217a192M14L04M90O9m0N2J19L19K42JK42j41k52N20M92l29k87J48j9J94R1j84
1239A253k53J27j70j36n6J88j46q3r31k37L89M28n05n50l37J57J65N2K31o97n17
1260a628J42O58N07m04o29k11N35O46K45r31j37L59O94L31k36J53L68r1p8K33
1280E26O02j08l59K36O76N3o09J93O38j28r9o13M84K6K09m20m50k49N77M06p49
1301H42o27K00Q7l88j89l35k68K21o13J14K22K65o70J2j06J97k93J36j53M79n98
$$ y = [-1903, -2229, -1379, -1213, -1440, -997, -850, -1323, -1354, -733, -346, -561, -587, -556, -74, 1, 280, 601, 664, -12, 238, 739, 843, 1253, 1183, 1132, 1317, 1321, 1250, 1602, 998, 748, 1189, 1418, 1016, 731, 638, 718, 161, 343, 200, -327, -263, -406, -455, -549, -964, -1206, -1270, -1439, -1602, -1572, -1296, -1637, -1861, -1606, -1919, -1736, -1537, -1589, -1774, -1760, -1479, -1277, -1024, -1086, -1192, -778, -474, 16, 85, 45, 97, 216, 535, 777, 778, 1020, 879, 627, 1147, 1639, 1310, 1023, 1171, 1152, 1346, 1437, 1253, 1000, 1127, 957, 821, 765, 953, 807, 724, -207, -444, -55, 373, -132, -682, -1019, -862, -697, -645, -414, -1111, -1628, -1486, -828, -321, -725, -1354, -1565, -1030, -384, -139, -1070, -1207, -848, -154, 177, -59, 94, 462, 371, 293, 526, 1128, 1020, 661, 897, 1573, 1626, 1017, 1210, 1848, 1720, 1621, 1008, 1492, 1518, 1727, 1307, 857, 608, 1185, 1591, 842, 215, 415, 502, 114, -75, -410, -678, -457, -1070, -956, -734, -469, -1139, -1127, -1233, -1036, -1329, -1193, -1346, -867, -1465]
1322a465OK42O27P1l37o10L66J270J70n3q07J76O19P84n82k8P5j90N45O49j35
1343A393n43o12N08R56J14q53q36O78O30j48o09r33L66P62j9o83j000K27Q20k84
1363f6l18o57l50J27K44N18n7j578m48J367Q75o02p86j97N91N77K01n40k34p1
1383a404L12N90J34j85J10M24k84K41Q58l85l79N07N98K04r44K35P46K23o56k93
1403F52M65L86l12N6m10M7j89K61J2m00j72J39p28M1L26M64j124J5N3n10M66o75
1425a137L79P1l47n34J39P20Kl54l94L65N64K24o96m04M23N30M00l02J51K29k31
1446b02K29J022l21l11k01K16O61M20o22l46O39K85M70o01m98n5M55O01q47m02
1466E92K68k23L6J57j46o51l75L73M79m11r32K36P1J16j30k40o85lO54K4j13q40
$$ y = [-1465, -1459, -1217, -590, -519, -856, -1466, -1100, 170, 340, 287, -520, -344, 275, 1059, 477, 449, 524, 334, 879, 1528, 1393, 850, 238, 746, 1702, 1816, 963, 127, 805, 1435, 1287, 678, -255, 111, 873, 854, 171, -829, -602, 218, -66, -384, -1041, -1391, -1264, -1020, -502, -559, -2137, -2585, -1218, -343, -945, -1731, -1928, -1337, -760, -559, -1099, -1333, -1404, -1092, -502, -368, -553, -443, -19, -303, -62, 796, 411, 32, 539, 1137, 1341, 397, 632, 1378, 1601, 945, 652, 1117, 1503, 1191, 1247, 837, 884, 695, 956, 968, 568, 396, 535, -193, -152, 174, 638, -486, -471, -418, -928, -462, -1137, -758, -687, -1034, -1568, -1429, -709, -707, -1061, -1455, -1090, -526, -302, -998, -1402, -979, -449, -49, -351, -200, 29, -202, 27, 1049, 728, 417, 216, 432, 1093, 1513, 891, 545, 1184, 1469, 1939, 1338, 840, 785, 1240, 1841, 994, 592, 860, 637, 673, 830, 684, 33, -342, 31, 510, 99, -833, -597, -526, -410, -540, -780, -1465, -1468, -814, -790, -903, -1743]
1488a743N16N14l49k94K64L72n12K54O45L0l43j11N58M50j75K93k32O7L22J66
1508F92N05l37j48K95K95l94L6M18n9o82M86L55p5p74j97J00l36L28j02m19J2
1529am45N57J34n44k85J2j07J65k65J3n13R4N34J85o84k44M27L39k84j70Q7L5
1551i60L43L29j9r0k48O00K03K14k53N01k96k62R15j75o6k41P6N05n9l06J9M31
1573A161l23k28M38l38j85K47k14K30p09J49k01K4j13L0k39j18j81N5j44k79K03
1594g35J01j74k95M59j30l61j19K21J91l64M49j11L8l72K30J011j32p8l69N08
1614c2L02p1L00j31l59L02K42K70j03J23j42oJ15r2M65k13l23L20J15l33k51K86
1636G84q9k13l68J49l7l29J44j24k19n30N19K14k84q08M68K32l55K31J8l06p59
$$ y = [-1743, -1227, -713, -1062, -1356, -1092, -720, -1232, -978, -333, -303, -646, -757, -199, 251, 76, 369, 137, 204, 526, 692, 1197, 860, 712, 1007, 1302, 908, 944, 1362, 1303, 621, 1107, 1462, 1387, 613, 416, 516, 180, 508, 406, -13, -1, -446, 111, 245, -299, -584, -572, -679, -514, -779, -766, -1279, -1185, -651, -466, -1150, -1394, -967, -628, -912, -1082, -995, -960, -617, -288, -307, -397, -645, -45, 158, 372, 119, 620, 324, 62, 977, 802, 736, 495, 571, 1076, 1017, 711, 730, 1161, 838, 610, 1048, 710, 525, 772, 558, 788, 79, 228, 27, 51, -62, -32, -271, -389, -570, -515, -659, -938, -735, -634, -808, -1103, -644, -774, -1135, -1254, -1033, -842, -1206, -757, -868, -830, -1202, -972, 39, -93, -171, -540, -32, 270, 199, 499, 368, 9, 311, 553, 823, 720, 843, 701, 695, 810, 718, 1183, 970, 647, 967, 1082, 749, 498, 784, 695, 482, 114, 263, 226, -103, 41, -83, -302, -832, -313, -99, -383, -1191, -723, -491, -846, -615, -597, -903, -1662]
1657a662O57R86l40p32l02N68O22k69J12mn8M7P94K41n04k87O85J03N1J00o8m8
1679F92J61PL25k87l26N49J54n67j12J54N25m80l30M79l64k39R8J51o78m67J94
1700c61K02J78m52K04n34k9JL34l54j47J21K96j94l59L54J19m10K15N40k73l29
1721h78L79M86j0n91L70N67n7J28k8q2j04J27O88j48m95jP34j89K8K01j95n03
1743D27K24M75j29o74j91J90M24l52k54Lr1l13L40l28k5k68m2J21k91j42O6K73
1765e57l55J2j45J64k89M42J20k24j72M66NP1l39M41l50P95j90L56l57j38M87
1786B43J88L99k80R1r2J73j04L78j87m78N25L09m00j73j33L85k12j18k45L88m37
1807B20O4K15k71l42m24M96ol52j75l2L29k20P4j84l81q5J68K95l89r7J67M26
$$ y = [-1662, -1005, -19, -359, -1091, -1393, -825, -203, -472, -360, -364, -422, -375, 419, 660, 156, -131, 554, 657, 708, 808, 740, 692, 853, 860, 1185, 898, 572, 1121, 1275, 708, 596, 750, 1275, 795, 465, 944, 580, 341, 439, 590, -88, -555, -361, -159, 19, -433, -229, -763, -792, -791, -457, -811, -958, -837, -541, -735, -1094, -740, -621, -1031, -816, -276, -549, -878, -499, -13, -23, -614, -244, 323, 266, 394, 366, 284, 180, 307, 995, 847, 352, 351, 1085, 896, 924, 1125, 930, 427, 651, 1126, 997, 323, 132, 322, 746, 394, 140, 143, 52, -261, 79, -249, -274, -542, -584, -463, -754, -896, -830, -557, -912, -900, -1045, -881, -1170, -728, -608, -832, -1004, -538, -533, -462, -801, -360, -710, 85, -105, 251, -106, -244, 243, 431, 830, 550, 641, 549, 722, 618, 996, 809, 331, 856, 1165, 765, 592, 459, 844, 632, 514, 269, 657, 220, 284, 499, 228, -114, -538, -42, -48, -400, -575, -607, -278, -498, -424, -608, -989, -1074, -906, -611, -1000, -1097, -930, -504]
1829e04l29M06m57J03L78QL95j31n08N31O21o07n3J80L33j65O10j57j69M1J04
1850F30L98J40j65n55J92j63L09Q2n38K08j67j47M29n00L2k74R6J88j35k66J2
1871a94j53k10kl29J11R9J32k61k89J17M19K29j69m4J0j59J36K06l58K88K44k3
1893b00K40m63L01J35L98k49K58k34K87M04N9k50m08L47K45p9O0r2o27N21J72
1914H25J13n55m98K55M13j62j01k08J31l80k15M83o20K33n56K85K79o68M40r8
1934f04l9k8j59R1K21JJ69l15k68L82K36K15l2m46K32J04K07N82n50rO7J75M97
1957G29j96J0q0M5O27k00n25j30J64O75j91n60n8J79M35l30l53k72L73M2k03K8
1979B09l84l54M00J96k62m56N6K09r8j05k7m31J02M19N33o43l97J04L48K16k28
$$ y = [-504, -833, -427, -884, -781, -403, -395, 0, -131, -639, -108, 513, -94, -147, 33, 366, 201, 811, 654, 485, 526, 630, 1028, 1168, 1003, 448, 640, 477, 786, 868, 330, 538, 371, 224, 653, 153, 185, -89, 7, 195, 60, -206, -194, -347, -557, -559, -888, -777, -678, -546, -807, -1096, -979, -560, -331, -500, -544, -534, -693, -557, -351, -709, -421, -177, -200, 40, -423, -122, 13, 411, 162, 420, 186, 473, 877, 936, 686, 278, 625, 870, 791, 851, 759, 132, 653, 825, 938, 383, -115, 140, 553, 391, 290, 82, 213, -167, -382, 101, -519, -286, -842, -557, -278, -946, -506, -604, -643, -671, -830, -739, -518, -517, -348, -663, -931, -549, -313, -98, -130, -576, -344, -240, -33, 549, -1, -10, 57, 232, 729, 533, 543, 463, 508, 1135, 935, 410, 280, 444, 1119, 928, 368, 310, 489, 924, 594, 241, -31, 342, 384, 181, 209, -175, -529, -129, 67, -195, -651, -595, -386, -484, -589, -616, -1047, -945, -526, 7, -636, -1033, -929, -581, -365, -593]
2000e93J77j11K93L2K60m61L88O6M83l63J61n2OJ32J17q8j48O8J72P06m01m07
2022D37j77M29L7Q4m15L3j72K51Q3j60M4p28L41l29m6K65l26q6J19K82k51o66
2044i51j78P89J42l08k23j00O5L82k34o6J83R3K92j53k06M9K91OK24j01K89m49
2066a64K65M67K5l48l6L76K16Jk18m97L84N17J45l65j30k51J91J50j71l95l33
2087a71M58L66m86ln39K7L69p1Q8p43J22L56q7j33j32k89L30K9q3j42R7j5O2Q5
2111e05j90Q8M01M6Rj62K52k9J84j50K20q6J3K58J30j05l7oL2L84J67k20j52j04
2135D38M5N0J5k00k28L28q5j67R1LK5l93p2M7j16j5L01j67l02M7k9J33m0l88l55
2160a034K81L07r2J11k52Q8m9O0L23J20K19l32q5L35J50j24n3K15J72k6K34k72
$$ y = [-593, -416, -527, -234, -202, 58, -403, -15, 51, 534, 171, 332, 280, 286, 418, 535, 447, 299, 367, 539, 1245, 844, 437, 260, 689, 726, 810, 395, 428, 256, 507, 590, 430, 474, -254, 87, -242, -288, -23, -349, -435, -316, -34, -285, -951, -1129, -340, -198, -506, -729, -829, -764, -382, -616, -682, -499, -406, -114, -267, -473, -424, -133, -127, 97, -4, 285, -164, 101, 568, 593, 245, 209, 585, 801, 802, 584, 87, 471, 988, 1133, 768, 638, 387, 578, 728, 557, 162, -171, 287, 653, 167, 164, -375, -348, 21, -50, 38, -705, -583, -227, -314, -447, -579, -868, -538, -509, -592, -734, -637, -652, -590, -505, -695, -607, -206, -160, -151, -313, -61, -90, 94, -56, 164, 78, 91, 349, 479, 374, 337, 331, 363, 747, 914, 694, 542, 438, 483, 533, 548, 348, 120, 448, 363, 196, 287, 290, 315, -78, -150, -103, -219, -234, 67, -100, -402, -355, -384, -251, -291, -679, -1034, -753, -446, -538, -427, -679, -591, -640, -580, -257, -137, 82, -250, -335, 0, 150, 26, -27, 188, 360, 334, 568, 296]
2182B96K65k7J65m5j39j66N03l88M13O8m67N4j00K33m85rJ62l4Rj70o9Ol62J16
2206a71J66k51j52K03k86N3k85K19k36K85k15J33J93k08K05o1M8l30J63J07J73
2227b47p2K41Q2k37M10p0j90L37m2L82l0L7j71K78q8j32J17r4J98k70K92j02J8
2250F47o1j14j60K8Q9m09J67j1j62N2l00j07J95j00r3J03j61J0K47n61J84l03
2272h20L10j09J31K44k59K27o5r3q4P8M3M70k28J1J89k75N66j84m5L72p8l04L7
2295A34K25K60j13j37J9J3J23Q6K6P0m0l68q8K24j68J60J00l53l04m0J14M5j37
2318a49J2j80J63j09j85J49l49Or6L4L10l97K98j85k06M91k08k23J9M14j80L01
2340b70J68J52J88j92P4j97L77M3j78o1K28J70k12J29R1N5n6k26m2O44l69j87
$$ y = [296, 561, 534, 699, 654, 515, 349, 852, 464, 877, 945, 478, 532, 432, 665, 180, 171, 333, 299, 308, 138, 69, 75, -287, -171, -5, -256, -408, -205, -491, -438, -723, -504, -740, -455, -670, -537, -344, -552, -347, -408, -360, -690, -527, -420, -247, -319, -78, 4, -233, 177, 107, -83, 254, 212, 594, 564, 601, 430, 708, 620, 488, 605, 511, 709, 439, 731, 629, 647, 586, 472, 312, 340, 429, 20, 187, 176, 14, 66, -234, -341, -146, -246, -339, -236, -397, -387, -140, -701, -517, -820, -510, -619, -488, -244, -503, -276, -341, -434, -518, -440, -397, 73, -155, -144, 45, -230, 336, 152, 107, 479, 401, 97, 134, 359, 619, 506, 369, 388, 401, 524, 610, 636, 706, 666, 298, 210, 434, 266, 426, 526, 173, -131, -171, -57, -12, -149, -137, -317, -154, -263, -448, -299, -648, -642, -738, -704, -394, -791, -493, -678, -884, -393, -601, -824, -805, -391, -571, -270, -102, 50, 238, 46, 120, -77, 300, 343, 165, 104, 332, 502, 290, 419, 510, 565, 509, 283, 241, 885, 516, 329]
2362C29J21N4J42l14j32K28k95j67J22p6J80m16L02P1m07p9k9j60K51k55j95K10
2384e15L4L3J36r9j77P0J29l33m8K13K20k90M28K81K4k24J38J53K13j99j21M23
2406D89j87L75m30P4M28l47L38n45Q7J06O9J11J56k48M0j92k04K10J43k73l60
2427a60K69l07J30k95K06m3K91l56n0m40J06M70m05L2l61L31K42q9PK9l32J07
2449f18K73J59q8O0k4J0K29k7P3j04K08J84k05J64N0K3K43l2l86K87Q2k83N3L4
2473C65n0qQ0J7o3q3j69J12k67J56j48j34Q2K22j77q8j63J0o5j10R2p7L5J76k14
2498d69j24J01N6P7J76l33J25J62P3k5K1n4J38J1N5J45k08J74J23k24M14Kj35
2521B81k31qL90P6m6j20N6J47k83n4k7J98jj15O3l27K98p4l51q5J03j23O9Q9o5
$$ y = [329, 450, 504, 646, 332, 200, 428, 133, -34, 88, 12, 192, -224, 78, 149, -258, -337, -366, -526, -275, -530, -725, -515, -481, -448, -312, -411, -588, -518, -389, -722, -770, -557, -337, -627, -199, 82, 106, -118, 20, 173, 386, 187, 66, 489, 302, 677, 247, 321, 749, 402, 740, 195, 282, 388, 457, 568, 724, 476, 516, 324, 120, 330, 473, 200, -160, 109, -198, -68, -363, -157, -200, 91, -265, -315, -755, -649, -179, -584, -552, -913, -582, -340, -429, -422, -393, -725, -618, -345, -186, -274, -214, -238, -228, 1, -26, 47, -57, 151, 335, 130, 294, 344, 367, 610, 578, 192, 479, 561, 278, 331, 365, 315, 307, 387, 404, 341, 258, 89, 201, -66, 90, -58, -192, -110, 112, -65, -153, -316, -306, -371, -481, -389, -466, -431, -255, -469, -593, -492, -436, -359, -183, -516, -391, -229, -156, -181, -160, -214, -76, -65, -10, 135, -73, 101, 224, 0, 414, 416, 281, 50, 42, 432, 508, 462, 342, 398, 545, 262, 208, 181, 379, 378, 263, 326, -1, 297, 223, -128, -213, -110, -233, -164, -75, -140]
2546a40k75M84j89n5j22M9k4m83L66K00kk19J39qK41m11J60K27k11J04J15Q2k26
2569a98M57pl0m38K32J88R7l74M86R3k13o3J28L61j65l36P5k60J79j6K26J05k81
2592B46l06M37j78n26L10k2M1m17P4M91m85N2L04l27J13j72J20n5k27K4p6Q8K90
2615b01j82J18j12N5j0J17k50K58K67j15Q3j2J01j22n2PL25k54mK40J27k71L47
2638D60Q7K24m84O7j36K76j95j51K5k75P5K77J95m52r5O7k41K38l86J76o6m6K47
2661a13k08q7j37K26J23k57l57M27N33o08J62K11l6O7j76J14k2K88l48K69l56
2682b85N17K24o23J23L84J0j28N2K72OK15k84m28K35q2K24k0r5j82K34l3n07M90
2705C19j31j7J48m77j63Q9j81M95k25kJ07k96N0N2j53P3k53J98L33l02q8P0K64
$$ y = [-140, -415, 69, -120, -175, -297, -248, -272, -755, -389, -189, -191, -410, -271, -279, -38, -449, -289, -62, -273, -169, -54, 28, -198, 259, 252, 222, -216, 16, 204, 301, -73, 413, 506, 293, 230, 358, 719, 554, 218, 293, 33, 212, 196, 422, 527, 246, -60, 377, 199, -327, -17, -39, 2, -415, -341, 150, -335, -283, 21, -306, -193, -365, -245, -300, -527, -503, -579, -491, -201, -383, -265, -377, -322, -332, -215, -465, -207, 60, -55, 28, 16, 117, -5, -57, -50, 275, 21, 17, 257, 384, 113, 460, 547, 771, 287, 354, 218, 494, 299, 148, 173, -102, -27, 250, 445, -7, -102, -35, -276, -38, -424, -248, -314, -360, -113, -321, -408, -545, -319, -196, -453, -810, -383, 150, -458, -296, -85, -121, -54, -230, -116, -138, 150, -198, 71, -285, 232, 456, -167, -44, 340, 350, 222, 274, 546, 552, 767, 483, 55, 290, 208, 432, 412, 317, 135, 369, 336, -171, 319, 188, 171, 319, -158, -321, -232, -413, 82, -143, -145, -38, -334, -284, -232, -385, -312, -565, -367, -34, -336, -424, -354, -90]
2728i0k38J27N2p0j08M54j00q6K27ql05J46K86l42M40L9j40r0K28k92J1J95j57
2751A79K08r0q6L60k32J1j3m93L92k46K2M11m01k02L46k84N18n85J46j57j68L51
2773a3n09J26R0p2K58m46J31K48n3k8o9J84P7O4p69O76J36l78L76q3K04n3P8k25
2797e0J57L1Q1j34K1K47m3R0P6l36L45j37Lk70lM29m38o9P1K31j56l40N06n79
2821b67J20j08r1M39j82l35K55k22J1K08k54M77l52j40K08j34k87M30n6J29l30
2842d81J91R9K5l2M6r7K95Q5M0k22J18R9K8K28k66j16M8N6L4J52j65q1K69j00
2866B53kM8J08K40n23r8k75L20J8j54N6p3o7J57k86J28M5j29P7m84N47j95m01
2889f90L68O5j12j0L92l05j7k42Q8N37m71M41n9K02n0n26L13M8K56N0j01J1J27
$$ y = [-90, -328, -201, -149, -219, -327, 127, 27, -59, 168, 160, -145, 1, 287, -55, 385, 424, 284, 194, 422, 130, 141, 336, 179, 387, 297, 211, 571, 339, 350, 337, -156, 236, -10, 12, 423, 22, -180, 166, -118, 400, -185, -39, -196, -364, -13, -522, -396, -306, -378, -120, -566, -435, -187, -240, -268, -337, -153, -76, -12, -781, -105, 31, -347, 29, -54, 150, 97, 175, -50, 107, 138, 219, 85, 106, 353, 310, 400, 476, 140, 485, 348, 351, 81, 78, 507, 69, 0, 71, 302, 146, -194, 312, -267, -147, -255, -346, 93, -89, -424, -169, -391, -380, -172, -426, 51, -301, -441, -233, -367, -654, -224, -280, -151, -481, -290, -191, -166, -198, -152, -249, 46, 131, 171, -51, 67, 166, 194, 422, 156, 40, 88, 144, 178, 330, 165, 84, 353, 253, 251, 299, 407, 647, 124, 26, -249, 71, 89, -65, -9, -82, -149, 8, -278, -150, -105, -234, -157, -641, -94, -289, -690, -322, -257, -369, -379, 13, -292, -309, -551, -463, 74, -397, 44, -15, 187, 137, -389, -76, -28, 228, 278, 177, 188, 315]
2912C15J24j57m8J11nJ52k23M3o6J08J16k74J47l51J64J27k6Q8k22Q5j70k60M09
2935A87l74K73n5j09l35j57K34J93J9j67j15J21m4m7K37k54J55K5j31R4K48K4
2957B2l66K51%N5K11m12K72J33n8k3k39L81K06m74K37N2Q5k12M35m26R4O8j5O9
2981C46l36K88j73j64J14J31j22L8j96K23j75j19nK8q5o7L15m71L0L90m9j61l23
3004e43M03l28Q61o82J54K34j88k59L26l88M37M1k90lK40j73M30j01k41L20k46
3025DM91l24J64l2k7O5j99J37o2J83kq1j46Rj08P2J08j19k53K03J3k43j2OJ58
3050Ek47J41p0m41M25L3j42K29l87K45Ok82J1M89o5M5r5j35J17o0O8lJ26N8q3
3075a2k4K21k89K52m2K64j64n2K6j39J80j72J37lm9k71K21R9J36r3ml27K32J77
$$ y = [315, 439, 282, 234, 345, 340, 492, 269, 312, 246, 354, 470, 196, 343, -8, 156, 283, 257, 345, 123, 208, 38, -222, 187, -187, 86, 31, -78, -413, -570, -336, -143, -124, -291, -406, -285, -329, -376, -139, -393, -238, -213, -344, -250, -2, 22, -344, -93, -93, -38, 173, -239, 33, 166, 108, 85, -154, 227, 433, -41, 196, 248, 333, 121, 556, 130, 224, 292, 277, 346, 10, 298, 125, -39, 75, 206, 84, 122, -74, 149, -26, -145, -150, -122, -207, -274, 41, -430, -400, -10, -59, -220, -543, -140, -468, 393, -289, -135, 99, -89, -348, -22, -410, 27, 68, -222, -225, 15, -158, 272, 171, -70, 250, 4, 495, 171, 335, 303, 276, 341, 142, 279, 217, 400, 398, 317, 171, 180, 72, 144, 252, 133, -120, 83, 96, -147, -159, -153, 5, -242, -101, -171, -612, -187, -154, -296, -67, -454, -209, -203, -485, -474, 15, -50, -5, -100, -235, -118, -178, -110, -113, 13, 71, -12, -36, 185, -104, 148, 106, 370, 206, 154, 180, 41, 221, 49, 186, 183, 134, -137, 84, 183, 319, 226, 222, -105, 127, 304]
3099C04k04j43J37K3p7j92nL07m22K73j36N8J5m9k39o7K15o6Qn1M73l38q8j63
3123d27M74r2l26L57M5j06K95k7m1n3KO9j98M71j77j63K50O0k26P5O4j86J65Q3
3147C88m7L5j53j5j68K09Rk03J42k22p5j6J33j9K48l94P0j49J44l2M4l26J4K19
3171a64r7P3Q3j56O1P3J74k78J92n1J51j89J01K00l18K50k4j85L19Q8m2k10Q5
3194A36J89k16K74k89K74p3l2Jj30o6K91l7j19l88M86k63K3L14k49k03Q3j99J01
3217i2Q6j70K4K07k51j23N8j7J80j4j00j61J77l6J53l83M39M7n6J47l61Q2K74
3240A10j40J17j37J09l8M2J84k1k96L85p7j66O2M8j95j2J37K07j1r2q4J59j95
3263I6K62m38K72j03l6J05j65k17J10j65M94m10J25r5J72n4M9J28o33K82L95m03
$$ y = [304, 100, -43, 94, 117, 40, -152, -157, 150, -272, 1, -135, -77, -62, -111, -350, -417, -202, -268, -260, -311, 162, -176, -264, -427, 47, -45, -371, -14, 31, -75, 220, 193, 152, 99, 101, 170, -28, 443, 266, 103, 353, 413, 187, 262, 326, 140, 305, 388, 341, 376, 223, 208, 40, 249, 258, 55, 197, -25, -100, -116, 17, -2, 246, -148, -78, -227, -83, -115, -71, -397, -383, -164, -261, -188, -105, -261, -200, -127, 47, -231, -39, -90, 61, -128, -27, 173, -145, 105, 81, -104, 215, 303, 261, 51, 136, 325, 109, 383, 94, 368, 295, 263, 264, 134, 68, 359, 322, 203, -185, 301, 38, 61, 375, 126, -77, 6, -193, -92, -6, -176, -152, 55, -196, -319, -261, -278, -98, -112, -212, -373, -196, -232, -79, -462, -23, 24, -32, 115, -246, -164, 110, -30, 87, -50, 59, 21, 63, 247, 226, -70, 315, 238, 72, 134, 182, -13, -25, 112, 319, 308, 216, 132, 291, 96, 358, -80, 192, 89, 53, 158, -7, -224, -114, -279, 215, -195, -70, -165, 7, -47, 2, 130, -503, -221, 174, -229]
3285b29m60Q24l05K71j64k74K10j92J09L58N8k30j68K55O1O2N6j09k27O3K90N3
3307C12k49J13j87M57p7k96m1K66k01K73n3Oj72oj75J20j40P8K34m2j10m58L96
3330D8j8n5p1m69K93J84j44K22k98J31j85Q2L5o1J44k5J00j03J07Pj40k4J7N50
3354C27n21J73j50R5K51QM2j70M51n74M03k95J21K8J52j30l27M74l02M32m74O03
3376F17p35M46k55o3K64k43J8q7M3j05J25J06m4n54N36k68k79L68Lr1Mj21J42
3399a73j17j38L03L75n83L97k2Lk79L66R2l32K9K38Q9l95L03j64J73J60j55J02
3421B72j06n1O0k73K02M97j65k51q0R3p6k97L50j88l2J31m0Ml00L03j7%J40j03
3445G3k80l5m0J64l61N77k77k31K67p2j63M04j89m0k06J22K71m3j79j47K40m1
$$ y = [-229, -689, 135, -170, 101, -63, -337, -127, -319, -210, 148, 206, -24, -192, 63, 124, 186, 242, 133, -94, -31, 259, 312, 63, 176, -11, 446, 369, 73, 32, 298, 97, 370, 317, 323, 151, 145, -30, 90, -50, 28, 262, 220, 110, -348, 48, 30, -25, -96, -565, -272, -88, -232, -10, -308, -177, -362, -280, -245, -306, -162, -187, -87, -190, -83, -76, -216, -240, -223, 327, -194, -21, -171, -76, 175, 183, 225, 55, 506, -68, 335, 40, 161, 189, 341, 211, -116, 358, 56, 488, 14, 617, -118, 328, 73, 10, 274, 31, 49, -38, 5, -100, 25, 131, 87, -467, 69, -199, -478, -110, -107, -198, -194, -315, -173, -290, -428, -125, 250, -333, 64, 42, 45, -234, 132, 224, -108, -79, 159, 248, -147, 156, -8, 165, 325, 170, 272, 166, 115, 175, -98, 104, 601, 436, 185, 105, 198, 122, -175, 175, -13, -45, 86, 46, 50, -250, 53, 36, 36, 176, 73, -207, -242, -282, -118, -479, 98, -179, -410, -143, -215, -378, 26, -163, -203, -409, -287, -16, -59, -238, -385, -145, -186]
3467a86J9K93K23l63J3J98k87O9M9R1R0J31k49J51p2R9j77K33l29J37jj20J28
3490A40P8k5l11J05O8kk33J69j00K47J16j48R7l78k18M39l86J36p5Q7r0L81k25
3513a28j25j1K65q9k3p3k36L97n9j42N70k0k32R9k36L76k64J49j78Q5l8J26o9
3536A44j34k21K98K52p3l53K04j23JO0j39L33l59J06J51k34L52M4n18J79j84K6
3558a88J53Q2l64L37rk65K66P9j65Nq0j05J3q6J66J2Q0j19M45j96q0J53R6j08
3582A22R0j31K37k16j15K6n1J37j00J76K42j9l44rR0o6P3j16r2J42J66k30K7j6
3606B3k0K09l47k4O7K3j04L39m03K30k03J92K42l10n7n8O0j01pN2P0K9K78k23
3630d3j74L69m52J51J00j42Q0L59k23J8J17r0m6J82n75J29P10n59q5K74J25J47
$$ y = [-186, -167, 126, 349, -14, -1, 197, -90, -21, 28, 119, 209, 340, 91, 242, 170, 269, 92, 325, -4, 133, 132, 12, 140, 218, 193, -118, -13, 55, 53, -180, -11, -111, 136, 252, 104, 201, -177, -395, 44, -342, -206, -281, -194, -284, 97, -128, -253, -264, 1, -88, -111, -184, -420, -23, -82, -224, 346, 326, 94, 193, -43, 333, 69, 218, 40, 125, 87, 213, 144, 10, -211, 87, 339, 266, -87, 117, -6, -5, 55, -84, 249, -110, -4, 147, -87, 265, 309, -209, -30, -214, -188, -35, 47, -317, 20, 11, -254, 12, 91, -74, -69, -149, -254, -241, -327, -161, -149, -69, -188, 257, 61, -19, 134, 230, 122, 212, 81, 318, 102, -13, 13, -38, 99, -1, 175, 417, 398, 54, 45, 135, 69, 142, 26, -66, 76, 242, 12, 39, 23, 3, 212, -135, -159, -92, -69, -173, 166, -237, -7, -210, -18, 224, -86, -143, -201, -141, -242, -249, -197, -127, -98, 180, -43, -217, 152, -300, -149, -49, -191, -111, 248, 25, 43, 160, 70, 24, 206, -369, -240, 470, -89, -174, 100, 225, 372]
3652C72l27j6J10J09k34K06j40J77j8m83Q5K01J44j36j8Q8J01m47J3K79p4ml1
3675d3p9J44k6k27J49m67N76k28jK56k95L24k97J78j08L03r2r0k4M26l24N8N9
3698A72R0r0o3l87K21K43K13l93n6L3J64j41j24K9J04j1j23M3J77m7j72K11J14
3721B07k54J2L38l69r4M1q3K80k86l89O22j47J53j17K30k8j80J27k60p4L04K2
3743E5l83L27m7O4J93l41P4R7J76m6k16qQ9J48k23J04J51q3J79J75l83l6n4j98
3767a86L54j28Q6J41k74p1J85l01k4Q8J50j51N2R3j66j91o6N49l92J77P3L8m7
3790a1M7j3j24m5J17J65Pj24l79L74j29j39J93O9J26Q5k79j00K84q2R7L6N2j7
3814B10k05R4k6O7J64n4o4j32J6J42k16q2K2J6J13q4L1l0L9m6k85K01J1jj16L1
$$ y = [372, 45, 29, 139, 248, 14, 220, 80, 257, 239, -244, -159, 42, 186, 50, 32, 120, 221, -226, -213, 66, -8, -12, -43, -122, 22, -4, -231, -82, -549, 27, -201, -202, 54, -241, 83, -214, -36, -144, 159, 67, -23, -47, 379, 55, 113, 172, 262, 172, 109, -278, -57, 186, 399, 6, -50, -17, 147, 6, -118, -89, 15, 4, -119, -76, 101, 54, -118, 93, 207, -47, -35, 303, -66, -160, -119, -202, 78, -208, -597, 25, -122, 31, -86, 144, 116, -64, 63, -197, -271, 33, 55, -328, -1, -48, 16, 209, -132, -58, 39, 215, 169, -47, -55, 34, 182, -41, 63, 214, 131, 310, 485, 102, 66, 12, -186, 168, 40, 126, 267, -7, -78, 107, -194, -218, -130, 20, -131, -79, 14, -152, -343, -409, 140, -252, -75, -2, 36, -11, 36, 23, -101, -146, -29, 136, 143, 19, -360, 14, -115, -254, -61, 8, 134, 219, -60, -160, 124, 42, 139, 175, 227, 210, 5, 99, 73, 140, 304, 250, 186, 54, 70, 212, -4, -86, -64, -48, 65, -19, 12, -18, 21, -25, -310, -109, -98, -99, -215, -184]
3840a84J81j36m7P0j28J52J5J79k78o4K64r0n7PJ11K7q2J80j20J31j97P4K97j75
3864A30m08N00k88J06L62l84O9J59j9j26j47J03O6O7l76J08J5L54Nl99L37j87
3886D7l0K00k67R7j38K06n8l03m2m6M46m99j44L67r2K41l14MM73m4n4j38qJ20
3910B4O7L5k59r2q1J59L17j2Q1l24j11L02L2j37j94K26L08k11O2l40M6J02J13
3933A13k73N84l94K23j32k5L0P7q5j97J89k52M51L3l80R6J8n2M3k99M3j47N34
3956A98k32k03J04J80m63N29m27J38L04j56M8l1r7l6J62K11l26n1m2J31K50j29
3978F2L91n35L2L61m26L55j79l4k24P3P3J2MK40l14L03j80k8j86O26m68L00k49
4001IJ24jl72J88j5J44m44K04K66k01r5L26l41Q6j00K97k65R7k54J84J56k1J53
$$ y = [-184, -3, -139, -186, -116, -244, -92, -77, 102, -176, -240, 24, -66, -123, -116, -5, 22, -60, 120, 0, 131, -66, 8, 305, 130, -278, 222, -66, 40, 402, 18, 87, 246, 227, 101, -46, 57, 123, 190, -186, -78, -63, 291, 296, -103, 234, 47, 17, 217, -50, 47, -91, 115, 57, -246, -288, -334, 112, -387, -531, -164, -256, -15, -329, -325, 148, 104, 50, -88, -96, 24, 91, 126, -133, -225, -306, -147, 170, 158, 239, -85, -196, 106, 138, 1, -193, 33, 341, 130, 192, -148, -102, 0, 113, -160, 424, 30, 253, 121, 96, 126, 203, 118, -79, 110, -142, 309, 342, -38, 58, 76, 24, 67, -232, -189, -336, 198, -34, -237, -133, 47, -416, 113, -314, -176, 128, -28, 20, -11, -108, -144, 18, 229, -97, -148, -190, -59, 191, 62, 453, -82, -50, 311, -115, 240, 61, 27, -197, -124, -51, -39, -35, 205, -109, 194, 14, -14, -200, 426, -42, 258, 9, 133, 132, -240, -52, -67, 77, -367, -163, 103, -98, -193, 133, -208, -122, -222, 75, -190, -93, -347, -163, -7, -28, 125]
4024A25k47J32M5J08k06k36J6K17K71q3j28m0m4J40N2j21M2J60k35L91j23l83
4046a47L04k51J58J65j4n00L56R1k91K31k82K11j33J85l29k2L53j04j30%K17j89
4068a21j41J13QO0jk57L53j20K63j15j85Q6j53K47m28N75p1PJ35l05L81l18M2
4091E5K0o0J30j81J01J53j04J04R3J23l59m3L80j74k5k34N7k8p1L08l25M75j48
4114B47m20M42k14J7M9j26j36q2K46j84J07jJ10m6j76K18k86K9K83p9j4J69m45
4137b92L93j84K98k40K1l0K76j56K19l22J07j90L00l04M72k98r4NP1K18l63J45
4159E2k24N17k80k5o9J3j98K18j74J59J6J66j19l43M01k01j74L08k63L3K16N3
4181H2l48L7k05L13k2Q6j06K41l93J12L89k88J89j2n0j20J48O0l90J57J79j60
$$ y = [125, -122, 10, 55, 163, -43, -279, -263, -46, 225, 142, 14, -26, -70, 70, 122, 1, 43, 203, -32, 359, 236, -147, 157, -94, 64, 229, 215, -285, 71, 162, -129, 102, -180, 31, -102, 83, -246, -268, 85, -19, -149, -149, 68, -121, -262, -149, -141, -81, -82, -339, 14, -106, 157, 42, -143, -57, -210, 37, -391, 184, 113, 120, 255, -50, 331, 13, 55, 75, 15, 145, -36, 65, 218, 114, 218, 311, 434, 75, 32, 412, 238, 213, -21, 36, 8, -63, 245, -80, 395, 247, -173, 269, 55, 72, 121, -5, -141, -223, 23, -161, -54, -55, 55, 9, -167, 51, -235, -206, 77, -2, -16, 153, -292, 101, -83, 215, -25, -4, -34, 242, 86, 305, -17, 90, -100, 200, -104, 368, 70, -24, -19, 52, 270, -93, 52, -172, 345, 65, 40, -29, -16, -214, 4, -170, -11, 5, 171, 52, -291, 110, -91, -265, 43, -220, -187, 29, 82, -266, -229, -434, -121, -143, -57, -163, 78, -315, -203, 186, -102, 87, 75, 25, -95, 53, 113, -277, -120, 59, -101]
4203a01K44k41L71M0j29k49K94k75m4l2J85rR2j88J19l4K6N0p1N5j28L69k98O6
4227A12j03J01k59J27P1k62K67p0k18K61j08k75K07r2o5M14j05K29l38J39l06
4248b73L21K04n08L62m81M35L9R2j75M38m37n6m0m9L16k90K94j71o0L46j29M4
4270B22l26L09j99J9j10j42N19k48j11J78j33J82q4r5L86l88J16l56R4j70K61
4291g6K88m49J91k4p2N19n53M3K52o8q9K06j73l54K29J11R9O2mR4o7m2K5j32J50
4316A66l81n6N94m35L18l72J26o5M10l08J39o9n0j65K33j52O3J3o1L6j56J10k69
4339c31M20l72M28m08L96l47L28j92K75l34J57J37n01J54J11Q0j75J20Rj03K38
4360I0j39N7l21L81m1Q5l53K77K40k62K69k74K88l3k35M25q3j71l2N5k54J44K7
$$ y = [-101, 143, -98, 273, 313, 184, -65, 229, -46, -90, -122, 63, 54, 146, -42, 77, 43, 69, 119, 48, 103, -25, 344, 46, 112, 9, 110, -149, -22, 49, -213, 54, -16, -234, 27, -81, -356, -149, -241, -306, 108, 3, 232, -106, 33, -273, 48, 252, -256, 106, -375, 60, 99, 191, 16, 454, 17, -39, -79, -128, 188, -102, 192, 21, -39, 307, 178, 222, -104, 205, 6, 25, -85, -227, 292, 44, -67, 111, -22, 160, 76, -19, 367, -21, 95, -261, -167, -337, -76, 212, -237, -46, -70, -142, 377, -176, -133, 119, 51, -38, 168, -5, -359, -130, -19, 80, 142, 138, 232, 165, 123, 148, 16, 166, -215, -271, 323, -112, 206, -166, -40, -105, 305, -3, 136, 67, 17, -148, 85, -67, -4, 9, -52, -16, -172, -62, -331, 89, -283, 145, -263, 133, -214, 114, -78, 197, -137, 20, 157, -344, -190, -79, 1, -174, -54, -45, -148, 90, -49, 8, -313, 68, 27, 112, -241, 36, 276, 14, 283, 9, 297, 264, 29, 454, 371, 200, 168, 223, -31, 113, 140]
4383A40J49m11j57M04J03k01j15N0J0Q4KJ20l62K00J30k14j40N64l42K62m02P7
4405d9J2J01k19R9l48M66j90j25L45Q5m4q1l86J61M10l01O1R2l1j91K00k53K65
4428G9J55k01r4J05K91m74Q8L78l84K66j93M6J62q7P7pl37L7j74Mk2J48L34l66
4452a69K57m6p3O9j70J32J98l16J00K92j90p7J72k35M6jLJ15k81K11j80M96m55
4475a02O1P6R0j70K54m16J22nJ57K9k0J8k36J22L42k55M2j97m7L75l34K38l51
4498b07L55k15J16k48J46k8J05p9O6J08l42P5J04k26K18r0K66k19K60k49k9m3
4520a56J00q6l6r1M54m16K45o6j83J55k6J10r5J58R0l66K31K20k39m1J02k80J35
4543h1J29p7M9R8m72R1J16J62j29k30M76j28n2Q0J36p3J94l42P3J40q4q9L7j01
$$ y = [140, 289, -122, -279, 125, 228, 27, -88, -38, -28, 56, 58, 178, -184, 16, 146, -68, -208, 356, 14, 276, -126, -49, -37, 64, -155, -56, -404, 62, -128, -253, 92, 177, 133, 52, -334, -173, 237, -64, -3, 89, 58, -133, 67, -186, 79, 234, 33, -61, 44, 335, -139, -51, 327, -57, 209, 16, 62, 224, 137, 214, 207, -130, -93, -267, -263, -285, -137, 197, -169, 88, 42, -31, 38, -132, 0, 198, -118, -18, 274, 84, 7, 179, -56, -10, -11, -8, 107, -174, 37, -143, 353, -102, -41, 35, 125, -45, 209, -207, -85, -90, 67, 96, 76, 94, -142, -20, 322, 67, 109, -88, -135, 240, -94, 144, -207, 148, -67, 49, -199, -53, -81, 24, -55, 11, 119, -223, -148, -44, -270, -52, -142, 124, -95, 165, -84, -113, -156, -56, -142, -178, -269, 185, -231, 14, -52, -235, -80, -106, 4, -91, 67, 157, -209, 22, 242, 3, -38, 64, -216, -81, 48, -29, 20, 118, -354, -263, -147, 15, -114, -344, 132, 4, -48, 32, 168, 95, 289, -53, 20, 160, 76, -13, 24, -77]
4567g7R2J1j5k37J40M9L4j78J6j14J98J19p6L7Jl75L93k48L17j90R1K7l69J58
4591a96l9M48q4r6L8j50j27K00j5j05j09L08PRl34J74J56k9j00j05L82l74L23
4614A82o3k38J26m4j16M2L14k37K03k56J11K35l75J34K3q7j91K13K8J85m23L47
4636A13l48K14K53m02M80m07K1M9K0NK24l75P6L8J4K0j00K29o9J48k55O5K09l65
4660a43lL57lj20j26J22k34N8J76K03K1n4m53L26m82L14M5J93j83k81M39k9k24
4683h1R1k36K25j77K69k29J71j89J68j02j7l72K49N21l30N7k69M39k61K19m14
4704b68L52Q6l12K46k99j46L04K42p1Q0L47n64Q4l9J93k94k66K27L34j96M3Q3
4726A66j69j65L07r7k9j3lj03k9K31Q9j86J46k31k35N69j98K8k95O4M15j93K46
$$ y = [-77, 15, 26, 11, -226, -86, -37, -3, -181, -165, -279, -81, 38, -38, -1, 0, -375, 18, -230, 87, -103, -12, 15, -354, -196, -235, 213, 129, 33, 71, -79, -206, -6, -21, -126, -235, 73, 80, 89, -245, -71, 85, 56, -44, -149, 233, -141, 182, 119, -119, 7, -37, -153, -111, 203, -34, 169, -87, 24, 259, -116, 18, 41, -46, -237, -24, 4, 189, -234, 113, -235, -21, 232, -170, 310, -97, -76, -27, -7, -2, 222, -153, -77, -39, -25, -5, -105, 124, 55, 203, -52, 13, 222, -143, -146, 211, 208, 88, -38, 84, -150, -92, 84, 287, 308, 254, -199, 127, -355, -41, 4, 197, 14, -267, 172, 143, -81, 10, -226, -1, -178, 91, -138, 33, -156, 12, -90, -107, -479, -230, 291, -39, 18, -251, 188, -73, 146, -268, 84, 170, -142, 104, -195, -341, -37, 205, 134, 214, 561, -3, 81, 42, 235, -59, -325, -98, 236, 40, 83, 166, -3, -168, 139, 42, 13, 0, -3, -106, -135, 96, 185, -1, 145, -86, -321, 248, 50, 78, -217, -153, 262, 69, 315]
4749C15m21K96k48J75m04L61k20N6K4j88K84l9n6J15p7K86l08K0j20K67P1k25
4771c6L06k59L03l12j03J99k32j03J94K05k11J96K0p6k31Rl6Q3K31j89K87j06
4793A39R6l35K64m97L24j31J47m7l85M17M5LO6k82lK52j44K2p2R7L98p66O78j41
4817A45k91m6O4N6j15M31j68J31M8k96L1J38r6l50M29l59J08o9K50m0O5J26j0
4840A82l2k65L79j73j97J51J97q7J00l23j00L24l8j62j66J99Rk70N26l20j71O4
4862a73l7j90K49j3K85j08r4m8L0J09m7M61p7m77J90k74K19j26k53N84j14J34
4884B30m5kl24J06K12j35N8n8k78N39m26p1pk01N11k42j04k7K12J8J33L4K1P4
4908B28j50k31K06nj31L09j03o3j96L33l46L5J10m6J62l5l58L03m46N00m00K24
$$ y = [315, -106, 190, -58, 117, -287, 74, -146, -90, -66, -254, 30, -9, -65, 50, -27, 259, -49, -29, -149, 118, 189, -36, 270, 11, 314, 2, -101, 98, -134, -237, -43, 162, -49, 147, 167, 91, -140, -131, -167, -84, 147, -42, 245, 139, 235, -100, 164, -333, -9, -140, 7, -40, -425, -8, 37, 40, 106, -176, -179, 73, -71, -49, -121, -24, 374, -392, 286, 145, -146, -192, -128, -72, -187, 244, 76, 207, 255, -41, -10, 128, 32, -318, 111, -248, -140, -209, 41, 1, 66, 192, 182, 150, -115, 264, 91, -106, 45, 242, 155, 255, -68, -168, 156, 118, -44, -210, -11, -2, -272, 254, -66, -237, -173, -210, -400, -151, -164, 121, 13, -81, -129, -99, 10, -37, 424, 347, -130, 60, -214, 5, -121, -374, 210, 96, 230, 185, 183, -141, -35, 177, 42, 100, 42, -236, 303, -123, -194, -201, -402, 109, -133, -237, -264, -52, -34, 99, 133, 154, 228, 78, -153, 53, 48, -83, 226, 123, 60, -136, 197, -149, -114, -4, -50, 112, 77, -281, 22, -424, 76, -324, -100]
4930a00k01J20J16J57J5L5j7q2m4q5J24j60K11Q6l24J31J78k64M7J11R7J58l27
4953a8L09m13J1J72p8m7K44J1m66K90k99L78j78J72l28J04J74k46K34m77M62K17
4975B28k51j22M4l3O8Q2j24L3J5k13L98j00j3oJ25K2j55l5J25j70Q3k55O19k35
4999A30J40j99nL5RPm62P22l23p1J04j38j17n7KL91j98j11k87N09l9k31j2K83
5023H2Rq0J2K9j74J11k53J47L03m38L36o4J7n1r4j5K45k88R9K13l27K29j75J43
5047A6j17m4K23j77N8m5K64q8O8Qj9j60k38K45Pk58M01k40p3J93j84J39j10J70
5071C9J7j0K29l21k19J56L8J48n9J40j45j73L26r2O8k43N3Q9k1K1j25K9K71n60
5095c44M12r3l27P08l73K48k25J39q9k7k23J5J85K45k59K03j41L4p5J70r7j2j39
$$ y = [-100, -301, -181, -65, 92, 107, 142, 125, 43, -1, -86, 38, -122, 89, 175, -149, -18, 160, -104, -57, 54, 151, 309, -18, 291, -122, -111, 61, -17, -64, 180, 191, -275, 15, -284, 94, -84, 88, -240, -136, 38, -208, 26, -451, 11, 228, -23, -145, -101, -134, -66, 16, -108, -75, -60, -273, 125, 25, 12, 6, 131, 153, -2, -37, 88, -82, 1, -254, 365, 130, 270, 71, 66, 101, 110, 117, -345, 377, 54, -17, 87, -51, -168, -225, -223, 168, -30, -141, -428, 81, 42, -189, -201, 82, 91, 11, 23, 52, -122, -11, -264, -117, 186, -252, 84, 20, 37, -14, -108, -123, 122, -166, -67, 146, -181, 48, -127, 16, -101, -145, 78, -99, -41, -86, 178, 90, 158, 166, 147, -13, -251, -6, 1, -257, 144, -96, -169, 24, -160, -21, -131, 39, 56, 46, 275, -46, -265, -109, -71, 77, 18, 158, 13, -160, 166, 74, 142, -101, -48, 41, 20, 41, -84, -55, 216, -344, 68, -25, -352, 356, -17, 231, 6, 145, 56, 29, -194, -179, 6, 251, -8, 195, 54, 88, 13, 183, 86, 74, -65]
5118f5J87k53K1R2j12kR5N9J57k05j3j3J67j29L4L7n9J39m18L03j10Q0j39K78
5142A31j70m2K3J32N5k42J87r1K13m06L03o4j40M3m9J42j59j52M78k47K28l04
5164a31R5%n2qm7M40k15J7l66K90p7J85K07k32K9p1R5q7k1k54K44J92l30J55j88
5189a30m5j5n3J69j44N93m39J24K74l68J37k71j6j23L66k92K81j44k6O2NJ17p1
5212ik26M2L35k27M22k59K91k12j32J50k88J85j58M22n01M50j56l34J11K77k3
5233A60m9m47L98j61J03j29M9K61k33L77n48K22K81K7l97K3l34K44j80L05k4P1
5255A9q3K0J68j22k6Q8J01j18o5O3j29J70j86j99J84J69j75o0K77j39p3J88q7
5278a5m1L0K03k04J12j41j33K65m6J14j27M8k84K88j66J44j47K11j94k79M46J44
$$ y = [-65, 122, -131, -110, -18, -130, -132, -37, 22, 179, -26, -39, -52, 115, -14, 20, 57, -2, 137, -281, 22, -88, -8, -147, 131, -39, -81, -58, 74, 129, -113, 74, -17, 196, -210, 93, 29, -111, -68, -117, 25, -134, -286, 192, -55, 173, -131, -36, -36, -88, -96, -143, 297, 82, 99, -267, 23, -54, 131, 338, 106, 135, 64, 159, 72, 51, -203, 41, 233, -97, 58, -130, -175, -190, -243, -74, -218, 375, -64, 60, 334, -34, 103, -168, -184, -307, 59, -233, 48, -96, -122, -60, -55, 62, -9, -235, -193, 142, -85, 337, 78, 369, 157, 25, 175, -113, 72, -86, 336, -165, 285, 129, -205, -94, 183, 160, 111, -336, 62, -99, 4, -125, -76, 185, -48, 329, -219, 3, 284, 311, -86, -63, -397, -153, -333, -28, -52, 19, -64, -44, 124, 2, -24, 64, 165, 47, -18, 45, -84, 86, -100, -299, -115, 54, -121, -181, 96, -43, -116, 72, -15, -56, -26, 177, -27, 85, -56, -189, 76, 30, 144, 17, 65, -219, 69, -97, 47, -100, 111, -83, -362, 84, 228]
5300B28l08K87l4k34N3m3j35K88l5Jj06k83N2K47O1J7J00J23j89l17K70p2L17
5323B88l90Q7K05j43q3M3j22k44K80q5p7l3M07j22j64L10j81J5K09k65M9L75l66
5346gK03l36L3J51M1o6J40j54j6J65j54L1k41J97p1J52N1j57J04j5M4K21l76o8
5370a28J02j66M14j63J7r6j11O3R6n1J60k73M1R5j1q5K36l53M13k27O4Q8j24P
5394Hl45L33J33q5o2J62M7k19K53m83J74j19L16N9Oj54j53K3j6M95l30N5n7N9
5418A00k18l7j9m8K86l04R9J26j46R6l4M1L31l61L1K35m8j98J3k5q9J58j18R2
5442c7Rp8k88L98M6Q2l67K14K2j29J96l7K2P4l40J78j2J31k24R1K29N1k70L2k66
5467b73J9j3j34O33m26M99j59P3N9m68L12k36O4j33J43J21j73l8j64M35m4j96
$$ y = [228, -80, 207, 173, -61, -8, -51, -186, 102, 67, 68, -38, -321, -269, -22, 39, 56, 156, 279, 90, -227, 43, -29, 288, -102, -15, 190, 47, -36, 7, -115, -359, -79, -164, -241, -274, 133, 11, -153, 157, -24, -9, 200, -65, -16, 359, -7, 196, -140, -107, 44, 85, 19, 159, 5, -11, 154, 0, 31, -210, -13, -84, 68, 119, -38, 66, 51, 95, 316, -60, -128, -26, -192, 222, 59, 76, -20, -131, -68, 28, -23, 137, -136, -95, 0, -11, -96, 140, -213, 200, -27, 37, 125, 1, 8, -337, -4, 129, 44, -18, 144, 191, -28, 225, -258, -84, -203, 113, 172, 178, 24, -129, -106, -122, 373, 43, 98, 41, 100, -118, -155, -174, -222, 64, -240, -141, -15, -161, -65, -99, -58, 273, -88, -57, 178, 130, -68, -55, -80, -169, -11, -129, -37, -28, -106, -394, 4, 50, 132, -235, -21, 1, -128, 68, 31, 53, 127, -213, -35, -47, 84, -140, -49, 180, 231, -39, -7, -273, -254, -267, -401, 232, -194, 305, 146, 219, 278, -190, 122, -114, -50, -183, -40, 81, -92, -130, -294, 141, 97, -99]
5489i9J24J66l66K84k27m8K04n8p6J54J4R6l30N1J68j0K1N7j13J54k10M3M13j63
5513B49k69J93j79N1J12m1j54N4j55J29j89M98k5k25M6K30k14m60K61j22J65Q7
5535D2j28l63M13k01L99k89K9J74O5l26j49K82l7Q3Qq6m1J82J5k05K80r5J5k08
5559a41P3J61J92k07l85M26%k36M7k04K52J28l38K93j33M7k9K93p9p1J89l46K
5582f6K33j42J18J39k54M6l3m6k73K51k8k4O7k90M99m41L07j72K3N3j34K9o4Q
5606a94K1J46j06o9j55Q4L44j20L65l31P4k10M23k38M6j59k66N66j49m2o2J24
5628I2j52M26k91j44j67K42o9mn6K41r0j7l2J94r3P7m1J65k25K2j48J73J4l84
5652b67K01Q4n0n3K51l46J68Q4j29J79j39K92m42n7M39k74K3n8J4M18l19L29l00
$$ y = [-99, 25, 191, -175, 109, -118, -166, 38, -20, -96, 58, 72, 168, -162, -111, 57, 47, 68, 125, 12, 166, -44, -1, 412, 249, -20, 173, -6, 45, 157, 116, -38, 16, -139, -10, -199, 299, 274, 49, 95, 325, 111, -349, -88, -210, -45, 42, -86, -449, -36, -237, 162, -127, -98, 76, 141, -185, -334, -52, -89, -6, 2, -84, -125, 57, 72, -133, 147, 52, 67, -141, -68, 93, 285, 78, -307, 119, 119, -117, -70, -274, -22, 106, -232, 61, -72, -25, -54, 239, 160, 89, 278, -68, -66, 167, 25, 143, 282, 28, 74, 41, -5, -278, -27, -55, -79, -12, -302, 197, -244, 63, -109, -86, -33, -167, -138, -202, -194, -173, -27, -133, -202, -357, -273, 71, -49, 316, -15, 59, -151, 272, 34, 80, -79, -345, 221, 72, 30, -32, 92, -60, 366, 75, -69, -236, 6, -63, -67, -123, 118, 28, 11, -21, 173, 80, 157, 116, 281, 56, 78, -70, 103, 117, -267, -66, 18, -32, -85, 166, -180, -12, 72, -57, 122, -17, 275, -167, -224, 215, -59, -36, -94, -80, 338, 19, 348, 48]
5675D8k34L91k64J54l09M87m5j39k02L36k44R3m84L29J18j24j04L76j08k45J26
5696d4J86j35n4J15j29L0j89J8M17j00l6j92L40l43J16j07K68l13K2j51J89K48
5718A56j78J55k38J60oj89K08k05K17J20k36l81O53l28J11r9P1j06N2j80M89n8
5740A88k3k94J88J7m41N13j68P8k08K60p6r7O8k7K60l73m4j97M20L2j24m0n1L19
5764A80m4j45L0j92o6N06m39o3L53J41m62K60J4L8J07r1j6j62M5J53j27k62J89
5787e3M8J09Lj99J66j33J8L48l75P2k44L29L02n83M18k33r8M5j11L75o3j86k02
5810b47K11k8j43J12L43l60j32K31l29M34J79m16J63J89m98J44J05J17j26L27
5830B76k44j63K34Q9k37k03o0K69J29K01Q5k60o8k77L00r3J47j95p1J22k9J81
$$ y = [48, -186, 205, -59, 95, -214, 273, 228, 89, -113, 223, -21, 72, -412, -83, 35, -89, -193, 183, 75, -170, -44, 142, 7, -47, 68, -61, -31, -220, -202, 215, 115, 79, -113, 227, -116, 0, -107, 161, -152, -130, -281, -92, 156, -22, 133, -105, 55, 49, -140, 68, -137, 80, 200, -36, -417, 236, -92, 19, -80, -9, -115, -63, -243, 246, 188, 165, -129, 59, 76, -365, 148, -20, 58, -150, 110, 34, -63, 5, -22, 238, -135, -179, -376, 44, 76, -48, -88, -139, 180, 136, -9, 21, -171, -237, 269, -170, -233, 120, 261, -201, 59, 73, 111, 218, 127, 111, -51, -6, 147, 20, -242, -53, -5, 104, 107, -92, 74, -59, -41, 307, -68, 4, -240, 89, 391, -192, 226, -7, -105, -60, -171, 204, 141, -45, -247, -36, -64, -207, -95, 248, -112, -244, -13, -342, 92, 271, -145, 18, 207, -291, -147, -42, 75, -51, 276, 32, -131, 103, 192, -45, -248, -308, -39, 90, 291, 376, 116, 48, -229, 71, -22, 125, -70, -141, -19, -48, 133]
5852A33l58L42j23r9N0L9K6J71k17j70L97k52J22l8k17J63J99m51J99k42J81K39
5874I4j29K97l15q3K72j1j39r9L04l89K96m9k61M7p0J41K39j95o7R1kj00K72j42
5898Bk68M76j16k05O2j57N7M29k89m6M9J25j31M8L5p3p0j5L06J04m16k13J79K29
5922A02m0J86k11j10J26k7j13L67m73N21l77q8K29j37R1k60K75j3Nm1j32J59m17
5945c78M28K0n2j27P3J21m76N92q1M0m45O40k20k08K47j54n0R7p2k75K40Q8R0
5968A38l0k48K38k82L85o9L0k52o4J05K8j77K28J64j98L1j90J31M28n5k34j3k1
5991G3J28l53J41L0j51j41K33R7l71K81o5k59L14j3j20J67J64l48J68M7k4k13
6013b15L72k63O3O26k56j20k62j56J50R6K45j95J35j87k09L62j64J42j93P0j59
$$ y = [133, -225, 117, -6, -105, -55, -16, 10, 181, -36, -206, 191, -61, 61, 23, -194, -31, 168, -283, -84, -326, -145, 94, -35, 262, -53, -136, 136, 125, -14, -113, 191, -198, 98, 49, -212, -165, -235, -94, 145, -50, -117, -26, -28, -128, 144, 2, -266, 210, 94, -111, -49, -206, -149, 280, -9, -55, -6, 119, -12, 36, 71, -2, -72, -87, 219, 323, -93, -306, -127, 102, 62, 248, 37, -73, 53, 26, -87, 280, -193, 328, -49, -137, 92, -45, 46, -214, 61, 48, 53, 12, -120, 39, -378, 50, 70, 18, -109, -36, 85, -391, 201, 120, 160, -285, 355, 135, -73, 174, 20, -30, 67, -5, -280, -40, 48, 138, 108, -140, 98, -184, 201, 132, 162, -90, -154, -49, -21, -198, 30, 194, -4, 27, -163, -32, 396, 341, 107, 94, 73, 201, -152, -11, 19, -132, -273, -40, 57, -314, -33, -98, -357, -43, -56, -176, -9, 155, -193, -25, 22, -2, -215, 157, -106, -43, 583, 327, 207, -55, -211, -61, 35, 280, 85, 220, 33, -176, 186, 22, 164, -29, 41, -118]
6034a18L53j79Nr0j67K65j90M43k39m9r3l7K86L7j81q9J83m00O4J43J55j15J82
6057A69l70N61k45k52M0J76r1Q4nJ56k49J34l26J7j87L68j2M24l11j06L01j23
6079A53j32l11K90J37k63J74j9k4l11J27J99L0o8J61k71k8L91m42J02K20k9j84
6101i8ok0J23q9l44M01L5J6J82p8j39j1M8j10j58J0K79l86M42K1o5j20O9m6J72
6126A28o6K69k63J31l38O8P3J97J4j90j20J73l6l9J26O6k58L90m62M03k40l79
6148c53L62%N0K39l11j12J99N3l33K42k39K58j55K27P2j97k50J61J17p5J49Qk54
6171a42R5k50L51k17L35k06K8K47M7j64M2k81K71k21J04r3K9K68j42No3k24K14
6194C3J52l37J1L47P1l71L10k90K56k07Or3Q7L21l62l2N4j34K12j5P1m29J93K41
$$ y = [-118, 235, 56, 61, -29, -196, 69, -121, 322, 83, 34, -59, -96, 190, 227, 46, -43, 140, -260, -196, -53, 102, -13, 169, -201, 360, 115, -137, -97, 79, -12, 72, 67, 223, -26, 108, -218, -201, -388, -20, -32, 392, 81, -25, 276, 153, 21, -290, 0, 137, -126, 48, 29, 5, -306, -179, 20, 50, -18, 143, -128, -156, 235, -207, -105, 115, 86, -98, -104, -124, -1, -90, -434, -33, 2, 18, 200, 122, -17, -28, 20, -90, -248, -238, 41, -345, 97, 118, 53, -67, 2, -44, 128, 62, 331, 68, 199, -139, -71, 2, 199, 213, 23, -97, 76, 40, 1, 127, 193, -65, 325, -137, 266, 26, -353, 9, 9, 59, 298, -13, -125, 74, 127, -206, 36, -203, 55, -100, 127, 199, 2, -248, -87, 30, -45, 104, 112, -142, -47, -297, 54, -163, 172, -34, -6, 241, 288, 124, 166, -115, 156, -65, 39, -54, -25, 243, 101, 106, 43, -181, 33, 185, -152, -141, 206, 277, -94, 216, -74, 182, -25, -19, -112, -25, 296, -66, -98, -44, -178, 34, 19, 90, -339, -146, 95]
6218I5l04J24Q7n3k73L46j38j07K96l16L53l20j1M64m17K76j83j18q3Q3K39K1
6240F1m0J2P0j50K48j15L1l35j60M70J91l59N7K12j77Mo7%J56j60k27N00k8n2
6264A42k66m1l0J21K16l1J32k27q6K5K56k42k57K96j32k5j24J94J98L5l99L46
6286A01k78K65l40K75k58N8J01N3J6j43M9O4R4O2M2k88J28k60L08k6P6k98K28
6309B9k33M58k20j03K06j33J85l20L95l09J4J92k61R5J32l22J75j46J43J30R7
6330B04j55k69K58k35j47L39kQ0l2l39L3L67J5j78J01J91o7p1k28K91j09l22O19
6353C44o45L44J72j58j56L69j80j14L07l21L98l36J17j03Q6q7J48k4o23N96k53
6374a19L48n16L59J38%j18j55L5k73J87O4j8j57K99m40K75K50j18J1%L7k82K33
$$ y = [95, -209, -85, 2, -51, -324, 22, -116, -223, 73, -243, 110, -210, -221, 243, -174, 102, -81, -199, -282, -199, 40, 61, 21, 33, 103, -47, 201, 86, 117, -218, -378, 92, 283, -76, -19, 193, 16, 20, -47, -47, 109, -51, -278, 222, 194, 142, -124, -165, -195, -74, 142, 111, 243, 16, -70, -45, 211, -31, -288, 8, -124, -149, -273, -79, 119, 154, -245, 101, -177, 88, -252, 23, -235, -177, -76, -23, -7, -150, -101, -37, 57, 119, 161, -127, 1, -259, 49, 23, 99, -199, 29, -204, 254, 34, -69, 137, 4, 189, -131, 264, -45, -31, 161, -100, -5, 127, -195, -20, -166, -23, 107, 204, 49, -220, 38, -197, -344, -5, -7, 73, 41, -298, -265, 102, 117, -61, 40, 231, 164, 93, -135, 156, 47, -275, 344, -301, 43, 215, 57, -99, 270, 90, -24, 283, -38, 360, 24, 141, 38, 124, 37, 185, 161, -462, 134, -119, 229, -287, 72, 210, 210, 92, -63, -28, -301, -114, -50, -68, -225, 74, -366, -91, 159, 41, 52, 52, 89, -193, 40]
6397D0j92l7n4K17j14J52l3j90K38r8K37k27j5Q2r4P6J76J4L5r3k34K05N2l31
6421a88L69j41Q9l7j97J43m82L32J7j17J20J84jr9M6l15L39K18m28M2K57j39j81
6444a69k40J18j45N89m28R1K4P0k3R9k53L63j83%K49m60O2K02J87l26N81n18K32
6467A22k05J59K02J6l26l5K7Q3J31n2q4l45O42q8k31o5j59K29N2M9l13K2K65J1
6491A07n7K50m93J2K99L5l30L44k46n6l1J41J69k35N0j6J38r0j70L35m6Q1l21
6514a30L10j28L29n22L19j70L11m06j99K88L19k38r1o3O3k4K31k39L56j38l96
6535b18N85o41O05n42J95m9m5K74J15n81J25kL55l72L25k18R1n0Q0k0K0j58JK13
6559H8K4KK9k8j68J4l04L03M1J36q9J63l6q0q1l01J52L67j42L2Q4j49k9m8J80
$$ y = [40, -152, -189, -243, -26, -140, 12, -21, -211, 27, -71, 166, -61, -76, 6, -88, -12, 164, 178, 213, 120, -114, 91, 143, -188, 181, 40, 129, 92, -105, 38, -444, -112, -95, -212, -92, 92, 91, -8, 38, -277, 62, 280, -148, -106, 151, 12, -169, -409, -291, -436, 153, -275, -184, -160, -90, -113, -14, -267, 96, -87, -87, 162, -298, -236, -34, 153, -173, 408, -110, 122, -83, 76, 278, 294, -32, -67, -40, 43, 174, 122, 38, -307, 335, 247, 16, -49, -208, 21, 73, 122, -191, -169, 96, 107, 50, 300, -193, -181, 118, 153, -177, 167, -79, -135, -166, -25, 144, -91, -41, -57, 81, -9, -179, 156, 110, 191, -130, 180, 52, 381, -141, 178, 8, 319, -87, -286, 2, 321, 83, -8, -71, -8, -32, 199, -40, 316, 178, -218, 367, -274, 331, -211, -16, -65, -110, 164, 279, -302, -177, -179, 176, -196, 129, -89, 2, -48, 32, 12, 32, -126, -125, 88, 112, 114, 143, 115, -53, -39, -343, -40, 1, 137, 48, 211, 175, 95, 14, -287, -135, 232, 90, 122, 206, 57, 28, -20, 160]
6584A60l43J89p8M2K1p8L62k53p2P6Q0N7j07j31L38l55J03M07k82k41m2N3J71
6607G7m9nK4k06N9q9lQ4n1j03L60j96J28k04J72l08L64l16J4JL37j02J25k82K22
6632E3m2K46k98j15J14n0K17j6N5j10K22j76k91L29r4j61L99m47N54l49k27M29
6654B42l85K22j87L97m00K45J1k41J63l38L17q3J57j44l56M17O8j80o0K24j23
6675c4K63l17J2L9J12j87J16j75n1P4K40j65J43k90K44J35k29K59j88j20L4K0
6697f5k33L64r0M1R6l31L28N13o07J06m4n7j44J02J28J80l25J78K8k08j43m9J79
6720e3r7K93l59K05j4K6j5j83M00j05k33ln7K86j05J21j83O6j27rP1K08k83J59
6744IJ94J35j54J26j43l71k9R7M64k45l94M16m7J01rj58k0M6K74k35l85N65k87
$$ y = [160, -183, 6, -72, -30, -9, -87, 275, 22, -50, 26, 106, 163, 56, -75, 263, -92, 11, 418, 136, -105, -147, -94, 77, 28, 23, 47, -159, -100, -189, -192, -108, -159, -262, 98, -98, 30, -174, -2, -310, 54, -262, -248, -247, 90, -12, 113, -169, 53, 11, 257, -41, -156, -42, -92, 125, 109, 164, 54, 276, 100, -191, 138, 44, -117, 282, -165, 389, 40, -187, 242, -143, 79, -108, 289, -111, 134, 145, -96, 67, -271, 46, -37, 120, -24, -380, 37, 105, -75, -135, 89, -34, 229, -88, -76, -37, 75, -112, 4, -171, -222, -148, 92, -73, 70, -220, 24, 159, -70, 189, 1, -119, -85, -65, -298, 66, -24, 17, 113, -218, 110, 623, 16, 122, 78, 21, -123, -21, 107, 287, -38, 140, 168, -40, -183, -232, -53, -150, 143, -216, -11, -25, 1, -14, -197, 203, 98, -135, -138, -195, 91, -14, 107, -76, -10, -137, -146, -75, 133, -150, 9, 203, 338, 184, 310, 167, -204, -233, -136, 328, 83, -311, 105, 58, 159, 150, -8, -28, 18, 292, 57, -328, 237, -50]
6767e0K37j83j57J0K27k62M0J84K54k36j20J05j21pK9l3O9p4J06p0J38k0P3k18
6791g9M2k2k44L59j75K41O9j96J16L9jj42J24L8j99J62m36L21j15N61k87J36j80
6814A32M3m43L54k86N02k05L4m52R2J55o4L57l70P3k93K99K22q6Q4P4k01j4J85
6837A92m52J49K80k53km4Q1q6J84jK6J13q0N0j30k03K41l61M05k54J01j2l9j92
6861b87J34JJ5Q8qJ52qJ23m03J91O6K07l4R0m20K05K0k91J56oP1j14J82r6q8j2
6887f6K12m33k6O23m74K59J10k96J85l11J79j15K27N4l39K67o0j40K8rj28K22
6909c1J64K06k39l1l03N3K63J7K85j24l78M87l21J13j68k92L48l5J98k95J11J41
6931A69j29K59l33L0R4n7r7k61L23n6L00k08qR0k02K55r9k45m5J63J27k18O0J
$$ y = [-50, 187, 4, -153, -143, 84, -178, -138, 46, 300, 64, -56, 49, -72, -79, -50, -83, -14, -88, 18, -52, 86, 66, 139, -79, -37, -59, -303, 56, -119, 122, 191, -5, 111, 150, 149, 7, 131, 169, -30, 132, -304, 17, -98, 463, 176, 312, 132, 175, -268, 86, -200, 302, 97, 131, -321, -229, -74, -138, 219, -151, -78, -371, -72, 150, 64, 148, 222, 21, 7, 192, -260, -111, 169, -84, -86, -130, -49, -135, 49, 48, 74, 187, 107, 157, 27, -176, 65, -296, 109, -145, -44, -56, -95, -287, -153, -152, -137, -49, -57, 95, 87, 210, -193, -2, 64, 271, 237, 327, -93, 112, 132, -159, -3, -9, 62, -52, 130, 34, -54, -66, 146, -287, -313, 310, -164, 95, 205, -91, 94, -217, -38, -153, 74, 128, -211, 56, -4, -144, -116, -125, -253, -31, 133, 339, 100, 69, -234, -181, 82, 99, 384, 260, -118, 369, 48, 161, -7, -299, 49, 14, 212, -83, 28, 169, 40, 299, -34, -4, 90, 33, -64, -325, -2, -58, 242, 34, 26, 116, -86, 169, 70, -175, -220, -57, 70, -148, -88, -87]
6955h7P5K67m72KK40j27J41P5o0k60j6L89m26M83k22k19K07N8q9J7J50K30l73
6978a7K58q4l20n2K1L33N1k13O9l9L4n9q8o4J52M57l05j40j08K01j20j73j5J81
7002d0j14j33K98j96J63j31P2K98n16M04l18l8J66K06j71P6jk09K35M4j55j6J59
7025H3m26J58J26K30J22j52J27n70j08J26M54l90J35j04M15m15J39j71M04j8k65
7046a00K66j41oj34L50j11r4J70l96J18j68P0M51k72j96K20J28j32J35k2q0k61
7068b05L32k13P6J00j86P2L66k25k43M5J6M00o04PL56J0m7J74PJ95n96K4R3J51
7092A05j68K36j11J03o2l8J95k86Q9ml6P9p9j47o8J35K27J31j84l61L40k96K07
7115Gj7M4K5k66R6J43k33J77J41J80n04J12j70L97l14K96J64l00k6J47N8m21N10
$$ y = [-87, -12, 255, -217, -215, 25, -102, 39, 114, 54, -206, -222, 167, -259, 224, 2, -217, -10, 48, -41, -24, 126, 356, -17, 241, 157, -163, -215, -194, 139, 190, -23, 46, 7, 41, -18, -106, -170, -18, 439, 134, -6, -114, 87, -33, -206, -221, -40, -154, -287, 11, -185, -22, -153, -81, 217, -299, 105, -213, -251, -85, 121, -50, 26, 25, -184, 51, 95, -60, -76, 83, -343, -185, -59, 171, 293, 141, 268, -302, -410, -284, 170, -220, -85, -189, 226, -189, -50, -221, 183, 165, -100, 166, 25, 19, -115, 235, 124, 30, 200, -196, -78, -246, -176, 275, 3, -193, 27, 155, 23, 158, 136, 56, -205, 127, -86, -10, 90, -96, -24, 342, 117, -126, -81, -65, 335, -269, -262, 94, 104, 57, 231, 238, 433, -163, -139, -46, 105, -63, 173, 62, 165, 103, 65, 260, -26, 63, 59, 23, 102, 23, -124, -192, -57, 170, 301, 117, -244, 96, -200, 7, -10, 34, 59, -207, -111, 32, -201, -24, 117, 297, -207, -95, -265, 132, -182, 114, 278, -22, -48, 99, 157, -264, 246]
7138B46jj24p8j62J63J6j79K12m80N27k14K14J75l65lK96n00M3%q0L57Pj30L6
7162b4m7r1J7O7J97l76K04q7l1K81q5r5n9j53K34KN7J05k30K6r9P8k9j97J85K56
7188A06J41k95J0K37k47j80j25K57q7P3R5l4l4j29M29l07L74r0j88O1m6k0J09
7211A10Kk47J90j94O7m0M2n6J27J98j26j79J78J32k95J25j05l9J79l82L44l6j79
7234a84Q1j86L17j9l16M43J6j8j53j11J69JL4k56J35Q1R6n5M9j21k4j26jL49k93
7259i2K73M7m66K70j77K70N8l00L57l95K12j31J58O6l65K82j0N4k89K94n9p8K32
7282B11k41J74j20M7j51O3J7j37k23K90j90L59m27J37o0o3M83k20L60l36j94N38
7304C17j18r2j17o8L99j92j44j1J04J9K7o0K4nJ20k33k7n2J09j56K33K8O8n8k67
$$ y = [246, 245, 121, 43, -119, 44, 60, -119, 93, -387, 140, -74, 140, 315, -50, -53, 243, -257, -214, -214, -294, 63, 70, -60, -24, -71, -162, -145, -78, 119, -257, -53, -140, -171, 110, 25, -70, -129, -282, -48, -46, 11, 116, -114, -88, -187, -109, -138, -335, -150, 106, 247, -48, -38, 199, -48, -228, -353, -96, -183, -110, -15, -49, -83, -212, 217, -90, 284, 194, 6, 67, 21, 1, 110, 112, -135, 55, -139, -72, -112, -70, -126, 1, 199, 73, -106, 72, 204, -91, 34, -71, -110, 69, -313, 31, -5, -184, -103, -289, 28, 9, -307, 136, 152, 134, -19, -130, 39, 40, 74, -182, -47, 34, 130, 75, 124, 3, -21, -147, -148, 201, -92, 181, 228, -238, 32, -145, 125, 183, -117, 240, -155, 57, -74, 84, 150, -215, 67, 57, 111, -178, 116, 57, -21, 211, -30, 144, 24, 71, -80, -17, 0, -137, -360, -70, -260, 99, -328, -191, -251, -314, 169, -51, 309, -27, -221, 317, 199, 107, -10, -78, 321, 129, -15, -26, 78, 97, 124, 64, 88, 83, 203, -30, -57, -109, 0, -156, 77, 105, 173, 115, -152]
7329a52K45p2J36k03J44j77j65K85r9J79j90K34j39R3k05k86M31k1l11M73o29
7350d29Q29l58k21J05k17P42k33j49J93j42k45L87j07k23j17K37J05l22K37m7
7370B5k9qj47L5j3M12l10K01m92N15j76m33M69k75K47j4Jl11M36l85K35K90l19
7393d6k4K38m2j22m4K48o86J15L58j79K58l3k56O8J64j97N3J2Q8J11j04J49l7
7416I2j85K81l07J41r0J23K5m7j24j27K10K51l55J24q1rk8K16l40L90k95n7L71
7439A79k32K7j12R4J59J01m0j81R8k34M3J23j74J58J15R6l04k79N15n8k34Q3J2
7462d5k71M17J4j47J28j79Jj87P9N11j76k54P5kK19j85k1J61Kq1M9k26j28M57
7486B11O0k13P5J7j78J83o3n4k59K49q8K90j77j64J44j36J47n6Jj79K41Q3n6K20
$$ y = [-152, 93, 21, 157, -46, 98, -79, -244, 41, -58, 121, -69, 165, 26, 119, -86, -372, 59, 38, -273, 200, -429, 400, 42, -179, -74, -291, 451, 218, 69, 262, 120, -125, 262, 155, -68, -185, 52, 157, -165, 72, 25, -4, -12, -159, -124, -137, 275, -35, 166, -326, 189, 13, -420, 49, -226, 21, 7, 8, -303, 133, -252, -17, 273, -46, -70, 168, 126, 4, -40, 208, -478, -363, -5, -184, 74, 41, -215, -147, 17, -180, -127, -115, -27, 84, -20, 129, 92, -93, 188, -119, 22, -68, 55, 80, 33, -91, -218, -8, 243, -112, 12, -69, -78, -106, 110, -230, 160, -135, -192, 179, -53, -26, -138, -44, 115, 216, 176, -5, 93, -141, -98, 25, -149, 9, 124, 220, -84, -363, 152, 94, -140, -57, -45, -316, 101, 115, -32, 96, -83, -82, -269, -190, 321, 145, -109, -34, -36, 183, -2, -23, 138, 140, 59, 108, -118, -246, 211, 271, 58, 133, 150, -28, 155, 92, 38, -221, 28, -60, 230, 53, -111, 33, -103, 44, -12, -11, -190, 51, 134, 78, 298]
7510B98o19K79J01k18L02n3j58j95J28K7Q6l3L26l02k42N41k30j49J26R9oR1j42
7533E7R7J50k30l4K03j75j49j15K02k29L61Q9Qk00k08J06O5K36k80J02J93n63
7555c14L60P1m41K19j95J93P9o8J95m33J83J74q3j16J38k0k54K08K46j50l8Q3
7577C7q5k00K17j32J39J03j60m6p8M33n52J4L45J07l0j63R2r0N8j32L71k44RO9
7601H2N0q4K5K85m82j75K63j85J92J98k30j27N46k29k49k6j44K19J17J12k04k08
7623b54J66RR4j74J41R8k69qK80k4p8J18l92K50M8m1Q6k08J33j23K71j95M58j51
7647B35M5Q4m46J82K5n2j96L18j64R0L2O3j24l7K05q9k40J96j80K62lk52J95n42
7671c93P54n07L69j69q1k5O6M5n05K61J34j4n1R5J53l42K16m72M65K5o6J97k03
$$ y = [298, -321, -42, 59, -159, 143, 90, -68, -263, -135, -108, -22, -55, 271, -31, -273, 268, 38, -111, 15, 114, 108, 199, 57, 154, 304, 74, 40, 243, 68, -81, -196, 6, -223, 138, 227, 235, 35, -173, -67, -2, 234, -46, 56, 249, -314, 46, 117, -324, -105, -300, -107, -28, -96, 99, -334, -151, 23, -60, -176, -38, -58, -312, -104, 142, -8, -46, 37, -48, -248, -31, -163, -24, 79, -81, -127, -205, 228, -324, -310, 35, 142, 112, -51, 41, -49, 9, -123, 248, 4, 13, 82, 132, 48, 73, 358, -124, -299, -36, -221, -29, 169, -61, -188, 358, 129, -120, -146, -290, -71, 46, 158, -46, -254, -88, -79, 15, -159, -18, 80, -189, -197, 83, 59, -19, 99, -293, -43, 5, -36, 50, -158, -25, -148, 123, -72, 386, 235, 280, 364, -82, 100, 125, 73, -123, 195, 31, 121, 153, 216, 92, 55, 260, 171, -69, 127, -53, 209, 206, -46, 149, -393, 361, -146, 223, 54, -27, -52, 14, 59, -446, -185, -51, -65, -116, -21, 132, -210, 6, -466, -1, 24, -42, 155, -48]
7694d8K04k17O4L42n69L53j02J24l50L50k36L20k67l1K05k10J10j01J95j78P5
7715C3k15M26j11j33k06L2lL29l41K31j07L1M6P0l54L82m6n2%j60K87j79J97j24
7739C3k47%k55M97j35J87j68K49o5j30j21M17q9k94K66M9l65J04M2j7r4K0J38
7762B2n6J12k3M73k69k41j44J95k21j0R8K49K05l05k31L58j57k2M3j28k70K29
7784i3k74J91J78J40k07q5J92j22k4L20l94R1j8L05l8l52m8K43l22J25MP8J32
7807B2j49K88j72K35j76L01m92J45k19K78K12k62J64J34k91J17j17j41R7Q3P5
7828A32lj12k5K06r2k18J37pj32J55O5k3P6r4j73J11r4n7M1K7N6O9k42J66L8R8
7854A05j71J02k73M65k4m21K36K99l39K30K54l78j14j31K64k62j1M03j88j05J63
$$ y = [-48, 156, -61, 3, 345, -224, 129, 27, 151, -199, 151, -85, 235, -32, -63, 142, -68, 42, -59, 136, -42, 33, -182, 244, 133, 0, -206, -174, -177, 152, -189, 42, -65, -34, 12, 82, -272, 110, 64, 12, 12, -148, 139, -40, 157, 33, -214, -214, -469, 28, -107, 80, -88, 161, 96, -34, -155, 262, 173, -121, 145, 194, -171, -67, -25, -42, -136, -116, 22, -34, 78, 55, 528, 259, 18, -126, 69, -152, -162, -64, 185, 390, 85, -146, 212, 55, 33, 76, -52, -322, -93, -367, -176, 2, 142, -65, -150, 42, -80, -104, 216, -178, -87, -105, 200, 162, -190, -238, 5, -317, -192, -188, -110, 22, -127, 161, -11, 224, 48, 349, -143, 2, -217, 61, 273, 11, 175, 309, 18, 135, 18, -123, -26, 57, 132, 129, 17, -8, 198, 106, -112, 25, 18, -114, 41, 106, 83, 159, 65, -108, 3, -91, -148, -107, -80, -24, 45, -197, -31, 7, 105, -66, 36, -237, 228, 204, -217, 19, 318, -21, 209, 463, 85, -29, -160, 104, -158, -169, 234, 46, -59, 104]
7875A04l21J49kpK05O4k24L3L3rj46K2J88K4r4j57J11K29j52J18k24j38M27m3
7899A90J9j27j40K96k57J34k12k03L87Mj56K48k82l52L12J59J49l41J64j63O1
7920a10Q9j69N82j85k01j37K92n8p3J03L4j24j20j8J07L00j68n9j60K23J64k42
7942G0J64l8j11k83NK34j75L31k44N4J67q1m2j47j10J38Lm9m2L10l50J83k4k05
7966b42J67P8r3Q6j61L31pp9M8M1j16K72k63n4j94J64l4L79l09n7n2k24O56j52
7990A85k63K17n8j59L89k93L4k43J25K17k89K00J3k56K32j74o5J32p4J20j40Q4
8012f6j04K12n8j69J47j32K17j20j40M22m93L81K35l62P8l44O74k11m23L39k51
8033a68MJ48k1L9k15J29K88k6j42j00O5m7L09k32l7j92Q7p7L73o5q8j80K61j46
$$ y = [104, -217, -68, -70, -77, 128, 192, -32, 1, 34, 25, -121, -99, 89, 113, 19, -138, -27, 202, 50, 168, -56, -194, 233, 190, 209, 82, -58, 238, -19, 115, -97, -300, 87, 91, -65, 183, -99, -451, -139, 20, 169, -172, -8, -171, -110, -21, -190, 392, 207, 6, -131, 161, 103, 30, 133, 167, 43, -77, -95, 12, 312, 144, 85, -75, 148, 312, 70, 234, 196, 85, -198, -193, 41, -134, 197, -47, 7, 174, 93, 51, -96, -206, -68, -65, -114, -156, 154, -196, -13, -37, -242, -75, 3, -90, -4, -165, 166, 159, 80, 128, 169, 53, 325, 62, 8, -186, -22, -56, 323, 14, -43, -95, -319, 337, 185, -78, 139, 81, -78, 311, 18, 52, -191, -66, 151, -138, 62, 75, -181, 51, -123, -188, -56, -130, -10, -150, -66, -170, 42, -16, -185, -38, -170, 47, -73, -213, 209, -284, 97, 332, -30, 48, -296, 378, 167, -256, 83, -168, -164, -16, -37, 2, -213, -84, 204, 178, 36, -64, 1, -46, 263, 31, -6, -198, -111, -188, 185, 120, 32, -148, 113, -33]
8057c3k11m3L73mj53k4N89n54M6k52J91k8J53j57K75k37M8K59j85j37K20k42j79
8080b85J26n1O9n4L21J10j84J55j92j5K00l86Kr4J43M1R2l6K44j74k3j90M33q0
8104A72Q6k47J01K9L39m78O3M9J97l28j94M26k18J27M5o1m13M8M01j03o7j51O6
8127a11J63k60K67N5k3q8L25o11J14K90k54Q8L18k34j41J62J19j78J85J4j65r6
8149f1n9Ll1m0L63l97K97k35J64J56j36P3j13pj7k79M89j87PL7J6J58o6l1k26
8174a22O2j34p8j71L93J19j33j0r8K44K0j66j29J04Lo5k60
$$ y = [-33, -244, -287, 86, 82, -71, -95, 494, -60, -14, -266, -75, -103, 50, -107, 168, -69, -21, 238, 53, -84, 136, -106, -285, -159, -210, -141, -195, 126, 236, 52, 207, 15, 0, 200, -186, -184, -278, -135, -94, -2, -38, 206, 32, 9, -181, 252, 172, 258, 11, 112, 141, 480, 2, 65, 114, 311, -17, -211, 215, -3, 124, 169, 108, -305, -257, 144, 41, -26, -177, -111, 52, -208, 59, 114, 91, 3, 328, -283, -169, 121, -133, -45, 273, 39, -102, 60, 179, 1, 186, 200, 35, -61, -120, -117, -148, -188, 175, -222, 75, -160, 4, 160, 24, 97, -16, -23, -40, -319, 170, -17, -10, 27, 43, 201, 135, 104, -122, -60, -194, -272, -443, -50, 69, -64, -74, -172, 72, 92, -74, -203, -99, -96, -161, -421]
8191d21
$$ Imaginary data points
##PAGE= N=2
##DATA TABLE= (X++(I..I)), XYDATA
0@%%%%%%%%%%%%%%pJ5j6J6j6J6j8K6l2L3m0M7n0N8o6P4q4R4j07J21j33J46j64
37h7J84k03K24k48K75l04L37l75M15m59N14n76O43p26Q28r50J104j308J583j984
57a113K628l826O792k5410n5428M6414N2087p67l5963j1017N521M367M859J3473
71B617M75j8692j6078J1183K2991Q343j2175j3686K750J4539K165j3874l191J9191
85F558J0830j8877j7453J4342K2885j879j7194m533N647L544M170P870Q0j3788
99B202q265J1217J5539j164j2485p031L712Q596M610m640q600j033N732P95n494
114C691k923L091K056l539l574j637J267K743J156l942p284q28Q336N795l755
129F53o667j40K348K762L023j12n506l149N759O880j783n606m52M798L248k611
$$ y = [0, 0, 0, 0, 0, 0, 0, 0, 0, 0, 0, 0, 0, 0, 0, -7, 8, -8, 8, -8, 8, -10, 16, -16, 17, -23, 24, -26, 32, -34, 40, -44, 50, -57, 64, -69, 77, -87, 97, -106, 118, -130, 145, -159, 178, -197, 218, -241, 273, -303, 340, -386, 442, -508, 596, -712, 871, -1113, 1515, -2311, 4481, -20929, -76357, -29943, 22144, 21377, -14586, -25603, -20082, -15715, -10856, 2617, 3092, -15600, -31678, -20495, 2496, 10839, -1336, -15022, -12272, 2267, 4432, -9442, -12633, 6558, 17388, -1489, -18942, -4600, 18285, 16406, -788, -5321, 326, 3870, 8040, 15910, 15990, 2202, -6063, 5154, 20693, 19529, 7044, 13, 3725, 12321, 16931, 12291, 3691, 2658, 8390, 9185, 3691, 768, 3859, 5915, 2376, -1198, -2835, -1568, 1175, 2331, -1611, -8895, -9723, -1387, 4408, 653, -6014, -6154, -3806, -1044, 1979, 1867, -3639, -6788, -1029, 5851, 4068, -1538, -1990, 2808, 6056, 3445]
145C445m167n94N907O616l349r397j605J0310O580m801o764K91R43J400N908L659
161A4382r196j0564L162J2839K995j0061p881j93N257L531j548o797l482M314
175c242M032m791n123L057M012l894l278K973J122m378J450Q407q64j1798l637
190a5952J1715R130m973r009j523M458N345K967k060o058k621M841N222O4m65
205A081j252l928j285P649O375o155p478K936O635j174l683K624K653m600m184
220c786L784N464k218n361q29Q18N86J356O96l340l847P83K751J293r56j353k280
237f439r95L118M558j333n767j39M702K039j385L34R25j257p80K555K594j094
253A636k129J349J701r43J4K195J104k330n08Q48J386J098O08j282j956L44K381
$$ y = [3445, -722, -1316, 4591, 11207, 7858, -1539, -3144, 7166, 13746, 8945, 2181, 2472, 3415, 4815, 10723, 14382, 5186, -5378, -2216, 10623, 13618, 3557, -4324, -4517, 740, 4271, 2723, -4074, -7556, -3242, 790, -4001, -9124, -6067, -2055, -5949, -9227, -6254, -5132, -9510, -8060, 347, -517, -12315, -15952, -4237, 4893, -80, -9089, -10612, -6154, -809, 2158, 98, -5960, -8581, -3740, 1482, 1546, 1081, -171, -4099, -5384, 2265, 8640, 2485, -4993, -2057, 4578, 3404, -279, 2345, 4998, 398, -3786, -2, 5462, 3244, -2117, -2946, -2128, -1542, -186, 510, -2830, -6677, -5894, -3143, -1850, -2806, -4159, -6439, -7434, -4316, 242, -1091, -6858, -6997, -2295, -256, -1641, -1307, -382, -1639, -2419, 136, 2730, 1636, -493, 856, 2557, 1614, 1628, 3823, 4927, 2597, 2089, 2937, 4323, 5421, 6029, 4747, 2791, 3135, 5516]
270E516J276j006j697j600k14J093K556p43m254k380K225K485j204k435r89q03
286b174o61K223J013k036k936J19J692J006q5l98j778k53J877K265r37j632R38
303a757J332q04L07J871L63j667n25K642Q35j578N20K024q64j569J006K512n5
320D593j462L39J56r55Q90K314n79k988j290J918J047r44j018K57k468j214J980
337E76K022k772l203O58J069k12q64Q18r73j816k48K231K39j392m69J002q4j215
355d633J564K088j331j743J670J563l64L4J449k40r34M36K297J92p99m74J415
372B190J19j04N07J075q82r39J398J140j143o30O81J77j003k74K58k89q78k82
390A121J49n04p21k86k86n04q26k02J95p68o74M29O4q90j85K99O3m55K86M82K1
$$ y = [5516, 6792, 5786, 4089, 2489, 2275, 3368, 5924, 5181, 927, -1453, 772, 3257, 2053, -382, -1371, -2174, -2835, -612, 401, -1635, -4571, -4452, -2760, -1754, -1839, -2237, -4015, -4268, -2391, -126, -1063, -2695, -1757, -425, -1229, -922, 949, 1312, -355, -880, 1762, 2597, 1019, 1539, 3563, 2699, 1130, 2136, 4648, 4593, 3131, 3470, 3626, 2671, 3561, 5875, 5296, 2308, 1018, 2936, 3983, 3039, 2021, 2278, -190, -1404, 576, 2598, -174, -3377, -2719, -1650, -1862, -2726, -1908, -2881, -4697, -4945, -2714, -2475, -3867, -4336, -3334, -3418, -4633, -3069, -981, -2312, -4055, -2385, -822, -1186, -1152, 297, 57, -877, -441, 1856, 2048, 1249, 775, 2190, 2309, 2205, 2712, 3787, 2905, 1966, 3364, 4504, 3361, 2731, 3412, 3589, 2586, 2312, 2570, 2281, 1403, 1121, 1270, 766, 45, -241, -527, -1031, -1857, -2059, -1864, -2632, -3306, -2877, -2813, -3703, -3888, -3589, -3526, -3981, -3695, -3213, -3192]
411c192l35K93M59N80L25p31P43P85N14k92P15K91L9M06Q26k87K24L17K98L81
431B359L4k87K24M89l55k30L94P4o29J73K60r09o10J4L02j73j143p86j00J12l57
452a144o32K11o42l08L07J31j470m23P19L94o92K58K76j70L10K12J99k78m1J136
472a647Q08p6l80J80J426J45R4J79L86jQ11J128p62l70O60Q89L92p54j83L34L99
493C658l43j86J7n27K3j81K34l91j213%K38n19q76k79m9j78m0q16O1m87l7M44
515a447p72m97k27J151L03r83p94P86J235j89k56K21J23M2N10J238l26q24J198
534D92J512J16q13q2J302N26K44M0p47m16J266J405k34k390m69K017P73j054r12
553B576m05j76K98Q17j51j931j961J157J334m07j882j050J60L56O99M1k669j339
$$ y = [-3192, -3527, -3234, -2775, -2195, -1870, -2601, -1858, -1073, -559, -851, -136, 155, 194, 600, 1426, 1139, 1363, 1680, 1978, 2359, 2393, 2106, 2330, 2819, 2464, 2234, 2628, 2702, 2073, 2246, 2506, 1597, 987, 1001, 1303, 1130, -13, -799, -899, -787, -1144, -1776, -1565, -2207, -2515, -2208, -2077, -3547, -3970, -3251, -2857, -3549, -3291, -3015, -3185, -2875, -2663, -2464, -2742, -2783, -1647, -839, -915, -1295, -1115, 311, 456, 550, 729, 1115, 1114, 1925, 3053, 2291, 1921, 2581, 3470, 3862, 3108, 2925, 3259, 3658, 3315, 3129, 3146, 2619, 2642, 2461, 2695, 2304, 1091, 1091, 1329, 810, -66, -345, -394, -572, -612, -1428, -1367, -1854, -1891, -1447, -2219, -2716, -2943, -1792, -1489, -2472, -3266, -2480, -1245, -1434, -1690, -1469, -1346, -1304, -794, 444, 118, -706, 492, 2004, 2120, 1307, 1225, 2527, 3053, 3297, 3337, 2590, 2174, 3440, 4845, 4611, 2221, 1752, 3769, 4542, 3488, 2576, 2171, 1995, 2293, 3110, 2959, 1028, -933, 224, 1558, 1151, -731, -1781, -1621, -1265, -566, -525, -3194, -4533]
571d533J188K146j020k015k67J566N63o67j42L7j88L23J239M40j164m63J861J421
589C25q16p55K62N74J138J348p93j654K81K185J097j520q89Q09R74n69l70P37
607B364l35o12l63L73r9p55l4K35j066l00J27J22n19l98j95j296l6J268O86k563
627c396j565J170K303j37k078j151R18J465R31m69j488l05J545J607r1n80o58
644a979J48J240K485R3k697r37K780L628j202l258k94K065K492L1j933j409L64
661A617K182J791j815k776M33J517R55l56j058j991r19K075K568j624m733m35
677b569L443J786k014l096l89J313J610L37j674k087k31K393J209j200j608K70
693b507O10K13J584L40k677q21L030K372j690k537J123K844K50k122L75J284K20
$$ y = [-4533, -3345, -1199, -2219, -4234, -4501, -2935, -2372, -3039, -3181, -3144, -3332, -3009, -1770, -1330, -2494, -2957, -1096, 325, -491, -1246, -984, -410, 728, 2076, 1283, -371, -90, 2095, 3192, 1672, 783, 1592, 2566, 1997, 1627, 2364, 2029, 1417, 1054, 1427, 1328, 573, 539, 774, -292, -592, -465, -343, -862, -1260, -1455, -2751, -2787, -1519, -833, -3396, -4961, -3791, -1488, -1625, -3703, -4854, -3936, -2471, -1540, -2009, -3497, -3802, -2257, -650, -741, -1321, -1979, -1831, -591, 1894, 1987, -710, -1647, 1133, 4761, 3559, 301, 7, 2072, 4564, 4595, 2662, 1253, 1617, 3799, 5590, 3775, 999, 1432, 2949, 3904, 3548, 2490, 499, -420, 1655, 4223, 2599, -2134, -2569, 874, 2660, 646, -2450, -2839, -1526, 84, 421, -1253, -3340, -3571, -1178, 31, -1169, -2777, -2507, -1897, -1684, -100, 240, -2437, -3258, -228, 2144, 454, -2083, -960, 1884, 2134, 12, 387, 1671, 1891]
710A891o03O07K3n79P82N91q74o04J095N46j232j79O72l57j583N24J673j073k609
729a289J53K362M31k632j380J442Q00q38o03o37k23P31J271j382j717K88K058
746a165J26q13l96J57o37O52K216P90l091j936K805L868m72l141p61J052K029
763A283J868r15k379m66K077J602l90q55p3o57JJ260J137j485k360N84K279J30
781B641k051r77Q91L08j77m81j182l95J253Q49j970j518P91J072J14r05L31m24
799a830j315Q44J825N34k108j499J309K302K20j189q00m12J328J610J02j451j
816e31J478m6o48J698J050j733j904J782K640q97k118J58J874m93j617J155Q73
833B721p31j463oM68o5r4o2j159n82P50o5r47j8J072p44k187N46K230l2k352o93
$$ y = [1891, 1288, 1895, 1918, 1339, 2121, 2712, 1838, 1234, 2329, 2875, 1643, 1464, 2136, 1779, 196, 720, 2393, 1320, -1289, -1136, 1226, 1657, -975, -2355, -913, -113, -951, -1554, -2191, -2414, -1683, -412, -1794, -3511, -3223, -1165, -1039, -1852, -2248, -2091, -2728, -2076, 140, 930, -2161, -4097, -1292, 2576, 2104, -1037, -1798, -746, 1283, 3151, 2236, -143, -609, 1468, 3070, 2680, 1825, 1752, 1095, 1096, 2356, 3493, 2008, -352, 232, 2511, 2641, 590, -387, 504, 812, 635, 154, -1028, -1423, -170, 679, -1291, -2809, -2018, -946, -832, -1737, -1406, -1830, -3145, -2301, -476, 58, -2050, -3549, -2240, 62, 282, -907, -1707, -2119, -791, 819, 921, -530, -531, 947, 901, 253, 1951, 3001, 1268, -636, 1146, 3786, 2889, 771, 929, 2803, 2310, 693, 1848, 2721, 1990, 527, 521, 989, 924, 830, 768, -391, -973, -223, -288, -1235, -1253, -181, -925, -3112, -2566, -336, -368, -2720, -3413]
854c413J526K08q95L72J726j420j749R44K234N16j135k66l26K85J119J725m34
871A017j647k62J611J231K34J91j198q80K48K660Q18j840j418Q68P36o42J055
888B782N3j534j375J189J660o06k008m68J067m35j94m9m03r37K32O47m53j291
906b123J05L98J47k25k98n51o7R45J152r62j570K92K023O09q57k60M86j64N66
925c54J048M63j348m69Q23J230K21l85J82K96k0O9K17k92L77P45o68j300j13J714
945B436J47p07r10O8j015P7J449M70j906k173Q81J906q2j232r14p88K71Q59R41
964b22q80j615J03Q57j7K28N48j03j390j60J466J045p00J8N15n59q57J477J741
983A495j70j435n43J260N93O04N93p94j340l61K122J071r72m23l70k49L7J816
$$ y = [-3413, -1887, -1679, -2574, -2202, -476, -1896, -3645, -2701, -467, 49, -1086, -1352, -1678, -1393, -274, 1451, 1017, -630, -892, 719, 1950, 2184, 2375, 1177, 297, 545, 3205, 4023, 2183, 765, 1633, 2369, 1727, 2782, 2835, 1301, -74, 1115, 2775, 2169, 161, -307, 760, 325, 131, 82, -321, -1258, -1026, -379, -832, -2123, -2018, -1620, -1473, -1698, -1996, -2547, -2614, -1669, -517, -1479, -3049, -2757, -734, -125, -982, -1242, -756, -920, -354, 694, 1157, -191, -660, 163, 1393, 1614, 1229, 1411, 1707, 1687, 1756, 1973, 1681, 2058, 2803, 2135, 835, 722, 2436, 2583, 1876, 966, 1034, 19, 96, 1545, 2015, 109, -2064, -1183, 723, 641, -591, -1505, -2293, -2022, -1163, -222, -1102, -2717, -2614, -1757, -1774, -1546, -998, -1101, -2491, -2651, -1185, -140, -840, -822, -307, -866, -1723, -246, 1495, 1325, -110, -653, 607, 1200, 1804, 2397, 1603, 263, -98, 2024, 3095, 2123, 1700, 1330, 1081, 1118, 2934]
1001B934k76j257j373O08R17q70k27Q86j116j371k19J483J94o15p04q2r52l40
1019b380J179P58o05k018J95R30R35L30n01j228r44J593J589Q1q74m32L49N42
1037e01M36R88k28j336K92Q90P72k72L32K90o80r5O66J011n41r09M3J51j92l9
1057A078N44j12r41l67N95j85k57j42p62k63l1N09l93l63n29K86J51l84j93k96
1077b055j0j00K86N41l79m55L79Q30j43p41N83q5J22P37N99m95m58P07Q67K9K08
1098I67o7k16K9L15J032p9p78R8N92l11J9O65J05r21p21P26L57n65k38L19m63
1119H65o86j02Q15l74n15n97P9m04K25L42j41j338L7M20K58k14j86K14n23K30
1139a595O00N35n59o60M6R40K90J47K43j8k11K72N21M07q1l08O65J8n07N43J010
$$ y = [2934, 2658, 1401, 28, 636, 1553, 683, 456, 1342, 226, -1145, -1364, 119, 313, -302, -1006, -1088, -2040, -2380, -1201, -443, -1048, -3066, -2871, -1941, -1006, -676, -1177, -2405, -3349, -1756, -167, -86, -960, -1392, -1043, -501, -65, 923, 695, -641, -349, 541, 1313, 1041, 1373, 1663, 983, 888, 1554, 2565, 2024, 1115, 1158, 1309, 1117, 1078, 1622, 1510, 569, 202, 797, 612, 355, 213, -549, -812, -843, -334, -727, -1090, -1619, -1333, -1182, -1566, -1759, -2055, -2065, -2165, -1879, -1338, -1717, -2172, -1793, -963, -1106, -1847, -1264, -1349, -1227, -490, 109, -386, -844, -137, 730, 759, 967, 900, 684, 713, 1028, 2060, 1981, 1203, 1301, 1893, 1582, 1601, 2266, 2371, 1450, 729, 1455, 1812, 1247, 1009, 1328, 865, 179, 77, 892, 518, 3, -594, -515, -919, -694, -352, -493, -1831, -1794, -1374, -1116, -1330, -1516, -1302, -1825, -1595, -995, -460, -1019, -1679, -1633, -693, -403, -256, -13, -31, -242, 30, 551, 958, 877, 569, 1234, 1252, 745, 1288, 2298]
1160B298p34m5J08J15P5J74J34j67j88p49Q75j53n3r36N3K72m56N5O5q74m03J29
1182d05J42m05m14K29j20k77P4j47mk3l3J68l1J8l73M53k32J88J09K73P4l2O32
1205a36j94k10M03N63j45K66J66r5K83j09j92L26L95k10K96l62L6O7J71n20K58
1226A057P2n46k75K06K62m48n13l58M96n44n7n1k37j08N0l24L4Q8P2m34l71J10
1248a819K90O97r40p6l38R83P8J44R3r2l51O41Q44J78m91l24K35J55Q82J07k88
1269F08k90L55P10J53o25r8L92K27r0J64Qm95J17j73j02J21l28r2K81l80k44m66
1291b47O2N39p4r12k69k04P61j22j97q36L58L83J45m57j86N55l75r6L28K78J97
1312c69n04R2M14M19Rk2K89L74l33K37K58N86j96n36l96R53Q60K89j097p55N59
$$ y = [2298, 1564, 1519, 1627, 1742, 1817, 1991, 2125, 1958, 1770, 1021, 1896, 1743, 1690, 754, 807, 1079, 623, 678, 743, -131, -534, -405, -263, -668, -1082, -853, -973, -1250, -1176, -1323, -1327, -1350, -1383, -1215, -1246, -1228, -1601, -1148, -1380, -1192, -1083, -810, -736, -768, -136, -330, -540, -137, 426, 281, 547, 713, 618, 901, 792, 600, 926, 1321, 1111, 1407, 1045, 1081, 1148, 1319, 799, 1057, 1129, 583, 308, 514, 776, 328, -185, -543, -47, -591, -648, -699, -936, -1044, -994, -1318, -1284, -1196, -1124, -1558, -1929, -1819, -1529, -832, -1772, -1848, -2186, -1203, -1125, -981, -888, -980, -1331, -690, 154, 332, -159, -483, -248, -93, 789, 896, 608, 318, 673, 1383, 1536, 911, 813, 1205, 1432, 1342, 1506, 1514, 1019, 1136, 963, 861, 982, 654, 562, 843, 463, 219, -247, -185, 354, 280, -632, -901, -1105, -344, -466, -663, -1499, -1141, -758, -613, -1070, -1256, -701, -1076, -1172, -844, -566, -369, -873, -781, -367, 52, 61, 39, 328, 702, 369, 606, 864, 1450, 1254, 718, 322, 1275, 2135, 2424, 1327, 572, 1131]
1333A131M91M01m26n44j99M51r8J42k13o29q83N72R30m01j224k98L31O13l94r09
1353a156j29L17M96l06m56o44L29N60p5m89j94M01J18J13P75n56q11L92R51R84
1373F20o90q15O0R49O60j50m93J68K77N63m17M51k31p9r3n0O96Pl15o32L28L83
1395A197j60j008M39L80l31k91q45K61O17m59m18j91o6J28R8o58k43J42M66p01
1415a643%P52k21k13k29N80J95j47M4j06J93LK6N77K91J21m02q6M24M41N93l79
1437H14m45P9J312k28m35j40K18o9L71L30m86j81p13O45L06R7j229P9K04M26K9
1458I84j088n67J87O67k00m57q04O42M54m84l01O4l13l33Q45m1k86l89J30L86
1478i04J93R3j45j82N08J31M23k40o70N47O42j6j90K96J45j82K59M93m2l70J21
$$ y = [1131, 1622, 2023, 1597, 1053, 854, 1305, 1207, 1349, 1136, 507, -376, 196, 1126, 725, -499, -797, -466, 147, -247, -1156, -1285, -968, -472, -778, -1234, -1878, -1549, -989, -1064, -1553, -1747, -1346, -1228, -1115, -340, -896, -1707, -1315, -364, 620, -70, -885, -825, 124, 784, 634, 141, 309, 586, 1149, 732, 1183, 952, 873, 780, 730, 1426, 1433, 1118, 486, 814, 1197, 1037, 29, 468, 848, 517, 226, -619, -358, 259, -200, -618, -809, -875, -747, -649, -1307, -1550, -1408, -942, -1643, -1643, -891, -1112, -1325, -1554, -974, -779, -926, -882, -988, -795, -792, -766, -189, 102, 223, -179, -265, 159, 600, 1193, 814, 369, 448, 1760, 1532, 1097, 957, 1175, 1106, 1477, 1807, 1321, 1140, 427, 1072, 1378, 1475, 246, 325, 529, 955, 984, -104, -671, -484, 183, -17, -474, -1278, -636, -182, -666, -967, -903, -1216, -1549, -704, -745, -1031, -1420, -1290, -904, -711, -618, -763, -945, -437, -306, 117, -123, -793, -246, 396, 380, 190, 486, 631, 449, 708, 1201, 1159, 789, 910]
1499I10M80k4j93m93L17k48M15k0j08m53l33K94L88l39n38J35k14o83O09L52n07
1520b53o26n2N82k04j55l15j91RM1L06m6m20j76M29L73k41J82j06k3L2J036K22
1542D04m89m96P62P77n55p2N2J24J21L32k57J4k44N46J43j06j03l8o7j60N74l39
1564I23m70l72O49J85k23p06j31K32q4N8m03l53l71J09L92n9j04l06L05j50O5
1585h14n1Ok49j02L77n8M7J79l0K4o9M01L85J79j18j94M85q3K02j11L59l12P1
1608E24P42l48l5m23M16L63m9J08m72j66p0K70J42o33k17J86J89p61K92O4j57
1629c5m97J92M32o25m21N83l36r2n33L16M51k22j72J27l31K1N48K89o23l25M72
1650g81N99n9j07l3J90k24J99R20Q9p58K05N30R3M8l83q2r9N32j5K30n10M4L83
$$ y = [910, 1390, 1366, 1173, 680, 997, 749, 1164, 1144, 1036, 583, 250, 544, 932, 593, 55, 190, -24, -707, -98, 254, -253, -879, -931, -349, -553, -708, -1023, -1214, -1205, -1164, -858, -904, -1324, -1500, -1071, -698, -939, -757, -863, -886, -854, 182, 404, -85, -581, 181, 958, 403, 331, 383, 507, 628, 960, 703, 717, 473, 1019, 1162, 1056, 953, 915, 848, 688, 1262, 923, 453, 81, 730, 915, 692, -14, -145, 87, 3, 61, -342, -695, -1066, -957, -565, -624, -728, -1034, -729, -879, -814, -865, -859, -1108, -1210, -833, -891, -844, -665, -695, -671, -740, -339, 46, 225, 107, -87, 398, 315, 517, 406, 765, 453, 524, 1266, 918, 883, 460, 876, 1239, 1190, 1298, 826, 660, 590, 860, 1002, 369, 152, 338, 527, -234, 58, 122, -35, -532, -340, 92, -533, -954, -371, -707, -799, -1332, -1016, -565, -787, -959, -832, -1163, -1142, -594, -305, -928, -1253, -781, -182, -241, -348, -381, -191, -415, -216, 704, 793, 35, 240, 770, 863, 911, 528, 446, 347, 879, 864, 1094, 584, 628, 1011]
1673A011j28l42l8M20m20j76k4N4k25k82L39p6o48J89m9L97q10J33k20J67k68
1694i96J24J98j60m39N12J86l73j6Q1j66J55N88M1k28J16j42L79M29j037P91J93
1715B36o3N4J70L19l10N74J24m54P7J36L53k45k6P7l45n6k4M28o02J51l81N80
1737G73l44o1k46k06j14J2R1j39j76n52M11L66m68j79M7Lk34J87p2J67j89M2J94
1760f87n7M5M30J40m41J33K73L2K37N70j67k96n35O85M26l46nK57J95l42M07L99
1782A353n88k34j42Q74k70o76KJ39L23m82L74o52j2j41K41k10l32j95K62L56p46
1803g56O3j83m4J48o8L66k08l87O30J37m88m07N11K33k75K54J94l44J56K08O03
1824C43l33k51M02L31j73N1j67L38J08j09K71J9l24K37J24O1l19o1Q8N3R5j17
$$ y = [1011, 883, 541, 503, 923, 503, 327, 303, 357, 132, -150, 189, 113, -535, -346, -395, 2, -808, -675, -895, -728, -996, -872, -674, -834, -1273, -761, -575, -948, -964, -883, -1049, -894, -306, -265, -493, -377, -519, -140, 289, -748, 43, 236, 173, 227, 397, 716, 406, 980, 1104, 650, 727, 863, 1216, 971, 945, 1022, 677, 621, 597, 1025, 423, 574, 193, 773, 429, 368, 122, -84, -198, -186, -95, -234, -410, -962, -551, -185, -653, -832, -785, -782, -1016, -829, -901, -734, -923, -881, -687, -744, -699, -269, -129, -570, -437, -164, -132, 105, 675, 508, 212, -323, 362, 788, 442, 437, 694, 889, 547, 954, 1353, 765, 531, 389, 1263, 993, 317, 319, 458, 781, 299, 673, 21, 9, -132, 109, -101, -433, -628, -366, -10, -756, -693, -876, -920, -772, -840, -474, -682, -1069, -439, -302, -790, -1197, -686, -453, -728, -474, -280, -624, -468, -260, 343, 10, -241, 161, 492, 319, 370, 203, 541, 649, 540, 811, 830, 506, 743, 867, 928, 609, 548, 636, 689, 784, 667]
1846F67m96J41j59K39r4k65l10L45k10k0N1k50j74K23R4n33j25K11K0j12k83J31
1868i09K79l75J22K50n3J98K8K89L09m02R6k15P25j21l03L25o8K0L96J18k11l65
1890A33O60K89l41p6O8J09k43K25l26Rj00L17M7m91j75j6N36o18j09m10J44M34
1912F6l01L66q22L6p2N6K49k49k60J87J38j40P3J23n7j56L89j68Q1k16N77l25
1934d25K37K01k49K44o6K79o8j19J43N84K51o52Q9J41l7N31k29k05r8q7N36N4
1956A055j210M74k63L9O49l61k41k93J09L93l73q4m31J28J31j86k44P5j7P5J27
1977d48r8j83n5J96L58m54k2k06O02J87j8l29Q5j9M13P10o21n15O55J90J1n3j27
2000B59M48j14K08j46J57j36J48n4J17l86O1kJ55k40J71p5o44N43rj94l88m38
$$ y = [667, 171, 312, 153, 392, 298, 33, -277, 68, -142, -162, -111, -361, -535, -312, -218, -751, -876, -665, -645, -757, -1040, -909, -630, -1005, -883, -633, -686, -488, -460, -171, 138, -264, -168, -383, 342, 221, -82, 243, 175, 195, 591, 709, 498, 133, 793, 1082, 741, 665, 733, 842, 599, 824, 498, 507, 407, 724, 771, 280, 105, 89, 625, 7, -102, -512, -368, 66, -235, 131, -691, -655, -727, -671, -422, -671, -931, -744, -606, -746, -673, -550, -607, -763, -374, -542, -461, -677, -100, -425, -188, 13, -236, 8, -58, 221, 153, 34, 177, 761, 1012, 360, 449, 590, 553, 1084, 855, 650, 552, 465, 1001, 1055, -155, 319, 56, 95, 744, 383, 142, -151, -42, 351, -22, -106, -537, -409, -278, -464, -708, -633, -650, -575, -448, -546, -729, -784, -588, -230, -684, -706, -912, -310, -123, -141, -470, -385, -404, 9, 719, 98, -417, 238, 428, 439, 386, 259, 707, 593, 801, 655, 812, 676, 824, 770, 887, 501, 562, 560, 715, 475, 646, 571, -73, 470, 461, 267, -121, -559]
2022e59N27M67p67k40j89K84K88l90o7j23p6O84k54k30k83lL62j32L05k26m01
2043a023N49L16J20l24j86L00P54j47l83J87O6M72q4j13Q6lp1L09mm30J22kP9
2066E90K61k25m43J59K37K09m16l57k88J64M78j10p06K28m0K48k95j31k86J35
2086e88M7m8J32j95l24K31M71j62J09n59M99J4L37p6l55Q3K87L46j89j96O0M56
2108C80J5j98K58j65j86L63K31l55K55k95L95q7J26p0J02l5k2K74o66j05P7K56
2130E48n6m30K03l8j31j03j46j16q1J47j31P0n3n26K14J51j58k18J25J02J2M00
2152b15n25N0L76L47Kl52L8J96J40L25j31J3l39L56j72O39l20l80O7L60J66P5
2174G16l1j08q5O7l6J25k86o5J03J50l97M9J57l48r3J29M00m38l45K22L4l64J23
$$ y = [-559, -32, 435, -332, -572, -761, -477, -189, -579, -646, -769, -845, -161, -415, -645, -928, -931, -569, -701, -396, -622, -1023, -474, -158, -38, -362, -548, -248, 506, 359, -24, 163, 229, 701, 617, 504, 590, 587, 516, 825, 821, 391, 513, 511, 590, 851, 626, 183, 342, 579, 788, 372, 15, -273, -109, 369, 259, -447, -219, -259, -11, -306, -437, -723, -588, -541, -589, -457, -652, -976, -745, -274, -436, -327, -886, -387, -373, -36, -112, -467, -384, -97, 249, 60, -136, -76, 380, 395, 197, 455, 290, 104, 467, 698, 343, 598, 303, 698, 611, 737, 667, 769, 734, 712, 986, 320, 215, 292, 548, 492, 62, 265, 227, 96, -7, -153, -269, -350, -203, -334, -264, -317, -843, -629, -478, -636, -854, -729, -627, -615, -215, -740, -690, -314, 33, 35, -317, -279, -83, 57, 382, 251, 264, -75, 281, 109, 748, 428, 48, 115, 475, 641, 716, 685, 577, 492, 559, 523, 648, 362, 297, 400, 550, 153, 202, 359, 11, -82, 47, 447, 9, -336, -114, -80, -444, -321]
2197c21l00K50q7l01K54n7J83k24o1J93N3j09J08k27J46N9JK39R3J56K3j32K51
2220A90k12J87R1J74J66m6L5j87k07N19l80L64N6k89J63j38j07q4K6Q2L56o39
2242A20l25P5K12R9j96m1j64J01l8Rj06k80j09j00J45L12l83k89L84J58k1N9J20
2265b58l05k81K15K23m3M94m9j32L31l13J53K25L2j55J31k68K7L00P02k82l40
2286D07p2K37J9r5J57k48j40M7M6k8o2r1r0j26J59p5j37k03k22k3L34j02l11K41
2310c78j88J87J15r4j61j88M12n06L95j71K21J44j13qP9J37j42M1L19j42J81m2
2332I8j2K14Q8n1K5J27l30K17J79L1n29K57J7P6K77k37N0j33k26L27j9j5k05k56
2356c0K78j35j73r0l20K33j7L22k98k79k0J90j54j58J90J94l00k11M64j69J18
$$ y = [-321, -621, -371, -458, -759, -505, -562, -379, -603, -664, -471, -418, -527, -419, -646, -500, -441, -440, -201, -108, 48, 71, -61, 190, -22, 165, 256, 430, 596, 550, 585, 398, 191, 710, 330, 694, 750, 461, 624, 486, 379, 295, 321, 403, 759, 120, -205, -130, 82, 181, -15, -56, -220, -119, -157, -148, -254, -534, -643, -743, -598, -286, -669, -958, -574, -416, -437, -378, -258, -563, -844, -629, -406, -449, 45, -4, -136, 195, -118, 35, 260, 292, 137, 268, 0, 27, 327, 1029, 747, 407, 335, 572, 591, 496, 653, 405, 265, 312, 358, 330, 268, 177, 87, -39, 120, 45, -92, -295, -517, -540, -206, -308, -619, -378, -566, -379, -264, -358, -519, -707, -295, -801, -406, -577, -356, -212, -325, -333, -254, -117, -259, -218, 101, -41, 140, 98, 86, 300, 388, 337, 362, 489, 159, 376, 555, 586, 57, 314, 331, 407, 684, 447, 497, 364, 138, 465, 446, 431, 226, -30, 248, 113, -60, -150, -470, -237, -254, 68, -230, -509, -529, -339, -493, -651, -461, -267, -567, -778, -314, -483, -365]
2377c65k3L17l12J8L10k60J51J32%Lj26K54K90j70j2J91J05J54k31k0K01j62J9
2400D64J08L54o87L17M1j77J36n2k90k14L7K62o3l00J16j11M5mk61K19j65j37
2422c62j90J88j34K00q2K7m71M28o2K28k33J7j57K27K05k0K77l75J84J62k1K61
2444B97j16J6J04j39L18l06J50k30L98J24j95o5l49M56q0K31k75l61L53J2k91
2465E2P1l2N0j10J79j88j60J96m91J08J61J2n55M70K0j5j64j32R3k4LN5P9k06
2489e28n4L12O2J32k89J72qk0P5L58j78k76N15k09J06J0o1K52J64j00k85NJ41
2512B96J9M06n00K57Q0m2Q2m62K03J68m20k55K78j32L5r6l8j0J09l83J10J34n37
2535f98J85K24k7k44N7j6m5J88K65j02k21k46P14j46R1k55K44Nj96K64L7k82J89
$$ y = [-365, -388, -71, -383, -365, -55, -315, -164, -32, -32, -29, -155, 99, 389, 219, 207, 398, 503, 657, 426, 406, 607, 445, 464, 572, 926, 239, 556, 597, 420, 556, 504, 214, 0, 37, 299, 236, -64, 52, -59, -14, -18, -279, -60, -225, -362, -552, -364, -498, -298, -380, -353, -824, -396, -458, -230, -463, -446, -603, -376, -171, -191, 86, -289, -105, 57, 36, 297, 181, 197, 301, 162, 480, 174, 324, 94, 492, 616, 421, 356, 7, 463, 383, 614, 339, -22, 331, 343, 52, 123, 91, 141, 31, 210, 22, -138, 58, -433, -325, -164, -152, -707, -237, -217, -232, -396, -528, -435, -459, -456, -401, -322, -528, -582, -270, -208, -76, -365, -193, -201, -221, -146, 212, 34, -242, 273, 64, 170, 180, 119, 371, 535, 435, 150, 155, 296, 315, 721, 221, 478, 558, 516, 598, 136, 339, 507, 87, -168, 110, -22, 13, -83, -121, -131, -22, -405, -295, -161, -698, -513, -289, -316, -560, -503, -519, -564, -376, -111, -213, -434, -680, 34, -112, -21, -276, -32, -27, -223, 41, 78, -204, -15]
2558a5M68j65j18N06j54j83q2l8M10j64mK36n41K72q9N1j31j0J07K5Qk25m6nn7
2583E6n4k43K0j31K97k2l7J95l48J13q2l17J16J05l8R8j44K55k39K9L3J99j80
2606c19J92MMJ64J04j9j18L6j73K82j30P57k42k5j33k23K03J05k75ML22p1m4q2
2630C23L5l49L21P5l27j79K03o2k88K44m08P6N1p3O0J42j05j38j42K74j72r1N3
2653d77J60j32K16l61K22n5J70J24l27J7K81L30l53J03n7P0R2J05j00K62q8J76
2675C78nk77K35k4K1J49k43J18l36K50K97q0m43r1K38NJ74m41r9j97J7J88q4n6
2699c06r2L11rk36L7n9l7L87j68l67J38J22j81J61j49K5J04J84j13J75L6L9j23
2722a21m1J64j72P4K46M8N3k37k0L87l3o9K35k16j52K07l33L10l7j51J91pJ59
$$ y = [-15, 453, 288, 170, 676, 522, 339, 257, 219, 629, 465, 461, 697, 156, 428, 339, 390, 259, 249, 356, 381, 389, 164, 118, 113, 56, 2, -241, -221, -352, -55, -77, -114, 81, -267, -154, -236, -553, -437, -332, -370, -272, -416, -161, -400, -371, -338, -139, -319, -127, -123, -119, 45, 149, 130, 12, 48, -125, 157, 27, 784, 542, 517, 384, 161, 364, 469, 194, 198, 520, 449, 405, 323, 358, 9, 330, 405, 78, -101, 102, 40, -248, -4, -412, -336, -285, -358, -298, -156, -261, -399, -541, -267, -439, -530, -477, -317, -449, -233, -594, -372, -427, -257, -133, -460, -443, -162, 168, -185, -82, -139, -69, 23, 128, 28, 290, 202, 378, 373, 96, 331, 307, 328, 477, 234, 352, 16, 266, 563, 483, 40, -51, 187, 192, 366, -75, -174, -371, -354, -166, -250, -306, -398, -87, -96, -332, -295, -354, -391, -4, -172, -539, -401, -279, -460, -299, -448, -423, -319, -135, -248, -73, -37, 2, -121, -162, 2, -170, -96, 150, 198, 251, 14, -6, 381, 348, 279, 514, 298, 146, 353, 20, 330, 293, 142, 333, 326, 485]
2745D85n97L01M9J48J9m58M1j94K90j36l00K13p3k7q7k39J19J28k28K41J27l90
2767e68J30P9J35J00j96Q0J14N13o23Q3K12N0k67L35k00L26l03K80L4P4o6K15
2789E37n0l41J29Q0K50k55L50o36L78m73M52J14k37k85j56K32k9j39J64J40n14
2810b89K12k15J79n57M06k1PK12k1n53M03P6J1q6j6k15L55n6N1j16J05j52J94
2833h6L4J31J3L06l02pJ90j6J60m86K95m5L0K29j8o2L04k26k32K50j66P4J2j67
2857B15j24J10j51J10J6k68J82k14r8J67m8J49R4n52J33k41L41j44k20J82J06
2878b55J97j60Q1q0p3l4J93J50q9l73N50k29K8o7L79m18K35q1K93j60K87l34M6
2901H6J28J69K18k64N6K28k86J49m51J66J32N8n85L46J12j12j68K8j14j25RJ90
$$ y = [485, -112, 189, 238, 386, 405, -53, -12, -206, 84, -52, -352, -139, -212, -239, -326, -565, -446, -318, -546, -305, -178, -568, -438, -359, -224, -124, -320, -240, -126, 387, -236, -153, 59, 109, -158, 177, -23, 303, 0, 280, 314, 388, 322, 537, 487, 146, 275, 355, 605, 350, 700, 64, 442, -31, 421, 535, 298, 13, -143, 89, 60, -79, 85, 225, -289, -77, -292, -113, -670, -264, -285, -278, -66, -87, -640, -237, -161, -150, -236, -252, -467, -112, -168, -117, -233, -128, -280, -86, -52, 79, 92, 398, 96, 89, 279, 263, 423, -63, 232, 187, 217, 446, 428, 366, 670, 444, 212, 462, 296, 370, 382, 215, 91, 201, 50, 160, 176, -92, 90, -124, -222, -55, -103, 46, 140, -412, -279, -520, -179, -323, -543, -361, -255, -58, -218, -137, -217, -290, -324, -131, 19, -70, -443, 107, -122, -94, -161, 218, -200, 35, -46, 247, 87, 374, 40, 86, 214, 383, 601, 337, 393, 621, 335, 484, 33, 199, 331, 389, -196, 150, 262, 150, -18, 10, -104, -229, -220, -30]
2923c0O1l71k4L04m14P7P6j23J61j7k2j99J60k4P4L2l16K10o0K70k4J03J10k09
2947a95L39J07n57J06N42l63M5K6M15k07J28l15J68M00j93k48o5K63j40j21K99
2968D34k64l0P9o3K85m96R6l72L72k60L05k22Q6L46l44l17M3L07k52J39j14k25
2990d67O2J75J46n1j26K71j95J10k23N41l94J35j01N0K96j13P4p1J28m0L24n74
3012d3K57L4K8j23L0R8J32q6J50q3k78jM78l03k63J07n1J36k70J37K13l57j48
3035b06j28M23j96o1j65O7Q3p7P2l44K51Q5k06J00p5K17l10O9J05L69l08K06J44
3058A15k17J32R0M1j31j42L62o0M3j72J08M0j48JM64n21K45R8l42K90l17N6J25
3081A60J28q1j49Q2k67J00L17l44m4N1j47Q7p6K97r7l01K01k22j50J92J87j59
$$ y = [-30, 31, -340, -364, -60, -474, -397, -321, -444, -283, -300, -322, -521, -361, -385, -311, -279, -595, -385, -445, -175, -199, -96, 14, -195, 144, 251, -306, -200, 342, -21, 24, 50, 465, 258, 386, 71, 239, 639, 446, 198, 133, 396, 256, 135, 434, 170, 140, 219, 156, 441, -55, 41, -331, 41, -219, 86, -136, -50, 296, -48, -365, -322, -15, -267, -128, -242, -467, -405, -230, -84, -135, -261, 10, -185, -75, -298, 243, -151, -16, -117, -67, 229, 116, 190, 119, 247, 207, 531, -43, 214, 248, 276, 153, 183, 281, 413, 327, 477, 394, 116, 115, 593, 290, 27, 134, 83, 219, -51, 86, 299, -58, -206, -334, 89, -107, -168, -333, -266, -183, -260, -188, -532, -281, -196, -402, -302, -377, -160, -470, -401, -296, 73, -235, -29, 115, -102, 30, 120, 161, 30, -112, 250, 190, 233, 61, 169, 209, 61, 62, 526, 5, 250, 348, 6, 296, -21, 35, 160, 288, 207, 58, 140, -127, -27, 290, -54, -98, -47, -194, -107, -183, 114, 17, -284, -83, -305, -455, -263, -76, -235]
3103b35j43P6K76l12J75p5K81j14j21q2M30k61j14J44J53L8j58m4L13J0P9j21
3125A95J58j0J76r2j81L32m26Mo4J46L29j91m17J41K69n32L33J28l19m43N57j5
3147G8k20M81l07j89J86k63mj2rLk7J8L25k04j62J57M9j62n6J15j73K37K15O4
3171A40k17K7K29o28P95j15K10l71J09N1L6q6j18J37J31l66J04M9L53p9J10m1
3193D60j48p3m24M03j60k69R7l9j61N52k11r1N6J74m97m5J5J82k00L77k02j31
3215c35nJ73l56L75o6J03j29J16J14l42N17k03o3J8P7K14pr1K0K73k94K63j33
3238B39L0J88l41L85k60p9J06k65K90k92L16j97m7K72J3k78J45q4n02K2K03KO5
3261f9p4M57k35n75L47o2J4L09m52N2J00Q0m7q3o5lJ86L61l00j57K10j82L68k55
$$ y = [-235, -378, -302, -26, -338, -163, -238, 43, -71, -192, -274, 156, -105, -219, -75, 78, 116, -42, -86, 227, 237, 316, 195, 353, 343, 519, 427, 246, 578, 152, 156, 92, 238, 567, 376, -41, 100, 369, -163, 170, 298, -21, -464, 93, 78, -142, 339, 32, -157, 29, -234, -238, -250, -259, -256, -283, -265, 60, -144, -306, -149, -100, -262, -318, -203, -376, -139, 76, 140, -77, -50, 179, -449, 346, 231, 441, 70, 179, 230, 266, 180, 62, 199, 330, -36, 68, 117, 470, 391, 501, 460, 312, 239, -185, 218, 58, -211, -114, -153, -314, 238, 27, -64, -8, 166, -331, -376, -361, -179, -379, -2, -204, -335, -340, -167, -523, -148, -214, -111, -240, -124, -10, -352, 165, -38, -101, -83, -6, 208, 201, 110, 130, 403, 109, 372, 239, 269, 457, 116, 501, 241, 162, 268, 3, 293, 1, 317, 120, 73, 345, 358, 80, 225, 141, -361, -339, -136, -134, -69, -143, 314, 79, -496, -149, -211, -197, 112, -340, -288, -188, -108, -155, -238, -303, -306, -120, 241, -59, -216, -6, -188, 180, -75]
3285g5j1j79L02J25J19j44N2j21K93nm54N33k80J65m15K78j00J58J63l39J61j5
3307B11j9j7n4k05L31m68O4l2J02m92M62J16o5o8j27j53N15m53L51n7k47MJ29
3330a72K01q7j59J21J33J63k14QJ65k52K75R5j67j13P7P3l29K49M5k58P6m8M51
3353C33l3k99M95j01m19K39m2k4k64M50p6j72n4J4P4m0p2k04K32j64o2l5m4K27
3377d1k56N47n45P0j26R5J92j86J00R5P8k26q6P2J83O1j55J1K21K04j97K47m13
3400e5p4L70j31K7l38M11k45J54N7Q1J03k08m3k52M49k83J94R1j76J83j31j44
3422D0l4K9L75l98N2R2k90K72m99R5K45jp0o8j86P1J89j67n4P8n8K31j55j1K47
3447B5P7J96l80j09k05Q88n05L4k8J10k01J26k94K54J98L3J96l56L37lm60M05
$$ y = [-75, -86, -265, 37, 162, 281, 137, 189, 68, 361, 356, -98, 435, 155, 320, -95, 183, 83, 241, 404, 65, 226, 211, 192, 175, 121, -84, 247, -221, -157, -189, -87, -579, -117, -1, -66, -134, -261, -414, 101, -352, -1, -58, -305, -301, -172, 29, -58, -217, -96, 37, 200, -14, -6, 159, -93, 182, 277, 110, -3, 74, 147, -182, 67, 112, -146, -70, -118, 333, 300, 1, 496, 395, -24, 215, 173, 149, -115, 335, 259, 87, 33, 47, 121, 81, 9, -195, 37, -127, -189, -224, -268, -41, -297, 250, -295, -225, -351, -256, -64, -250, -150, -55, 23, -203, -289, -217, -34, 27, -128, -117, 104, 308, 111, 358, -55, -129, 241, 110, 137, -201, 210, -35, 119, 176, 257, 360, 152, 109, -143, 306, 23, 217, 308, 132, 315, 184, 40, 6, 35, 410, 12, 64, 156, -134, 138, -361, -266, -21, -22, -92, -160, -346, -275, -86, -253, -307, -229, -287, -56, -211, -222, 25, 102, 298, -82, -191, -396, 492, -13, 21, -7, 103, -98, 28, -266, -12, 186, 219, 415, 59, 396, 393, -67, 338]
3469C38j88L52l55J30n9k00j59L52L34m28J5K9k92L32m21r0L00K14j35j51P0j32
3491a44j93J48N78p13J15O8K09n14M32l08K34j22K30M12m63r3l5m0K99J62r9k74
3513a11K82K05k7r8oml8J8l19K84j17J4K15r5J08K79o29J43o0J58k38J36l5r6
3537c1k6p3j78R7j44M99k61p1P9K24l55K85o8j91M8j06K94j71pl4J50j40J65j07
3561a22m9j69K25L92j39j01l81K28J99l66M89P8k20J9O6l75K50m1J38K55j23k57
3583dl33K50K37j81Pq5Q7j3K04m35J36K10l9Rj63LP0O8r9oq3P3q5J36j23J91L9
$$ y = [338, 150, 502, 147, 277, 218, 18, -141, 211, 545, 117, 132, 161, -131, 201, -220, -310, -10, 204, 69, -82, -12, -144, -337, -189, 389, -324, -209, -141, 68, -446, -14, -322, -88, -210, 20, 432, -31, -124, -159, -199, 100, 262, 163, -111, 171, 376, 349, 251, 245, 241, 203, 221, -98, 186, 69, 83, 298, 203, 311, 590, -39, 104, 44, 202, -36, 100, 65, -31, -57, -130, -308, -211, -355, 144, -117, -188, -109, 115, -240, 45, -23, -214, -166, -272, 22, -149, -156, -190, -40, -180, -15, -122, -171, -340, -115, 277, 138, 37, -344, -116, 83, -283, 206, 284, 64, 83, 149, -226, 24, -17, 121, 376, 253, -4, -337, -87, 150, -31, -24, -109, -22, -35, 169, -266, -130, 80, 41, 50, -113, -110, -40, 28, -71, -77, -160, -87, -172, -36, -159, 32, 71]
$$ [...]
8191A49
##END NTUPLES=NMR FID
##END=
