##TITLE=1H_Pr 3185-2
 200.13MHz, CDCl3,
 24 sc
 
 14.1.2025
##JCAMPDX= 6.0         $$ Bruker NMR JCAMP-DX V2.0
##DATA TYPE= NMR FID
##DATA CLASS= NTUPLES
##ORIGIN= UXNMR, Bruker Analytische Messtechnik GmbH
##OWNER= pz
$$ XWIN-NMR		Version 3.5
$$ Tue Jan 14 16:16:43 2025 Russian Standard Time (UT+4h)  she@DPX200
##.OBSERVE FREQUENCY= 200.1311
##.OBSERVE NUCLEUS= ^1H
##.DELAY= (6, 6)
##.ACQUISITION MODE= SIMULTANEOUS
##.ACQUISITION SCHEME= undefined
##.AVERAGES= 8
##.DIGITISER RES= 18
##SPECTROMETER/DATA SYSTEM= spect
##.PULSE SEQUENCE= zg30
##.SOLVENT NAME= CDCl3
##.SHIFT REFERENCE= (INTERNAL, CDCl3, 0, 14.3821)
##AUDIT TRAIL= $$ (NUMBER, WHEN, WHO, WHERE, WHAT)
$$ ##TITLE= Audit trail, XWIN-NMR		Version 3.5
$$ ##JCAMPDX= 5.01
$$ ##ORIGIN= Bruker BioSpin GmbH
$$ ##OWNER= she
$$ F:/spectra/data/she/nmr/H-C/1/audita.txt
$$ ##AUDIT TRAIL=  $$ (NUMBER, WHEN, WHO, WHERE, WHAT)
(   1,<2025-01-14 16:15:23.39 +0400>,<she>,<DPX200>,
      <created by zg, POWCHK disabled, PULCHK disabled
       configuration hash MD5:
       00 E9 B6 7A A2 85 ED C7 34 08 36 98 17 FE 4E 26
       data hash MD5: 16K
       34 1D 12 7A 8F 93 36 A5 BF D2 21 74 C4 8E 82 2C>)
$$ ##END=
$$ 
$$ hash MD5
$$ 03 20 36 C8 80 B0 55 58 A0 48 15 98 B8 91 FE E3
##$RELAX= 
##$RELAX= 
##$RELAX= 
##$RELAX= 
##$RELAX= 
##$RELAX= 
$$ Bruker specific parameters
$$ --------------------------
##$DU= <F:/spectra>
##$EXPNO= 1
##$NAME= <H-C>
##$PROCNO= 1
##$TYPE= <nmr>
##$USER= <she>
##$AMP= (0..31)
100 100 100 100 100 100 100 100 100 100 100 100 100 100 100 100 100 100 
100 100 100 100 100 100 100 100 100 100 100 100 100 100 
##$AQSEQ= 0
##$AQ_mod= 1
##$AUNM= <au_zg>
##$AUTOPOS= <>
##$BF1= 200.13
##$BF2= 200.13
##$BF3= 200.13
##$BF4= 200.13
##$BF5= 200.13
##$BF6= 200.13
##$BF7= 200.13
##$BF8= 200.13
##$BYTORDA= 1
##$CFDGTYP= 0
##$CFRGTYP= 5
##$CHEMSTR= <none>
##$CNST= (0..31)
1 1 145 1 1 1 1 1 1 1 1 1 1 1 1 1 1 1 1 1 1 1 1 1 1 1 1 1 1 1 1 1 
##$CPDPRG= <>
##$CPDPRG1= <>
##$CPDPRG2= <>
##$CPDPRG3= <>
##$CPDPRG4= <mlev>
##$CPDPRG5= <mlev>
##$CPDPRG6= <mlev>
##$CPDPRG7= <mlev>
##$CPDPRG8= <mlev>
##$CPDPRGB= <>
##$CPDPRGT= <>
##$D= (0..31)
0 0.7 0 0 0 0 0 0 0 0 0 0.03 0 0 0 0 0 0 0 0 0 0 0 0 0 0 0 0 0 0 0 0 
##$DATE= 1736856922
##$DBL= (0..7)
120 120 120 120 120 120 120 120 
##$DBP= (0..7)
150 150 150 150 150 150 150 150 
##$DBP07= 0
##$DBPNAM0= <>
##$DBPNAM1= <>
##$DBPNAM2= <>
##$DBPNAM3= <>
##$DBPNAM4= <>
##$DBPNAM5= <>
##$DBPNAM6= <>
##$DBPNAM7= <>
##$DBPOAL= (0..7)
0.5 0.5 0.5 0.5 0.5 0.5 0.5 0.5 
##$DBPOFFS= (0..7)
0 0 0 0 0 0 0 0 
##$DE= 6
##$DECBNUC= <off>
##$DECIM= 32
##$DECNUC= <off>
##$DECSTAT= 4
##$DIGMOD= 1
##$DIGTYP= 9
##$DL= (0..7)
0 120 120 120 120 120 120 120 
##$DP= (0..7)
150 150 150 150 150 150 150 150 
##$DP07= 0
##$DPNAME0= <>
##$DPNAME1= <>
##$DPNAME2= <>
##$DPNAME3= <>
##$DPNAME4= <>
##$DPNAME5= <>
##$DPNAME6= <>
##$DPNAME7= <>
##$DPOAL= (0..7)
0.5 0.5 0.5 0.5 0.5 0.5 0.5 0.5 
##$DPOFFS= (0..7)
0 0 0 0 0 0 0 0 
##$DQDMODE= 0
##$DR= 18
##$DS= 0
##$DSLIST= <SSSSSSSSSSSSSSS>
$$ [...]
##$SUBNAM0= <"">
##$SUBNAM1= <"">
##$SUBNAM2= <"">
##$SUBNAM3= <"">
##$SUBNAM4= <"">
##$SUBNAM5= <"">
##$SUBNAM6= <"">
##$SUBNAM7= <"">
##$SUBNAM8= <"">
##$SUBNAM9= <"">
##$SW= 18.051750892319
##$SWIBOX= (0..15)
0 0 2 0 0 0 0 0 0 0 0 0 0 0 0 0 
##$SW_h= 3612.71676300578
##$TD= 16384
##$TD0= 1
##$TE= 0
##$TE2= 300
##$TE3= 300
##$TEG= 300
##$TL= (0..7)
0 120 120 120 120 120 120 120 
##$TP= (0..7)
150 150 150 150 150 150 150 150 
##$TP07= 0
##$TPNAME0= <>
##$TPNAME1= <>
##$TPNAME2= <>
##$TPNAME3= <>
##$TPNAME4= <>
##$TPNAME5= <>
##$TPNAME6= <>
##$TPNAME7= <>
##$TPOAL= (0..7)
0.5 0.5 0.5 0.5 0.5 0.5 0.5 0.5 
##$TPOFFS= (0..7)
0 0 0 0 0 0 0 0 
##$TUNHIN= 0
##$TUNHOUT= 0
##$TUNXOUT= 0
##$USERA1= <user>
##$USERA2= <user>
##$USERA3= <user>
##$USERA4= <user>
##$USERA5= <user>
##$V9= 5
##$VALIST= <valist>
##$VCLIST= <CCCCCCCCCCCCCCC>
##$VD= 0
##$VDLIST= <DDDDDDDDDDDDDDD>
##$VPLIST= <PPPPPPPPPPPPPPP>
##$VTLIST= <TTTTTTTTTTTTTTT>
##$WBST= 1024
##$WBSW= 4
##$XGAIN= (0..3)
0 0 0 0 
##$XL= 0
##$YL= 0
##$YMAX_a= 177220
##$YMIN_a= -241994
##$ZGOPTNS= <>
##$ZL1= 120
##$ZL2= 120
##$ZL3= 120
##$ZL4= 120
##$ABSF1= 10
##$ABSF2= 0
##$ABSG= 5
##$ABSL= 3
##$ALPHA= 0
##$AQORDER= 0
##$ASSFAC= 0
##$ASSFACI= 0
##$ASSFACX= 0
##$ASSWID= 0
##$AUNMP= <proc_1d>
##$AZFE= 0.1
##$AZFW= 0.1
##$BCFW= 1
##$BC_mod= 2
##$BYTORDP= 1
##$COROFFS= 0
##$CY= -3
##$DATMOD= 1
##$DC= 2
##$DFILT= <>
##$DTYPP= 0
##$F1P= 0
##$F2P= 0
##$FCOR= 0.5
##$FTSIZE= 0
##$FT_mod= 4
##$GAMMA= 1
##$GB= 0.15
##$INTBC= 1
##$INTSCL= 1
##$ISEN= 128
##$LB= 0.25
##$LEV0= 0
##$LPBIN= 0
##$MAXI= 10000
##$MC2= 0
##$MEAN= 0
##$ME_mod= 0
##$MI= 1.114404
##$NCOEF= 0
##$NC_proc= 0
##$NLEV= 6
##$NOISF1= 3.799351
##$NOISF2= 2.8
##$NSP= 1
##$NTH_PI= 0
##$NZP= 0
##$OFFSET= 14.38212
##$PC= 1
##$PHC0= 249.7284
##$PHC1= 10.19222
##$PH_mod= 1
##$PKNL= yes
##$PPARMOD= 0
##$PSCAL= 0
##$PSIGN= 0
##$REVERSE= no
##$SF= 200.129724274929
##$SI= 16384
##$SIGF1= 3
##$SIGF2= 2
##$SINO= 400
##$SIOLD= 16384
##$SREGLST= <1H.CDCl3>
##$SSB= 0
##$STSI= 0
##$STSR= 0
##$SW_p= 3205.1282051282
##$SYMM= 0
##$S_DEV= 0
##$TDeff= 0
##$TDoff= 0
##$TI= <>
##$TILT= no
##$TM1= 0
##$TM2= 0
##$TOPLEV= 0
##$USERP1= <user>
##$USERP2= <user>
##$USERP3= <user>
##$USERP4= <user>
##$USERP5= <user>
##$WDW= 1
##$XDIM= 8192
##$YMAX_p= 0
##$YMIN_p= 0
$$ End of Bruker specific parameters
$$ ---------------------------------
##NTUPLES= NMR FID
##VAR_NAME=  TIME,          FID/REAL,        FID/IMAG
##SYMBOL=    X,             R,               I
##VAR_TYPE=  INDEPENDENT,   DEPENDENT,       DEPENDENT
##VAR_FORM=  AFFN,          ASDF,            ASDF
##VAR_DIM=   8192,          8192,            8192
##UNITS=     SECONDS,       ARBITRARY UNITS, ARBITRARY UNITS
##FACTOR=    0.0002768,     1,               1
##FIRST=     0,             0,               0
##LAST=      2.2672688,     0,               0
##MIN=       0,             -241994,         0
##MAX=       2.2672688,     177220,          0
$$ Real data points
##PAGE= N=1
##DATA TABLE= (X++(R..R)), XYDATA
$$ [...]
2162H00j507J000J387j759m87J294q43j663J796M48j031J271Q49j820n35J533
$$ 800 -707 293 1680 -79 -566 728 -115 -1778 18 466 -565 706 1555 -265 -800 733
2178G33j085j048J979k0j104J216Q23k054P7Q19j143j06J780j69j277J703q7j856
$$ 733 -352 -1400 579 559 -545 671 1494 -560 -483 336 -807 -913 867 698 -579 1124 1037 -819
2196h19L91J100j428k76K107l28j364J505j16j779O75O83j375Q5J972p53n63J330
$$ -819 -428 672 -756 -1032 1075 747 -617 888 772 -1007 -332 351 -1024 -939 1033 280 -283 1047
2214A047n36j563P45L30j049O68J647r64l16J283r78j699J252J67j364J242J128
$$ 1047 511 -1052 -307 23 -1026 -358 1289 325 9 1292 314 -1385 -133 34 -1330 -88 1040
2231A040r83k00J585j558j229J081o2j156J808P66j417M93J266j565r93J413q77
$$ 1040 57 -143 1442 -116 -1345 -264 -326 -1482 326 1092 -325 168 1434 -131 -1124 289 -588
2248e88r46J865P84j350P44Q24j829p47J451j251n52K293K82j111J006K69k128
$$ -588 -1534 331 1115 -235 509 1333 -496 -1243 208 -1043 -1595 698 980 -131 875 1144 -984
2265i84L22J032r50p09J865K82r73R00M39k006n6J177j339j4J849M4j143J379
$$ -984 -662 370 -580 -1289 576 858 -115 785 1224 -782 -838 339 -1000 -1014 835 879 -264 1115
2283A115j49j880K31P03j151L62J764n07q08J693m56k027P23O49j635O40J759
$$ 1115 966 -914 -683 20 -1131 -769 995 488 -320 1373 917 -1110 -387 262 -1373 -733 1026
2300A026q04J07R65p15j952J414K04j693J185J289o36k15J293j440j189J300J08
$$ 1026 222 329 1294 579 -1373 41 245 -1448 -263 1026 390 175 1468 28 -1161 139 247
2317B47j663J192J016j189L33J182j141j332J527j47j280J381O78j292N17J257
$$ 247 -1416 -224 792 -397 -64 1118 -23 -1355 172 25 -1255 126 804 -488 29 1286
2333A286j593m84J220n81j053J699M81j414P40Q81j514n52J356q24o70J704P4
$$ 1286 -307 -791 429 -152 -1205 494 975 -439 301 1182 -332 -884 472 -352 -1022 682 756
2350G56j220O22O31j925L39J217q56Q6J494m40j372J140j4j537O03J525j102k81
$$ 756 -464 158 789 -1136 -797 420 -436 -350 1144 704 -668 472 458 -1079 -476 1049 -53 -334
2368c34J209n57j073R27j46j183Q80J171j202j58J484q97p90Q79P8j425J109Q01
$$ -334 875 318 -755 172 26 -1157 -277 894 -308 -466 1018 121 -669 210 288 -1137 -28 773
2386G73j313N68R73j037q13J327l49j385J493N13j198R92O15j375n43J157p96
$$ 773 -540 28 1001 -36 -849 478 129 -1256 237 750 -448 544 1159 -216 -759 398 -398
2403c98n47J553J81j136P25O67j627j82J063q74k02J522k1j017R80J35j831L59
$$ -398 -945 608 789 -347 378 1045 -582 -764 299 -575 -777 745 724 -293 687 822 -1009 -650
2421f50J003j063%J737m72p01Q64m75j576R10J041j023PJ662r58p69J153n24j298
$$ -650 353 -710 -710 1027 555 -146 718 243 -1333 -423 618 -405 -398 1264 306 -463 690 166 -1132
2440a132J140M24j004K95J368j151l79J160m74j361J080K47r08P58J177j239k46
$$ -1132 8 432 -572 -277 1091 -60 -439 721 247 -1114 -34 213 -695 63 1240 1 -245
2457b45R20q64j271J287M96j018J276Q27j661j05P27r76p88J579K02j010J199
$$ -245 675 -189 -1460 -173 323 -695 581 1408 -253 -358 369 -607 -1395 184 386 -624 575
2474E75O85j450l02Q70j265j52J660j68o29J149R0j728P45K12q80j81J704m71
$$ 575 1260 -190 -492 378 -887 -1039 621 453 -176 973 1063 -665 80 292 -588 -769 935 464
2492D64o74J248l65j427N14K43r19L98J290o25j00J020q64r54L57J93j067J017
$$ 464 -210 1038 673 -754 -240 3 -916 -518 772 147 47 1067 203 -751 -394 -201 -1268 -251
2510b51J183n10m76J139q42j240R81k69p78R61J066p88J67N78p64j565J193J54
$$ -251 932 422 -54 1085 243 -997 -16 -285 -1063 -102 964 176 343 921 157 -1408 -215 -61
2528f1q19J024Q60j236L18Q16j277o19J020k40q02J123R10j155M69P66k043J2
$$ -61 -880 144 1004 -232 86 902 -375 -994 26 -214 -1016 107 1017 -138 331 1097 -946 -934
2546i34J071n39k22J139K72j146N86L50j297kJ262q11l49J560j85q79M82J29j362
$$ -934 137 -402 -624 515 787 -359 227 577 -720 -722 540 -271 -620 940 755 -124 358 487 -875
2565h75J43J296j041o3J431n68m77O21k71j076L23Q05r20N85J121r32o03Q30M4
$$ -875 -732 564 -477 -540 891 323 -154 467 196 -880 -557 248 -672 -87 1034 102 -501 329 373
2584C73j302N73R33j238O83J108p75p08Q20m95j005J264K12r65O84J144j460j64
$$ 373 -929 -356 577 -661 22 1130 355 -353 467 -28 -1033 231 443 -522 162 1306 -154 -318
2602c18Q40m73p68J014r5p99P73N81j133j70R25n98m41J186J34j118P07O81j459
$$ -318 522 49 -719 295 200 -599 174 755 -378 -548 377 -221 -662 524 658 -460 247 928 -531
2621e31K46Q44q28k72J394l02j299J088j72j022P13P02r34J75Q29q59k88R97n9
$$ -531 -285 559 -269 -541 853 551 -748 340 168 -854 -141 561 -373 -198 631 -228 -516 481 422
2640D22j042P48N98j187K32R25q31m16R63k56j002O85N27o11K03O52p21m33Q72
$$ 422 -620 128 726 -461 -229 696 -135 -551 412 156 -846 -161 366 -245 -42 610 -111 -544 328
2659C28k82j096J106M30p55L93R14j183l47Q50j045q5J116j09p58R90N96j382
$$ 328 46 -1050 56 486 -269 124 1038 -145 -492 358 -687 -772 344 235 -523 467 1063 -319
2677c19j73P30r19j79J219Q9q59J062K8j102K12O82j235L37J082p43q2P25P0j274
$$ -319 -492 238 -681 -860 359 448 -411 651 679 -423 -211 471 -764 -427 655 -88 -170 555 625 -649
2697f49N53L02j036M19R31l08k78Q50l71r89N35J05r03P75Q26p01J01J016r19
$$ -649 -96 206 -830 -411 520 212 -66 784 413 -576 -41 64 -839 -64 762 61 162 1178 259
2716B59j205O88K65r15Q41Q33p04O1R57r70q86Q74q2p97R16M14o80M91K74o39
$$ 259 -946 -258 7 -908 -67 766 62 123 1080 110 -776 98 16 -781 135 549 -131 360 634 -5
2736er77J066n03l79R43J51o08M03P35j134j91N89p48l83J567Q3p12P48J61j273
$$ -5 -982 84 -419 -798 145 296 -312 91 826 -308 -499 90 -658 -1041 526 609 -103 645 806 -467
2756d67l5O39p85j11J301K75q36O17o8j429K60P65m15k29J151J47p60O92k38j238
$$ -467 -502 137 -648 -759 542 817 -19 598 530 -899 -639 126 -289 -518 633 780 20 712 474 -764
2776g64K69N10l34N2Q64l17m05Q26l35j155M68K49q04O97R27o69j68R78o39r15
$$ -764 -495 15 -319 -267 597 280 -125 701 366 -789 -321 -72 -876 -179 748 79 -89 889 250 -665
2796f65N75L3m65N67P71p43K2P76j057m17M47K75r48J093O47j156M2Q09p22p81
$$ -665 -90 -57 -522 45 816 73 95 871 -186 -603 -156 119 -829 264 911 -245 -203 606 -116 -897
2816h97J140j97m89Q91M90j045J65J38l67p24J121j19p16J025K59r56J45O97r98
$$ -897 243 46 -443 448 938 -107 58 196 -171 -895 226 107 -609 416 675 -281 -136 561 -437
2835d37N7P08j35p41J320l11j003O90J88q91J60O97m46j97J077l90n49N72n0r63
$$ -437 -380 328 193 -548 772 461 -542 148 336 -555 -395 302 -144 -341 736 346 -203 369 319 -644
2855f44K84Q98p48Q6J018p52n59Q45j03p68K24O69m99k16R47n81m15M60j0r74
$$ -644 -360 538 -210 -124 894 142 -417 428 325 -443 -219 450 -49 -265 682 101 -314 146 136 -838
2875h38R21M48q32L05P00j010j79Q19l74o52J032J95j027N43O55r26j35P30m14
$$ -838 83 531 -301 4 704 -306 -485 334 -40 -692 340 535 -492 51 706 -220 -355 375 -39
2894c9n98J114k66o08M06L69p44J4R44r64m28J337m50l55K49M24j209L69P79o08
$$ -39 -637 477 211 -397 9 378 -366 -352 592 -372 -800 537 87 -268 -19 405 -804 -435 344 -264
2914b64j62Q70k89n38P90k36q42K30R35p39N9N89n59k91R04k18j056P06O96q75
$$ -264 -426 444 155 -383 407 171 -671 -441 494 -245 -186 403 -156 -447 457 239 -817 -111 585 -290
2934b90O0Q59p05o18Q15j87p02Q98J87p00M46P90o64l83O19o42l04Q21n1p61M80
$$ -290 -230 629 -76 -694 121 -66 -768 130 317 -383 63 853 189 -194 425 -217 -521 300 249 -512 -32
2955c2P26r61j5N39n42m58J285l01l46L86J2p50K80L95p11l8R60r5n55O27J24
$$ -32 694 -267 -282 257 -285 -743 542 241 -105 281 293 -457 -177 218 -493 -531 429 334 -221 406 530
2976E30q93L10J14l66j99J181n86n39Q16k98o81L15N91q11J50R61n96j20J026
$$ 530 -363 -53 61 -305 -504 677 91 -448 368 70 -611 -296 295 -516 -366 595 -1 -121 905
2995I05l57j329M48L10o83N33Q82n77j28L87k55p84O11L70r81N78N63n54l6N14
$$ 905 548 -781 -333 -23 -706 -173 709 132 4 391 136 -648 -37 333 -648 -70 493 -61 -97 417
3015D17p95n06Q45L6p33P33M18m93Q7L51p18k37P49k73n80R09L70m98P0L08r78
$$ 417 -378 -884 -39 -3 -736 -3 415 -78 9 360 -358 -595 154 -119 -699 210 580 82 152 460 -518
3036e18k5N38k55j4P87l5n95J14P7n69L36L11l79k97R83m12l92K11M25p41J93
$$ -518 -543 -5 -260 -274 513 478 -117 -3 74 -495 -159 152 -227 -524 459 47 -345 -134 291 -450 -257
3057b57M45o99K87P80k72n91N19J38q55L02L97p68M03Q78l30k60L40o30n52O15
$$ -257 188 -511 -224 556 284 -307 212 350 -505 -203 194 -574 -171 707 377 117 457 -173 -725 -110
3077a10L19r81R85O37r44j93O16m81n93P27Om12M53Q72j090O4K68m45k44O14J86
$$ -110 209 -772 213 850 -94 -287 329 -152 -745 -18 -12 -424 29 901 -189 -125 143 -302 -546 68 254
3098B54o71M60O37q91QN90o18l6N71l40m70P99j03p69K40R42r47K9N71k83l62
$$ 254 -417 43 680 -211 -203 387 -231 -267 304 -36 -506 293 190 -579 -339 603 -344 -315 256 -27 -389
3119c89P08J07r33N49M58o66k7N31k19l59O78m16m96N16J06k60j63P66o12m00
$$ -389 319 426 -507 42 500 -166 -193 338 119 -240 438 22 -474 42 148 -112 -275 491 -121 -521
3139e21J033n31o15N56M94q14L24L38m46m9L58k62k48O88K96r49L58O02r17N6
$$ -521 512 -19 -634 -78 416 -398 -74 264 -182 -231 127 -135 -383 305 601 -348 10 612 -305 -249
3159b49P21r59m4R22k58l72O20o8p74K63N19o75J17R00m20m19M12J94p76Q6M53
$$ -249 472 -487 -531 391 133 -239 381 313 -461 -198 321 -354 -237 663 243 -176 236 430 -346 -260 193
3180A93o09L92O60n38l27N59j70q74P26K22n73j15J188m60l55M65q6q61O17J01
$$ 193 -416 -24 636 98 -229 330 160 -714 12 234 -339 -454 734 274 -81 384 298 -563 54 155
3200A55o85M14O37o37K10P04q93o17O95K06o14L43J115r94L6L85p11j23K35J81
$$ 155 -530 -116 521 -116 94 798 -95 -712 -17 189 -425 -82 1033 39 75 460 -251 -374 -139 42
3220D2n47O70N62p20NK03n65M7L67k43J3N55L14r31K54M73n20o63P79q6m05R60
$$ 42 -505 165 727 7 12 215 -350 -303 64 -179 -166 389 703 -228 26 499 -21 -684 95 9 -396 564
3242E64k38n34L64J55j051K23P59l66j04O53j7o24M79P7q89J54N96m14K5Q31l93
$$ 564 326 -208 156 311 -740 -517 242 -124 -228 425 408 -216 263 340 -549 -395 201 -213 -188 643 250
3263B50o90P00P1q21J60N28p16K84Q14n32j91K01j61o42O91M45o41J90L73l83
$$ 250 -440 260 331 -490 -330 198 -518 -234 580 48 -143 58 -103 -745 -54 391 -250 -60 313 -70
3283g0q5M75j22r02N31M48n17M42O1l51Q0K13q3p03P88O9p41P61K32n17J1N46
$$ -70 -155 320 198 -704 -173 275 -242 200 261 -90 -10 203 120 -583 205 274 -467 294 526 9 20 566
3305E66m14o66P08q7n24O14K67q16L93J16m28j81N89l41J7O68k23o20L46K85m96
$$ 566 152 -514 194 107 -417 197 464 -352 41 157 -271 -452 137 -204 -187 481 258 -362 -16 269 -227
3326b27j05P75m49k95O35m8m12J80J49m96j1O24l19m91Q53l98l54P67k12o47J30
$$ -227 -332 443 -6 -301 334 286 -126 54 203 -293 -304 320 1 -490 363 -35 -389 378 166 -481 -351
3347c51O73p49K04R82o15m10N77j56p59O56J63l97J06M30k79k6Q1P2o87L32L79
$$ -351 322 -427 -223 759 144 -266 311 155 -604 52 215 -182 -76 354 75 49 130 202 -485 -153 226
3368B26o90M01L40o40o4M83J60l96L97j59j16p7P10p30j16Q80n88n16N60j5m76
$$ 226 -464 -63 277 -363 -427 56 216 -180 217 58 -58 -135 575 -155 -271 609 21 -495 65 50 -426
3389d26L83O71o75p5L41j17n25O47j83n62P70J57o23R4M77o83r5R98p18j63P33
$$ -426 -43 628 -47 -122 219 102 -423 224 41 -521 249 406 -217 -123 354 -329 -424 574 -144 -307 426
3410D26j16p72N64L53n94K43k6k84N8M76k60o35O84L53n27m1Q74j034K76K52m90
$$ 426 310 -462 102 455 -139 104 78 -206 -148 328 68 -567 117 470 -57 -98 776 -258 18 270 -220
3431b20m8L92L39o74K76K99o15k3N78k04k62L28J33m44J69K72n73O1L74l98L4
$$ -220 -268 124 463 -211 65 364 -251 -274 304 100 -162 166 299 -145 24 296 -277 -216 158 -240 -206
3452b06M44Pm28M74j57m85J91L51k18j66O21l23l13M20M7q94L91K61l59R5N92
$$ -206 238 245 -183 291 134 -351 -160 191 -27 -193 428 105 -208 212 259 -635 -244 17 -342 -247 345
3473C45q1n12O94m01o63L42L93n65L64N64o56P5M38j97n60K84J09l78M63L40l39
$$ 345 264 -248 446 45 -618 -276 117 -448 -84 480 -176 -101 337 140 -420 -136 -27 -405 58 398 59
3494E9J71K14l89l89N94l4p23N26M89p38K47M24o99k20O74m31k93O21M00n96R9
$$ 59 230 444 55 -334 260 226 -497 29 518 -220 27 451 -248 -468 206 -225 -518 103 503 -93 6
3515FN38j004M8O67o26j05N79M67o44J64o0j78k79L98J84m91N90j06l47J93L94
$$ 6 544 -460 -412 255 -371 -476 103 570 -74 90 30 -148 -427 -29 155 -336 254 148 -199 -6 388
3536C88n63j30N33k04n43J005k86n22M90m03j65j32P72l44j1N97j40n91O03k79
$$ 388 -175 -305 228 24 -519 486 200 -322 168 -235 -400 -532 240 -104 -115 482 342 -249 354 75
3556G5p03O58O3j15k45R14n87k57L87l11j70J97J75k70L37K01p18K59N14n47l01
$$ 75 -628 30 93 -22 -267 647 60 -197 190 -121 -291 -94 81 -189 148 349 -369 -110 404 -143 -444
3577d44L15K66m88L96K17k97o5L72m12q4N91k93j78J54K82m01r5L18m49NN51l27
$$ -444 -129 137 -351 45 262 -35 -100 272 -140 -224 367 74 -104 50 332 -69 -164 154 -295 -290 261 -66
3599f6j73M08O2j77j89N75n53J74J85k95l8K17J59n66J30J27m13M15K50j66j25
$$ -66 -239 169 231 54 -135 440 -113 61 246 -49 -87 130 289 -277 -147 -20 -433 -18 232 66 -59
3620e9K90j31n68N07L07q30L50K18J74n38N16l65k03L46J05n60L98J24O2k85M16
$$ -59 231 100 -468 39 346 -484 -134 84 258 -280 236 -129 -332 14 119 -441 -43 81 143 -142 274
3641B74n68j28Q11l23k97K19K55m01J85L60m51j59O47l88l23M01L46q77L38M62
$$ 274 -294 -422 389 66 -231 -12 243 -158 27 387 -64 -223 424 36 -287 114 460 -417 -79 383
3661C83n65k35O92j27k83M63J12q60O97j17o34N19L53j55k08J98n1m98M23l73
$$ 383 -182 -417 275 148 -135 328 440 -420 277 160 -474 45 398 243 35 233 182 -316 107 -266
3681b66k40P14K11j51l84N59j49n63K76k37k28M21K27m9k4J73k49n78M44L6pJ98
$$ -266 -506 208 419 268 -116 443 294 -269 7 -230 -458 -37 190 141 117 290 41 -537 -93 -57 -64 134
3703A34Q9k23L19l88n0k17N92k73j83M10j50j66N42m11k54pL51j89k35N97Jj81
$$ 134 223 0 319 -69 -119 -336 256 -17 -200 210 60 -106 436 25 -229 -236 115 -74 -309 288 289 108
3725A08k56N01m66k44L71j45J18J39J4l30K96J56n18J31L89l14j31M61n9l76K66
$$ 108 -148 353 -113 -357 14 -131 -13 126 140 -190 106 262 -256 -125 264 -50 -181 280 221 -155 111
3746A11J06o68K02M46m24O3O48q9l64J60J7l87L6L82m62J93L06j54j70J01J82
$$ 111 217 -451 -249 197 -227 -164 484 395 31 191 208 -179 -143 239 -223 -30 276 122 -48 53 235
3767B35l47L99j7l45J94k8m73L84L34l96j27K22j45M6P5K96n63O6L52o87K29O26
$$ 235 -112 287 270 -75 119 91 -382 2 336 -60 -187 35 -110 -64 11 307 -256 -190 162 -525 -296 330
3789C30m09p5M00M6j87k22L55l84J05J20k91P8N41k53m53K25J59m21K76L58k09
$$ 330 -79 -154 246 292 105 -117 238 -146 -41 79 -212 -134 407 154 -299 -74 85 -336 -60 298 89
3810H9l09K95K5m37N7L13n59O89J37k62K2q7j10J19P6K66o23K31O4j08K09j18
$$ 89 -220 75 100 -337 -280 33 -526 163 300 38 60 -27 -137 -18 58 324 -299 -68 -4 -112 97 -21
3832b1k19m1J78J79j81K50J61m43l6L80q5k38j2J42l67O83k07l42J45M5N6j26
$$ -21 -240 -281 -103 76 -105 145 306 -137 -173 207 122 -116 -128 14 -353 330 123 -219 -74 -29 27 -99
3854i9K48J24l40r0M6J84l5M12m79r5M72l58j8R2J37o70L23L49k61K03J68o29
$$ -99 149 273 -67 -157 -111 73 38 450 -29 -124 348 -10 -28 64 201 -469 -146 203 -58 145 313 -316
3876c16K17J67r3l00J34L92m9k4M44r91J45M75l72N3J71l1k66M31K8j76l07N35
$$ -316 -99 68 -25 -325 -191 201 152 128 572 -419 -274 201 -171 -118 53 22 -244 187 215 39 -268 267
3898B67m13k03M04P7j67M03j06k62j8J71j90R3K26n26K00L56j42k56n4J72k40
$$ 267 -146 -349 55 132 -35 368 262 0 -18 153 -37 56 282 -244 -44 312 170 -86 -140 32 -208
3919b08J41M17k10m06O06k77j77K17j34k61l5N12j16k8M00k67o52O42l42L8KM16
$$ -208 -67 350 140 -266 340 63 -114 103 -31 -292 -327 185 69 41 441 174 -478 164 -178 -140 -138 278
3941B78k82j04M68l69p9J49L2m90P14M5l89J10K83j36m90O8K62m10M80J60l53
$$ 278 -4 -108 360 -9 -88 61 93 -397 317 362 -27 83 366 230 -260 -192 70 -340 140 300 -53
3962e3J84K2k05l08M84k42j83K96R1LK0q5k05k06M40j05k30N23r5k25K13j02j54
$$ -53 131 153 -52 -360 124 -118 -301 -5 86 89 109 24 -181 -387 53 -52 -282 241 146 -79 134 32 -122
3985a22L25k72k0q2M26k19l56Q02mn16J14M5j24l65O82L34p45K44j33l48J85P5
$$ -122 203 -69 -89 -171 255 36 -320 482 478 -38 76 121 -3 -368 314 648 -97 147 14 -334 -149 -74
4007g4l04M30K87n24K71k0N7l67K81P1k10R8Q5j18j86J70PoK43p8k93nN16k21
$$ -74 -378 52 339 -185 86 66 123 -244 37 108 -102 -4 81 -37 -223 -53 -46 -52 191 113 -180 -185 331 110
4031A10j87J99o2k28N1K00j08o3L66k49m5M39o54J41R3J31l52N16n3n13P3K94
$$ 110 -77 122 60 -168 -117 83 -25 -88 278 29 -16 423 -231 -90 3 134 -218 298 245 -268 -195 99
4053I9l2k28L18K3q8M1j52k47L73K14l72M3J39Nj95L16Rn03J85K06k39j28K18
$$ 99 67 -161 157 180 92 133 -19 -266 107 321 -51 -8 131 136 -59 257 266 -237 -52 154 -85 -213 5
4076EM4k60M23j86k13J52K14l46K74k7j78%J81J0k16K49j54J14j31J71r4j38O4
$$ 5 49 -211 212 26 -187 -35 179 -167 107 80 -98 -98 83 93 -123 126 -28 86 -45 126 32 -106 -42
4099d2K2J58K01j25m37L84L22o46J59K87n78J85J64m4j16L09l7l20K26J90o59
$$ -42 -20 138 339 214 -223 161 483 -163 -4 283 -295 -110 54 10 -106 203 166 -154 72 262 -397
4120c97L23K55k02K85J19k63l95K82J39m27J29K91k06q6R7K72k96K5L18p00L67
$$ -397 -74 181 -21 264 383 120 -275 7 146 -281 -152 139 -67 -153 -56 216 -80 -55 263 -437 -70
4141g0n5r5L10j46K21l98N10k27m48O19m1j34r5J65p2k04M28q7n14L26J24j43
$$ -70 -125 -220 90 -56 165 -233 277 50 -398 221 180 46 -49 116 44 -160 268 181 -333 -7 117 -26
4163b6O8p9n4q6J83o8O6J26n5l93M05L2l58J99Q6k17k00M00L23n26L37k38k25
$$ -26 42 -37 -91 -177 6 -62 4 130 75 -318 87 119 -239 -40 46 -171 -371 29 352 -174 163 -75 -300
4186c00L09o3J53l47M13r0j89L10K51n47J47R5k18J9L01j87l91L45J30K3k00j85
$$ -300 9 -54 99 -248 165 75 -114 196 447 -100 47 142 -76 -57 244 57 -334 11 141 164 -36 -221
4208b21M17k21K50k35j92L07o6j6Nq1l55K02M88l26j42L31m4k83J48J78l58o2
$$ -221 196 -25 225 -10 -202 105 39 23 28 -53 -408 -206 282 -44 -186 145 101 -182 -34 144 -214 -276
4230b76M64j76k31N36j84l83M53j83k80J50L13l83O4L82n09J13J45K21m39K32
$$ -276 188 12 -219 317 133 -250 203 20 -260 -110 203 -180 -116 266 -243 -130 15 236 -203 29
4250B9q8p2r3L23k49l9L94l41M2M1J96o1K38m8k89J7J8j11LJ79l63Q7L11o0L3
$$ 29 -59 -131 -224 99 -150 -189 205 -136 -94 -53 143 82 320 272 -17 0 18 -93 -90 89 -274 -187 124 64 97
4275I7l85O39m98l21M86J0j13J68j73j13L28q5k05p3L24l59K22N01l02r2K33k13
$$ 97 -288 351 -147 -468 18 28 -85 83 -90 -203 125 40 -165 -238 86 -273 -51 450 148 56 289 76
4297G6J74m12L31k28r0N12m28nJ73P4l28K12J01l36K18R0j59k84J81K0K5K6L63
$$ 76 250 -162 169 -59 -149 363 -65 -70 103 177 -151 61 162 -174 44 134 -25 -309 -128 -108 -83 -57 306
4320C06m63N32R9m47l73M88j31l28M29k06J27k76K33l5j9L17l67k51O89n97J83
$$ 306 -157 375 474 27 -346 142 11 -317 112 -94 33 -243 -10 -45 -64 253 -114 -365 324 -273 -90
4341i0O5M9Q7j58J93j2n33O43n14M4R6L69l77k15L66k65K36J01l6l7J63k28M4
$$ -90 -25 24 111 -47 146 134 -399 244 -270 -226 -130 239 -138 -353 13 -252 -16 85 49 12 175 -53 -9
4364iP3j1j99rM4o2MK16J44j02p5J32j50j57J61j88j19M53k25Q8k63O53p37Q6
$$ -9 64 53 -146 -155 -111 -173 -169 47 191 89 14 146 -4 -161 0 -188 -307 146 -79 9 -254 399 -338 -252
4388b52J71M7P3K8n6k40K02K15l46J63Q0o9J38j4k17j23J23RL3p0J20k36M00K08
$$ -252 -81 -34 39 67 11 -229 -27 188 -158 5 85 16 154 140 -77 -200 -77 -68 -35 -105 15 -221 179 387
4412C87l92j82J47o4k2K08J8l01p7L88k26m8K4K65k58K58k25q4M27j83k59j35
$$ 387 -5 -187 -40 -104 -126 82 100 -201 -278 110 -116 -164 -140 125 -133 125 -100 -184 243 60 -199 -334
4434c34P39n31J0J22P7m06M09M3l36P3M25m19k9L37k94R6R9q2j65J80J04j22j40
$$ -334 405 -126 -116 6 83 -323 86 129 -207 -134 291 -128 -157 180 -114 -18 81 -1 -166 14 118 -4 -144
4457a44J01j16J06J00K55m88K55m8J94L5l99k5N0L94l20n7J41k26n6K85J57l83
$$ -144 -43 -159 -53 47 302 -186 69 21 215 250 -149 -174 -124 270 -50 -107 34 -192 -248 37 194 -189
4479a89J2J86J13m82L35R6m21K53o3M2qL33n68L46K74l02J15j80J70k85K86p6
$$ -189 -177 9 122 -360 -25 71 -350 -97 -160 -118 -126 207 -361 -15 259 -43 72 -108 62 -223 63 -13
4501a3j18L27K79m69k52M96o7m55J95q4K40j45K25j28j00O9j94K08j31K40l1j51
$$ -13 -131 196 475 6 -246 250 183 -272 -77 -161 79 -66 159 31 -69 0 -194 14 -117 123 92 -59
4523e9K24m8j27J50p9k65L15l4k39K87kk47J01J40j57l8M9J53j64J2Rj4R3J81
$$ -59 165 117 -10 140 61 -204 111 77 -162 125 123 -124 -23 117 -40 -78 -29 124 -40 -28 -19 -33 60 241
4547B41m02j56L39N0k51L9Q9P3j62L60l30k0j1L0P8J14l8j28J03J46l63Q7K15
$$ 241 -161 -317 22 72 -179 -140 -51 22 -140 220 -110 -130 -141 -111 -33 81 43 -85 18 164 -199 -112 103
4570A03j88K42L2m95J98J95j0p8K3K26l18j34Q7K68j76j5k0j43J95KJ21j88K52
$$ 103 -85 157 189 -306 -108 87 77 -1 22 248 -70 -204 -117 151 -25 -40 -60 -203 -8 -6 115 -73 179
4593A79m12k40M97P6k62J50O5J7n4r9J53o9l29K28j75J92O7j19J38J55l22O5J29
$$ 179 -233 -473 24 100 -162 -12 53 70 16 -83 70 1 -328 -100 -275 -83 -16 -135 3 158 -164 -99 30
4616C0J06j78N8l6j42J98K25j04o4L6k83r8M53O9m61J83J71k70J96l1o8k37K50
$$ 30 136 -42 16 -20 -162 36 261 157 93 129 -154 -252 201 270 -191 -8 163 -107 89 58 -10 -247 3
4639Cj38J9J48l6OK48j58n8m18N93o6l45M48K8j75j58K99j02l42o8N10j62K4Q
$$ 3 -135 -116 32 -4 2 250 92 34 -384 209 143 -202 246 274 99 -59 240 138 -204 -272 238 76 100 108
4663A08j57N60j69k09j27J47j62k51M37k83l4K29r1k8j06L7QR7L01l82M3M0j13
$$ 108 -49 511 342 133 6 153 -9 -260 177 -106 -140 89 -2 -30 -136 -99 -91 6 307 -75 -32 8 -105
4686a05k8J08L40l90R7K6m1k34K49j93L4m5O4J19l1K79l98K07K25j68k07J04m
$$ -105 -133 -25 315 -75 22 48 7 -227 22 -171 -137 -182 -118 1 -30 249 -149 58 283 115 -92 12 8
4709Hj40r1N51k56L15k46p2k01J55J06R3k42O5j30J92k28j98K84K02j51O9J89
$$ 8 -132 -223 328 72 387 141 69 -132 23 129 222 -20 45 -85 107 -121 -319 -35 167 16 85 274
4731B74k23o3j5n9M9q4k5K77m85L55J81j91N5j40j35p1L40O6k32K21K3m39M49
$$ 274 51 -12 -27 -86 -37 -121 -146 131 -354 1 182 -9 46 -94 -229 -300 40 106 -126 95 118 -321 128
4754A28j23j78L25k48J91k78K83j08R0k01n9K57j0k44K53r1K58k86j64K96P8m5
$$ 128 5 -173 152 -96 95 -183 100 -8 82 -119 -178 79 69 -175 78 -13 245 -41 -205 91 169 124
4776A24j47K84q3j90J61Kl6J50j11l96N36k40j55m7J87l80L16J76l93L83o5m4
$$ 124 -23 261 178 -12 149 151 115 265 154 -242 294 54 -101 -148 39 -341 -25 151 -242 141 76 32
4798C2j3o6L02j73l3P5l17J2K77K4k56M53j03m09L73Mj29J75j68k32j84M80k97
$$ 32 19 -47 255 82 49 124 -193 -181 96 120 -136 317 214 -195 178 182 53 228 60 -172 -356 124 -173
4821a73K46j28N2NK57J19l25o3k55P9K81j32L12j8l88L62j48j01L72l13j7n6J13
$$ -173 73 -55 -3 2 259 378 53 -10 -265 -186 95 -37 275 257 -131 231 83 -18 354 41 24 -32 81
4844H1j12LJ3Qj80K0M50l84K98j77n7q4K63j17L4L14l45j66K68k02j4K43k05K48
$$ 81 -31 -28 -15 -7 -187 -167 283 -101 197 20 -37 -121 142 25 59 373 28 -138 130 -72 -86 157 -48 200
4868B00m84K21J32JJ03k88K23k36L45k67o4j29L30O1k77K16L01l50K24k77K63
$$ 200 -284 -63 69 70 173 -115 108 -128 217 -50 -114 -243 87 148 -129 87 388 38 262 -15 248
4889B48k97k11J49K90j4k25J84J12l46P2J14k31K08m3OJ48j84L1r6j49M10l17
$$ 248 -49 -260 -111 179 165 -60 124 236 -110 -38 76 -155 53 10 16 164 -20 11 -85 -234 176 -141
4911a41k1L63k09k1n5j14j93K25J22m8K21k70P9J06O8m66K02K34j03PL7j42J0
$$ -141 -162 201 -8 -29 -84 -198 -391 -166 -44 -92 129 -141 -62 44 112 -354 -152 82 -21 -14 23 -119 -109
4934a09K09k71J29j80K2N19m84K17J26l06K98j15l69K16K82m05L55j34J3L77l53
$$ -109 100 -171 -42 -222 -200 319 -165 52 178 -128 170 55 -314 -98 184 -221 134 0 13 390 37
4955C7n8M8nj38J87P3k94J85q1J73k70J68K16j12k29P4J56l51Q3j44K43o8j54
$$ 37 -21 27 22 -116 71 144 -150 35 -46 127 -143 25 241 129 -100 -26 130 -221 -138 -282 -39 -107 -261
4978b61L20k20M59k94p2K10lp6o0j44J62r9P7Kj63J01J61o9k89M42j62p5jK04
$$ -261 59 -161 298 4 -68 142 139 63 3 -141 21 -78 -1 1 -162 -61 100 31 -258 184 22 -53 -54 150
5002A50L4l51j30J00J84K45l40r9K56J24r3O4j44k9j50J94J8j03K11j03J04k18
$$ 150 184 -167 -297 -197 -13 232 -108 -207 49 173 80 144 0 -29 -179 15 33 -70 141 38 142 -76
5024g6N9j05P3J79k15q4L03J45n01J67m7k20L80j22j13N4M0J98m35O05j17l79
$$ -76 -17 -122 -49 130 -85 -169 134 279 -222 -55 -102 -322 58 -64 -177 -123 -83 115 -320 285 168 -211
5046b11K26l6J64k30j8j11K74o7j59J44K89r0p9l5J13q7r7R4K3j43n2K74j30o0
$$ -211 15 -21 143 -87 -105 -216 58 -9 -168 -24 265 175 96 61 174 87 -10 84 107 -36 -88 186 56 -4
5070dNJ32N4j64L3j98N36l72l00N8K73Q8k38L89m03K86np1j94N6j52L78k16K17
$$ -4 1 133 187 23 56 -142 394 22 -278 -220 53 141 -97 292 -111 175 170 99 -95 -39 -191 187 -29 188
5094A88m37L97j40r0k20J56L1J09R6M9o9R8k16r1J25K49l39q3N0M69n10L65j70
$$ 188 -249 148 8 -82 -302 -146 -115 -6 90 139 70 168 -48 -139 -14 235 -104 -187 -137 332 -178 187 17
5117A7j41K97j38p5j51L26k10J61M4l11q2J02M7K29k29J90l05Q5K49J2j28j76
$$ 17 -124 173 35 -40 -191 135 -75 86 130 -181 -263 -161 -114 115 -114 76 -229 -144 105 117 -11 -187
5139a87J72R4O1j00K5j20L4R6k37R4J87j74m0O3J19l95K14l7M8J15r9j26L02l2
$$ -187 -15 79 140 40 65 -55 -21 75 -162 -68 119 -55 -95 -32 87 -308 -94 -131 -83 32 -67 -193 109 77
5163G7L7j16O8j70m9K17j9j78L33l98K51q4Q8J40k12j8J18p6k27K37Q2n3j18Q2
$$ 77 114 -2 66 -104 -153 64 45 -133 200 -198 53 -31 57 197 -15 -33 85 9 -218 19 101 48 -70 12
5187A2j05K10l3j54r6J5L95k75J45k5j66l9J68J36n4k15P9l6k7j46J01R8l88L85
$$ 12 -93 117 84 -70 -166 -151 244 -31 114 89 -77 -116 52 188 134 -81 -2 -38 -65 -211 -110 -12 -400 -15
5211a5L36k99k27L58k5m2R6l70q8K03M9J90J12r6k48n1K23q2J9k36L82j19j13
$$ -15 321 22 -205 153 128 86 182 -188 -276 -73 -24 166 278 182 -66 -117 106 24 43 -193 189 70 -43
5234d3J49j78J17K19j71K8m3j1k14J42o2K50l88L14K3k47J11j2J94l56M30l92
$$ -43 106 -72 45 264 93 121 78 67 -147 -5 -67 183 -205 109 132 -115 -4 -16 178 -178 252 -140
5256a40qM43k53JJ61k36o2J66Q5k75N5L2J19J09j81J29k07JJ73j0k01L67n76J67
$$ -140 -148 295 42 43 204 -32 -94 72 157 -118 -63 -31 88 197 16 145 -62 -61 112 102 -99 268 -308 -141
5280a41j59J96k8K44k33J96k47K70j79q0M7O5J11N9J8k11J81O3j02J25j69J8j07
$$ -141 -300 -104 -132 112 -121 75 -172 98 -81 -161 -114 -49 62 121 139 -72 109 172 70 195 26 44 -63
5303f3J24J99l26j11R9j15r8M10O2j61O5j24k72r3L83L6q6R0J06p4J08m20M74
$$ -63 61 260 -66 -177 -78 -193 -291 119 181 20 85 -39 -311 -404 -21 15 -71 19 125 51 159 -261 213
5326B13j03r1j42J76j46J39M8K00l83O6J44j5r3j74K87k29J6lK75j84n4K8J88
$$ 213 110 19 -123 53 -93 46 94 294 -89 -23 121 106 13 -161 126 -103 -87 -90 185 1 -53 -25 163
5349A63m6m3k77Q2J82k16l0P3mJ16J29j48j66K02q1k40N13j41j20j4rn7l1K39
$$ 163 117 74 -203 -121 61 -155 -185 -112 -116 0 129 -19 -185 17 -64 -304 209 68 -52 -66 -75 -132 -163 76
5373G6j61j68J85J92j63Q4J00k97l8M08l90K82Jp9r2O7J17k27L12j61l98L1N43
$$ 76 -85 -253 -68 124 -39 45 145 -152 -190 218 -172 110 111 32 -60 7 124 -103 209 48 -350 -319 224
5396B24k72K28%n24J30o0L12J20m08M19j96P7J25m7j67J12l09K29J76Q5k41k68
$$ 224 -48 180 180 -344 -214 -274 38 158 -250 169 -27 50 175 128 -39 73 -236 -7 169 254 13 -255
5418b55J07Q1q0K31p1j39L20j6l55J93K7j85JK21j69K98k10j06K56m6l70L8J18
$$ -255 -148 -67 -147 84 13 -126 194 178 -177 16 43 -142 -141 80 -89 209 -1 -107 149 103 -267 -229 -111
5441a11j04K15m5l4J00l06M53j45J60j93QN6R5J45m28n9M19j88J21m29L74Q1m38
$$ -111 -215 0 -45 -79 21 -285 168 23 183 -10 -2 54 149 294 -134 -193 226 38 159 -270 104 185 -253
5464b53M29n7j52m1oo7j9K39o2n2J47J9k37l4J85k27j21J98J04J55k06m1K62k73
$$ -253 176 119 -33 -74 -80 -147 -166 73 11 -41 106 125 -112 -146 39 -188 -309 -111 -7 148 -58 -99 163 -110
5488a10K24l31K63j07J67rJ3j8J7q0qM7M5j45J79j98r4j09O07j08m41J78N3k55
$$ -110 114 -217 46 -61 106 97 110 92 109 29 21 68 113 -32 147 -51 -145 -254 353 245 -196 -18 35 -220
5512b20L66k40J05k98L90j24M8l2pO4j48K47l37K28k08Q1L2j98L83q6Jj83n5K10
$$ -220 146 -94 11 -287 103 -21 27 -5 -12 52 -96 151 -186 42 -166 -85 -53 -251 132 46 47 -136 -191 19
5536A9j71K47j52J50j33j63q7L96j31N0K7j76K97j64P6m2j30O1O8j28j21P11m68
$$ 19 -152 95 -57 93 -40 -203 -290 106 -25 25 52 -124 173 9 85 43 -87 -26 42 -86 -207 504 36
5559C6j31N5J66l3l85N56k15j55Q6Q9k61L1J58l44N71k14N5O5O3J1l21Mk6Q7m2
$$ 36 -95 -40 126 93 -292 264 49 -106 -20 69 -192 -161 -3 -347 224 10 65 130 193 204 -117 -113 -139 -52 -94
5584i4l5N89o95L78o9j69J14J31n6j96K65j41M0p1K2p6J36k80J66m5j87L40l15
$$ -94 -129 460 -235 143 74 -95 19 150 94 -102 163 22 62 -9 13 -63 73 -207 -41 -86 -273 67 -248
5607b48M74l21J70M1j71J33K17m80J30J70O1k14j83K45j3o5J6q1Q5J91j59J09
$$ -248 226 -95 75 116 -55 78 295 -185 -55 115 176 -38 -221 24 11 -54 -38 -119 -34 157 -2 107
5629A07j02Q3RJ14l35p3K48K00j56J04j74Mj75L20R9k99M5L2j47O4k9M4j87L03
$$ 107 5 88 97 211 -124 -197 51 251 95 199 25 29 -146 174 273 -26 19 51 -96 -32 -61 -17 -204 99
5653I9m62O46m6j18n9K3O9k88J58k40L11l6p6m7q3M80l54J31k16p2J64j43J44
$$ 99 -363 283 237 119 60 83 152 -136 22 -218 93 57 -19 -66 -149 331 -23 108 -108 -180 -16 -159 -15
5676a5K7k3rJ20j74m7j6q5K97K6j02l80M37qk04K42m3k1j6J71R7l05L20l21j12
$$ -15 12 -11 -20 100 -74 -121 -137 -222 75 101 -1 -381 56 48 -156 86 43 22 6 177 274 -31 289 -32 -144
5701a44J12p2J21J81j45j41J06K70k32j41M11j94q7Q3J10k98j50nJ12M9J76k17
$$ -144 -32 -104 17 198 53 -88 18 288 56 -85 326 132 45 128 238 -60 -210 -215 -103 -54 122 -95
5723i5j29K50Jj05Q7M09l42M2k35P3j74K56m0j64P1M54n06l9L39j52o9K4K08j35
$$ -95 -224 26 27 -78 9 418 76 118 -117 -44 -218 38 -2 -166 -95 359 -147 -186 153 1 -68 -44 164 29
5747B9N6j02r1J79q9J50m78N53j58j5j61N0p1k3K35k52m4J08O9j95K94j15K18
$$ 29 85 -17 -108 71 -18 132 -346 207 49 34 -127 -77 -148 -171 64 -188 -232 -124 -55 -250 44 -71 147
5770A47n12N41j08J08m7O5k07j24M35k81R9K6q1m3j44LK18Q3q3k1j70J48j36k3
$$ 147 -365 176 68 176 129 194 -13 -137 298 17 116 142 61 18 -126 -123 95 178 95 74 -96 52 -84 -107
5794a07L61k79Q0P5k59L98k65O2l6RJ51l67J32K2J47n4K2k78J3K35k52K92M2J83
$$ -107 254 -25 55 130 -129 269 4 66 30 39 190 -177 -45 -23 124 70 92 -186 -173 62 -190 102 144 327
5818C27l04k53L56j15j86L7J59K24m53J17K45k36J56k85J35J25J35k74M2J77q9
$$ 327 23 -230 126 11 -175 -138 21 245 -208 -91 154 -82 74 -211 -76 49 184 -90 -48 129 40
5839D0m8K17l77lL64m9j42J5l5J60j12R5l38L24j42J94j51k65L72l15L35n4k80
$$ 40 -8 209 -168 -171 193 144 2 17 -18 142 30 125 -213 111 -31 163 12 -253 119 -196 139 85 -195
5862a95M51k05j65j13L79k37j75J19J61m5k12L98m41J00K28J00R5m35J66P8N7
$$ -195 256 51 -114 -227 152 -85 -260 -141 20 -25 -237 161 -280 -180 48 148 243 -192 -26 52 109
5883A09N0n8j55Qq4K84k98J55j35J49K41n22J46J67m9k65K80j61R7K49j81q5k8
$$ 109 159 101 -54 -46 -130 154 -144 11 -124 25 266 -256 -110 57 8 -257 23 -138 -41 208 27 -58 -86
5906h6K68j18n26P31j74j55o0m9q1L84r3J30l79J85J40k89L45j15n6m0J98k69
$$ -86 182 64 -462 269 95 -60 -120 -169 -250 134 41 171 -208 -23 117 -172 173 58 2 -38 160 -109
5928a09K7J13j40J48k36O3O7K13j53N9KJ35j33j60K90k74j36N4M12k63O0K44m53
$$ -109 -82 31 -109 39 -197 -134 -67 146 -7 52 54 189 56 -104 186 -88 -224 -170 242 -21 39 283 -170
5951a70n4L48J25k46K15l49K91k7R3k09PK06k51k51K15J67k22L9Q3l11L41L19
$$ -170 -224 124 249 3 218 -131 160 133 226 17 24 230 -21 -272 -57 110 -112 -73 10 -301 40 359
5973C59l66N2M6k54J75K35j84m08K99J6j68J83p1J89j16L3j67K98j01P1j92R4
$$ 359 -7 45 91 -163 12 247 63 -345 -46 -30 -198 -15 -86 103 -13 20 -147 151 50 121 -71 23
5995B3J91k39k01K81k34K48l6j90R5j64L28l48K03kj19L54j62l2K4l1k5J88k7
$$ 23 214 -25 -226 55 -179 69 33 -157 -62 -226 102 -246 -43 -45 -164 190 28 -4 20 -11 -36 152 125
6018A25P0j18j37k4j11K70K1n5J49j88K53k80J17j30K30m14k0M74k60J28L2k01
$$ 125 195 77 -60 -84 -195 75 96 41 190 2 255 -25 92 -38 192 -222 -242 232 -28 100 132 -69
6040f9K46j35m14J18L76k07q7M8M3M4Q3j30J22j37L35N1k95n5K33j29R8R5m68
$$ -69 177 42 -372 -254 122 -85 -172 -124 -81 -37 46 -84 38 -99 236 287 -8 -63 170 41 139 234 -234
6063b34K16J53k1j65O5o5l39L57K55k65j65M28k07o2J32o3l41L20R0l59M11K23
$$ -234 -18 135 114 -51 14 -51 -390 -33 222 -43 -208 220 13 -49 83 20 -321 -1 89 -270 141 364
6085C64n58L02j59k05M2N2K23k91K66J92ok41J03ml43K07J95m50NJ35L46j42R4
$$ 364 -194 108 -51 -256 -214 -162 61 -230 36 228 222 -19 84 80 -263 -56 139 -311 -306 -171 175 33 127
6108A27l91M37n0k02L4J91k87N1m1P0N9p0M24m52K6J57j30K5R3O4l30J66l2L40
$$ 127 -264 173 123 -79 -45 146 -141 -90 -131 -61 -2 -72 352 -100 -74 83 -47 -22 71 135 -195 -29 -61 279
6132B79j89k30k10M36J06L8j97o2J29k57J2J11j28J15J22Q1j62L3K28k74k7J26
$$ 279 90 -140 -350 86 192 230 33 -29 100 -157 -145 -34 -162 -47 75 156 -6 27 255 -19 -46 80
6154H0J18M5l58Q5j49L58o2j64o3L49l41J89n1%l06K97j64J00J44r2N0l75M50
$$ 80 198 243 -115 -30 -179 179 117 -47 -110 239 -102 87 36 36 -270 27 -137 -37 107 15 65 -310 140
6177A40j05k29K70k52k05K15K37l59L34L6o3K28j74n6k75J69Q9o3K44l17J6L37
$$ 140 35 -194 76 -176 -381 -166 71 -288 46 82 19 247 73 17 -258 -89 0 -63 181 -136 -120 217
6199B17k67K59m65K48l16J32K41r9j85K56K53j57kN2k24j04Q7J17Nj4J43jk45
$$ 217 -50 209 -256 -8 -324 -192 49 -50 -235 21 274 117 115 167 -57 -161 -74 43 48 34 177 176 -69
6222f9J75M7k57j04M35l04R8j33L45j03j39j47J24jJ02p5K28k51j01L28j99l42
$$ -69 106 153 -104 -208 227 -77 21 -112 233 130 -9 -156 -32 -33 69 -6 222 -29 -130 198 -1 -343
6244c43J53J29J47j55l2M72o53K33K3p6L9K45k55N6m3M32m23k28J46J69Q9R6j06
$$ -343 -190 -61 86 -69 -101 371 -282 -49 -26 -102 -63 182 -73 -17 -60 372 -51 -279 -133 36 125 221 115
6267A15p9J93k97L24l42P1p4R3J32k19R3J49O8k74J21L4k06J66j12k21K70L09
$$ 115 36 229 -68 256 -86 -15 -89 4 136 -83 10 159 227 -47 74 108 -98 68 -44 -265 5 314
6289C14l13o0J45k9j43j4J05J80q4oJ41k81Q0J16l70J34J00jk8J79l21J40n6m1
$$ 314 1 -59 86 57 -86 -100 5 185 101 95 236 -45 35 151 -219 -85 15 14 -14 165 -156 -16 -72 -113
6313a13L9RJ14j86j7n2K80j23kJ22k73J94j12p1Q6J02J33k48R2mm0n4j40L34j14
$$ -113 -74 -65 49 -137 -154 -206 74 -49 -51 71 -202 -8 -120 -191 -105 -3 130 -118 -26 -30 -70 -124 -264 70 -44
6338d4N4k59J86J52O1k15L3K73j06L8M1k17n3J88k46J59P3j22j33N34k35r7P4
$$ -44 10 -249 -63 89 150 -65 -32 241 135 173 214 -3 -56 132 -114 45 118 -4 -137 397 162 65 139
6361A39k17K1K64k96K72k34K09r8j23M6q5l0M36j91j54NJ85k46j73J80K8N3K02
$$ 139 -78 -57 207 -89 183 -51 158 60 -63 -17 -102 -132 304 113 -41 -36 149 -97 -270 -90 -62 -9 193
6384A93K4n29J27K96k23J42r9J08k03J89k95P6J30M42n74K84L0l68L54K68k03
$$ 193 217 -312 -185 111 -112 30 -69 39 -164 25 -270 -194 -64 378 -196 88 118 -250 104 372 169
6405A69l16J69J48k02Q8m6q3p2K59J3l6j45J04M0k98O9R8J23J74j01k22L94l77
$$ 169 -147 22 170 -32 56 10 -73 -145 114 127 91 -54 50 90 -208 -139 -41 82 256 155 -67 327 -50
6428e0q6K52k19R9j57K92M1n06M73K5k54R1j49J12J52R1j49J5L6k58m2K53r0k61
$$ -50 -136 116 -103 -4 -161 131 172 -334 139 164 -90 1 -148 -36 116 207 58 73 109 -149 -191 62 -28 -289
6452b89K43L10l03o7L11n5l3j07R1k11J10l6J53j94J89rr1K61k85j42K04j3k73
$$ -289 -46 264 -39 -106 205 150 117 10 101 -110 0 -36 117 -77 112 103 12 273 -12 -154 50 37 -236
6475b36L8K67j75Q7J80k29J1j64M04l70J77n9P3M5O4J58k07m3J48m1o7j74J86
$$ -236 -198 69 -106 -19 161 -68 -57 -221 183 -187 -10 -69 4 49 113 271 64 21 169 128 61 -113 73
6498G3k57K93j60k34L22l0k8R3K1j70K57k72O0p5K25j60j44K6K27p2j08LJ4M3
$$ 73 -184 109 -51 -285 37 7 -21 72 93 -77 180 -92 -32 -107 118 -42 -186 -160 67 -5 -113 -110 -96 -53
6522e3P3j31J28J04j21J0K07k67m47M88j06J08P6P4n7j28J81m4K5j10n3n4lK10
$$ -53 20 -111 17 121 0 10 217 -50 -497 -9 -115 -7 69 143 86 -42 139 95 120 10 -43 -97 -100 110
6546A10j08k24J6K85k00J33J27q4J18j65K9M0J65k47k66K13J84l51N3J21J07j38
$$ 110 2 -222 -206 79 -121 12 139 55 173 8 37 77 242 -5 -271 -58 126 -225 -172 -51 56 -82
6568h2J91j9M9N7k4k13r3O5o1n8K01o1j60K32j98Q8K65j49j78K5K26k79j77N15
$$ -82 109 90 139 196 172 -41 -134 -69 -130 -188 13 -48 -208 24 -174 -86 179 30 -148 -123 103 -176 -353 162
6592A62p3J09j13j07j12K29m2J29k13J07j37o5Q3m6J23Q9p7J07j99L52l30R5r9
$$ 162 89 198 85 -22 -134 95 53 182 -31 76 -61 -126 -43 -89 34 123 46 153 -46 306 -24 71 -28
6615b8q7KK49j9k08K22j54P6m6N3J10j69O0O8l07K53j14k34J57O6L56n11J93J41
$$ -28 -115 -113 136 117 -91 131 -23 53 7 60 170 1 61 129 -178 75 -39 -273 -116 -50 306 -205 -12 129
6639A29k97K92j47J57j40L2K22j90K40l20J63k96J00k01J22J17L9N6L6K8k91J76
$$ 129 -168 124 -23 134 -6 26 248 58 298 -22 141 -155 -55 -256 -134 -17 22 78 114 142 -149 27
6661B7j19J62o0K89o59K13jQ7j3j08J19j55K85J20j19n6N1J08n16L59J24m02K90
$$ 27 -92 70 10 299 -360 -147 -148 -61 -74 -182 -63 -218 67 187 68 12 63 171 -345 14 138 -264 26
6684B6K7n1k16K36l34J90L30j25j23j3J58l62M43k34j03J94R9J06l97K30K0l25
$$ 26 53 2 -214 22 -312 -122 208 83 -40 -53 105 -257 186 -48 -151 43 142 248 -149 81 101 -224
6706b24J66P8j66J00K39l65rM21j76K28j93j42L7J34k71q8L27K2k11J50O8q2j95
$$ -224 -58 20 -146 -46 193 -172 -181 240 64 292 99 -43 -6 128 -143 -231 96 118 -93 57 125 43 -152
6729a52P0M28m20J02j39r6J41O1k94J06K09J11l32J85m5K41k94L25m48K59J26
$$ -152 -82 346 -74 28 -111 -207 -66 -5 -299 -193 16 127 -205 -20 -65 176 -118 207 -241 18 144
6750A44Jm55K10L94l50j88J57K21k39M59k04n25N90j18j97K51k17K08M5k32p1
$$ 144 145 -310 -100 294 -56 -244 -87 134 -105 354 150 -375 215 97 -100 151 -66 142 187 -45 -116
6771a16l05L47L38m34P2K34l35j24L11k50L25J39n26J90L29p3k79J22L5L41l3
$$ -116 -421 -74 264 -170 -98 136 -199 -323 -12 -262 63 202 -324 -134 195 122 -157 -35 0 341 308
6792C08l12L23r9l45K84l19P8J85l42L71j78q2j7K86mk43p9O6J13Q5q7j98J69
$$ 308 -4 319 220 -125 159 -160 -82 103 -239 132 -46 -128 -145 141 137 -106 -185 -119 -6 79 -8 -206 -37
6815c7N53o76j43L50J33k35K32m7j53J9M88m21j99K60J84l11N21m09j86n7M06
$$ -37 516 -160 -303 47 180 -55 177 130 -23 -4 484 63 -136 124 308 -3 518 109 -77 -134 272
6836B72k02r5L3Pk91N20j58j49%j17J76k68K76L8pl2j42J82j70K11k42OL35l54
$$ 272 70 -25 8 15 -276 244 86 -63 -63 -180 -4 -272 4 42 35 3 -139 43 -127 84 -158 -152 183 -171
6860a71K15o6j16j17r5M47M7K16j76j40j35J35l9p8J9P2oj34J7o4J22L27k23j59
$$ -171 44 -22 -138 -255 -350 97 144 360 184 44 -91 44 5 -73 -54 18 12 -122 -105 -169 -47 280 57 -102
6884a02L01j16j47K07j52m4K00j98m1Q6J29J57j66J26n9k41q3M85m45Q2j95K50
$$ -102 199 83 -64 143 -9 -53 147 -51 -92 -6 123 280 114 240 181 -60 -143 342 -103 -21 -216 34
6906C4l20M31k04J49r1p3J37j01L8k08j12M63P4k86K09k7J61l60J92j25q2N26
$$ 34 -286 145 -59 90 -1 -74 63 -38 0 -208 -320 143 217 -69 140 113 274 -86 106 -19 -101 425
6928D25k96k6n8k97r2K11M08l98K99n4J74j98J35q9J9kk36j73K60JJ2l17K41p3
$$ 425 129 103 45 -252 -344 -133 275 -123 176 122 296 98 233 144 163 161 -75 -248 12 13 25 -292 -51 -124
6952a24j04J13K38k44r7M26k9j56n5J67n8NJ30k73M4P8jk71L62k98J92j65K03
$$ -124 -228 -115 123 -121 -218 208 179 23 -32 135 77 82 212 -61 -17 61 60 -211 151 -147 45 -120 83
6975H3k86L91j3o1k02K10k30J26N4Q4k64M25j67m67L83k78K47j95M13m58J88K67
$$ 83 -203 188 175 114 -88 122 -108 18 72 156 -108 317 150 -317 66 -212 35 -160 253 -205 -17 250
6997B50k55j76L67q5m12K28j56J31P1R4p8j08R9o4j0Q1J83r1r6L01m13K7J22k25
$$ 250 -5 -181 186 101 -311 -83 -239 -108 -37 57 -21 -129 -30 -94 -104 -23 160 69 -27 274 -139 -112 10 -215
7021b15K81j6j28P0p7jJ90R9k13K8J5L7K36k20k79L05k25j55L07J27l05K29k68
$$ -215 66 50 -78 -8 -85 -86 104 203 -10 18 33 70 306 86 -193 112 -113 -268 39 166 -139 90 -178
7044a78J93j67J44J39l66M99k69j39L14j67K64j93J09j44j22K61p9l42L70j61
$$ -178 15 -152 -8 131 -235 264 -5 -144 170 3 267 74 183 39 -83 178 99 -243 127 -34
7064c4PM8K79k61R5J70k64j64K95k57n8J29K06j96J03J59l23J1K95o9l40K12k22
$$ -34 -27 21 300 39 134 304 40 -124 171 -86 -144 -15 191 -5 98 257 -66 -55 240 171 -169 43 -179
7087a79K08j59J86k54rM70k85j14M6J27j2l0M0qj41Q5J75k41K0J69j25j44J86
$$ -179 29 -130 56 -198 -207 263 -22 -136 -90 37 25 -5 35 27 -114 -29 146 -95 -75 94 -31 -175 11
7110A1qn9j2J86q8M7j24J55l29L41k77P5J16Rq9Q8l17L62j43M2O1p6J3j65O5K
$$ 11 3 -56 -68 118 30 77 -47 108 -221 120 -157 -82 34 43 -46 42 -275 87 -56 -14 47 -29 -16 -181 -116 -114
7136a14J95k5Q7P7k29j27Q1N2J02j53R1J2J84m02M3L19P3m28K06j71M6M6J94l91
$$ -114 81 56 143 220 -9 -136 -55 -3 99 -54 37 49 233 -169 -126 193 266 -162 44 -127 -81 -35 159 -232
7160b32N9L17j0k56P5J33m43M14J95m61K68j43m6M2j3Po8O3J55k03J16j38n7m7
$$ -232 -173 144 134 -122 -47 86 -357 57 252 -209 59 -84 -130 -88 -101 -94 -162 -99 56 -147 -31 -169 -226 -273
7184b73K82J76m46j5M55k50J30j03Q3j47K2K18k45J15J45Lk29J57o9J07P3m33
$$ -273 9 185 -261 -276 179 -71 59 -44 39 -108 -86 132 -113 2 147 150 -79 78 9 116 189 -244
7206b44J79q9K0J35R1L5j88L70m52J95j22L16k8q5j61j16Q1K9J86J92k01j22j53
$$ -244 -65 -154 -134 1 92 127 -61 309 -143 52 -70 246 218 133 -28 -144 -63 -34 152 344 143 21 -132
7229a32m5K67R4k13O4J09k22J24J97j55l09L42k45NK23k90JL74R8m49l19P34k74
$$ -132 -177 90 184 -29 35 144 -78 46 243 88 -221 121 -124 -119 104 -186 -185 189 287 -162 -481 253 -21
7252b1L4J90K0l16J15q6J10n4K34j78rJ36j44m5lL7k14M44j84j21J89j40N57n81
$$ -21 13 203 223 -93 22 -64 46 -8 226 48 39 175 31 -14 -17 20 -194 250 66 -55 134 -6 551 -30
7276c0m7K09l17L38n4l48n6N25l38J85j8N9o5j13J57j47Q7j88N8j7K59k28J18
$$ -30 -77 132 -185 153 99 -249 -305 220 -118 67 49 108 43 -70 87 -60 27 -161 -103 -120 139 -89 29
7299B9m0J82m95L87j10J89j43j6k3k1R4rj42J73km46K02J21J11m3J48k83o8J49
$$ 29 -11 171 -324 63 -47 142 -1 -17 -40 -61 33 24 -118 55 53 -393 -191 -70 41 -2 146 -137 -205 -56
7323e6q2L10k46LJ33j1k49m4pL42J9l13L08j19K6q7K84j48j4j40Pk8L06J02k09
$$ -56 -138 172 -74 -71 62 51 -198 -242 -249 93 112 -201 107 -12 14 -73 211 63 49 -91 -84 -112 194 296 87
7348H7j74J69j0k77L02k2o4J52k5j61j91K51k67L7J75O9l04L20j48j96K52N2k13
$$ 87 -87 82 72 -205 97 75 11 163 138 -23 -214 37 -230 -193 -18 51 -253 67 -81 -277 -25 27 -186
7371a86K61N0l29L27R6j55J8q7O1j72K09J50n56j2K86p7PK88P2n03K58Q9O6k21
$$ -186 75 125 -204 123 219 64 82 -5 56 -116 93 243 -313 -325 -39 -116 -109 179 251 -252 6 95 161 -60
7395f0l5J12j43O6q2K07j11K08l06J98j04J04j45J76k99K55k57K29j82K75j87
$$ -60 -95 17 -126 -60 -142 65 -46 162 -144 54 -50 54 -91 85 -214 41 -216 13 -169 106 -81
7416h1r3P0J56n7r1J59j03j61L28J68m95L17j05o9N6O1n8J11o7n5J9l0j36M6J62
$$ -81 -174 -104 52 -5 -96 63 -40 -201 127 295 -200 117 12 -57 -1 60 2 113 46 -9 10 -20 -156 -110 52
7441E2mk07L67m68J04K84Q0j00j4k39L31ll88K52J89l58N5K55j26k44P0K3qK11
$$ 52 48 -159 208 -260 -156 128 208 108 94 -145 186 183 -205 47 236 -122 -67 188 62 -182 -112 -89 -97 114
7465A14k7k39L98l64J2J17J39l34L46j19j27J5q8P1K27N1M8l84K00j72Q7k6J05
$$ 114 87 -152 246 -118 -106 11 150 -184 162 43 -84 -69 -157 -86 141 192 240 -144 56 -116 -29 -55 50
7488E0n1j48M06l60J32j12K94l09j4l4q4L3K3L63k97k83N28j64J37j32L8o4K95
$$ 50 -1 -149 257 -103 29 -83 211 -98 -112 -146 -230 -197 -174 189 -108 -391 137 -27 110 -22 16 -48 247
7511B47q4k54j86K10K32o8K0j71r5K48j69R7L0R4l66L79j9o3n3J16M8l87K97k1
$$ 247 163 -91 -277 -67 165 97 117 -54 -149 99 -70 27 57 151 -215 164 145 82 29 145 193 -194 103 82
7535H2l11J8M93k74k71L65J31m93M30l90k6j3L37k7j94J69O4m12N09l21o3J04
$$ 82 -229 -211 282 8 -263 102 233 -260 170 -220 -246 -259 78 51 -143 26 90 -322 187 -134 -197 -93
7557i3J01J43j68J61k35j34K38J9j46K89j21k86L38j52l9p2L67k47m5M51n91q
$$ -93 8 151 -17 144 -91 -225 13 32 -114 175 54 -232 106 -46 -85 -157 210 -37 -82 369 -222 -230
7579b30J47K13l73O0K25j33n6K22Kj01n6K32k99K54Q9m22K24P0K78o08L48o0n3
$$ -230 -83 130 -243 -183 42 -91 -147 75 77 -24 -80 152 -147 107 196 -226 -2 68 346 -262 86 26 -27
7602b7m6J69k14r7M23l30R4P6k42j28K32J38J70k41J40j65R2k70K82j37j22K10
$$ -27 -73 96 -118 -215 208 -122 -28 48 -194 -322 -90 48 218 -23 117 -48 44 -226 56 -81 -203 7
7624Gk04J31L8Q2k56L42j43j58K33k08l4J38M06n83K51J28k85n0L25J13l14J00
$$ 7 -197 -66 -28 54 -202 140 -3 -161 72 -136 -170 -32 374 -209 42 170 -115 -165 160 273 -41 59
7646E9j51l7L58j1k44r2L02k47j35L99q8k47J55K10n15k2L78j70N8J82N3N4k0
$$ 59 -92 -129 229 218 -26 -118 184 -63 -198 201 113 -134 21 231 -284 -306 72 -98 -40 142 195 249 229
7669B29K8l75j11J22J8J29J16L8l58k6L83k35m5j26K70K03q3j29k18K16O1m32
$$ 229 257 -118 -229 -107 -89 40 156 194 -164 -190 193 -42 -87 -213 57 260 177 48 -170 46 107 -325
7691c25J82J00j22J26L57l15m6Q4L28j84k20R6k37O6K75j83l0O0J47k91J6K18
$$ -325 -143 -43 -165 -39 318 3 -43 41 369 185 -35 61 -176 -110 165 -18 -48 12 159 -132 -116 102
7713A02j01j58L14k77J52J24k78Q8K35l8m42N40J2k84m4J59J4k64L09q6k91L13
$$ 102 1 -157 157 -120 32 156 -122 -34 201 163 -279 261 273 -11 -55 104 118 -146 163 77 -214 99
7735I9J93p0k57J07j92J06j04Q9j23j20M75k92J37L35n25J7K98j72M4O0j30K6
$$ 99 292 222 -35 72 -120 -14 -118 -29 -152 -272 203 -89 48 383 -142 -125 173 1 45 105 -25 1
7757AK11k08j37K43m9j68j15K05O0j89j27N38l02O7n2rq6L22J84o06J10j90M34
$$ 1 212 4 -133 110 61 -107 -222 -17 43 -146 -273 265 -37 30 -22 -31 -117 205 389 -217 -107 -297 137
7780A37r8J36j84j06J50j15j03K48o0%J98j89r0j43L17j81K26P3l32jL57k14j94
$$ 137 39 175 -9 -115 35 -80 -183 65 5 5 203 14 -76 -219 98 -83 143 216 -116 -117 240 26 -168
7803a68J49l4k10J33R5o8Q9qk19L43k76L05k15K3M25k67n5l1m4J12k68M66m59
$$ -168 -19 -53 -263 -130 -35 -103 -14 -22 -241 102 -174 131 -84 -61 364 97 42 11 -33 79 -189 277 -182
7826a82k8N47j69j86J73j78j51K91j12j42K58l33j4K6L61k34J86k68J10k66M93
$$ -182 -210 337 168 -18 155 -23 -174 117 5 -137 121 -212 -226 -200 161 -73 113 -155 -45 -311 182
7847A82o8L8k00K60m10J66J44l24L05j44J09k19m5K76l8o5O2p8m2j9P4Rk9J00
$$ 182 114 152 -48 212 -198 -32 112 -212 93 -51 58 -161 -206 70 32 -33 29 -49 -91 -110 -36 -27 -56 44
7871D4L2q3K72j03l84J4QNN18m56r8lL55j87J56R4M1n31N1L74r7m7r2K71j76k3
$$ 44 76 -7 265 162 -222 -208 -200 -195 323 -133 -231 -234 121 -66 90 184 225 -306 -255 119 22 -25 -117 154 -22 -45
7897d5r5J85k8P3q2K02k84P8j04R8jK06p4Jk45M97k93l48J69M71j84j15n8o5j97
$$ -45 -140 45 17 90 8 210 -74 4 -100 -2 -3 203 129 130 -115 382 89 -259 -90 381 197 82 24 -41 -238
7922b38L27P1j22n5K78n79J99L65j45j55k20L16k32N25q7m39M0L52l96K36m6r5
$$ -238 89 160 38 -17 261 -318 -119 246 101 -54 -274 42 -190 335 248 -191 -151 201 -195 41 -5 -100
7944a00r2L00N7l6J01Jj04j99K27k36j5J33N6l99M25p9j61J19nj66o7P71o94n8
$$ -100 -192 108 165 129 230 231 127 -72 155 -81 -96 37 93 -306 119 40 -121 -2 -7 -173 -240 531 -163 -221
7968b21M91j15k02j62K34k3j72J32P1k5R4o3n4R4J71m48J23J41p9j07J43p8J37
$$ -221 270 155 -47 -209 25 2 -170 -38 33 8 102 39 -15 79 250 -198 -75 66 -13 -120 23 -55 82
7991H2j4j83l90N49j76L0OM14k62j75J92j52Q3j45J47j79Q3M5J12l6nj59k3L4
$$ 82 68 -115 -505 44 -132 -102 -96 318 56 -119 73 -79 4 -141 6 -173 -90 -45 67 31 26 -133 -156 -122
8015a22J72q2K00m3o5j59R6O6j49M05l55k8J49j5K47j21k62K49j77j34L67j86
$$ -122 50 -32 168 125 60 -99 -3 63 -86 319 -36 -64 85 70 317 196 -66 183 6 -128 239 53
8037E3k54K77l88J42M29k64J22k93M68n65J05K82N2r4l5L9l27L63k52k3K55J88
$$ 53 -201 76 -312 -170 259 -5 117 -176 292 -273 -168 114 166 72 37 76 -251 112 -140 -163 92 280
8059B80j70k4j6O2jk4j87J41l41M29j28J41j86J6j0J01n3p9K10j72j0j20K18m10
$$ 280 110 86 70 132 131 107 -80 61 -280 149 21 162 -24 -8 -18 83 30 -49 161 -11 -21 -141 77 -333
8083c33M15k01J12Q6K33k90j03j57K32l60N20K14k41k7K65l91J09J25n50K46K05
$$ -333 82 -119 -7 79 312 22 -81 -238 -6 -366 154 368 127 100 365 -26 83 208 -342 -96 109
8104A09rq7l73L28K61q4n8k8k71K50l3oJ36K79m94L5K70l33j6O6O6Nj24L41k04
$$ 109 100 13 -360 -32 229 145 87 59 -212 38 5 -1 135 414 -80 -45 225 -108 -124 -58 8 13 -111 230 26
8129B6l08K22J39K1k73L12j64k02J97j4j24K27j17j32J43R9k0k4K08k04J7K69
$$ 26 -282 -60 79 100 -173 139 -25 -227 -30 -44 -168 59 -58 -190 -47 52 32 8 216 12 29 298
8151B98o24L06M2J02p2l9N1j71J70j75j2J03K52m89J33J61K21n22M04j55j20L
$$ 298 -326 -20 22 124 52 13 64 -107 63 -112 -124 -21 231 -258 -125 36 257 -265 139 -16 -136 -133
8173a33L32k45o6K08j19K16j71O0k1k4L05l50j75L75l55p2M59j30
$$ -133 199 -46 -112 96 -23 193 22 82 61 37 342 -8 -183 192 -163 -235 224 94
8191I4
$$ Imaginary data points
##PAGE= N=2
##DATA TABLE= (X++(I..I)), XYDATA
0@%%%%%%%%%%%qJ6j6J6j6K4l2L6m4N6o5P3q8J04j21J45j69J93k24K56k89L30l76
$$ 0 0 0 0 0 0 0 0 0 0 0 0 -8 8 -8 8 -8 16 -16 20 -24 32 -33 40 -48 56 -65 80 -89 104 -120 136 -153 177 -199
34a99M24m80N40o04O76p55Q38r31J035j148J272j404J549j709J883k078K289k520
$$ -199 225 -255 285 -319 357 -398 440 -491 544 -604 668 -736 813 -896 987 -1091 1198 -1322
52a322K780l066L384l744M153m619N159n794O547p465Q614j0091J2081j4921J9328
$$ -1322 1458 -1608 1776 -1968 2185 -2434 2725 -3069 3478 -3987 4627 -5464 6617 -8304 11024
67A1024k7179M5481j73451r7869J94557N4431J02044M1570l5644p7381l7533j02612
$$ 11024 -16155 29326 -144125 -241994 -47437 6994 109038 150608 114964 37583 50 -102562
79a02562o0275O3557J12727O6568P9306J7899p3955o2316m897n7749o0450J6975
$$ -102562 -162837 -99280 13447 80015 159321 177220 103265 40949 36052 -21697 -82147 -65172
91f5172M0488K3978O4404L7476m8232n5970k2943m8644l4891J6331J2523J5152
$$ -65172 -24684 -706 63698 101174 52942 -3028 -25971 -74615 -109506 -93175 -80652 -65500
103f5500P8766O7560j8738m8434l9033n3047j2887N1276M0541J7588M9038M0235
$$ -65500 13266 80826 62088 13654 -25379 -78426 -91313 -40037 504 18092 67130 107365
115A07365j5795l7421m8313n7123q42O2119L9024p71J580j1962l0043j2697j1228
$$ 107365 91570 54149 5836 -51287 -52129 9990 49014 48243 49823 37861 7818 -4879 -16107
128a6107l0823k927L3379J8047p308j2665k4319j4144K5611K9457L438J699L065
$$ -16107 -46930 -49857 -16478 1569 -5739 -18404 -42723 -56867 -31256 -1799 1639 3338 6403
141F403j2382q036M553n439q62K5950L0644J6450N671j7117l4147j5009J302n671
$$ 6403 -5979 -14015 -9462 -14901 -15763 10187 40831 57281 62952 45835 11688 -3321 -2019 -7690
155g690k121Q368P037J4388K2291n740l5851k8195j6975j2256M769J1591P424
$$ -7690 -9811 -1443 5594 19982 42273 36533 682 -27513 -44488 -56744 -51975 -40384 -32960
168c2960K7749M1771Q144k6310k9952l3062k0223J9993L5115K0873L0008L3218
$$ -32960 -5211 36560 44704 18394 -11558 -44620 -64843 -44850 -9735 11138 41146 74364
180G4364m112k8636l0126m0226k4884K5302L8754J9795K2851J2263k8482l4530
$$ 74364 70252 41616 11490 -28736 -53620 -28318 10436 30231 53082 65345 36863 2333
192B333j9570l0530k1166K2790L0988J6060K6503J1844l0470k7187o490j9020
$$ 2333 -17237 -47767 -68933 -46143 -15155 905 27408 39252 8782 -18405 -24895 -43915
204d3915j1903K3060K1483J3261L5481K2453k4056k3496p093k2198j1792K0330
$$ -43915 -55818 -32758 -11275 1986 37467 59920 35864 12368 5275 -16923 -28715 -8385
216h385J2659O028L2201J8776k5512k4176j3547k8551j0958K3488R782o58K4037
$$ -8385 4274 10302 42503 61279 35767 11591 -1956 -30507 -41465 -17977 -8195 -8853 15184
229A5184J0750k5751j4596l929k0495j754K8275R357j106J9824M511k2480j728
$$ 15184 25934 183 -14413 -18342 -38837 -40591 -12316 -2959 -4065 15759 20270 -2210 -3938
242c938P392j2756J647K3401J358n354J5458j608k4005O0P146j3406Q9J5406o742
$$ -3938 3454 -9302 -7655 15746 17104 11750 27208 25600 1595 1655 8801 -4605 -4516 10890 4148
257D148p410J3767n710k2599J252O236j0612N559J5370o385l890J4597n117j7269
$$ 4148 -3262 10505 4795 -17804 -16552 -10316 -20928 -15369 1 -6384 -10274 4323 -794 -18063
271a8063P044R301m880J1197J5393r466m928R743q723j4010J0529Q069m601R476
$$ -18063 -11019 -1718 -6598 4599 19992 10526 5598 15341 6618 -7392 3137 11206 6605 16081
285A6081P350j5790q426L867j2307j1158J2594P051l634R365L092j6025m665M364
$$ 16081 23431 7641 -785 3082 -9225 -20383 -7789 -738 -4372 4993 8085 -7940 -12605 -8241
299h241j1325n106J6006P583M84J2450K775j3490o04L579j1906k280J5414N085
$$ -8241 -19566 -24672 -8666 -1083 -599 11851 14626 1136 532 4111 -7795 -10075 5339 10424
313A0424R16J1841k641j5122j575j176j4196l30J3499J475R45Q365p246j5325
$$ 10424 11340 23181 20540 5418 3843 2667 -11529 -11859 1640 3115 4060 12425 5179 -10146
327a0146N18j846j1353N825J4376J273L251Q343q198j1131M108j143p671J0111
$$ -10146 -9628 -11474 -22827 -17002 -2626 -1353 1898 10241 2043 -9088 -4980 -6123 -13794 -3683
341c683J3656L40M113O541j1641j0113L902m776q128R801J0292k547L972K849
$$ -3683 9973 10313 14426 20967 9326 -787 3115 -1661 -9789 12 10304 7757 11729 14578
355A4578j4732r436L403p344o728J2834R537k688O208J773j4694n801O115o002
$$ 14578 -154 -9590 -6187 -13531 -20259 -7425 2112 -576 5632 7405 -7289 -13090 -6975 -12977
369a2977j699J6228Q048k536O740k65j5253k751O915o927j97J5110L677n027N114
$$ -12977 -14676 1552 9600 7064 13804 13539 -1714 -4465 2450 -4477 -4674 10436 14113 9086 14200
384A4200l769j6427j299M919q657M53J4028P85m037O221m736j4839J567M084q251
$$ 14200 10431 -5996 -7295 -2376 -11033 -10580 3448 4233 196 6417 1681 -13158 -11591 -7507 -15758
399a5758M436J5804R49j067P374n980j3046L539K691p746P001J4506p88j965N753
$$ -15758 -11322 4482 5431 4364 11738 5758 -7288 -3749 -1058 -8804 -1803 12703 11915 9950 15703
414A5703r019j3261M288J028q659P264J1744m577j784M614j0275j0529O767r3
$$ 15703 6684 -6577 -2289 -1261 -9920 -2656 9088 4511 2727 7341 -2934 -13463 -6696 -6789
428f789p342R031J0276n154J043N276q819o531Q561j302o586J0198Q672n534K458
$$ -6789 -14131 -5100 5176 22 1065 6341 -2478 -9009 -448 -1750 -8336 1862 10534 5000 7458
443G458M329j0282m858O931l647n898R729M471o602J913K531j0864k783P661n258
$$ 7458 11787 1505 -3353 3578 -69 -5967 3762 8233 1631 3544 6075 -4789 -7572 89 -5169
458e169m518R418J761o719M045K827q402J610Q509n504l747R384k14o164N713
$$ -5169 -9687 -269 1492 -5227 -1182 1645 -6757 -5147 3362 -2142 -5889 3495 3281 -2883 2830
473B830K759p213M273O941p483l305P649l701o151N388M04o917O185N399q541
$$ 2830 5589 -1624 2649 9590 2107 -1198 6451 2750 -3401 1987 2391 -4526 1659 7058 -1483
488a483j589N964n879o732N434m27m332R751O328o628K30M065r243n710O613M0
$$ -1483 -3072 2892 -2987 -9719 -4285 -4712 -9044 707 7035 407 637 4702 -4541 -10251 -3638 -3598
504c598k13J2697N677q408l76M92j1643m567P031M34K431J2585J339j0682j167
$$ -3598 -3811 8886 14563 6155 5779 6271 -5372 -9939 -2908 -2474 -43 12542 13881 3199 2032
519B032j715j1114j679P279r56L358J2174n91q789R14j472j0509L21O499k002
$$ 2032 317 -10797 -12476 -5197 -6153 -2795 9379 8788 -1 913 -559 -11068 -10747 -4248 -6250
534f250L903J2869K21n390L077m158j2526m00M886k811P036J3681j226n198J614
$$ -6250 -2347 10522 10743 5353 8430 4272 -8254 -8654 -3768 -6579 457 14138 12912 7714 9328
549I328q265j4701K38N067M70J0623J1901n220p044L48q583j1308M581O898J773
$$ 9328 1063 -13638 -13400 -8333 -7863 2760 14661 9441 2397 2745 -5838 -17146 -12565 -5667 -3894
564c894J1311P943r337p260K310o162n282Q016M124j729Q294M590r810m214L341
$$ -3894 7417 15360 6023 -1237 1073 -5089 -10371 -2355 1769 40 8334 12924 3114 -1100 2241
579B241n388k957P196k38m830O897M244p082P1K713q393m394P102k50j540Q741
$$ 2241 -3147 -6104 1092 854 -3976 2921 7165 83 154 2867 -5526 -9920 -2818 -3068 -4608 4133
595D133L156o592J224P61j1150k950R065L326K502R100k406j1399l93P38p890
$$ 4133 7289 697 1921 2682 -8468 -11418 -2353 973 3475 12575 10169 -1230 -1623 -885 -8775
610h775K173J0375J626K239N600q859j4411R90L411j476P108Q239l974j604L169
$$ -8775 -6602 3773 5399 7638 13238 4379 -10032 -9042 -5631 -7107 1 8240 4266 2662 5831
625E831q411j0257M490M704l3Q783N190q342k951M610n564m206N896R3l649P147
$$ 5831 -2580 -12837 -8347 -3643 -3676 5107 10297 1955 -996 3614 -1950 -6156 -260 -167 -3816 3331
641C331N062o019j8L083o636l149M759l634n271P535O959j850K256m97j2076m842
$$ 3331 8393 2374 2356 5439 -1197 -4346 413 -3221 -8492 -957 6002 4152 6408 5911 -6165 -11007
657a1007O210o91j413J0149N361k900K109m107j4546k681Q990L579L593R182j901
$$ -11007 -4797 -5488 -6901 3248 8609 5709 7818 3711 -10835 -13516 -4526 -947 2646 11828 9927
672I927p423R75l700j0510J291R440J825L821O134o211r710J445k66n283N059
$$ 9927 2504 3479 -221 -10731 -9440 0 1825 5646 11780 5569 -4141 -2696 -2962 -8245 -3186
687c186N925l821J649O152m411o630L093j114m200O174L799n925J510P309k789
$$ -3186 2739 -1082 567 6719 2308 -4322 -1229 -2343 -6543 -369 3430 -2495 -985 6324 3535
702C535k643K274n528o043P162N076l809L174M551n009k960J082p197n193R241
$$ 3535 892 3166 -2362 -8405 -1243 3833 24 3198 7749 2740 -220 862 -6335 -11528 -2287
717b287O878j442L507l9r822k517L089m661r05J0404M615k507K613k234j1406
$$ -2287 4591 3149 6656 6617 -3205 -5722 -2633 -7294 -8199 2205 6820 4313 6926 4692 -6714
732f714r81N634j422K182Q579j019m927L237k006q316J068M418k580K810P319
$$ -6714 -7695 -2061 -3483 -1301 7278 6259 1332 4569 2563 -5753 -4685 -267 -2847 -37 7282
747G282l761n304L608j030n988K367K164m476L350P891l218l357K966k646n543
$$ 7282 3521 -1783 1825 795 -5193 -2826 -662 -5138 -1788 6103 2885 -472 2494 -152 -5695
762e695L381J538m725N528Q014k964l100J781n800n614N543K290k806O064N300
$$ -5695 -2314 -776 -5501 27 8041 5077 1977 3758 -2042 -7656 -2113 177 -2629 3435 8735
777H735n697k809J366o467l715P149K752k682N824K412p688j928K380m879q58
$$ 8735 3038 229 1595 -4872 -8587 -1438 1314 -1368 4456 6868 -820 -2748 -368 -5247 -6105
792f105P395M94k562N445N57p969L05L369m693P08O702j987k479O083r98o871
$$ -6105 1290 1784 -778 4667 5224 -2745 -2440 929 -3764 -3056 3646 1659 -820 5263 4265 -2606
808b606J019J946m788J684O307k972j313N853k091p016K038Q14m454L172O395
$$ -2606 -1587 359 -4429 -2745 3562 590 -723 5130 3039 -3977 -1939 -1125 -5579 -2407 3988
823C988k940o82M923l981o519K990N97k933M741N530l737l03L452n327n039L738
$$ 3988 1048 366 5289 1308 -5211 -2221 -1624 -4557 184 5714 1977 1674 5126 -201 -5240 -1502
839a502Q77k988N717L730n074J62K857n997l771M973l62k186O235K061m824J420
$$ -1502 -625 -3613 2104 5834 760 922 3779 -2218 -5989 -1016 -1378 -3564 2671 4732 -92 1328
855A328K339o277l232N209j294j396O818J383m691K341J520p252j461M518k100
$$ 1328 3667 -2610 -5842 -633 -1927 -3323 3495 4878 187 2528 4048 -3204 -4665 -147 -2247
870b247m43P340Q6m681K770J57p011j86M150k902L31O747j188l606L479l68o579
$$ -2247 -2690 4650 4736 55 2825 2982 -4029 -4215 -65 -2967 -2636 4111 2923 -683 2796 2428 -4151
887d151J090L128l446Q95O205j901k013M390j212o468J475J684l645J866O018
$$ -4151 -3061 67 -3379 -2484 3721 1820 -193 4197 2985 -3483 -2008 -324 -3969 -2103 3915
902C915k323p01N012l134o801K219J082m112L422N379l236o33M938l775n415K772
$$ 3915 1592 891 5903 2769 -4032 -1813 -731 -4843 -1421 3958 722 89 5027 1252 -4163 -1391
918a391M37l846M243M002l732K04M820l871l790L710j377m175M216L298m026K344
$$ -1391 -954 -4800 -557 3445 -287 -83 4737 866 -2924 786 -591 -4766 -550 2748 -1278 1066
934A066M349m546k352L223k778m104M173K716l048L548L471n606k279K979l127
$$ 1066 5415 869 -1483 1740 -1038 -5142 -969 1747 -1301 2247 5718 112 -2167 812 -2315
949b315k874N415J187l264M138K618o255j819M201k880j275N502r19l781M221
$$ -2315 -5189 226 1413 -1851 2287 4905 -1350 -3169 1032 -1848 -3123 2379 1460 -2321 1900
964A900J635n780Q14L838l818m00M939k580l539M182J136m002J708K963m741q5
$$ 1900 3535 -2245 -1431 2407 -1411 -1811 3128 548 -2991 1191 2327 -1675 33 2996 -1745 -1830
980a830L977k601k836N088k17m298L551J893n190O38M124k738j450M690j922m275
$$ -1830 2147 -454 -3290 1798 1581 -2717 834 2727 -2463 -1825 2299 -439 -1889 2801 879 -3396
996c396L991K079m194J527L003m050j138M598l079l546N171J564l281K396J463
$$ -3396 595 2674 -1520 7 3010 -1040 -2178 2420 -659 -4205 966 2530 -751 1645 3108
1011C108n716m35L948k401j624N078P96l695K933O06o052N00L957k701n07N374
$$ 3108 -2608 -3043 905 -1496 -3120 1958 2754 -941 1992 2598 -3454 -2954 1003 -1698 -2205 3169
1027C169q87l470L148j39n387J808L174l437Q91M877k125l018L718j265m906K838
$$ 3169 2282 -1188 1960 1821 -3566 -1758 1416 -2021 -1130 3747 1622 -1396 2322 1057 -3849 -1011
1043a011K197m030J427N397k593k025L189k285m647L542J220l402K836M684l030
$$ -1011 1186 -2844 -1417 3980 1387 -638 2551 266 -4381 -839 381 -3021 -185 4499 1469
1058A469j455K835l759l860L817J495k843L529L607m068p09K319m435k517M694
$$ 1469 14 2849 -910 -4770 -953 542 -2301 1228 4835 767 58 2377 -2058 -4575 119
1073A19P5k704M463K213m073K50J666m429j508M158n33j982M529J792m147J285
$$ 119 194 -2510 1953 4166 93 343 2009 -2420 -3928 230 -303 -2285 2244 4036 -111 1174
1089A174J469n639j097M573j221j605N311J190m171J533M46n631j06M459j810
$$ 1174 2643 -2996 -4093 480 -741 -2346 2965 4155 -16 1517 1963 -3668 -3774 685 -1125
1104a125k31M966m11l836J667n2n084J295M086k423J70M698j467l682K323l15
$$ -1125 -1356 3610 3199 -637 1030 978 -4106 -2811 1275 -1148 -978 3720 2253 -1429 894 579
1120E79m302K552L101l632M55M400k123k282L020j478l576L043J882m083J197
$$ 579 -3723 -1171 1930 -1702 -1247 3153 1030 -1252 1768 290 -3286 -243 1639 -2444 -1247
1135a247M740k702j624L258k417m056M034J325l166K125L120l605r65K819k814
$$ -1247 3493 791 -833 2425 8 -4048 -14 1311 -1855 270 3390 -215 -1180 1639 -1175
1150a175k525M349Q47k994L068J590m466p32K881k212j261M951m14l432L001P97
$$ -1175 -3700 649 1496 -1498 1570 3160 -1306 -2038 843 -1369 -2630 2321 1907 -1525 1476 2273
1166B273m727Q27K825k633J2M150j461l294L162L02l727J837J954l279J38M340
$$ 2273 -2454 -1627 1198 -1435 -1423 2727 1266 -2028 1134 1436 -2291 -454 1500 -1779 -1641 2699
1182B699k132k090L471n30l569J704J354l972J283M506j972j155L509j385m574
$$ 2699 567 -1523 1948 1418 -2151 -447 907 -3065 -1782 2724 752 -403 3106 1721 -2853
1197b853J870Q33l161K746M117k853k56K891l006m054K756P00k384L368K921l543
$$ -2853 -983 -150 -3311 -565 3552 699 443 3334 328 -3726 -970 -270 -2654 714 3635 92
1213I2O8K885l527k240L035p80k318L912J631l891J016K951l148j360L100k212
$$ 92 160 3045 -482 -2722 313 -467 -2785 1127 2758 -1133 -117 2834 -314 -1674 1426 -786
1229g86k687L777J360k773K490K507l922j737K808l050j999M378J194j874K848
$$ -786 -3473 304 1664 -1109 1381 3888 -34 -1771 1037 -2013 -4012 366 1560 -314 2534
1244B534J593n196j310K339k391j51M680j98k300K590N06m716j40K122k059M77
$$ 2534 4127 -1069 -2379 -40 -2431 -2582 2098 1900 -400 2190 2696 -2020 -2160 -38 -2097 -1620
1260a620M594j652k854L083J51l435J301J677l564O08L796j859j631L471l71l150
$$ -1620 2974 1322 -1532 1551 1702 -1733 -432 1245 -2319 -1711 2085 226 -1405 2066 1695 -1455
1276a455K199M29m543R13L946j458k41L960j666m537K351k67l238K328L563j807
$$ -1455 744 1173 -3370 -2457 1489 31 -210 3750 2084 -2453 -102 -369 -3607 -1279 2284 477
1292D77N78L097l707l839K376N04k546L792K525l127L31K537l448l043K966M3
$$ 477 1055 4152 445 -3394 -1018 -514 -3060 732 3257 130 461 2998 -450 -3493 -527 -484
1308d84j486L617J355l753M15K298k956j046K993j249k073L979N13k905J197J932
$$ -484 -1970 1647 3002 -751 -336 1962 -994 -2040 953 -296 -2369 1610 2123 -782 415 2347
1324B347l374n19K760k520j270L693P45k454K461O16m260J13K380k264l21L454
$$ 2347 -1027 -1546 1214 -1306 -2576 1117 1862 -592 1869 2485 -1775 -1662 718 -1546 -1867 1587
1340A587K23k034K014j11m138Q32K216k072R23L283j707k141K330k12l225J346
$$ 1587 1810 -224 1790 1679 -2459 -1627 589 -1483 -560 2723 1016 -1125 1205 993 -2232 -886
1356h86K277k263J034K656k814k144K779k10k399K497J463k974J341J705l114
$$ -886 1391 -872 162 2818 4 -2140 639 429 -1970 527 1990 -984 357 2062 -1052
1371a052j275L180n20k081L176N61l172R76J652l326k47L084j246r57L427l33
$$ -1052 -2327 853 333 -1748 1428 1989 -1183 -207 1445 -1881 -2128 956 -290 -1247 2180 1847
1387A847k861J544P54l726K41L157j390l98L492m30k948J475k91l714P21L142
$$ 1847 -1014 530 1284 -2442 -2201 956 -434 -832 2660 2230 -718 757 466 -3248 -2527 615
1403F15j619O41L922j166k849J230q60l868J674K416j272J695L636j943k226J170
$$ 615 -1004 -363 3559 2393 -456 774 -86 -3954 -2280 136 -1136 559 4195 2252 26 1196
1419A196k005l689K231K423j152K036L682k412k001Q88k987l516L206K044l84
$$ 1196 -809 -4498 -2267 156 -996 1040 4722 2310 309 1197 -1790 -5306 -2100 -56 -440
1434d40K669K556k962j629P97l710k224L354J738o82L416J576l435j209O66l190
$$ -440 2229 4785 1823 194 991 -2719 -4943 -1589 149 -533 2883 4459 1024 -185 481 -2709
1450b709j708L763P98o90L364J101l684m73P46k939r26L434j53r02L435R60l115
$$ -2709 -4417 -654 144 -546 2818 3919 235 -238 508 -2431 -3357 77 -76 -978 2457 3417 302
1467C02L10O8l696k53L194m09l38L465L95k722M64m62l880P89L326p86L55L012
$$ 302 612 680 -3016 -3269 -75 -484 -822 2643 3038 316 780 318 -3562 -2773 553 -233 122 3134
1485C134j025k837J046p03l058J816L101j119J95K183j948k593J847k44k313K445
$$ 3134 2109 -728 318 -385 -3443 -1627 1474 355 550 2733 785 -1808 39 -205 -2518 -73
1501g3K529k200k97J904k227j979K596j32j536K568Q59k695K54J682k357q03K909
$$ -73 2456 256 -41 1863 -364 -2343 253 121 -1415 1153 2012 -683 -429 1253 -1104 -1907 1002
1518A002r90j432K877J62k461N84J474k495k12K198j062r61L247J13k357P06K70
$$ 1002 12 -1420 1457 1619 -842 -258 1216 -1279 -1491 707 -355 -1316 1931 2044 -313 393 663
1535F63k876K47K303r85J52L449o22k792P84l78l346J296K722j068Q62L541j909
$$ 663 -2213 -1966 337 -648 -496 2953 2331 -461 323 -55 -3401 -2105 617 -451 411 3952 2043
1552B043k871O33j006k446K276K449r77J033K366k080k793J525j665j627K429
$$ 2043 -828 -195 -1201 -3647 -1371 1078 101 1134 3500 1420 -1373 152 -1513 -3140 -711
1567g11K138j376J004K097k723j780J684j231j946K767R73j286J766J485k767
$$ -711 1427 51 1055 3152 429 -1351 333 -898 -2844 -77 896 -390 1376 2861 94
1582I4j151J652k260j223K599Q98r86K210Q63k635r35J109j932p15K999J59j000
$$ 94 -1057 595 -1665 -2888 -289 609 -377 1833 2696 61 -874 235 -1697 -2412 587 746 -254
1599b54K333Q7l195k18J493k080Q8L019l38j306K139l22l172P63J387j808P48
$$ -254 2079 2166 -1029 -1247 246 -1834 -1746 1273 935 -371 1768 1446 -1726 -963 424 -1384 -636
1616f36K543j430j293K020m29k526J673R32k230R18K486j811p90J842j354j865
$$ -636 1907 477 -816 1204 775 -1751 -78 854 -1376 -458 2028 217 -573 1269 -85 -1950
1632a950J892P71j806J346J551j887n26J837k098j646K454K92o51J457J195k567
$$ -1950 -58 713 -1093 253 1804 -83 -609 1228 -870 -2516 -62 230 -421 1036 2231 -336
1648c36k46J522k122j264K633M45j008K527J02k873k5J141k625j67L107m56o66
$$ -336 -582 940 -1182 -2446 187 632 -376 2151 2253 -620 -645 496 -2129 -2296 811 355 -311
1665c11K395k6k687Q7N39k302Q76K065l17k32K156k74k635N66J2k438Q76K583
$$ -311 2084 2058 -629 -542 -3 -2305 -1429 636 319 87 2243 1969 -666 -100 -88 -2526 -1650 933
1683I33o56k6K517j252k283Q51p45k428J159K837p03O30K014j539k320J018o55
$$ 933 277 251 2768 1516 -767 84 -661 -3089 -1930 907 204 834 2848 1309 -1011 7 -648
1700f48k350J974K108r85J039J750k059k269J549j122j707J875J486m37Q92J655
$$ -648 -2998 -1024 1084 99 1138 2888 829 -1440 109 -1013 -2720 -845 641 204 1096 2751
1716B751k238j387J425j392k060K643J014j070J804J518k674r90R28j582j257
$$ 2751 513 -874 551 -841 -2901 -258 756 -314 1490 3008 334 -656 272 -1310 -2567
1731b567K230J269j145J816Q67k676o86J211k124q35K830O65j051K028mk681L4
$$ -2567 -337 932 -213 1603 2470 -206 -892 319 -1805 -2640 190 855 -196 1832 1828 -853 -819
1748h19J102k137O3K633r7o41J929m11k608M55P85k106L82K499o97m94K002m72
$$ -819 283 -1854 -1791 842 745 104 2033 1622 -986 -531 254 -1852 -1470 1029 332 -162 1840 1368
1766A368k769R47L26k138J032K371o60j75K035j252k513Q57k0j894J965K185j129
$$ 1368 -1401 -454 -128 -2266 -1234 1137 477 302 2337 1085 -1428 -571 -591 -2485 -520 1665 536
1783E36NJ697j961k197J358l45j258K451J722j522J31J084k281j341J818l19j546
$$ 536 541 2238 277 -1920 -562 -907 -2165 286 2008 486 617 1701 -580 -1921 -103 -422 -1968
1800a968K429J441j959M77J128k414p62K035o52j404K170P64j601R54J030k490
$$ -1968 461 1902 -57 420 1548 -866 -1628 407 -245 -1649 521 1285 -316 638 1668 -822
1816h22n03J534p89n78K015J77j442J682N00k657k98J146j348L14K660k65k137
$$ -822 -1325 209 -580 -1158 857 1034 -408 1274 1774 -883 -1181 -35 -1383 -1069 1591 1326 -811
1833h11J943l82k231L12J640j676J112K287j200j423P70k14j988J524J364j610
$$ -811 1132 750 -1481 -1169 471 -1205 -93 2194 994 -429 341 127 -1861 -337 1027 -583
1849e83N70J681j501j306J227j95j470K118R85k048L12J520j931p77K298q43j429
$$ -583 -13 1668 167 -1139 88 -107 -1577 541 1526 -522 -210 1310 -621 -1398 900 57 -1372
1866a372J827N10j834Q60R26k060K72J857r50j326J737N5j206J368M83k036L05
$$ -1372 455 965 -869 -9 917 -1143 -871 986 36 -1290 447 502 -704 664 1147 -889 -584
1883e84J234j195n98K423p52j061J651R0k183k27J191r13L17K233o78j323J578
$$ -584 650 -545 -1143 1280 528 -533 1118 1208 -975 -1202 -11 -924 -607 1626 948 -375 1203
1900A203r23k278J093J110j060R93K270j256j686J202r77j673J427J133j136Q62
$$ 1203 280 -1998 -905 205 -855 138 2408 1152 -534 668 -309 -1982 -555 578 -558 304
1916C04J564j357j020J367j538j111J966M17j754J465J393j878k28J427j406j207
$$ 304 1868 511 -509 858 -680 -1791 175 592 -1162 303 1696 -182 -410 1017 -389 -1596
1932a596J617K99j391J734P14j719N14J089j939j115K194p91o18K350N66k223
$$ -1596 21 320 -1071 663 1377 -342 172 1261 -678 -1793 401 -390 -1008 1342 1908 -315
1948c15J37R22j942p37K343l11q35K055K76j925N23N11k006L18J690p56o53K228
$$ -315 -178 744 -1198 -1935 408 97 -738 1317 1593 -332 191 702 -1304 -986 704 -52 -705 1523
1966A523m48j856N42N24j518L35J887p32o77J792o90j810J415J49k028Q75J827
$$ 1523 1075 -781 -239 285 -1233 -898 989 257 -420 1372 682 -1128 287 436 -1592 -717 1110
1983A110j456O4J821j193j667J623k09j409J357J055j568L77J232j338j145J668
$$ 1110 -346 -282 1539 346 -1321 302 93 -1316 41 1096 -472 -95 1137 -201 -1346 322
1999C22o42j226J895N45j077O55R14j625j030J663q10j253K307M80j684J380Q41
$$ 322 -320 -1546 349 894 -183 472 1386 -239 -1269 394 -416 -1669 638 1118 -566 814 1655
2016A655k542p17J622o08n35K340J9j301Q18K81j981k01J755j439j62K315m32
$$ 1655 -887 -1604 18 -590 -1125 1215 1234 -67 751 1032 -949 -1150 605 -834 -996 1319 887
2033H87j153J184N0k541L32J612j276L24K321j039j185J571o45j972P90J134j467
$$ 887 -266 918 968 -1573 -1241 371 -905 -581 1740 701 -484 1087 442 -1530 -740 394 -1073
2050a073M96K451j395q58J409q85j647J006J038j673J164J524j267n12J246r48
$$ -1073 -577 1874 479 -379 1030 145 -1502 -496 542 -1131 33 1557 290 -222 1024 76
2066G6j633J470M76j514Q97J475j489L5J370j724q09J598J67j531J567Q48j823
$$ 76 -1557 -87 389 -1125 -228 1247 -242 -207 1163 -561 -1370 228 395 -1136 431 1279 -544
2083e44M0J472j328j033J881k11j105J868J43k285O22J216j410l7J550l39j271
$$ -544 -504 968 -360 -1393 488 277 -828 1040 1183 -1102 -480 736 -674 -711 839 500 -771
2100g71J555J04k075Q09J051j368M21J856j452j019J299j60j587J255R31j737
$$ -771 784 888 -1187 -378 673 -695 -274 1582 130 -889 410 250 -1337 -82 849 -888
2116h88Q12J693j605m85J279r02j344J742L01j343Q26J419j667j77J415j417j283
$$ -888 -76 1617 12 -473 806 -96 -1440 302 603 -740 86 1505 -162 -339 1076 -341 -1624
2133a624J577N10j297J269J016j547m6J071j898p10K040p4j090J528R15k390L89
$$ -1624 -47 463 -834 435 1451 -96 -142 929 -969 -1679 361 287 -803 725 1640 -750 -361
2150c61R19j497m31J832k05q07J708j35j938M79J050j560p9J847m37j004J933
$$ -361 558 -939 -1370 462 257 -550 1158 1023 -915 -436 614 -946 -1025 822 385 -619 1314
2167A314l13j746L24R63j538L27J613j131l00J688k03k014J278J80j763R24J562
$$ 1314 1001 -745 -421 542 -996 -669 944 -187 -487 1201 998 -1016 262 442 -1321 -397 1165
2184A165j418l6J661j045j270J154j96j401J353J149j274L67J388j591r66J096
$$ 1165 -253 -289 1372 327 -943 211 15 -1386 -33 1116 -158 209 1597 6 -960 136
2200A36l44j427J693Q71j073L51R32j442p04J204o36q91J870N10j469J033P15
$$ 136 -208 -1635 58 929 -144 207 1139 -303 -1007 197 -439 -1330 540 1050 -419 614 1329
2217A329k159k29J257m82j035J975K97j697J263P84k114K81R81j289r2J899l80
$$ 1329 -830 -1059 198 -284 -1319 656 953 -744 519 1303 -811 -530 451 -838 -930 969 589
2234E89j125J711m8j942M64P74j500J61K109p28m82J325q36j548M40P61j256L22
$$ 589 -536 1175 1127 -815 -351 423 -1077 -916 1193 465 -17 1308 472 -1076 -636 125 -1131 -809
2252h09J933n19m66J185o46j865P82K22r76O94J551q18k62J631j249j464Q56K48
$$ -809 1124 605 139 1324 678 -1187 -405 -183 -1159 -465 1086 268 6 1637 388 -1076 -220 28
2270B8j266J108J245j099Q6J369j204j421J114j41j439J683J179j303L02J178
$$ 28 -1238 -130 1115 16 102 1471 267 -1154 -40 -181 -1620 63 1242 -61 241 1419
2286A419j539o99Q58k23j440J646R51j066M47Q25j181j142J337o53j008J835P43
$$ 1419 -120 -819 39 -184 -1624 22 973 -93 354 1179 -2 -1144 193 -460 -1468 367 1110
2303A110j299J001O01j944j36R68j027n25J840O2j115J187N33j620k93R73r45
$$ 1110 -189 812 1413 -531 -667 301 -726 -1251 589 651 -464 723 1256 -364 -657 316 -629
2320f29l54J922m45q77J410j66j639J37J182j593K96J911o61j075J331k16j445
$$ -629 -983 939 494 -383 1027 861 -778 -641 541 -1052 -756 1155 494 -581 750 534 -911
2337i11O72N66r11j22K106j170o93J026m64j077J212O52j739N19J126r85k01J224
$$ -911 -239 327 -584 -706 1400 230 -463 563 99 -978 234 886 -853 -334 792 -193 -394 830
2355H30q22j115J274M96j368P71J173j460qJ152j066j076J277O7l07M13J243k302
$$ 830 8 -1107 167 663 -705 66 1239 -221 -229 923 -143 -1219 58 125 -182 231 1474 -828
2373h28L09Q81r76l24J492k26r01J546R7j644J04Q92j371N39J141k18j186J413
$$ -828 -519 362 -614 -938 554 328 -573 973 1070 -574 -470 422 -949 -410 731 513 -673 740
2391G40p2j531N42O93j326M61J616q83o14J272n13j452J031N54j229N69J062q54
$$ 740 668 -863 -321 372 -954 -493 1123 240 -374 898 385 -1067 -36 518 -711 -142 920 66
2409F6j34J101j104q63J180J79j452P32J176j067L08J071j330p88J280l85j055
$$ 66 -68 1033 -71 -934 246 425 -1027 -295 881 -186 122 1193 -137 -925 355 -30 -1085
2426a085J243P88q88o5J251j706n75J146l78q72J517P28j248L43N83j539n62J575
$$ -1085 158 946 58 -7 1244 -462 -1037 109 -269 -1141 376 1104 -144 199 782 -757 -1319 256
2444B56l80o71J541K18j386N37M54j586J73J480o56m95J758o74j033O79J15j347
$$ 256 -124 -795 746 964 -422 115 569 -1017 -844 636 -20 -515 1243 569 -464 215 330 -1017
2462a017P32J012j341N25R81n72r08Q57Jj484Q04J236r62p8J470q99r95R48k90
$$ -1017 -285 727 -614 -89 892 320 -588 269 270 -1214 -410 826 -136 -214 1256 357 -638 310 20
2481B0j320R64J048r49K44J276j083r92Q99m07j213J598N88j175Q36Q61j329q34
$$ 20 -1300 -336 712 -237 7 1283 200 -792 107 -300 -1513 85 673 -502 334 1195 -134 -968
2499i68R23k02j050K083K55q19M21L10j665n2R88p75o17K060j98j060J181Qj823
$$ -968 -45 -247 -1297 786 1041 222 643 953 -712 -764 224 -551 -1168 892 694 -366 815 823 -1000
2518a000P0J059o77k41J501j8r06J123m47j331M44N55j179P68J538r43k61Q11
$$ -1000 -930 129 -548 -789 712 694 -212 911 464 -867 -423 132 -1047 -279 1259 316 55 866
2536H66m68j279K53N92q53L15J750o37o89J107o47j448O96M5n64R67J157q26o89
$$ 866 398 -881 -628 -36 -889 -574 1176 539 -150 957 310 -1138 -442 -397 -961 6 1163 337 -352
2555c52J125o46j267J092J08q69J076R43j067l99J069r74j092J290J17n87O74
$$ -352 773 127 -1140 -48 60 -809 267 1210 143 -256 813 -161 -1253 37 154 -433 241
2572B41R68j399K81K34o17o34J307k07q15J024L20r72N0J019j303l72J261r2p77
$$ 241 1209 -190 91 325 -292 -926 381 174 -641 383 703 -269 -219 800 -503 -875 386 294 -483
2591d83J165J15j429N66M18j020J84J091o78k74J033j30j099O55M58j544N86J145
$$ -483 682 797 -632 -66 352 -668 -484 607 -71 -345 688 558 -541 114 572 -972 -386 759
2609G59j197J02J160o17p89N53L11j006K86J423j159p7J027q67k65M90M7r38R10
$$ 759 -438 -336 824 207 -582 -29 282 -724 -438 985 -174 -251 776 -91 -356 134 181 -757 153
2628A53N75j033K39P90j000n14J050J46r18R68K59j048Q0R46j031k37J160m15
$$ 153 728 -305 -66 724 -276 -790 260 406 -512 456 715 -333 -253 693 -338 -575 585 170
2646A70o85J258k76j117R85q9q91K34J338o88n79R63k87j168O60M21j053M00J067
$$ 170 -515 743 467 -650 335 246 -645 -411 927 239 -340 623 336 -832 -172 249 -804 -404 663
2665F63p16l54J231l53j126O71L19j058M10O61l77k63J320p32q81P47k72p68Q15
$$ 663 -53 -407 824 471 -655 16 335 -723 -313 348 -29 -292 1028 296 -585 162 -110 -878 -63
2684f3N27o16M6Q00n94p25Q27j44r98J063O55r44P60N61j507l32J028q74k47J006
$$ -63 464 -152 -106 694 100 -625 202 58 -940 123 778 -166 594 1155 -352 -684 344 -530 -777 229
2704B29J58n79L98M08p58l74R47q90n58J242N20j022R15q4r28J50J30m95p6J167
$$ 229 387 -192 206 614 -144 -518 429 -461 -1019 223 743 -279 636 552 -376 -226 -96 -591 -667 500
2724E00k5o71O11L73j408M81M32j008r5J266n7n06P92j18j325M49L61p98K67J169
$$ 500 475 -196 415 788 -620 -139 293 -715 -810 456 399 -107 685 567 -758 -309 52 -746 -479 690
2744F90k27o24J154p77j060N84J49q08O60J321r86k47Q04o37q75N44K40o62R83
$$ 690 463 -161 993 216 -844 -260 -111 -919 -259 1062 76 -171 633 -4 -879 -335 -95 -757 226
2763B26P12p01j83J060r64q00O73l5j093J241Q53r23J98L57o36p84J087m55m15
$$ 226 938 237 54 1114 150 -650 23 -12 -1105 136 989 66 264 621 -15 -799 288 -167 -582
2782e82J056N9p04P65P2j177m09J054m02l50J046L77p58L10K13j251k64J215n32
$$ -582 474 533 -171 594 666 -511 -920 134 -268 -618 428 805 47 357 570 -681 -945 270 -262
2801b62k66J461j03r26L14M0q70r8R38n87l5J301l58q28O84pr87Q5P42n28Q7J006
$$ -262 -528 933 830 -96 218 258 -612 -710 228 -359 -394 907 549 -279 405 398 -589 -504 238 -290 -203 803
2823H03n02m81N96l03j051Q39L90q44M20R15q39k62Q06o11o80N26N87p96N31Q28
$$ 803 301 -180 416 113 -938 -99 291 -553 -133 782 -57 -319 487 -124 -804 -278 309 -487 44 872
2843H72j108j42M80l93m31Q73M1j010J093M72j166O9O08n42n81J113K1p80Q94
$$ 872 -236 -378 102 -291 -722 151 192 -818 275 747 -419 -350 258 -284 -865 248 269 -511 383
2862C83K87j166L84L19n70J07M90pp34R87j31m72K48J93p30J1J027p53k36N31
$$ 383 670 -496 -112 207 -363 -256 234 227 -507 480 349 -123 125 318 -412 -401 626 -127 -363 168
2882A68J62j097N28Q21j128K03R15m47m52Q07o4j292J032J76r52M31J030p85k82
$$ 168 330 -767 -239 582 -546 -343 572 125 -327 480 416 -876 156 332 -620 -189 841 56 -226
2901b26M67m96l21P64J12r05N66N61j086K40P75m73n82J063o0o51L73M61r73j5
$$ -226 241 -255 -576 188 300 -605 -39 522 -564 -324 451 -22 -604 459 399 -252 121 582 -391 -406
2921d06Q59n22o04J086l10o21R63K23j017K43O74r02j04R76m09q25J024j3p45
$$ -406 453 -69 -673 413 103 -518 445 668 -349 -106 568 -334 -438 538 129 -696 328 315 -430
2940d30J27M31m50m24J044k89m47O16J13q33N10K86j225P63P42o31j38P54k82
$$ -430 -303 128 -322 -746 298 9 -438 178 291 -542 -32 254 -971 -208 534 -97 -235 519 237
2959B37p92O06j52o29N87P27m85j19O29n79n06O31l12n04P48O13r66L79L13m92
$$ 237 -555 51 -101 -730 -143 584 99 -20 609 30 -476 155 -157 -661 87 700 -266 113 426 -66
2979f6m10O74r0r67R29L10o67M09O62j254k36R92l97m83J171p5p08L44M50j044
$$ -66 -476 198 108 -859 70 380 -287 122 784 -470 -706 286 -111 -594 577 502 -206 138 588 -456
2999d56J73N38m87j69J096k80n14O77o8j224L81P14p23mQ82Mn90M57j9j110J68
$$ -456 -283 255 -232 -401 695 415 -99 578 510 -714 -333 381 -342 -346 536 540 -50 407 388 -722 -554
3020e54P20m19K75P21k14l63M09m18j082Q98L58r03N78P24o25l53Q91l61j040
$$ -554 166 -253 22 743 529 166 575 157 -925 -27 331 -572 6 730 105 -248 643 282 -758
3039g58M52M01n17L38J051o11n82N39m96n30P36J53p63O69O13n50k58N23o14l52
$$ -758 -306 95 -422 -84 967 356 -226 313 -183 -713 23 176 -587 82 695 145 -113 410 -204 -556
3059e56M50J89n91P32L63p70J7O10o74k74O78o3m00J037P3j011N21P6q44j56R22
$$ -556 -106 83 -508 224 587 -183 -166 444 -230 -504 174 111 -289 748 821 -190 331 407 -437 -593 329
3080C29m20k21O18K02n74q3N98p81j3O45l32l19R49l14p21O28l6p98K62P73o66
$$ 329 -91 -312 306 508 -66 -149 449 -332 -345 300 -32 -351 598 284 -437 191 155 -643 -381 392 -274
3101b74R9O74l41n05Q10l56n69L58N83p69K10M54n32m24N51K10p22N82M76p80
$$ -274 -175 499 158 -347 463 107 -462 -104 479 -290 -80 374 -158 -582 -31 179 -543 39 515 -265
3121b65J43P31j008NQ72m81l62O42J54r29L75N92o66n5N90j11q19Q89j31o00M36
$$ -265 -122 609 -399 -394 478 -3 -365 277 431 -498 -123 469 -197 -252 338 227 -592 297 166 -434 2
3142BN26j006R1R66o90k71J028l17r05N93K02o51K33Q74n25l28M22m7p50P22j29
$$ 2 528 -478 -387 579 -111 -382 646 329 -576 17 219 -432 -199 675 150 -178 244 197 -553 169 40
3163D0m86M98L49q34K01N69m51m49P30p4p59N86O15j039L96N56o82O5M20l86k04
$$ 40 -446 52 401 -433 -232 337 -114 -563 167 93 -666 -80 535 -504 -108 448 -234 -169 251 -135 -339
3184c39M35M07o21J5P76p05q20Q27l02q4Q54J7o54M62L83j126K9Q08n30L2O05
$$ -339 96 503 -118 -103 673 -32 -852 -25 -327 -411 443 460 -194 268 651 -475 -446 362 -168 -136 469
3205D69j30m91K52J63q17J51O86o74k3J092l26n63O35j65j044O08M43n32k61Q40
$$ 469 339 -152 100 263 -554 -403 283 -391 -414 678 352 -211 424 259 -785 -177 266 -266 -527 313
3225C13K8k76L01j66q78N49K62m12K33P07o68K8L26m57n64K44K86m31M96O41o71
$$ 313 341 65 366 200 -678 -129 133 -279 -46 661 -7 21 347 -110 -674 -430 -144 -575 -79 562 -109
3246a09L4N76p00l00L64L04m88N46J42q30K42R51j106k26P00j41k43L58K74o09
$$ -109 -75 501 -199 -499 -135 169 -319 227 369 -461 -219 732 -374 -600 100 -41 -284 74 348 -261
3266b61O1N38o30l43Q55m07k66Q39k27j61J63O8o67N5M93q9l01N31K02j065N70
$$ -261 -200 338 -292 -635 220 -187 -453 386 159 -2 161 229 -438 -383 110 21 -280 251 453 -612 -42
3287d2K77n49j36N95m25K02M25k42l23L13R3m61L07L32q81M69N00k11o64O36J59
$$ -42 235 -314 -450 145 -280 -78 347 105 -218 95 188 -273 34 366 -515 -46 454 243 -421 215 374
3308C74o45J99L27n37K78L33n45k36O97K1p74O17K48n44J3O41m43j08O99j99p33
$$ 374 -271 -72 255 -282 -4 329 -216 -452 245 266 -508 109 357 -187 -174 467 24 -84 615 416 -317
3329c17M26J44n27N35l9n04K7O49n23PL48m20k51M48L01q16L58K41j58l21N57
$$ -317 109 253 -274 261 222 -282 -255 394 -129 -122 226 -194 -445 3 304 -512 -154 87 -71 -392 165
3350A65J95o69M86L94q52k3N85m09l63Q20k58m23M84K89p65K92M89o00j63N09
$$ 165 360 -309 177 571 -281 -304 281 -128 -491 329 71 -352 132 421 -344 -52 437 -163 -326 183
3370A83k65o88J290j37o09J15N29p78N9O26l46k55P33r4q87N89K34n49K07J95
$$ 183 -82 -770 520 383 -226 -111 418 -360 -301 325 -21 -276 457 363 -524 65 299 -250 -43 152
3390A52l41J30M36l81j98N82j57n82N30J36o95J51M99m79J6N18m6o57O20mo14
$$ 152 -189 -59 377 -4 -202 380 223 -359 171 307 -388 -237 262 -217 -201 317 271 -386 234 230 -384
3411c84K10N11n36o2R02n37m86N76n1o30M01P47r59L06N75m88k71L95Nn83J12
$$ -384 -174 337 -199 -261 641 104 -382 194 143 -487 -86 661 -298 8 583 95 -176 219 224 -359 -247
3432b47K85l57K09O34m45k26M58k51l81N15o4l64N6P81p45J7M99n72k15N69q3
$$ -247 38 -319 -110 524 79 -147 311 60 -321 194 130 -234 -178 603 -142 -125 374 -198 -413 156 73
3453G3o68O35L10n57o2M21k68m90O72o0n35P33j08l06J65M61p15j84N16n4l44
$$ 73 -595 40 350 -207 -269 152 -116 -606 66 6 -529 204 96 -210 -45 416 -299 -483 33 -21 -365
3474c65O16M06p05j5P42j232Q2P91j11m44O25j07l39K68R0r16K02P26m31p5M04
$$ -365 251 657 -48 -63 679 -553 -471 320 209 -235 390 283 -56 212 302 -614 -412 314 -117 -192 212
3495B12l4j69Q3r8k57k18O55l37l9M39K25n52M50k32o16K92J97qPN19m94j74N48
$$ 212 178 9 92 -6 -263 -481 174 -163 -202 237 462 -90 360 128 -488 -196 1 -7 0 519 25 -149 399
3518C99l39l42K61L15p82N85L21m66K3K79m11j40K64K04n33L05P45o55J8K37l18
$$ 399 60 -282 -21 294 -488 97 418 -48 -25 254 -157 -297 -33 171 -362 -57 688 33 51 288 -30
3539c0l27M27J0l27L82M18o07j18O75o32m67O72M3l13N15K76q66Q7M22l91j73
$$ -30 -357 70 80 -247 135 553 -54 -172 503 -129 -596 76 119 -194 321 597 -269 -182 240 -151 -324
3560c24N37k70m62J007j40n10K49J7k04j3N20m11j54N13j12m73M44J61o76L76
$$ -324 213 -57 -519 488 348 -162 87 104 -100 -113 407 -4 -158 355 243 -230 214 375 -301 75
3580G5R6k03j42P48m54m42L47q9n9P7L15p10M34J60j68k19K54Q1m49L52K7k42
$$ 75 171 -32 -174 574 120 -322 25 -64 -123 -46 269 -441 -7 153 -15 -234 20 101 -348 4 31 -211
3602b11K49J10J0k09K15Mn30M88O0l04jN49n92q3M16k60k29L08L57o53M76L25
$$ -211 38 148 158 -51 164 168 -362 126 186 -118 -119 430 -162 -245 171 -89 -318 -10 347 -306 170 495
3624D95p87K39R7l16K6L34k9k62K53J09l77q7L73j14l66P18n35J55qL80m64J23
$$ 495 -292 -53 44 -272 -246 88 59 -203 50 159 -218 -305 68 -46 -412 306 -229 -74 -82 298 -166 -43
3646d3J43m70J45M51k86j18K03J01p64P69M2J30n11L84l33j23M98k92j05K54L43
$$ -43 100 -370 -225 226 -60 -178 25 126 -638 131 173 303 -208 176 -157 -280 218 -74 -179 75 418
3667D18p39J79M39n45J18N19n52k72N15J27k07P9K26l15l77N33n40J86M74K05
$$ 418 -321 -142 297 -248 -130 389 -163 -435 80 207 0 79 305 -10 -387 146 -394 -208 266 471
3687D71p45N34K5m40J02L01l93k58M81O4k56L63k7m27J98K29k85l6M04k81k13
$$ 471 -274 260 285 -155 -53 248 -145 -403 78 142 -114 249 222 -205 -7 222 -63 -99 305 24 -189
3708a89R6L9k31K74q0j03nL69j14m2K10r4m99L60J85m12Q4O18m67m4K86m41l03
$$ -189 -93 -54 -285 -11 -91 -194 -199 170 56 14 224 130 -369 -9 176 -236 -152 466 -1 -45 241 -200 -503
3731e03M76r3j93N22K41n44j71L89j18k91L79p6j90K76K71j68k38k6K2l29M60
$$ -503 -27 -120 -313 209 450 -94 -265 124 6 -285 94 18 -172 104 375 207 -31 -57 -35 -364 96
3752I6o0j09R5J08k86J00L45m64RM07l47j75O49Q4m67J60k39l33J18K35j9qR5
$$ 96 36 -73 22 130 -156 -56 289 -175 -166 241 -106 -281 368 452 -15 145 -94 -427 -309 -74 -93 -101 -6
3775fJ12j44j03K00k63K6M46n11J12M10k06k80J49Q2l06K23L07n26K40K55k69
$$ -6 106 -38 -141 59 -204 -178 268 -243 -131 279 73 -207 -58 24 -282 -59 248 -278 -38 217 -52
3796e2j36N81k71k85K27n9j33J89J13k30p2M32m70k35N59O0m50J47M91k35k34
$$ -52 -188 393 122 -163 64 5 -128 61 174 -56 -128 304 -166 -401 158 218 -232 -85 406 171 -63
3817f3J94p3k37N15k80j99M20J01k48j65K18l40p4L59K11m95J63M43n99J07P0
$$ -63 131 58 -179 336 56 -143 277 378 130 -35 183 -157 -231 128 339 -156 7 450 -149 -42 28
3838B8k17J06K49j53k16K80R8k37lM66n01q6M43l80K7K18N0m43k0O96l36l20M20
$$ 28 -189 -83 166 13 -203 77 175 -62 -65 401 -100 -186 257 -123 -96 122 172 -271 -291 405 69 -251 169
3861A69k13Q8K77k95k76N21j19l27Q8K70k56j12M75l83j34L85k4k89K71J22m95
$$ 169 -44 44 321 26 -250 271 152 -175 -87 183 -73 -185 290 -93 -227 158 134 -155 116 238 -257
3882b57K69N4j86K25K86m31k59L86n6j06n2K57k28J94m2p7l17L37J05j84K41O3
$$ -257 12 66 -120 105 391 -40 -299 87 31 -75 -127 130 -98 96 54 -23 -340 -3 102 -82 159 222
3904B22l74J12K15k53J8j63K35j99L42m7j85J22J1j27o9J32ml38L06K89m55K82
$$ 222 -152 -40 175 -78 -60 -223 12 -187 155 108 -77 45 56 -71 -140 -8 -12 -350 -44 245 -210 72
3926G2M25n85r3M27l51l29N15m2k17J88M89p84O7J36n03M60N19m15k94L04L38
$$ 72 497 -88 -181 246 -105 -434 81 39 -178 10 499 -285 -218 -82 -585 -125 394 -21 -315 -11 327
3947C27l72PK53k97j78O64p3n62N61j29k0l41M89p46M01M18k95k80K79P7n27M65
$$ 327 -45 -38 215 -82 -260 404 331 -231 330 201 181 -160 329 -417 -16 402 107 -173 106 183 -344 121
3969A21l6m83J28O41m39O1Q8P9k82K90R8p53L51J68J55r0R0J24m60L72p8l70R7
$$ 121 85 -398 -270 371 -68 -7 81 160 -122 168 266 -487 -136 32 187 97 187 311 -149 223 145 -225 -128
3992a28N72k61j06R8j57j44K35k02j04M11o0j35J64l4k51j69N82l79j58L50j85
$$ -128 444 183 77 175 18 -126 109 -93 -197 214 154 19 183 149 -102 -271 311 -68 -226 124 -61
4013f1j96J23K08k20J05J69k4j10L58m20K9Q6L34m37R3l5k17k6M10k00k83N93
$$ -61 -257 -134 74 -146 -41 128 104 -6 352 -68 -39 47 381 -56 37 2 -215 -241 169 -31 -314 279
4035B79J8m99M07j8l06J53J86k36m48M13j8P5J70O0l11K8J20j75q7K34m6j79J78
$$ 279 297 -202 205 187 -119 34 220 -16 -464 -51 -69 6 176 236 -75 -47 73 -102 -189 45 -1 -180 -2
4058bK25l16r4K56j25q2R1L00p46N31R2l31K36K02l87K6L21j33k46J90j21k10
$$ -2 223 -93 -187 69 -56 -138 -47 253 -493 38 130 -201 35 237 -150 -124 197 64 -182 8 -113 -323
4080c23J07L25j59jL39j86m04J38J97j05L1K58l53j13K90k33J63K31p2m18J70
$$ -323 -216 109 -50 -51 288 102 -302 -164 33 -72 -41 217 -136 -249 41 -192 -29 202 130 -288 -118
4101a18L44k47k84N97n95K55N56m03l39M56k54k16M01J17l71Q8K48j53p9L41m23
$$ -118 226 -21 -305 292 -303 -48 508 105 -234 222 -32 -248 153 270 -101 -13 235 82 3 344 -79
4122g9k22L97K03k76K96K7n80o7N43l43J18r8L50l3k84j51r0J60L39n64J6M46
$$ -79 -301 96 299 23 319 346 -234 -301 242 -101 17 -81 269 236 -48 -199 -289 -129 210 -354 -338 108
4144A08j21P4K5l1j53L4Q9rpk7J23n7R1j17l61J94L57j30j62J60R6j65O5j05k35
$$ 108 -13 61 86 55 -98 -64 25 16 9 -18 105 48 139 22 -339 -145 212 82 -80 80 176 11 76 -29 -264
4169b64J58L16m29P9J30J79l62J60q7k65L63J40l41K9L08R1j48J93l77j00N84
$$ -264 -106 210 -219 -140 -10 169 -193 -33 -120 -385 -22 118 -223 -194 114 205 57 250 -127 -227 357
4190C57n34Ol7K73n1L5R9p7l75K72K47n67n2N45m44N00l13P1j08K52Kk54J50J03
$$ 357 -177 -171 -208 65 14 49 148 71 -304 -32 215 -352 -404 141 -303 197 -116 -45 -153 99 101 -153 -3 100
4214A00K6j37L0on79N36L8j98K43J11l15K66L16n93J12M34l87m6O2K19k68NL01
$$ 100 126 -11 19 13 -566 -30 8 -190 53 164 -151 115 431 -162 -50 384 -3 -49 13 232 -36 -31 270
4237B70k80n7N6j10k21N53k90j4J35J83o2k06L46n37J0M23k21l81O48j94l81M08
$$ 270 -10 -67 -11 -121 -342 211 -79 -93 42 225 163 -43 303 -234 -224 199 -22 -403 245 51 -330 78
4259G8J66l65J37K05k83l47P99l90m29M07J65k31J24O3q9k09K98j49j10O3L77
$$ 78 244 -121 16 221 -62 -409 390 0 -429 -22 143 -88 36 99 10 -199 99 -50 -160 -97 280
4280B80m39K88p9l63J72K03l8r0J87ok70J59J44k17M01k15k14J68K27m19K3q7
$$ 280 -159 129 50 -313 -141 62 24 -66 121 115 -155 4 148 -69 332 117 -97 71 298 -121 -98 -185
4302a85M66l02J27j35m9K96l3m96RK67J23l30O13k36q0R3kj16j59J87l20M72j37
$$ -185 281 -21 106 -29 -78 218 185 -311 -302 -35 88 -242 371 135 55 148 146 30 -129 58 -262 210 73
4325G3p8L9K09K74o77Q1J53m0n52M94J17l50K45Mk69K66P1k06J17K5J73l22L96
$$ 73 -5 34 243 517 -160 -79 74 34 -518 -24 93 -257 -12 -8 -277 -11 60 -146 -29 -4 169 -153 243
4348B43n70K97J79k92O6J13K04j92o4M4q0j30R2K0J28J46k0o0j55K51k82N7m5
$$ 243 -327 -30 149 -143 -77 36 240 48 -16 28 -52 -182 -90 -70 58 204 184 124 -31 220 -62 -5 -50
4371e0q3K63l28L05j09J15o5K1k34J53K57m27J55l6R8k42K33k7r1K62j76m02P20
$$ -50 -133 130 -198 107 -2 113 48 69 -165 -12 245 -182 -27 -63 35 -207 26 -1 -92 170 -6 -408 312
4394C12k32j40J67O6k0k65K52k32k05M05pj61Q2kP8j21J57l29q1M90q3k89J86
$$ 312 80 -60 107 173 153 -112 140 -92 -297 108 101 -60 22 20 98 -23 134 -195 -276 214 131 -158 28
4417B8J82j58j18K07K87p12K50K35m33J25N7j42K76r1L4j21J70j76j21J73K43
$$ 28 210 52 -66 141 428 -284 -34 201 -232 -107 -50 -192 84 -7 27 -94 76 -100 -221 -48 195
4438A95k36J56R6l20K80k55J75j80J32J36l27J77o0%K0L6M8P5J61n81L03j63L37
$$ 195 -41 115 211 -109 171 -84 91 -89 43 179 -148 29 -31 -31 -11 25 73 148 309 -272 31 -132 205
4461B05l74J19J31j79k22M62Q5j16nk56J4L04J20m14k46N74p7k65K20l50K01j70
$$ 205 -169 -50 81 -98 -320 142 227 111 106 -150 -136 168 288 -126 -372 202 125 -140 80 -270 -69 -239
4483b39L26j39K86K1n5k03k89K98j84J06K15j95L1J58j69J17q2kP2l82J53K10
$$ -239 87 -52 234 255 200 -3 -292 6 -178 -72 143 -52 -21 137 -32 85 3 1 73 -309 -156 54
4505E4j34K71l80J12M6j22J14J33l3k41J74O9J95j28j85j02J59K72j44k90K39
$$ 54 -80 191 -189 -77 -31 -153 -39 94 61 -180 -6 63 258 130 -55 -157 2 274 130 -160 79
4526G9p3j69K61j15q3n1L01o6k18N1J71Pk01Q7j38j8K12m7j00K27j06k12K27Q2
$$ 79 6 -163 98 -17 -100 -151 150 84 -134 -83 88 95 -106 -19 -157 -175 37 -10 -110 117 11 -201 26 108
4550A08j79j55L17j69j3J68Jk29K62n9o1j41j04K82j91K58j53R9R5l54M4J05J46
$$ 108 -71 -226 91 -78 -91 77 78 -151 111 52 -9 -150 -254 28 -163 95 -58 41 136 -218 -174 -69 77
4573G7k81K44K36k80MK99l22k39K92j46J00j40L11k61J01P8R8l28L73j35k08J58
$$ 77 -204 40 276 -4 0 299 -23 -262 30 -116 -16 -156 155 -106 -5 73 171 -157 216 81 -127 31
4595C1K05m02J17L49k50k29K7N9j23K48j03n2P0J13j81L07k01n4M13k81J63k24
$$ 31 236 -166 -49 300 50 -179 -152 -93 -216 32 -71 -123 -53 60 -121 186 -15 -69 344 63 226 2
4617BJ15J04l49J00j67K13KK35k62k4Q5J14q5l49K14j24j83L09j36L34R5j36k22
$$ 2 117 221 -128 -28 -195 18 20 255 -7 -31 54 168 83 -266 -52 -176 -359 -50 -186 148 243 107 -115
4640a15J20k8k3J7R7k19l7L71m00O2J30K54n55J37N47j82j98L5K45l55K14k00
$$ -115 5 -23 -46 -29 68 -151 -188 183 -217 -155 -25 229 -326 -189 358 176 -22 13 258 -97 117 -83
4662h3j1L08k25o7n5K16j66J40m00M89m15M44k33J04j8Q1n4j73Pn3K95P7j37k35
$$ -83 -94 214 -11 -78 -133 83 -83 57 -343 146 -269 175 -58 46 28 109 55 -118 -111 -164 131 208 71 -164
4686a64J44P8P9k26J66q9j92K55k2o6J29j92L35o59O46l42M1J0K43l87P4K63N9
$$ -164 -20 58 137 -89 77 -12 -204 51 29 -37 92 -100 235 -424 222 -120 -79 -69 174 -213 -139 124 183
4709A83l36M57m20J19J22j50j72L11k2j00l14K29L99m61J44K3J1r1J62m1J61j99
$$ 183 -153 304 -116 3 125 -25 -197 114 92 -8 -322 -93 306 -155 -11 12 23 -68 94 53 214 15
4731A5j58K20K48L0l34j00j04L50j51L55n79K40k1k05L18N3p4k06L16j16j55M30
$$ 15 -143 77 325 355 21 -79 -183 167 16 371 -208 32 11 -194 124 177 103 -103 213 97 -58 372
4753C72o03J82j37M14r7k19J66j56jN6J54j33RK51l99J26K63k13N8K5K63l79q8
$$ 372 -231 -49 -186 228 131 -88 78 -78 -79 -23 131 -2 7 258 -141 -15 248 35 93 118 381 2 -86
4776h6M07k77n6J12L2k56K13j73n7K24p4k23J21J21j7j20K36k8j77J01J67l79
$$ -86 321 44 -12 100 132 -124 89 -84 -141 83 9 -214 -93 28 11 -109 127 99 -78 23 190 -189
4798a89K7J35J9j72M5L9L09j86j43L0L56l88j20J62J55j0j53J99j28j35O2K1N1
$$ -189 -162 -27 -8 -180 -135 -96 213 27 -116 -86 270 -118 -238 -76 79 69 -84 115 -13 -148 -86 -65 -14
4821a4K14j77m1l2J84p5m19N73k40J41j02J26o8k12L5K16l62L51o2k18MK2k7K31
$$ -14 200 23 -18 -50 134 59 -360 213 -27 114 12 138 70 -142 -107 109 -253 98 36 -182 -178 -156 -183 48
4845D8o9L06l66J94o9j37L31k66pK23k82k2J9K20r0j19q4K53l0K0L9k36J23j6
$$ 48 -21 285 -81 113 44 -93 238 -28 -35 188 -94 -116 -97 123 33 -86 -170 83 53 73 112 -124 -1 -17
4869a7j44J92j64L4R2J74o1K39l37j9J17j05J46J00l70L45j52j63j77L43Jj80
$$ -17 -161 31 -133 -99 -7 167 106 345 8 -11 106 1 147 247 -123 222 70 -93 -270 73 74 -106
4891a06K25j53J41Lj70P7j71P3j34L80j01j13P7k1J58k52K07q6Q4r6m8k03K90
$$ -106 119 -34 107 110 -60 17 -154 -81 -215 165 64 -49 28 7 165 -87 120 34 118 22 -26 -229 61
4914F1k6j19q9K31L9k92J36Q9L1k52L47k12J75oK8p8j83R3N3J34k26j91J01K57
$$ 61 35 -84 -173 58 97 -195 -59 30 61 -191 156 -56 119 113 141 63 -120 -27 26 160 -66 -257 -156 101
4938A01k9l34L93j98k43M80j86P3k17jL49j18k90J34J23K0K2j04J22k71k2J65
$$ 101 72 -262 131 -67 -310 170 -16 57 -160 -161 188 70 -220 -86 37 57 79 -25 97 -174 -196 -31
4960c1L61n43J15q4M83k64k25L54l92K30K11l59j52L06K01k97J60r0j32r4M37
$$ -31 330 -213 -98 -182 301 37 -188 166 -226 4 215 -144 -296 10 211 -86 74 -16 -148 -242 195
4981A95p0j15J58o3j82J03k46J76K07p5q5j90N7K18l7j85K52j66K54k42J19k9
$$ 195 125 10 168 105 -77 26 -220 -44 163 88 3 -187 -130 88 51 -134 118 -48 206 -36 83 54
5003E4J98k05k50J59N0j63P6K05j26M3o4l12J69K78Q8l4k80J78M6k81K99j14N
$$ 54 252 47 -203 -44 6 -157 -81 124 -2 41 -23 -335 -166 112 200 166 -114 64 110 -171 128 14 19
5026A9K18r1j19j26R7j16o3J50j8Q7oJ23n7nl05J65J12l4p2n6j64K74J30j37J58
$$ 19 237 146 27 -99 -2 -118 -181 -31 -49 38 32 155 98 93 -212 -47 65 31 -41 -97 -261 13 143 6 164
5051A64j54m4Lj48K10L8k49N0OQ0o0M11m18kJ01J64j48n1n3J78L8j2o8o1j77L61
$$ 164 10 -34 -31 -179 31 69 -180 -130 -124 -44 -104 307 -111 -113 -12 152 4 -47 -100 78 116 104 36 -25 -202 159
5077A59k1r6n9j47N00k35p1k15L09j03N6k06K55j74k20J09J41j15J69m3J36N3
$$ 159 138 42 -17 -164 336 101 30 -185 124 21 77 -129 126 -48 -268 -159 -18 -133 36 -7 129 182
5099A82J6k77J16L0j42k5L98j20k19R0j8Qj59J31Ok67L58K0l08L13k13J76J22
$$ 182 198 -79 37 67 -75 -100 298 178 -41 49 31 39 -120 11 17 -250 108 128 -180 133 -80 96 218
5122B18k05k22L02j93K34j66j35M53m9m44K71j03K91k35J78k71J67k58M7K94j71
$$ 218 13 -209 93 -100 134 -32 -167 286 237 -207 64 -39 252 17 195 -76 91 -167 -120 174 3
5143Ck62L04r2Q9P2j55J64l2j80q2J02L6M11l01j84k7K85k99J70MR4l67K98k25
$$ 3 -259 45 -47 42 114 -41 123 91 -89 -171 -69 -33 378 77 -107 -134 151 -148 22 26 120 -247 51 -174
5167a74J05r1%n3K38j51J12J56j88l0Q6N8j82n7J89j00K10Jm93M87nk89J01K14
$$ -174 -69 -160 -160 -213 25 -126 -14 142 -46 -76 10 68 -114 -171 18 -82 128 129 -364 123 118 -171 -70 144
5191A44J62m59j17L41q6J69j08k89K82j11J61p4J90pl91K62j87L9M5J92j02k39
$$ 144 306 -153 -270 71 -15 154 46 -243 39 -72 89 15 205 198 -193 69 -118 -79 -34 158 56 -183
5213a83R4J24P4LM6O1j34Jj88l5J41J04j66M7j58M9K72p9k83M30j45k49j6R0K57
$$ -183 -89 35 109 112 158 219 85 86 -102 -137 4 108 -58 -11 -169 -120 152 73 -210 220 75 -174 -190 -100 157
5238A57k62M7k2q5J3K31P4j45J47j03K65l35j30M02m36l3J91J03rj12j05l12M50
$$ 157 -105 -58 -80 -165 -152 79 153 8 155 52 317 -18 -148 254 -182 -215 -24 79 70 -42 -147 -459 -9
5261iQ7j56R4Q2j71j28K08p1rk1K38j91OK24k37J19%j08j34K72n5j91O5J64q6
$$ -9 78 -78 16 98 -73 -201 7 -64 -73 -94 144 -47 -41 183 -54 65 65 -43 -177 95 40 -151 -86 78 -8
5286hj0p4q8L63Pk12R1j64K62k70L5j78K67Q5j22l41K90P5M4j64r1J09O6N5j37
$$ -8 -18 -92 -180 183 190 -22 69 -95 167 -103 -68 -246 21 106 -16 -357 -67 8 52 -112 -203 -94 -28 27 -110
5311a10J55J74q9k34o6N4p5L78R5j30j25J90j90Q8k85L21j39o6K07k14L59j62
$$ -110 45 219 130 -104 -170 -116 -191 187 282 152 27 217 27 115 -170 151 12 -54 153 -61 298 136
5333A36k38j39O03l38N4J78j45k53Q5P2k15J55K82k6k83K56L2l45R8J48j67j39
$$ 136 -102 -241 362 24 78 256 111 -142 -57 15 -200 -45 237 211 -72 184 216 -129 -31 117 -50 -189
5355a89L01j89J20J63P9k02k28K24J9q9K30m30L36k40n7O9o7J0J45j2j41M3k6
$$ -189 112 -77 43 206 285 83 -145 79 98 9 239 -191 145 -95 -152 -83 -150 -140 5 -7 -148 -105 -131
5378a31M9K44Rk09J29n4R5M4l29K76jm7oj6q8N4k49K19J0k3L17l74K4M5n7L00
$$ -131 -82 162 171 -38 91 37 132 176 -153 123 122 75 69 53 -35 19 -230 -11 -1 -24 293 -81 -57 -12 -69 231
5404B31k35m3j4K2J89K8j5nM7o7j84J3J97l39J92k49K37J58k61P1j4j11P6M8K9
$$ 231 -4 -47 -61 -39 150 178 163 158 205 138 -46 -33 164 -175 17 -232 5 163 -98 -27 -41 -152 -76 -28 1
5429Aj77l84M00j6K14o4L4pm4J29J06o0k83l12N19J26j42k57J93RJj68K14O9n7
$$ 1 -176 -560 -160 -176 38 -26 8 1 -43 86 192 132 -151 -463 56 182 40 -217 -24 -15 -14 -182 32 101 44
$$ [...]
8191a01
##END NTUPLES=NMR FID
##END=
