##TITLE=1H_Pr 3185-1
 200.13MHz, CDCl3,
 24 sc
 
 14.1.2025
##JCAMPDX= 6.0         $$ Bruker NMR JCAMP-DX V2.0
##DATA TYPE= NMR FID
##DATA CLASS= NTUPLES
##ORIGIN= UXNMR, Bruker Analytische Messtechnik GmbH
##OWNER= pz
$$ XWIN-NMR		Version 3.5
$$ Tue Jan 14 16:22:36 2025 Russian Standard Time (UT+4h)  she@DPX200
##.OBSERVE FREQUENCY= 200.1312
##.OBSERVE NUCLEUS= ^1H
##.DELAY= (6, 6)
##.ACQUISITION MODE= SIMULTANEOUS
##.ACQUISITION SCHEME= undefined
##.AVERAGES= 8
##.DIGITISER RES= 18
##SPECTROMETER/DATA SYSTEM= spect
##.PULSE SEQUENCE= zg30
##.SOLVENT NAME= CDCl3
##.SHIFT REFERENCE= (INTERNAL, CDCl3, 0, 14.3821)
##AUDIT TRAIL= $$ (NUMBER, WHEN, WHO, WHERE, WHAT)
$$ ##TITLE= Audit trail, XWIN-NMR		Version 3.5
$$ ##JCAMPDX= 5.01
$$ ##ORIGIN= Bruker BioSpin GmbH
$$ ##OWNER= she
$$ F:/spectra/data/she/nmr/H-C/1/audita.txt
$$ ##AUDIT TRAIL=  $$ (NUMBER, WHEN, WHO, WHERE, WHAT)
(   1,<2025-01-14 16:21:20.28 +0400>,<she>,<DPX200>,
      <created by zg, POWCHK disabled, PULCHK disabled
       configuration hash MD5:
       00 E9 B6 7A A2 85 ED C7 34 08 36 98 17 FE 4E 26
       data hash MD5: 16K
       C6 A0 5C 73 E7 56 8B 4A 10 51 9F 17 43 8C 7C AA>)
$$ ##END=
$$ 
$$ hash MD5
$$ B6 8C 2B 0F E1 DB ED 37 E3 E1 27 7B 49 28 BE EF
##$RELAX= 
##$RELAX= 
##$RELAX= 
##$RELAX= 
##$RELAX= 
##$RELAX= 
$$ Bruker specific parameters
$$ --------------------------
##$DU= <F:/spectra>
##$EXPNO= 1
##$NAME= <H-C>
##$PROCNO= 1
##$TYPE= <nmr>
##$USER= <she>
##$AMP= (0..31)
100 100 100 100 100 100 100 100 100 100 100 100 100 100 100 100 100 100 
100 100 100 100 100 100 100 100 100 100 100 100 100 100 
##$AQSEQ= 0
##$AQ_mod= 1
##$AUNM= <au_zg>
##$AUTOPOS= <>
##$BF1= 200.13
##$BF2= 200.13
##$BF3= 200.13
##$BF4= 200.13
##$BF5= 200.13
##$BF6= 200.13
##$BF7= 200.13
##$BF8= 200.13
##$BYTORDA= 1
##$CFDGTYP= 0
##$CFRGTYP= 5
##$CHEMSTR= <none>
##$CNST= (0..31)
1 1 145 1 1 1 1 1 1 1 1 1 1 1 1 1 1 1 1 1 1 1 1 1 1 1 1 1 1 1 1 1 
##$CPDPRG= <>
##$CPDPRG1= <>
##$CPDPRG2= <>
##$CPDPRG3= <>
##$CPDPRG4= <mlev>
##$CPDPRG5= <mlev>
##$CPDPRG6= <mlev>
##$CPDPRG7= <mlev>
##$CPDPRG8= <mlev>
##$CPDPRGB= <>
##$CPDPRGT= <>
##$D= (0..31)
0 0.7 0 0 0 0 0 0 0 0 0 0.03 0 0 0 0 0 0 0 0 0 0 0 0 0 0 0 0 0 0 0 0 
##$DATE= 1736857279
##$DBL= (0..7)
120 120 120 120 120 120 120 120 
##$DBP= (0..7)
150 150 150 150 150 150 150 150 
##$DBP07= 0
##$DBPNAM0= <>
##$DBPNAM1= <>
##$DBPNAM2= <>
##$DBPNAM3= <>
##$DBPNAM4= <>
##$DBPNAM5= <>
##$DBPNAM6= <>
##$DBPNAM7= <>
##$DBPOAL= (0..7)
0.5 0.5 0.5 0.5 0.5 0.5 0.5 0.5 
##$DBPOFFS= (0..7)
0 0 0 0 0 0 0 0 
##$DE= 6
##$DECBNUC= <off>
##$DECIM= 32
##$DECNUC= <off>
##$DECSTAT= 4
##$DIGMOD= 1
##$DIGTYP= 9
##$DL= (0..7)
0 120 120 120 120 120 120 120 
##$DP= (0..7)
150 150 150 150 150 150 150 150 
##$DP07= 0
##$DPNAME0= <>
##$DPNAME1= <>
##$DPNAME2= <>
##$DPNAME3= <>
##$DPNAME4= <>
##$DPNAME5= <>
##$DPNAME6= <>
##$DPNAME7= <>
##$DPOAL= (0..7)
0.5 0.5 0.5 0.5 0.5 0.5 0.5 0.5 
##$DPOFFS= (0..7)
0 0 0 0 0 0 0 0 
##$DQDMODE= 0
##$DR= 18
##$DS= 0
##$DSLIST= <SSSSSSSSSSSSSSS>
$$ [...]
##$SUBNAM0= <"">
##$SUBNAM1= <"">
##$SUBNAM2= <"">
##$SUBNAM3= <"">
##$SUBNAM4= <"">
##$SUBNAM5= <"">
##$SUBNAM6= <"">
##$SUBNAM7= <"">
##$SUBNAM8= <"">
##$SUBNAM9= <"">
##$SW= 18.0517418723606
##$SWIBOX= (0..15)
0 0 2 0 0 0 0 0 0 0 0 0 0 0 0 0 
##$SW_h= 3612.71676300578
##$TD= 16384
##$TD0= 1
##$TE= 0
##$TE2= 300
##$TE3= 300
##$TEG= 300
##$TL= (0..7)
0 120 120 120 120 120 120 120 
##$TP= (0..7)
150 150 150 150 150 150 150 150 
##$TP07= 0
##$TPNAME0= <>
##$TPNAME1= <>
##$TPNAME2= <>
##$TPNAME3= <>
##$TPNAME4= <>
##$TPNAME5= <>
##$TPNAME6= <>
##$TPNAME7= <>
##$TPOAL= (0..7)
0.5 0.5 0.5 0.5 0.5 0.5 0.5 0.5 
##$TPOFFS= (0..7)
0 0 0 0 0 0 0 0 
##$TUNHIN= 0
##$TUNHOUT= 0
##$TUNXOUT= 0
##$USERA1= <user>
##$USERA2= <user>
##$USERA3= <user>
##$USERA4= <user>
##$USERA5= <user>
##$V9= 5
##$VALIST= <valist>
##$VCLIST= <CCCCCCCCCCCCCCC>
##$VD= 0
##$VDLIST= <DDDDDDDDDDDDDDD>
##$VPLIST= <PPPPPPPPPPPPPPP>
##$VTLIST= <TTTTTTTTTTTTTTT>
##$WBST= 1024
##$WBSW= 4
##$XGAIN= (0..3)
0 0 0 0 
##$XL= 0
##$YL= 0
##$YMAX_a= 163109
##$YMIN_a= -240698
##$ZGOPTNS= <>
##$ZL1= 120
##$ZL2= 120
##$ZL3= 120
##$ZL4= 120
##$ABSF1= 10
##$ABSF2= 0
##$ABSG= 5
##$ABSL= 3
##$ALPHA= 0
##$AQORDER= 0
##$ASSFAC= 0
##$ASSFACI= 0
##$ASSFACX= 0
##$ASSWID= 0
##$AUNMP= <proc_1d>
##$AZFE= 0.1
##$AZFW= 0.1
##$BCFW= 1
##$BC_mod= 2
##$BYTORDP= 1
##$COROFFS= 0
##$CY= -3
##$DATMOD= 1
##$DC= 2
##$DFILT= <>
##$DTYPP= 0
##$F1P= 0
##$F2P= 0
##$FCOR= 0.5
##$FTSIZE= 0
##$FT_mod= 4
##$GAMMA= 1
##$GB= 0.15
##$INTBC= 1
##$INTSCL= 1
##$ISEN= 128
##$LB= 0.25
##$LEV0= 0
##$LPBIN= 0
##$MAXI= 10000
##$MC2= 0
##$MEAN= 0
##$ME_mod= 0
##$MI= 1.114404
##$NCOEF= 0
##$NC_proc= 0
##$NLEV= 6
##$NOISF1= 3.799351
##$NOISF2= 2.8
##$NSP= 1
##$NTH_PI= 0
##$NZP= 0
##$OFFSET= 14.38212
##$PC= 1
##$PHC0= 248.5649
##$PHC1= 9.19222
##$PH_mod= 1
##$PKNL= yes
##$PPARMOD= 0
##$PSCAL= 0
##$PSIGN= 0
##$REVERSE= no
##$SF= 200.129724274929
##$SI= 16384
##$SIGF1= 3
##$SIGF2= 2
##$SINO= 400
##$SIOLD= 16384
##$SREGLST= <1H.CDCl3>
##$SSB= 0
##$STSI= 0
##$STSR= 0
##$SW_p= 3205.1282051282
##$SYMM= 0
##$S_DEV= 0
##$TDeff= 0
##$TDoff= 0
##$TI= <>
##$TILT= no
##$TM1= 0
##$TM2= 0
##$TOPLEV= 0
##$USERP1= <user>
##$USERP2= <user>
##$USERP3= <user>
##$USERP4= <user>
##$USERP5= <user>
##$WDW= 1
##$XDIM= 8192
##$YMAX_p= 0
##$YMIN_p= 0
$$ End of Bruker specific parameters
$$ ---------------------------------
##NTUPLES= NMR FID
##VAR_NAME=  TIME,          FID/REAL,        FID/IMAG
##SYMBOL=    X,             R,               I
##VAR_TYPE=  INDEPENDENT,   DEPENDENT,       DEPENDENT
##VAR_FORM=  AFFN,          ASDF,            ASDF
##VAR_DIM=   8192,          8192,            8192
##UNITS=     SECONDS,       ARBITRARY UNITS, ARBITRARY UNITS
##FACTOR=    0.0002768,     1,               1
##FIRST=     0,             0,               0
##LAST=      2.2672688,     0,               0
##MIN=       0,             -240698,         0
##MAX=       2.2672688,     163109,          0
$$ Real data points
##PAGE= N=1
##DATA TABLE= (X++(R..R)), XYDATA
$$ [...]
$$ plain form
2045 -1921 -23 -576 -1018 777 647 92 1654 1000 -418 949 -207 -1883 -243 -712 -1287 392 248
2062 248 -689 1499 1164 -88 982 727 -1021 171 -720 -1841 -67 235 -1135 750 1087 99 1426
2079 1426 942 -720 284 43 -1676 -876 -237 -1293 449 679 -523 1407 1442 -239 562 292 -1317
2096 -1317 -496 -473 -1573 149 573 -369 921 1417 -209 858 1156 -783 -72 -253 -1973 -485 429
2113 429 -1169 258 1285 182 915 1089 -346 507 346 -1430 -1024 -177 -914 -357 633 -480 530
2130 530 1509 49 572 1241 -932 -677 -124 -1721 -566 572 -547 96 1475 201 520 1195 -266
2147 -266 -151 314 -1085 -1146 86 -702 -401 958 -152 228 1573 -393 203 941 -913 -849 562 -893
2165 -893 -957 862 -218 15 1157 -378 -13 1175 -96 -745 396 -466 -1042 649 -634 -619 979
$$ packed form
2045a921J898n53m42J795j30n55J562o54j418J367j156j676J640m69n75J679j44
2062B48r37K188l35j252J070k55j748J192q91j121J774L02j370J885L37r88J327
2079A426m84j662J004k41j719Q00O39j056J742K30j202J930L5j681Q01k70j609
2096a317Q21K3j100J722M24r42J290M96j626J067K98j939P11j81j720J488R14
2113D29j598J427J027j103P33J74j435Q53j61j776M06Q47p37N57R90j113J010
2130E30R79j460N23O69k173K55N53j597J155J138j119O43J379j274L19O75j461
2147b66J15M65j399o1J232p88L01J359j110L80J345j966N96P38j854O4J411j455
2165h93o4J819j080K33J142j535L65J188j271o49J141q62n76J691j283J5J598
$$ plain form
2182 979 120 -599 731 10 -250 891 -553 -1018 686 -282 -503 809 135 -277 903 30 -575 580
2200 580 -200 -886 440 -471 -613 694 179 -385 885 201 -522 690 -182 -1373 334 -170 -871 694
2218 694 73 -239 1184 35 -736 795 338 -883 386 -61 -1259 274 91 -768 799 588 -227
2235 -227 684 283 -577 498 -195 -1323 97 32 -1099 307 399 -731 789 753 -537 701 535 -736
2253 -736 181 -104 -1046 66 151 -649 587 863 -307 562 676 -392 65 163 -1074 -159 131 -784 269
2272 269 760 -445 522 878 -442 283 395 -945 -358 455 -965 -265 680 -441 121 859 -230 341
2290 341 865 -464 -7 250 -934 8 866 -733 -278 1105 -129 119 774 -409 -26 309 -942 -411
2308 -411 442 -846 -433 930 -428 -151 1323 138 -77 670 -519 -502 626 -850 -858 762 28 190
$$ packed form
2182I79q59p19J330p21k60J141j444m65J704r68k21J312o74m12J180q73o05J155
2200E80p80o86J326r11j42J307n15n64J270o84p23J212q72j191J707n04p01J565
2218F94o21l12J423j149p71J531m57j221J269m47j198J533j83q59J567k11q15
2235b27R11m01q60J075o93j128J420o5j131J406R2j130J520l6j290J238j66j271
2253g36R17k85r42J112Q5q00J236K76j170Q69J14j068M57R8j237R15K90r15J053
2272B69M91j205R67L56j320P25J12j340N87Q13j420P00R45j121N62P38j089N71
2290C41N24j329M57K57j184R42Q58j599M55J383j234K48O55j183L83L35j251N31
2308d11Q53j288M13J363j358K77J474j185k15P47j189J7J128j476qJ620p34J62
$$ plain form
2326 190 1284 -133 28 1389 -482 -406 121 -587 -695 325 -601 -449 967 -8 -146 1318 307 -282
2344 -282 677 -714 -1130 280 -614 -620 747 84 -329 704 86 16 1052 -272 -521 192 -913 -1257 95
2363 95 -454 -405 776 174 -156 1399 608 -288 625 -241 -1133 -238 -553 -1104 458 -15 -405 1154 803
2382 803 82 1202 320 -621 -88 -866 -1751 -73 -123 -482 723 273 241 1395 727 41 697 26 -1286
2401 -1286 -384 -471 -1373 204 162 -435 948 893 -81 850 461 -707 -275 -261 -1527 44 156 -824 473
2420 473 842 200 583 820 -253 63 -320 -961 -492 -147 -1080 -30 1033 -231 832 992 -196 516
2438 516 408 -810 -315 -1 -845 -217 346 -685 331 904 -56 605 891 -360 -181 21 -1067 -590
2456 -590 177 -782 -63 550 -60 229 541 -189 -125 459 -1006 -525 443 -540 -349 586 -442 367 713 -172
$$ packed form
2326A90J094j417J61J361j871P6N27p08j08J020r26J52J416r75j38J464j011n89
2344b82R59j391m16J410q94oJ367o63m13J033o18p0J036j324k49P13j105l44J352
2363I5n49M9J181o02l30J555p91q96R13q66q92Q95l15n51J562m73l90J559l51
2382H03p21J120q82r41N33p78q85J678n0l59J205m50l2J154o68o86O56o71j312
2401a286R02q7r02J577m2n97J383n5r74R31l89j168M32J4j266J571J12r80J297
2420D73L69o42L83K37j073L16l83o41M69L45r33J050J063j264J063J60j188P12
2438E16j08j218M95L14q44O28N63j031J016N73r60O61K86j251J79K02j088M77
2456e90P67r59P19O13o10K89L12p30O4N84j465M81R68r83J91R35j028Q09L46q85
$$ plain form
2476 -172 211 843 -667 -595 -78 -931 -556 542 -280 114 956 26 -18 737 -210 -251 276 -760 -376 364
2496 364 -633 -22 925 81 215 649 59 -208 134 -466 -550 329 -665 -405 724 137 -61 517 -102 -307
2516 -307 596 -301 -810 47 -819 -421 343 57 -153 719 8 -272 492 -161 -574 476 -347 -539 228 -4
2536 -4 -161 844 430 -166 726 -93 -528 256 -263 -909 269 -210 -550 616 379 -196 761 190 -453 379
2556 379 0 -824 12 -161 -438 407 243 -292 946 208 -208 123 -84 -652 67 -265 -591 -33 90 -471
2576 -471 572 1039 92 365 491 -528 -81 -232 -1021 -92 142 -667 603 583 -78 916 523 -366 248
2595 248 -12 -988 -368 -18 -860 121 370 -284 461 657 -420 138 483 -472 -205 -211 -911 -363 418 -392
2615 -392 451 618 -185 328 432 -44 -268 287 -643 -246 249 -544 70 851 82 626 685 -532 207 395
$$ packed form
2476a72L83O32j510P2N17q53L75J098q22L94Q42r30m4P55r47m1N27j036L84P40
2496C64r97O11R47q44J34M34n90k67L42o00q4Q79r94K60J129n87j98N78o19k05
2516c07R03q97n09Q57q66L98P64k86k10Q72p11k80P64o53m13J050q23j92P67k32
2536dj57J005m14n96Q92q19m35P84n19o46J178m79l40J166k37n75R57n71o43Q32
2556C79l79q24Q36j73k77Q45j64n35J238p38m16L31k07n68P19l32l26N58J23n61
2576d71J043M67r47K73J26j019M47j51p89R29K34q09J270k0o61R94l93q89O14
2595B48k60r76O20L50q42R81K49o54P45J96j077N58L45r55K67op00N48P81q10
2615c92Q43J67q03N13J04m76k24N55r30L97M95p93O14P81p69N44N9j217P39J88
$$ plain form
2635 395 -739 -586 1 -600 -148 224 -26 208 879 -26 -293 591 -212 -395 29 -670 -449 437 -305 -75
2655 -75 648 129 199 588 -33 -127 326 -513 -284 441 -388 -241 745 -170 -215 886 -47 -41 638 -265 -369 253
2677 253 -347 -267 341 -430 -154 534 251 -247 595 -111 -157 142 -373 -428 189 -85 -366 535 166 -195 488
2698 488 292 -267 445 48 -295 377 -310 -636 91 -2 -308 41 92 -104 436 275 -385 116 -215 -788 73
2719 73 -8 -304 315 -152 -653 232 198 -691 462 -304 -568 177 -62 -758 549 481 -549 355 276 -85 366
2740 366 243 -387 215 313 -507 251 375 -527 133 -113 -526 256 355 -649 348 261 -541 27 114 -533 243
2761 243 127 -561 -170 241 -266 332 277 -601 313 132 -495 154 272 -358 -121 237 -659 207 411 -484
2781 -484 254 351 -264 -177 531 -326 60 315 -503 -56 75 -511 -12 546 -329 -61 129 -61 126 522 -381
$$ packed form
2635C95j134J53N87o01M52L72k50K34O71r05k67Q84q03j83M24o99K21Q86p42K30
2655g5P23n19P0L89o21r4M53q39K29P25q29J47R86r15m5J101r33OO79r03j04O22
2677B53o00Q0O08p71K76O88k83m98Q42p06m6K99n15n5O17k74k81R01l69l61O83
2698D88j96n59P12l97l43O72o87l26P27r3l06L49N1j96N40j61o60N01l31n73Q61
2719G3q1k96O19m67n01Q85l4q89J153p66k64P45k39o96J307o8j030R04p9l61M51
2740C66j23o30O02R8q20P58J24r02O60k46m13P82R9j004R97q7q02N68Q7o47P76
2761B43j16o88L91M11n07N98n5q78R14j81o27O49J18o30K37L58q96Q66K04q95
2781d84P38R7o15Q7P08q57L86K55q18M47J31n86M99N58q75K68J90j90J87L96r03
$$ plain form
2802 -381 -33 285 -329 -285 224 -349 -41 282 -606 250 871 -32 -61 453 -461 -397 95 -249 -407 312 -252
2823 -252 -339 360 113 198 262 18 -323 433 148 -265 444 -213 -218 345 -39 -56 988 108 -364 461 -122 -433
2845 -433 402 -260 -342 151 -288 65 595 -57 -142 570 342 -274 67 -40 -293 295 -106 -91 153 134 -306
2866 -306 686 -104 -228 379 -206 -282 48 -104 -293 -14 -93 -99 394 78 -99 726 -107 -329 76 -145 -613
2887 -613 172 -227 -454 635 56 -224 494 351 -302 496 -66 -524 63 -172 -596 73 -2 -413 11 297
2907 297 -369 365 399 -484 64 91 -735 38 -165 -282 214 127 -196 552 372 -130 91 61 -190 245 -250
2928 -250 -731 -90 392 -202 161 453 -217 248 297 -447 137 247 -785 -60 298 -224 -63 541 -198 203
2948 203 490 -419 105 315 -165 -213 -41 -419 -238 353 -476 209 609 -140 99 304 -394 -41 257 -707
$$ packed form
2802c81L48L18o14M4N09n73L08L23q88Q56O21r03k9N14r14O4M92l44j58P19n64
2823b52q7O99k47Q5O4k44l41P56k85m13P09o57nN63l84j7J044q80m72Q25n83l11
2845d33Q35o62q2M93m39L53N30o52q5P12k28o16L41j07k53N88m01J5K44j9m40
2866c06R92p90j24O07n85p6L30j52j89K79p9oM93l16j77Q25q33k22M05k21m68
2887f13P85l99k27J089n79k80P18j43o53P98n62m58N87k35m24O69p5m11M24K86
2907B97o66P34L4q83N48K7q26P73k03j17M96q7l23P48j80n02K21l0k51M35m95
2928b50m81O41M82n94L63K92o70M65M9p44N84J10j032P25L58n22J61O04p39M01
2948B03K87r09N24K10m80m8J72l78J81N91q29O85M00p49K39K05o98L53K98r64
$$ plain form
2968 -707 -187 -57 -673 -293 549 -81 57 482 -99 122 313 -529 -281 86 -354 -173 542 -149 -93 500
2988 500 -25 -54 621 -203 -80 304 -175 -257 441 -405 -311 487 84 121 548 6 -168 157 -213 -234 135 -300
3010 -300 -278 204 51 -200 568 140 -373 569 -146 -265 368 43 -170 417 -79 65 219 186 -382 387 -155
3031 -155 -489 237 187 -343 110 238 -241 151 -137 -85 265 -74 -302 268 -113 -367 257 6 -369 305 61
3052 61 -187 445 280 -326 270 300 -577 82 126 -486 195 47 -333 78 205 -592 57 155 -465 -94 61
3073 61 -114 261 216 -338 430 198 -284 -23 -22 -527 189 39 -556 213 220 -365 144 329 -591 349 14 -452
3095 -452 -62 -47 -493 95 42 -175 90 394 -238 82 87 -421 222 21 -518 -73 139 -296 -3 386 -133
3116 -133 93 511 -268 73 -21 -314 -72 19 -478 22 66 11 68 315 181 150 509 -103 -149 158 -565 -230
$$ packed form
2968g07N20J30o16L80Q42o30J38M25n81K21J91q42K48L67m40J81P15o91N6N93
2988E00n25k9O75q24J23L84m79q2O98q46R4P98m03L7M27n42j74L25l70k1L69m35
3010c00K2M82j53k51P68m28n13R42p15j19O33l25k13N87m96J44J54l3n68P69n42
3031a55l34P26n0n30M53J28m79L92k88N2L50l39k28N70l81k54O24k51l75O74k44
3052F1k48O32j65o06N96L0q77O59M4o12O81j48l80M11J27p97O49R8o20L71J55
3073F1j75L75m5n54P68k32m82K61Jn05P16j50n95P69Pn85N09J85r20R40l35m66
3095d52L90J5m46N88n3k17K65L04o32L20Nn08O43k01n39M45K12m35K93L89n19
3116a33K26M18p79L41r4k93K42R1m97N00M4n5N7K47j34l1L59o12m6L07p23L35
$$ plain form
3138 -230 289 -238 86 386 -196 51 440 -228 -170 282 -540 -420 126 -463 -71 497 -363 86 690 27
3158 27 4 107 -170 -566 -32 -263 -275 30 -309 -35 605 -144 68 301 103 -26 115 -224 -303 108 -434
3179 -434 -43 433 137 121 416 85 -285 236 6 -298 246 -295 -353 243 153 -302 649 144 -216 418 -123
3200 -123 -288 -124 -242 -136 262 -156 -231 286 57 -18 341 -16 -257 254 91 -157 -9 -152 -355 264 207
3221 207 -55 513 237 -51 297 19 -477 201 136 -55 146 101 -257 111 59 -325 406 109 -55 -259 -155
3242 -155 -235 22 112 -9 533 64 -106 275 136 -328 -180 156 -336 293 110 -430 -36 151 -70 -30 261
3263 261 -425 62 159 -359 141 158 -435 80 575 -444 224 80 -662 -24 263 33 -94 192 -405 11
3283 11 230 -452 -313 146 -435 -7 187 -451 146 -131 -453 -87 368 -372 -283 114 -225 -118 464 -379 -174
$$ packed form
3138b30N19n27L24L00n82K47L89o68N8M52q22J20N46n89L92N68q60M49O04o63
3158B7k3J03k77l96N34k31j2L05l39K74O40p49K12K33j98j29J41l39p9M11n42
3179d34L91M76k96j6K95l31l70N21k30l04N44n41n8N96r0m55R51n05l60O34n41
3200a23j65J64j18J06L98m18p5N17k29p5L59l57k41N11j63k48J48j43k03O19n7
3221B07k62N68k76k88L48k78m96O78o5j91K01m5l58L68n2l84P31k97j64k04J04
3242a55q0K57R0j21N42m69j70L81j39m64J48L36m92O29j83n40L94J87k21M0K91
3263B61o86M87R7n18N00J7n93N15M95j019O68j44p42O38K87k30j27K86n97M16
3283A1K19o82J39M59n81M28J94o38N97k77l22L66M55p40Q9L97l39J07N82q43K05
$$ plain form
3304 -174 298 -104 -246 447 22 -109 289 -74 342 356 -316 -358 -41 -311 -30 374 -265 -146 12 -341 -2
3325 -2 446 31 -384 152 -178 -154 404 -419 71 317 -213 53 155 230 -244 327 -261 -103 156 -14 -345
3346 -345 0 -189 -105 238 92 -225 509 -80 -442 189 -272 -285 317 -129 -105 339 79 -60 116 198 21
3367 21 207 -169 -305 -36 36 -137 124 215 -294 510 -42 -283 499 -141 -163 72 -42 -195 76 -213 -269 115
3389 115 196 -205 197 36 -212 206 268 -303 -168 -83 -409 359 -52 -172 473 98 -150 219 172 -300 -36
3410 -36 3 -432 170 -60 -292 69 140 -224 249 327 110 -66 213 -441 133 77 -332 -167 190 -265 -70 -32
3432 -32 -175 123 83 -338 -257 112 -461 -125 101 -256 199 158 -300 100 1 20 122 135 -70 -196 -158 -243 -176
3455 -176 362 97 -40 349 -20 106 139 -231 141 -86 -178 -174 -151 -310 106 181 -28 251 357 -272 151 117
$$ packed form
3304a74M72m02j42O93m25j31L98l63M16J4o72m2L17k70K81M04o39J19J58l53L39
3325bM48m15m15N36l30K4N58q23M90K46n30K66J02P5m74N71n88J58K59j70l31
3346c45L45j89Q4L43j46l17P34n89l62O31m61j3O02m46K4M44k60j39J76Q2j77
3367B1J86l76j36K69P2j73K61R1n09Q04n52k41P82o40k2K35j14j53K71k89n6L84
3389A15Q1m01M02j61k48M18O2n71J35Q5l26P68m11j20O45l75k48L69m7m72K64
3410c6L9m35O02k30k32L61P1l64M73P8k17j76K79o54N74n6m09J65L57m55J95L8
3432c2j43K98m0m21Q1L69n73L36K26l57M55m1m58M00r9J9J02J3k05j26L8q5O7
3455a76N38k65j37L89l69J26L3l70L72k27r2MK3j59M16P5k09K79J06o29M23l4
$$ plain form
3477 117 -117 -184 2 -346 38 339 116 -16 -14 -168 -25 123 -350 -205 168 -183 -181 22 11 -218 334 61
3499 61 -174 252 41 -134 307 -126 -210 158 -211 -346 255 -35 -73 121 -83 82 51 108 -280 459 119 -162
3521 -162 19 -293 -365 166 54 273 183 330 73 324 -129 -270 269 20 -279 176 -11 -107 14 131 -355
3542 -355 254 46 -336 1 6 -46 16 -20 -344 163 -212 -294 321 65 -111 -18 90 -256 18 -93 -172 -60 -163
3565 -163 -496 220 155 -216 121 0 -182 52 33 -481 30 61 -200 -74 126 -55 204 194 -330 259 47
3586 47 -375 -82 256 -297 194 43 105 -14 90 -220 -67 137 -29 228 84 -150 38 408 -231 -161 119
3607 119 -106 176 65 -105 71 138 35 287 219 42 -130 386 -217 -165 -92 -252 -123 81 98 61 138 -177
3629 -177 179 252 -257 -204 -8 -113 -12 252 -87 -220 39 -212 -137 218 -59 96 52 -176 -110 182 -67 -428
$$ packed form
3477A17k34o7J86l48L84L01k23j32Kj54J43J48m73J45L73l51KK03j1k29N52k73
3499F1k35M26k11j75M41m33q4L68l69j35O01k90l8J94k04J65l1N7l88P39l40k81
3521a62J81l12p2N31j12K19r0J47k57K51m53j41N39k49k99M55j87r6J21J17m86
3542c55O09k08l82L37Nn2O2l6l24N07l75q2O15k56j76R3J08l46K74j11p9J12j03
3565a63l33P16o5l71L37j21j82K34j9n14N11L1k61J26K00j81K59j0n24N89k12
3586D7m22K93L38n53M91j51O2j19J04l10J53K04j66K57j44k34J88L70o39P0K80
3607A19k25K82j11j70J76O7j03K52o8j77j72N16o03N2P3j60J29K04J7l7P7l15
3629a77L56P3n09N3J96j05J01K64l39j33K59k51P5L55k77J55m4k28O6K92k49l61
$$ plain form
3651 -428 175 -83 43 562 26 148 149 -229 -485 -163 182 -72 38 -272 56 384 61 216 473 143 -101
3672 -101 183 -182 -151 164 89 -297 -21 45 -431 275 50 22 134 -34 -392 -54 39 -254 61 -7 -139 168
3694 168 -54 116 503 1 39 102 -135 -166 148 34 -141 220 27 72 -178 16 168 291 -124 -481 -18
3715 -18 -36 -519 -22 155 -107 266 151 -145 452 196 -284 -198 12 -140 -81 -99 -103 303 31 -214 114 249
3737 249 51 48 -178 -361 105 294 12 23 -73 -240 48 169 -39 61 95 -132 64 -102 -112 -206 152 -218
3759 -218 -71 319 133 19 -93 -34 -146 64 -263 79 35 -98 49 90 17 103 196 -232 47 177 -233 -39
3781 -39 148 -158 216 -4 -53 60 -46 -141 -4 148 -13 174 152 -46 -67 172 -66 191 -36 54 -244 123
3803 123 -89 -84 237 42 71 208 -257 -259 92 -404 55 97 105 -507 -32 -220 -93 328 -228 214 203 -90 -35
$$ packed form
3651d28O03k58J26N19n36J22Jl78k56L22L45k54J10l10L28L28l23J55K57l30k44
3672a01K84l65L1L15p5l86K76O6m76P06k25k8J12j68l58L38R3k93L15o8j32L07
3694A68k22J70L87n02L8O3k37l1L14j14j75L61j93M5k50J94J52J23m15l57M63
3715a8j8m83M97J77k62L73j15k96N97k56m80Q6K10j52N9j8mM06k72k45L28J35
3737B49j98lk26j83M66J89k82J1r6j67K88J21k08J00L4k27J96j66j0r4L58l70
3759b18J47L90j86j14j12N9j12K10l27L42m4j33J47M1p3Q6R3m28K79J30m10J94
3781c9J87l06L74k20m9J13j06r5J37J52j61J87k2j98k1K39k38K57k27R0k98L67
3803A23k12NL21j95K9J37m65kL51m96M59M2Qo12M75j88J27M21n56M42j1k93N5
$$ plain form
3826 -35 241 -102 -215 89 -131 -89 -8 -51 85 181 200 -216 47 -318 -94 91 -320 -145 16 -206 -139 195
3848 195 -202 -86 50 -133 -155 245 -46 -222 237 -97 -92 162 341 -182 290 203 110 210 38 -189 99 129
3870 129 -286 259 227 -169 168 72 21 24 199 -237 108 56 -383 66 59 -237 108 149 12 43 219 -331 -48
3893 -48 26 -407 40 225 -9 -108 -77 -303 -115 95 -183 44 219 -406 178 -12 43 -75 52 -254 211 241
3915 241 53 216 87 -135 -419 -162 -5 64 99 -8 -140 112 -222 66 -83 -182 -210 97 -84 74 82 -26
3937 -26 109 241 49 -9 140 -61 -187 323 1 -102 -137 -21 -312 94 18 -104 110 -62 77 201 86
3958 86 -114 147 -95 -280 -19 225 27 174 -33 130 145 -243 25 386 -224 -266 127 80 -189 -137 29 125
3980 125 126 -81 -89 252 58 179 267 2 -167 -97 -117 -198 233 -70 153 -44 -38 -360 127 137 -33 310 -114 72
$$ packed form
3826c5K76l43j13L04k20M2Q1m3J36R6J9m16K63l65K24J85m11J75J61k22O7L34
3848A95l97J16J36j83k2M00k91j76M59l34NK54J79n23M72q7r3J00j72k27K88L0
3870A29m15N45l2l96L37r6n1LJ75m36L45n2m39M49pk96L45M1j37L1J76n50K83
3893d8P4m33M47J85k34r9L1k26J88K10k78K27J75o25N84j90N5j18J27l06M65L0
3915B41j88J63j29k22k84K57J57O9L5j07j32K52l34K88j49r9k8L07j81J58Qj08
3937b6J35J32j92n8J49k01j26N10l22j03l5J16k91M06p6j22K14j72J39J24j15
3958H6k00K61k42j85K61K44j98J47k07J63J5l88K68L61o10m2L93m7k69N2J66R6
3980A25Jk07qL41j94J21Q8k65j69P0k0q1M31l03K23j97Ol22M87J0j70L43m24J86
$$ plain form
4004 72 -104 8 -305 -10 39 -353 52 226 27 445 -182 -546 58 11 -321 133 231 34 147 -62 -8 -93
4026 -93 -78 -139 -84 157 159 265 -78 -73 -122 -56 -172 -232 -70 -209 263 23 185 40 306 -272 109 316 -218 -9
4050 -9 66 -154 -21 4 -110 248 -80 -300 -222 -164 -155 -9 -103 -333 27 55 -121 405 84 -70 353 156 -110
4073 -110 14 73 68 -92 150 -208 90 342 -151 -55 180 -377 -88 -154 -112 -24 141 109 -43 -107 40 180 336
4096 336 -165 -154 153 -134 -5 -160 -302 -131 28 -137 -39 273 126 321 162 -23 163 164 11 -190 -113 -135
4118 -135 -44 -155 147 -22 25 -64 -42 -23 -93 -280 68 -142 228 -231 -88 -132 -20 66 139 -236 36 44 37 -180
4142 -180 6 227 53 -111 -193 -27 -52 416 216 -108 -50 -88 317 -147 -10 14 124 -105 112 138 -9 -35
4164 -35 271 56 -38 92 57 -142 -48 -263 -26 116 -62 -168 -169 -123 -276 92 367 -122 259 70 -230 80
$$ packed form
4004G2j76J12l13K95M9l92M05J74j99M18o27l64O04m7l32M54R8j97J13k09N4q5
4026i3J5o1N5K41KJ06l43Nm9O6j16o0J62j39M72k40J62j45K66n78L81K07n34K09
4050iP5k20J33K5j14L58l28k20P8N8RJ46r4k30L60K8j76N26l21j54M23j97k66
4073a10J24N9nj60K42l58K98K52m93R6K35n57K89o6M2Q8J65l2j52o4J47J40J56
4096C36n01J1L07k87J29j55j42J71J59j65R8L12j47J95j59j85J86Jj53k01P7k2
4118a35R1j11L02j69M7q9K2J9p0j87L48k10L70m59J43m4J12Q6P3l75K72Qpk17
4142a80J86K21j74j64q2J66k5M68k00l24N8l8M05m64J37K4J10k29K17K6j47k6
4164c5L06k15r4J30l5j99R4k15K37J42j78j06jM6j53L68K75m89L81j89l00L10
$$ plain form
4186 80 155 -238 265 -44 -119 -87 125 -12 226 9 90 -19 109 19 93 63 -17 13 47 87 -13 7 -87 120 -174
4211 -174 -247 -98 -200 104 105 -35 82 134 172 171 14 264 -20 -11 -57 -186 -92 147 -188 -23 96 -169 95 74
4235 74 -111 108 -145 -75 -61 -47 -155 147 136 -71 -220 173 9 -32 169 221 101 123 31 -109 -100 -177 -71 -47
4259 -47 -112 -117 105 -114 243 -172 -151 34 219 -17 -153 -9 -17 308 -114 225 2 39 -30 69 -196 -120 -274 136
4283 136 -32 -205 275 -56 35 128 49 -4 389 -84 231 87 -121 -43 -49 -22 -393 98 -96 -46 -134 129 35 246
4307 246 33 -256 -78 -141 -159 -18 -310 7 83 -187 -228 101 71 -240 -71 204 -229 -44 -80 -60 -83 -87 133
4330 133 109 36 104 21 -137 96 56 -139 55 -92 50 113 93 -273 51 46 -89 106 -66 251 -297 -248 41
4353 41 -25 59 -97 -246 141 -65 -121 -122 -91 18 -105 -51 24 -19 161 137 -33 29 -182 196 -21 -168 76 68 -95
$$ packed form
4186H0P5l93N03l09p5L2K12j37K38k17Q1j09J28r0P4l0q0L0L4M0j00K0r4K07k94
4211a74p3J49j02L04Jj40J17N2L8jj57K50k84Rm6j29R4K39l35J65J19k65K64k1
4235G4j85K19k53P0J4J4j08L02j1k07j49L93j64m1K01N2j20K2r2j40Rp7J06K4
4259d7o5nK22k19L57m15K1J85J85k36j36J44qL25m22L39k23L7o9R9k65P6j54M10
4283A36j68j73M80l31R1R3p9n3L93m73L15j44k08P8oK7l71M91j94N0q8K63r4K11
4307B46k13k89J78o3j8J41k92L17P6k70m1L29l0l11J69K75m33J85l6K0k3mK20
4330A33k4p3O8q3j58K33m0j95J94j47J42O3k0l66L24nj35J95j72L17n48M9K89
4353D1o6Q4j56j49L87k06n6jL1J09j23N4P5m3J80k4j70O2k11L78k17j47K44qj63
$$ plain form
4378 -95 188 253 358 86 48 -11 115 187 84 49 -208 -288 -9 -131 -267 153 -117 -178 -110 170 -191 15 -115
4401 -115 -338 -218 -49 -261 192 61 -210 323 94 137 -19 -57 50 165 81 232 74 363 -11 161 278
4422 278 -155 17 238 -137 78 80 -25 -83 -51 -193 -148 62 223 -202 -27 -34 65 180 -16 -56 -120 -314 0
4445 0 75 182 136 -72 149 -43 67 231 -67 -18 -85 279 -11 212 -277 -98 77 14 28 245 189 -135 15
4468 15 -9 234 213 -83 -5 12 44 202 -26 50 -16 -130 -32 76 277 20 3 -43 56 252 52 -233 117 -52
4492 -52 -134 -193 178 2 136 10 -6 68 -238 -57 42 373 46 29 -58 -220 200 5 -143 86 60 74 123 -72
4516 -72 -48 -144 62 -33 -116 41 81 -81 -249 28 270 71 -175 -106 267 -125 -77 -44 -35 55 147 -60 54 45 6
4541 6 -233 -166 116 73 7 121 -18 108 -115 229 204 284 -26 -42 -252 60 388 -194 -112 -29 -3 152 97 -33
$$ packed form
4378i5K83O5J05k72l8n9J26P2j03l5k57q0K79j22j36M20k70o1O8K80l61K06j30
4401a15k23J20J69k12M53j31k71N33k29M3j56l8J07J15q4J51j58K89l74J72J17
4422B78m33J72K21l75K15Kj05n8L2j42M5K10J61m25J75pR9J15j96m0o4j94L14
4445@P5J07m6k08K21j92J10J64k98M9o7L64k90K23m89J79J75o3J4K17n6l24J50
4468A5k4K43k1k96P8J7L2J58k28P6o6j14R8J08K01k57j7m6R9J96k00k85L50j69
4492e2q2n9L71j76J34j26j6P4l06J81R9L31l27j7q7j62M20j95j48K29k6J4M9j95
4516g2K4r6K06r5q3J57M0j62j68K77K42j99k46O9L73l92M8L3RR0R2k07J14rl9
4541Fk39O7K82m3o6J14j39J26k23L44k5Q0l10j6k10L12L28n82Q2Q3K6J55n5j30
$$ plain form
4565 -33 148 -7 -12 11 170 -114 -52 264 125 -38 -94 -247 99 -86 33 -163 97 206 -232 -74 -86 158
4587 158 70 14 -75 -119 -48 -138 -6 -187 -82 246 113 -14 -97 -169 26 111 -104 15 211 182 -51 46 -233 51
4611 51 61 -247 -253 175 120 -179 38 91 -29 99 213 -280 73 -181 -222 209 -32 122 -90 -38 92 79 100
4634 100 126 90 -145 -149 187 230 -148 -145 -79 -89 332 -46 216 178 -311 173 76 210 -170 48 108 63 162 -148 -187
4659 -187 37 -102 -28 -162 -182 -7 -113 43 -118 -78 131 39 83 360 20 -217 12 -121 -37 107 -228 -85
4681 -85 -53 -210 148 -235 -68 147 82 63 -134 204 -181 -93 -111 -230 -151 -168 -57 88 75 39 -67 113 71 335
4705 335 16 -399 168 121 -7 -258 -72 128 -186 31 -20 -153 -10 -153 -156 167 -11 146 60 -147 -45 -1
4727 -1 -140 -250 15 -16 7 22 -139 -22 -56 -233 -163 97 4 -153 -20 -50 -8 137 -108 -83 -269 -208 191 -197
$$ packed form
4565c3J81j55nK3J59k84O2L16j39j63n6j53L46j85J19j96K60J09m38J58j2K44
4587A58q8n6q9m4P1r0J32j81J05L28j33j27q3p2J95Q5k15J19J96k9k33R7k79K84
4611E1J0l08oM28n5k99K17N3j20J28J14m93L53k54m1M31k41J54k12N2J30j3K1
4634A00K6l6k35mL36M3l78LO6j0M21l78K62l8m89M84r7J34l80K18O0m5R9l10l9
4659a87K24j39P4j34k0J75j06J56j61M0K09r2M4K77l40k37K29j33Q4J44l35J43
4681h5L2j57L58l83J67K15o5j9j97L38l85Q8j8j19P9j7J11J45j3l6j06J80m2K64
4705C35l19m15N67m7j28k51J86K00l14K17n1j33J43j43lL23j78J57q6k07J02M4
4727aj39j10K65l1K3J5j61J17l4j77P0K60r3j57J33l0M2J45k45K5j86O1L99l88
$$ plain form
4751 -197 49 -131 62 59 -29 315 132 132 -47 1 -94 26 14 -31 125 2 -168 -146 93 -113 34 235 -289
4774 -289 148 64 129 82 77 28 -96 -104 149 -3 -78 292 7 -21 133 259 -217 -261 114 284 -8 -80 21 -83
4798 -83 -129 267 -154 61 145 173 -217 5 370 -81 36 -148 271 166 -120 -73 -21 9 15 146 204 -109 -189 -132
4822 -132 -182 -4 -118 -65 60 -42 98 240 -4 -217 -206 77 -197 357 -3 -263 -55 -237 12 28 -119
4843 -119 -42 395 -46 125 -84 -123 -244 243 -184 251 -41 -172 -28 120 149 5 118 -183 -141 34 185
4864 185 -121 338 -48 65 81 189 -321 -103 -191 35 -89 -28 173 113 113 -113 165 -12 119 59 -34 12 28
4887 28 -8 -210 -71 -10 -42 179 246 -77 -59 -268 -88 39 110 245 106 -194 -275 73 7 -59 -16 150 -12 145
4911 145 277 -14 197 -182 -118 -153 8 -65 -57 205 -131 132 -47 89 51 -7 -89 -18 28 -111 -2 -79 -25 -202
$$ packed form
4751a97K46j80J93lq8L44j83%j79M8r5J20j2m5J56j23j70K2K39k06J47K01n24
4774b89M37q4O5m7nm9j24qK53j52p5L70k85k8J54J26m76m4L75J70k92p2J01j04
4798h3m6L96m21K15Q4K8l90K22L65m51J17j84M19j05k86M7N2L0OJ31N8l13q0N7
4822a32n0J78j14N3J25j02J40J42k44k13J1K83k74N54l60k60K08j82K49J6j47
4843a19P7M37m41J71k09l9j21M87m27M35k92j31J44J48K9j44J13l01M2J75J51
4864A85l06M59l86J13J6J08n10K18q8K26j24O1K01o0%k26K78j77J31o0r3M6J6
4887B8l6k02J39O1l2K21O7l23J8k09J80J27P1J35j39l00q1L48o6o6M3J66j62J57
4911A45J32k91K11l79O4l5J61p3QK62l36K63j79J36l8n8q2P1M6j39J09p7N4j77
$$ plain form
4935 -202 -17 -139 -79 123 -14 -2 146 107 237 79 4 -140 -73 -32 90 -107 -173 -16 182 -89 -167 -54 184
4958 184 -142 198 -54 -49 201 238 98 -76 -164 -102 219 75 3 71 139 -35 -41 -19 -110 208 -205 -13 6 -79 -123
4983 -123 -69 200 108 128 -54 152 -130 -96 -89 51 -161 283 311 86 -76 125 22 260 148 146 166 112 143 19
5007 19 123 -23 12 67 -104 42 -68 32 -98 -1 45 107 136 -150 -151 119 148 105 231 -109 -49 110 -115 -147
5031 -147 85 14 -140 -228 -55 -327 53 156 -92 33 189 -14 103 34 -183 143 101 -108 -1 -39 -179 55
5053 55 98 15 96 -61 -131 165 -82 -180 130 51 123 50 -157 -259 266 -63 -81 82 -41 -69 117 239 -78 13
5077 13 204 -51 -139 -171 110 -44 36 -73 137 97 210 109 -102 230 99 -14 -138 -52 92 -75 146 85
5099 85 -149 225 161 -68 -104 -30 201 33 -180 130 -52 -67 145 75 -70 14 129 422 -15 -21 65 -67 54
$$ packed form
4935b02J85j22O0K02j37J2J48l9J30j58p5j44O7M1J22j97o6J57J98k71p8J13K38
4958A84l26L40k52NK50L7j40j74q8O2L21j44p2O8O8j74oK2r1L18m13J92J9q5m4
4983a23N4K69r2K0j82K06k82L4PJ40k12M44K8k25j62K01j03K38j12kK0n4L1j24
5007A9J04j46L5N5j71J46j10J00j30R7M6O2K9k86jK70K9m3J26l40O0J59k25l2
5031a47K32p1j54q8J73k72L80J03k48J25J56k03J17o9k17L26m2k09J07l8j40K34
5053E5M3q3Q1j57p0K96k47r8L10p9P2p3k07j02N25l29j8J63j23k8J86J22l17R1
5077A3J91k55q8l2K81j54Q0j09K10m0J13j01k11L32j31j13j24Q6J44j67K21o1
5099H5k34L74o4k29l6P4K31j68k13L10j82j5K12p0j45Q4J15K93m37oQ6j32J21
$$ plain form
5122 54 -194 -148 1 146 23 381 131 160 58 100 164 -8 163 207 -38 148 44 -276 -8 287 166 7
5144 7 111 99 148 -243 146 8 -301 -123 -13 8 62 131 29 -67 -26 274 -154 -54 -311 -178 145 -9 86
5167 86 1 -66 -193 -11 -36 140 126 -42 -203 112 -98 257 198 318 -111 200 -47 100 222 -226 -77 53
5189 53 -52 -215 151 167 -41 228 99 -56 219 -177 -70 -27 -40 264 -63 -21 177 60 -190 -47 12 -163
5211 -163 142 431 148 -242 9 -136 -127 -124 -22 -117 -16 226 21 -194 109 -22 -94 -251 -347 99 -147 -160 165
5234 165 169 -384 143 -24 -302 -8 27 -146 -217 -106 -174 11 -26 181 -154 249 -214 66 195 -133 113 197
5256 197 173 -1 115 -264 -126 -12 136 43 -90 -261 -56 65 -306 -1 -68 -290 -220 5 -128 172 64
5277 64 -211 -235 179 166 19 81 -89 -109 206 113 -286 -377 -59 27 -65 154 -25 83 196 -121 64 -79 -232
$$ packed form
5122E4k48M6J49J45j23L58k50K9j02M2O4j72J71M4k45J86j04l20K68K95j21j59
5144GJ04j2M9l91L89j38l09J78J10K1N4O9j02r6M1L00m28J00k57J33L23j54R5
5167H6q5o7j27J82k5J76j4j68j61L15k10L55n9J20m29L11k47J47J22m48J49J30
5189E3j05j63L66J6k08K69j29j55K75l96J07M3j3L04l27M2J98j17k50J43N9j75
5211a63L05K89k83l90K51j45RLJ02r5J01K42k05k15L03j31p2j57r6M46k46j3L25
5234A65Mn53N27j67k78K94L5j73p1J11o8J85l7K07l35M03m63K80J29l28K46Q4
5256A97k4j74J16l79J38J14J48r3j33j71K05J21l71L05o7k22P0K25j33L00j08
5277F4k75k4M14j3j47O2j70k0L15r3l99r1L18Q6r2K19j79J08J13l17J85j43j53
$$ plain form
5300 -232 278 338 -237 55 96 -114 116 -110 22 41 -109 64 -30 -47 -91 118 184 201 195 -145 -58 281 117 -150
5324 -150 -133 -168 -134 -98 127 -375 -140 -55 -120 -163 17 -73 73 48 261 -23 62 47 244 150 -50 49 -7 -78 45
5349 45 15 -292 237 163 -14 -153 -42 -302 -6 -266 -6 -97 -236 -48 23 -64 -144 197 24 224 103 35 -277
5372 -277 -142 -88 2 23 114 85 64 89 -11 56 -204 -18 83 -220 -101 -45 149 -50 -9 238 207 113 -192 16
5396 16 -141 32 -170 -24 -2 -168 437 127 -61 103 85 -48 -258 67 -244 -31 -16 34 -67 23 -137 -105
5418 -105 -95 -95 129 31 45 -36 -94 8 -66 -103 101 -153 196 -17 86 96 -69 -42 51 -191 103 389 -111 -93
5442 -93 194 38 -31 -59 -103 -71 40 -17 -57 -165 -175 35 96 -111 -71 65 -148 173 -69 324 -83 80 -102
5465 -102 -11 85 -138 -128 71 -42 251 39 9 -77 37 -109 -58 237 -392 -80 44 252 -290 -15 15 -70 260
$$ packed form
5300b32N10O0n75K92M1k10K30k26J32J9j50J73r4j7m4K09O6J7ol40Q7L39j64k67
5324a50J7l5L4L6K25n02K35Q5o5m3J80r0J46k5K13k84Q5j5J97r4k00R9n6p1J23
5349D5l0l07N29p4j77j39J11k60K96k60K60r1j39J88P1q7q0L41j73K00j21o8l12
5372b77J35N4R0K1R1k9k1K5j00O7k60J86J01l03J19N6J94j99M1K47l1r4l05K08
5396A6j57J73k02J46K2j66O05l10j88J64j8j33k10L25l11K13J5N0j01R0j60L2
5418a05J0%K24r8J4q1n8J02p4l7K04k54L49k13J03J0j65K7R3k42K94K86n00J8
5442i3K87j56o9k8m4L2J11n7m0j08j0K10O1k07M0J36k13L21k42L93m07J63j82
5465a02R1R6k23J0J99j13K93k12l0q6J14j46N1K95o29L12J24K08n42K75L0q5L30
$$ plain form
5488 260 -143 19 -8 -28 -139 83 -92 -296 157 -190 101 426 -259 -132 65 27 6 -35 66 -121 -146 318
5510 318 -53 144 130 279 277 78 -179 95 120 49 41 -277 -197 199 22 -172 -44 25 -120 10 14 -36 71 -319
5534 -319 54 8 -176 -45 123 -8 24 -51 -43 1 215 18 -41 -130 73 60 -187 71 -32 -133 24 -223 30
5557 30 114 52 -99 -71 -25 -118 83 66 -13 -187 3 153 137 -161 420 88 253 138 26 -71 -66 169 -57 138
5581 138 -87 -87 -121 144 124 94 -33 17 9 40 67 -32 -274 -259 -274 23 -6 -282 106 63 169 155 -32 30 352 100
5607 100 -160 -9 -16 121 90 -338 120 35 -48 178 209 -35 -121 54 -278 29 20 29 68 59 -52 112 207 -186 229
5632 229 61 -147 -64 -340 28 110 -162 -109 -73 288 -155 238 -161 -89 284 88 -168 178 12 24 166 145
5654 145 70 -133 2 23 -191 4 -207 18 271 -273 39 236 68 45 300 -17 -146 49 -167 -165 172 -119
$$ packed form
5488B60m03J62k7k0j11K22j75k04M53l47K91L25o85J27J97l8k1m1J01j87k5M64
5510C18l71J97j4J49kj99k57K74K5p1ql18Q0L96j77j94J28O9j45J30Mn0J07l90
5534c19L73m6j84J31J68j31L2p5QM4K14j97n9q9K03j3k47K58j03j01J57k47K53
5557C0Q4o2j51K8M6r3K01j7p9j74J90J50j6k98N81l32J65j15j12r7NK35k26J95
5581A38k25%l4K65k0l0j27N0qL1K7r9k42J5j5K97k9k76L88m3J06j4j87O2L22k52
5607A00k60J51pJ37l1m28M58q5q3K26L1k44q6J75l32L07rRL9rj11J64R5l93M15
5632B29j68k08Q3k76L68Q2k72N3L6L61m43L93l99P2L73j96k56L46j66J2J42k1
5654A45p5k03J35K1k14J95k11K25K53n44L12J97j68k3K55l17j29J95k16KL37k91
$$ plain form
5676 -119 -58 165 20 -244 66 91 97 80 21 -35 -177 122 -207 -24 -5 -171 -69 15 -183 73 -157 -27 -11
5699 -11 -3 -35 262 -109 -184 155 -55 -135 164 0 -130 97 32 -21 163 -246 62 44 10 -177 179 18 34 -33
5723 -33 -127 40 -213 2 94 169 246 -357 233 205 215 176 201 -167 20 -62 -101 108 45 -36 -27 314 -68 177 101
5748 101 -16 271 22 -202 68 174 -390 12 -19 28 -42 50 -151 -16 -23 -4 179 -157 -79 -254 -156 -88 -149 -88
5772 -88 -68 -78 100 -51 43 4 -120 -137 69 -15 -179 128 196 111 -6 26 -262 179 -320 33 233 126 -24
5795 -24 322 20 95 14 -139 -256 44 -44 238 87 -68 163 69 -74 -95 98 -169 -100 223 5 -39 159 -166
5818 -166 -159 204 199 60 -5 194 -6 148 -216 26 306 -236 -221 405 121 -4 -65 -55 -192 66 11 -124 -128 128
5842 128 205 217 -27 -173 296 -34 145 85 -31 -45 188 -115 -165 198 115 108 18 76 29 60 260 -152 104 -207
$$ packed form
5676a19O1K23j45k64L10K5Oj7n9n6j42K99l29J83J9j66J02Q4j98K56k30J30J6
5699a1Ql2K97l71p5L39k10q0K99j64j30K27o5n3J84m09L08j8l4j87L56j61J6o7
5723c3r4J67k53K15R2P5P7o03N90k8J0l9K5l68J87q2l9K09o3q1RL41l82K45p6
5748A01j17K87k49k24K70J06n64M02l1M7p0R2k01J35pJ9J83l36P8j75R8O8o1O1
5772h8K0j0J78j51R4l9j24j7K06q4j64L07O8q5j17L2k88M41m99L53K00j07j50
5795b4L46l02P5q1j53j17L00q8K82j51j55K31r4j43k1J93k67O9L23k18m4J98l25
5818a66PL63nj39o5J99k00J54l64K42K80n42J5O26k84j25o1J0j37K58n5j35mK56
5842A28P7J2k44j46M69l30J79o0j16j4K33l03n0L63q3pr0N8m7L1K00m12K56l11
$$ plain form
5866 -207 -237 63 29 -26 87 -41 -23 126 286 -99 -158 160 -202 -4 -180 -118 32 -172 304 134 46 10 -106
5889 -106 -40 -148 140 60 -155 13 12 29 -172 24 -143 -1 39 -72 -40 -41 -165 -188 -109 -223 -52 -96 7 -55
5913 -55 -47 86 -101 40 -213 -24 93 46 -101 339 -95 90 149 32 -15 -68 72 49 -187 180 196 97 34 -50
5937 -50 -106 40 -197 -16 20 -372 135 -89 9 -78 -85 -298 -94 -170 267 -27 33 -203 329 -142 130 211 -230
5960 -230 -43 26 238 -136 -1 14 -91 -33 -131 52 76 19 -99 265 79 -75 -5 -225 -95 235 -142 42
5982 42 -44 154 -92 126 0 -182 127 -53 88 80 -138 -60 30 -105 -48 -6 -273 -188 -12 203 -15 -194 -164
6005 -164 -378 -10 72 201 146 4 191 265 30 -174 175 -267 -126 64 50 6 -74 -40 -114 -4 80 -187 112
6028 112 192 -156 144 -101 173 -159 149 -174 -69 138 99 -40 -84 -63 -132 -18 15 107 87 -74 -41 -87 -161 -44
$$ packed form
5866b07l0L00l4n5J13j28J8J49J60l85n9L18l62J98j76O2J50k04M76j70q8l6j16
5889a06O6j08K88q0k15J68jJ7k01J96j67J42M0j11L2jj24k3P9j14J71m4J03o2
5913e5QJ33j87J41k53J89J17m7j47M40m34J85N9j17m7n3J40k3k36L67J6r9o3q4
5937e0n6J46k37J81L6l92N07k24R8q7pk13K04p6M37k94O0k36N32m71K72Q1m41
5960b30J87O9K12l74J35J5j05N8r8J83K4n7j18L64j86j54P0k20J30L30l77J84
5982D2q6J98k46K18j26j82L09j80J41qk18P8R0j35N7M2k67Q5J76K15k18j79L0
6005a64k14L68Q2J29n5j42J87P4k35k04L49m42J41J90j4m4q0L4p4J10Q4k67K99
6028A12Q0l48L00k45K74l32L08l23J05K07l9j39m4K1o9J14L3R2k0j61L3m6p4J17
$$ plain form
6052 -44 27 -77 -126 124 -66 151 65 -137 163 -17 -115 -124 172 -150 -160 -20 -88 -27 124 6 71 119 -389 282
6076 282 48 -229 175 186 93 -209 -50 320 -133 -119 119 -111 -236 40 -112 -293 -74 73 -139 -215 61
6097 61 36 -53 247 22 -73 -97 246 -92 -102 -85 -50 69 29 111 -86 -37 -24 76 212 100 65 -55 -78 224 -76
6122 -76 70 136 243 183 -120 -35 -61 -149 282 -118 -42 84 -167 -218 -51 -4 -66 -80 97 124 261 -186 147 75
6146 75 -144 53 0 -156 115 431 -371 1 -112 -306 22 -126 -128 -290 201 77 -167 157 287 -10 -28 136
6168 136 -110 -95 127 53 -99 143 28 125 -139 -91 55 -243 3 -244 79 121 108 81 22 146 347 -42 102
6191 102 -94 -180 -24 81 -178 183 57 -281 -51 -86 -24 274 -97 -115 192 59 -159 16 -18 5 -147 229
6213 229 -91 26 107 -78 246 218 -187 -6 -153 52 -26 -137 -90 44 -119 -157 -44 191 -169 -338 184 -63
$$ packed form
6052d4P1j04m9K50j90K17q6k02L00j80r8rK96l22j0J40o8O1J51j18O5M8n08O71
6076B82k34k77M04J1r3l02J59L70m53J4K38k30j25K76j52j81K19J47k12p6K76
6097F1k5q9L00k25r5k4L43l38j0J7L5J19m0Q2j97M9J3J00J36j12l5j20k3L02l00
6122g6J46O6J07o0l03Q5k6q8M31m00P6J26k51n1J67M7o2j4J77K7J37m47L33p2
6146G5k19J97n3j56K71L16q02L72j13j94L28j48kj62M91j24k44L24J30k97j8J64
6168A36k46J5K22p4j52K42j15R7k64M8J46k98K46k47L23M2j3k7n9J24K01l89J44
6191A02j96q6J56J05k59L61j26l38K30l5O2K98l71j8L07j33k18J75l4K3j52L76
6213B29l20J17Q1j85L24k8m05J81j47K05p8j11M7J34j63l8J13K35l60j69N22k47
$$ plain form
6235 -63 88 27 -116 227 -187 33 295 288 146 -89 125 10 15 243 22 20 206 -12 -89 -20 23 -76 79 -22
6259 -22 181 221 47 243 55 204 -46 -96 -30 -23 315 -43 -9 153 -20 -105 113 -92 3 -102 274 70 -18
6282 -18 -237 -20 348 -5 -192 234 -3 -5 68 -35 -43 133 -184 -308 66 56 -119 -243 -36 -50 347 -76 -73
6305 -73 -61 118 223 232 -14 -168 -71 -51 47 409 -22 4 51 -71 -83 -61 -13 -281 126 -176 -83 -11 -82 236 -92
6330 -92 97 -119 140 97 -220 -93 -18 -261 -97 -200 -216 7 219 61 170 26 -3 130 167 87 47 -107 -61
6353 -61 12 148 58 285 151 -64 199 323 -112 82 65 40 234 386 -81 285 244 -73 120 74 -6 78 -44
6376 -44 -103 -41 -249 -74 72 69 -186 -118 298 -235 -161 290 7 163 141 -145 -27 222 -104 -3 329 -125 -166
6399 -166 85 -60 48 91 -61 -185 236 -113 -131 198 103 80 170 -164 68 148 15 -65 70 15 -105 105 -92
$$ packed form
6235f3J51o1j43L43m14K20K62pj42k35K14j15NK28k21kJ86k18p7O9M3r9J55j01
6259b2K03M0j74J96j88J49k50n0O6PL38l58L4J62j73q5K18k05R5j05L76k04q8
6282a8k19K17L68l53j87M26k37kP3j03qJ76l17j24L74j0j75j24K07j4L97m23L
6305g3J2J79J05Rk46j54R7K0R8L62m31K6M7j22j2K2M8k68M07l02R3P2p1L18l28
6330i2J89k16K59m3l17J27P5k43J64j03j6K23K12j58J09j44k9J33L7q0m0j54M6
6353f1P3J36r0K27j34k15K63J24m35J94j7k5J94J52m67L66m1l17J93m6q0Q4j22
6376d4n9O2k08J75J46lk55O8M16n33P4M51k83J56k2k86J18K49l26J01L32m54m1
6399a66K51j45J08M3j52j24M21l49j8L29r5k3R0l34K32Q0j33q0J35n5j20K10j97
$$ plain form
6422 -92 -229 228 -41 -28 -67 -205 -104 192 20 -189 295 27 91 192 -314 17 291 47 85 144 -52 -15
6444 -15 -178 279 -125 -44 96 -147 -194 -289 108 34 -97 120 -141 -84 163 -117 -127 -170 73 51 236 -59 8
6467 8 -281 89 151 -227 -94 -75 -329 495 -167 -25 194 52 239 -210 -203 -214 119 138 24 -102 233 103 258
6490 258 -128 -109 110 54 -42 82 -42 -64 330 123 -241 182 416 -236 2 200 314 69 154 -45 296 114
6512 114 -162 -97 -108 5 -40 -27 -211 207 -30 5 101 18 34 45 109 106 281 -104 11 -8 252 -184 -50 104
6536 104 -111 -40 115 -56 -23 19 -52 -15 -280 -53 -339 -85 -94 149 145 26 -130 44 -390 -141 81 197 329
6559 329 234 -67 -132 -106 172 117 81 5 32 325 -56 6 105 146 132 -115 27 -71 73 -98 -141 -80 13 -58 249
6584 249 9 -83 -130 -227 -84 62 -233 140 313 -29 3 213 -39 -20 118 140 129 -55 59 -4 -33 30 -34 -200
$$ packed form
6422i2j37M57k69J3l9j38J01K96j72k09M84k68O4J01n06L31K74k44L8N9j96L7
6444a5j63M57m04Q1J40k43m7r5L97p4j31K17k61N7K47k80j0m3K43k2J85k95O7
6467Hk89L70O2l78J33J9k54Q24o62J42K19j42J87m49Pj1L33J9j14j26L35j30J55
6490B58l86J9K19n6r6J24j24k2L94k07l64M23K34o52K38J98J14k45Q5j99L41j82
6512A14k76O5j1J13m5J3j84M18k37L5R6q3J6J1O4lJ75l85J15j9K60m36J34J54
6536A04k15P1J55j71L3M2p1L7k65K27k86K54rK43mj19j56J74m34K49K22J16J32
6559C29r5l01o5K6K78n5l6p6K7K93l81O2R9M1j4k47J42r8J44j71m3O1R3p1L07
6584B49k40r2m7r7J43J46k95L73J73l42L2K10k52J9J38K2j1j84J14o3k9O3o4j66
$$ plain form
6608 -200 118 196 -188 -305 151 -47 -71 -2 147 -178 91 179 -55 -291 -28 122 38 -61 44 235 136 30
6630 30 -151 -189 -32 -53 -100 218 68 -104 9 43 350 203 -156 -168 -242 -85 -54 -184 -185 87 -319 324 138
6653 138 -62 88 43 -236 67 197 -40 -42 89 -93 -186 65 224 -18 259 -92 5 162 -39 13 184 83
6675 83 -127 -46 -169 17 542 10 -240 -216 -19 -68 116 -65 -149 170 100 -18 -11 164 -249 208 -13 -351 -2
6698 -2 17 -51 160 -281 30 172 -200 -329 92 -31 5 -32 129 -305 138 13 -195 -244 198 11 -456 169
6720 169 -94 96 -45 -13 -37 2 15 29 -289 -301 143 127 165 -142 177 -42 19 373 -196 -84 123 -58 57
6743 57 87 102 147 -86 -210 77 86 -101 -64 222 -252 -84 294 4 144 145 49 58 -26 115 -19 55 -77 78 -210
6768 -210 114 346 -86 12 -209 144 -51 181 89 25 130 109 36 -67 155 -194 -14 -48 32 -52 -187 -124 -12
$$ packed form
6608b00L18P8l84j17M56j98k4O9J49l25K69Q8k34k36K63J50q4r9J05J91r9j06
6630C0j81l8J57k1m7L18j50j72J13L4L07j47l59j2p4J57L1j30jK72m06O43j86
6653A38k00J50m5k79L03J30k37kJ31j82r3K51J59k42K77l51R7J57k01N2J71j01
6675H3k10Q1j23J86N25n32k50K4J97m9J84j81q4L19p0j18PJ75m13M57k21l38L49
6698bJ9o8K11m41L11J42l72j29M21j23L6l7J61m34M43j25k08m9M42j87m67O25
6720A69k63J90j41L2k4L9J3J4l18j2M44j6L8l07L19k19O1L54n69J12K07j81J15
6743E7L0J5M5k33j24K87Rj87L7K86m74J68L78k90J40Jr6Rq4J41j34P4j32J55k88
6768b10L24K32m32R8k21L53j95K32r2o4J05k1p3j03K22l49J80l4Q0q4j35O3J12
$$ plain form
6791 -12 -38 -156 83 -56 -53 1 101 54 -14 68 -17 130 45 -117 62 338 -41 210 129 -125 -180 -170 -203 -54 -136
6816 -136 -83 -162 151 -23 437 99 3 -264 9 -16 13 274 -120 -126 -13 -187 -210 229 238 -262 -127 -172 -175 49
6840 49 -21 -9 -96 240 -31 305 16 -101 369 -59 -320 214 -123 -314 -145 82 -47 49 298 -128 124 -2
6862 -2 -119 39 67 -267 214 -115 -62 -141 -68 -32 -153 95 -26 -94 -459 29 -342 -49 -74 172 29 -162 145
6885 145 160 5 -116 -40 -330 313 182 103 79 117 215 -137 -38 -149 333 -105 31 327 269 -129 218 261 -9
6908 -9 20 203 -158 129 -223 26 -143 88 10 -80 18 -97 -26 211 -275 -204 14 -77 157 -17 63 1 -19 84
6932 84 -112 -44 63 22 100 -123 -76 -82 -25 71 38 15 102 207 -111 -154 119 212 -66 91 21 -14 107 -76 -2 87
6958 87 79 9 188 -12 201 -123 171 -167 50 58 -15 114 -66 -85 -137 -195 21 -86 -60 12 35 -59 231 152 -18
$$ packed form
6791a2k6j18K39j39LN4J00m7o8Q2q5J47q5j62J79K76l79K51q1k54n5J0l3J49q2
6816a36N3p9L13j74M60l38r6k67K73k5K9K61l94oJ13j74k3M39Rn00J35m5lK24
6840D9p0J2q7L36k71L36k89j17M70m28k61N34l37j91J69K27j29R6K49m26K52j26
6862bj17J58K8l34M81l29N3p9P3L6j21K48j21o8l65M88l71K93k5K46j43j91L07
6885A45J5j55j21P6k90O43j31p9k4L8R8l52R9j11M82m38J36K96n8l98L47M3k70
6908iK9J83l61K87l52K49j69K31p8r0R8j15P1K37m86P1K18r1K34j74Q0o2k0J03
6932H4j96O8J07m1P8k23M7oN7R6l3k3Q7J05l18m3K73R3k78J57p0l5J21j83P4Q9
6958H7qp0J79k00K13l24K94l38K17Qp3J29j80j9n2n8K16j07K6P2K3r4K90p9j70
$$ plain form
6983 -18 -304 94 -167 141 -23 100 14 -204 74 110 164 -25 -159 -24 17 -169 -34 -325 -37 -149 -62 -314
7005 -314 111 211 -260 212 60 141 84 -147 134 161 128 111 33 65 52 -85 -41 -148 96 -65 118 -70 -9
7028 -9 -166 120 205 58 -283 124 11 -76 46 -121 -454 -28 -272 -76 76 -169 -107 -34 -202 -85 -38 -213
7050 -213 -7 -121 -24 -110 -257 -97 55 -21 -88 -326 -383 124 -89 -30 -22 39 98 -201 -86 99 48 49 199 59
7074 59 200 181 -100 23 2 -108 197 -149 219 -88 153 -239 -157 118 -211 -60 48 -157 -22 148 -26
7095 -26 -45 -172 0 -336 -242 129 -134 112 -61 177 280 -2 -128 22 -74 -101 223 -47 -221 220 -28 59
7117 59 78 -77 -80 67 292 91 -71 85 -47 -93 -298 74 274 17 -11 -52 54 -127 -28 112 -55 43 -105
7140 -105 -36 19 -156 37 202 83 6 98 -77 -70 241 85 -170 167 49 -54 -34 105 118 108 262 -385 151
$$ packed form
6983a8k86L98k61L08j64J23q6k18K78L6N4j89j34J35M1j86J35k91K88j12Q7k52
7005c14M25J00m71M72j52Q1n7k31K81K7l3j7p8L2j3j37M4j07K44j61J83j88O1
7028ij57K86Q5j47l41M07j13q7J22j67l33M26k44J96J52k45O2P3j68J17M7j75
7050b13K06j14R7q6j47J60J52p6o7k38n7N07k13N9QO1N9k99J15J85n1JJ50j40
7074E9J41j9k81J23k1j10L05l46L68l07K41l92Q2K75l29J51J08k05J35J70j74
7095b6j9j27J72l36R4L71k63K46j73K38J03k82j26J50r6k7L24k70j74M41k48Q7
7117E9J9j55lJ47K25k01j62J56j32m6k05L72K00k57k8m1J06j81R9J40j67R8j48
7140a05O9N5j75J93J65j19p7R2j75PL11j56k55L37j18j03K0J39J3j0J54o47N36
$$ plain form
7163 151 274 -60 -75 -35 -27 -50 42 -29 227 69 66 38 79 288 105 -145 -58 41 -42 -205 86 -155 -121 -18 148
7188 148 31 16 -102 -111 41 -11 100 102 91 34 -15 205 212 -138 -125 -131 -300 57 263 82 83 64 104 -193 30 -80
7214 -80 19 -80 -72 -70 32 -81 -237 61 63 -162 21 -48 226 -171 181 329 -51 168 10 69 221 -34 -27 36 136
7239 136 314 -83 4 -333 35 -48 78 67 -44 -174 -418 135 62 3 60 -140 -224 115 7 -1 141 125 -23
7262 -23 65 -73 -97 -106 7 214 -60 -130 -101 20 94 269 -69 -84 -125 25 47 -157 -95 145 -155 -17 51 -112
7286 -112 -58 97 -33 -51 324 -129 -4 -216 183 -21 27 77 156 -117 270 183 21 -267 172 -85 30 40
7308 40 112 73 -100 121 189 2 -339 -23 -102 148 -24 -164 -21 -90 45 162 -249 -4 225 180 -70 -6 47
7331 47 -293 -222 -110 46 148 -125 206 206 -8 68 -125 -112 189 36 -16 21 20 122 133 -165 -100 455 204 163
$$ packed form
7163A51J23l34j5M0Qk3R2p1K56j58lk8M1K09j83k50Q7R9q3j63K91k41L4J03J66
7188A48j17j5j18rJ52n2J11Kj1n7m9K20Pl50J3oj69L57K06j81Jj9M0k97K23j10
7214h0R9r9QKJ02j13j56K98Kk25J83o9K74l97L52J48l80K19j58N9J52k55PO3J00
7239A36J78l97Q7l37L68q3J26j1j11j30k44N53p3n9N7k00q4L39j08qJ42j6j48
7262b3Q8j38k4rJ13K07k74p0K9J21P4J75l38j5m1J50K2k04O2K40l00J38O8j63
7286a12N4J55j30j8L75m53J25k12L99k04M8N0P9k73L87q7j62k88M39k57J15J0
7308D0P2l9j73K21O8j87l41L16p9K50j72j40J43o9J35J17m11K45K29m5k50O4N3
7331D7l40P1J12J56J02k73L31%k14P6j93J3L01j53n2L7jJ02J1k98O5N55k51m1
$$ plain form
7355 163 99 235 114 -235 194 -212 -88 -5 -123 158 -327 -8 55 -50 -215 45 -163 -42 72 -115 17
7376 17 -188 -237 -264 -76 139 -229 49 60 -145 -23 153 146 -22 111 182 -39 94 93 -86 -90 38 169 179 91
7400 91 48 -11 -120 268 -132 102 85 24 275 39 -126 159 -303 2 -208 -91 207 -228 -68 41 -119 69
7422 69 143 69 -86 137 -5 156 54 -95 -195 -77 -83 76 184 10 -35 379 -66 40 -82 -284 -22 -67
7444 -67 86 -277 -90 -166 -240 10 109 9 189 -90 160 45 -89 -230 362 29 30 116 179 224 48 -66 62
7467 62 58 -42 -268 31 27 -176 36 59 64 -188 -176 244 175 -143 20 172 -133 -96 168 -277 47 52 -104 -127 147
7492 147 31 62 -113 -124 -18 -51 -9 -86 250 -43 -33 71 47 -309 -260 97 -34 -13 133 -100 91 101 81 35
7516 35 171 125 -116 393 -156 -115 292 -322 -60 54 175 156 38 -175 182 353 -24 157 -69 71 -93
$$ packed form
7355A63o4J36j21l49M29m06J24Q3j18K81m85L19O3j05j65K60k08J21J14j87J32
7376A7k05m9k7J88K15l68K78J1k05J22J76pj68J33P1k21J33jj79mJ28J31J0q8
7400I1m3n9j09L88m00K34j7o1K51k36j65K85m62L05k10J17K98m35J60J09j60J88
7422F9P4p4j55K23j42J61j02j49j00J18oJ59J08j74m5M14m45J06j22k02K62m5
7444f7J53l63J87p6p4K50R9j00J80k79K50j15j34j41N92l33JQ6O3M5j76j14J28
7467F2mj00k26K99mk03K12K3Nk52J2M20o9l18J63J52l05L7K64m45L24Nj56k3K74
7492A47j16L1j75j1J06l3M2p7L36k93J0J04k4l56M9L57j31K1J46k33J91J0k0m6
7516C5J36m6k41N09n49M1M07o14K62J14J21j9j18k13L57J71l77J81k26J40j64
$$ plain form
7537 -93 -82 92 90 73 141 -125 -258 -106 97 137 -28 73 146 -106 55 39 -85 57 84 -28 -215 -96 37
7560 37 -191 196 -223 64 169 10 -139 15 -189 -57 363 103 -202 -43 141 -135 161 -249 -60 82
7580 82 166 206 380 132 -46 14 -163 -119 59 -94 -103 294 -132 206 -57 -71 224 -118 67 102 44 -98 -14 -114
7604 -114 257 -77 -11 -276 -240 -65 -341 17 138 -100 93 42 24 -78 138 -39 -60 -283 -46 -65 -115 -30 152
7627 152 177 80 0 125 -168 -124 117 138 -135 264 388 -249 62 39 -153 103 102 -129 -47 -135 220 -67 41
7650 41 -90 -2 -41 118 64 -99 -28 220 1 -17 276 80 -160 33 -286 101 -158 139 50 -49 189 -123 -180
7673 -180 37 -49 -39 -35 -278 -41 86 162 -148 -54 -116 -158 305 -97 -38 42 -207 84 112 -153 120 43 149 -21
7697 -21 244 -137 116 -49 55 98 -182 -153 -94 -95 -6 57 30 -59 -73 -1 65 129 -4 37 86 177 144 -95 -187 -61
$$ packed form
7537i3J1J74kj7O8k66j33J52K03M0j65J01P3k52J61j6j24J42K7j12j87J19J33
7560C7k28L87m19K87J05j59j49J54k04J32M20k60l05J59J84k76K96m10J89J42
7580H2Q4M0J74k48j78O0j77M4J78j53rL97m26L38k63j4K95l42J85L5n8j42Q4j00
7604a14L71l34O6k65L6J75k76L58J21k38J93n1j8j02K16j77k1k23K37j9n0Q5J82
7627A52K5r7q0J25k93M4K41K1k73L99J24o37L11k3j92K56jk31Q2q8L55k87J08
7650D1j31Q8l9J59n4j63P1K48k19j8K93j96k40J93l19L87k59K97q9r9K38l12n7
7673a80K17q6J0Mk43K37J27P6l10R4o2m2M63m02N9Q0k49K91K8k65K73p7J06j70
7697b1K65l81K53j65J04M3k80K9N9jQ9O3k7q9j4P2O6O4j33M1M9R1l3k39r2J26
$$ plain form
7723 -61 89 338 -386 -42 113 -305 -70 -80 129 -104 10 -239 -297 72 93 -151 319 69 -25 -30 -196 -34
7745 -34 97 -281 -163 314 -125 115 -48 65 -197 100 259 204 24 -62 67 -19 80 -11 -52 -94 67 54 264
7768 264 -55 107 -34 -297 130 -209 -4 201 207 -220 32 -165 -14 25 92 -60 173 60 -338 -66 -9 -165
7790 -165 -90 -2 123 78 83 -180 -397 71 60 -4 37 103 95 110 -271 -168 -82 -84 96 188 114 136 85 -53 102 -141
7816 -141 -60 144 -7 98 255 -63 74 -16 94 -119 356 -49 16 130 -87 -94 -112 86 -176 -261 43 -261
7838 -261 28 141 -91 -39 -75 228 -247 126 -177 9 -91 -229 -12 -91 -160 214 151 2 -141 222 -27 -57
7860 -57 264 -192 53 -15 -72 -145 117 -56 121 -259 92 -123 7 42 -57 145 -149 -290 -208 141 -79 161
7882 161 -72 127 167 -246 45 -58 -173 70 65 -128 -41 7 -214 15 -99 51 3 -30 -112 232 -31 -20 234
$$ packed form
7723f1J50K49p24L44J55m18K35j0K09k33J14k49n8L69K1k44M70k50r4nj66J62
7745c4J31l78J18M77m39K40j63J13k62K97J59n5j80q6J29q6R9r1m1m2J61j3K10
7768B64l19J62j41k63M27l39K05K05Om27K52j97J51L9O7j52K33j13l98K72N7j56
7790a65P5Q8J25m5Nk63k17M68j1o4M1O6qJ5l81J03Q6kJ80R2p4K2n1j38J55k43
7816a41Q1K04j51J05J57l18J37r0J10k13M75m05O5J14k17pj8J98k62q5L04l04
7838b61K89J13k32N2l6L03m75L73l03J86j00j38K17p9o9L74o3j49j43L63k49l0
7860e7L21m56K45o8n7p3K62j73J77l80L51k15J30L5r9K02k94j41Q2L49k20K40
7882A61k33J99M0m13K91j03j15K43nj93Q7M8k21K29j14J50m8l3q2L44k63J1K54
$$ plain form
7905 234 -78 36 -45 -36 89 120 -122 0 224 294 -50 -27 248 26 54 362 58 -66 -217 -117 342 26
7927 26 -229 186 -68 -201 310 -138 25 33 -36 100 -89 -97 275 -21 120 -130 36 -25 197 52 -15 95 -24
7950 -24 69 2 -121 138 59 50 57 -87 -15 -61 -289 124 88 172 95 26 -70 179 315 -149 -2 -19 99 -13 243
7975 243 203 -199 159 24 5 145 83 -8 152 57 -32 163 -184 -48 -73 92 -296 80 304 -82 -167 53 -298
7998 -298 203 114 -214 -22 3 -231 -160 118 -14 -23 73 43 176 53 111 17 161 229 -93 -63 243 -77 -14 -278
8022 -278 191 224 253 83 59 280 -84 -284 -86 -54 123 -129 57 302 13 294 16 18 30 158 89 -26 -44
8045 -44 276 -50 -109 -266 -376 -29 -95 -249 -48 -53 -237 -60 90 -67 -258 133 42 85 -104 208 224 -1 -146
8068 -146 165 120 49 -22 120 166 119 -348 160 102 -4 238 16 10 153 210 243 -302 -139 -35 -82 353 -134 79
$$ packed form
7905B34l12J14q1RJ25L1k42J22K24P0l44K3K75k22K8L08l04j24j51J00M59l16
7927B6k55M15k54j33N11m48J63Qo9J36j89qL72k96J41k50J66o1K22j45o7J10j19
7950b4R3o7j23K59p9rPj44P2m6k28M13l6Q4p7o9r6K49J36m64J47j7J18j12K56
7975B43m0m02L58j35j9J40o2r1J60r5q9J95l47J36k5J65l88L76K24l86q5K20l51
7998b98N01q9l28J92K5k34P1K78j32rR6l0J33j23N8r4J44O8l22L0L06l20O3k64
8022b78M69L3K9j70k4K21l64k00J98L2J77k52J86K45k89K81k78KJ2J28o9j15j8
8045d4L20l26n9j57j10L47o6j54K01nj84J77J50j57j91L91r1M3j89L12J6k25j45
8068a46L11m5p1p1J42M6m7m67N08n8j06K42k22oJ43N7L3n45J63J04m7M35m87K13
$$ plain form
8092 79 57 -11 54 24 -241 -136 125 166 69 -17 -60 -55 47 219 39 126 -198 77 -23 -85 298 -33 178 -45
8116 -45 -208 -214 228 -39 -162 -93 -24 20 14 -7 -104 -183 199 86 -196 132 -44 239 367 180 62 85 38 -239
8140 -239 -7 -74 -255 -238 -360 103 -165 69 101 114 310 -58 102 221 -20 -17 56 238 133 229 -12 6 -133
8163 -133 52 157 45 -115 -76 51 -14 -336 220 187 1 -67 -118 -46 -94 -165 -58 126 -70 32 105 -203 126
8186 126 20 154 276 -183 -97
$$ packed form
8092G9k2o8O5l0k65J05K61M1r7q6m3NJ02J72j80Q7l24K75j00o2L83l31K11k23
8116d5j63oM42k67j23O9O9M4ok1r7p9L82j13k82L28j76K83J28j87j18K3m7k77
8140b39K32o7j81J7j22M63k68K34L2J3J96l68J60J19k41LP3J82j05R6k41J8j39
8163a33J85J05j12j60L9J27o5l22N56l3j86o8n1P2m8p1J07J84j96J02P3l08L29
8186A26j06J34J22m59Q6
8191i7
$$ Imaginary data points
##PAGE= N=2
##DATA TABLE= (X++(I..I)), XYDATA
$$ plain form
0 0 0 0 0 0 0 0 0 0 0 0 0 -8 8 -8 8 -8 16 -16 24 -24 32 -37 41 -48 59 -72 80 -94 108 -124 142 -161 183 -207
34 -207 235 -264 296 -332 371 -413 461 -511 567 -630 696 -770 848 -935 1031 -1135 1250 -1378
52 -1378 1518 -1674 1852 -2050 2277 -2536 2840 -3193 3623 -4150 4814 -5683 6872 -8616 11418
67 11418 -16691 30158 -146291 -240698 -56555 -33209 38650 82066 138677 163109 154257 107974
79 107974 103949 45754 -38165 -114283 -184579 -197196 -91588 -39688 -48982 11064 104352 130598
91 130598 133299 94792 29808 -7732 -38403 -70486 -56473 -43172 -25211 13220 -10013 -57439
103 -57439 2356 80026 71095 39288 -1269 -57184 -62705 -44466 -37701 4074 52825 67399 62725
116 62725 17771 -18411 23773 35393 -41176 -74946 -54808 -50635 -29952 -6834 -9081 20233
$$ packed form
0@%%%%%%%%%%%qJ6j6J6j6K4l2M0m8N6o9P8q9J07j31J52j74K02k32K66l03L44l90
34b07M42m99N60o28P03p84Q74r72J078j197J326j466J618j783J966k166K385k628
52a378K896l192L526l902M327m813N376o033O816p773Q964j0497J2555j5488K0034
67A1418k8109M6849j76449r4407J84143K3346P1859M3416N6611K4432q852m6283
79A07974m025n8195q3919p6118p0296j2617J05608N1900r294O0046R3288K6246
91A30598K701l8507o4984l7540l0671l2083J4013J3301J7961L8431k3233m7426
103e7439N9795P7670q931l1807m0557n5915n521J8239O765M1775M8751J4574m674
116F2725m4954l6182M2184J1620p6569l3770K0138M173K0683K3118k247K9314
$$ plain form
128 20233 60357 59405 55320 49074 28826 17448 -30767 -100267 -76868 -7985 4813 11851 20617
141 20617 -9263 -16770 5607 4470 12660 32115 23951 11017 -11216 -35211 2283 46320 22773
154 22773 2543 2235 -26062 -36158 -25859 -50717 -55443 -14295 11417 28468 51048 61809 77856
167 77856 63993 -1927 -28911 -11400 -28407 -50744 -56110 -80741 -73528 -19743 12602 41908
179 41908 89206 99807 76709 39576 -9920 -23787 -16725 -49470 -71206 -53512 -51884 -36187
191 -36187 12858 31579 37797 62654 56647 31106 18495 -6442 -25117 -29165 -51260 -51609 -13142
204 -13142 5129 18756 42521 24295 -1066 12344 8851 -11279 -7900 -11076 -23786 -22158 -25901
217 -25901 -10823 32647 44671 34506 35568 12742 -13140 -10105 -26172 -48425 -30856 -19283
$$ packed form
128B0233M0124r52m085o246k0248j1378m8215o9500K3399O8883J2798P038Q766
141B0617k9880p507K2377j137Q190J9455q164j2934k2233k3995L7494M4037k3547
154B2773k0230l08k8297j0096J0299k4858m726M1148K5712J7051K2580J0761J6047
167G7856j3863o5920k6984J7511j7007k2337n366k4631P213N3785L2345K9306
179D1908M7298J0601k3098l7133m9496j3867P062l2745k1736J7694J628J5697
191c6187M9045J8721O218K4857o007k5541j2611k4937j8675m048k2095l49L8467
204a3142J8271J3627K3765j8226k5361J3410l493k0130L379l176j2710J628l743
217b5901J5078M3470J2024j0165J062k2826k5882L035j6067k2253J7569J1573
$$ plain form
229 -19283 -24073 -4102 16208 28096 43680 35629 20200 27660 13596 -13257 -15298 -30634 -53328
242 -53328 -36626 -19488 -14472 14336 30830 21489 24538 20469 7445 12434 7963 -7753 -4303
255 -4303 -13989 -30774 -11409 988 -10180 980 10617 -1962 1371 4521 -4802 5280 10412
268 10412 -537 7971 13976 4631 10857 5691 -16993 -11386 -6377 -23692 -17614 -2954 -8812 -1960
282 -1960 9677 9552 23280 30249 14690 13248 8563 -15140 -18526 -15315 -28017 -19082 -4593 -11599
296 -11599 -757 19046 14314 15647 21867 9847 6750 3315 -14724 -12824 -5273 -18440 -12341 5098
310 5098 234 4168 14889 2859 838 7197 -6562 -10199 -619 -6355 -3567 6908 1752 8285
324 8285 19183 4298 -427 7960 -7836 -17606 -10716 -17054 -16392 -2278 -3135 4279 22066 18417
$$ packed form
229a9283m790J9971K0310J1888J5584q051j5429P460j4064k6853k041j5336k2694
242e3328J6702J7138N016K8808J6494r341L049m069j3024M989m471j5716L450
255d303r686j6785J9365J2397j1168J1160R637j2579L333L150r323J0082N132
268A0412j0949Q508O005r345O226n166k2684N607N009j7315O078J4660n858O852
282a960J1637j25J3728O969j5559j442m685k3703l386L211j2702Q935J4489p006
296a1599J0842J9803m732J333O220j2020l097l435j8039J900P551j3167O099J7439
310E098m864L934J0721j2030k021O359j3759l637R580n736K788J0475n156O533
324H285J0898j4885m725Q387j5796r770O890o338O62J4114q57P414J7787l649
$$ plain form
338 18417 15494 21277 8345 -911 -156 -18143 -25632 -14020 -19461 -19910 858 7049 9648 22038
352 22038 17185 13570 18904 4936 -7569 -3123 -14368 -22793 -11266 -11353 -8951 9128 8030 3132
366 3132 15497 11317 940 4770 -1748 -9265 -2047 -7820 -10470 5750 5420 -1311 9528 7568
380 7568 -1457 4601 -2577 -13191 -5381 -7437 -14462 -226 6263 5239 15913 13482 5441 12722
394 12722 5311 -10319 -5349 -9015 -21400 -14252 -9926 -10418 5585 11952 8115 19228 19934 7303
408 7303 8383 2815 -11489 -9134 -13057 -22600 -9912 -2593 -7742 3695 12785 8356 14680 14669 3193
423 3193 6227 2114 -13413 -9736 -5222 -12558 -4495 1200 -3983 5864 10490 123 4584 8496 -3142
438 -3142 -2195 298 -7606 -1538 2441 -6395 1878 9475 -457 1136 5298 -4558 -3447 -175 -9540
$$ packed form
338A8417k923N783j2932r256P55j7987p489J1612n441m49K0768O191K599J2390
352B2038m853l615N334j3968j2505M446j1245q425J1527q7K402J8079j098m898
366C132J2365m180j0377L830o518p517P218n773k650J6220l30o731J0839j960
380G568r025O058p178j0614P810k056p025J4236O489j024J0674k431q041P281
394A2722p411j5630M970l666j2385P148M326m92J6003O367l837J1113P06j2631
408G303J080n568j4304K355l923r543J2688P319n149J1437R090m429O324j1j1476
423C193L034m113j5527L677M514p336Q063N695n183R847M626j0367M461L912j1638
438c142R47K493p904O068L979q836Q273P597r932J593M162r856J111L272r365
$$ plain form
453 -9540 -3975 4006 -3984 -330 8232 2691 5522 8990 -1373 -733 2942 -8766 -8118 569 -6224
468 -6224 -5039 1872 -3411 1484 9848 1363 1493 7826 -1756 -3069 3332 -2866 -1687 3843 -5771
483 -5771 -4915 4907 -2129 -3624 3400 -4012 -5032 1585 -3179 367 12118 4334 1337 8082 1253
498 1253 -1533 2970 -6383 -10646 -4738 -11806 -11974 3377 4440 5067 13007 8019 5775 12293 3203
513 3203 -4004 -448 -11019 -18785 -10117 -8446 -4962 7543 5628 4177 14822 11179 4701 9331
527 9331 1206 -9679 -8504 -14524 -14525 447 1475 -2198 7064 7356 4243 11546 7706 -633 1919 -7870
543 -7870 -17528 -7726 -3511 -3537 6593 6332 1440 9925 8825 1672 6393 -598 -13768 -10542 -9652 -10466
559 -10466 2372 5793 2006 9436 8977 2542 10016 9850 -2800 -5907 -11782 -17741 -6423 -967 -4446
$$ packed form
453i540N565P981p990L654Q562n541K831L468j0363O40L675j1708O48Q687o793
468f224J185O911n283M895Q364q485J30O333r582j313O401o198J179N530r614
483e771Q56R822p036j495P024p412j020O617m764L546J1751p784k997O745o829
498A253k786M503r353m263N908p068j68J5351J063O27P940m988k244O518r090
513C203p207L556j0571p766Q668J671L484J2505j915j451J0645l643o478M630
527I331q125j0885J175o020jJ4972J028l673R262K92l113P303l840q339K552r789
543g870r658R802M215k6J0130k61m892Q485j100p153M721o991j3170L226Q90q14
559a0466J2838L421l787P430m59o435P474j66j2650l107n875n959J1318N456l479
$$ plain form
574 -4446 5708 9517 2649 7379 9204 4467 7751 914 -14838 -11413 -5141 -6624 1157 4461 -966
589 -966 4531 5941 -1333 5306 8736 -2143 -4477 -5634 -11043 -1188 6823 1040 3978 5208 -3111
604 -3111 791 5831 -2575 -2104 -2450 -11369 -7465 854 593 9105 14348 2039 -315 3392 -1269 790
620 790 277 -12825 -11576 -3969 -7245 -572 10828 9619 9809 8031 -3305 -616 7373 -1975 -8748
635 -8748 -8640 -13394 -7127 3046 1595 6367 14170 5155 160 3243 -1294 -1212 1013 -10591 -13392
650 -13392 -3727 -2342 3707 12632 6334 2480 6055 -1151 -3266 2447 -3913 -7243 -4735 -11170 -8232
665 -8232 7621 10497 9393 10341 1270 -1736 3921 -3398 -9002 -3547 -6835 -9869 -3055 -1058 4789
680 4789 16292 8947 -409 3618 1750 -1652 789 -6946 -11895 -4304 -5515 -5742 7079 10475 7132
$$ packed form
574d446J0154L809o868M730J825m737L284o837j5752L425O272j483P781L304n427
589i66N497J410p274O639L430j0879k334j157n409R855Q011n783K938J230q319
604c111L902N040q406M71l46q919L904Q319k61Q512N243j2309k354L707m661K059
620G90n13j3102J249P607l276O673J1400j209J90j778j1336K689P989r348o773
635h748J08m754O267J0173j451M772P803r015m995L083m537Q2K225j1604k801
650a3392R665J385O049Q925o298l854L575p206k115N713o360l330K508o435K938
665h232J5853K876j104R48r071l006N657p319n604N455l288l034O814J997N847
680D789J1503p345r356M027j868l402K441p735m949P591j211k27J2821L396l343
$$ plain form
695 7132 7907 -335 -5798 2340 920 -5430 -2265 -6062 -9036 1297 4457 3179 10119 6759 -2135
710 -2135 -499 -3523 -7695 -135 -1064 -7931 -2194 816 2414 11165 8606 -858 2551 909 -7076
725 -7076 -3611 -2773 -6218 -1627 -3505 -7214 4595 12474 8064 8406 3722 -5084 -2399 -3495 -10071
740 -10071 -3252 139 -5705 -1683 2645 1445 9057 10099 109 1231 678 -6350 -3317 -1557 -7664
755 -7664 -3100 553 -2114 5028 9998 3061 3447 2486 -6836 -5049 -771 -4144 -930 660 -5260 75
771 75 6845 2613 4961 7193 -1093 -2488 -2421 -8701 -4208 2729 -3263 -1273 3921 1419 4190 6955
787 6955 -704 -135 2393 -5660 -5553 602 -3489 -2154 2393 -2045 1333 7633 2185 1097 3815 -4192
803 -4192 -5489 -937 -4085 -1388 4874 -579 -406 5767 489 -440 4219 -1291 -3318 -456 -6078 -5355
$$ packed form
695G132P75q242n463Q138j420o350L165l797k974J0333L160j278O940l360q894
710b135J636l024m172P560r29o867N737L010J598Q751k559r464L409j642p985
725g076L465Q38l445M591j878l709J1809P879m410L42m684q806K685j096o576
740a0071O819L391n844M022M328j200P612J042r990J122n53p028L033J760o107
755g664M564L653k667P142M970o937L86r61r322J787M278l373L214J590n920N335
771G5O770m232K348K232q286j395O7o280M493O937n992J990N194k502K771K765
787F955p659N69K528q053J07O155m091J335M547m438L378O300n448j088K718q007
803d192j297M552l148K697O262n453J73O173n278r29M659n510k027K862n622P23
$$ plain form
819 -5355 2479 -726 -293 6824 4203 2601 5844 -368 -4006 -122 -6023 -8028 -905 -1741 -1684 4680
835 4680 2950 2669 8280 3419 -702 3463 -2188 -7246 -3360 -5896 -6136 1490 345 236 8211 5793
851 5793 1506 4875 1426 -3568 -39 -4449 -7882 -1243 -2540 -4942 3222 4278 2150 6994 4214
866 4214 -1070 2750 -946 -6864 -1962 -2585 -5929 -501 360 -958 6640 5348 366 4528 3146 -3886
882 -3886 -1077 -1476 -5808 -1684 -1970 -5170 2145 4329 357 5001 4804 -720 2344 1049 -4742 -957
898 -957 -694 -6862 -2568 542 -1899 3267 4782 -181 3244 3882 -1811 1762 2598 -4535 -2938 -2057
914 -2057 -6052 -658 2287 -1541 2830 4814 -1234 1276 3769 -1048 824 698 -5742 -2330 1238
929 1238 -4525 -1029 3095 -1099 1391 3688 -817 2371 4483 -3105 -3246 141 -3505 -824 2538
$$ packed form
819e355P834l205M33P117k621j602L243o212l638L884n901k005P123q36N7O364
835D680j730k81N611m861m121M165n651n058L886k536k40P626j145j09P975k418
851E793m287L369l449m994L529m410l433O639j297k402Q164J056k128M844k780
866D214n284L820l696n918M902o23l344N428Q61j318P598j292m982M162j382p032
882c886K809l99m332M124k86l200P315K184l972M644j97n524L064j295n791L785
898i57K63o168M294L110k441N166J515m963L425O38n693L573Q36p133J597Q81
914b057l995N394K945l828M371J984o048K510K493m817J872j26o440L412L568
929A238n763L496M124m194K490K297m505L188K112p588j41L387l646K681L362
$$ plain form
944 2538 -2349 -296 2873 -2308 172 5379 790 473 1862 -4067 -3229 1086 -2729 -735 3537 -1399
960 -1399 -1190 3543 -539 106 3788 -1861 -1678 2183 -2373 -2559 2491 -1276 -1927 1930 -1219 603
976 603 5915 -594 -2524 1760 -2479 -2568 2409 -340 -377 3031 -2437 -3831 2474 455 -563 3225
992 3225 -625 -1826 2469 -1034 -2406 3285 638 -2399 1843 -912 -2429 2173 -1492 -3186 2200
1007 2200 137 -1311 4159 1708 -1734 1792 -1173 -3006 2630 378 -2958 1522 -1018 -4097 1153
1022 1153 1549 512 4741 1573 -2929 1522 -210 -3987 506 -442 -2580 1953 411 -2702 3138
1037 3138 2592 -1642 2074 1471 -2066 1629 -406 -4843 156 -143 -3506 2196 3231 -365 2813 1213
1053 1213 -2924 1212 1070 -3335 490 689 -4083 -348 397 -1767 2768 3704 -1022 2268 2794 -3106
$$ packed form
944B538m887K053L169n181K480N207m589l17J389n929Q38M315l815J994M272m936
960a399K09M733m082O45L682n649J83L861m556j86N050l767o51L857l149J822
976F03N312o509j930M284m239q9M977k749l7L408n468j394O305k019j018L788
992C225l850j201M295l503j372N691k647l037M242k755j517M602l665j694N386
1007B200k063j448N470k451l442L526k965j833N636k252l336M480k540l079N250
1022A153L96j037M229l168m502M451j732l777M493r48k138M533j542l113N840
1037C138n46m234L716o03l537L695k035m437M999k99l363N702J035l596L178j600
1053A213m137M136j42m405L825J99m772L735P45k164M535R36m726L290N26n900
$$ plain form
1069 -3106 -824 158 -3848 -112 1148 -2911 1107 2787 -1968 1053 2913 -815 1720 2205 -3290
1084 -3290 -782 563 -4416 -1189 2291 -1528 990 2793 -1450 1157 2611 -2403 51 2580 -2289
1099 -2289 -831 1413 -2528 -621 1583 -2847 -115 3893 -520 -297 2206 -1697 -481 2098 -2268
1114 -2268 -229 2949 -2432 -2428 1659 -1608 -211 2980 -1377 -630 2824 -1139 -1200 2794 -947 -1253 1594
1131 1594 -2372 -1778 2309 -1625 -1537 2256 -1280 -871 3240 728 33 2685 -2064 -2462 1841 -1365
1147 -1365 -2128 1821 -1148 -1623 2505 -242 773 4727 963 -2272 1025 -1268 -2738 778 -1634
1162 -1634 -2629 1772 -841 -1835 4124 2894 304 2904 -549 -2709 1507 -1250 -3448 374 -1615
1177 -1615 -3550 1418 1359 361 4591 1764 -1398 2219 383 -2470 994 -896 -4089 -753 -1297 -1706
$$ packed form
1069c106K282R82m006L736J260m059M018J680m755L021J860l728K535M85n495
1084c290K508J345m979L227L480l819K518J803m243K607J454n014K454K529m869
1099b289J458K244l941J907K204m430K732M008m413K23K503l903J216K579m366
1114b268K039L178n381MM087l267J397L191m357P47L454l963o1L994l741l06K847
1131A594l966N94M087l934Q8L793l536M09M111k512o95K652m749l98M303l206
1147a365p63L949k969m75M128k747J015L954l764l235L297k293j470L516k412
1162a634r95M401k613r94N959j230k590K600l453k160M216k757k198L822j989
1177a615j935M968n9r98M230k827l162L617j836k853L464j890l193L336n44m09
$$ plain form
1193 -1706 3863 3444 -401 2647 1497 -1637 1716 361 -2799 -260 -1945 -5360 -65 1779 -175
1208 -175 3562 2611 -764 2522 1557 -2259 1060 288 -4497 -1380 -753 -2830 1878 2446 -726 2235
1224 2235 2588 -1010 2431 2720 -2377 -1484 -1845 -4916 -234 1880 -1436 1649 2748 -1048 1424 2477
1240 2477 -225 2253 1336 -4699 -3105 -283 -3210 -115 1901 -903 1788 3311 -482 1802 3496
1255 3496 -1618 -1664 -1012 -3659 -987 1483 -2298 -502 1769 -1100 1611 4801 911 827 1191 -4214
1271 -4214 -2922 -59 -2843 -363 2690 -1412 -593 2560 368 2179 4067 -1204 -1193 805 -3507 -2981
1287 -2981 318 -1359 -264 2452 -1045 1060 5150 722 -877 485 -2789 -2064 761 -2156 -1780
1302 -1780 1806 -1281 -1384 3308 1935 1390 3799 -1269 -2847 -583 -2967 -2498 1719 -374 -717 2710
$$ packed form
1193a706N569m19l845L048j150l134L353j355l160K539j685l415N295J844j954
1208a75L737r51l375L286r65l816L319p72m785L117O27k077M708N68l172K961
1224B235L53l598L441K89n097Q93l61l071M682K114l316L085J099l796K472J053
1240B477k702K478r17o035J594K822k927L095K016k804K691J523l793K284J694
1255C496n114m6O52k647K672K470l781J796K271k869K711L190l890q4L64n405
1271d214J292K863k784K480L053m102Q19L153k192J811J888n271J1J998m312N26
1287b981L299j677J095K716l497K105M090m428j599J362l274P25K825k917L76
1302a780L586l087j03M692j373n45K409n068j578K264k384M69M217k093l43L427
$$ plain form
1318 2710 406 301 3212 535 -905 1456 -1893 -3316 255 -1049 -1936 1332 -266 -356 4144 1717
1334 1717 -861 1628 -916 -2914 -203 -1697 -1824 2317 264 -2145 1606 1379 -111 2608 561
1349 561 -1901 843 -1631 -3864 454 828 -1036 2404 1123 -938 2038 511 -2216 726 -607
1364 -607 -2898 519 765 -1537 1525 1099 -1155 2318 1963 -1586 509 -379 -3430 -812 -833 -2274 2146
1381 2146 2533 -317 2501 2207 -1361 456 -69 -2986 -669 -206 -3549 -43 1536 -577 2605 3200
1397 3200 623 1999 1351 -3289 -1451 -1055 -3956 -1808 729 -972 2097 3410 655 2655 3405 -1126
1413 -1126 -594 -201 -3761 -2626 -1155 -3325 109 3016 198 3045 4740 954 1077 977 -3044 -2515
1429 -2515 -1202 -4203 -2359 769 -1110 1077 4116 1946 2759 3744 -1003 -1685 -441 -4247 -3562 -554
$$ packed form
1318B710k304j05K911k677j440K361l349j423L571j304q87L268j598r0M500k427
1334A717k578K489k544j998K711j494j27M141k053k409L751k27j490K719k047
1349E61k462K744k474k233M318L74j864L440j281k061K976j527k727K942j333
1364f07k291L417K46k302L062m26k254L473l55l549K095q88l051K618k1j441M420
1381B146L87k850K818k94l568J817n25k917K317M63l343L506J579k113L182N95
1397C200k577J376o48m640J838L96k901K148K537j701L069J313k755K000P50m531
1413a126N32L93l560J135J471k170L434K907k818K847J695l786J23j00m021N29
1429b515J313l001J844L128j879K187L039k170Q13R85m747o82J244l806O85L008
$$ plain form
1445 -554 -2013 -343 2650 910 2570 4527 842 -269 1483 -2133 -2806 -692 -2836 -1802 1243
1460 1243 -664 527 4254 2061 1280 2339 -1232 -2159 -239 -3347 -2905 1045 -747 -1059 2351 1092
1476 1092 1468 3513 149 -1581 640 -2053 -2818 369 -845 -700 2012 576 221 3541 1268 -801
1492 -801 953 -1808 -3352 -689 -1455 -1338 2177 725 -440 2990 1768 -109 1853 -688 -2958 -986
1508 -986 -2192 -2692 1498 1402 -38 2659 2053 567 2508 308 -2619 -863 -2695 -4698 -1053 -80
1524 -80 -457 3043 2590 874 3522 2654 -1039 258 -1599 -4624 -2823 -2373 -2598 1791 2491 611 3559
1541 3559 3499 717 2184 780 -3067 -2398 -3088 -5228 -1410 421 -641 2798 3515 1750 3303 2978
1557 2978 -622 -484 -1645 -5260 -3846 -1697 -2341 779 2607 1230 3376 3707 598 1645 1431 -3057
$$ packed form
1445e54j459J670K993j740J660J957l685j111J752l616o73K114k144J034L045
1460A243j907J191L727k193p81J059l571r27J920l108M42L950j792l12L410j259
1476A092L76K045l364j730K221k693p65L187j214J45K712j436l55L320k273k069
1492h01J754k761j544K663p66J17L515j452j165L430j222j877J962k541k270J972
1508i86j206n00M190r6j440K697o06j486J941k200k927J756j832k003L645R73
1524h0l77L500m53j716K648q68l693J297j857l025J801M50k25M389P00j880K948
1541C559o0k782J467j404l847O69o90k140L818J831j062L439P17j765J553l25
1557B978l600J38j161l615J414K149o44L120J828j377K146L31l109J047k14m488
$$ plain form
1573 -3057 -3026 -2556 -4195 -1652 763 -708 1984 3669 1427 2351 2922 -369 -620 -1299 -4537 -2866 -476
1590 -476 -2074 -54 2410 474 1722 3100 619 1154 1187 -2567 -2846 -830 -2611 -1063 1129 -466
1606 -466 911 2509 288 888 2274 -613 -1064 -106 -2411 -1438 869 -1145 17 2058 -76 168
1622 168 1856 -168 -469 472 -1872 -1897 674 -802 -493 2214 327 -247 1622 -449 -594 1148 -1161
1639 -1161 -2054 384 -749 -712 1720 596 304 2323 38 -1264 1245 -755 -1940 -32 -1279 -1399
1655 -1399 1322 181 118 2522 984 -317 1574 -316 -1733 224 -1368 -2021 344 -461 -720 1876
1671 1876 1498 250 1862 686 -921 448 -1316 -2589 -449 -469 -1526 1198 1049 287 2407 1179
1687 1179 -611 1219 377 -2200 -386 -936 -1991 339 227 -927 1747 1981 -46 1590 1081 -1038
$$ packed form
1573c057L1M70j639K543K415j471K692J685k242R24N71l291k51o79l238J671K390
1590d76j598K020K464j936J248J378k481N35L3l754k79K016j781J548K192j595
1606d66J377J598k221O00J386k887m51R58k305R73K307k014J162K041k134K44
1622A68J688k024l01R41k344k5K571j476L09K707j887n74J869k071j45J742k309
1639a161q93K438j133L7K432j124k92K019k285j302K509k000j185J908j247j20
1655a399K721j141o3K404j538j301J891j890j417J957j592o53K365q05k59K596
1671A876l78j248J612j176j607J369j764j273K140k0j057K724j49p62K120j228
1687A179j790J830q42k577J814n50j055K330j12j154K674K34k027J636n09k119
$$ plain form
1703 -1038 97 -563 -2458 -564 28 -1661 862 922 -92 1630 1467 -216 928 362 -2173 -730
1719 -730 7 -1932 16 816 -862 1198 1857 -327 1369 1412 -1505 -734 -132 -2048 -336 450 -1135
1736 -1135 857 1849 -430 724 1839 -168 171 -8 -2204 -1012 391 -1501 -15 1602 23 861
1752 861 1590 -308 577 1187 -1829 -1409 -153 -1857 -828 1068 -618 598 1956 -154 543 1852
1768 1852 -556 -721 -53 -2429 -1771 330 -812 96 2099 -72 213 2269 197 54 932 -1789 -1737
1785 -1737 -409 -1868 -911 1719 -137 212 1997 541 1015 2108 -765 -1513 -258 -1722 -2262 49
1801 49 -317 53 2240 504 356 2153 956 -411 483 -1554 -2275 -130 -1325 -772 1537 564 -16
1818 -16 1784 974 28 1755 -137 -1775 -489 -1899 -1898 592 610 -263 1815 848 86 1611 551 -905
$$ packed form
1703a038J135o60j895J894N92j689K523O0j014J722j63j683J144n66k535J443
1719g30P37j939J948Q00j678K060O59k184J696M3k917P71O02j916J712P86j585
1736a135J992R92k279J154J115k007L39j79k196J192J403j892J486J617j579Q38
1752H61P29j898Q85O10l016M20J256j704J029J896j686J216J358k110O97J309
1768A852k408j65O68k376O58K101j142R08K003k171K85K056k072j43Q78k721N2
1785a737J328j459R57K630j856L49J785j456M74J093k873p48J255j464n40K311
1801D9l66L70K187j736j48J797j197j367Q94k037p21K145j195N53K309r73n80
1818a6J800q10r46J727j892j638J286j410JK490J8q73K078r67p62J525j060j456
$$ plain form
1836 -905 421 -1239 -2777 -275 -282 -519 1240 715 -54 2113 1068 -447 776 -195 -1875 -295 -1023
1853 -1023 -1368 1153 1286 -616 985 962 -232 1504 445 -1670 -38 -590 -2273 -226 518 -256 1715
1870 1715 1418 -707 1031 837 -861 227 -145 -2204 -402 -55 -1006 810 1318 -65 1412 1303 -911
1887 -911 416 556 -1782 -916 -727 -1545 535 1131 -453 919 1702 -166 553 974 -992 -34 320 -2163
1905 -2163 -1296 705 -754 519 1366 -107 804 1378 -716 -44 901 -1528 -1080 -261 -1263 -105 1154
1922 1154 -387 617 1656 -184 216 1386 -669 -798 -3 -1633 -753 577 -700 574 1609 -103
1938 -103 -167 1013 -417 -272 894 -1078 -1020 653 -625 -564 818 -146 220 1373 -524 -144 1256 -539
1956 -539 -721 635 -631 -212 1358 -338 -371 843 -558 -574 946 -123 -685 918 -529 -1121 703
$$ packed form
1836i05J326j660j538K502pk37J759n25p69K167j045j515J223r71j680J580p28
1853a023l45K521J33j902J601k3j194J736j059k115J632n52j683K047P44p74J971
1870A715k97k125J738j94j698J088l72k059J802L47r51J816N08j383J477j09k214
1887i11J327J40k338Q66J89q18K080N96j584J372P83j868P19M21j966R58L54k483
1905b163Q67K001j459J273Q47j473R11N74k094O72R45k429M48Q19j002J158J259
1922A154j541J004J039j840M00J170k055j29P95j630Q80J330j277J274J035j712
1938a03o4J180j430J45J166j972N8J673j278O1J382r64L66J153j897L80J400j795
1956e39j82J356j266M19J570j696l3J214j401j6J520j069n62J603j447n92J824
$$ plain form
1973 703 -229 -196 1477 86 -435 639 -636 -1063 525 -589 -687 1264 298 -468 1078 185 -297 1076
1991 1076 -436 -1089 609 -582 -1468 189 -1 -409 1431 724 -116 1464 322 -1156 260 -408 -1405
2008 -1405 129 -350 -1166 972 535 -493 1789 1171 -100 873 24 -1393 -331 -754 -1760 262 358
2025 358 -1045 1211 1196 -98 1516 570 -896 153 6 -2052 -799 -224 -1116 625 1060 128 1702
2042 1702 1523 -334 493 275 -1622 -464 -485 -1577 -148 524 -375 932 1231 190 1041 1055 -765 -411
2060 -411 -408 -1741 -512 203 -643 738 1613 316 902 1030 -596 411 615 -1742 -600 -153 -1170 62
2078 62 846 -129 968 1649 -130 341 934 -859 -746 -140 -2021 -81 672 -545 391 1899 -137 266
2096 266 1241 -443 -416 124 -1483 -906 66 -898 8 1513 294 569 1153 -118 -244 1079 -1031 -1180
$$ packed form
1973G03r32L3J673j391n21J074j275m27J588j114r8J951r66p66J546q93m82J373
1991A076j512o53J698j191q86J657j90m08J840p07q40J580j142j478J416o68r97
2008a405J534m79q16K138m37j028K282o18j271R73q49j417J062m23j006K022R6
2025C58j403K256j5j294J614r46j466J049j47k058J253N75q92J741M35r32J574
2042A702j79j857Q27k18j897J158k1j092J429O72q99J307K99j041Q51J4j820L54
2060d11Lj333J229P15q46J381Q75j297N86J28j626J007K04k357J142M47j017J232
2078F2P84r75J097O81j779M71N93j793J13O06j881J940P53j217R36J508k036M03
2096B66R75j684K7N40j607N77R72r64R06J505j219K75N84j271j26J323k110j49
$$ plain form
2114 -1180 202 -1239 -575 818 82 545 1698 -58 -56 1215 -397 -912 -115 -1295 -1314 156 -586 -226
2132 -226 1530 908 311 1323 45 -294 703 -1075 -1419 208 -830 -628 742 439 48 1333 365
2149 365 -557 1076 -616 -1202 139 -452 -1154 779 16 -50 1186 177 -358 961 -34 -753 571 -644
2167 -644 -855 409 -192 -800 837 658 -525 975 306 -533 647 -282 -1141 450 -160 -1023 533 265
2185 265 -388 931 665 -904 510 86 -929 332 -165 -1065 400 205 -644 843 719 -535 667
2202 667 172 -972 197 43 -930 250 655 -668 709 785 -764 491 635 -848 116 212 -1177 218
2220 218 414 -899 285 654 -357 748 641 -583 -169 344 -988 -375 408 -742 111 459 -604
2237 -604 631 1150 -340 158 641 -750 -132 53 -1038 18 319 -557 233 923 -79 92 667 -500
$$ packed form
2114a180J382j441O64J393p36M63J153j756KJ271j612n15P97j180j9J470p42L60
2132b26J756o22n97J012j278l39R97j778l44J627j038K02J370l03l91J285r68
2149C65r22J633j692n86J341n91p02J933p63o6J236j009n35J319r95p19J324j215
2167f44k11J264o01o08J637j79j183J500o69q39J180r29q59J591o10q63J556k68
2185B65o53J319k66j569J414m24j015J261m97r00J465j95q49J487j24j254J202
2202F67m95j144J169j54r73J180M05j323J377P6j549J255J44j483R64R6j389J395
2220B18J96j313J184L69j011J105j07j224M14N13j332O13P83j150Q53L48j063
2237f04J235N19j490M98M83j391O18J85j091J056L01q76P90O90j002J71N75j167
$$ plain form
2255 -500 -460 336 -994 -396 425 -1043 9 1089 -254 265 983 -312 54 552 -837 -708 311 -575
2273 -575 -677 646 -377 223 1107 -114 -344 897 -184 -685 376 -546 -543 475 -529 -42 1125 -131
2291 -131 37 872 -71 -314 805 -562 -1073 637 -452 -398 948 -40 65 836 153 -325 817 -209
2309 -209 -742 539 -628 -796 331 -41 -58 1403 380 -26 827 -56 -639 267 -358 -1127 143 -449
2327 -449 -451 1039 521 -244 699 336 -508 544 -404 -1045 308 -401 -1221 55 622 -12 1001 424 -366
2346 -366 813 465 -1102 179 -394 -1400 -77 140 -542 643 959 -22 886 753 -692 465 -268
2363 -268 -1231 -391 -314 -1373 513 456 -140 768 1005 -108 660 453 -1070 -145 -355 -1640 -266 391 -707
2382 -707 431 869 71 918 1195 -343 456 241 -1461 -648 -356 -1399 115 499 -150 574 1075 -58
$$ packed form
2255e00M0P96j330N98Q21j468J052J080j343N19P18j295L66M98j389J29J019q86
2273e75j02J323j023O00Q84j221k30J241j081n01J061r22LJ018j004M87J167j256
2291a31J68Q35r43k43J119j367n11J710j089N4J346r88J05P71o83m78J142j026
2309b09n33J281j167j68J127l72j7J461j023m06Q53q83n83R06o25p69J270n92
2327d49kJ490n18p65R43l63q44J052r48o41J353p09q20J276N67o34J013n77p90
2346c66J179l48j567J281n73j006J323K17o82J185L16r81R08j33j445J157p33
2363b68r63Q40P7j059J886n7n96R08K37j113P68k07j523R25k10j285J374O57j098
2382g07J138M38p98Q47K77j538P99k15j702Q13K92j043J514L84o49P24N01j133
$$ plain form
2400 -58 680 603 -625 -138 -3 -1074 -799 386 -746 220 1048 177 315 1085 69 380 87 -1045 -852
2419 -852 -188 -805 24 492 36 450 1157 -27 416 833 -572 -565 -48 -1087 -396 563 -193 24 965 -13
2439 -13 233 1023 -266 -281 271 -937 -527 191 -814 -170 957 166 -35 952 -284 -108 850 -829 -600
2458 -600 85 -818 -325 413 36 -231 967 -243 -135 937 -303 -664 522 -438 -779 382 -319 -171
2476 -171 796 424 -91 492 41 -494 220 -547 -604 357 -81 -206 986 278 -102 935 -100 -291 503
2495 503 -416 -884 314 -283 -543 689 136 -336 810 283 -475 503 49 -887 462 17 -900 317
2513 317 99 -40 879 501 -315 707 237 -463 151 -307 -830 -40 147 -595 553 501 -265 450 471 -799
2533 -799 267 -165 -1043 -79 161 -831 78 703 -306 801 623 -364 132 25 -978 -192 143 -741 176
$$ packed form
2400e8P38p7j228M87J35j071K75J185j132R66Q28q71J38P70j016L11k93j132J93
2419h52O64o17Q29M68m56M14P07j184M43M17j405PN17j039O91R59p56K17R41r78
2439a3K46P90j289j5N52j208M10P18j005O44J127p91k01R87j236J76R58j679K29
2458f00O85r03M93P38l77k67J198j210J08J072j240l61J186r60l41J161p01J48
2476a71R67l72n15N83m51n35P14p67n7R61m38j25J192p08l80J037j035j91P94
2495E03r19m68J198n97k60J232n53m72J146n27p58R78m54r36J349m45r17J217
2513C17k18j39R19l78q16J022m70p00O14m58n23P90J87p42J148n2p66P15K1j270
2533g99J066m32q78R64K40r92R09O25j009J107j78r87M96j07j003P86L35q84R17
$$ plain form
2552 176 490 38 686 775 -230 45 512 -741 -231 -89 -953 29 332 -289 541 1068 16 156 699
2571 699 -494 -151 133 -935 -183 -244 -358 225 662 -217 341 579 -469 248 211 -733 -427 110 -661 -105
2591 -105 448 -362 135 799 -246 -98 404 -489 -528 124 -820 -495 391 -347 -88 735 60 179 680 -261
2611 -261 -397 216 -585 -336 81 -220 -94 583 82 228 844 -53 -197 405 -284 -717 303 -627 -314 389
2631 389 -127 -282 998 270 183 566 -93 -628 134 -341 -676 146 -314 -337 493 301 49 784 73 -107
2651 -107 323 54 -772 69 -128 -375 558 363 -112 733 26 -444 392 90 -859 98 -209 -771 254 -113
2671 -113 -151 724 245 -128 598 243 -390 458 -198 -614 158 -208 -307 597 188 -386 525 368 -238 601 251
2692 251 -542 65 -78 -659 79 397 65 334 374 -289 557 114 -508 32 341 -445 -213 285 -656 388
$$ packed form
2552A76L14m52O48Q9j005K75M67j253N10J42q64R82L03o21Q30N27j052J40N43
2571F99j193L43K84j068P52o1j14N83M37q79N58K38j048P17l7r44L06N37p71N56
2591a05N53q10M97O64j045J48N02q93l9O52r44L25Q86p38K59Q23o75J19N01r41
2611b61j36O13q01K49M17l01J26O77n01J46O16q97j44O02o89m33J020r30L13P03
2631C89n16j55J280p28q7L83o59n35P62m75l35Q22m60k3Q30j92k52P35p11j80
2651a07M30k69q26Q41j97k47R33j95m75Q45p07m70Q36l02r49R57l07n62J025l67
2671a13l8Q75m79l73P26l55o33Q48o56m16P72l66r9R04m09n74R11j57o06Q39l50
2692B51p93O07j43n81P38L18l32K69M0o63Q46m43o22N40L09p86K32M98r41J044
$$ plain form
2712 388 -9 -190 303 326 -257 221 459 -580 -95 -31 -720 28 570 -411 118 432 -279 174 460 -296
2732 -296 133 303 -696 -211 379 -322 201 605 -582 335 521 -305 236 602 -215 -224 206 -478 32 594
2752 594 -317 -20 547 -392 -3 566 109 140 478 -505 -49 299 -294 -327 291 -81 40 318 -346 33 314
2773 314 -232 -81 431 -358 -360 267 -275 -238 360 -285 -293 304 -294 -135 594 -276 136 508 -196 -480 540
2794 540 -501 -268 644 -247 -225 473 -268 -108 336 -201 -287 406 -163 -239 183 -351 -244 298 -159 -207 604
2815 604 -62 -91 376 -277 -82 445 -105 -466 322 -198 -531 203 63 -423 429 157 114 507 222 -536 176
2836 176 -155 -756 89 139 -82 473 206 -206 318 295 -610 438 -69 -572 113 -211 -481 -57 301 -326
2856 -326 295 116 -301 385 131 -822 -180 -91 -537 183 522 -288 185 400 -188 701 260 -480 126 -53
$$ packed form
2712C88l97j81M93K3n83M78K38j039M85O4o89P48N42r81N29L14p11M53K86p56
2732b96M29J70r99M85N90p01N23M04j187R17J86q26N41L66q17rM30o84N10N62
2752E94r11K97N67r39L89N69m57L1L38r83M56L48n93l3O18l72J21K78o64L79K81
2773C14n46J51N12p89kO27n42L7N98o45qN97n98J59P29q70M12L72p04k84J020
2794E40j041K33R12q91K2O98p41J60M44n37q6O93n69p6M22n34J07N42m57m8Q11
2815F04o66k9M67o53J95N27n50l61P88n20l33P34j40m86Q52k72m3L93k85p58P12
2836A76l31o01Q45N0k21N55k67m12N24k3r05J048n07n03O85l24k70M24L58o27
2856c26O21j79m17O86k54r53O42Q9m46P20L39q10M73K15n88Q89m41p40O06j79
$$ plain form
2876 -53 -485 78 57 -184 409 362 -359 484 193 -79 140 245 -566 181 -252 -945 -187 94 -385 -89 425
2897 425 -181 207 268 -507 -16 213 -760 195 86 -332 -89 531 -458 213 661 -134 -200 99 -454 -408 -32
2918 -32 -207 -13 358 -458 207 532 -147 37 314 -258 -170 296 -498 -260 267 -576 -285 474 57 422 409
2939 409 -240 -81 336 -334 -142 74 -432 -215 244 -328 117 537 66 -95 283 -179 -291 439 -493 -341
2959 -341 118 -145 60 185 -25 -79 585 -135 -304 340 -506 -384 110 -208 -180 152 -13 -64 736 -121 -267
2980 -267 382 -180 -493 314 -481 57 528 55 -346 269 324 -245 752 105 127 3 10 -453 143 -286 -199 430
3002 430 135 91 411 -21 -112 413 60 -366 -94 -170 -261 -154 -73 -366 419 248 15 303 14 -291 122 215
3024 215 -506 298 -91 -283 352 242 -232 179 310 -208 173 29 -266 302 -120 -463 -74 244 -167 49
$$ packed form
2876e3m32N63k1k41N93m7p21Q43k91k72K19J05q11P47m33o93P58K81m79K96N14
2897D25o06L88O1p75M91K29r73R55j09m18K43O20r89O71M48p95o6K99n53M6L76
2918c2j75J94L71q16O65L25o79J84K77n72Q8M66p94K38N27q43K91P59m17L65j3
2939D09o49J59M17o70J92K16n06K17M59n72M45M20m71j61L78m62j12P30r32J52
2959c41M59k63K05J25k10n4O64p20j69O44q46J22M94l18K8L32j65n1Q00q57j46
2980b67O49n62l13Q07p95N38M71m73m01O15N5n69R97o47K2j24Pm63N96m29Q7O29
3002D30k95m4L20m32r1N25l53m26K72p6r1J07Q1k93P85j71k33K88k89l05M13R3
3024B15p21Q04l89j92O35j10m74M11J31n18L81j44k95N68m22l43L89L18m11K16
$$ plain form
3044 49 220 -157 349 28 -332 111 278 -452 -3 345 -325 197 158 -303 122 357 -209 -36 311 -438 -332
3065 -332 370 -213 148 322 -43 -30 456 -411 -44 154 -389 43 334 -67 -90 444 -371 -82 136 -370 42
3086 42 544 -361 -122 284 218 -52 418 -262 -120 263 26 45 190 -246 -169 88 -110 -69 469 -81 89 474
3108 474 -272 -196 248 -315 -546 233 -46 -185 432 74 90 752 291 224 239 -319 -254 156 -155 -171 113 -250
3130 -250 -254 470 -14 4 306 23 -356 177 -292 -309 141 -226 -338 220 126 -128 589 179 36 255 -134 -588
3152 -588 331 5 -585 192 -141 -221 725 315 -137 469 209 -154 337 -263 -534 -137 -20 -334 297 -58
3172 -58 258 410 334 -161 143 -45 -541 57 120 -403 -45 -55 -300 484 193 -51 517 83 -363 269 -264
3193 -264 -584 137 -163 -274 192 479 36 393 341 -372 148 58 -642 -49 -134 -402 -106 -99 -437 177 405 65
$$ packed form
3044D9J71l77N06l21l60M43J67p30M49L48o70N22l9m61M25K35n66J73L47p49J06
3065c32P02n83L61J74l65J3M86q67L67J98n43M32K91m01k3N34q15K89K18n06M12
3086D2N02r05K39M06o6k70M70o80J42L83k37J9J45m36P7K57j98M1N38n50J70L85
3108D74p46P6M44n63k31P79k79j39O17l58J6O62m61o7J5n58O5M10l11j6K84l63
3130b50mP24m84J8L02k83l79N33m69j7M50l67j12N58r4k54P17m10j43K19l89m54
3152e88R19l26n90P77l33q0R46m10m52O06k60l63M91o00k71L97J17l14O31l55
3172e8L16J52p6m95L04j88m96N98O3n23L58j0k45P84k91k44N68m34m46O32n33
3193b64l20P21l00j11M66K87m43L57n2p13N20r0p00N93q5k68K96Pl38O14K28l40
$$ plain form
3215 65 39 58 -353 48 381 -491 -177 -134 -277 -93 62 -165 215 161 -335 35 215 -321 -7 224 -511 -30
3237 -30 308 -347 109 334 -78 -42 327 -304 27 203 -326 138 394 7 -24 398 162 15 504 -173 115
3258 115 220 -394 -105 342 -294 -194 536 67 -261 146 -386 -328 26 -192 -43 284 -458 -238 412 -192
3278 -192 -171 88 -286 -282 176 -161 -33 672 151 -10 453 -74 -248 393 -189 -267 295 -167 -170 336 -262 -200
3300 -200 237 186 -394 385 -299 -203 415 33 -281 218 -29 -233 275 15 -149 129 -44 -347 -10 -60 -297
3321 -297 132 212 -299 466 29 -204 453 -141 -114 102 -133 -287 95 73 -493 283 -107 9 72 130 -7 409
3343 409 -6 -167 202 -23 -275 -132 -180 -320 194 48 -162 63 317 -215 -58 397 -557 -28 -186 -263 -191
3364 -191 39 -304 149 47 -356 307 46 -339 306 -63 -370 155 285 169 227 357 -323 62 408 -263
$$ packed form
3215F5k6J9m11M01L33q72L14M3j43J84J55k27L80n4m96L70J80n36L14K31p35M81
3237c0L38o55M56K25m12L6L69o31L31J76n29M64K56l87l1M22k36j47M89o77K88
3258A15J05o14K89M47o36J00P30m69l28M07n32N8L54k18J49L27p42K20O50o04
3278a92K1K59l74MM58l37J28P05n21j61M63n27j74O41n82p8N62m62lN06n98O2
3300b00M37n1n80P79o84R6O18l82l14M99k47k04N08k60j64K78j73l03L37n0k37
3321b97M29Q0n11P65m37k33O57n94K7K16k35j54L82k2n66P76l90J16O3N8j37M16
3343D09m15j61L69k25k52J43m8j40N14j46k10K25K54n32J57M55r54N29j58p7P2
3364a91K30l43M53j02m03O63k61l85O45l69l07N25J30j16N8J30o80L85L46o71
$$ plain form
3384 -263 -131 332 -235 -29 -62 -267 20 359 -527 111 132 -427 164 246 -123 105 253 -293 -162 169 -205
3405 -205 -85 346 112 268 476 -185 50 246 -161 -101 158 -193 70 402 -102 387 168 131 -318 379 14
3426 14 -288 211 -287 -222 10 -164 8 572 65 180 286 -181 35 384 -322 -486 65 -380 -127 -15 -65
3447 -65 22 303 22 7 43 -279 -225 109 -159 -150 391 -158 -77 448 -39 -195 340 76 -303 -72 -148 -518 4
3470 4 -186 -188 117 162 -282 482 -231 -75 276 -10 -80 274 -51 -255 266 -88 -190 460 208 -90 307 -109
3492 -109 -219 106 258 -99 40 -20 -296 127 109 -231 119 71 -178 77 144 -357 -233 258 -197 164 212 -384
3514 -384 109 -24 -288 165 68 -345 21 149 -282 -161 220 -136 181 117 -161 -54 -68 114 -13 219 -131
3535 -131 34 108 -53 28 -161 -327 182 197 -79 64 427 51 154 -113 -172 108 82 -229 -82 116 -280 220
$$ packed form
3384b63J32M63n67K06l3k05K87L39q86O38K1n59N91Q2l69K28J48n46J31L31l74
3405b05J20M31k34J56K08o61K35J96m07O0K59l51K63L32n04M89k19l7m49O97l65
3426A4l02M99m98O5K32j74J72N64n07J15J06m67K16L49p06j64N51m45K53J12n0
3447f5Q7K81k81j5L6l22N4L34k68RN41n49Q1N25m87j56N35k64l79K31p6l70N22
3470Dj90kL05M5m44P64p13J56L51k86p0L54l25k04N21l54j02O50k52k98L97m16
3492a09j10L25J52l57J39o0k76M23j8l40L50m8k49K55O7n01J24M91m55L61M8n96
3514c84M93j33k64M53r7m13L66J28m31J21L81l56L17o4k78J07j4J82j27K32l50
3535a31J65P4j61Q1j89j66N09J5k76J43L63l76J03k67n9K80k6l11J47J98l96N00
$$ plain form
3557 220 229 -176 147 166 -315 41 15 -175 283 315 -155 321 311 -87 22 186 -242 281 207 -264 -166 100 -220
3580 -220 -55 237 -104 -237 311 -273 26 479 -164 -257 196 125 141 -53 65 -295 41 -579 -197 79 -274
3601 -274 -97 19 261 -242 344 -276 -302 148 -237 -194 -149 -74 -199 105 16 -136 269 100 -129 225 -187 -63
3623 -63 157 -163 3 415 34 -2 295 9 -16 121 70 67 260 -206 -206 71 90 -104 190 -105 -38 722 75
3646 75 24 87 -87 -228 -340 -134 -285 120 -68 -127 109 -181 62 329 162 -37 216 -161 -410 -62 -198
3667 -198 -129 340 -65 133 302 314 -95 42 -1 -263 137 -237 -339 -23 -23 -291 121 167 184 385 170 255 30
3690 30 -119 -155 -15 187 -318 147 250 -180 78 289 -27 343 398 -61 93 50 -81 168 35 -236 226
3711 226 204 -235 162 54 -200 -277 -184 -264 -326 84 -249 92 -203 -96 257 390 -215 -81 227 -491 -128 63
$$ packed form
3557B20Rm05L23J9m81L56k6j90M58L2m70M76j0l98J09J64m28N23p4m71R8K66l20
3580b20J65K92l41j33N48n84K99M53o43r3M53p1J6j94J18l60L36o20L82K76l53
3601b74J77J16K42n03N86o20k6M50l85M3M5P5j25L04q9j52M05j69k29L54m12J24
3623f3K20l20J66M12l81l6K97k86k5J37n1lJ93m66%K77J9j94K94k95O7P60o47
3646G5n1O3j74j41j12K06j51M05j88n9K36k90K43K67j67j99K53l77k49L48j36
3667a98O9M69m05J98J69J2m09J37m3k62M00l74j02L16%k68M12M6J7K01k15Q5k25
3690C0j49l6J40K02n05M65J03m30K58K11l16L70N5m59J54m3j31K49j33k71M62
3711B26k2m39L97j08k54p7R3q0o2M10l33L41k95J07L53J33o05J34L08p18L63J91
$$ plain form
3733 63 -8 -257 63 -298 -100 306 -170 -41 149 -336 -98 -146 -46 -163 169 -193 314 207 -347 -204 132
3754 132 -62 78 275 -367 -475 264 109 -144 86 -86 82 209 100 208 55 -215 -30 53 -19 130 72
3775 72 -265 78 150 -127 -147 38 93 -59 -53 -169 -344 103 13 156 150 134 -185 214 -150 -95 -87 8 126 272 -25
3800 -25 -134 455 159 -282 72 44 -5 -35 -186 -153 -15 14 -420 134 46 -41 -54 -56 -337 228 -189 -58 102 -55
3824 -55 -245 119 27 70 361 -379 -140 139 55 -177 105 -200 -7 43 -53 -204 98 146 -149 -33 37 -96 -57
3847 -57 -3 -192 70 -36 -183 204 103 -189 -176 82 -338 -228 172 248 37 75 -197 76 162 192 142 -35 -78
3870 -78 68 -198 -199 -109 98 14 134 140 183 189 247 104 -76 111 -316 143 -173 -54 -169 2 -6 167 317 -123
3894 -123 -80 -79 155 -105 61 -90 -152 -199 -173 -99 181 67 0 146 -62 78 318 -115 -237 -22 -154 -195 234
$$ packed form
3733F3p1k49L20l61J98M06m76J29J90m85K38m8J00j17L32l62N07j07n54J43L36
3754A32j94J40J97o42j08P39j55k53K30j72J68J27j09J08j53k70J85Q3p2J49n8
3775G2l37L43P2k77k0J85N5j52Oj16j75M47r0J43oj6l19L99l64N5QR5J18J46k97
3800b5j09N89k96m41L54k8m9l0j51L3J38K9m34N54q8q7j3kk81N65m17J31J60j57
3824e5j90L64r2M3K91p40K39K79q4k32K82l05J93N0r6j51L02M8k95J16P0j33L9
3847e7N4j89K62j06j47L87j01k92J3K58m20J10M00P6k11L8k72K73Q6L0n0j77m3
3870g8J46k66jR0K07q4J20OM3ON8j43j80J87m27M59l16J19j15J71qJ73J50m40
3894a23M3JK34k60J66j51o2m7K6P4K80j14o7J46k08J40K40m33j22K15j32m1M29
$$ plain form
3917 234 -107 281 183 -41 -85 45 22 -140 103 -339 -108 194 43 123 342 -50 -35 71 -7 -255 -30 -98
3939 -98 -78 -47 -143 80 459 -189 2 286 29 102 173 -120 -293 -3 84 -213 257 -273 79 28 -11 299 43
3962 43 54 -92 46 -267 -38 59 5 -32 161 -86 -261 42 37 -88 117 -144 -327 -131 -188 -13 -136 -56 218
3985 218 364 -45 -174 152 121 -45 21 -94 -95 258 -101 148 107 117 -177 -72 157 -54 -54 91 65 -270 -18
4008 -18 -156 -141 -44 -227 -27 17 -81 414 -144 -287 90 225 -140 -155 246 -311 78 329 -114 -120 -48 -75 163
4031 163 108 1 70 55 -180 -22 186 53 46 148 229 -153 115 167 -94 62 -53 -11 -3 80 45 -82 70 247
4055 247 95 -79 -42 -50 136 -97 43 14 31 294 -109 -31 158 -285 60 226 103 191 473 -18 -91 48 101
4078 101 -58 -70 -167 -167 87 138 126 364 -69 51 230 -87 -44 51 116 135 -67 242 -11 -81 127 -252 -77 -89
$$ packed form
3917B34l41L88r8k24m4J30k3j62K43m42K31L02j51Q0K19l92J5J06p8k48K25o8
3939i8K0L1r6K23L79o48J91K84k57P3P1k93j73K90Q7k97M70n30L52n1l9L10k56
3962D3J1j46J38l13K29R7n4l7J93k47j75L03nj25K05k61j83J96n7J75j23Q0K74
3985B18J46m09j29L26l1j66O6j15jL53l59K49m1J0k94J05K29k11%J45k6l35K52
4008a8j38J5R7j83K00M4r8M95n58j43L77J35l65j5M01n57L89K51m43oP2k7K38
4031A63n5j07O9j5k35J58K08j33pJ02Q1l82K68N2k61J56j15M2QQ3l5j27J52J77
4055B47j52j74L7qJ86k33J40k9J7K63m03P8J89m43L45J66j23Q8K82m91p3J39N3
4078A01j59j2r7%K54N1j2K38m33J20J79l17M3R5O5J9k02L09k53p0K08l79J75j2
$$ plain form
4102 -89 -211 -180 -219 226 85 76 -30 88 82 133 162 221 -116 125 -217 -191 124 -64 75 106 185 223 267 116 109 -198
4128 -198 -201 -38 -26 2 -28 146 -41 -129 -104 92 -181 252 104 -140 -71 118 -168 -206 12 122 -64 17 -37 20
4152 20 -93 -124 29 38 -56 34 37 -467 151 34 -137 56 84 92 24 -11 -75 45 370 111 -311 21 -50 -63 155
4177 155 -83 33 325 -62 228 175 -14 129 74 -164 100 348 41 97 60 90 211 -112 -32 -216 -39 -61
4199 -61 219 -49 53 172 214 -316 76 169 -63 -44 0 -41 217 58 -82 81 179 104 -175 -20 27 -259 12
4222 12 -152 -48 1 -189 -202 25 165 150 189 -51 -283 -142 -82 11 238 23 30 208 -45 167 129 -300 163
4245 163 136 55 227 -68 297 -114 130 295 23 53 108 -81 118 -225 54 25 42 66 281 -110 -69 151 112
4268 112 68 81 -249 37 25 -21 91 157 170 108 69 -52 24 187 -91 29 -25 85 -159 -163 201 140 257 -94
$$ packed form
4102h9j22L1l9M45j41rj06J18oN1K9N9l37K41l42K6L15j88J39L1P9L8M4j51pl07
4128a98lJ63J2K8l0J74j87q8K5J96k73M33j48k44O9J89k86l8K18J10j86Q1n4N7
4152B0j13l1J53Rr4R0Ln04O18j17j71J93K8Qo8l5o4J20L25k59m22L32p1j3K18
4177A55k38J16K92l87K90n3j89J43n5k38K64K48l07N6l7L0J21l23Q0j84J77k2
4199f1K80k68J02J19M2n30L92R3k32J9M4m1K58j59j40J63R8p5k79J55M7k86K71
4222A2j64J04M9j90j3K27J40j5L9k40k32J41O0R3K27k15PJ78k53K12l8m29M63
4245A63k7q1J72k95L65m11K44J65k72L0N5j89J99l43K79k9J7K4K15l91M1K20l9
4268A12m4J3l30K86j2m6J12O6J3o2l9j21P6J63k78J20n4J10k44mL64o1J17l51
$$ plain form
4292 -94 -281 -10 61 -149 56 -221 -45 -401 -216 2 -88 -184 61 -13 -46 -266 266 337 151 -114 -83 -119 -42
4315 -42 -31 18 149 160 77 67 207 -63 -73 -239 -185 68 15 -26 210 243 133 48 -176 59 372 241 -175 -87
4339 -87 214 -27 -65 87 -257 115 40 -109 25 39 -45 51 -177 -178 -142 -148 -59 11 144 197 -164 80 82 -91 -49 -101
4365 -101 -88 71 219 214 -99 -108 -73 99 126 -31 444 -107 79 364 140 -159 118 -63 333 -159 -39 171
4387 171 268 367 95 -55 -12 19 203 -339 2 90 -313 30 -73 186 -131 248 107 -1 -202 -72 -120 -130
4409 -130 -6 -47 122 102 155 314 -48 -2 17 -366 45 218 -51 -39 79 -283 -310 7 107 -111 22 -147
4431 -147 -83 80 110 44 -159 124 -236 -99 198 -163 13 78 -59 -59 118 121 -151 258 103 -6 48 13 -38 -151
4455 -151 -18 122 -40 -251 -216 40 -363 66 85 -288 -100 -17 82 16 271 -308 7 -95 327 27 -67 -183
$$ packed form
4292i4j87K71P1k10K05k77J76l56J85K18r0r6K45p4l3k20N32P1j86k65L1l6P7
4315d2J1M9J31J1q3j0J40k70j0j66N4K53n3m1K36L3j10q5k24K35L13j31m16Q8
4339h7L01k41l8J52l44L72p5j49J34J4q4R6k28jL6oQ9P0J33N3l61K44Kj73M2n2
4365a01J3J59J48nl13rL5J72K7j57M75n51J86K85k24k99K77j81L96m92J20K10
4387A71R7R9k72j50M3L1J84n42L41Q8m03L43j03K59l17L79j41j08k01J30m8j0
4409a30J24m1J69k0N3J59l62M6J9l83M11J73k69J2J18l62k7L17J00k18J33j69
4431a47O4J63L0o6k03K83l60J37K97l61J76O5j37%J77Lk72M09j55j09N4l5n1j13
4455a51J33J40j62k11L5K56m03M29J9l73J88Q3R9o6K55n79L15j02M22l00r4j16
$$ plain form
4477 -183 266 38 151 -311 63 -49 102 19 -18 304 -25 41 -205 175 -103 42 87 -24 137 -69 -119 -131
4499 -131 -98 -96 -11 122 27 41 71 -146 -82 42 212 -19 254 326 -114 135 -61 -162 -151 139 -143 -19 29 -464
4523 -464 -206 0 64 49 -101 -140 -121 6 -235 9 158 66 97 13 51 179 -129 184 181 97 -39 -10 146 180
4547 180 -85 -161 -68 245 86 -76 78 -311 -148 -27 -95 133 -53 324 190 78 4 -54 303 -13 -67 161
4569 161 19 -173 -12 -22 42 124 181 -289 180 11 -170 0 -245 -101 107 129 295 -18 111 67 105 -237
4591 -237 -54 96 -122 -151 86 401 -104 -186 -68 -82 67 195 -11 31 106 -117 231 52 54 -44 103 -145 69
4614 69 -87 51 24 71 179 -46 19 -142 -116 126 42 -183 100 -5 -193 168 -26 20 -52 -208 139 29 204
4637 204 128 -8 -44 -109 -443 31 -155 214 -100 -164 130 -1 235 -11 123 71 40 -43 93 204 -288 -172
$$ packed form
4477a83M49k28J13m62L74j12J51q3l7L22l29O6k46L80k78J45M5j11J61k06n0j2
4499a31L3KQ5J33r5J4L0k17O4J24J70k31K73P2m40K49j96j01J1K90k82J24M8m93
4523d64K58K06O4j5j50l9J9J27k41K44J49r2L1q4L8J28l08L13lq4j36K9J56L4
4547A80k65p6R3L13j59j62J54l89J63J21o8K28j86L77j34j12p4n8L57l16n4K28
4569A61j42j92J61j0O4Q2N7m70M69j69j81J70k45J44K08K2J66l13J29m4L8l42
4591b37J83J50k18k9K37L15n05q2J18j4J49J28k06M2P5k23L48j79Kr8J47k48K14
4614F9j56J38k7M7J08k25O5j61K6K42q4k25K83j05j88L61j94M6p2j56L47j10J75
4637B04p6j36l6o5l34M74j86L69l14o4K94j31K36k46J34n2l1q3J36J11m92J16
$$ plain form
4659 -172 44 -63 205 -64 -11 -156 158 -55 139 114 166 -111 116 -275 188 37 -221 -183 -89 -78 -355 116
4681 116 -48 -116 277 136 -29 157 -290 -153 -112 87 -7 383 23 48 19 134 -73 -39 37 122 -39 -216 -131
4704 -131 172 -111 -370 -63 -18 -234 -84 -49 67 -55 110 -114 82 -133 -142 119 -92 -109 -86 547 -126 227
4726 227 196 -205 101 19 -207 -73 89 15 115 -61 267 -172 -32 -115 -95 -50 71 56 -73 -183 -42 30 -66
4749 -66 294 -121 -29 5 198 -110 30 -242 52 28 -11 13 107 58 -100 112 29 -13 349 -181 -137 179 -189 -206
4773 -206 -186 75 -14 31 45 -4 -114 197 -91 -60 -131 44 -66 12 276 -8 52 61 -36 -104 -219 -254 -59 -366 -154
4798 -154 101 69 -157 147 124 72 107 -15 -67 132 -161 -151 69 34 -60 250 162 6 271 2 14 -249 -79
4821 -79 96 143 -356 -225 -95 51 -35 137 75 -172 -5 28 136 -37 88 -208 -82 -302 12 201 -108 167
$$ packed form
4659a72K16j07K68k69N3j45L14k13J94k5N2k77K27l91M63j51k58L8R4J1k77M71
4681A16j64o8L93j41j65J86m47J37M1J99r4L90l60K5k9J15k07L4P6Q5j61j77Q5
4704a31L03k83k59L07M5k16J50L5J16j22J65k24J96k15rK61k11j7K3O33o73L53
4726B27l1m01L06q2k26J34J62p4J00j76L28m39J40q3K0M5J21j5j29j10J41P2r6
4749f6L60m15R2L4J93l08J40k72K94k4l9K4R4m9j58K12q3m2L62n30M4L16l68j7
4773b06K0K61q9M5J4m9j10L11k88L1p1J75j10P8K64k84O0Rr7o8j15l5J95l07K12
4798a54K55l2k26L04k3n2L5j22n2J99k93J0K20l5r4L10q8j56K65k69J2k63J70
4821g9J75M7m99J31J30J46q6J72o2k47J67L3J08j73J25k96J26k20L14J89l09K75
$$ plain form
4843 167 -39 20 144 -56 143 106 272 226 0 171 -78 125 272 -27 -41 151 109 140 113 149 126 -105 -124
4866 -124 -97 -53 3 -242 -132 75 111 206 102 71 298 -214 -29 -86 -56 8 -81 12 29 18 97 57 280 72 -57
4891 -57 40 92 51 -123 133 103 151 18 -247 -58 25 107 367 -283 26 47 -105 -108 241 70 -262 -34 -55 -105
4915 -105 -110 45 -278 67 34 -96 -72 -203 -87 4 84 66 26 233 -38 -32 -58 -12 200 75 -24 -141 61 25 346
4940 346 -132 107 -43 -137 -399 -297 64 -42 22 -7 -11 -233 315 -180 90 59 -278 166 -57 -119 47 26 80
4963 80 -42 -143 -50 -74 -37 -16 186 -91 268 67 -187 162 65 87 -90 -98 135 -289 -254 98 -60 -74 -144 86
4987 86 -228 -2 1 -152 -39 -185 62 -29 93 -121 210 -309 18 295 -10 -18 -112 108 67 121 -78 -303 -172
5010 -172 -7 -136 -33 94 -52 166 -95 -42 243 102 -108 -126 307 122 207 -180 -14 114 3 -126 98
$$ packed form
4843A67k06N9J24k00J99l7J66m6k26J71k49K03J47k99j4J92m2L1k7L6k3k31j9
4866a24K7M4N6k45J10K07L6R5j04l1K27n12J85n7L0O4q9R3J7j1P9m0K23k08j29
4891e7R7N2m1j74K56l0M8j33k65J89Q3Q2K60o50L09K1j52lL49j71l32K28k1n0
4915a05nJ55l23L45l3j30K4j31J16R1Q0j8m0K07k71Ok6M6K12j25r9j17K02l6L21
4940C46m78K39j50r4k62J02L61j06O4k9mk22N48m95K70l1l37M44k23o2J66k1N4
4963H0j22j01R3k4L7K1K02k77L59k01k54L49r7K2j77qK33m24L5L52j58j4p0K30
4987H6l14K26Lj53J13j46K47r1J22k14L31n19L27K77l05qr4K20m1N4j99k25J31
5010a72J65j29J03J27j46K18k61N3K85j41k10j8M33j85Q5l87J66J28j11j29K24
$$ plain form
5031 98 -243 -174 88 251 -25 -93 39 -330 -18 20 39 56 64 38 -144 197 -19 -59 -146 76 -33 41 -122 -55
5055 -55 57 -147 -58 94 -163 -185 208 16 -21 35 358 -17 23 52 -118 -50 -228 -94 66 -27 186 426 -51
5078 -51 51 138 -28 49 -47 -1 203 -58 -256 44 47 79 162 331 -101 -197 196 -217 14 10 -136 -61 12 111 -49
5103 -49 148 -79 -71 -137 -100 160 28 -373 -36 53 -309 46 341 102 361 95 -135 -193 236 -117 21 -67 241
5126 241 -133 250 -62 -158 133 -74 91 86 -62 -57 218 2 -100 -49 40 -5 75 -264 -457 120 -210 -7 229
5149 229 -4 -162 137 -255 -101 15 -239 11 143 22 -216 28 -115 132 -45 -118 -96 280 180 -258 169
5170 169 -47 -140 30 73 -164 -63 -95 151 14 185 -94 -178 -33 -199 16 -32 24 36 -154 0 -18 119 -33
5193 -33 -13 88 128 -9 -250 -155 312 265 -339 266 -115 -102 59 -213 -35 158 -124 95 -25 -231 45 185
$$ packed form
5031I8l41O9K62J63k76o8J32l69L12L8J9J7Qk6j82L41k16m0q7K22j09P4j63O7
5055e5J12k04Q9J52k57k2L93j92l7N6L23l75M0K9j70O8j78J34J60r3K13K40m77
5078e1J02Q7j66P7r6M6K04k61j98L00LL2Q3J69m32r6L93m13K31mj46P5P3R9j60
5103d9J97k27Qo6L7K60j32m01L37Q9l62L55K95k39K59k66k30n8M29l53J38q8L08
5126B41l74L83l12r6K91k07J65nj48NK75k16j02N1Q9m5Q0l39j93N77l30K03K36
5149B29k33j58K99l92J54J16k54K50J32j21k38K44j43K47j77p3K2L76j00m38M27
5170A69k16r3J70M3k37J01l2K46j37J71k79q4J45j66K15m8N6J2j90J54j8J37j52
5193c3K0J01M0j37k41R5M67m7o04O05l81J3J61k72J78J93k82K19j20k06K76J40
$$ plain form
5215 185 54 -187 -371 -104 -166 106 -316 355 128 -195 252 164 -7 -338 -81 -7 189 -21 26 100 -122 43
5237 43 152 -133 101 195 306 -65 -33 70 84 -84 290 15 -226 152 -139 194 -62 99 1 46 -88 -75
5259 -75 -117 -4 -2 -107 94 20 -66 -79 51 8 -165 -245 -167 -165 -296 -70 151 68 204 247 -123 -66 -170 -125 -27 26
5285 26 62 -154 133 -125 -159 -79 -49 -104 346 -7 -80 -98 1 -57 3 -75 59 -155 -224 -150 121 342 107 -49 -318
5310 -318 31 -60 52 123 140 -27 -95 -184 97 -37 115 -260 -129 75 -67 118 -206 75 137 182 0 -191
5332 -191 -162 -32 -383 8 9 -146 34 141 88 163 -7 -211 -42 138 -79 9 133 38 -167 -4 -178 -387
5354 -387 106 -17 -134 84 236 1 -70 -69 110 22 -249 99 -133 -110 -43 154 -323 -53 -38 150 151 -155 104
5377 104 196 75 -252 159 -8 -43 -109 58 92 112 415 -238 216 66 32 6 108 -32 154 -139 25 114 -18
$$ packed form
5215A85j31k41j84K67o2K72m22O71k27l23M47q8j71l31K57P4J96k10M7P4k22J65
5237D3J09k85K34R4J11l71L2J03J4j68L74k75k41L78k91L33k56J61r8M5j34J3
5259g5m2J13Kj05K01p4q6j3J30m3j73q0P8Kj31K26K21q3J36M3l70N7j04M5R8N3
5285B6L6k16K87k58l4Q0L0n5M50l53p3j8R9n8O0p8J34k14o9P4K71K21k35j56k69
5310c18L49r1J12P1J7j67o8q9K81j34J52l75J31K04j42J85l24K81O2M5j82j91
5332a91K9J30l51L91Jj55J80J07n3P5j70k04J69J80k17Q8J24r5k05J63j74k09
5354c87M93j23j17K18J52k35p1JJ79q8k71L48k32K3O7J97m77K70J5J88Jl06K59
5377A04R2j21l27M11j67l5o6J67L4K0L03o53M54j50l4k6J02j40J86k93J64Q9j32
$$ plain form
5400 -18 -210 -16 -118 -266 -53 145 -143 55 -65 -64 -79 91 -335 -277 55 -244 77 18 66 -82 74 -304
5422 -304 -37 83 -76 285 8 -72 -66 122 20 100 -167 -195 -17 152 -147 -24 70 -89 -211 -17 15 -90
5444 -90 -33 43 -58 -24 38 -225 -31 -33 -29 -267 -143 -200 -102 132 106 25 56 220 -38 29 -135 33 -93 -43 -203
5469 -203 -143 180 111 -34 60 93 -147 -178 199 -87 -187 -244 114 62 278 -235 19 481 99 -268 193 -4
$$ packed form
5400a8j92J94j02j48K13J98k88J98j20Jj5J70m26N8L32k99L21n9M8j48J56l78
5422c04K67J20j59L61k77q0OJ88j02Q0k67k8J78J69k99J23R4j59j22J94L2j05
5444i0N7P6j01L4O2k63J94kMk38J24n7R8K34k6q1L1J64k58O7j64J68j26N0j60
5469b03O0L23o9j45R4L3k40l1L77k86j00n7L58n2K16n13K54M62l82l67M61j97
$$ [...]
8191c1
##END NTUPLES=NMR FID
##END=
