##TITLE=1H_Pr 3061
 200.13MHz,CDCl3 ,
 8 sc
 
 10.6.2025
##JCAMPDX= 6.0         $$ Bruker NMR JCAMP-DX V2.0
##DATA TYPE= NMR FID
##DATA CLASS= NTUPLES
##ORIGIN= UXNMR, Bruker Analytische Messtechnik GmbH
##OWNER= pz
$$ XWIN-NMR		Version 3.5
$$ Tue Jun 10 16:26:43 2025 Russian Standard Time (UT+4h)  she@DPX200
##.OBSERVE FREQUENCY= 200.1313
##.OBSERVE NUCLEUS= ^1H
##.DELAY= (6, 6)
##.ACQUISITION MODE= SIMULTANEOUS
##.ACQUISITION SCHEME= undefined
##.AVERAGES= 8
##.DIGITISER RES= 18
##SPECTROMETER/DATA SYSTEM= spect
##.PULSE SEQUENCE= zg30
##.SOLVENT NAME= CDCl3
##.SHIFT REFERENCE= (INTERNAL, CDCl3, 0, 14.3821)
##AUDIT TRAIL= $$ (NUMBER, WHEN, WHO, WHERE, WHAT)
$$ ##TITLE= Audit trail, XWIN-NMR		Version 3.5
$$ ##JCAMPDX= 5.01
$$ ##ORIGIN= Bruker BioSpin GmbH
$$ ##OWNER= she
$$ F:/spectra/data/she/nmr/H-C/1/audita.txt
$$ ##AUDIT TRAIL=  $$ (NUMBER, WHEN, WHO, WHERE, WHAT)
(   1,<2025-06-10 16:25:33.10 +0400>,<she>,<DPX200>,
      <created by zg, POWCHK disabled, PULCHK disabled
       configuration hash MD5:
       00 E9 B6 7A A2 85 ED C7 34 08 36 98 17 FE 4E 26
       data hash MD5: 16K
       7F F9 CF BD 0C 52 B0 EF D2 82 2D D8 F9 05 C6 61>)
$$ ##END=
$$ 
$$ hash MD5
$$ 98 94 A5 B1 33 E5 5D 48 BF 32 47 F5 DB 14 82 DA
##$RELAX= 
##$RELAX= 
##$RELAX= 
##$RELAX= 
##$RELAX= 
##$RELAX= 
$$ Bruker specific parameters
$$ --------------------------
##$DU= <F:/spectra>
##$EXPNO= 1
##$NAME= <H-C>
##$PROCNO= 1
##$TYPE= <nmr>
##$USER= <she>
##$AMP= (0..31)
100 100 100 100 100 100 100 100 100 100 100 100 100 100 100 100 100 100 
100 100 100 100 100 100 100 100 100 100 100 100 100 100 
##$AQSEQ= 0
##$AQ_mod= 1
##$AUNM= <au_zg>
##$AUTOPOS= <>
##$BF1= 200.13
##$BF2= 200.13
##$BF3= 200.13
##$BF4= 200.13
##$BF5= 200.13
##$BF6= 200.13
##$BF7= 200.13
##$BF8= 200.13
##$BYTORDA= 1
##$CFDGTYP= 0
##$CFRGTYP= 5
##$CHEMSTR= <none>
##$CNST= (0..31)
1 1 145 1 1 1 1 1 1 1 1 1 1 1 1 1 1 1 1 1 1 1 1 1 1 1 1 1 1 1 1 1 
##$CPDPRG= <>
##$CPDPRG1= <>
##$CPDPRG2= <>
##$CPDPRG3= <>
##$CPDPRG4= <mlev>
##$CPDPRG5= <mlev>
##$CPDPRG6= <mlev>
##$CPDPRG7= <mlev>
##$CPDPRG8= <mlev>
##$CPDPRGB= <>
##$CPDPRGT= <>
##$D= (0..31)
0 0.7 0 0 0 0 0 0 0 0 0 0.03 0 0 0 0 0 0 0 0 0 0 0 0 0 0 0 0 0 0 0 0 
##$DATE= 1749558332
##$DBL= (0..7)
120 120 120 120 120 120 120 120 
##$DBP= (0..7)
150 150 150 150 150 150 150 150 
##$DBP07= 0
##$DBPNAM0= <>
##$DBPNAM1= <>
##$DBPNAM2= <>
##$DBPNAM3= <>
##$DBPNAM4= <>
##$DBPNAM5= <>
##$DBPNAM6= <>
##$DBPNAM7= <>
##$DBPOAL= (0..7)
0.5 0.5 0.5 0.5 0.5 0.5 0.5 0.5 
##$DBPOFFS= (0..7)
0 0 0 0 0 0 0 0 
##$DE= 6
##$DECBNUC= <off>
##$DECIM= 32
##$DECNUC= <off>
##$DECSTAT= 4
##$DIGMOD= 1
##$DIGTYP= 9
##$DL= (0..7)
0 120 120 120 120 120 120 120 
##$DP= (0..7)
150 150 150 150 150 150 150 150 
##$DP07= 0
##$DPNAME0= <>
##$DPNAME1= <>
##$DPNAME2= <>
##$DPNAME3= <>
##$DPNAME4= <>
##$DPNAME5= <>
##$DPNAME6= <>
##$DPNAME7= <>
##$DPOAL= (0..7)
0.5 0.5 0.5 0.5 0.5 0.5 0.5 0.5 
##$DPOFFS= (0..7)
0 0 0 0 0 0 0 0 
##$DQDMODE= 0
##$DR= 18
##$DS= 0
##$DSLIST= <SSSSSSSSSSSSSSS>
$$ [...]
##$SUBNAM0= <"">
##$SUBNAM1= <"">
##$SUBNAM2= <"">
##$SUBNAM3= <"">
##$SUBNAM4= <"">
##$SUBNAM5= <"">
##$SUBNAM6= <"">
##$SUBNAM7= <"">
##$SUBNAM8= <"">
##$SUBNAM9= <"">
##$SW= 18.0517328524113
##$SWIBOX= (0..15)
0 0 2 0 0 0 0 0 0 0 0 0 0 0 0 0 
##$SW_h= 3612.71676300578
##$TD= 16384
##$TD0= 1
##$TE= 0
##$TE2= 300
##$TE3= 300
##$TEG= 300
##$TL= (0..7)
0 120 120 120 120 120 120 120 
##$TP= (0..7)
150 150 150 150 150 150 150 150 
##$TP07= 0
##$TPNAME0= <>
##$TPNAME1= <>
##$TPNAME2= <>
##$TPNAME3= <>
##$TPNAME4= <>
##$TPNAME5= <>
##$TPNAME6= <>
##$TPNAME7= <>
##$TPOAL= (0..7)
0.5 0.5 0.5 0.5 0.5 0.5 0.5 0.5 
##$TPOFFS= (0..7)
0 0 0 0 0 0 0 0 
##$TUNHIN= 0
##$TUNHOUT= 0
##$TUNXOUT= 0
##$USERA1= <user>
##$USERA2= <user>
##$USERA3= <user>
##$USERA4= <user>
##$USERA5= <user>
##$V9= 5
##$VALIST= <valist>
##$VCLIST= <CCCCCCCCCCCCCCC>
##$VD= 0
##$VDLIST= <DDDDDDDDDDDDDDD>
##$VPLIST= <PPPPPPPPPPPPPPP>
##$VTLIST= <TTTTTTTTTTTTTTT>
##$WBST= 1024
##$WBSW= 4
##$XGAIN= (0..3)
0 0 0 0 
##$XL= 0
##$YL= 0
##$YMAX_a= 45101
##$YMIN_a= -42240
##$ZGOPTNS= <>
##$ZL1= 120
##$ZL2= 120
##$ZL3= 120
##$ZL4= 120
##$ABSF1= 10
##$ABSF2= 0
##$ABSG= 5
##$ABSL= 3
##$ALPHA= 0
##$AQORDER= 0
##$ASSFAC= 0
##$ASSFACI= 0
##$ASSFACX= 0
##$ASSWID= 0
##$AUNMP= <proc_1d>
##$AZFE= 0.1
##$AZFW= 0.1
##$BCFW= 1
##$BC_mod= 2
##$BYTORDP= 1
##$COROFFS= 0
##$CY= -3
##$DATMOD= 1
##$DC= 2
##$DFILT= <>
##$DTYPP= 0
##$F1P= 0
##$F2P= 0
##$FCOR= 0.5
##$FTSIZE= 0
##$FT_mod= 4
##$GAMMA= 1
##$GB= 0.15
##$INTBC= 1
##$INTSCL= 1
##$ISEN= 128
##$LB= 0.25
##$LEV0= 0
##$LPBIN= 0
##$MAXI= 10000
##$MC2= 0
##$MEAN= 0
##$ME_mod= 0
##$MI= 1.114404
##$NCOEF= 0
##$NC_proc= 0
##$NLEV= 6
##$NOISF1= 3.799351
##$NOISF2= 2.8
##$NSP= 1
##$NTH_PI= 0
##$NZP= 0
##$OFFSET= 14.38212
##$PC= 1
##$PHC0= -1462.758
##$PHC1= 4.5922
##$PH_mod= 1
##$PKNL= yes
##$PPARMOD= 0
##$PSCAL= 0
##$PSIGN= 0
##$REVERSE= no
##$SF= 200.129724274929
##$SI= 16384
##$SIGF1= 3
##$SIGF2= 2
##$SINO= 400
##$SIOLD= 16384
##$SREGLST= <1H.CDCl3>
##$SSB= 0
##$STSI= 0
##$STSR= 0
##$SW_p= 3205.1282051282
##$SYMM= 0
##$S_DEV= 0
##$TDeff= 0
##$TDoff= 0
##$TI= <>
##$TILT= no
##$TM1= 0
##$TM2= 0
##$TOPLEV= 0
##$USERP1= <user>
##$USERP2= <user>
##$USERP3= <user>
##$USERP4= <user>
##$USERP5= <user>
##$WDW= 1
##$XDIM= 8192
##$YMAX_p= 0
##$YMIN_p= 0
$$ End of Bruker specific parameters
$$ ---------------------------------
##NTUPLES= NMR FID
##VAR_NAME=  TIME,          FID/REAL,        FID/IMAG
##SYMBOL=    X,             R,               I
##VAR_TYPE=  INDEPENDENT,   DEPENDENT,       DEPENDENT
##VAR_FORM=  AFFN,          ASDF,            ASDF
##VAR_DIM=   8192,          8192,            8192
##UNITS=     SECONDS,       ARBITRARY UNITS, ARBITRARY UNITS
##FACTOR=    0.0002768,     1,               1
##FIRST=     0,             0,               0
##LAST=      2.2672688,     0,               0
##MIN=       0,             -42240,          0
##MAX=       2.2672688,     45101,           0
$$ Real data points
##PAGE= N=1
##DATA TABLE= (X++(R..R)), XYDATA
0@%%%%%%%%%%%%%%%%%%%JrJ6j6J6j6J6k4L2l2L3m1M8n1N9o6P4q8R7j06J21j36
41g2J52j69J86k02K26k50K74l05L35l69M05m45M92n42O00o65P38q26R29j049J195
62F38j378J615j935K391l097M356p305K7757K0410k7257p724j975J6573J2251
76C5320K847j6093k3760k0441j740R107J4844N542j0060k0260j5036k510J4449
89b7791J9105J2277j386j3850j4892m03J2966J9878J5016O0j2960j5233p020R298
103d935J7795J3273J547j2431j8141q788N145J5578J5240K574j0633j6551j2879
116a3206K131J4656J4124M637r293j8061j3919k215J0751J5515N929p299j5150
129a1400j5090l130J1303J5962J0685j962j2591j1867l263R298J8208J3114K10
$$ y = [0, 0, 0, 0, 0, 0, 0, 0, 0, 0, 0, 0, 0, 0, 0, 0, 0, 0, 0, 0, 1, -8, 8, -8, 8, -8, 8, -16, 16, -16, 17, -24, 24, -27, 32, -34, 40, -48, 49, -57, 64, -72, 80, -89, 97, -105, 121, -129, 145, -160, 175, -194, 211, -234, 258, -284, 316, -349, 389, -437, 492, -557, 638, -740, 875, -1060, 1331, -1766, 2590, -4715, 23042, 43452, 16195, 8471, 6496, 23069, 35320, 38167, 22074, -1686, -22127, -23867, -14760, 84, 5626, -4434, -24694, -39730, -42240, -27791, -8686, 3591, 2205, -11645, -26537, -26940, -13974, 5904, 20920, 20980, 8020, -7213, -14233, -4935, 12860, 26133, 27680, 15249, -2892, -11680, -6535, 9043, 24283, 26857, 16224, -327, -13206, -11075, 3581, 17705, 22342, 13049, -5012, -18931, -21146, -10395, 5120, 11049, 3750, -11400, -26490, -29620, -18317, -2355, 8330, 6368, -6223, -18090, -21353, -12055, 6153, 19267, 19477]
142A9477j0037j3491o037O535J3886J2923J675j1845j5143r497J498J2527J2542
155A5013K615q785j5538j0788J381J0923J4241P150o814j3750j0871j093J0666
168e650J4008P647l449j3895j3500k917P416J2955R570k620j2131j3209n610P064
182a4321J3458J0631K189r186j2959n051N722J3327J2937L209o993j2029q651
195g717K992J1584J1004M149p101j4208j0599j221Q419J1343M079n810j2478j2613
209a8177k558Q633J1850P521k538j0853j0289l184P431J4057R511k47q249j1040
223h132m447O231J1974J0564J263q696j0867o683K317J1045J0177J774p185j2026
237b691q157R88Q218J0474M076o531j1012q763j193Q198J0663N262l372j0443
$$ y = [19477, 9440, -4051, -10088, -3553, 10333, 23256, 24931, 13086, -2057, -11554, -10056, 2471, 15013, 17628, 8843, -6695, -17483, -16102, -5179, 9062, 16212, 9398, -4352, -15223, -16316, -5650, 8358, 16005, 12556, -1339, -14839, -17756, -10340, 2615, 12185, 9565, -2566, -15775, -21385, -14321, -863, 9768, 11957, 2771, -10188, -15239, -9517, 3810, 16747, 19956, 12963, 934, -7717, -4725, 6859, 17863, 22012, 14911, 703, -9896, -11117, -2698, 8645, 12724, 6914, -5564, -18177, -20735, -12102, -252, 7269, 4731, -6122, -16411, -19595, -12164, 1893, 11404, 11157, 2908, -8132, -12579, -6348, 5626, 16190, 17453, 8757, -2110, -8793, -6476, 4569, 14746, 16520, 9335, -2691, -10848, -9860, -1642, 8832, 12908, 6377, -4635, -13398, -14591, -6393, 4270, 9532, 6160, -4283]
251d283r165j204O480J1098P950k015q931r173l133O278J0635Q043O87q330j0389
266e452m094L825R629Q943P69p294j0441o718K512Q602Q164K919n972j0807p012
281a2427P26P860R421L591l821q913q268j53P550R215N726k228q566p834j945
296a0066N979R887N917j092p212r252l529M789Q716P001k15p379q766n190K519
311g893Q869P292Q59n817r441n901J869P598Q511K661n176q155o307J92P806Q907
327E874L948l102q183o532k05N831R067N442k628p426p274k256N034Q095N383
342A1068j033p685q152l065K937P497O446m43o612q290m470K884P219O691J977
357F969n364q179m346J779P337Q038K699l703p452n695J248O633P438M129l008
$$ y = [-4283, -13448, -14652, -8172, 2926, 10876, 8861, -70, -9243, -12376, -6098, 4537, 12580, 13267, 4937, -5452, -9546, -5721, 3908, 12851, 13620, 6326, -4115, -10833, -8321, 281, 8445, 11364, 5392, -5415, -12427, -11701, -3841, 5580, 9171, 5350, -3563, -11831, -11984, -4434, 4781, 10507, 8279, -287, -8121, -10066, -4087, 5800, 11717, 10625, 3413, -5839, -9368, -4579, 4137, 11138, 10923, 3544, -5222, -10412, -7893, 976, 8268, 9127, 3310, -6131, -12032, -10163, -2565, 5946, 8607, 3431, -4724, -11031, -10839, -3033, 5874, 9822, 6720, -1463, -7995, -8200, -2369, 6698, 12140, 9512, 2086, -5188, -7444, -2410, 5685, 11068, 10035, 2350, -5802, -8867, -5930, 1567, 8013, 7570, 958, -7332, -11802, -8918, -1699, 4992, 6969, 1605, -6574, -10920, -9141, -1804, 6234, 8933, 5230, -2222, -7917, -6669, -36, 7402, 11531, 8523]
372H523p873o255q44N351P555L679k160p044p711k039M406O855M994j088o535
387a86o974l123L448P605N409L55m805p301l679K756O811O581J253m665o598m734
403g847R93O713O595K131l495p191n244L19N432P280L234l135o306n825j195N096
419b445O988L981j804o682o211j747L366O892M960j159n644o507k880L267O579
434I54N531Q30n038o389k948J874O263O305J273m063o705m589J182N148N569K348
450G545l756p122n090l06M837O386K879k105o029n550n8M976O724M814q07n434
466A904n339j422M149O794M227m97n308p006l053K355N281M463m63n387o722m196
482a0220J466N872N051J287l342o069l656J604N830O666K599k552m975m305J73
$$ y = [8523, 650, -5605, -6449, -1098, 6457, 10136, 7976, 932, -6779, -8818, -4412, 2443, 7437, 6349, -186, -7160, -10283, -6835, 770, 6179, 6534, 1729, -5572, -9251, -6495, 316, 6897, 8150, 3485, -3113, -7847, -6854, -141, 6454, 8585, 5090, -2101, -7345, -7026, -1594, 5686, 8920, 5785, -521, -6346, -7541, -2445, 4543, 8524, 6720, 38, -6173, -7920, -4554, 2338, 7298, 6139, 495, -6012, -8892, -5625, 954, 6485, 7315, 2277, -4112, -7060, -5186, 1077, 7382, 8655, 4592, -2113, -6702, -5520, -372, 5197, 7545, 3789, -3333, -8423, -8729, -3892, 2494, 5373, 3268, -2761, -8311, -8369, -3393, 3331, 8145, 7338, 1904, -3435, -4857, -708, 6086, 10313, 9816, 4508, -2498, -5551, -3196, 2085, 6548, 6085, 698, -6024, -10220, -8754, -2882, 2169, 3456, 114, -5955, -9611, -8007, -2177, 4489, 7088, 4536, -439, -4744, -4571]
497d571N243O068K872k136o074n273j107L403N909L262k057n358n725k145L325
512d364N889M296l50n077n437k132K229N890N095K05m181n859l368J710N005M996
528D547J430l867n801l495N76M860N720K194k317n329m133N81M282N451L363j774
544F288n305m633j110L373N311K927j154n093n757j763K603M870M029k61m398
559g3n140k479K539N661M436J034l147n375k877J634M878N035J176l252n282m254
575e486J57M340M472J716k363n443m351l81L730N502K779j476m064m231q78L762
591b215N500L748l65m225m462j664K244N148L762n76m017n336l048J426M271L953
607D144M27m012n186l002P08M488M892J448k508m811l327R01M239N142K703k047
$$ y = [-4571, 672, 6740, 9612, 7476, 1402, -3871, -4978, -1575, 4334, 7596, 5539, 181, -5544, -7689, -4364, 1525, 5821, 5471, 394, -5043, -7175, -4946, 944, 6039, 6244, 2063, -3796, -7164, -5454, -449, 4547, 5977, 2110, -3691, -7186, -6610, -1750, 3970, 6164, 3847, -1482, -5615, -5034, -752, 4699, 8062, 6288, 983, -3650, -4760, -1387, 3924, 6851, 5697, 604, -5153, -6916, -4313, 557, 4586, 4325, -73, -5213, -7692, -5153, 508, 4944, 5978, 2831, -2544, -5421, -3787, 1091, 6126, 7302, 4050, -1232, -5486, -5329, -989, 3483, 5199, 2836, -2607, -6958, -7339, -3609, 1893, 4672, 3196, -868, -5099, -5977, -2215, 3285, 7033, 6668, 2443, -2019, -3683, -1439, 3709, 7471, 6895, 2878, -2458, -5506, -4080, 191, 4144, 4571, 559, -4627, -7629, -6921, -2433, 2459, 3907, 1399, -3412, -6739, -5838, -1599, 3543, 6246, 4199]
623D199m595l531l43L601N047K675j226m627m560q40K677M406L316p96m281m615
639c493j963K181M521L293J20l612n014k236J525M114M067O96l058m572l031J123
655e339M333M075J570k079m589l086N26L836M798K006j745l997l805l60L480M306
671C930K391j228m287m113j235K316M421K636j004l570m345j910K013M095L376
686C486J60l302l953k000J255M276L896O98k352m027k583R13L576M049J501k381
702C212m035k957j19L173M065J728j552m093l585l62K561L987K594j174l736l591
718c884j156K281M100K804j75l328m009j289J713L733L411K89k787l856k223J277
734c099L686L242R66k270m153k485N43L058L661J195j845l802l211K5L026L487
$$ y = [4199, -396, -3927, -4270, -669, 4378, 7053, 5827, 1200, -3360, -4200, -1523, 2883, 6199, 5403, 1122, -3493, -5456, -3275, 1246, 4539, 4659, 1047, -3967, -6203, -4678, -564, 3503, 4199, 1141, -3431, -6462, -5339, -1006, 3069, 4639, 2560, -2029, -5115, -4589, -753, 4045, 6051, 4306, 309, -3496, -3856, -376, 3930, 6321, 5093, 806, -3307, -4542, -2226, 2195, 4831, 3827, 257, -4088, -5998, -3985, 110, 3486, 3646, 344, -3609, -5609, -4354, -78, 3818, 4516, 2164, -1863, -4446, -3533, 43, 4092, 5593, 3212, -823, -3780, -3899, -726, 3339, 5067, 3515, -578, -4163, -4525, -1964, 2023, 4617, 3443, -293, -3884, -5040, -2759, 1341, 4145, 3970, 642, -3367, -4656, -2943, 790, 4201, 4490, 1703, -2153, -4376, -3099, 587, 3829, 4795, 2525, -1628, -4113, -3570, -512, 3149, 4344, 2499, -1303, -4514, -4489, -1463, 2024]
750B024J859j188l659l176m96K532M072K254p65l013l554j027K324L724K692j92
766D411l084l539j652J428L771K873o2k516l765k203J030L206L261P62k416l550
782b045k345K82L172L428J158j569l479k691Q6K545L603J944j366l190k770n77
798c814K325L597K113n21l105l239q00J739L376K681l69k806l291j591J383L205
814H83K627L52k556l673j750Q57K855L067O89k026l329k363N66K864L007J423
830C493j433l291k392N3K445L367J640r42k819k947m52K274L085J962n07k829
846G07k957j082J594L276K138k93k366l284j523J348K902K567K69k314l036j870
862c924O95L059K783N87j695l143k144M68K487L097J227j620k888k302k29K410
$$ y = [2024, 3883, 2695, -964, -4140, -4636, -2104, 1968, 4222, 3457, 444, -3110, -4137, -1813, 1911, 4603, 4411, 1327, -2212, -3864, -2436, 1335, 4208, 4146, 1630, -2135, -4338, -3308, -102, 3159, 3921, 1505, -2045, -4390, -4108, -936, 2492, 3650, 2081, -1398, -4089, -4003, -1458, 2145, 4089, 2723, -467, -3237, -3814, -1489, 2108, 4221, 3700, 595, -2644, -3444, -1705, 1671, 4352, 3983, 1177, -2114, -3705, -2322, 883, 3510, 3862, 1306, -2367, -4117, -3260, -405, 2662, 3351, 1325, -2004, -4367, -3801, -937, 2070, 3493, 2060, -1231, -3623, -3570, -1125, 2242, 3882, 2940, 121, -2826, -3278, -1004, 2081, 4043, 3536, 707, -2250, -3332, -1738, 1538, 3676, 3383, 1017, -2267, -3790, -2442, 460, 3027, 3296, 982, -2054, -3924, -3229, -170, 2613, 3200, 1505, -1638, -3782, -3314, -827, 2270, 3497, 1877, -1011, -3313, -3542, -1132]
878a132L071J524q73k839k559l98J847L149K110o32k516k622j001J562K947K138
894C776qk434l092j263R21K611K472R4k192l048j888P26K512K497Q57j760l048
911b267j778M36K444K978J207j126k670k284K06K398K814J660q18k676k398m95
927b369J831K895J602n64k366k930r81J486K533J932j64k353k741j473R40K686
943c6K134J69j800k859j638P64K394K567P57j577k487j831K91K576K750J112r96
960B290k517k013P9J993K861J490r69k417k323o75J671K563J537n27k560k662
976b179r52J003K507J972k81k135k561j323R32K437K208N78j750k585j293O02
992b820K328K589Q30j254k408j830L60K139K461J304j006k585j998k04J798K542
$$ y = [-1132, 1939, 3463, 2590, -249, -2808, -3206, -1359, 1790, 3900, 3268, 752, -1870, -2871, -1309, 1638, 3776, 3768, 1334, -1758, -3021, -2100, 511, 2983, 3077, 885, -2163, -4051, -3325, -813, 1684, 2541, 781, -2267, -4045, -3609, -1165, 1813, 3020, 1894, -776, -3060, -2854, -456, 2358, 4018, 3200, 524, -1874, -2369, -538, 2357, 3959, 3395, 1029, -1901, -2882, -1396, 1137, 3069, 2905, 552, -2189, -3662, -2722, -36, 2098, 2267, 467, -2392, -4030, -3266, -872, 1695, 2452, 875, -1612, -3443, -3152, -576, 2174, 3286, 2290, -227, -2240, -2161, -168, 2693, 4183, 3214, 797, -1526, -2201, -530, 2033, 3570, 3043, 483, -2179, -3131, -2128, 379, 2351, 2070, -65, -2626, -3949, -3017, -580, 1628, 2206, 456, -2129, -3422, -2820, -492, 2097, 2927, 1673, -735, -2565, -2205, -66, 2395, 3699, 2693, 108, -1890, -2094, -296, 2246]
1008B246J295o85k381k535n78J507K295J676m15k339k466j060J104K520J791L0
1024B005j790k627j241R88K332K251M94j542k280j533N09K422K322P68j052k435
1040d09j779J72J887K472J115j065k230k080m79J758K386J257n99k315k248o23
1056b780J172K434J720m77k022k298j073J105K335J859K05j873k348j075O79K280
1072a57K243M45j418k242j489N54K053K210J002j181k344j604J3J741K311J001
1088C138q14k199k104l09J420K055J418n42k189k094p31J157K229J514r9j738
1104A12k322q81J034K086J944K59j562k078j227O67K190J948N56j110k274j513
1120b171L53J807K121Q14j071k028j827k13J689K063J030o34k067j914m34J186
$$ y = [2246, 3541, 2856, 475, -2060, -2638, -1131, 1164, 2840, 2425, 86, -2380, -3440, -2336, 184, 1975, 2005, 215, -2412, -3653, -2665, -333, 1918, 2412, 870, -1410, -2943, -2434, -12, 2310, 3078, 2026, -409, -2188, -2016, -129, 2343, 3458, 2393, 163, -1917, -2396, -638, 1748, 3005, 2406, 91, -2157, -2780, -1608, 826, 2546, 2069, 47, -2251, -3324, -2219, 116, 1975, 2180, 307, -2041, -3116, -2437, -157, 2086, 2531, 1113, -1129, -2618, -2064, -11, 2199, 3201, 2020, -324, -1928, -1915, -174, 2137, 3138, 2324, 125, -1979, -2288, -868, 1187, 2605, 2063, -126, -2220, -2951, -1794, 435, 1949, 1850, 112, -2210, -3091, -2057, 29, 1973, 2232, 670, -1408, -2635, -1968, 222, 2170, 2726, 1616, -658, -2171, -1818, -11, 2110, 2924, 1853, -175, -2002, -2215, -526, 1537, 2567, 1933, -134, -2048, -2482, -1296]
1136a296K171J399m53j745k009q61J078K085J586L1j656k009r64O25K063J949
1152A994K32j311j994j273N21J906J963P52j158k076j373L5J654K088Q05r08k057
1169b00j807j54J314J909J219o65k002j784n57J139K072J338j33j629j960o52
1185b552R96J911J726K00j484j885j037O72J908J651M22j189k102j270L53J617
1201f3J833N74j070j873j574lJ619J812Q91o55j932j619j77J312J975J108n28
1218A630j580j779n82J168J904J276j36j590j749p64P37J877J541L4j243j806
1234a062j060N66J690J629M50j152j787j142R8J546J792N82q58j762j446%J310
1251f06J713R74o63j726j434l49J134J852J063l28j553j673m40R00J678J379p3
$$ y = [-1296, 875, 2274, 1821, 76, -1933, -2794, -1716, 369, 1955, 1986, 330, -1679, -2643, -2018, 45, 1994, 2226, 915, -1079, -2352, -1831, 75, 2038, 2790, 1632, -444, -1817, -1782, -128, 1960, 2765, 1857, -200, -2007, -2161, -847, 1062, 2281, 1616, -386, -2170, -2727, -1588, 484, 1822, 1689, 60, -1900, -2552, -1556, 355, 2081, 2281, 797, -1088, -2125, -1453, 455, 2106, 2528, 1339, -763, -2033, -1680, -63, 1770, 2344, 1274, -599, -2173, -2176, -557, 1255, 2146, 1491, -441, -2060, -2237, -925, 1050, 2158, 1630, 50, -1729, -2311, -1143, 761, 2037, 1901, 311, -1438, -2202, -1465, 412, 1953, 1987, 744, -1062, -2122, -1556, 134, 1763, 2213, 1061, -726, -1868, -1770, -224, 1568, 2150, 1292, -470, -1916, -1916, -606, 1107, 2081, 1418, -308, -1742, -2091, -957, 895, 1958, 1630, 77, -1596, -2036, -1136, 542, 1921, 1848]
1268A848j454j661p96P01J700J357K45j158j793r41M61J465J611M63r86j635j236
1285a809J73J435J540O99o41j708j359q4J121J648Q45n15j476j573m05J077J590
1302E58J068j70j434j554n31Q18J719J264n8j102j574q02O72J576J366K80j121
1319I75j606r65K33J433J494L08q75j597j242R0J199J502P20p24j501j216k10
1336a982J106J651Q71l68j363j361l01Q94J562J176k07j287j394n95O99J534J140
1353A775P4j178j567p07M42J336J360K00j086j497j004K81J304J277M94p88j561
1370h45j062J31J123J522O83n06j323j206l5J115J433R07k20j345j272l56P88
1387d68J417R32k41j170j494o92O15J245J022L8j101j429p44L79J397J278K71
$$ y = [1848, 394, -1267, -2063, -1362, 338, 1695, 1940, 782, -1011, -1952, -1491, -26, 1585, 2048, 1062, -573, -1809, -1636, -201, 1339, 2038, 1397, -311, -1670, -1754, -633, 1015, 1860, 1345, -131, -1704, -2109, -1032, 558, 1626, 1456, 22, -1532, -2063, -1245, 474, 1738, 1680, 578, -996, -1798, -1126, 450, 1816, 2096, 975, -631, -1596, -1363, 70, 1564, 1872, 997, -600, -1842, -1752, -553, 949, 1669, 945, -556, -1772, -1982, -876, 775, 1646, 1278, -85, -1446, -1747, -853, 709, 1885, 1678, 391, -1003, -1598, -899, 635, 1775, 1849, 671, -896, -1603, -1161, 175, 1535, 1735, 649, -848, -1852, -1571, -267, 1010, 1504, 716, -845, -1907, -1776, -653, 869, 1552, 1046, -277, -1483, -1518, -403, 1030, 1937, 1717, 372, -900, -1256, -468, 949, 1881, 1640, 470, -1024, -1716, -1101, 144, 1166, 1204, 103, -1326, -2070, -1691, -294, 984, 1255]
1404A255p25j311q84L72J271J396N66p02j314j006m1J089J357N32n41j376j253
1421a315k29Q50J288Q57m25j217j192m51P66J403R69k0j023j313m81N21J276J169
1439A433J02r61j288q01L27J223J157L38q27j353q21J79J078J316N39o40j247
1456b46j025J9J039J193P07m62j312j128k16P58J278P35l15j134j278l79P55J228
1474B17R54N6j023j158n21N48J348J045J41p68j270p82L71J064J081K74q08j269
1492e00r54%J034J136M12n21j207r74%R34J293P43l80j037r40k44Q54J285P59
1511A693j70j074j185m11N12J143Q76j62j035j187o51L89J121R76J71p98j192
1528i84n99K90J062J234L90n74j079q32J29R79J114N64m81j191r31j77P25J135
$$ y = [1255, 530, -781, -1665, -1293, -22, 1374, 1940, 1238, -76, -1082, -1123, -34, 1323, 1855, 1314, -62, -1315, -1544, -694, 594, 1451, 1026, -191, -1383, -1834, -1068, 335, 1304, 1284, 261, -1052, -1533, -1012, 264, 1433, 1535, 574, -714, -1515, -1188, 35, 1192, 1530, 703, -650, -1471, -1292, -214, 1102, 1641, 1001, -246, -1271, -1252, -213, 980, 1687, 1225, -87, -1215, -1431, -673, 605, 1340, 1025, -109, -1387, -1766, -1011, 217, 1171, 1227, 204, -954, -1475, -927, 421, 1466, 1607, 839, -431, -1213, -842, 222, 1303, 1577, 769, -500, -1454, -1454, -420, 716, 1128, 607, -600, -1574, -1574, -640, 653, 1396, 1016, -21, -961, -1205, -351, 934, 1693, 1523, 449, -736, -1147, -635, 508, 1384, 1222, 187, -1000, -1651, -1262, -141, 835, 1006, 208, -984, -1583, -1293, -231, 1003, 1393, 819, -260, -1092, -963, 16, 1130, 1694, 1213, 22, -909, -1086, -361, 774]
1546G74O01l60j075j144k96O71J088Q02r0j018j061l94N38J173R20P2p75j150
1564g24n73M54J021R88K43p54j122p45J81J011J032L37n53j116q72N6Q43J104
1582H11N28m40j014r47k02P77J094O13k16r95j044l13N67J104Q00j58q61j040
1600i36m92M96J085Q87J33p89j047n26L11J041J058J85o63j008p52J46R29R81
1618A039L66n56j135p82r7P59J023M98m19r99r69j52O95R93P29j73r30r16k76
1637a302N62J085Q05J1p41j031m23M65R44Q75J30p44j026o09K27R00Q56K18n87
1656F15j096p18J16P91R34L95m93r60q11n8Q27R75M90k49r27q60j34O14J010O53
1676A114j79p87r14l65N49R79P13M1p42r45m33L07R47Q48Q2o24r19o53J80Q45
$$ y = [774, 1375, 1015, -60, -1204, -1500, -829, 259, 1061, 971, -47, -1108, -1502, -964, 209, 1129, 1201, 426, -724, -1297, -843, 178, 1166, 1409, 655, -467, -1212, -1031, -20, 1012, 1349, 796, -320, -1192, -1136, -293, 811, 1339, 899, -115, -1062, -1264, -487, 607, 1220, 1004, 9, -1035, -1348, -781, 323, 1123, 965, 104, -936, -1428, -932, 153, 1040, 1173, 384, -663, -1189, -878, 163, 1221, 1406, 743, -265, -1017, -871, 58, 1039, 1405, 849, -286, -1068, -1165, -406, 617, 1115, 696, -303, -1272, -1424, -729, 264, 993, 820, -110, -1026, -1302, -740, 345, 1150, 1161, 420, -611, -1034, -569, 375, 1250, 1380, 636, -390, -999, -772, 128, 984, 1202, 615, -481, -1199, -1083, -292, 642, 1037, 544, -416, -1227, -1285, -458, 517, 1007, 758, -169, -1029, -1163, -549, 461, 1114, 935, 148, -766, -1131, -582, 397, 1110, 1151, 409, -536, -969, -662, 285, 1133, 1215, 591, -328, -981, -801, 44]
1696D4Q19K59o01r74o85k8P18R16L40m21q78p65n5P04R48O12k30q15p11j56N94
1717c65J017O66q8p21r12l25M35Q02P16pp94r50n54K25Q08O97J56n95r64n71J83
1738a141P42Q98L50m31q06o05L7P81Q94M32k68q58p46p6N95Q53N05k66p77q74
1758g61k93N41Q34N66p6p52q48l40M04Q89O81M3o08q03m87L00Q40P19J83n04q64
1779c36n36O6P67Q29K35m18q01p02kO25P83M15l33q20o76j82N36Q96M53j71p12
1800h4p35k21M75Q29O66k4o66o89l30L64Q26O40Q0n80q54m23K09O29P24J25n60
1821D01q21n97O1O35O70L02l65q22n97M0N78Q20M69k05o74o29j04N86P64N39o3
1842I88o65p34k13L85P46N45n1o06p60m25L10O60N56Q4n71p78m58J25O70O78J22
$$ y = [44, 863, 1122, 521, -453, -1138, -1166, -448, 468, 808, 387, -491, -1256, -1311, -607, 341, 953, 723, -92, -803, -959, -365, 652, 1318, 1230, 509, -403, -728, -293, 509, 1225, 1218, 424, -526, -1080, -855, -47, 650, 806, 211, -753, -1324, -1141, -399, 499, 849, 418, -388, -993, -956, -175, 719, 1151, 883, 25, -721, -797, -202, 651, 1156, 890, 113, -761, -1054, -513, 321, 887, 811, 59, -789, -1129, -725, 164, 845, 888, 280, -523, -1010, -710, 130, 849, 1032, 528, -336, -872, -806, -39, 790, 1025, 607, -194, -896, -898, -273, 510, 925, 592, -228, -904, -1086, -550, 346, 799, 628, -84, -819, -1040, -565, 264, 930, 906, 240, -449, -779, -415, 411, 1051, 1131, 551, -303, -726, -517, 112, 836, 961, 401, -420, -1017, -956, -321, 349, 651, 286, -536, -1133, -1093, -515, 305, 774, 569, -105, -734, -838, -252, 512, 1051, 988, 323, -411, -624, -239, 507, 1052, 1001, 395, -365, -790, -480, 180, 736, 820, 249, -529, -987, -862, -192, 486, 608]
1863F08m33p32n56J10O17P48L21l17o77n10pO22Q36L92j75n96o02j06M70P35M58
1884A206j44o88o95l39K45O97M28q9o33p94l75K09O12O53R5m84o44l52K20P26
1904a46P15K95l17o55l99J42N82P17K80l37p05o16r1M75N73L17k42p60o50j80
1924a002L76O61M54q6n49o34k23M10O89N88Q2n08o41k64K18O74N82O8m30o79n00
1945g14J65N68N84J93l88o96m87QN90O48K39k43o37n65k1M80O43M06k44n88n59
1966f18j89L94P11M06p7n52o33k17L24O20N82J2n10n87l41K23O41N40R4m03o71
1987b51m23R1M80O19J99m02o22n17j4N42N74L18k27o22m65k3M32O98M22j86n03
2008A20n68j16M21N81M52n2n80o31k49K28N92M47m0m68o42l78K25N50N23J65m09
$$ y = [608, 175, -557, -1113, -1003, -386, 362, 683, 366, -311, -821, -828, -206, 630, 1022, 847, 251, -351, -457, 13, 748, 1206, 1062, 374, -321, -660, -415, 282, 710, 621, -12, -806, -1181, -972, -360, 293, 388, -96, -740, -1092, -872, -146, 569, 864, 547, -108, -507, -365, 217, 934, 1214, 877, 172, -444, -535, -60, 513, 830, 588, -172, -822, -1002, -626, 35, 489, 403, -146, -780, -1003, -593, 96, 684, 766, 258, -383, -647, -429, 245, 827, 895, 465, -214, -714, -549, 19, 603, 796, 408, -288, -775, -767, -177, 471, 710, 467, -170, -735, -756, -276, 367, 773, 529, -59, -618, -807, -413, 298, 704, 627, 75, -558, -775, -451, 169, 751, 763, 253, -334, -675, -452, 189, 729, 823, 420, -251, -674, -583, -103, 516, 715, 313, -309, -826, -840, -298, 276, 594, 367, -255, -720, -743, -311, 387, 809, 623, 120, -448, -564, -143, 438, 890, 838, 258, -373, -622, -394, 198, 645, 605, 137, -505, -883, -658, -108, 415, 580, 171]
2029A71o03l73J03N93O03K18k59n82m55N4M85N84L05k34n83n04j35M24O18K76
2049G06j38n64n66j70L39N80M34j02m78n46k89K84N94M62N7m22n99k62J69N59
2069D8N74Q7l72n39l76O2N21N16K34k87o11m25m8M29N77K79k24n32n27r1L72N58
2091B25L92j10n25m90j70K96N98M47k3m78n26k70K36N25M73N2m35n52l04J15N48
2112B4M86J04k79n77l94J30M39N25K41k46n50m35n2M35N19K37j47n47n28j07L22
2133d00N29L76j00m56m97j74K81N99M30N8l73n16k37K01N38N13L8l74n16m09R3
2154c96M59M09J19l33o01l82j8L84N71J98k37m78m03j6M53N50L55j11m96l84r6
2175d53L34N30L47p1m42n35k08K28M53L88j4m49n21k55J31N00M32J04l22n11l07
$$ y = [171, -432, -805, -702, -109, 494, 712, 453, -129, -584, -530, -45, 539, 844, 610, 27, -477, -612, -188, 430, 706, 568, 4, -562, -732, -393, 187, 621, 519, 41, -505, -794, -510, 84, 546, 603, 181, -418, -680, -511, 48, 622, 709, 337, -202, -578, -516, 5, 521, 755, 468, -143, -568, -616, -187, 390, 669, 445, -87, -614, -705, -333, 225, 617, 507, -18, -508, -678, -382, 216, 663, 640, 162, -364, -634, -398, 127, 600, 652, 217, -335, -639, -524, 24, 510, 614, 335, -242, -636, -506, -67, 458, 699, 453, -97, -532, -584, -149, 370, 607, 460, -87, -615, -722, -400, 129, 505, 405, -51, -548, -722, -441, 158, 588, 646, 273, -243, -480, -279, 259, 772, 810, 436, -80, -489, -396, 63, 472, 591, 258, -343, -725, -743, -359, 212, 410, 173, -305, -708, -724, -271, 279, 634, 523, 27, -357, -453, -119, 411, 758, 687, 245, -290, -498, -270, 183, 571, 557, 108, -413, -668, -537, -37, 395, 499, 177, -334, -641]
2196f41J29M39M85J97k75n06l46K2M20M82J90j73n16m05l1L46M95L00j59m51m25
2217d23j49L15M98K88rm11m87j78J82M77L65Pl67m58l14J61M81L94J27k91m76
2238b68k70J00M22N11J60k38m23l29j4L81M30J74j53m83l87j31K80M24K39j42
2258B83m14m53j46K44M33L31%l79l89j35K39M71M07O5k59m26j81J42M23M27J18
2279H01k90m54l15J6L37L74J13k37m85m10l0K50L90J94j55m19l74r3L26M42K94
2300B75j5l40l44p6K60M68L73j2l02l59j92J87M01L24N2l20m53k63N2L70L27L4
2322D47k59m07l39L2L33L78J49j52m20l06j7K96M43J77j10l28l58p1K87M07K79
2343D61p6l26l21j60K25M07L05J5l25l71j73J74L13L28N8k93l67k37O7L22L25
$$ y = [-641, -512, -73, 412, 609, 334, -172, -518, -496, -76, 406, 596, 423, -93, -498, -529, -183, 312, 612, 453, 2, -423, -572, -257, 241, 529, 520, 109, -378, -556, -374, 103, 468, 475, 108, -350, -664, -503, -22, 372, 499, 208, -268, -538, -438, -16, 495, 655, 417, -6, -335, -349, 32, 462, 636, 483, 0, -387, -518, -238, 186, 425, 283, -131, -584, -730, -486, -53, 278, 278, -101, -490, -625, -386, 85, 492, 557, 298, -128, -309, -167, 256, 683, 801, 511, 57, -258, -242, 95, 469, 582, 345, -140, -550, -580, -330, 60, 254, 99, -320, -694, -787, -461, -19, 275, 260, -80, -424, -500, -240, 228, 601, 589, 287, -72, -264, -77, 324, 648, 700, 380, -73, -336, -284, 86, 413, 447, 188, -219, -558, -526, -193, 185, 334, 182, -238, -544, -561, -265, 178, 355, 245, -83, -441, -512, -225, 182, 461, 385, 59, -262, -422, -197, 210, 515, 530, 205, -166, -339, -165, 148, 476, 534, 241, -126, -363, -296, 26, 351]
2364C51P3k53l94k77L7K82L64J65j72l71k80nK91L71J94o4l34l36l3K15L68K66
2386D58o9l22l32j56J97L49K68L0l25l27j70J35L55L00N6k27l38k39J35L12K91
2407C81J24k04l81k42nK63L35Q4j79l44l16j1K25L24J63j04l07k62n4K07M10K62
2429C69k4k53k91r2J89L56L00Mk72l10k00Q3L35K46L8k43l94k17M0K73K71J04
2451C12k38l14k38nK99L06J33j28l14k38J8K29L24K20j02k65k86m8K23L32K32
2472D52k2k74k88r1J54K76K54j4k52l31j95J30K55K39K5k09l61j99M2K53L01N3
2494A98j19l14k22L4K85L00J72r5k81k10qK28L41J61q2k73k85o8J79K84J86p9
2516C32k81k87j27J16K87K07J2k20l19j53J04K71K68P3k13k68j97O6K95K66J05
$$ y = [351, 424, 171, -223, -500, -463, -181, 183, 348, 176, -195, -475, -480, -189, 182, 376, 312, -22, -358, -391, -176, 192, 458, 389, 67, -265, -421, -224, 125, 393, 423, 98, -229, -399, -264, 91, 391, 447, 220, -118, -357, -222, 90, 381, 505, 301, -80, -322, -327, -64, 271, 355, 176, -168, -484, -495, -270, 54, 217, 113, -194, -456, -510, -303, 107, 369, 345, 92, -199, -291, -102, 254, 554, 558, 286, -24, -224, -141, 194, 440, 478, 235, -159, -376, -336, -63, 208, 312, 74, -240, -478, -483, -184, 122, 255, 127, -187, -425, -407, -178, 146, 366, 264, -1, -287, -335, -112, 220, 452, 430, 156, -132, -223, -69, 207, 461, 447, 195, -136, -331, -201, 54, 293, 318, 109, -252, -451, -409, -156, 145, 198, 79, -235, -457, -423, -138, 162, 334, 239, -42, -252, -260, -32, 309, 470, 388, 115, -170, -238, -59, 225, 411, 332, 51, -236, -363, -247, 40, 247, 259, 39, -280, -433, -329, -58, 210, 283, 70, -198, -395, -329, -34, 232, 337]
2537C37j33l07k00M1K22L21J30j15k67k34l5K29K69J63n5k96l04p2J47K73J81
2558B95r4k42k80j44J50K74J91L9k39k56j56J53K91K76O6j42k56j62Q2K66K68
2579C80P7j43l00j91k1K34K26J05j24k84k65l7J88K50J46p7k46k58o5J61L10J81
2601B47j0k13k97o5J38K61K21J4k32k55j37J05K54K28P6j76k56j45K9K30K89P3
2623C79j31k43k07nK09K42J17j05k70k57k5J48K51J52q4k47k56q8J72K54K05r
2645B02k28k42p0J20K51K43L4j91k49j46R6K56K05Q0j80k57j63L8K19K37O0r4
2667B21k63k06QJ99K38J33q3k54k05p3J78K45J38m1k35k93n6J28K28J59j7j86
2689c7k40j25J15K56K23L7j54k16j27R1K37K54P7j45k08j63OK20K29Q1j42k59
$$ y = [337, 204, -103, -303, -262, -40, 281, 411, 296, 29, -205, -240, -11, 258, 421, 366, 70, -234, -306, -159, 114, 295, 201, -41, -321, -465, -315, -41, 150, 189, -50, -306, -462, -309, -18, 258, 324, 182, -74, -236, -154, 112, 380, 457, 314, 14, -177, -198, 36, 262, 367, 243, -41, -306, -343, -155, 95, 241, 164, -82, -340, -405, -244, 66, 247, 237, 24, -273, -338, -200, 61, 282, 296, 64, -191, -328, -223, 31, 259, 335, 159, -97, -242, -213, 17, 306, 379, 248, 5, -202, -207, 2, 244, 361, 256, -14, -271, -296, -148, 103, 255, 171, -76, -332, -420, -248, 6, 211, 202, -26, -268, -338, -218, 33, 276, 310, 119, -130, -276, -180, 76, 281, 361, 181, -76, -239, -201, 18, 255, 315, 221, -42, -248, -240, -41, 197, 330, 247, -7, -212, -285, -107, 138, 276, 235, 0, -293, -349, -221, 7, 166, 149, -37, -277, -402, -287, -31, 192, 229, 75, -141, -268, -177, 60, 314, 391, 246, 38, -125, -119, 101, 330, 411, 269, 10]
2711A0k03k8J30K38R7j18k22k17o2J44K33J43j3k11k11n7J21K56J94K8j67k39
2733a54p7J03K06K02M9j68k36j42O0K03K06P4j39k22j71J8J74K04R8j03k16j90
2755b21m2J66K14J11q7j96j98m1J11K22J38l0j68j97r3J37K21J76K0j40k11q5
2777a93P2K07K20J1j50k05j42L0J75J64O3j04k34j67OJ45K31Q7j09j85j63j8J53
2800a06K02J39k9j82j85m7J28K27R1Pj66k19q9J13J53J72Mj61k00j08Q7J53J73
2823A57N2j45j82j29N3J68J82Q2p8j92j52pJ74J81P1l8j98j74l2J35J67J26l9
2846A82j72j79m5J09J90R7rj27j84j13Q7J82J53J2j31j77j19N4J65J70L2q6j73
2869h2j24K7J49J88O1o5j62j22l0J62J63P3l6j80j37m7R7J71J05m9j45j73p5R7
$$ y = [10, -193, -221, -91, 147, 244, 126, -96, -313, -375, -231, 2, 145, 132, -79, -290, -347, -226, 30, 224, 252, 85, -154, -231, -128, 78, 280, 329, 161, -75, -217, -157, 46, 252, 326, 187, -35, -206, -188, -14, 190, 288, 185, -31, -221, -263, -97, 117, 228, 141, -55, -253, -294, -183, 39, 177, 147, -21, -218, -311, -174, 47, 223, 243, 103, -108, -193, -121, 86, 306, 317, 167, -38, -180, -150, 25, 189, 252, 148, -86, -253, -247, -102, 129, 216, 107, -78, -241, -259, -106, 96, 235, 206, 24, -161, -208, -80, 147, 238, 245, 79, -140, -229, -116, 37, 209, 213, 52, -148, -256, -169, -16, 157, 209, 64, -118, -247, -194, -26, 156, 238, 160, -32, -184, -191, -17, 164, 235, 197, -1, -175, -207, -72, 95, 221, 182, 10, -169, -214, -105, 85, 182, 173, 46, -138, -251, -164, 18, 171, 183, 52, -125, -244, -190, -25, 145, 177, 91, -82, -206, -179, -30, 158, 219, 154, -8, -130, -160, 2, 165, 238, 202, 22, -115, -162, -65, 106, 211, 162, 17, -156, -231, -134]
2893a34J49J24k3j12j73p0O8J77J38J7j00j49r5O2J31J67L9j01j52j00j2J51J34
2916A36N9n7j91j18oJ32J43J01p3j40j24n4J04J64J08k0j20j74m4P9J53J14j1
2939A61j24j53q0P1J16J31L8j14j61p8L6J56J34L2o2j56j07K6J26J39N8o0j23
2962Fj25l1J17J29Q0m6j31j40l5J20J16J04oj39j06n4M4J65R0J9j31j51n4M7R5
2987a7J28J3r2j42o1J3J34J28K2n5j38q4K2J10J56M4l9j30q6j8R1J49N4n0j55
3012cj26j7P8J18R3l8j17j41n4Q8J33Q5K8j19j20n5M4J71R8L1j09r6r5N4Q8J12
3038A31L4n4j49r1J5O0J67L0o9j27j05j5J14R1J07l4j22r7m2R6J34Q5k0j04j18
3063h3m7P5R9J25m1j01q9p5N0J15J08jr4j10p5L0J11J04N0q3j29o1j9R5J23P4
$$ y = [-134, 15, 139, 116, 4, -169, -239, -171, 6, 144, 161, 61, -88, -183, -121, 10, 177, 216, 115, -37, -137, -149, 2, 136, 195, 138, -53, -171, -177, -45, 98, 199, 126, -14, -138, -192, -88, 76, 184, 164, 44, -130, -174, -95, 58, 172, 161, 37, -116, -196, -125, -9, 122, 160, 46, -115, -193, -157, -1, 133, 165, 103, -53, -160, -134, -8, 131, 189, 129, 6, -119, -150, -33, 96, 176, 130, -1, -141, -176, -56, 60, 164, 158, 19, -87, -141, -97, 68, 158, 177, 46, -105, -159, -112, -17, 111, 124, 32, -110, -171, -158, -24, 104, 126, 71, -67, -151, -129, -19, 137, 181, 142, 12, -74, -92, -1, 148, 202, 152, -3, -129, -146, -68, 50, 143, 105, -12, -153, -207, -119, 14, 99, 127, 8, -112, -167, -123, 48, 146, 177, 68, -28, -123, -69, 19, 131, 165, 111, -38, -129, -114, -54, 113, 143, 74, -53, -158, -173, -59, 32, 139, 105, -17, -114, -156, -60, 74, 159, 139, 35, -83, -130, -55, 44, 169, 128, 27, -62, -137, -87, 28, 136, 135, 41, -69, -144, -114, -3, 101, 151, 68, -61, -122, -141, -46, 77, 151]
3089A51q2j02r1j9P8J09R9l7j05j10rO0J26Q1j9q9j06k9M9J02R5nj05j09o6M5
3115h8Q6P4L4r1j31m4K2R0J10L1o2p7p9J3J00J10O7m3j01p6l2P4J31N8n1q1j19
3142g5l8M5R6Q3k9j04q2n7L9J23Q1K6q5j03n9M8R4J12K8q3j14n9K0R8P1M5n2j17
3170d8o8J6O1J14M7n0q2p5k0N9J18O5l3p9q5l4M0R8P9%r6r6m5N2N9Q8Mn7j10n2
3200a30L2P5R8L5n0j23n0OR7R0L6j7j04r3j4Q1R5M9k5r7q5j5O7J01O8l1o6j10
3228h0k5N4R0O3np0q0p0L1P8R0J3o4r6n2NQ0J11K5m3q2o4KP5J03M2l6p8p4MM3
3259a0R7L1qj05q3j2K0Q9N6qp5q3l6L8O5Q9Oq6n8l9M3O2R2K0m5p4j05M5J06N8
3289I0J8l8q0o3jO0P3M9k5p9j01QM0Q1M5oo7q7k0L9Q1M4Po0q4l8L7O9P9J0n1o4
$$ y = [151, 69, -33, -124, -143, -65, 44, 143, 106, 1, -109, -118, -58, 68, 149, 130, 41, -65, -94, -45, 57, 152, 147, 42, -67, -133, -88, -2, 72, 106, 15, -116, -160, -138, -48, 62, 93, 31, -46, -125, -112, -12, 98, 165, 122, 21, -55, -87, -13, 118, 176, 125, 44, -75, -113, -68, 28, 111, 82, -22, -104, -161, -122, 1, 82, 108, 23, -80, -139, -91, 3, 115, 143, 60, -54, -113, -93, 5, 76, 121, 69, -48, -116, -100, -39, 75, 122, 72, -10, -85, -105, -46, 72, 137, 104, 25, -60, -94, -54, 44, 123, 123, 27, -69, -114, -62, -3, 85, 89, 32, -78, -130, -98, -23, 75, 110, 60, -63, -113, -107, -10, 80, 116, 99, -5, -98, -112, -31, 64, 113, 88, -9, -94, -109, -42, 59, 127, 96, 30, -80, -105, -51, 39, 102, 97, 27, -53, -123, -92, -14, 76, 89, 25, -71, -123, -118, -38, 73, 98, 55, -27, -91, -89, -14, 89, 131, 95, 17, -57, -53, -10, 87, 118, 110, 5, -78, -90, -70, 19, 75, 67, -8, -91, -127, -89, -24, 65, 71, -15, -73, -112, -69, -7, 85, 105, 60, -14, -119, -74, 32, 90, 108, 70, -10, -73, -74, -14, 59, 108, 83, 4, -97, -89, -49, 32, 77, 71, 4, -83, -103, -64, 17, 61, 68, 8, -76, -114, -77, -8, 71, 81, 30, -34]
3321c4k7j2J05O2Nl5p4l2qN2P4L8o0n8o9j7M9O3O7l1o5o7k5K5Q0O9k9l0o1m5M6
3352d4N9N5K6p0o1l5J7O6O1%l9m7n7mP9N4L9n4o5l2j1M6O9N5l0o6p8pN0L5O2j7
3384E6m0o3l6QP4N3j1k8r0k3L7N5O7Rk3p4j4PO2N1L3k9q1m2J9J5N5L8l5p5l9j9
3416h3M7O1K6k3n7m0j3J9P2O2k7l3m5l4K4P6K8J0l5n0m7K9K8P2Kl9m7m5PL3P4
3447E2K0n2m2m2KN9K4K8k0l4m3j1M0M4M5j3o0n0jJ0P6J6Lm5n2j9L8K6N3j2k8l5
3479b3l2K3K6L4L5k7m9k8J6K6O0lk8l2m8JL0N1Jpm4l7j7K8P3K0j4l9m4jJ4O1K9
3512E5J4n1m2nlL8K7J0l3m3k2PL1L1J6j6l4l6K8K4N1J4j4n7l3J1J9M5J6j4l4l9
3544c9nJ8K2K9%k6m2QMN6K8J5k5m7oJ3M6M8j6l8m3k1k0L3M0%k5n8l6RK7L6L0K
$$ y = [-34, -61, -73, 32, 94, 99, 64, -10, -42, -50, 2, 76, 114, 54, -4, -73, -90, -41, 22, 89, 58, -7, -74, -99, -74, 6, 75, 46, 16, -45, -90, -44, 15, 70, 96, 26, -35, -70, -53, 13, 74, 74, 35, -12, -69, -73, 6, 60, 99, 45, -20, -52, -63, -17, 52, 107, 77, 11, -67, -74, -24, 11, 73, 56, 16, -47, -83, -75, -1, 52, 41, 13, -77, -100, -63, -8, 59, 68, 45, -29, -43, -36, 26, 77, 110, 81, 0, -42, -23, -8, 47, 85, 50, -25, -64, -83, -36, 25, 51, 28, -29, -69, -82, -63, 9, 71, 44, 11, -34, -68, -44, 32, 60, 70, 35, -15, -62, -33, -5, 67, 69, 30, -17, -62, -55, -22, 52, 72, 20, -22, -64, -62, -3, 21, 49, 29, -5, -48, -59, -19, 25, 70, 57, -3, -53, -54, -44, 32, 48, 51, 6, -46, -65, -27, -1, 52, 40, 12, -23, -55, -32, -6, 28, 63, 36, -13, -41, -25, 1, 61, 58, 30, -2, -50, -49, -19, 32, 33, 26, -18, -55, -72, -44, 29, 49, 35, -4, -48, -49, -35, 26, 55, 69, 18, -24, -29, -32, 6, 33, 43, 10, -33, -55, -48, -17, 14, 30, 14, -20, -56, -28, -4, 47, 61, 47, -10, -43, -32, -13, 32, 48, 34, 0, -39, -44, -26, -4, 25, 25, -1, -43, -35, -31, 25, 53, 68, 43, -4, -10, 3, 49, 97, 81, 43, 0, -21, -41, -8, 32, 32, 7, -51, -87, -78, -51, -15, 15, 17]
3578A7p2JKK8L9K7QMo0J3kL6M2k1k7m3j9LN7mPk2n2k2L1RK9Qj4k8l3J1K4N2J5
3613D4k4l2l0J7J4L9L3k7l9k0k2N4L3PJm1k5jJ4L2M7m4j7l7j6J6M8NNl9j7k6N
3646d3J9P0k1l1k1k2K2J2L6L2j8m5Lj2J1N2K5j8m5m8ML6K0K0rj7o6RL5LK4J5l0
3679Bn0KL1J5L4Rk9l5rJ2L5J6ppn0oNK1K6K3l9k2k8RN0J4k%k0m3OK1K6N0l0j2
3715A8k6j1J8M6Rj3Po6pJ1K0M8l5j7m1Mk0L0K1K5j5m5j8lL5K2L5rl0k2j2M8J5
3748B2L6pl9k5j4K2M6J9k7j6l9l0L4J3L1Rm0l6l0K9L3L0j5J6n9LJ4K7L0%j0k3
3780Dj8lLM4J7rm3k3KK2L5kj4j7k7k0K8M0J3qqn6MJ6K3M0ql0k4k2J0L7K3Lj8k8
3816a4j3jM2K6Oj7k0m0lL6M7omm7j8kJ0L7K2k9j7m4J0J5J9L9Ml3l3j6K9K3L4J6
$$ y = [17, -55, -54, -52, -24, 15, 42, 50, 54, -6, 7, 5, 41, 83, 62, 35, -8, -27, -24, 33, 29, 36, 14, -38, -60, -29, -20, 9, 17, 3, -25, -58, -47, -23, 29, 44, 20, -12, -42, -25, -11, 28, 61, 34, -5, -25, -47, 7, 40, 47, 48, 7, -18, -19, -5, 27, 74, 30, 13, -24, -40, -24, 24, 29, 34, -5, -22, -48, -43, -24, 46, 25, -6, -27, -49, -27, -15, 21, 53, 35, -10, -7, -19, -8, 44, 69, 51, 6, -42, -38, -2, 18, 38, 29, 12, -54, -45, -10, -7, 17, 32, 2, -48, -46, -15, 0, 34, 43, 14, -21, -30, -18, 17, 33, 26, 19, -31, -37, -32, -11, 15, 38, -1, -23, -51, -42, 8, 22, 20, 20, 0, -43, -37, -16, 10, 60, 30, 18, -8, -19, -1, 45, 54, 41, 48, -18, -25, -14, 6, 54, 19, 2, -39, -35, -55, -25, -4, 21, 6, -39, -57, -60, -25, -3, 32, 23, -7, -29, -41, 7, 22, 58, 51, 12, -13, -27, -5, 41, 60, 33, 17, -22, -52, -18, -5, 26, 35, -5, -41, -71, -42, -9, 21, 6, 22, -37, -34, -20, 7, 37, 37, 27, 4, -14, -17, -14, 30, 47, 38, -5, -28, -26, -4, 31, 29, 15, -2, -29, -49, -21, 19, 32, 24, 16, -40, -36, -20, 3, 43, 35, 5, -19, -41, -31, 6, 29, 32, 14, -14, -27, -28, 14, 40, 46, 29, 9, -31, -34, 2, 49, 43, 39, -8, -26, -28, -18, 19, 41, 12, -5, -49, -39, -24, -5, 34, 38, 5, -28, -44, -15, 8, 42, 58]
3850E8l3k6j7J0NM7Lk5j6l8oK1K7K8j4l0m5J3J8K4J6J5l6j6k8L9J0M0ql2k8OJ5
3883cJ3L0kj9k5k2J4K1L9ok1Kl1j9L1J6J1nl0k1mL1J9%Ql4j8j7M0K4K7kl9l7J8
3918a1J2PK9Kk5k7j3J3J7L3j6%k8k9J1K0M1J0k3l3j6rN3rK3j1j1m3jK0J4K0J1
3951C1k7k2qPJ9K6Pj4k6rJ5K6J3jkn5J3j1L6j6J8k0j2k2j4K9J1J4oj6jJQL0MO
3987C2j7j0j4J4K9J3Pn0l1j5qL0M2j8j9k2kj0M9QnRl7J1mJ7L9J4%m9klK1LNNm0
4024hj1lJ7J8MRk5j7m2M5RM1k0k9qlLL3J0%j2m0J3mK3J9J4l7j2lLL0JKol2pL4
4062Ij9L6J8j9k8l1J4OQOJ5k7k9kL1J1J2Kj1j9j8M3J5K4ol2Lk4J8K7K6j4l6j4
4096ek0LK2oJ5l0j7jLK3J1J5j7j2j2QKL2M2k2k2j4JRJ8J0j6ok9joJ3K9oj9pk6
$$ y = [58, 25, -1, -18, -8, -3, 44, 47, 22, 6, -32, -38, -17, 10, 38, 24, -6, -51, -38, -20, 4, 20, 35, -1, -17, -45, -6, 4, 44, 36, 4, -24, -18, -3, 10, 40, 38, 19, -6, -28, -14, 7, 46, 40, 19, 21, -10, -29, 2, 18, 29, 24, -6, -27, -31, 0, 19, 19, 27, -7, -25, -42, -2, 22, 49, 47, 8, -29, -11, 1, 8, 37, 39, 14, -13, -26, -13, 4, 37, 21, 21, -7, -36, -25, -5, 36, 46, 23, -10, -26, -35, 18, 9, 32, 21, 10, -33, -34, -14, 0, 20, 31, 4, -18, -26, -19, 0, 26, 33, 19, -7, -16, -1, 25, 38, 37, 35, -20, -7, -18, 18, 2, 20, 0, -12, -34, -48, -19, -8, 6, 0, -16, -17, -16, -8, 22, 26, 32, 15, 5, -9, 5, 34, 47, 54, 4, -27, -42, -50, -20, 22, 4, -15, -37, -39, -49, 0, 8, 3, 12, -25, -14, -18, -1, 38, 52, 52, 3, 1, -2, 19, 22, 27, 32, -8, -19, -22, -5, 13, 17, 26, 1, -16, -58, -13, -4, 37, 17, -12, -20, -23, -20, 13, 23, 23, 11, -29, -16, -20, 3, 22, 36, -1, -13, -16, -13, 17, 18, 20, 14, -18, -25, 9, -10, 26, 44, 25, -3, -34, -20, -14, -6, 0, 15, -12, -41, -43, -12, -1, 11, 13, 2, -17, -35, 8, 23, 47, 41, 9, 12, -12, 6, 33, 59, 45, 9, -5, -25, -22, 0, -6, 9, -21, -38, -39, -36, -13, -2, 13, -4, -16, -28, -20, -18, 14, 56, 34, 12, -2, -1, 8, 26, 36, 20, 14, -15, -16, -22, -9, 20, 14, -5, -12, -38]
4133c8NM9mj2Jql5K8K4J9j5j1rjj3K9K7Jnk8j0j2K7J0Nj3j3l1NK6RMQk6k0j5J9
4170b3J9J1J1l3nnJM9k%rk6roJ9L0j0pj1mRK3LMjk4l0QJ6J3Lj7oj6j5J8J9K3j9
4209Aok7QPJ8K0Lk4j4QmL2K1rKn5Qj1L6NNk9k2J5j9K2K6Nnk6okJ5RK3k2j1j5o
4248b4K5L5Rk1jl8PNJ8J7rj5k5k2J7K8LMj2l2LL2k0L6Oj2j4j2KK0J9%rk9k7K6
4284a0K4LJ1j5j7j7j0J8L6K0k3j9j9j3K8L7j4J2k8j2j4KL5MJ7m0Ok5J5J9RKk2
4317@nj9J2K0K6kj2k9KJ3l1L5Oj0j8j3KOL3J4k1j2J0l4J3RK8kj3j2o%J1J8K6j9
4353B6j4j6j5J5K9Ppm8QqK1L4Nk1k2k0%K1rPK1j7l2KL1JJ8Rk3Mk7J7J2J9J4j3
4389B9l4j1K6oRMj0k1nj6K6%K3j7j4j6j6J7K3K1Oj1k7KJ4J3K1pj4j2%MM2j0kl0
$$ y = [-38, -33, 16, 12, 0, 1, -7, -42, -14, 10, 29, 14, 3, -6, -7, -20, 9, 36, 37, 32, 4, -6, -18, 9, 19, 24, 11, -2, -33, -28, -2, 7, 11, 19, -7, -27, -42, -23, -4, 7, 18, -15, -20, -25, -24, 25, 23, 23, 14, -12, -21, -27, -8, 22, 12, 5, -6, -10, -1, 22, 25, 29, 28, 4, -26, -18, -2, 11, 14, -3, -9, -25, -40, -22, -3, 20, 1, -5, -32, -24, -17, 1, 21, 24, 0, -14, -6, -10, 22, 43, 34, 36, -19, -11, -22, 14, 19, 24, -5, -27, -12, -31, -9, 17, 22, 17, -9, -15, -17, -2, 7, 30, 8, -3, -18, -24, 1, 36, 45, 24, 23, -15, -8, -3, 15, 32, 23, 8, -17, -39, -22, 6, 9, 13, 1, -31, -28, 4, -16, 20, 26, 14, 0, -12, -10, 10, 29, 29, 20, -9, -36, -10, 14, 17, 28, 13, -4, -21, -31, -13, 23, 43, 20, 1, -18, -31, -3, 34, 20, 32, 4, -8, -22, -20, 15, 19, 36, -4, 2, -23, -8, 11, 20, 22, 0, -5, -24, -12, 8, 34, 32, 20, -9, -7, 6, -25, 10, 16, 6, -12, -25, -23, -17, 16, 30, 9, -3, 7, -27, -14, -5, 23, 21, 8, -4, -10, -10, 1, 19, 45, 26, 12, -4, -19, -4, 25, 32, 25, -23, -15, -23, -2, 32, 37, 16, -6, -26, -26, -5, -14, -7, 14, -3, -35, -33, -2, -1, 17, 26, 3, 7, -20, -3, 9, 28, 42, 29, -5, -16, 10, 4, 13, 17, 7, -14, -19, -35, -9, -9, 14, -3, -17, -33, -49, -32, -9, 12, 18, 7, -20, -18, -4, 9, 30, 23, 9, -3, -3, 1, 43, 33, 31, 1]
4425Aj7qJ8K3jrJ3m0j5J7K7JMk1j6j1J0K9KJ8k4l3plL3K4J1k2mj4ONL2mk2J6k6
4462gl2L0K2j1J3k0j9J4pK2J9oj2l1%K0mJ5J8j3l0JlK8J5lMk6j8qK4K8%j3j5%
4498ekKJ4j0jLj1lNQK2Nnk2l%J1K7o%k8k0JK9JRj6j1j9j3K2J3j1Mj2k0PNK6mJ5
4539GJ5m3PML2pOj6j6K8k2K2JLlql3JK2J3rJk8j8J8J1KJ7k4j5nK1K5jj2J9l9J0
4577a4MJ3K4j8J0ok1%K1j8L4j9j2plJ8qK0%l0Ml%J5Mjk4kj5QK4J0Qk6j9J3J4J1
4615Ij3J9k3Qk2rK0L0llrj6K1j3K0Nj3k4pJ4K3JOrj1l1J6jL0pnPm4RJ7K0L%ok5
4655a6NPK0Opj3j7j4K8J1MJ9l3j1k1%K5K7Pk6J2k3J1KK2Pjm3kJ3%K4J7j0k2oj8
4692a6K2j6K6j9mjk1mL3j%jk6lJM2Ojk1j9RJ5RK3j8mk%j3PPJ6j3rqqK0j0K0k3
$$ y = [1, -16, -24, -6, 17, 16, 7, 20, -20, -35, -18, 9, 10, 14, -7, -23, -34, -24, 5, 7, 25, 1, -32, -39, -42, -9, 15, 26, 4, 0, -14, -8, -3, 29, 25, 3, 19, -7, -39, -9, 13, 2, 15, -5, -24, -10, -17, 5, 24, 18, 6, -25, -25, -5, -9, 6, 24, 11, -19, -18, -21, 7, 22, 19, 23, -3, -21, -29, -5, 23, 23, 10, -5, -5, -7, -5, 9, -1, -2, 1, -10, -13, -8, 0, 22, 27, 22, 0, -3, -3, 8, 35, 29, 29, 1, -19, -18, 11, 12, 21, 5, -6, -25, -38, -16, -3, -14, -10, -22, -42, -35, -30, -4, -8, 7, 22, -21, -14, -10, 22, 15, 21, 5, -11, 17, -5, 17, 18, 21, 18, 10, -23, -22, 0, 13, 4, 5, -23, -41, -23, -12, -10, 7, -17, -32, -37, -16, 9, 8, -4, 15, -24, -14, -10, 3, 27, 9, 19, 13, -8, -8, 13, -5, 29, 10, -2, -9, -12, 6, -2, 18, 18, -12, -8, -11, -11, 4, 8, 7, -17, -19, -34, -26, -2, 8, 16, -10, -29, -16, -2, 9, -4, 15, -8, 0, -22, -31, -11, 19, 16, 13, 4, -12, 9, -4, 16, 21, 8, -16, -23, -9, 14, 15, 21, 12, 1, -30, -14, -15, 15, 8, 3, 10, -34, -25, -8, 12, 15, 15, 9, -16, -11, -4, 16, 22, 15, 2, -15, -29, -1, 10, 14, 33, 0, -11, -32, -32, -7, 20, 27, 1, 13, -10, 1, 3, 25, 32, 31, -12, -14, -1, -1, 23, 40, 30, 8, 2, -16, 6, -10, 16, -3, -7, -8, -29, -33, 0, -1, -1, -2, -28, -31, -30, 12, 18, 17, -4, -23, -14, 1, 10, 33, 15, 11, 9, 9, -4, 3, 10, 26, 13, 4, -4, -12, 8, -2, 18, -5]
4732eJ4k8j0OK1Rorlj6kJ4L1Pj4j0k6K4J4J4Jjk3%qJ9K2Ml0kk3J2NoK0pqk9RL3
4772A3l0J6kpl4K5kQK6J0l3JrJ6OPJ5lk5mnJ5J2J6j1k7j7J3PNL4l4ppQj2K9j2
4810AK3j8k8J3%J1J1J2l3oJj4J1J2J9k8j%KJ3L0lj1l8RkK6Rj8M%j4%J8J5j0jj5
4848@mnOKPJ0k9rJLJ3LNk3Lj2RJ2J6J3l6kOj1K6J7Nj0j9JQ%K4j2j9OJ0k3J3K2
4888B7k2onj1pMJ2J2j1Ml9lL4NoK3l2PoJ4K4j6Rlj2lK6lJ4j1k3J4nrJ1Oqoj4o
4928b1Pj2J7J7pooj2oK0Q%jj8JJ3K9onnk7J6JJ3LJ5k0k0K8pNJ9j2j1j8lNmJ8o
4968Bjk1J2j0J8qK3k7Lj9J1K2%kj1J5j2MmK9rJ2k1rpJ1pJ5MJj3k1L0JOJ2j2lj6
5007bnlj4L1rj2%j4J5J6Jk0mj4J2JQ%J7j7Rj3ML7j1j3MqKnJ9MOj9nk4K6J0J4%
$$ y = [-5, 9, -19, -29, -23, -2, 7, 1, -8, -11, -27, -29, -15, 16, 23, 9, -1, -27, -3, 11, 25, 26, 25, 2, 2, -6, 13, 35, 39, 9, 7, -16, -4, 1, -5, 15, 8, 0, -29, -20, 13, -17, -1, -3, -10, -44, -19, -21, -13, 13, 23, -10, -9, -18, -2, 4, 11, 26, 23, -2, -6, -11, 4, 16, 32, 21, -6, -23, -10, -3, 2, 36, 2, -5, -12, -4, -16, 13, 1, 24, 6, -22, -9, -9, 2, 13, 25, -8, -14, -13, -27, -16, -4, 15, -13, -14, -14, -12, 1, 31, 28, 17, -21, -12, -14, 12, 21, 3, 7, 7, -7, -7, 11, 26, 16, 15, 0, -4, -9, -3, -1, 6, 16, -13, -22, -21, -18, -5, -2, 3, -20, -17, -29, -20, -8, 8, 21, -15, -17, -11, -22, 4, 21, 26, 16, -3, -2, 6, 6, 30, 18, -1, 5, 15, -8, 5, 27, 5, -1, -6, -17, -24, -20, -8, 4, -7, -3, -42, -45, -11, -6, -12, 11, -21, -14, -20, -6, 18, 2, 11, 8, -4, -7, 19, 16, 30, 19, -4, 10, 5, -4, 7, 13, 5, -1, -15, -21, -14, -26, -9, 8, 1, -5, -11, -23, -29, -9, -1, -1, -2, -20, -19, -6, 23, 17, 12, 7, -20, -4, -3, 10, 13, 28, 8, -12, 16, 9, 14, 33, 21, 10, -8, -11, -6, -10, 8, 2, 1, -20, -8, -18, 0, -8, 15, -12, -9, -28, -17, 5, 5, 3, -8, 7, -5, -1, -5, 24, 15, 27, 6, -3, -10, 1, -6, 9, 13, 14, 1, -20, 10, 11, 17, 29, 17, 14, -2, -7, -10, -24, 7, -2, -14, -14, -28, -13, 3, 4, -16, -20, -34, -22, -21, -13, -13, 4, -13, -4, -17, -13, 24, 13, 0, 4, -4, -2, -7, 12, 16, 22, 3, -2, -26, 0, 10, 24, 24]
5047B4j9j9rPJ4Mj7Qj7QjJ5Lj2K3j8k8J8J0oJ8j3nJ1j8J2KJ2kk0J8j8J4J4k0N
5083blRJ5j0mnRLl8J4jJ4QMk1k2K1j3J8KmQk8%OK4qJ5j8mj8K0J6LJ0Mk7Nj7K6
5123A1MMj4rmPPj3K3Mk6Oj2J5OlJ0k6MQk0K1Mr%ok4J0PK5j2Kj1KNqPK4j1j0j7
5164a9%K6jJ1k0MppJ6KJ9mj0qjj0K9k2J7k8mmKK1JK1k5nj6J6lJ9j4nj1RpJ4NJ6
5204A7rl0J6Ok0L2mkqRpmL4k2J2omkk0J7%mj6j0jJ5j1ML2k1Ol3K6j4L4nQl%j7
5244ePKL1rk0qJ2j5J3J5pk1Lj7LJ9oJ0Kk8ORJj0K1k0jJJkLPj0J0Nj7K2J0Lj0j2
5285bLk1K9NJ1rpj5JjJ9Jj4jj9j1J5J5MPj5j0mJ6lJ3j4K1k0k0JL6oJ2j6Jj1j5
5323b4K1J9Mok1LnJ5Pknj2J2LpkJ8j7qj3NLJ0J6j2rlkkNJ0Oj6JmLK%L0lk8rQJ4
$$ y = [24, 5, -14, -23, -16, -2, 2, -15, -7, -24, -16, -17, -2, 1, -11, 12, -6, -34, -16, -6, -12, 6, -7, -12, -1, -19, -7, -5, 7, 5, -15, 3, -15, -1, 13, -7, -2, -5, 4, 19, 9, 5, 0, 9, 12, -26, -12, -13, 1, 9, 13, -8, -30, -9, -22, -4, -2, -6, 2, -26, -26, -20, 4, -4, 11, -7, -11, -29, -9, 7, 10, 20, 24, -3, 2, -15, 11, 15, 19, 5, -4, -8, -1, 6, -7, 16, 20, -6, 0, -12, 3, 9, 6, 16, -10, -6, 2, -18, 3, 7, -2, -2, -8, -32, -22, -15, 10, -2, 0, -11, -9, -4, -12, -5, 19, 8, -2, -19, -19, 7, 6, 17, -3, 1, -6, -13, 3, 5, 24, 20, 10, 2, 1, -9, 20, -2, 15, -13, -17, -21, -19, 2, 3, 24, -1, -6, -22, -6, -9, 10, -4, -9, -20, -11, -18, -4, 1, 17, 8, -22, -6, 0, -20, 12, 8, 6, -2, 7, 0, -4, 30, 8, 20, 14, 10, 8, -12, 5, 5, 1, -15, -25, -26, -11, -22, -18, 14, -7, -1, -34, -8, -22, 12, 7, 15, 12, 12, -5, 2, 4, 35, 26, 6, -2, 10, -5, 8, 23, 16, -5, -2, -19, -16, 3, -3, 7, 9, -19, -13, -4, -3, -13, 8, -12, -13, -12, -11, -13, -10, -3, -13, -3, 2, -15, 7, 17, 20, 10, -2, 1, -20, 9, 14, 25, 16, 9, -6, -5, -6, 13, 14, 0, -1, -20, -31, -16, -1, 3, 10, -5, -15, -19, -3, -6, 7, -7, 14, -6, -26, -25, 11, 5, 17, 1, 2, -9, -24, -3, 16, 20, 14, -7, -4, -9, 6, 13, 11, 6, -6, 6, 9, 2, 0, 18, 1, -7, -20, -15, -12, -2, 14, 2, -7, -10, -12, -14, -9, 1, 7, -9, -8, -12, -9, -7, -7, 23, 20, -8, -17, -9, 5]
5367EJ1j6J8l7J0KMJ9qK3l2qJ2K0qnlk5J9l2J3J5j3KOqnJ5RLloj0RJQJ9Jk0oK
5408ALONJ9l4J0j6nJ1nnjJ5k3OpJ7Lj2kjLPRj0KJ5l2J3QrPJ8k0j8J5MJ5k6L1q
5449Ik2J0nkJ8pj5Mk%jNJ9k9J2k1J3K4j4J2Mok3lQK7qPk2j5OQJJ3pj1J2j9K0j8
5489a8L6oj1J1j7j3J4kpRk1J0jJ5J7j3J0k1MmJ1PrJ8k2j4mJ1J9nqrJ0m%nNK0k0
5528gpJ4j3K0OJnlKk1K1oJ8k5j5J3KLqQPj4MOLjqJ2l5MP%J7l0L2%oqJ9KrP%j5
5572hLrNK5j3pknQ%JJj6nJ0%PKLmj7J2lJ3JJ9l3J0k4J2%J2PjoJ0nQk2NOj2j0Q
5616a4J3nRJKj8NJ0K4j6%k0QlJPqNqrLJ3J0oPk5KmJ7nrKJ8j4n%K0k2RPok3JJ4
5660a2kK7k5kJ5k2K0oJ4Qk2OqJ%Qj1RKJ0k6K1lJ1j8j5qNJL2nj0j6J1PJ0mPj1J
$$ y = [5, 16, 0, 18, -19, -9, -7, -3, 16, 8, 31, -1, -9, 3, 23, 15, 10, 7, -18, 1, -31, -18, -3, -16, -14, -8, -16, -21, -6, 3, 6, 3, -3, -13, -4, -3, 5, 24, 25, 5, -1, 1, 4, 10, 15, 34, 0, 10, -6, -11, 0, -5, -10, -11, 4, -19, -13, -20, -3, 0, -12, -14, -15, -12, -5, 4, -6, -4, 11, -21, -8, 0, -9, -2, 16, -4, -22, -7, -3, 12, -14, 17, 9, -13, -3, -8, -10, 8, 1, -14, -10, -12, -12, -13, -8, 11, -18, -6, -27, -14, 10, -4, 8, 12, 6, -17, -20, -12, 15, 7, 14, -8, -23, -17, -9, -8, 5, -2, -13, -1, -20, 0, -18, 18, 12, 1, 12, -5, -18, -4, -6, -13, -4, -25, -15, -16, -1, 16, 3, 13, -8, -4, -8, 3, 10, 1, 19, -3, -17, -21, -10, 9, 4, -4, -13, -3, -7, -7, -12, -7, 13, -7, -14, 0, -13, 7, 13, 14, 9, 6, 8, -13, 8, 2, 20, -5, -20, -7, -5, -2, -10, -2, 5, -9, -5, 1, 4, 3, -5, 7, -28, -24, -17, -17, 0, -30, 2, 2, -4, -12, 7, 9, 0, 7, 7, -8, -5, -14, -9, 16, 3, -4, -6, -11, -3, -3, -2, -1, -17, -22, -12, -12, -5, -3, 0, -4, -21, -9, -12, 1, 2, 21, -12, -2, -26, -14, -14, -2, 5, 4, -2, 8, 3, 11, -11, -6, 0, -12, -22, -14, -1, -6, 3, 4, 6, -12, -7, 3, 27, 11, 11, -9, -1, -4, -3, 4, -4, 1, -7, -16, -13, 0, 10, 4, 11, -14, -12, -16, 1, -4, -13, -11, 7, -7, -12, -12, 8, -14, -5, 2, -4, -27, -26, -12, -14, 13, -12, -14, 1, -21, -1, -7, 7, 15, -7, -1, -9, -8, -8, 0, -11, -2, 0, 10, -16, 5, 2, 13, -5, -20, -28, -23, -22, 10, 5, -5, -21, -10, -3, 7, 3, 10, -1, 0]
5700@nl1L9ONlk1jnJ8Kn%jk8J1K2k8K2pLMrJ9k9K2kj5PjrnK4j8PPpnJ2mK1j4L
5743Aj1%K2mmj1Rj0OqJ5J0l0Oj2mRj0J5Jk3K2JO%NJlj3j7K6J1NJ0k7RnnLJ2j0
5784bNj7MjJ5%j8J8k6J2j3KK5j1J0j0noJ7k0K7%j5K2j2j5QJ6j3J5j0l2K5Nj2q
5820b0L3l2%J7Pjj5jj0K5j2j8K0OlnL%PQNqrKnj1LL6l4K3k1kJ3%J5j7jlJ4j1M
5861BRK%lk0J1oMMoj5J8k8K3J4nKkqQkRlK6l4JNqjMJ3pj1kQpK3Pk5J6j1j3J6N
5905A3pj9K7k1j2J1mJ6Qk3OJMj3J4Moj2J6OpJ9j8LJ4j7l5K3OKplJ0qJ1J2j6j8
5943b0J8oj1K2j2MmMjrmJ6MqjJONjRpRpmPj4OJ4nlk3R%J4Jk2J5nj2J7j0J5lj4
5987a0Rk1J1Lj2J5J0k4j3K8KK0%rOk6K0kk2K2kMj1JpnNJ8j8kJ2pPj5J9j5j0%J8
$$ y = [0, -5, -36, 3, 9, 14, 11, -10, -11, -16, 2, 4, -1, -1, -2, -30, -19, 3, -25, -3, -10, -7, -3, -12, 7, -22, 0, -2, -17, -10, -11, -20, -25, -1, -19, -12, -5, -12, -17, -5, -9, 12, -2, 1, -10, -10, 12, 8, 4, -7, 2, -8, -2, -10, 5, 15, -15, -9, -21, -25, -16, -26, -11, -10, -33, -11, -10, -4, -4, 1, 2, -1, -14, -31, -5, 6, 11, 21, -6, 3, -2, -7, -4, 8, -2, 3, -14, -10, -11, 4, 4, -14, 4, -22, -10, -23, -21, 4, -7, 3, -7, -12, -18, -1, -21, 6, 6, -9, 13, 1, -14, -6, 10, -3, 12, 2, -30, -5, 0, -12, -20, 13, -19, -19, -2, 5, 4, -11, -12, -22, 3, -9, -27, -7, -1, -4, -9, -6, -6, 1, 9, 14, 6, -3, -1, -6, -17, -14, 22, -12, 11, -10, -12, 1, 1, 16, -1, -2, -5, 9, -2, 2, 11, 13, 13, 10, -10, 1, -5, -1, 3, -3, -18, 0, -28, -5, 9, 4, 6, 4, -4, 4, 2, 11, 8, 34, 0, 1, 6, -2, -3, 1, 14, 7, -4, -6, 2, -5, 18, 25, 0, 16, 5, -8, 8, 13, 6, -13, 14, -7, -19, -8, -12, 4, 12, -11, -5, -4, 0, -13, 1, 5, -1, -13, 3, 9, 2, 21, 3, 6, 20, 3, -32, -9, -3, -1, -8, -11, -1, -9, 2, 14, -2, -20, -2, -8, -19, 3, -9, -5, -9, -5, -6, -15, -19, -3, 1, -7, -8, -7, -1, 4, 3, 12, 5, 14, 7, 3, 10, -4, 2, 16, 11, 8, -15, -6, -6, 8, 9, -13, 2, -3, -15, 2, -8, 7, 4, -10, -1, -22, -11, -8, -20, -5, 5, -19, -32, -4, -2, 18, 18, 9, 15, -11, 9, 7, -15, 7, 5, 9, -2, -1, -8, -13, -8, 10, -8, -10, 2, -5, 2, -13, 6, -9, -19, -19, -1]
6026aJ6j1rLj2MoL3l1JJ7j6nK4nj3MJ6j9lRJ3MoKk7J5J6j1Mj1OOj0Pj0%QnJk8
6067c0K1KJ5mpJ9l4K0j6j0K7qnLLM%qJ1k3J3qJ4oj7J4K1qj1RoJ2pqJkRjlJ5j4
6108cj2MkPj3J6Qj5PmJ0rLJ0k1J1j5J3j%j2JK0Nk4K0j8NjNJ5k8J3J7nJKk3J0M
6148AlpJ3j0j5K0j1lJ0Kj6qJ4J6qJJqJ6qK1j0Mqj2K0moPLJ7j8lkk1J4Lmj6JJ1
6189fj0MJ4j2Kj6J1lJ6moJ9j1J9j2j3kK7j8Nj2Oj1KNLj0J1KPrJlrRKj0J1NOk1
6230a1J9Qk4oK8j2%Nj7lmJ9MLml1J7RqJ9j8j9K0k0J8OJ2Qj3JLoj4J2Pj1K2j9k
6269bPLJ0j7j2J4k0PJ1mNpoJ5oj0J3kMmj5J8j0lLLMJ9k5ORk1J4Rk2J9j7PlJ5q
6310Aj8%J6k3J5JqnK2krJ0rKLj4RNOQk1J5Jk1L0Pnkk1Qj6J2kJ6l3J8J0qKJpMj1
$$ y = [-1, 15, 4, -5, -2, -14, -10, -16, 17, -14, -13, 4, -12, -17, 7, 2, -11, -7, 9, -10, -13, -4, 9, 13, 7, 9, -18, -3, 13, 2, 6, -5, 1, 7, -3, 4, -6, -6, 2, -3, -2, -30, -9, -7, 8, 4, -3, 16, -18, 2, -14, -24, 3, -5, -10, -7, -4, 0, 0, -8, 3, -20, -7, -15, -1, -7, -24, -10, 11, 3, -8, 1, -5, 7, 0, -8, -7, -9, 0, -1, -4, 11, -3, -15, -11, -13, -6, -19, -3, 5, -10, -3, -7, 3, -6, -3, 7, -14, -3, -18, -5, -6, -6, -18, -17, 3, 8, -16, 4, -14, -9, -10, -5, 10, -18, -5, 12, 7, 8, 10, -13, -3, 1, -2, -9, 4, -6, -21, -1, -12, -15, -5, -3, -19, -27, -13, 3, -5, -4, -3, -11, 5, -3, 18, 8, 12, 4, -8, 12, 8, 2, 9, 12, 29, 11, 8, 6, -15, -1, 2, -2, -18, -17, -6, -16, -12, 2, -10, -8, -24, -13, -16, 0, -4, -10, 9, -2, 17, 5, -8, -10, 17, -1, 4, -8, -2, -13, -11, -6, -3, -13, -2, 0, 7, -2, -1, -4, -13, -4, -2, -12, -1, 4, 10, -11, 8, 16, -8, -14, 14, 2, 2, 7, -10, -13, -17, 2, 6, 9, 5, -26, -9, 0, -8, 11, -7, -26, -6, -26, -8, -2, 10, 18, 5, 6, 9, 3, -11, 1, 8, -3, 19, 0, -2, 5, 8, 18, 1, -11, 3, -17, -10, 1, -3, 2, -5, -11, 4, -2, -12, 1, -1, 3, -1, -16, 2, -8, -11, -8, -5, -1, 18, -7, -1, 8, -13, 1, 10, -12, 7, -10, -3, -6, 9, 1, -17, -17, -1, -24, -9, -8, -16, -21, 1, -1, -10, 0, -9, -7, -4, -18, -9, -4, 2, 10, -11, 4, 5, -16, 14, 21, 16, 14, -7, 1, -15, -3, -5, 11, -22, -4, 6, -2, 0, 1, -6, -2, -13]
6353a3qK8rj1RJ0mj1%J2kMK3m0J8k6J9mOmK1k2J4j2Jj1K2Krj8NQJ0JnJRj0Rk4
6393a1NJj3L1k0LPoRkLnj6L3pKjj1J3qJ3rqljkQLkomJ0RpqJ1j3%OjlLJ2j6JmP
6440Cj0k0K3mK4j2koLJ5k2K1qknkpK0j0nJ7o%RQj8Jj4j2RJ3nJ0k2K6l0K1J0rm
6480bjkj5J0K2qj6J6kkj4K1nrJ2Nj7J2Qj1m%NnKjJ5J2k9J0jk1JK4j8lKJ4j3j5
6520b3K2lKoQllpK1j6RJ8k0j3L2pj1mJ3qj1J2qJ3nk0K9lk1J0J0Mj9MNLpoK1oj4
6561hQpjK0k1J3j1j0mK1j0JpOJ6J4j6%Rj6mL0k4jj0OkK6k9QkmJ9j3MoJ7j0nj1
6601a4K4j8K4lLk4K7j7j0J2r%qJ2Kk7J6J5omNonK1k0%J8Nkq%Lj3L4j7k8J4mjK2
6641A3Jk6J6nmkLj0J9%ooJ5kj2nJ0Lj5K3jj2%%%kPn%Nj5K1kjrrJ9pj2J3J3k6J1
$$ y = [-13, -21, 7, -2, -13, -4, 6, 2, -9, -9, 3, 1, 5, 28, -12, 6, -20, -1, -5, 1, -3, 18, -4, 10, -2, -1, -12, 10, 12, 3, -15, -10, -2, 8, 9, 4, 5, 14, 4, 13, -11, -6, -5, -18, 13, -7, -4, 3, -3, 6, 4, 7, 2, -14, 19, 12, 14, 13, 2, 15, 7, 20, 11, 3, 0, -1, -3, 5, 8, 6, 0, -4, 6, 15, 8, 0, 11, -2, -2, 4, 3, 0, 3, 15, -1, 0, -4, 3, -7, -27, -4, -8, 16, 4, 2, -4, -1, 14, -8, 13, 5, 3, -2, -4, -11, 9, -1, -6, 11, 5, 5, 14, 22, 4, 5, -9, -21, -12, 1, -4, 6, -16, 10, -20, 1, 11, 2, -2, -3, -5, -20, -10, 12, 4, -12, 4, 2, 0, -14, 7, 2, -7, 5, 10, -7, 5, 13, 2, -2, -2, 3, -2, 0, -1, 14, 26, -3, 7, 6, -15, -14, 10, -8, -11, -9, 5, -8, -23, -1, -4, -2, -8, 0, -3, -6, -13, 8, -8, 1, 19, -1, -14, 18, 11, 0, -4, 9, 1, -10, 2, -6, 7, 2, -18, 11, 8, -13, -3, 7, 11, -8, -4, 1, 4, -3, -9, 12, 6, -8, 0, -7, -8, 12, -9, 4, -7, -17, -21, 0, -10, -9, -16, -10, 6, 20, 4, 4, 13, -3, -7, 23, -1, -2, -12, -6, -8, 18, -11, -3, -5, -9, 10, -3, 1, -5, 12, 2, -3, -14, 10, -8, 16, 13, 16, -8, 19, 2, -8, 4, -5, -5, -13, -1, 1, -26, -10, 5, -1, -5, 0, -6, -11, 10, -10, -10, 8, 13, 11, 3, 3, 6, -7, 27, 10, -18, -4, -8, -9, 13, 14, -12, 4, -1, -5, -7, -4, -14, 5, 5, -1, -7, 8, 6, -6, -11, -1, 2, -13, 10, 9, -3, -3, -3, -3, -5, 2, -3, -3, 2, -13, 8, 6, 5, -4, -13, 6, -1, -13, 0, 13, -13, -2]
6684bj1J8j7NQQllj3KMPPn%nJ1Nj1JkjK0j9J0j9%jJ3k9K6k9J9jpmJ2LNJ9l5L1
6726A7k2oJ1KLQk7J4mKj2J5%krlj1PPN%KKMrJ0j4PJ9pnj5K7k6J2j1RlpRkJ4j3
6769bOk1J2j5PnJ4KPk5L5j0pKk2oJ9P%nLJ0jJj2J1koLJ9j6rRPj2J5j9%k3K9k0
6810b0J7j7KLojJ5j5JJ2Qj6K6pqLj2J8Oj8mM2k9oJ2Nj5j3J8qlPk0J4OjJj0L2j8
6850Aj2LJ0KklKQlpPKJj2rJK6k0OK%k3K2MjjPj4K3j6j4K4lJ4l1%Q%j5K7k1LlR
6894Bj5K0ojl%K2j5mNkj7J1Qj7K4j8jOKJj2NnJ1j3MK1j2lJ6k2JoJ6j0J6j6KjJ
6935eRk0NOJ0nJ2lk2pKR%J8j2%MMk1J0NQQj5OnOrJQj9L3l9RNoMRj9NJ1j3QJJ4
6980A0Kj6%klPlJ7j2rN%J0poKOOLj2qMQk1J8J5k1J4j2oK5krOrjjOj3QNjj6OJ4
$$ y = [-2, -13, 5, -12, -7, 1, 9, 6, 3, -10, -8, -4, 3, 10, 5, 5, 0, 11, 16, 5, 6, 4, 3, 23, 4, 14, -5, -5, -6, 7, -22, 4, -25, -6, -7, -14, -18, -6, -3, 2, 21, -14, 17, -5, -11, 0, 2, 5, 13, -14, 0, -4, -2, -14, 1, 1, -1, -10, -13, -24, -17, -10, -5, -5, -3, -1, 3, -6, 4, -10, -3, 16, 9, 4, -11, 16, -10, 2, -9, 0, -3, -10, -1, -3, 11, -2, 4, -17, -5, -20, -13, -18, -4, -2, 5, -20, 15, 5, -2, 0, -22, -28, -9, -2, -2, -7, -4, 6, 5, 6, -6, 5, 3, -3, 0, 19, 3, -6, 3, 10, -2, 13, -6, -6, -29, 0, -20, -3, -20, -18, -15, -21, -22, -7, -22, -21, -9, -1, -17, 9, 2, -6, -3, -15, 3, 9, -9, -13, 29, 0, -6, 6, 11, -4, -17, 1, -7, -10, -3, -23, -9, -3, -4, -3, -13, 19, 1, -11, -8, 2, 4, 2, -1, 1, 9, 6, -1, 6, 8, 9, -3, -12, -11, 15, -5, 1, 3, 3, -20, 2, 6, 5, 4, 11, -3, 20, 4, -10, 14, 11, 25, -6, -6, 2, 2, -13, 14, -7, -4, -7, 2, -13, 7, 1, 0, -3, -3, 19, 4, 0, 5, 3, -14, -3, 5, -12, 12, -6, -7, -1, 1, 2, -10, -5, -10, 1, -12, -8, 13, 1, -2, 14, -8, -7, -13, 3, -7, 9, -7, -5, -6, -5, 4, -16, -11, -5, 5, 0, 12, 9, -13, -20, -18, -9, -9, 9, -3, -3, 1, 5, -16, -6, -1, 7, 15, 0, 6, 1, 7, -2, -1, 7, -12, 21, -18, -9, -4, -10, -6, 3, -16, -11, 0, -13, -5, -4, 10, 12, -4, -4, -6, -9, -2, -5, 12, 0, -9, -4, -4, 6, -1, -7, -5, 1, 7, 10, -2, -10, -6, 2, -19, -1, 14, -7, 7, -5, -11, 14, 12, 3, 9, 0, -1, -2, 4, -9, -1, 4, 3, -13, -7, 7]
7025Gpk3J8%K5k5J8j8MJ9k1Pj1kJ4j6K6k9O%j2rJ8J1j1KJ6j3NJ0kJ3j2J2k0nj
7062fK3j6j2O%MpRrJ4j2j2LK0j7j8PK3kkJ0J4%nkJk2rK1lJ7j9rJ3K0k4MQjl0J3
7103gkJ0qpjJLLqNJ9jk3LMKmj6K0j3J2J6qj%J4jNKj7qPlLj1kJ4qj5K5j2Jlj2J9
7148cnj7J8rJ6j0JJ3KLRk1j5J6j2MQkjQoJ4j7MOj6J1k8K9KMNj7kJ5J3j8oj3J9
7188B%njPj6J4lRml3K1J1rNmlnJ1J0mqJ0lj0J1j3K7k3moJ6qJ9j6k%kPLK5j4ql
7231Ak2OQmpRMkkJ7j7J0rJ3nj4J8k6J7nK8k0kJ1oJ7pk9L1j4j8K8j6J5k8NRKlr
7271a6K2qLRk7J6KPKqk7J5J4kNJ2k2Qnjj2J3J3j7J2j3pJ1j5K2Mkj2j4J2NKj9J2
7310fnrQK5j1Qj0k0JJ7J0OLj0OJMk0jqK1k2LPKKrJ2j9mJ6k0J1PkMpMJ1p%qNj3
$$ y = [7, 0, -23, -5, -5, 20, -5, 13, -5, -1, 18, -3, 4, -7, -9, 5, -11, 15, -14, -8, -8, -20, -29, -11, 0, -11, -9, 7, -6, -1, 9, 7, 20, 8, 20, 0, -5, -6, 17, 1, -11, -5, -5, -1, -8, 1, -8, 6, -6, -18, -15, 5, -12, -30, -23, 0, -2, -4, 6, 20, 20, 15, 13, 14, -8, -17, 4, 1, 18, -1, -10, 3, 23, -1, 3, 11, 10, -20, -7, -9, 1, -7, -14, -15, -14, -11, -8, -16, -11, 8, 7, -16, -13, -9, -7, -11, -27, -7, -20, -8, 8, 0, -1, -1, 13, 12, 17, 19, 2, -6, 1, -2, 1, -10, -12, 2, -6, -21, 4, -8, -7, -10, -22, -3, -8, -25, -7, -16, 0, -10, -9, 4, 6, 9, 18, -3, -18, -2, -14, -10, -2, -4, -5, 3, -3, 11, -6, -2, 4, -12, -1, -29, 0, 2, 6, 11, -6, -8, 7, 20, 2, -4, -17, 2, 2, -3, -4, 3, -13, 1, -2, 7, 3, -30, -9, 2, -7, -2, -6, -9, -14, -3, 7, 3, -5, 5, 2, -8, 3, -10, 17, -6, -10, -16, 0, -8, 11, -5, -7, -7, -9, -2, 1, 26, 12, 4, 1, -21, -15, -7, -11, -18, -9, -5, -7, -9, 8, -9, 1, -8, 5, 0, -14, 4, -22, -5, -10, 18, -2, -4, 7, 1, 18, 11, -18, 13, -1, -19, 9, -7, 8, -20, -15, -6, -4, -7, -16, 6, -2, 1, 10, -17, -1, 1, 8, 10, 2, -25, -10, 4, 2, 7, 19, -3, 5, 0, -1, -13, 0, 13, -4, 8, -5, -12, -1, -16, 6, 10, 8, -4, -18, -6, -1, 1, -18, -6, -11, -20, -12, 13, 2, 10, 0, -20, -19, -2, 8, 14, 17, 7, 13, 14, 18, -2, -3, -11, 10, -12, -9, -2, 0, 2, -7, 5, -14, -18, -2, -22, -11, -4, -6, -2, -9, -5, 6, -1, -1, -9, -4, -17]
7354a7KJ3QL1k0k3qQjj6KJ9%j0LNJ5K0k6Rj6jqJ5mj3K3k3NL%j0J2%k2K3nJ6k1
7393a2J1lnJ5J0pj6mJ6j3LOj7jJoRRj2MJ8j2ROkjQj0Pj3j5J8p%J7j3J2opJLJj2
7436a0K7l1lOJj7L6jolNkjJ1lj3Rk3LLK5j3%ML%j5LRJ0k4OKJ%J1j1J4k6%Lj0J9
7479aKk3J0PKj3K2Nkj9MOj7JJ9Jj4Oj9J5%LNl%Qj8J3kmPj4nJ5J7j5mK0lj6JNr
7522gpQJ8l9K0KMQkk0J7Pk7KK9j5%llJ5oJ3Nk1mO%j1J6JqJjqJ4J4l2K3j6pK1k2
7564a5LPJ1j2qRj4K1kMLqJ3k8QQRj1J7j5pK3Jlllj0Pj2J1%Nk0Pj2J7j5LlQJ0j7
7606a3oK4j1RJnj8K0J0%NJ2k4j1LjkJ5j5%j1jK4k0K4j6J0l1J3J6lQj3J5k6J2L
7643cpQRj1%mK3Ok4J0j3j1J7k3L3okj6J8j8K2Kqk6K2rPQj1J0j2K3j6rnJ4L%J2
$$ y = [-17, -15, -2, 6, 37, 17, -6, -14, -6, -7, -23, -21, -2, -2, -12, -9, -4, 11, 31, 5, 14, -2, -3, -11, 4, 0, -13, 10, -13, -8, -5, -5, -15, -3, -3, -25, -2, -7, 9, -12, -1, -4, -9, 6, 16, 9, -7, -11, 5, -8, -5, 1, -16, -17, -16, -22, -13, -4, -16, -12, 6, -6, 3, 9, 7, 6, 14, 4, 11, -2, -17, 1, -6, -6, 11, -2, 10, 4, -3, -2, 1, 2, -10, 17, -14, -17, -11, -10, -27, 9, 8, 2, -1, 4, 2, 1, 12, 9, -4, 5, -18, -15, -12, 13, 0, 0, 4, 7, 7, -8, -5, 4, 14, -10, -4, -2, -1, -1, 10, -1, 13, -13, -13, -10, -20, -1, 1, -22, -12, -5, -3, -16, 6, 11, 9, -10, -6, 0, -17, -16, 3, 4, -10, -4, -23, -8, -8, -5, 0, -3, -3, 5, -13, 0, -2, -6, 1, -13, -18, -3, 14, -1, -5, 15, 12, -4, -3, 2, -7, -14, -6, 12, -27, -7, -5, -1, 7, 5, -15, 2, 9, -18, -16, 13, -2, -2, -5, -8, 7, 1, 14, 19, -2, -6, 0, 0, -11, 5, 6, -2, -1, -2, -10, 4, 18, -14, 9, -7, -14, 7, -15, -12, -5, 6, -6, -14, -5, -19, 2, 0, 4, 7, -1, 12, -16, -8, 0, 9, -2, 15, 0, -7, 16, 17, 14, 11, 8, -2, 5, -7, 4, 4, 9, -11, -4, -16, 1, -14, -11, -14, -6, 4, -13, -19, 5, -6, 3, 4, -1, -19, 1, 11, 11, 16, 28, 4, -7, -4, -5, -7, 8, -7, -7, -18, -19, 5, -15, 9, -7, 3, -28, -15, 1, -2, 6, -7, 8, -18, -6, -3, -10, -2, 7, -4, -4, -8, 15, 21, -3, 7, -6, -17, 0, -23, 10, 4, 2, -14, 4, -14, 8, 10, 2, -24, -2, -11, -4, 4, -7, 3, -9, 14, -2, -11, -16, -2, 1, 1, 13]
7682A3k0lNPl%j0J3mRj5OJ2jprk%J4K1j3j6kjMQk0lL7j9J1j3qL0j7kjj4J0J7O
7723B0j7KqkNjLlJ6k5Rj8L7l6RJ2%k1J2kpJ7J9k3J4j1OmOJ1j7j2J7kPJlj2j5l
7763a9J9Ok0L3j2j5Rp%J4k1L0mj0j2MQJjJk2J8JpJ4qJ4l1K0KqjQJr%OkJ1Loj0
7805bQQpJ1k9mL4k8MKj1J2J1mqQpJ1lJ0qJj9J1Jj7M0j2k3lOMOJ1j8mKpL4j1J6
7846B6Lk7jj1J2qJ7j2jJj2K0oJ9qk1K2k8K0j9kK5j3J1k2LRJ8mLj2j5J6MJ3j1n
7883Dj6LkJ2QkJnKj4J4oMmoj1J2qJRK5k9lNRLPorJ2j6LKQQj0mqPKJ1mj4lokJJ
7931a4L0k1rj1K0RnMpMj8J0j3J9J2Rl6NK3pJ0j1QQk1JlJ9j2Rj8PlJ1j0lPjk0K
7971a6lJ3NJqJ7omJ0J1j3Kj5J0j2MmRRpKqLj3J7j2Rlplj6M4j4NojjNJLlj7J3n
$$ y = [13, -7, -10, -5, 2, -1, -1, -11, 2, -2, 7, -8, -2, 10, 9, 2, -7, -9, -9, 5, 26, 13, -3, -5, -6, -2, 6, -14, -17, 20, 1, 12, -1, -9, 21, 4, 2, 1, -13, -3, 14, 20, 3, 5, -3, -5, 0, -1, 2, -1, 15, -10, -1, -19, 18, -18, -9, 3, 3, -18, -6, -8, -15, 2, 21, -2, 12, 1, 7, 3, 9, 20, 3, -9, 8, 6, 13, 14, 11, -1, -16, -19, 0, 6, -14, 19, 7, -8, 1, -6, -6, 8, -13, 17, 13, 3, -9, -5, 3, 4, 3, 4, -18, 0, 1, -6, 8, 0, 14, -17, 3, 5, -3, -4, 4, 5, -4, -4, 2, 0, 11, 14, 8, -2, 6, 14, 7, 18, -11, -15, 19, -9, -5, -3, -14, -2, 9, 5, -3, 5, -2, 9, 6, 16, 8, 9, -10, 1, 2, -15, 25, 13, -10, -13, -7, -3, 3, 14, -4, -8, -6, -13, 21, 10, 26, 29, 2, 1, -10, 2, -6, 11, -1, -2, -1, -13, 7, 1, 20, 12, -9, 13, -15, 5, -14, -16, 9, -4, 7, -15, -12, -3, 15, 11, 14, 2, -13, 3, 7, 20, 9, 4, -12, -9, -11, 1, 9, 7, 8, 3, 5, -9, 5, -1, 3, -1, -7, -18, -6, -14, -13, -4, 21, -8, -11, -6, 3, 6, 13, 7, -2, 10, -6, -3, -1, 7, 15, 5, 1, -7, 0, 2, 13, 9, -5, -8, -14, -16, -15, -14, 16, -5, -14, -25, -5, 4, -1, 3, -4, 0, -18, -8, -21, -2, 10, 19, -17, -12, 11, 4, 14, 3, 11, 19, -2, -1, -4, 15, 3, 12, -6, 1, -2, 9, -1, -4, 3, 2, -18, -16, -19, -6, -1, 0, -8, 9, 3, -1, 9, 20, 7, 9, -6, 4, -8, -4, -8, 1, 10, 3, 5, -3, 0, -13, 4, -8, 1, -2, -9, -12, -28, 16, 2, 7, 1, 0, -1, 4, 5, 8, 5, -12, 1, -4]
8015dJ3mj7PQNk5J8J7j0Rj9mnJ5l%OllomJ9rN%k0K0j3mQOJ2j1Lj2QOMmLj8OjQ
8060GjOlk3J3j7K9j1K6l4QJ2J1k0J6jj7J3k5J6Nj6J8Nj7j1J3%j5J9j1K0j8mpR
8096eJ2nJ2j7J5nj3qM0k0rKkK6j9ljj1oPJ6pOj1J0j8jQmL1k1NrJ2j7PKj7J2J1
8136EOrLP%mjj3%K4j7nJ1JJqJ3pJ0k5J8j3nJ7mMLonkjJ6ol%%k1K5j4J6j0J3j7
8179clkJ6Nj4m%j2JQmK1
$$ y = [-4, 9, 5, -12, -5, 3, 8, -17, 1, 18, 8, 17, -2, -6, -11, 4, 1, 1, 7, 4, 1, -5, -9, 10, 1, 6, 6, -14, 6, -7, -11, -3, 3, 15, 4, 7, -5, 3, 9, 13, 9, 12, -6, 0, -1, 7, 6, 12, 9, -14, -1, -18, 11, 0, 26, -8, 0, 12, 23, 3, 19, 18, 1, 14, -11, 5, 10, -6, 12, 17, 0, -11, 2, 2, -13, 6, -5, 15, -3, -7, -14, -5, 7, 2, 14, -3, 12, 7, -6, -14, 26, 6, -3, -1, -3, 23, 4, 1, 0, -11, -17, -10, 6, -1, 5, -6, 4, -14, -15, -7, -11, 20, -1, 4, -5, 7, -10, -3, -1, -18, -6, 5, 11, 2, 5, 12, 12, 8, 7, -6, -6, 18, 1, -4, 7, 8, 9, 1, 14, 7, 17, -8, 10, -3, -8, 9, 5, 9, 12, 6, 1, -1, -2, 14, 8, 5, 5, 5, -16, 9, -5, 11, 1, 14, -3, -6, -8, 8, 13, -1, -5, -5, -17, -16, -8, -12, 9]
8191I
$$ Imaginary data points
##PAGE= N=2
##DATA TABLE= (X++(I..I)), XYDATA
0@%%%%%%%%%%%%%%%%%%%%%%%%%%Qj6J6j6J6j6J6j6J9k7L2l2L3m1M8m9N6o3O5p3
46d0Q1r0J00j08J22j36J48j62J80k00K21k46K75l08L49l99M63n45O55q16J072
67F16j543K697j1092j8229J0064J9171K4695J3543l112j5635j4186k552J4379
80A8816J7428Q857o184k0358k1980q266N959J4399R458n394j7160j9727j0845
93c4997P419J7218J3403J838j1809j6814q089N669J7766J7823M413r061j5341
106a0562j1655L387J6030J6809P657p501j6059j1653l86J3278J8968R079n375
119B2017j4305j4107k450J0583J5759J0849m007j6163j5536p112N663J4577R854
132A5622k634j3807j7387q358M814J3056J3585K656j0887j4021p773M226J5177
$$ y = [0, 0, 0, 0, 0, 0, 0, 0, 0, 0, 0, 0, 0, 0, 0, 0, 0, 0, 0, 0, 0, 0, 0, 0, 0, 0, 0, 8, -8, 8, -8, 8, -8, 8, -8, 11, -16, 16, -16, 17, -24, 24, -25, 31, -32, 33, -40, 41, -49, 51, -57, 65, -71, 77, -85, 95, -105, 116, -130, 145, -163, 186, -213, 250, -295, 360, -456, 616, -927, 1770, -9322, -27551, -17487, 1684, 26379, 39922, 36810, 21175, 6989, 4437, 18816, 36244, 45101, 38917, 18559, -3421, -11687, -5728, 8671, 18129, 12735, -4425, -24152, -34997, -27578, -10360, 3043, 4881, -6928, -23742, -31831, -26162, -8396, 9427, 13840, 4779, -10562, -22217, -18830, -2800, 14009, 21666, 14165, -1894, -13547, -13933, -655, 18313, 27392, 22017, 7712, -6395, -8845, 1738, 17497, 28346, 24339, 8176, -7360, -14472, -8809, 5768, 15622, 12988, -819, -18206, -26564, -21750, -8694, 4891, 7547, -3340, -17361, -25134, -20908, -5731]
145e731J5077O159n984j4140r346K744J1873J4954P309o587j4144j2382k126J0136
159b188J3303P568l276j4222j3903l033Q139J4284J0369j512j0955j3483o177
172a5086P353J3719J0420J130j0760j4787p780L098J1892J1168J107q641j3977
185a1144j0634J991J1688J1964N137n956j2079q740L65J1375J4927P199l002j0150
199B941j0430r83R440J3044Q586k801j1609j1539n274N297J2225P769k211j0994
213C461j3597o543L801J0429J0265Q08r529j1762p103K817J1758J1351L681o007
227C830j1526p107K241R686J2381N883n264j0518q536l28Q819J0917O197k794
241A3881j1159j0064j940N959J0559P197k490r723j0855m531N370R655P535M24
$$ y = [-5731, 9346, 15505, 9521, -4619, -13965, -11221, 652, 15606, 22915, 16328, 2184, -10198, -12324, -2188, 11115, 18683, 15407, 1185, -12718, -15751, -7612, 6672, 17041, 15529, 4574, -8909, -15086, -7733, 5986, 16406, 17536, 6776, -8011, -15791, -12693, -801, 10367, 11474, 2833, -11144, -21778, -19787, -8099, 3865, 9002, 3046, -9033, -17773, -17408, -6033, 8894, 16093, 13091, 2941, -7489, -8472, 968, 14012, 22598, 19797, 8188, -3351, -8625, -3328, 8897, 16666, 14455, 3461, -10136, -16679, -12878, -2449, 7816, 8624, -905, -12667, -19770, -16953, -5195, 6156, 9837, 3830, -7696, -14803, -12562, -2876, 9505, 15388, 10124, -394, -8930, -9258, -439, 10478, 16675, 13881, 2722, -7342, -9282, -3323, 7236, 14433, 11943, 2220, -8635, -13166, -7796, 1859, 9394, 9818]
255I818q909j1146m913L661J0069R153J396o272j0167o693L234R772R563L938
269A2504n271j0020o843O56Q656J0183L908l769r363r075r60P039R245N364l210
284I044r178q622l274N304R887N866j347p603r356l623M438R072P922L14o835
299B009q216m963K844R456Q275J890n462r103n434J648P477R148L116n252q687
314a254o963l01P103Q374L953l580r265p511j169N115Q788N362k667p880p992
329i887k352N284Q263O245lp147p890k681L827Q574P276O77n505q044m378L194
345d547P415O974K242n351q642n337R28O759P171J995m060q360p082J35O023P213
361C476L810l219p750o606j223N802Q349M447j245o369p240j577N024Q026N975
$$ y = [9818, 909, -10237, -15150, -11489, -1420, 7733, 9129, 2857, -7310, -14003, -10769, -997, 8566, 12504, 7233, -2787, -9630, -8974, -318, 9865, 13773, 10004, 641, -8434, -9394, -2355, 6890, 12254, 9044, -134, -8756, -12030, -6726, 3161, 9027, 7680, 77, -9279, -12902, -8464, 608, 8530, 8844, 2009, -6207, -11170, -8326, 1130, 9405, 11295, 5833, -3270, -8704, -7056, 421, 9569, 12685, 7433, -1254, -8217, -8518, -1415, 6959, 10912, 7332, -1933, -9444, -10613, -5498, 3290, 8652, 5985, -1895, -9887, -12239, -6955, 1308, 7553, 7550, 403, -7487, -10168, -6341, 2233, 9509, 10186, 4681, -3363, -7741, -4547, 2868, 9842, 12084, 6733, -1909, -7246, -6318, 441, 7612, 9607, 5547, -2813, -9895, -9760, -3737, 3476, 7286, 4067, -3683, -10289, -11512, -5710, 2639, 7086, 5841, -528, -7768, -9345, -4321, 3705, 9680]
376I680o55o022o727l441L304P790N678K79n434p871m140J850O383O598J036m963
392C345o972n228O84O471O754K549l497p235n075L3N154P483L698k859o474o060
408g229j118M934O941M490j370o671o198j707L483P232N437n84n557o799k862
423g578L255O311N601R56n379p050l735J525O111N887J227l938o988m787J305
438g277N484O199L090k989o332m792J9N494O712L194j653o035o136j011M055O065
454D087L878j850o207o434k867L239O327M077l58m983o530k615L104O764O123
469E755R44l833n331l292K237O725N981J748l646o579m381L03M625N694J454l888
485D516o414n679j032M304N585K936k215o008m832p46L901O818M429q68m568n176
$$ y = [9680, 9025, 3003, -3724, -7165, -3861, 3929, 9607, 9886, 4452, -3419, -7559, -5709, 674, 7272, 8308, 3345, -3627, -8855, -8171, -1700, 5054, 7603, 4106, -3129, -8204, -8171, -3017, 4466, 8164, 5305, -1169, -7229, -8347, -3413, 3528, 8018, 6648, -23, -6221, -7928, -4445, 2787, 8224, 7640, 2083, -4716, -7578, -4323, 1988, 7589, 8545, 3166, -3884, -7619, -6094, 17, 5904, 7131, 3193, -3795, -8582, -7277, -1793, 4406, 7496, 4507, -1825, -6617, -6598, -1104, 5608, 8802, 7149, 1114, -5022, -6033, -1978, 4087, 7965, 6115, -92, -6526, -9393, -6154, 173, 4250, 3892, -1091, -7621, -10236, -7132, -368, 5755, 6699, 2866, -2465, -5757, -3520, 3205, 9186, 10934, 7288, 709, -3672, -3369, 1256, 6950, 8404, 4516, -1898, -7577, -8609, -4305, 1280, 4216, 2001, -4007, -8839, -9585, -5684, 1134, 5563, 4695, 127, -5049]
501e049j478L714O040M849O8n115n731k613J877N578M866K96m266o314l544J748
517e074M975N265J874l581n872l828N93N015N556K086k423n903m908q6L847N221
533B757L022j985n433n047j296L760N649L415l75m354n180j398L109N697M600
548F941J3l984n073k891K064N277M085N86l771n954l601P92M557M988J051l111
564A969n033m047L99M810N394K623j933m956l821k73L788N752K847j713m658m985
580c837j621K843M767L306j044m961m939k136J866N106M151J16l497m849k251
595f980K201M947M983J509l125m569k728R45M613M818J545k657n431m057J63L325
611d98M440K126k484n269m445r15L405M809K670j015m569m581p95K983M992L821
$$ y = [-5049, -6527, -2813, 3227, 8076, 8144, 3029, -2702, -5315, -3438, 2140, 7006, 7302, 3036, -3278, -6822, -5074, -99, 5166, 7040, 3459, -2413, -6241, -5648, -633, 4923, 7009, 4586, -1317, -6225, -6311, -2464, 2757, 5779, 3794, -1639, -6686, -7982, -4222, 1427, 4842, 4467, 113, -5067, -6465, -3356, 2341, 6941, 6954, 2970, -2103, -4994, -2930, 2347, 6432, 7018, 3247, -2707, -6308, -5516, -959, 4029, 5080, 1969, -3064, -7111, -6712, -1902, 3492, 6115, 4182, -774, -4595, -4868, -1080, 4672, 7519, 5806, 1148, -3837, -5458, -2615, 2152, 5458, 4414, -547, -5486, -7622, -5756, -650, 3501, 3617, 120, -4729, -6980, -4779, 168, 5151, 6660, 3535, -1034, -3762, -2817, 1796, 6614, 8159, 5502, 71, -3986, -3823, -498, 3942, 6068, 3584, -1685, -6130, -7045, -3640, 1169, 3839, 2824, -1745, -6326, -7121, -4138, 854, 4675]
627D675l60l743m451j893K615M992L635N64l313m869k374J491M420M272O65k888
643C438m588l417Q00M130M026J462k369m847l575j96L445M622J709j951m237m122
659e670p28L216M525K799j078m136l788j061K603N027L299m01l278m150j629K185
675b265M302L778K60l497m156k343R29L959L653O23k763m613k917O11L200L973
691B734J589k335m084l067j01L306M175K143j170l989l475k10K633M151K775q67
707D208l583l786j291K361M030K770p3l380m220j616J539L769L397K07k780m062
723b510k513J219L692L333J052k204m052k618M20L327L976J329j628l536l227
738c940k1L038L740K057j157l618l279q95K357M013K152q71l151l771j348J896
$$ y = [4675, 4315, 572, -3879, -5772, -3157, 1835, 5470, 6034, 2721, -2148, -4522, -3031, 1389, 5661, 6326, 3438, -1150, -4567, -3767, 363, 4389, 5851, 3482, -1365, -4940, -5136, -1691, 2931, 4640, 2689, -1548, -5670, -6398, -3182, 1343, 4142, 3064, -1072, -4860, -5921, -3318, 1709, 5008, 4607, 1329, -2821, -4450, -2265, 2037, 5815, 6075, 2578, -1578, -3921, -2992, 967, 4620, 5243, 2480, -2133, -5050, -4439, -1239, 2734, 4323, 1988, -2096, -5163, -5264, -1958, 2217, 4360, 3190, -799, -4274, -4484, -1851, 2300, 5075, 4208, 625, -3161, -4452, -2091, 1939, 4709, 4636, 1256, -2964, -4580, -3041, 728, 4125, 4332, 1552, -2510, -5023, -3804, -112, 3221, 4273, 2069, -1983, -4601, -4181, -854, 3122, 4451, 2823, -713, -3940, -3961, -923, 2817, 4874, 3717, 99, -3180, -4075, -1718, 2295, 4447, 3576, 425, -3346, -4694, -2798]
754b798L626K867k18l165l525j738J326L885L190L48k387l685k047J055L352L652
770C738J016k309l504k454K63L136L517J338j590l743k899n1K388L523J940j365
786B944l339l122p56K200L428K199m37l236l368r17J638L372K754j37k603l393
802b773j620J530L336K833O40k296l485j796Q62L147L214Q02j804l350k602M81
818b881K864L008J343j513l408k704l53K390L348J476j072k975l125o29K047L140
834I56K181n01k797k875j177J582L435K376n3k215l125j434J211L000K894M18
850C876k219k945j910N87K973K856P59j699l240k223K57K384L143J279j590k992
866g04k476k93K249L041J673q52l061k749m79J713L035K129o14k595k891j118
$$ y = [-2798, 828, 3695, 3477, 312, -3213, -4951, -3625, 260, 3450, 3798, 1411, -2274, -4321, -3266, 86, 3738, 4754, 2445, -1059, -3513, -3250, -114, 3403, 4741, 3151, -592, -3491, -3542, -1154, 2369, 4309, 2944, -395, -3517, -4273, -2073, 1355, 3554, 3117, -119, -3487, -4404, -2766, 606, 3360, 3223, 620, -2773, -4393, -2863, 473, 3306, 3946, 1650, -1835, -3631, -2769, 378, 3592, 4394, 2590, -760, -3362, -2881, -17, 2991, 4334, 2821, -587, -3291, -3644, -1254, 2094, 3570, 2498, -477, -3602, -4231, -2184, 956, 3137, 2636, -161, -3036, -4213, -2631, 804, 3180, 3127, 912, -2213, -3647, -2436, 564, 3458, 3876, 1657, -1288, -3198, -2611, 362, 3218, 3977, 2278, -962, -3185, -2928, -544, 2599, 3878, 2288, -704, -3180, -3473, -1224, 1817, 3490, 2638, -423, -3172, -3651, -1938, 1097, 3226, 2612, 17, -2874, -3992]
882c992J561K873K277K13k390l007j184J031K879K707N02j752k868j848R00K695
898E97K649J026j596l019k058Q7K314K796R65j285k942k749k53K029K639J514
914B714r80k776k558o97J769L090J807l56k244k708q30J600K902K393L4k045k517
931a402j406J063K906K348L42j721k799j675N42K306K639O81j732k677k116l2
947b733K177K506J029j241k854k254k63J684K766J513r59k450k343n43J754K730
963E19J960j15k307k382o31J345K797K314O7j861k567j341J064K393K171N35j874
980B087k817j669L22K118K291O14j388k731k160J43J901K334J262j044k495k074
996c306l39J830K673J462m48k142k413m75J640K584J935j80k021k295j066J234
$$ y = [-3992, -2431, 442, 2719, 2932, 542, -2465, -3649, -2618, 261, 2968, 3470, 1718, -1150, -2998, -2098, 597, 3246, 4272, 2676, -343, -2401, -2314, 0, 2796, 3761, 2476, -466, -3215, -3468, -1439, 1200, 2714, 1734, -1042, -3600, -4297, -2528, 562, 2369, 2013, -231, -2939, -3769, -2169, 733, 3126, 3160, 1115, -1402, -2808, -1745, 1161, 3509, 3851, 2130, -669, -2344, -1802, 504, 3143, 3824, 2092, -585, -2701, -2733, -556, 1950, 2979, 1738, -1116, -3370, -3633, -1949, 817, 2330, 1371, -1079, -3422, -3965, -2211, 519, 2479, 2364, 57, -2325, -2956, -1611, 1186, 3500, 3567, 1706, -861, -2202, -1138, 1255, 3426, 3961, 2087, -730, -2399, -2077, 41, 2332, 2946, 1558, -1173, -3333, -3190, -1289, 1045, 2307, 1263, -1232, -3306, -3645, -1815, 858, 2320, 1872, -270, -2683, -3158, -1518, 1066, 3001, 2821, 800, -1495, -2561, -1327]
1012a327K699J953R3j737k650j342P55K261K241L11j731k510j831K33K197K208
1028A823P17j280k567j900k0J774K582J206r93k186k022l55J771K488J584l79
1044B243k176k093n78J261K552J876k39j894k299j049J087K260J971K82j888k478
1060a162j257N51K173K144L57j460k509j727L83J900K115R51j251k439j743p1
1076c045J819K323J110o37k105k090j89J590K320J576l42j953k002p28J264K372
1092A283J574M3j701k360j049Q86K050J873J37j592k229j521M34K086J867N04
1108B285j253k334j559K06J753K240Q73j014j966j796j57J775K215J233n70k011
1124h0j809m48J253K321J486l72j749k015q48J042K028J670R1j725k072j034N54
$$ y = [-1327, 1372, 3325, 3418, 1681, -969, -2311, -1556, 705, 2946, 3257, 1526, -984, -2815, -2582, -385, 1823, 2540, 1260, -1307, -3207, -3227, -1453, 1129, 2335, 1342, -844, -2866, -3221, -1450, 1038, 2622, 2243, 67, -2026, -2604, -1343, 1209, 3085, 2846, 952, -1347, -2396, -1309, 951, 2922, 3204, 1316, -1162, -2419, -1868, 305, 2449, 2806, 1346, -1163, -2890, -2507, -607, 1508, 2459, 1208, -1231, -2974, -3045, -1226, 1097, 2207, 1570, -535, -2625, -2814, -1224, 1096, 2672, 2330, 377, -1625, -2353, -1089, 1283, 2857, 2900, 1199, -1161, -2210, -1324, 726, 2599, 2736, 1144, -1085, -2606, -2172, -86, 1781, 2285, 1032, -1302, -2861, -2655, -902, 1338, 2211, 1197, -769, -2565, -2722, -947, 1268, 2501, 1931, -80, -1889, -2337, -1084, 1237, 2723, 2351, 602, -1413, -2261, -1219, 809, 2479, 2570, 845, -1227, -2261, -1707]
1141a707J975J861K74j337k171j405M34J678J914P70j207k129j507MJ651K091
1157A189R29p09j964j778m3J438K077J413m71j847j768n38J236K087J387j17j680
1174H41k153q05Q41J845J617M4j549k032j265N85J872J633M66j111k089j290L35
1191b215J685J987P12r01j750j579j9J656J915R83o36j881j649l33J220K031J136
1208B362n18j634j853o52J107J901J365j03j631j785p84O44J926J591Q9j293j895
1225a163j083N40J635J709N30j217j807j212J08J557J792P03p66j794j466K9J255
1242f50J797J103o24j686j518m08J146J786J116k31j555j788m91Q39J676J411
1258A923o6j417j702q75O99J702J368L06j158j837r88M20J516J625M47r44j665
$$ y = [-1707, 268, 2129, 2403, 1066, -1105, -2510, -2076, -398, 1516, 2286, 1079, -1050, -2557, -2553, -902, 1189, 2118, 1409, -555, -2333, -2376, -938, 1139, 2552, 2081, 234, -1534, -2072, -836, 1251, 2638, 2521, 841, -1312, -2117, -1276, 569, 2186, 2230, 681, -1351, -2616, -2031, -159, 1474, 1940, 829, -1260, -2550, -2215, -530, 1457, 2169, 1268, -482, -2061, -2080, -424, 1491, 2474, 1838, -43, -1692, -2025, -805, 1226, 2362, 1844, 210, -1643, -2295, -1188, 713, 2078, 1975, 344, -1441, -2225, -1581, 345, 1936, 2025, 732, -1163, -2246, -1706, -71, 1638, 2168, 951, -856, -2068, -1960, -403, 1389, 2092, 1326, -468, -1934, -1905, -650, 1147, 2250, 1626, -60, -1578, -1986, -840, 946, 2062, 1831, 276, -1512, -2003, -1164, 512, 1923, 1857, 440, -1262, -2137, -1438, 264, 1632, 1938, 780, -1057, -2045, -1625, -109, 1516, 1963, 1019, -646]
1275f46j319J59J442J556P50o31j702j359j44J170J759R18m53j389j564m36J091
1292g98J625J159j86j395j534o62O50J688J256n6j184j692r29N54J455J459K70
1309A680j153j591r81K38J504J584M90p72j583j131J44J248J629Q39o70j514j254
1326a293k56J102J559Q76l63j499j496l92P74J476J168k14j309j525o56O64J515
1343A31J216J79j108j574p37M70J417J430L26r11j451j043L12J369J376N79o91
1360A290j558j107J1J140J507O14n83j401j388k55J032J372Q30l51j392j360m26
1377b025P49J524J001q6j017j405n96P19J473J265K14r89j293p75L52J381J238
1394A730K51q10j517j060J19J076J271M48q05j409j105j44J068J442O86m11j293
$$ y = [-646, -1965, -1806, -364, 1192, 1942, 1311, -391, -1750, -1894, -724, 1035, 1953, 1500, 111, -1453, -1889, -798, 827, 1986, 1800, 405, -1129, -1791, -1141, 547, 1803, 1747, 563, -1129, -2058, -1504, -49, 1410, 1680, 527, -1064, -2045, -1807, -303, 1281, 1771, 999, -584, -1715, -1571, -323, 1306, 2145, 1475, -39, -1293, -1549, -447, 1112, 1988, 1625, 126, -1370, -1762, -988, 488, 1656, 1442, 133, -1392, -2048, -1384, 131, 1347, 1526, 418, -1156, -1893, -1423, -6, 1424, 1750, 839, -612, -1655, -1343, 26, 1402, 1981, 1290, -268, -1375, -1364, -224, 1283, 1897, 1314, -87, -1475, -1730, -698, 674, 1504, 1153, -239, -1599, -2025, -1276, 248, 1249, 1163, 146, -1259, -1855, -1136, 337, 1602, 1816, 827, -466, -1241, -889, 492, 1730, 1981, 1171, -346, -1406, -1287, -211, 1060, 1508, 703, -706, -1811, -1955, -887, 555, 1241, 830, -463]
1411d63j121r0R00J506R99k63j154j190m34P47J357R63l3j181j395o09M32J215
1429A86J164O5r34j374q46M09J178J208M42p50j351q68R9J097J350M95n73j271
1447b74j144p1R93J204P44l76j270j123k53Q46J397Q23j67j048j245m12P35J256
1465F15R90k6j065j267o85M10J249R91N4q30j362q14K91J126J214L56p07j128
1483e88q48J05J142J274N47m30j193r91p9Q46J231O66m51j179j149l93O79J187
1501C76P59j84j128j160l85N49J247J062L7q64j106n49N28J213J059K70p92j243
1519c11o68J56R73J073L00o94j278r59K2Q81J041N79m86j183r08j35Q26J229P32
1538A190j75r62j073k27P35J166Q53n4r63j111n07M67J131Q36K5q30j240o68L47
$$ y = [-463, -1584, -1674, -774, 732, 1731, 1468, 314, -876, -1310, -563, 794, 1757, 1724, 543, -852, -1461, -1029, 186, 1350, 1415, 481, -893, -1739, -1330, -152, 1056, 1498, 748, -603, -1471, -1372, -275, 1075, 1570, 997, -274, -1418, -1489, -496, 708, 1452, 1076, -194, -1317, -1570, -724, 673, 1496, 1329, 281, -964, -1376, -641, 615, 1605, 1579, 514, -753, -1438, -1028, 221, 1212, 1266, 436, -926, -1740, -1449, -323, 891, 1247, 540, -588, -1436, -1331, -189, 1085, 1632, 1202, 9, -982, -1061, -215, 1016, 1682, 1231, 52, -1097, -1490, -811, 376, 1135, 951, -177, -1337, -1722, -1173, 74, 1136, 1173, 309, -797, -1346, -818, 395, 1454, 1724, 932, -311, -979, -823, 150, 1223, 1523, 829, -449, -1408, -1386, -505, 536, 1115, 629, -554, -1462, -1597, -771, 458, 1190, 1015, 53, -1020, -1247, -512, 654, 1507, 1453, 490, -621, -1128, -661, 470, 1306, 1331, 501, -739, -1407, -1060]
1557a060J012R85K24p25j102q09J87J050J061L97m73j117q77N6Q24J163N62m29
1575I29j008r60k27P58J149O54j93j013j010l16N43J127Q69r7q48j082n16M59
1593g82J047Q91J43q23j132n95J98R56J022K07o66j096p64J66Q83J020M89n17
1611F47j066p59QQ09J141N70k85r82r46j17P00J025P14k03r82r99l99M67J049
1630C92O98m0q24j126n11L81R09Q95J57p12r75o46K52J003R31L31m72j023o84
1649a064J33Q37J036M45m48r15q71j02P96R57M91l03r45r32k26N51J015O22k00
1668H77q32r49m02N15R61P39M4q00r37m51K70R34Q90J19o12r25o29K16Q50R05
1688G83L82n07r24o48K4P95R62M58l42q81q00r6O23Q85N70k68r59q72l21M67R08
$$ y = [-1060, -48, 937, 1161, 436, -666, -1475, -1288, -238, 823, 1220, 747, -370, -1247, -1191, -367, 796, 1358, 929, -79, -1039, -1266, -508, 641, 1295, 1102, 89, -921, -1237, -694, 433, 1302, 1205, 357, -725, -1241, -782, 265, 1156, 1299, 476, -656, -1251, -1053, -97, 925, 1132, 466, -630, -1394, -1228, -345, 675, 1164, 647, -419, -1178, -1170, -361, 780, 1350, 1065, 83, -863, -980, -280, 745, 1459, 1256, 274, -725, -1124, -657, 392, 1090, 1050, 226, -900, -1411, -1030, -121, 774, 931, 219, -756, -1402, -1150, -147, 784, 1115, 643, -380, -1064, -931, -94, 942, 1387, 939, 24, -847, -949, -153, 804, 1295, 992, 47, -885, -1111, -560, 455, 1077, 877, 45, -904, -1306, -791, 170, 909, 953, 153, -784, -1235, -965, -31, 859, 978, 366, -559, -1188, -972, -122, 783, 1165, 658, -266, -914, -890, -95, 867, 1325, 983, 102, -698, -794, -171, 714, 1284, 1016, 57, -815, -1136, -669, 239]
1709B39N52j10q12r68l40M25Q76P80J17o60q31m53L65R51Q22K90m85r11n75J95
1729e33P59Q37L02m62r20p81q3O66P81L72k93r33p82j65N35R23N69j90p19q00
1749i17k43N70R09O56j1p03q03l66L43Q76P31po28q69n16K27P85P46J98n73q69
1770d64n28N0P44Q41L04l97q21o42jO49Q43M79l09p82o61j77N09Q85N11j39p55
1791A39p79k48L81P68O46p7o93q03m08K97P64O36J24n87q44m09K21P23P86K37
1811H74m31p42n31J24P42P70L85l12p95o18k2N39P41L69k77p40p85k17M61O97
1831B32M42j25p14p37k92L53Q04N80Rn01p22l76L34P70O92K01n07p11m11J14P54
1852A89O95J99l72p28n79M2O01P04L18l96p36o44j24N04P14L31k43p30p05j64
$$ y = [239, 791, 681, -131, -1099, -1439, -1014, -138, 642, 759, 99, -732, -1185, -820, 131, 953, 1243, 758, -153, -728, -533, 226, 1063, 1365, 903, -17, -798, -881, -215, 566, 938, 645, -288, -1070, -1235, -700, 223, 792, 602, -117, -917, -1160, -590, 319, 975, 964, 261, -542, -908, -565, 311, 1042, 1035, 407, -462, -978, -751, 34, 780, 978, 405, -464, -992, -942, -198, 643, 947, 550, -271, -913, -914, -265, 578, 1057, 748, -34, -695, -872, -363, 522, 1033, 894, 139, -640, -888, -507, 261, 907, 830, 137, -666, -1074, -777, -13, 623, 747, 160, -684, -1093, -872, -149, 637, 874, 443, -299, -830, -706, 36, 806, 1191, 879, 84, -534, -556, -17, 724, 1093, 816, 76, -709, -926, -465, 232, 674, 549, -165, -902, -1194, -841, -37, 543, 552, 51, -671, -1047, -713, 57, 749, 950, 443, -268, -679, -565, 189, 884, 1083, 711, -17, -596, -554, 47, 751, 1069, 673, -63, -707, -831, -327, 387, 718, 475, -255, -960, -1124]
1872a124L80P27N20j25o19o25k46M11P88O14J43m91o74k41K71P13O96J22m81p15
1892D4n04R8N66N81J41m54q34n93oM69O57K62k78o77n99k0N78P53M92j16n80n47
1914e67p6M68P70M82q1n37p09k98L12O27M71oo10p19l99J17O42N88N3l86o71m57
1936i86J58O37O50K94l34o27m62pN93O86K72k30o36n84q1M25O51M17k41o04n78
1957e87k21L93O94M17n1n62o17k35K63O49N52rn13n96l86J87O08N41J78m27o72
1978c94l74J01N35O79K47l28n85m79ON26O16L52k10o37n50j26L95O14L34j60n77
1999a5o41k19L42N75M54j2n34o00k41K85O79N39N8l69o00l47K65N70N73J53m13
2020E02n82m55N4N17N86J33l23o14n44j3M43N93K80k22n67m97j39M49O59L61p7
$$ y = [-1124, -744, -17, 503, 378, -241, -866, -1112, -701, 87, 701, 844, 353, -321, -562, -291, 422, 1118, 1240, 759, 44, -460, -362, 204, 785, 926, 472, -362, -955, -961, -492, 165, 427, 149, -528, -1127, -1147, -569, 184, 676, 560, -20, -567, -643, -175, 595, 1077, 996, 459, -250, -548, -236, 391, 862, 856, 246, -473, -872, -755, -113, 475, 528, 142, -529, -986, -828, -191, 459, 753, 419, -208, -670, -677, -84, 602, 874, 644, 8, -576, -657, -232, 419, 836, 595, -9, -587, -808, -415, 279, 696, 645, 83, -534, -769, -506, 143, 695, 686, 173, -423, -809, -622, -14, 527, 705, 278, -394, -768, -667, -132, 547, 794, 466, -119, -598, -592, -66, 550, 902, 692, 55, -495, -621, -226, 388, 722, 562, -15, -656, -875, -533, 42, 496, 484, -50, -650, -891, -606, 73, 612, 670, 301, -299, -646, -381, 189, 762, 915, 502, -80, -535, -481, 36, 622, 755, 432, -182, -726, -739, -296, 297, 577, 355, -212, -709, -848, -399, 260, 621, 544]
2041E44n18n61j49L10O28N05n3n03n51k86K53N70N01M8m64o03l20J26N12N73Q5
2062F47l62n86m34R2M92N55K41k73o06m12j1M19O21L06j96m96n33p1L66N54M10
2083G23p8n45n23k10K55N66M21j7m38o07l00K51N09M93J08m03n40l47J09N67M98
2104D92J62k72n78m19P2M58N35K29k92n08m55p2M38N54K79j34n03m91j10L54N66
2125C05L97r1m58n04k42K60N44L83J4m51n78l00J35M97M67P1l60n22l58J38M96
2146a57N32K40k54n09l25N3M42N74K51k03n11m72n7L33M75K99k08n63n06j55K62
2167d59M95L30p9m07n28j69K83M96M84R8l89m56k29J75N09M46J39l13n32l64P9
2188c91M01M83J69l11n12m17pM09M81K07j53m92m21n3L23N46K97j33m42m33j66
$$ y = [544, 26, -535, -684, -374, 254, 759, 706, 203, -348, -634, -381, 189, 690, 738, 274, -329, -649, -523, -11, 562, 647, 285, -301, -735, -643, -151, 404, 645, 372, -234, -646, -657, -238, 383, 689, 493, -3, -536, -607, -241, 313, 723, 645, 100, -423, -633, -378, 188, 609, 592, 154, -453, -753, -502, 7, 500, 608, 205, -335, -682, -573, -6, 492, 654, 382, -196, -615, -543, -85, 450, 679, 387, -121, -576, -648, -210, 344, 623, 489, -14, -505, -615, -261, 305, 702, 611, 153, -351, -593, -333, 211, 594, 608, 157, -421, -721, -586, -89, 378, 449, 89, -433, -791, -653, -157, 375, 615, 361, -148, -473, -420, 22, 596, 847, 644, 133, -339, -396, -63, 412, 711, 503, -60, -566, -721, -459, 36, 366, 287, -120, -648, -817, -534, -38, 446, 544, 155, -301, -530, -355, 154, 600, 739, 426, -106, -470, -391, 10, 493, 662, 351, -161, -578, -585, -176, 305, 512, 359, -133, -554, -607, -284, 262, 559, 426, -16, -449, -615]
2209f15L27M89L26k6m13m70j96J84M98M20nl22m65k74J43M73M07J35l11m83l31
2230e09L1M01M80J11k24m80m08JL36M58K53j41m27l94o7L14N33L12p0l85m01j16
2252c92K53M61L49Kl97m64k47J51M28L14Ml45n06k89J02L49M01J13k88m16k92
2273g09L8M44M42K12j15m16k91N0L44M62K80j10l73l88q2K56L85K55o3m35m58
2294b72k09J45L98K79o6l56m46k51J55M01L52Q5k74l84j95J05M40M33J50j90l65
2315f5k87P4L66L99K07j90l89l18q4K59M24J97j58l78m08j11K17L75K86q6l74
2336d4l64j69J75M08K98K8l17m01j76J47L56L47R9k80l72k15R7L69L57J41j89
2357B95l90k46N3L10L82J75j90l48l13p0K87L62J70p7m14l53q5K01L68K36n9l09
$$ y = [-615, -288, 201, 527, 501, 88, -382, -578, -394, 104, 524, 519, 197, -268, -542, -399, 74, 481, 616, 305, -178, -509, -478, -77, 403, 514, 290, -190, -598, -597, -261, 197, 450, 309, -118, -512, -579, -265, 268, 580, 510, 125, -276, -392, -139, 322, 671, 673, 276, -188, -435, -284, 144, 458, 462, 117, -389, -678, -576, -227, 174, 287, -1, -417, -709, -671, -227, 215, 427, 312, -104, -395, -345, -1, 461, 741, 631, 258, -130, -212, 44, 429, 684, 621, 186, -272, -481, -336, 62, 341, 275, -81, -527, -778, -623, -222, 130, 215, -59, -443, -638, -533, -93, 340, 490, 300, -65, -352, -278, 88, 487, 694, 504, 115, -203, -287, -28, 396, 593, 435, 57, -351, -462, -245, 130, 416, 330, -44, -408, -577, -402, 6, 304, 332, 15, -386, -562, -415, -59, 288, 387, 107, -265, -480, -383, -14, 343, 484, 295, -95, -341, -288, 22, 404, 579, 389, 41, -272, -342, -55, 307, 477, 400, -14, -367, -452, -251, 117, 353, 294, -15]
2379a5l61j58K20L53K66M1k71l40j78R3L57L20N5k38l35k51O7L27L05J53k35l34
2401a59k33jL02L71J40r6l17k81j3K61L48K15r8l39k75j10J83L39J84p8l00l74
2423c31j58J39K81K77k6k73k99k18J34L45L03J09k04l23j43R3L07L73J30j61l08
2444D7k30KK80K82J53j35l55k78l7J75L16J55j00l02l41j08K02L04K11l9k74l11
2466c83j06J39L05K65J2k05l07j65J44L00L05R5k00k81j79N1L09L02R0j50k98
2487D3k68J1K19K81J38j75k92k83r0K19K88J45q2k85l13m4J71L11K49l2k32k33
2509b54j16J43L24K64L9k04l06j15O6K73K66N1k17k76k22K3K69K28J16j78k92
2530a18k35oK07K94J42j28k76k74j3K13K73J93n6k72k57m9J67L15K25k2k27k61
$$ y = [-15, -376, -534, -314, 39, 305, 346, 75, -265, -443, -350, 7, 327, 382, 144, -191, -442, -375, -48, 257, 410, 175, -159, -392, -393, -91, 280, 420, 324, 7, -274, -287, -26, 322, 537, 439, 100, -175, -285, -102, 237, 421, 343, 43, -331, -489, -350, -69, 208, 182, -91, -390, -608, -474, -129, 174, 283, 79, -244, -387, -294, 13, 386, 516, 355, 47, -183, -181, 99, 381, 534, 399, 44, -234, -271, -96, 220, 375, 275, -27, -368, -476, -274, 30, 241, 202, -72, -383, -489, -350, -45, 220, 232, 27, -280, -445, -301, -1, 304, 399, 199, -82, -261, -210, 99, 401, 491, 341, 43, -225, -214, 5, 286, 424, 249, -43, -326, -416, -197, 91, 236, 154, -131, -444, -488, -317, -6, 243, 211, -21, -254, -370, -227, 97, 361, 400, 196, -110, -225, -159, 114, 380, 431, 214, -62, -284, -261, 8, 236, 352, 174, -118, -353, -359, -152, 142, 284, 156, -120, -394, -407, -194, 79, 272, 216, -56, -313, -362, -195, 120, 345, 323, 96, -165]
2552a65r9J62K87K23J8j88k89j70O7K48K37kj83l00k23L7K11K31J01j59k81k10
2574d47K6K34K93J54o2k52k38KK21L11J85o0k48k32j08J53K88J74m4k39k87j23
2596b99R1K63K22Nk10k71j63J03K49K25P0j59k77j68K9K27K67J03j73k43k39Q
2618c40K29K73J21q9k73j88k9J81K82J77n1j96k44q3J71K35K09j9k19k86j43J04
2640a78K46J99J4k01k85j58R0K01K51O9j76k59j71L4K46K65P8j04k41k07K1J80
2662h6K44J56j12k16k16o1J74K60J38k4k19k33p1J48K42K05k2j88k23j25J10K14
2684I5J97L6j81k93j51M2J93K16M8j51k39k04K1K02K20J26q6k11k07L0J71K87
2706A61J54n2j97k10k9J54K36J82j8k48k19r1Q1K17J58oj97k59j52Q1J90K19K9
$$ y = [-165, -264, -102, 185, 408, 426, 238, -51, -221, -154, 94, 331, 329, 146, -154, -377, -340, -129, 102, 203, 44, -237, -447, -421, -187, 106, 260, 198, -54, -292, -290, -69, 242, 427, 367, 119, -113, -221, -68, 220, 394, 350, 111, -176, -299, -208, 55, 277, 282, 72, -199, -362, -259, -10, 215, 285, 126, -151, -319, -290, -63, 204, 307, 134, -109, -348, -340, -111, 162, 283, 194, -79, -267, -296, -115, 167, 344, 293, 97, -147, -230, -59, 176, 385, 366, 147, -139, -282, -178, 68, 267, 281, 80, -205, -363, -273, -72, 179, 248, 72, -187, -358, -324, -78, 187, 265, 161, -80, -287, -266, -86, 158, 314, 202, -14, -230, -291, -117, 143, 281, 257, 38, -195, -266, -118, 124, 329, 307, 119, -104, -229, -119, 95, 292, 328, 147, -146, -297, -255, -62, 154, 202, 51, -188, -392, -371, -169, 51, 177, 91, -120, -327, -297, -126, 161, 315, 263, 66, -144, -173, -19, 217, 399, 381, 133, -86, -177, -96, 121, 279, 273, 76, -183, -335, -254, -64, 155, 184]
2729A84j77k01j55N3J95K51O6j11k07j94M3J70K46J26j10k10j84j7J54K45J27
2750B94n3k01k04m6J21K36J69o5j75k11r9J05K12J45J2j84k35j19O9J85J96L9
2772A91j51j94j47J7K22J90J18j07k11j34J5J60K25J02n7j96j89m2J37K09R9n0
2794B07k29j77o6R7K07J67l6j47k01r7J05K02J67L3j54j91r5O3K01J63M1j09k14
2817f3j58O6J53J68P9j13k01j55j3J48J82Q2l2j92j69l9J26J93J48m0j62j70o3
2840b25J23J61J45M1j93j71q1O8K04J36J8j36j63j22M3J77J42N8j04k06r9J7J32
2863c5J98L3o3j76j76LJ19J42J06l7j76j48l2J03K04J08j6j35j65l4J04J33J63
2886B23K6j61j50r0O5J59J43J3j38j76j07L8J36J41O2j22j56j08J7J29J64M8p1
$$ y = [184, 7, -194, -349, -296, -101, 150, 216, 105, -102, -296, -253, -83, 163, 289, 179, -31, -215, -232, -78, 167, 294, 241, 40, -164, -210, -89, 147, 316, 251, 76, -135, -234, -129, 83, 228, 240, 56, -179, -298, -229, -44, 152, 191, 40, -154, -301, -284, -62, 128, 246, 139, -72, -206, -191, -31, 194, 296, 239, 43, -146, -188, -51, 158, 257, 207, -22, -199, -265, -168, 39, 206, 170, 23, -178, -275, -170, 32, 199, 232, 78, -113, -208, -145, 56, 219, 260, 151, -63, -221, -155, -2, 166, 245, 132, -69, -224, -237, -89, 93, 175, 143, -49, -218, -257, -131, 62, 210, 170, 8, -162, -225, -102, 59, 204, 245, 52, -119, -200, -132, 72, 208, 226, 90, -73, -195, -152, 25, 167, 225, 121, -85, -184, -167, -35, 163, 196, 133, -43, -219, -216, -97, 45, 151, 114, -62, -210, -242, -139, 65, 173, 157, 22, -143, -177, -73, 60, 223, 249, 88, -62, -152, -87, 72, 215, 228, 90, -86, -193, -155, -19, 122, 184, 62, -94, -202, -185, -56, 108, 156, 85]
2909H5j39j35NJ37J41J00m4j40j51l0J03J51Q7k8j24j59n2Q6J59J25k8r1j65p4
2933a81P1J38J47L3j34j28r6M2J18J33K6o4j32j45MJ41J21P4p4j50j21j2J06J57
2957G4P5l5j20j20k5O3J51J09j8j40j28o2P8J39J00J7j19j43o0N5J36J48J0r9
2981H6j19r6M4J08J40L7r0j42r5lJ11J06L3l8j41j16k6J06J16Q6k6j21j20j0Q3
3006h7J30R5nj13q5o4Q7J14J09jj08j31n2L5R9J11Lr0j29q9L1R7J33K7p8j09q8
3033a58j5J20J56K9m0j30q6j9J19J17Q2m4j25j03l7M9J27J05m6p5j52l8M9J14
3057aJ11J0j10j09m2L6J20J14K1p3j21o8K3J16J02M3q5j18q6j1J01J13O3o2j17
3082c0r4j0P8J19O0m1j01r4l9R1R9P6j6j03j21k1M8J15Q0Jo8j08p4O6J16J00L7
$$ y = [85, -54, -189, -184, -47, 94, 194, 150, 10, -141, -171, -68, 83, 170, 142, 18, -141, -193, -107, 52, 177, 149, 58, -107, -181, -110, 28, 175, 208, 74, -54, -150, -108, 10, 143, 169, 105, -27, -172, -168, -27, 94, 168, 94, -56, -177, -189, -83, 74, 149, 114, -6, -126, -151, -88, 63, 172, 154, 14, -114, -176, -98, 41, 141, 158, 39, -104, -164, -109, 27, 175, 185, 86, -33, -129, -85, 23, 163, 200, 110, -32, -127, -130, -19, 87, 120, 82, -59, -175, -201, -95, 21, 107, 81, -40, -160, -170, -87, 43, 138, 133, 20, -65, -129, -42, 72, 181, 180, 72, -59, -111, -76, 23, 134, 137, 47, -82, -171, -140, -43, 90, 117, 39, -70, -158, -173, -53, 103, 132, 92, -38, -124, -143, -24, 93, 175, 131, 6, -97, -134, -85, 42, 147, 101, 26, -126, -164, -115, -1, 110, 120, 10, -99, -141, -105, 15, 129, 150, 77, -44, -112, -89, 27, 129, 172, 87, -31, -117, -128, -27, 86, 149, 87, -30, -124, -134, -56, 63, 123, 82, -19, -113, -152, -61, 38, 114, 98, -5, -126, -147, -99, 16, 96, 97, 29, -79, -153, -87, 29, 129, 166]
3109A66p0j20n2J7J19R0L4o0j18j02j2J07N9O6o5j08r7m4P6J18N7k7p2q1m1Q3
3135g7J14R1Lj03p1l5L3J29P6Oo8j21n1MQ3R8K6q8j03p9QJ12Q9L5m9j18p8J9Q0
3164c5J20N2m4p7j12l6R5P1O6pj10r2k5L5J13R9rn5j37l2M5J07P7K6o7r4o1J6
3192g1R4R2J9n3j14p5QR8M7O3m7j05q1J2M0J17N5m4o9q5k8O2R6O9j5q8p2l5M6
3221f4J00O3Qp3r2n5M6Q9O5L5o2o9o5J3Q3O5N5m1j25n2oN1Q3M8n6q8q6pN5P6N8
3252E2J3r2r1J9M3Q6O4Jn5o3q5P1P9O9K5o1r7n2MP7P6J5n9p2p9OQ3O0N2l9q2p5
3284a07J1N0Q6N6k9q2p3LM1O7R5l8p5p8l4N4P0M8K0m3r2l4K6P5Q0Nn2q3l7j6Q9
3315CO4J1m5o8l9k9L6J21L4m9n0n9kL9Q4L6j4n5o2k6M9Q6L7k1n4p9k3K6N1P0K3
$$ y = [166, 96, -24, -76, -59, 60, 150, 184, 124, 6, -96, -108, -1, 58, 124, 59, -49, -146, -190, -114, 4, 61, 34, -38, -119, -160, -77, 37, 128, 131, 28, -43, -78, -45, 84, 160, 166, 98, -23, -74, -70, 13, 111, 137, 49, -54, -133, -125, -13, 76, 111, 62, -56, -134, -115, -35, 85, 137, 93, 16, -96, -132, -37, 34, 100, 93, -17, -109, -134, -99, 14, 113, 104, 49, -88, -120, -75, 32, 109, 135, 68, -26, -87, -71, 23, 115, 134, 81, -33, -108, -100, -2, 45, 108, 61, -44, -125, -113, -73, 44, 99, 55, -14, -99, -127, -65, 31, 100, 85, -3, -75, -110, -64, 36, 99, 107, 34, -58, -113, -67, 22, 87, 122, 60, -9, -74, -61, 22, 87, 142, 101, -24, -76, -82, -31, 52, 100, 44, -44, -130, -137, -82, -6, 52, 65, -27, -118, -99, -56, 30, 94, 95, 40, -23, -108, -37, 42, 111, 136, 75, -22, -74, -70, 7, 83, 98, 39, -33, -112, -106, -23, 37, 89, 50, -32, -107, -96, -46, 40, 96, 67, -15, -88, -85, -44, 23, 118, 80, 5, -73, -107, -53, 17, 65, 85, 42, -50, -84, -58, 17, 97, 102, 50, -33, -70, -86, 3, 67, 78, 33, -35, -74, -103, -67, 54, 88, 39, -11, -70, -72, -33, 51, 87, 73, 18, -44, -70, -21, 65, 102, 81, 27, -52, -75, -49, 2, 72, 95]
3346I5q8m7n2LQ7N5Mk0r2l2J7N3P7K8j4r9m4k6O7P5K2mo9o9j2M1N2O8l4l0n7l5
3378h0M3O0N6Rn8o7k9J5P6M8Jl9p0m0RL9N0L6j5r0k9j5N7P9J7j6n9m3j1O2K9O8
3410I3k0o0m2k7L1P6K2jl7p7k8J8M2M3K9n9m5m9jP1O0Km6k6l8K4L9O0L9m4n5m2
3442d8J6QP9L4k1o3m4j6L3K4N8j9o9k3j8M4L7L2J0k9q0lK3K6M8J7k9n1m3L0M3
3473FL4J0j9m7l7RM5L0K4k4m9m0oM0M4L3j0n8k8j1K5N7K3Nn2m3k3J2N8M1mo3l0
3506d8nJ0L8M4j2j7l1l8K9L1M0J0j7m7j7j5M5J8M8l1k6m8J9qM3L7j6l4n1NL1M6
3538C3L0ql6m2j1%L3M3Om5m9j9K9J6K9K1m1m5j0K0M4K1K6nl2k5K2K7K7L0j3n0
3570B6j5l3K4K8J7j8m0m5j8J6K4L7qm4k3KkN3K2J0J0l3k6L3J6N7kl3l9oJ1K9J8
$$ y = [95, 7, -40, -92, -89, -2, 53, 57, 37, -55, -87, -70, -17, 60, 88, 74, -25, -69, -95, -28, 47, 69, 65, -4, -73, -85, -44, 8, 76, 42, 12, -45, -80, -37, 23, 79, 88, 30, -37, -66, -51, 25, 73, 74, 35, -35, -75, -66, -27, 23, 59, 44, -46, -75, -90, -33, 46, 63, 47, -12, -55, -66, -4, 25, 93, 73, 13, -29, -56, -25, 51, 73, 72, 35, -42, -70, -52, -10, 33, 62, 3, -42, -91, -92, -21, 39, 41, -5, -31, -69, -45, -6, 54, 93, 49, -6, -48, -32, -24, 55, 89, 68, 5, -39, -55, -22, 2, 60, 41, -28, -51, -69, -25, 12, 44, 54, 25, -55, -58, -35, -9, 39, 56, 27, -24, -67, -37, 6, 40, 50, 31, -16, -53, -44, 1, 31, 55, 31, -18, -58, -64, -24, 20, 53, 43, -15, -43, -54, -29, 28, 51, 56, 4, -39, -62, -50, 8, 49, 45, -18, -48, -53, -43, -5, 39, 27, 10, -21, -59, -30, 1, 41, 51, 34, -13, -30, -45, 0, 18, 66, 35, 9, -39, -20, -28, 15, 52, 36, 2, -49, -44, -13, 33, 63, 55, 19, -23, -34, -34, -1, 42, 48, 3, -46, -65, -36, -20, 9, 30, -11, -56, -66, -46, -2, 19, 45, 40, 8, -17, 5, 32, 59, 89, 76, 26, 11, -22, 2, 30, 47, 29, -11, -56, -74, -58, -34, 3, -5, -49, -72, -70, -72, -19, 3, 13, 23, -10, -36, -3, 13, 70, 68, 35, -4, -10, 1, 30, 48]
3603D8Rl1l8k1nJ7M3K8m8j3l4%K3K6J9kk4l1j9J9L8K9J1n5k4j0J2M3K0lk0k3r
3636b5J3K7M4Jl0k5l3K0K1L1kj3l3l2j1K6O1j7Qn7m0J7K4K5L5j2k6k9j0K2M3K5
3668D8Kn2k3j0RL9J1kj2k5m4JN3K7Jj2j6m1K0K1L2J3k3l3j3LK9K6K9pm9j1j4L
3702b0L1L7k3m8j8l0J7M6K1ok7l9oL2L3N8l9Ql7j4J5L2L7J2k8n1rQL6QQKm5m2
3736d1PK0J6L2k0m7l1KK3K1J7J1k8k7jPM5M3nk5k9j7K1K7K0%j2l7l7L6K8L2j9
3769C2j6n1LJ2K6K3Pk4l8mqK7J1M1ll4k6l0L0M6J7jm4j6Kk7L2N6j6j9m1j2K6J6
3803cM1Ll8j9j1j4J9M6PJ1l7l9LPL8K6km8j7j1M2J5L8j5l2k6j1J8K9J8km0j9k3
3837d6J3K8J8Rk2l9mRJ3M5Pl1j5k1lM9K1K2j2k7ok0J2M5Pj6j3k9k0K6J5Qmj7l3
$$ y = [48, 57, 26, -12, -33, -38, -21, 22, 50, 2, -11, -45, -45, -22, 4, 23, 21, -3, -34, -53, -34, 4, 33, 44, -11, -35, -45, -33, 10, 30, 27, 7, -16, -25, -12, 15, 59, 60, 30, 5, -28, -8, 13, 44, 42, 29, -4, -36, -47, -21, 40, 23, 31, -26, -66, -49, -25, 0, 35, 23, -3, -32, -42, -20, 23, 48, 50, -2, -25, -35, -26, 13, 24, 22, 10, -15, -59, -58, -5, 22, 23, 11, -5, -46, -26, -5, 27, 40, 17, -16, -29, -26, 3, 29, 58, 51, 2, -9, -23, -20, 11, 48, 25, -23, -41, -71, -54, -8, 13, 7, -20, -59, -65, -33, 0, 58, 19, 27, -10, -24, -9, 23, 60, 72, 44, -7, -16, -8, 28, 36, 44, 46, 1, -41, -34, -14, 2, 34, 14, -33, -64, -62, -39, -18, -1, 10, -18, -45, -46, -39, 6, 49, 44, 19, -10, -27, -6, 21, 41, 41, 29, -8, -45, -9, 19, 51, 32, 16, -35, -32, -20, 6, 29, 36, 12, -26, -30, -38, -11, 0, 41, 38, 4, -22, -52, -22, 24, 41, 40, -4, -20, -18, -45, -13, 43, 27, 8, -33, -45, -19, -3, 38, 41, 3, -16, -27, -41, -22, 24, 31, 42, 5, -34, -31, -24, 14, 40, 38, -10, -27, -38, 4, 19, 57, 42, 10, -16, -27, -9, 20, 38, 36, -4, -23, -46, -33, -5, 13, 22, 0, -39, -43, -34, -21, 24, 31, 0, -15, -36, -39, 10, 31, 53, 41, 14, 8, -12, 0, 45, 52, 36, 23, -6, -26, 0, 15, 23, 19, 2, -31]
3872c1j0MM0kJ6k5k1l0L0K4L4j2k2k9p%M5L7j8Pj1m3PK3J2M2l5m3KROL3J3j7j3
3907A5j8m9M1RL6j5j1l4rQK3K1Nk4l6kNK3L6qJ0l0l1K2K2K4Kmk9j4lJ3M3MJ6n0
3943A1k1lMJ6J1K3n1k5j9J9K2J7J9m6Jk1J1J9L3Qj6l7j1K7K6J5Q%l2k3OJ2K5Q
3977C6k1l6j7%K8K7Lmok9j0K5L7J9j6lk7l3K3K1K1pk0j2k1lOK7J1l1n1J1J2PL6
4012CJ9k2j0nj7L4K3K0qk1j7MK3j1K9ok1k1k1pL6J0Nll2j5nL3J5Oj2l2Oj6M4%
4048HMjk1j4QkK5J4Lk6nLJ0K0L7j5k7k1j2J1K7J9nk4m0J2k0M8Qj2l8j6qjL1K5
4084Ej2jjl8K1L3J5J7l8kj6K1J0K9k2L1l3k6K9j2NJ3ok5m0JK3J2K6qk1l1K2J4
4118enL2nj8nj0KJ7J2MJ0l4l3K4J0K0Rk1ml5KK0K2K3rn0MK7k2L6J9k4j4j6NJ6
$$ y = [-31, -41, -37, 3, 1, 17, -8, -29, -59, -29, -5, 29, 17, -5, -34, -41, -41, 4, 41, 23, 30, 19, -24, -17, 6, 18, 60, 25, -18, -16, -7, -1, 32, 45, 28, 15, -3, -52, -11, -2, 34, 19, 8, -26, -35, -27, -4, 17, 22, -2, -38, -40, -35, -12, 24, 16, 26, -4, -35, -13, 9, 33, 35, 31, 2, -12, -15, -2, 41, 45, 61, 11, -10, -13, -9, 7, 18, 41, -10, -35, -54, -35, -13, 4, 23, -23, -22, -43, -32, -13, 20, 28, 12, -25, -36, -9, 17, 32, 40, 40, 8, -15, -9, 3, 28, 36, 15, -21, -38, -38, -10, 17, 20, 16, 10, -19, -29, -4, 33, 52, 36, 33, 6, -27, -4, 17, 38, 31, 11, -1, -22, -25, -19, 8, 19, -12, -63, -52, -40, -33, 3, 22, 0, -10, -15, -32, 2, 25, 45, 37, 16, -1, 3, 26, 15, 44, 38, 17, -4, -25, -32, 4, 14, 19, 16, -16, -31, -36, -3, 12, 18, 6, -26, -20, -36, 8, 8, 12, 11, -10, -24, -16, -18, 7, 21, 24, -2, -7, -4, 6, 26, 63, 48, 21, 0, -12, -1, 26, 45, 40, 16, -24, -12, -32, 16, 24, 12, -26, -42, -50, -51, -20, 5, -7, -8, -9, -47, -26, 7, 22, 39, 1, -1, -17, 4, 14, 43, 21, 52, 19, -7, 22, 10, 15, 28, 22, -3, -43, -42, -19, -7, 19, 11, -10, -41, -19, -5, -10, 22, 17, -1, -6, -16, -14, 3, 15, 19, 29, -5, -38, -14, -4, 16, 25, 4, 0, -35, -33, -13, 9, 32, 23, -27, -23, 4, -18, 18, 37, 13, -1, -17, -12, 4]
4154DK6JKl3j1k4K9J2K0lj8j8k7J6J0K2Oj4j7qj4L4J2K2l0mk5pM1PmMj4rMlL2
4191B1RJ7l2l2PK2%K2Ml8j1mRJ9LJk0k4mJJ3K9Rk9j5k0J5J4K0J1qqk9K6%M0lK
4229C7j6l7K2OL8j5j5j9k8J2kJ8OK1m0k0j4L2lL3qqk6Nj2M3Nj2J2k6j5K2J0OJ6
4264B8kk5j9MJM2rlk7%j2RK5O%k0j4nK4J6J4k1ml3lK4K3N%l5j9j7K0L3K5j9j7
4301eoj2KJ8K9j2j1Ml3PK0J8J4J0m1j7J2kL4J7nm0k2K0K3oJ2Lm8JqOK2mJ5k3j4
4338b2kmkL4noml1J7K3J8J0j3j1j5QK0QK0k0j4j3J2J7NP%k5k9rK1K9Lkm6k7mK1
4376c1K3K6j5k8Jk3KK6L7pLk7lrL3K5Qjl5J0k5L4PQNj6m9MJ5J2NKk7j5j6PKK3
4414iJ5l0rqpK0L9%j5PrlJ9J3Joj9k7J6K3K9j3j7%k4oQJ6L4l3kl1Lj6M3J0jk0
$$ y = [4, 30, 31, 33, 0, -11, -35, -6, 6, 26, 23, 5, -13, -40, -24, -14, 8, 14, 0, -17, -25, -39, -5, 7, 29, -1, -5, -30, -37, 4, 11, 7, 11, -3, -12, -8, -11, 21, 30, 47, 15, -17, -10, 12, 12, 34, 38, 0, -11, -15, -6, 13, 16, 17, -3, -27, -31, -30, -17, 12, 21, -8, -23, -43, -28, -14, 6, 17, 9, 1, -28, -2, -2, 38, 35, 37, 21, -16, 6, 12, 50, 35, 20, 1, -27, -15, -17, 1, 7, 28, -12, -32, -46, -14, -17, 16, 8, 0, -26, -21, -33, 10, 15, 3, 15, -11, -26, -4, 6, 12, 28, 26, 1, -18, -14, -13, 29, 20, 17, -10, -10, -22, -13, 12, 18, 18, -2, -16, -21, 3, 19, 33, 12, 8, -25, -28, -4, 19, 24, 24, -11, -30, -47, -27, 6, 31, 12, -5, -11, -23, -21, -3, 26, 14, 3, 7, -26, -19, 1, 19, 33, 43, 2, -15, -3, -5, 29, 46, 41, 1, -21, -1, 22, 16, 28, 31, -17, -16, -24, -18, 4, 0, 15, -8, -22, -24, -28, -30, 4, -1, -7, -11, -42, -25, -2, 16, 26, 13, 2, -13, -5, 15, 23, 43, 23, 9, -4, 8, 25, 30, 37, 37, 12, -17, -26, -5, 24, 27, 25, -21, -48, -52, -31, -8, 18, 3, -25, -24, -47, -45, -19, 18, 11, 14, -13, -16, -25, 8, 33, 41, 40, 5, 15, -10, 24, 31, 39, 44, 28, -21, -17, -2, 10, 15, 17, -10, -25, -41, -34, -32, -9, 6, -24, -33, -41, -48, -28, 11, 11, -4, 3, -6, -9, 10, 23, 24, 18, -1, -28, -12, 11, 40, 27, 10, 10, -14, -20, -12, 4, 38, 5, 3, -28, -25, -41, 2, 12, 11, -9]
4452ik2j8J7L0J1Nk4l3PK0J0K6rj7j2OmK0K4k8K5l7Mj1K3J9Mj8j5kj3J4J4j1L
4487aJk1MKL3j0Nj1l7PJ3QJ9jk4nk1mK4J5Pj7nj4J5K5j1L8l1j4LKK4kK5jk4k4
4525hJ5qK6lj3j4lKJ3j1jj2qrj4K6KQPj6pj2K6QOJ1pj2LLJ7nL7j9j4j6J0J8oP
4565B7j5mj6J6pJ3Ooj9k3JJ5J4J4l2oj7jJ5K3L6k1lk6j7J2L4jRj8%rLOL1jl1K
4603DrJJ1QJ9nj8m1L7Jmj0J1k4j7J6MOJ6opk8K0mJ1MJ0rj6kK3J0Qpj0qJ2k5L2
4642A4Ropj5jrK9lOj8Kj6J5kK9j9rj6JqLL4j2K4l1k2ONPQj6Rj9lKL3LPKm3KM9
4684B4mJ0kk0J0j2KK7oNj0k8j3lK5K3qrm1nJ2kJ6%kKj8j0K5Qj4J0k5J2rNL0J1
4722A6mJj0k1K1J1L0rlk5j3J9J4kNk8J3k5pRJ1lrj8nRj1K4Rj8j1kpK9KK8j9pq
$$ y = [-9, -31, -49, -32, -2, 9, 14, -10, -43, -36, -16, -6, 20, 11, -6, -18, -12, -16, 4, 28, 0, 25, -12, -8, -19, 4, 23, 27, 9, -6, -8, -21, -7, 7, -4, -1, 0, -21, -17, -15, 18, 8, 13, 2, -35, -28, -15, -7, 12, 11, -13, -18, -39, -43, -19, -4, 3, -14, -19, -33, -18, 7, -4, 34, 3, -11, -8, -6, 18, 16, 41, 40, 16, -8, 7, -1, 25, 22, 9, -5, -8, -6, 7, -4, -5, -17, -25, -34, -48, -22, -20, -12, -5, -21, -28, -40, -14, -6, 0, 11, 4, -8, -5, -2, 15, 10, 47, 28, 14, -2, 8, 26, 20, 27, 12, 8, -8, 8, 1, 14, 20, 14, -5, -28, -27, -12, 2, 16, -16, -22, -39, -40, -25, -2, 34, 13, 10, -16, -33, -21, 13, 12, 21, 3, 3, -6, -3, 3, 34, 33, 2, 4, -5, -4, 7, 15, 34, 29, 11, -30, 7, 8, 4, -6, 5, -19, -36, -20, -16, -10, 6, 0, -7, -35, -15, -19, -8, -4, 6, -3, -19, -21, 2, 12, 20, 13, 3, -5, 7, -18, 14, 23, 17, 10, -5, -6, -15, 14, 11, 17, -1, 1, -15, 0, -2, 27, 8, -1, -17, -16, -24, -21, 13, 1, 25, -6, -28, -22, -17, -10, -2, -18, -9, -28, -31, -29, 4, 7, 14, 16, -27, -25, 24, 20, 30, 28, 8, 18, 6, 8, 35, 29, 34, 24, -4, -17, -20, 5, 28, 20, 11, -30, -35, -23, -25, -9, -9, -11, -9, -27, -37, -12, -4, -18, -8, -33, -21, -30, -25, 5, 16, 12, 13, 3, -18, 3, 14, 44, 35, 32, 7, -6, 13, 27, 25, 30, 2, 15, -10, -17, -8, 3, 0, -9, -27, -32, -23, -34, -10, -1, -19, -30, -32, -39, -10, -8, 20, 1, -6, -14]
4761a4nOK7K0k5Mj4K0j3K0Qrj3rnoPL5k0j0k0LqL0j5J9l0j7nLK8MNk9J1j4oK4
4799a3OK8k1Jk1LK9rK3Mj0j5k8K6J7kJ5k0k5kLJ4lK6l4Jrj2NM2j8j5qpLj1M0M
4837Gkk9kKJ9J4J9qj9k5J3J3L3oj5J0%k7J5J8Nqk1k5J5j3J8J0nj2ok9K3rJ3Ol3
4874d1Qj3%J7J5K3lj6j5J3K1k8M9k2KnQmLJ5lKl3j4J0K6Llk4rlONj2J8Ll6%%J8
4914a9J0J4k3MQkPK3%%qk3PJ5KJRJl9jK0J3Nj4l2J7j4J2QJ0kk1j8K0j8J0K5J3
4952B0j4j8J0nLJ7Nj8J0j5j2L0mkJKj7j7K2J2ROm2NJ9qK0kJ3m2JrJ4J5JRk3j4
4990a8K0j6K2Jkj0j2KmL3pRk2qnKJ8J2kk4J4j9K0k%JK7k5j3jJ6J0j0j2Pj5mMJ3
5029@Mj4K1j9rNOQk3K7j9PrJ5Lj3MMkJKpONj1j1jK6KJ2k1%lj8J8J4%J0j2k2PQ
$$ y = [-14, -19, -13, 14, 34, 9, 13, -1, 19, 6, 26, 34, 25, 12, 3, -2, -8, -1, 34, 14, 4, -16, -13, -21, 9, -6, 13, -17, -34, -39, -36, -8, -4, 1, -28, -17, -31, -37, -13, -7, 21, 0, 1, -20, -17, 12, 3, 26, 30, 20, 5, -23, 3, 20, 18, 33, 13, -12, -14, -11, 3, 0, 26, -8, -7, -16, -28, -23, 19, 1, -14, -22, -29, -26, -37, 3, 7, 5, -24, -26, -24, -5, 9, 28, 20, 1, -24, -11, 2, 35, 29, 14, 24, 24, -3, 12, 30, 35, 27, 6, -19, -4, -17, 1, 11, 6, -6, -12, -41, -18, -27, -14, -8, -41, -33, -46, -46, -29, -14, 9, 6, -10, -25, -12, 9, -19, 30, 8, 10, 5, 13, 9, 12, 27, 24, 26, -7, -21, -11, 15, 18, 15, -9, -18, -21, -15, -10, -22, -4, -1, -37, -37, -37, -19, -9, 5, -18, -14, -6, -8, -1, 22, 22, 22, 14, -9, -2, 13, 15, 16, 25, 26, -13, -14, 6, 19, 24, 10, -22, -5, -19, -7, 1, 11, 9, -12, -30, -10, -28, -18, 7, 20, 6, -12, -2, -7, -4, 13, 18, 0, 10, -5, -17, 13, 9, 7, 8, 10, -7, -24, -2, 10, 19, 25, -17, -12, 7, -1, 19, 17, 30, -12, -11, -20, -6, 9, 10, 19, -4, -18, 2, -14, 8, 9, 7, -3, -15, -13, -17, 16, 9, 18, -4, -12, -17, -15, 3, 15, 13, -11, 3, -16, 4, 2, 2, 3, 30, 5, -8, -9, 7, 17, 7, -5, 2, -13, -17, -13, 0, 4, -10, 11, -8, -17, -12, -6, 2, -21, 6, -13, -6, -15, 0, 3, -10, -6, -2, -4, -3, -1, -8, -2, 3, -8, -19, -20, 6, 8, 20, -1, -1, -4, -22, -4, 10, 10, 20, 8, -14, -7, 1]
5071ANKoNj7JrMNJ0Qk2JKNpJ6K0j7k5KK4KoprJ4J1j3K5J1j8j8qj4L2J2j0J0k7
5111ePj6K3KJ5k7l%rJ2J3Lmj1k2J5j2K4oK0j1kj3nJ4J5rmj4K6j5K0J0j3J9k6O
5148A7j7j1K6%Jj5j0RkJ0qQj2lomLK5j1j0j6PJ1OKpJ5Lj4QlQRj0okMJ1J9j2k1
5189BMQj5oL7Kj9rj9MMj6QK7l2pnK6jOj0jrj1KK4K3j6Mj5MOJ4kK0k8mLMJ7Mjr
5232A8j3lrQPj1Nj6plQRNj4PrlrM4p%j7N%L7m8K0L2k2mj6K0kQOj8lOk3K7KJQk4
5276Bj5J5%j7K2J1k6PLomK3j1rk2J4RjJ0Lj6jj8K8nJ5Mj3Lk0J6QKJ9j2j9PJpM
5316DQj1Pj5J0Lkopj7K0k2J4RPj3Mmk0J4J8J0j0Lk7j2L7JJMJ0l4J8RkLppjj1J7
5357ClJ2JplKj1RJ9j3j9kLk4K0jL3pk0J0k7MK8k%kRk8J4J0mK2l2J5j1rJ3K2jl0
$$ y = [1, 6, 8, 2, 7, -10, -9, -18, -14, -9, 1, 9, -13, -12, -10, -5, -12, 4, 24, 7, -18, -16, 8, 10, 4, -3, -12, 2, 13, 0, 25, 36, 18, 0, -8, -22, 10, 22, 12, 22, -5, 2, -14, 9, 11, 26, -1, -4, -4, -13, -1, 12, 15, 11, 0, -22, -7, -19, 5, -1, 19, 8, 6, -7, -12, 2, 17, 8, 4, -10, 16, 1, 21, 31, 18, 37, 11, 17, 0, -11, 15, 15, 16, 1, -9, 0, -2, 8, 0, 8, -4, -7, -13, -17, -14, 11, 0, -10, -26, -19, -8, -2, 0, -7, 8, 11, -3, 5, 2, 10, 19, 9, 3, 1, 5, 16, 35, 23, 2, 6, 14, -1, -7, 30, 32, 13, 4, -15, -11, -7, -23, -15, 12, -20, -27, -32, -6, -7, -1, -11, -12, -21, -32, -30, -6, 17, 1, 5, -10, -6, 0, 14, 12, 32, 4, 0, 3, 7, 24, 28, 27, 18, 5, 2, -7, 1, 8, -3, 2, -14, -21, -24, -16, -7, -2, -16, -9, -18, -21, -30, 14, 7, 7, -10, -5, -5, 32, -16, 4, 36, 14, 10, -6, 14, 12, 20, 26, 8, 5, 11, -12, 15, 17, 18, 26, 2, -13, 2, 2, -15, 7, 18, -8, -1, 2, -4, -8, 15, 4, -5, -27, -13, -4, -5, 5, 8, -8, -9, -27, 1, -4, 11, 15, 2, 5, -15, 1, 9, 11, 30, 18, -1, 6, 7, 0, 4, 12, 1, 8, -7, 3, 6, 4, -2, -9, -26, -6, -28, -14, -5, 2, -11, -7, -11, -31, -17, 1, 11, 1, 4, -23, -35, 2, 3, 4, 8, 18, -16, 2, 11, 9, 12, 5, -2, -3, -14, 3, 0, 12, 13, 6, 3, 5, -6, 3, 22, 9, -10, -12, -9, -33, -13, -14, 19, 12, -8, 2, -25, -21, 7, 5, 5, 3, 12, -16, -2, 8, 4, 26, -6, 9, -2, -11, 2, 24, 23, -7]
5397gJ4j9JJ4kK1j4j3jRKmKmj6kOPPjj2J7j0pRlK5k9J8l4MK4KjKJ2j6lj6L2Rk2
$$ y = [-7, 7, -12, -11, 3, 1, 22, 8, -5, -6, 3, 5, 1, 3, -1, -17, -19, -13, -6, 1, 0, -12, 5, -5, -12, -3, -6, 19, -10, 8, -26, -22, 2, 4, 3, 5, 17, 1, -2, -18, 14, 23, 1]
$$ [...]
8191A0
##END NTUPLES=NMR FID
##END=
