##TITLE=1H_Pr 3
 CCl4
 8 sc, 
 5.11.2024
##JCAMPDX= 6.0         $$ Bruker NMR JCAMP-DX V2.0
##DATA TYPE= NMR FID
##DATA CLASS= NTUPLES
##ORIGIN= UXNMR, Bruker Analytische Messtechnik GmbH
##OWNER= root
$$ XWIN-NMR		Version 3.5
$$ Tue Nov  5 14:08:22 2024 Russian Standard Time (UT+4h)  she@DPX200
##.OBSERVE FREQUENCY= 200.1318
##.OBSERVE NUCLEUS= ^1H
##.DELAY= (6, 6)
##.ACQUISITION MODE= SIMULTANEOUS
##.ACQUISITION SCHEME= undefined
##.AVERAGES= 8
##.DIGITISER RES= 18
##SPECTROMETER/DATA SYSTEM= spect
##.PULSE SEQUENCE= zg30
##.SOLVENT NAME= CDCl3
##.SHIFT REFERENCE= (INTERNAL, CDCl3, 0, 15.7039)
##AUDIT TRAIL= $$ (NUMBER, WHEN, WHO, WHERE, WHAT)
$$ ##TITLE= Audit trail, XWIN-NMR		Version 3.5
$$ ##JCAMPDX= 5.01
$$ ##ORIGIN= Bruker BioSpin GmbH
$$ ##OWNER= she
$$ F:/spectra/data/she/nmr/H-F/1/audita.txt
$$ ##AUDIT TRAIL=  $$ (NUMBER, WHEN, WHO, WHERE, WHAT)
(   1,<2024-11-05 14:07:11.71 +0400>,<she>,<DPX200>,
      <created by zg, POWCHK disabled, PULCHK disabled
       configuration hash MD5:
       00 E9 B6 7A A2 85 ED C7 34 08 36 98 17 FE 4E 26
       data hash MD5: 16K
       B5 0D 83 49 E1 11 46 83 5B F8 80 30 9B D5 3F 82>)
$$ ##END=
$$ 
$$ hash MD5
$$ 3A 74 91 A1 F9 2E 20 E1 8B 5B AB F7 31 36 43 B3
##$RELAX= 
##$RELAX= 
##$RELAX= 
##$RELAX= 
##$RELAX= 
##$RELAX= 
$$ Bruker specific parameters
$$ --------------------------
##$DU= <F:/spectra>
##$EXPNO= 1
##$NAME= <H-F>
##$PROCNO= 1
##$TYPE= <nmr>
##$USER= <she>
##$AMP= (0..31)
100 100 100 100 100 100 100 100 100 100 100 100 100 100 100 100 100 100 
100 100 100 100 100 100 100 100 100 100 100 100 100 100 
##$AQSEQ= 0
##$AQ_mod= 1
##$AUNM= <au_zg>
##$AUTOPOS= <>
##$BF1= 200.13
##$BF2= 200.13
##$BF3= 200.13
##$BF4= 200.13
##$BF5= 200.13
##$BF6= 200.13
##$BF7= 200.13
##$BF8= 200.13
##$BYTORDA= 1
##$CFDGTYP= 0
##$CFRGTYP= 5
##$CHEMSTR= <none>
##$CNST= (0..31)
1 1 145 1 1 1 1 1 1 1 1 1 1 1 1 1 1 1 1 1 1 1 1 1 1 1 1 1 1 1 1 1 
##$CPDPRG= <>
##$CPDPRG1= <>
##$CPDPRG2= <>
##$CPDPRG3= <>
##$CPDPRG4= <mlev>
##$CPDPRG5= <mlev>
##$CPDPRG6= <mlev>
##$CPDPRG7= <mlev>
##$CPDPRG8= <mlev>
##$CPDPRGB= <>
##$CPDPRGT= <>
##$D= (0..31)
0 1.2 0 0 0 0 0 0 0 0.06 0 0.03 0 0 0 0 0.0002 0 0 0 0 0 0 0 0 0 0 0 0 
0 0 0 
##$DATE= 1730801231
##$DBL= (0..7)
120 120 120 120 120 120 120 120 
##$DBP= (0..7)
150 150 150 150 150 150 150 150 
##$DBP07= 0
##$DBPNAM0= <>
##$DBPNAM1= <>
##$DBPNAM2= <>
##$DBPNAM3= <>
##$DBPNAM4= <>
##$DBPNAM5= <>
##$DBPNAM6= <>
##$DBPNAM7= <>
##$DBPOAL= (0..7)
0.5 0.5 0.5 0.5 0.5 0.5 0.5 0.5 
##$DBPOFFS= (0..7)
0 0 0 0 0 0 0 0 
##$DE= 6
##$DECBNUC= <off>
##$DECIM= 24
##$DECNUC= <off>
##$DECSTAT= 4
##$DIGMOD= 1
##$DIGTYP= 9
##$DL= (0..7)
0 120 120 120 120 120 120 120 
##$DP= (0..7)
150 150 150 150 150 150 150 150 
##$DP07= 0
##$DPNAME0= <>
##$DPNAME1= <>
##$DPNAME2= <>
##$DPNAME3= <>
##$DPNAME4= <>
##$DPNAME5= <>
##$DPNAME6= <>
##$DPNAME7= <>
##$DPOAL= (0..7)
0.5 0.5 0.5 0.5 0.5 0.5 0.5 0.5 
##$DPOFFS= (0..7)
0 0 0 0 0 0 0 0 
##$DQDMODE= 0
##$DR= 18
##$DS= 0
##$DSLIST= <SSSSSSSSSSSSSSS>
##$DSPFIRM= 0
$$ [...]
##$SUBNAM2= <"">
##$SUBNAM3= <"">
##$SUBNAM4= <"">
##$SUBNAM5= <"">
##$SUBNAM6= <"">
##$SUBNAM7= <"">
##$SUBNAM8= <"">
##$SUBNAM9= <"">
##$SW= 24.0689170037331
##$SWIBOX= (0..15)
0 0 2 0 0 0 0 0 0 0 0 0 0 0 0 0 
##$SW_h= 4816.95568400771
##$TD= 16384
##$TD0= 1
##$TE= 0
##$TE2= 300
##$TE3= 300
##$TEG= 300
##$TL= (0..7)
0 120 120 120 120 120 120 120 
##$TP= (0..7)
150 150 150 150 150 150 150 150 
##$TP07= 0
##$TPNAME0= <>
##$TPNAME1= <>
##$TPNAME2= <>
##$TPNAME3= <>
##$TPNAME4= <>
##$TPNAME5= <>
##$TPNAME6= <>
##$TPNAME7= <>
##$TPOAL= (0..7)
0.5 0.5 0.5 0.5 0.5 0.5 0.5 0.5 
##$TPOFFS= (0..7)
0 0 0 0 0 0 0 0 
##$TUNHIN= 0
##$TUNHOUT= 0
##$TUNXOUT= 0
##$USERA1= <user>
##$USERA2= <user>
##$USERA3= <user>
##$USERA4= <user>
##$USERA5= <user>
##$V9= 5
##$VALIST= <valist>
##$VCLIST= <CCCCCCCCCCCCCCC>
##$VD= 0
##$VDLIST= <DDDDDDDDDDDDDDD>
##$VPLIST= <PPPPPPPPPPPPPPP>
##$VTLIST= <TTTTTTTTTTTTTTT>
##$WBST= 1024
##$WBSW= 4
##$XGAIN= (0..3)
0 0 0 0 
##$XL= 0
##$YL= 0
##$YMAX_a= 163119
##$YMIN_a= -148966
##$ZGOPTNS= <>
##$ZL1= 120
##$ZL2= 120
##$ZL3= 120
##$ZL4= 120
##$ABSF1= 10
##$ABSF2= 0
##$ABSG= 5
##$ABSL= 3
##$ALPHA= 0
##$AQORDER= 0
##$ASSFAC= 0
##$ASSFACI= 0
##$ASSFACX= 0
##$ASSWID= 0
##$AUNMP= <proc_1d>
##$AZFE= 0.1
##$AZFW= 0.1
##$BCFW= 1
##$BC_mod= 2
##$BYTORDP= 1
##$COROFFS= 0
##$CY= 11.3945322036743
##$DATMOD= 1
##$DC= 2
##$DFILT= <>
##$DTYPP= 0
##$F1P= 15.6554695791079
##$F2P= 12.8336369535428
##$FCOR= 0.5
##$FTSIZE= 0
##$FT_mod= 4
##$GAMMA= 1
##$GB= 0.15
##$INTBC= 1
##$INTSCL= 1
##$ISEN= 128
##$LB= 0.24
##$LEV0= 0
##$LPBIN= 0
##$MAXI= 10000
##$MC2= 0
##$MEAN= 0
##$ME_mod= 0
##$MI= 1.114404
##$NCOEF= 0
##$NC_proc= 0
##$NLEV= 6
##$NOISF1= 3.799351
##$NOISF2= 2.8
##$NSP= 1
##$NTH_PI= 0
##$NZP= 0
##$OFFSET= 15.70392
##$PC= 1
##$PHC0= -26505.59
##$PHC1= 12.38744
##$PH_mod= 1
##$PKNL= yes
##$PPARMOD= 0
##$PSCAL= 0
##$PSIGN= 0
##$REVERSE= no
##$SF= 200.130013532006
##$SI= 16384
##$SIGF1= 3
##$SIGF2= 2
##$SINO= 400
##$SIOLD= 16384
##$SREGLST= <1H.CDCl3>
##$SSB= 0
##$STSI= 0
##$STSR= 0
##$SW_p= 3612.71676300578
##$SYMM= 0
##$S_DEV= 0
##$TDeff= 0
##$TDoff= 0
##$TI= <>
##$TILT= no
##$TM1= 0
##$TM2= 0
##$TOPLEV= 0
##$USERP1= <user>
##$USERP2= <user>
##$USERP3= <user>
##$USERP4= <user>
##$USERP5= <user>
##$WDW= 1
##$XDIM= 8192
##$YMAX_p= 0
##$YMIN_p= 0
$$ End of Bruker specific parameters
$$ ---------------------------------
##NTUPLES= NMR FID
##VAR_NAME=  TIME,          FID/REAL,        FID/IMAG
##SYMBOL=    X,             R,               I
##VAR_TYPE=  INDEPENDENT,   DEPENDENT,       DEPENDENT
##VAR_FORM=  AFFN,          ASDF,            ASDF
##VAR_DIM=   8192,          8192,            8192
##UNITS=     SECONDS,       ARBITRARY UNITS, ARBITRARY UNITS
##FACTOR=    0.0002076,     1,               1
##FIRST=     0,             0,               0
##LAST=      1.7004516,     0,               0
##MIN=       0,             -148966,         0
##MAX=       1.7004516,     163119,          0
$$ Real data points
##PAGE= N=1
##DATA TABLE= (X++(R..R)), XYDATA
0 0 0 0 0 0 0 0 1 -8 8 -8 16 -16 24 -24 32 -40 48 -57 70 -81 97 -113 134 -153 176 -202 232 -264 303 -343
30 -343 387 -436 491 -549 613 -686 763 -849 941 -1044 1157 -1283 1420 -1572 1738 -1926
46 -1926 2133 -2368 2634 -2940 3293 -3710 4206 -4808 5561 -6531 7842 -9716 12662 -18284
60 -18284 49367 -148966 9530 85105 -44235 -11007 -41424 139389 -138625 20770 95737
71 95737 -120403 78178 -34821 11177 8438 -35339 69740 -102458 101880 -35264 -71360
82 -71360 131358 -93264 14295 10103 20899 -13663 -74813 153964 -112645 -22513 112329
93 112329 -84597 18244 -18165 65824 -57179 -39003 131006 -125838 41123 33741 -51696
104 -51696 40743 -43223 61178 -64277 26708 45639 -109185 110004 -42101 -32667 49982
115 49982 -23914 24755 -71920 94080 -27791 -81170 125870 -72877 -1220 17469 5695
126 5695 4559 -64275 107340 -72668 -16768 82863 -81229 40496 -14701 16854 -13171 -25070
138 -25070 78277 -95839 51752 22942 -69864 62620 -30787 19783 -31626 23349 30736
149 30736 -91420 93503 -28385 -40014 52846 -26565 19328 -45123 54838 -9828 -59726
160 -59726 89548 -58322 5607 21913 -20693 20160 -37927 56503 -44456 -4746 57887
171 57887 -72985 42625 -2504 -12088 6455 -14236 44991 -64692 38461 20129 -61105
182 -61105 54304 -21816 4236 -9129 6644 23545 -59599 60827 -19115 -29044 45477 -31198
194 -31198 16846 -19052 21279 -1309 -35342 58226 -45618 8087 23872 -31010 22464 -19463
206 -19463 26537 -24724 -2105 39888 -54935 33487 1302 -17989 14403 -13263 26314 -36112
218 -36112 20969 14234 -41259 40248 -19173 710 4777 -6653 17060 -31919 33812 -13094
230 -13094 -17153 33914 -28322 13074 -4594 3197 3236 -19380 33134 -28596 5599 18083 -25757
243 -25757 18488 -10487 9853 -8824 -3746 23141 -32061 20743 771 -14310 14743 -11750
255 -11750 13180 -14839 7860 8179 -22767 24700 -13599 -764 8838 -9955 10609 -14490 15637
268 15637 -6709 -9703 21073 -18988 8256 285 -2949 5105 -10785 16174 -13709 2316 10442
281 10442 -15989 12714 -6356 2353 -115 -4671 11701 -15380 10571 -122 -8526 10667 -8619
294 -8619 6331 -4417 1119 4787 -10560 11903 -7160 -709 6447 -7543 6248 -5771 5222
307 5222 -1543 -5066 9920 -9113 4160 622 -2947 4178 -5432 5990 -4177 146 4302 -6836
321 -6836 6165 -2987 -214 2048 -3162 4444 -5256 3582 219 -3729 4802 -3882 2333 -733 -712
336 -712 2282 -3507 3648 -2178 -406 2707 -3234 2509 -1550 774 358 -2033 3174 -2684 1183 137
352 137 -1097 1853 -2034 1361 -502 -390 1002 -1604 1567 -695 -477 1090 -989 956 -1007 523
368 523 398 -999 989 -668 653 -164 -329 562 -481 203 -220 80 329 -433 117 100 -155 149 -302
387 -302 333 -125 -130 3 14 94 -292 151 103 15 -296 220 35 19 -174 -4 144 -235 -1 -7 153 -193 -86
410 -86 55 189 -214 59 144 -56 -6 -153 305 -80 -224 71 11 28 31 -284 410 -321 14 107 -176 517 -829
433 -829 658 -189 -215 388 -602 752 -562 139 518 -816 995 -814 120 689 -1103 1170 -1085 984
451 984 -197 -1070 2010 -1982 1197 -343 -485 1241 -1854 1871 -1406 143 1426 -2657 2539 -1410
467 -1410 41 836 -1640 2646 -3198 2221 197 -2517 3445 -2952 1963 -861 -388 2063 -3758 4160
483 4160 -2608 -553 3195 -4093 3316 -2386 1675 182 -3209 5795 -5757 2679 1074 -3398 4027
498 4027 -4087 3940 -2980 -40 4368 -7339 6390 -2423 -1653 3360 -3983 5064 -6089 4377
512 4377 782 -6646 8923 -6683 2373 721 -2296 4242 -7094 8356 -5208 -1991 8337 -9455
526 -9455 6029 -2357 696 1071 -5386 10277 -10812 4679 4001 -9243 8866 -5859 4152 -3308
540 -3308 -383 7479 -13179 11764 -3259 -5499 8707 -7238 6084 -7055 5741 1404 -11206
553 -11206 15757 -11115 1437 5367 -6543 6419 -8604 10959 -7372 -3533 14365 -16425
565 -16425 9107 -295 -3433 3757 -6814 12849 -14721 6657 7310 -16695 15251 -7299 1630
578 1630 -530 -1771 9522 -17763 16910 -4398 -10468 16442 -12216 6267 -5056 4890 1794
591 1794 -14478 22252 -16478 777 11907 -13841 9414 -8141 10598 -8334 -4210 19788
603 19788 -24352 13420 2413 -10396 9030 -7838 12484 -16307 8681 9353 -23948 22843
615 22843 -9150 -3093 5738 -4744 9557 -19031 20262 -5998 -14637 24808 -18256 5516 285
628 285 609 2549 -14624 25096 -20452 643 18242 -21978 13111 -5387 5917 -6206 -4248
641 -4248 21541 -29064 17169 4733 -18098 16104 -9114 9136 -13334 8538 9562 -27999
653 -27999 28974 -11561 -7967 14159 -9782 8931 -16295 19928 -7127 -16589 31402 -24860
665 -24860 5810 6849 -6706 5082 -12908 24307 -22487 1606 22687 -30262 18190 -2772
677 -2772 -1486 -1020 -4463 20380 -30772 20323 5407 -24994 24194 -11521 4347 -6899 6001
690 6001 8433 -28020 32316 -13963 -11231 22307 -16178 8273 -10335 14949 -6564 -15767 33359
703 33359 -28762 6434 12510 -14945 8970 -9829 18506 -19582 2151 23088 -33986 21667
715 21667 -864 -9226 6500 -5686 15841 -26354 19703 4881 -27631 29597 -14014 -165
727 -165 1716 752 7232 -23800 30546 -15140 -11906 27563 -22118 8513 -3586 7113 -4049
740 -4049 -13125 31053 -29951 7926 15590 -22252 13848 -7329 10947 -14111 2261 20439 -33934
753 -33934 24384 -960 -14875 14025 -8128 11030 -19255 16507 3456 -26330 31633 -16435
765 -16435 -2413 9070 -5652 6836 -17360 24602 -13977 -10232 27967 -25173 9282 1614
777 1614 -1216 393 -10112 24188 -25790 8142 15192 -24829 17092 -5807 3407 -6128 629
790 629 15581 -28288 22474 -1359 -16636 18557 -10352 6468 -10173 10360 2612 -21391 28539
803 28539 -16592 -3208 13513 -11031 7067 -10783 16295 -10730 -7769 24594 -24705 9946
815 9946 4422 -7663 4962 -7764 16484 -19361 7216 12714 -23953 18569 -5551 -1588 927
828 927 -2085 11165 -20890 18467 -2107 -15027 19582 -12085 4136 -3220 3925 2845 -15556
841 -15556 22317 -14448 -2339 13890 -13593 7832 -6004 8294 -5802 -5598 18348 -20341
853 -20341 9198 4567 -10226 8062 -6289 9317 -11389 4565 9278 -18959 16256 -5036
865 -5036 -3954 5427 -4334 7314 -12715 12205 -1841 -11488 16765 -11333 2644 1294 -1182
878 -1182 3288 -9889 14646 -10437 -1465 11726 -13083 7544 -2934 2342 -1519 -4252 12200
891 12200 -14419 7330 3580 -9776 8768 -5408 4582 -5103 1722 6292 -13121 12248 -4372
904 -4372 -3869 6707 -5607 5240 -6843 6428 -721 -7729 12055 -9044 2186 2658 -3593 3839
918 3839 -6036 8077 -5976 -1089 8171 -9990 6304 -1511 -702 1386 -3487 6952 -8246 4468
932 4468 2340 -7162 7113 -4122 1853 -1042 -438 3891 -7454 7240 -2665 -2909 5629 -4975
946 -4975 3362 -2808 2201 347 -4557 7042 -5598 1343 2400 -3644 3352 -3309 3397 -2325 -977
961 -977 4717 -6003 4052 -777 -1514 2253 -2748 3584 -3813 1962 1466 -4193 4539 -2776 739
976 739 513 -1308 2454 -3542 3342 -1139 -1715 3450 -3230 2016 -984 179 963 -2412 3323 -2709
992 -2709 692 1312 -2307 2155 -1629 1087 -421 -812 2156 -2624 1842 -205 -1122 1550 -1650 1470
1008 1470 -1224 444 752 -1803 1989 -1253 195 594 -973 1176 -1232 972 -191 -777 1430 -1337
1024 -1337 748 -164 -388 695 -912 1043 -767 82 484 -884 861 -518 167 119 -318 653 -662
1041 -662 439 19 -395 570 -542 349 -137 -87 377 -466 474 -280 56 132 -239 239 -156 47 57 -143
1061 -143 196 -170 14 49 -147 107 -161 108 -55 1 75 -60 63 -91 32 2 -37 -43 44 -101 56 -29 5
1084 5 7 -72 45 -24 71 -25 65 -13 -9 -66 20 44 20 28 -37 35 -13 35 -69 65 25 63 -127 78 -26 5 148 -156
1112 -156 153 -222 95 24 -186 148 -169 155 30 -143 221 -217 220 -139 -151 401 -464 398 -243 57 179
1133 179 -538 682 -497 222 148 -512 499 -454 388 -50 -274 732 -894 673 -97 -492 680 -841
1151 -841 848 -746 193 493 -1161 1303 -888 169 339 -683 938 -1136 978 -232 -833 1580
1167 1580 -1558 932 -192 -320 843 -1388 1809 -1398 276 1155 -1873 1729 -1051 421 63 -870
1183 -870 1873 -2332 1654 56 -1549 2170 -1844 1382 -1019 221 1275 -2773 3045 -1831 -167
1198 -167 1644 -2135 1952 -1965 1703 -451 -1800 3612 -3497 1586 355 -1562 1883 -2397 2971
1213 2971 -2517 279 2639 -4318 3532 -1551 -215 891 -1647 3035 -3999 2914 215 -3525 4523
1228 4523 -3230 1443 -478 -276 1993 -4343 5136 -2966 -1019 3901 -4247 2877 -1940 1810 -284
1243 -284 -2726 5668 -5746 2300 1781 -3824 3456 -2923 3180 -2971 237 4098 -6918 5661 -1703
1258 -1703 -1894 2830 -2777 3602 -4941 3920 428 -5623 7410 -4983 1048 1121 -1571 2686 -5301
1273 -5301 6682 -4140 -1754 6718 -7162 4080 -1210 471 287 -3365 7227 -7999 3442
1286 3442 3242 -6884 5892 -3397 2427 -2447 112 5029 -9316 8197 -2085 -4009 5850 -4463
1300 -4463 3587 -4609 4247 394 -7132 10337 -7052 438 3715 -3933 3490 -5085 6948 -4778
1314 -4778 -2219 9099 -10114 5347 92 -2096 1849 -3626 7456 -8906 4160 4326 -9871
1327 -9871 8590 -3634 541 -342 -645 5138 -10107 9644 -2391 -6104 9187 -6514 3125 -2735
1341 -2735 2954 560 -7679 12041 -8897 230 6484 -7106 4619 -4023 5610 -4583 -2137 10295
1355 10295 -12650 6934 1228 -5246 4474 -3858 6455 -8485 4727 4552 -12003 11460 -4564
1368 -4564 -1446 2589 -2082 4691 -9451 10150 -3114 -7118 12072 -8981 2910 -162 575 1152
1382 1152 -7040 12131 -9858 533 8431 -10212 6034 -2715 2995 -2939 -1982 9906 -13303
1395 -13303 7910 2007 -7978 7196 -4268 4397 -6216 3931 4225 -12308 12725 -5176 -3165
1408 -3165 5878 -4184 4027 -7148 8500 -2995 -7076 13250 -10607 2758 2493 -2684 2294
1421 2294 -5725 10313 -9413 837 9036 -12229 7632 -1677 -178 -392 -2044 8426 -12388
1434 -12388 8239 1814 -9648 9762 -5134 2453 -3075 2290 3569 -11151 12735 -5902 -3663
1447 -3663 8140 -6427 3928 -4564 5898 -2372 -6037 12644 -11170 3076 4052 -5545 3895
1460 3895 -4475 7490 -7394 950 8353 -12411 8423 -1219 -2630 2322 -2617 6276 -9631 7093
1474 7093 1439 -9535 10559 -5690 811 172 -67 3051 -8556 10654 -5503 -3469 9024 -7808
1488 -7808 3674 -1938 2614 -1003 -4682 10305 -10037 3088 4570 -7186 5207 -3398 4097
1501 4097 -4572 571 6654 -10979 8205 -1278 -3935 4449 -3376 4288 -6437 5169 1024 -8071
1515 -8071 10005 -5894 190 2232 -2084 3020 -6068 7762 -4487 -2753 8248 -7995 4010
1528 4010 -647 -13 528 -3600 7524 -7850 2765 3879 -7156 5658 -2864 1733 -1728 -317
1542 -317 4882 -8295 6834 -1153 -4063 5377 -3753 2857 -3308 2779 948 -5933 7928 -5111
1556 -5111 -96 3186 -3410 2805 -3553 4509 -2712 -2028 6405 -6798 3446 253 -1765 1807 -2770
1571 -2770 4693 -4993 1948 2986 -6018 5142 -2301 299 283 -1168 3390 -5397 4694 -975 -3241
1586 -3241 4834 -3709 2010 -1320 846 1088 -3959 5452 -3740 83 2922 -3460 2681 -2157 2140
1601 2140 -1116 -1528 4303 -4909 2660 305 -2093 2181 -2209 2626 -2668 910 1970 -4125 3824
1616 3824 -1676 -266 1185 -1487 2207 -3034 2557 -383 -2266 3543 -2922 1303 -139 -427 1165
1631 1165 -2317 3027 -2157 -19 2002 -2620 1983 -1061 596 0 -1188 2407 -2834 1571 320
1646 320 -1649 1888 -1569 1260 -977 155 1202 -2250 2222 -1067 -342 1038 -1250 1327 -1324
1661 -1324 975 -15 -1291 2022 -1672 703 204 -682 934 -1346 1330 -890 -127 1117 -1525 1181
1677 1181 -583 -1 425 -803 1141 -1181 641 275 -932 1150 -864 572 -139 -191 659 -1023 948
1694 948 -336 -283 643 -716 558 -399 183 180 -642 765 -684 332 209 -445 538 -502 385 -211 -160
1713 -160 453 -546 406 -154 -138 249 -278 342 -209 78 155 -325 342 -261 101 54 -153 191 -253 169 -88
1734 -88 -33 151 -236 139 -85 -112 189 -221 193 -82 1 106 -122 188 -82 22 37 -78 110 -148 71 2
1756 2 -60 1 -4 -38 -54 -121 76 -66 61 -10 9 108 -99 69 -14 -27 -25 -63 2 8 1 -19 -15 47 15 65 58 -44 87 -49
1786 -49 21 -25 -3 57 -61 92 -49 42 -61 -37 -25 -94 177 -41 -31 50 -101 89 -76 52 61 -183 247 -197
1810 -197 101 -40 -140 166 -171 216 -136 24 203 -273 220 -163 22 148 -273 297 -357 208 116 -291
1830 -291 437 -390 284 -68 -96 317 -485 508 -295 -55 405 -519 449 -343 170 166 -467 798 -678 313
1850 313 203 -497 641 -676 627 -313 -260 757 -980 739 -226 -202 372 -597 824 -787 337 317
1868 317 -1004 1181 -854 305 123 -408 830 -1164 1180 -481 -520 1133 -1265 802 -399 79
1884 79 357 -1070 1548 -1369 415 747 -1317 1186 -1017 723 -415 -421 1573 -1964 1529 -267 -827
1901 -827 1186 -1239 1245 -1181 650 677 -1974 2307 -1419 137 702 -1029 1323 -1774 1755 -733
1917 -733 -1065 2314 -2287 1287 -251 -343 785 -1552 2344 -2156 495 1517 -2608 2158 -1186 548
1933 548 -100 -779 2159 -3094 2257 -109 -1781 2333 -1875 1290 -1094 625 1012 -2907 3411 -2033
1949 -2033 -313 1805 -1970 1740 -1895 1920 -824 -1597 3498 -3599 1661 376 -1373 1449 -1911
1964 -1911 2648 -2631 604 2262 -4024 3263 -1319 -255 687 -1177 2484 -3683 2984 -117 -2904
1979 -2904 3896 -2692 1204 -557 209 1272 -3433 4430 -2698 -661 3135 -3345 2185 -1535 1525
1994 1525 -601 -1904 4445 -4703 2117 1242 -2769 2499 -2097 2433 -2485 519 2844 -5148 4287
2009 4287 -1338 -1299 1901 -1778 2522 -3643 3118 81 -3839 5280 -3534 782 676 -848 1573 -3511
2025 -3511 4664 -3058 -964 4326 -4725 2671 -866 492 -26 -2027 4674 -5317 2502 1887 -4218
2040 -4218 3719 -2073 1618 -1738 384 2958 -5702 5177 -1471 -2248 3404 -2661 2221 -2862 2667
2055 2667 19 -4198 6224 -4455 597 1909 -2186 1925 -3018 4233 -3063 -974 5023 -5773
2069 -5773 3151 -222 -938 986 -2065 4267 -5155 2562 2277 -5290 4861 -2203 539 -440 -270 2825
2085 2825 -5435 5291 -1463 -2995 4721 -3452 1836 -1618 1586 334 -3970 6311 -4634 282
2099 282 3117 -3536 2496 -2239 2980 -2285 -1083 5025 -6184 3523 383 -2422 2208 -2055 3279
2114 3279 -4095 2155 2196 -5718 5393 -2409 -383 1088 -1100 2354 -4549 4690 -1463 -3028 5347
2129 5347 -4221 1587 -392 276 730 -3418 5542 -4411 357 3524 -4463 3024 -1652 1581 -1245
2144 -1245 -1059 4456 -5898 3531 614 -3210 3127 -2168 2213 -2702 1525 1932 -5186 5322 -2377
2159 -2377 -1020 2250 -1980 2048 -3237 3475 -1137 -2877 5235 -4285 1464 637 -1020 1209 -2566
2174 -2566 4152 -3514 270 3363 -4766 3199 -1022 196 -26 -1110 3409 -4671 3063 594 -3400
2189 -3400 3664 -2217 1275 -1205 614 1593 -4125 4551 -2256 -1066 2836 -2589 1873 -1996 2130
2204 2130 -646 -2322 4355 -3964 1344 1101 -1903 1666 -1977 2688 -2429 84 2862 -4151 3123
2219 3123 -778 -611 940 -1252 2455 -3309 2270 465 -3043 3469 -2190 616 -89 -257 1319 -2982
2235 -2982 3370 -1718 -1008 2774 -2651 1558 -997 759 14 -1697 3245 -3089 1035 1173 -2122 1866
2251 1866 -1365 1420 -1158 -189 2133 -3204 2415 -559 -1041 1468 -1312 1566 -1823 1227 455 -2317
2267 -2317 2796 -1815 278 507 -816 1176 -1844 2036 -1059 -806 2171 -2218 1300 -448 -44 442
2283 442 -1291 2135 -2012 688 871 -1796 1682 -1056 608 -327 -337 1368 -2096 1643 -326 -895
2299 -895 1257 -1258 1013 -838 455 423 -1513 1847 -1282 158 664 -921 927 -1123 990 -419
2315 -419 -646 1464 -1521 911 -77 -357 609 -865 1143 -996 320 665 -1302 1149 -660 209 198
2332 198 -446 850 -1053 849 -139 -724 946 -821 461 -331 -15 386 -859 1055 -655 -38 494
2349 494 -663 634 -510 349 -3 -383 808 -817 447 -39 -360 488 -515 486 -377 36 382
2366 382 -677 648 -368 19 197 -310 427 -429 333 41 -259 521 -436 224 13 -136 281 -315 380
2385 380 -218 -46 289 -391 310 -174 40 81 -214 245 -218 163 136 -180 255 -265 128 -26 -55 209 -287
2406 -287 218 -127 -95 158 -188 129 -87 38 79 -156 147 -108 82 21 -88 139 -95 37 16 -63 115 -136
2428 -136 92 -93 -7 74 -60 77 -56 13 23 -106 32 -8 -43 89 -90 70 -72 18 19 -69 130 -111 3
2451 3 -22 46 50 42 14 18 4 -11 -20 -4 -7 -48 -9 -25 63 -49 138 -12 -64 10 -97 98 30 -25 -15 -92 47 -50 -43 3 -58
2482 -58 71 -44 2 30 -53 87 -26 116 -62 -37 71 -64 132 -108 30 -7 -97 51 -139 38 -38 -51 110
2505 110 -165 43 -42 -84 102 -204 244 -59 43 52 -142 216 -158 154 43 -121 325 -176 191 0 -49 231
2527 231 -240 261 -181 -11 229 -295 287 -143 96 69 -172 373 -337 160 48 -302 348 -294 243 -132
2547 -132 -80 312 -546 435 -246 -100 281 -380 486 -297 279 77 -454 632 -512 206 94 -275 404 -490
2567 -490 541 -335 -96 594 -776 624 -222 -1 242 -460 701 -774 437 191 -705 780 -622
2584 -622 292 -140 -125 586 -964 975 -391 -303 816 -844 566 -476 260 90 -746 1140 -991 332
2602 332 396 -707 721 -694 746 -405 -220 964 -1344 924 -208 -358 530 -625 923 -1056
2618 -1056 532 399 -1206 1300 -877 194 170 -397 729 -1256 1207 -477 -717 1395 -1238 733
2634 733 -378 127 230 -1041 1658 -1333 261 802 -1288 1068 -755 610 -370 -284 1444 -1855 1323
2651 1323 -133 -900 1068 -965 983 -1030 562 589 -1712 1986 -1201 -46 653 -760 951 -1388
2667 -1388 1415 -589 -894 1960 -1874 876 -55 -323 561 -1232 1874 -1699 406 1226 -1948 1582
2683 1582 -765 318 -208 -485 1541 -2209 1620 -4 -1407 1737 -1219 852 -795 412 685 -2039
2699 -2039 2476 -1377 -267 1239 -1313 1078 -1209 1296 -532 -1134 2398 -2293 1010 403 -914
2714 -914 933 -1167 1753 -1665 378 1495 -2538 2016 -744 -164 405 -672 1466 -2226 1731 43
2730 43 -1852 2313 -1590 624 -296 83 786 -2048 2613 -1530 -450 1908 -1916 1237 -821 884
2746 884 -360 -1113 2502 -2605 1091 766 -1629 1387 -1088 1336 -1399 286 1549 -2787 2310 -666
2762 -666 -651 990 -895 1359 -1924 1618 90 -2093 2718 -1852 405 345 -496 842 -1745 2368
2778 2368 -1464 -526 2236 -2391 1411 -446 268 54 -1078 2331 -2554 1099 905 -2145 1860 -1052
2794 -1052 798 -836 99 1453 -2668 2387 -679 -1095 1549 -1242 1007 -1365 1208 68 -1910
2809 -1910 2715 -1952 307 896 -1040 989 -1383 1931 -1309 -479 2177 -2551 1526 -214 -349 477
2825 477 -962 1862 -2221 1074 921 -2239 2034 -994 381 -184 -206 1314 -2315 2224 -653 -1142
2841 -1142 1896 -1539 874 -697 652 183 -1604 2456 -1859 255 1136 -1406 1111 -981 1185
2856 1185 -815 -468 1964 -2276 1404 -35 -851 932 -914 1291 -1565 839 846 -2034 1981 -1030
2872 -1030 -35 401 -513 962 -1672 1670 -556 -1169 1897 -1524 756 -184 42 389 -1201 1900 -1529
2889 -1529 221 1146 -1551 1138 -669 589 -350 -433 1480 -1920 1238 25 -1051 1103 -874 851
2905 851 -932 465 635 -1683 1768 -919 -205 708 -690 788 -1094 1074 -402 -840 1640 -1447
2921 -1447 642 56 -339 491 -950 1265 -1062 183 965 -1375 1100 -429 122 77 -443 1062 -1369
2938 -1369 896 179 -901 1163 -799 507 -380 136 529 -1097 1279 -736 -199 746 -788 594
2954 594 -627 503 -79 -622 1179 -1102 405 216 -516 478 -618 781 -551 9 694 -1082 792
2971 792 -343 -114 282 -436 680 -838 434 103 -637 823 -610 288 -68 -129 365 -687 728 -425
2989 -425 -203 547 -665 490 -442 200 109 -397 673 -713 275 213 -512 535 -381 312 -155 -59 449
3008 449 -674 564 -203 -115 344 -363 448 -364 198 133 -494 498 -448 127 70 -214 321 -401 336 -206
3028 -206 -135 349 -379 274 -129 3 165 -297 316 -322 151 127 -333 320 -263 107 -71 -70 308 -342 290
3049 290 -91 -107 182 -219 233 -155 36 112 -174 249 -178 -30 39 -219 144 -148 92 -83 -125 190 -159
3070 -159 118 -12 -91 190 -154 134 -128 -24 30 -257 194 -97 -12 41 -103 101 -80 67 -27 -31 174 -140
3092 -140 22 17 -29 46 -94 39 -10 -41 16 -147 72 -66 31 85 7 55 0 11 38 -29 42 -47 54 51 -53 32 -64
3119 -64 100 -28 -63 47 -4 20 27 30 5 -61 53 -64 -53 15 -23 -28 -45 0 46 29 41 42 14 37 -4 119 -73 -26 -30
3148 -30 -4 53 4 82 -34 34 -12 -27 53 30 12 42 -28 101 -72 13 -82 -41 78 -32 7 -65 44 38 4 32 -59 87
3176 87 -60 -2 98 -19 92 -69 -22 92 -69 110 47 32 23 -69 100 -95 80 9 -110 62 -102 180 -63
3199 -63 -27 137 -123 54 -118 98 62 -103 127 -134 77 -7 -102 88 -197 92 24 -81 158 -126 189 -72
3221 -72 5 85 -152 187 -90 -4 -10 -127 160 -226 211 -6 -97 250 -220 135 -76 51 90 -175 286 -239 -7
3244 -7 136 -268 203 -211 145 -49 -195 288 -345 185 -20 -187 236 -241 244 -130 48 159 -396 325 -170
3265 -170 45 117 -196 223 -311 321 -102 -232 429 -360 209 -19 -31 230 -340 415 -312 -3 254 -435 369
3286 369 -217 45 3 -215 396 -519 321 14 -334 448 -356 287 -239 -29 258 -556 542 -294 -85 320
3306 320 -371 388 -396 297 -19 -399 627 -527 279 153 -234 302 -452 563 -374 -17 506 -628 519
3325 519 -147 -22 128 -361 602 -655 410 181 -647 689 -498 240 -155 -22 404 -752 682 -322
3343 -322 -170 533 -555 443 -361 333 7 -603 857 -767 187 210 -475 449 -458 541 -467 -101 663
3362 663 -985 680 -227 -224 381 -413 627 -754 424 146 -792 925 -632 108 72 -131 472 -833
3380 -833 866 -378 -303 829 -717 436 -186 181 76 -602 1051 -926 220 443 -720 663 -475
3397 -475 462 -335 -122 799 -1126 793 -92 -455 543 -455 604 -626 446 180 -914 1130 -642
3414 -642 22 296 -344 454 -727 871 -410 -415 1025 -1074 511 -42 -145 207 -575 986 -902 294
3432 294 544 -1009 843 -417 170 -97 -192 762 -1186 890 -142 -658 814 -614 406 -423 247
3449 247 267 -1011 1182 -706 -52 546 -645 555 -582 698 -359 -398 1082 -1120 490 120 -370
3466 -370 377 -515 847 -781 234 618 -1100 911 -381 -20 145 -297 608 -1037 787 -18 -725
3483 -725 1002 -723 357 -202 37 287 -865 1079 -649 -71 738 -790 555 -324 368 -164 -430
3500 -430 1030 -1120 542 234 -598 548 -476 575 -638 163 574 -1049 940 -280 -174 365 -391
3517 -391 514 -762 669 -6 -717 1012 -704 255 -10 -161 273 -687 838 -557 -156 781 -857 551
3535 551 -187 101 56 -368 850 -877 443 275 -735 637 -421 347 -304 17 486 -918 863 -275
3553 -275 -293 546 -465 394 -446 392 40 -637 922 -711 216 231 -337 346 -503 619 -487 -137 717
3572 717 -792 516 -198 -152 182 -309 655 -750 367 243 -696 695 -388 177 -156 -117 380 -719
3590 -719 669 -210 -293 552 -509 328 -284 206 31 -456 787 -651 111 275 -403 391 -337 427 -270
3609 -270 -63 531 -641 406 -72 -129 310 -353 403 -429 240 184 -556 584 -333 88 124 -209 364 -419
3629 -419 393 -177 -294 528 -509 225 -64 -43 94 -372 513 -396 38 252 -408 364 -200 103 -62 -88
3649 -88 340 -405 269 -8 -224 281 -345 260 -225 83 203 -425 431 -185 -57 222 -183 158 -241 241
3669 241 -54 -124 352 -338 202 -76 -44 137 -220 255 -215 -38 169 -330 250 -130 124 136 -110 206 -255
3690 -255 217 -44 -238 216 -211 133 -67 -33 82 -203 263 -130 -34 122 -198 167 -117 123 44 -78 218
3711 218 -224 128 56 -67 104 -117 164 -96 -73 162 -218 96 -39 -5 31 -115 121 -144 82 -11 -190 107
3733 107 -122 126 -20 -68 72 -122 87 -113 7 151 -108 51 -115 -17 38 -100 136 -102 10 -28 -61 135
3755 135 -24 -16 11 -42 83 -111 48 -25 -7 87 -9 32 2 20 3 -58 37 -18 76 43 -94 -41 -64 101 -54 -34 39
3782 39 -69 -5 2 11 55 -82 82 -84 62 46 -59 56 -20 -10 10 -63 92 -79 60 3 5 49 78 43 -9 -5 56
3809 56 -26 55 -64 -17 10 -37 -8 -14 70 84 -63 -29 -26 -21 34 -97 -43 5 -6 49 28 -26 19 -21 39 49 3 7 10 -31 24
3840 24 76 -6 79 -57 -26 35 -19 7 -60 -11 -30 -40 -14 -63 31 -45 22 50 -25 62 -23 26 -72 -11 44 -5 10 -23 -15 57
3870 57 11 -12 -20 54 52 -64 68 -68 27 -19 -22 43 -41 22 -29 -49 97 -64 3 -27 47 102 -47 84 26 -14 101 -58
3898 -58 30 32 11 -8 -17 78 -159 78 -49 -13 30 -103 38 -56 9 70 8 95 -106 21 28 7 35 -130 -1 -7 -43 53
3926 53 -101 100 -30 -19 50 -154 188 -109 54 89 -198 142 -149 -13 -27 -62 101 -172 103 -74 -61 151
3948 151 -171 34 -96 -34 -22 -181 181 -178 5 57 -200 85 -144 101 -75 -75 156 -167 150 -91 -68 89
3970 89 -114 204 -172 14 123 -210 162 -109 68 47 -142 196 -221 186 -1 -68 159 -198 37 -87 -10
3991 -10 76 -178 217 -186 -6 155 -236 152 -113 106 -31 -111 309 -315 173 33 -56 202 -156 188 -174
4012 -174 77 168 -361 252 -39 -33 149 -102 242 -306 243 -82 -215 315 -241 90 -34 -48 162 -278 356
4033 356 -221 -3 216 -318 210 -163 102 -47 -135 320 -327 195 35 -274 243 -187 149 -194 -41 197
4053 197 -410 405 -103 -83 156 -199 261 -312 236 -12 -223 435 -323 134 16 -110 186 -201 389 -289
4073 -289 -74 259 -415 303 -117 -20 65 -202 365 -356 241 72 -331 354 -233 92 -40 -18 230 -399 430
4094 430 -171 -167 319 -316 165 -156 193 -3 -265 516 -354 112 210 -292 197 -239 245 -162 -45 373 -460
4115 -460 348 -15 -110 169 -233 254 -346 248 124 -462 467 -272 60 91 -98 249 -444 435 -166 -217 441
4136 441 -390 195 -133 40 77 -233 458 -463 63 200 -324 260 -141 166 -116 -126 289 -466 343 -48 -158
4157 -158 243 -197 232 -224 139 141 -430 425 -247 -38 180 -130 182 -350 282 -136 -154 474 -438 217 -31
4178 -31 -53 165 -272 369 -298 15 228 -357 299 -162 103 -5 -77 386 -436 336 28 -203 340 -259 171
4199 171 -211 60 125 -343 453 -185 -43 214 -233 192 -255 204 -61 -216 395 -444 176 87 -197 173 -228
4220 -228 259 -252 78 247 -332 272 -95 22 59 -72 246 -312 216 -1 -317 353 -240 135 -104 -11 190
4241 190 -296 336 -173 -67 300 -262 178 -80 155 -23 -188 305 -388 136 -25 -247 229 -173 124 -117
4261 -117 -64 204 -436 285 -71 -104 191 -191 180 -164 96 33 -207 286 -199 11 26 -100 125 -239 264
4282 264 -97 -71 205 -243 149 24 88 47 -104 204 -226 66 109 -116 194 -69 169 -48 -26 145 -163 163
4304 163 -86 -120 60 -158 94 -163 18 16 -179 263 -209 106 126 -74 166 -84 143 -53 -66 140 -214 118
4326 118 1 -17 46 -171 216 -171 -12 91 -183 132 -76 52 2 -7 104 -208 86 4 -74 128 -188 84
4348 84 -28 31 49 -89 166 -111 -27 113 -142 91 -71 80 -8 -89 149 -130 62 -88 -48 133 -64 43
4370 43 -8 12 103 -97 124 -57 35 0 -109 92 -66 13 4 -72 38 -131 1 -6 -48 -4 -20 107 -72 -20 102
4395 102 -14 88 -42 -33 7 -72 67 -21 20 19 -44 74 -32 21 3 66 62 -71 58 42 -91 26 20 69 -48 7
4421 7 39 22 24 -2 -33 61 31 11 -40 53 -27 16 10 -88 35 -13 -25 -1 -43 96 -32 -12 -12 -51 45 -46 10 10 -39 4 -51
4452 -51 23 -53 -51 72 -51 54 29 -67 79 38 6 14 -22 0 -23 -1 -24 -56 -46 -4 76 4 -8 26 67 12 -51 1 -9
4481 -9 -16 -48 -42 17 -10 -7 1 -45 -22 37 -65 -29 -12 32 -52 -4 83 -34 30 -3 -17 39 -18 32 21 9 10 22 7 52 -57 40
4513 40 22 15 14 10 -39 1 -38 9 -12 -17 24 -19 -71 -5 6 76 5 -17 9 -9 -39 -30 30 8 -6 3 28 -17 -54 1 -4 54 18 -25
4547 -25 30 48 12 14 -29 -26 47 -17 -15 -39 37 -11 8 0 27 69 -26 41 74 -16 22 36 54 -28 -86 35 52 34 -13 16 35 54
4579 54 -24 -33 -91 51 -4 -39 -36 -14 19 -20 -3 -24 4 11 -118 146 -9 41 -22 -52 45 -12 3 -30 -46 -23 -40 61 -132
4608 -132 -54 -13 32 25 -106 57 -10 5 66 -64 16 7 -31 82 -80 85 -8 50 43 -50 18 -33 -8 58 -109 33 -43
4635 -43 67 4 -13 86 -16 -3 3 -13 47 10 75 -59 2 59 -58 -16 -29 4 26 -35 102 -78 24 -2 -91 77 -1
4662 -1 95 2 22 -8 -40 60 11 -45 100 -66 73 -69 60 -1 -104 91 -87 74 62 -47 26 -103 63 -15
4686 -15 -68 92 -193 53 -41 76 47 -54 103 -103 44 22 -78 56 -106 40 -37 41 46 -142 103 -44 -91
4709 -91 35 -99 11 -123 61 -4 -66 96 -106 62 45 -64 72 -131 76 -110 -1 62 -185 48 -28 2
4731 2 94 -79 98 -118 0 39 -118 100 -90 43 4 -41 82 -147 126 -86 -13 94 -78 7 -34 22 -14 -103
4755 -103 145 -116 2 92 -97 81 -42 113 -98 5 183 -175 98 7 -30 73 -63 118 -90 99 -3
4776 -3 -128 165 -92 51 80 -68 86 -119 143 -15 -88 145 -119 98 -17 -53 8 -76 123 -105 20 150
4798 150 -101 116 2 57 -27 -38 125 -213 90 51 -64 165 -45 72 -18 27 39 -221 139 -55 -43 123 -103
4821 -103 88 -166 81 35 -112 187 -143 70 12 -73 52 -47 90 -51 -25 133 -160 96 -43 -7 34 -51 105
4844 105 -116 59 8 -225 102 -110 26 -1 -6 173 -43 141 -48 19 153 -129 65 -93 25 8 -153 145
4866 145 -120 46 59 -132 59 -88 57 -70 -1 94 -141 82 -47 -2 69 -116 71 -68 6 14 -83 115 -72
4889 -72 -15 34 11 71 -246 113 -24 -51 113 -120 71 -30 -27 38 -100 148 -126 -5 115 -95 107 -96 10
4912 10 -9 -65 94 -154 98 39 -4 97 -67 78 -113 1 68 -56 133 -25 15 29 -94 69 -101 29 35
4935 35 -61 138 -81 58 -27 -20 86 -132 106 -78 11 107 -138 79 0 18 59 -55 64 -108 51 16 -119 73
4959 73 -102 -23 -10 -45 43 -85 144 -43 -52 -5 -68 71 -63 27 -10 -78 41 -72 57 32 -86 96 -75 112
4983 112 -70 -37 9 -55 26 -13 -42 -66 -87 79 -84 24 -43 -75 128 -106 -18 -57 -52 104 -139 84 -11 1 57 -97
5009 -97 23 -27 68 37 -75 36 -63 -14 66 -69 81 -28 44 33 -22 119 -94 49 80 -21 69 -77 56 -54
5033 -54 0 26 -124 23 -41 45 45 -31 56 -24 13 40 -88 14 -33 44 63 -62 -9 -54 42 -76 42 20 -12 57 12
5060 12 -38 -3 4 64 -44 -74 -49 -41 28 -27 -34 -59 -3 51 -71 62 -62 -42 -14 -105 29 -52 -34 4 -20 2 -16 -15 17 -51
5090 -51 -6 14 -8 -15 -8 31 -72 43 -43 -43 -3 -76 54 -52 12 -33 -43 0 -68 -19 58 -25 39 27 22 2 -26 14 -20 52
5120 52 29 -32 56 -4 8 -15 -26 17 -69 97 13 3 35 -15 34 -27 9 23 -10 -9 3 37 36 6 4 -13 18 -7 2 -43 -92 27
5152 27 -20 -56 17 81 -21 -25 -5 -18 -13 -23 -12 -67 -46 -34 59 54 0 -117 -42 4 29 54 30 -22 -41 1 64 -2 -20 21 34
5183 34 15 -8 16 -24 50 0 -14 -5 9 -23 -17 -54 -21 -16 -30 -67 -1 -25 21 -36 -32 -59 5 67 -54 21 45 31 -63 -26 38 26
5215 26 -40 6 -1 -32 -76 -35 -37 -27 -3 -21 -35 21 36 -22 -10 -5 62 -33 -12 11 -4 -10 3 23 27 9 -11 -7 47 7 -41 -47 18 -6
5249 -6 22 9 16 29 2 29 1 -7 -62 2 -2 83 77 -15 44 56 -90 21 -9 5 -50 53 17 -39 2 -29 -22 -10 -40 -1 -30 2
5281 2 11 7 -33 13 -10 -19 -8 39 29 51 -74 -14 18 7 15 14 -7 40 -22 16 49 -20 16 -2 -9 -55 30 -79 14 23 -3 67 -37
5314 -37 -14 95 15 24 0 21 6 -125 28 -81 -42 7 26 11 -61 16 -63 -30 -39 -73 29 -81 -3 109 -24 0 -61
5341 -61 52 -8 -76 7 -53 40 -63 -30 45 -70 38 -81 -24 67 -181 86 -26 23 26 -66 28 -105 3 -17 25 23
5367 23 -110 71 -3 -68 38 16 112 -54 7 73 -14 81 -27 29 -15 -23 20 -94 37 -51 20 63 -123 93 -50 -4
5393 -4 27 -83 62 -100 1 16 -61 132 0 28 -14 -108 8 -120 106 -66 -55 118 -92 24 34 -11 35 -112
5417 -112 102 -121 30 0 -39 114 -119 93 20 19 61 -67 42 27 -54 61 -119 79 -82 64 42 -101 81
5440 81 -118 0 5 -81 6 -112 85 -17 -91 91 -149 8 -68 -25 66 -68 49 -122 -56 78 -115 71 -36
5463 -36 -20 -23 -96 118 -89 60 29 -47 120 -15 8 -58 49 35 -200 169 -35 -47 66 -126 99 -62 31 -29
5487 -29 -162 122 -199 14 37 -51 71 -77 88 -126 -1 99 -148 148 -48 -29 -30 -52 122 -94 73 17 -117
5510 -117 166 -82 32 15 22 34 -108 137 -61 -39 107 -165 135 -102 33 75 -143 137 -144 99 -22 -130
5532 -130 133 -107 82 -29 -28 95 -104 160 -49 32 55 -62 104 -48 106 16 -133 139 -96 23 25 -33 92
5555 92 -191 34 -41 -25 133 -187 139 -27 -38 7 -92 90 -132 75 74 -86 75 -135 104 -59 -21 95 -154
5578 -154 175 19 -12 108 -60 127 -59 26 26 -118 147 -89 59 21 -71 65 -89 122 -55 -55 117 -147 56
5601 56 -35 42 74 -70 52 -167 37 101 -145 168 -137 33 -3 -49 96 -139 82 -29 -61 69 -58 109 -63
5624 -63 17 20 -111 128 -49 4 58 -73 60 -84 70 -38 -16 102 -153 114 6 -90 15 -96 122 -95 53
5647 53 46 -127 137 -77 -33 -37 -37 126 -106 104 -31 -44 67 -50 83 33 -92 -2 -134 67 -70 7 38 -71
5671 -71 60 -96 31 -53 -72 149 -190 2 -33 -68 112 -67 5 -48 -24 47 -132 148 -28 -10 81 -29 99 -44
5695 -44 4 -25 -79 64 -67 77 -5 -28 62 -68 154 -62 24 104 -92 7 -25 -6 22 29 88 -62 26 -15 -77 22 -27
5722 -27 15 52 9 6 -84 42 -57 -39 4 -94 44 -11 39 12 -63 68 -42 20 -46 -11 70 -45 36 30 -63 48 -29 33
5750 33 -2 -14 -15 -41 75 -42 -52 -29 -6 74 -34 -26 52 -35 96 -17 69 -21 -28 52 -73 95 6 -66 11 -19 -30 -52
5778 -52 -25 -2 -24 22 -32 3 24 -26 -4 -58 -66 24 -58 18 -22 -37 -16 -75 48 -66 -8 52 -55 37 -99 -13 -3 47 -39
5807 -39 -24 54 -14 2 12 26 -18 -4 -43 -33 -28 5 -34 21 -2 -43 5 -19 39 -16 40 15 -42 6 -7 -25 -51 -21 30 12 -36
5838 -36 -54 -51 24 3 6 -25 1 36 -51 44 -9 -3 -68 -6 28 40 -42 13 -37 -7 -4 26 -29 4 27 -50 21 -14 3 15 -57 31
5870 31 53 -46 40 -6 27 -33 -58 8 -56 38 57 -50 -62 4 42 20 46 -68 20 -72 -17 0 -21 -28 -31 -16 50 -65 -19 -10
5900 -10 -6 27 15 32 46 -45 11 -2 23 10 -3 40 -16 -59 -32 14 19 13 34 -2 -52 -35 3 28 37 43 8 51 12 -17 -37 -81 -2
5933 -2 -8 32 52 -8 -54 -45 -20 3 -51 29 -11 -48 -6 8 78 -21 6 -55 -78 58 -44 -26 41 -25 -3 15 7 -6 -41 27 -7
5964 -7 63 -18 -43 22 -50 18 -34 1 -47 38 41 -25 33 24 -52 77 9 26 29 13 16 -14 -62 -25 -1 32 1 66 -28 -6 29 -57
5996 -57 28 -44 70 -51 -29 -23 -51 47 -51 -18 43 -73 49 -70 22 -29 -28 32 -34 38 38 -81 31 -6 83 -23 -56 70
6024 70 -75 31 -86 17 -71 -128 76 -96 -31 9 -39 55 -58 88 -19 41 -19 -151 75 -29 -37 -7 -39 96
6048 96 -128 42 65 -42 23 -31 62 30 -19 37 -95 117 24 -78 128 -90 -16 14 -100 34 -111 66 -92 -27
6072 -27 51 20 24 -88 41 -62 -17 89 -138 67 -75 -2 60 -76 63 -77 -18 7 -82 96 -76 53 65 -29
6096 -29 49 -84 113 -1 -50 114 -90 61 -26 -32 87 -144 91 -128 72 92 -84 40 22 -4 17 -90 43
6119 43 -140 160 -61 -86 104 -55 32 -61 18 28 -110 115 -18 13 65 -45 75 -80 81 -8 -97 121 -133
6142 -133 48 23 -103 116 -136 95 -21 23 39 -122 122 -57 3 89 6 94 -128 110 -30 -47 132 -97 69
6165 69 8 34 84 -167 164 -88 -10 97 -126 128 -46 13 -26 -12 118 -177 116 35 -114 116 -113 83 -95
6188 -95 10 93 -140 143 -55 -50 50 -58 98 -149 151 -34 -85 148 -144 77 9 -92 96 -82 148 -82
6210 -82 -40 144 -73 118 -36 45 19 -99 134 -207 6 43 -84 111 -105 130 -52 -3 83 -140 148 -66
6232 -66 -110 56 -152 86 -77 58 38 -135 136 -207 92 3 -126 71 -128 136 -144 -111 155 -222 83 -12
6254 -12 -34 44 -122 94 -134 80 31 -124 95 -131 12 -53 -30 75 -190 138 -64 -39 157 -108 103 -81
6276 -81 21 12 -130 179 -72 67 96 -120 57 -90 103 -20 -16 148 -184 70 -52 -25 26 -62 59 -74 95
6299 95 52 -142 111 -122 -37 16 -28 47 -113 123 -21 -75 162 -87 87 -2 -41 17 -123 73 -70 46 71 -125
6323 -125 116 -65 -4 9 -37 106 -157 127 30 -79 105 -100 61 -80 79 39 -88 116 -46 95 63 -101
6345 -101 40 -73 72 -53 -148 112 -77 54 27 16 46 -35 91 -63 36 38 -136 75 -39 14 0 -51 104 -66
6369 -66 41 33 -89 64 -96 -7 -30 1 83 -95 54 -65 -68 76 -9 178 -87 74 0 -10 96 -81 -11 48 11
6394 11 77 -129 36 -40 -17 108 -49 116 -90 -63 70 -34 67 -20 18 100 -52 63 -29 22 32 -22 134 -63
6418 -63 88 -22 -20 35 -49 57 -2 21 -17 -47 22 -10 -21 55 -30 47 -87 27 11 -53 43 -79 9 31 31 42 -9 36
6446 36 -58 -43 10 -33 24 -65 1 35 0 20 -57 1 46 7 60 -44 -40 -5 16 6 -59 83 -74 79 20 -65 35 12
6474 12 31 68 -47 14 -23 47 -49 -6 6 -16 29 -13 -26 -3 -45 -32 -34 -73 -21 -25 24 -25 21 48 -16 84 33 23 -28 -34 50
6505 50 21 4 -31 -2 18 -37 20 2 8 38 -55 -35 -42 -1 15 56 23 13 8 -4 -14 -46 -29 -54 -27 -25 -8 -2 37 -33 -37 5 -23
6538 -23 76 -42 -6 44 -26 -20 -37 -78 -13 -4 40 15 54 -36 -35 5 -16 7 -8 -26 -31 23 67 -3 -31 49 -43 11 3 -36 42 14
6570 14 48 0 24 -5 -13 56 12 2 -11 -29 6 -17 75 -2 36 21 -15 27 -64 14 1 62 4 -22 66 46 -19 -5 15 31 -8
6601 -8 0 -37 27 20 18 51 9 -17 42 -16 23 52 10 48 -51 46 -8 -65 151 -38 -49 34 4 20 -35 73 -18 15 0 -18 36
6632 36 21 55 48 -50 57 -50 2 -19 16 32 -16 1 -123 -37 -39 -9 62 -3 50 -22 -6 24 40 33 -48 -55 6 -34 3 5 -13
6663 -13 -20 -45 53 -50 12 7 32 48 20 -19 -40 -30 -6 -38 38 2 -14 -36 -67 17 -11 16 9 -84 67 2 65 -29 11 25 -92
6694 -92 -4 31 -64 100 -32 60 -89 78 70 -102 2 -62 27 14 -35 59 -74 102 -7 -38 82 -63 32 -57 4
6719 4 -39 -58 59 -71 25 114 -40 91 -18 52 -50 17 102 -67 59 -66 -52 106 -71 114 3 32 -5 -130
6743 -130 150 -61 -19 3 -97 65 -92 49 -7 -56 80 -115 96 21 19 27 -22 3 -50 -11 13 -50 115 -19 27
6768 27 -16 -62 121 -76 155 -16 -12 134 -105 47 -35 61 49 -59 164 -93 -33 68 -13 116 -95 13 -21 -59
6792 -59 49 -135 106 -68 -1 44 -72 74 -118 73 19 -92 127 -39 9 -24 -69 27 -82 45 10 -107 78
6815 78 -114 29 -30 14 12 -152 24 -16 66 102 -40 96 -70 65 -15 -103 116 -155 67 -8 -141 87 -107 117
6839 117 -101 -17 77 -142 180 -68 36 11 -170 67 -79 70 -55 -42 211 -126 91 -25 -12 77 -87 155
6861 155 -69 -23 63 -155 165 -61 27 -2 -20 170 -140 57 -10 -69 127 -69 100 -20 63 79 -135 154 -67
6884 -67 -45 79 -79 108 -49 118 12 -71 156 -155 70 59 -88 112 -97 190 -94 -20 151 -150 102 -47
6906 -47 31 48 -76 110 -67 120 42 -109 141 -80 108 -16 -22 75 -188 52 -71 -22 63 -145 65 -115 51
6929 51 -4 -115 151 -183 57 56 -102 53 -78 106 -30 -52 93 -158 100 -48 19 68 -115 137 -95 107
6951 107 45 -39 151 -101 69 -27 -25 133 -124 152 -111 2 33 -144 56 -45 57 78 -149 116 -118 72
6973 72 33 -88 133 -116 117 -56 -22 132 -100 146 -41 11 119 -90 72 7 57 -48 -82 113 -64 49
6995 49 26 -61 97 -118 157 -67 38 130 -139 102 -27 21 117 -56 112 -14 103 80 -67 130 -61 56
7017 56 -1 -66 80 -100 72 -57 -81 73 -28 89 -38 30 70 -147 70 -101 0 66 -89 70 -138 85
7039 85 -23 -38 114 -102 12 -6 -24 50 -71 69 -79 14 82 -47 77 -79 18 54 -68 22 -67 49 -10 -78
7063 -78 79 -46 15 27 -16 57 -99 73 -58 -5 -4 -74 109 -55 76 28 -27 62 -88 54 -7 -46 9 -92 43
7088 43 5 6 51 -82 93 13 19 92 14 41 -53 0 50 -10 44 -57 43 9 -28 82 -40 -2 -20 26 30 10 9 -10 19
7117 19 39 -58 68 -77 50 20 -4 80 -56 25 -35 -5 16 -67 3 -3 18 10 -61 29 -56 39 0 -12 72 2 34 -25 -47
7146 -47 59 -26 51 -18 -87 31 -22 84 -32 23 53 -14 70 16 -18 -9 -73 36 -40 -3 11 14 59 2 -9 18 -4 99
7174 99 -28 -12 -38 -28 30 -44 57 1 30 13 -14 9 27 -4 17 -17 73 9 24 24 8 12 -84 54 49 8 -26 -12 120 -39
7204 -39 9 29 36 -32 -76 -6 5 -20 -29 25 -34 77 -57 64 -57 50 55 -63 39 -13 46 -21 -27 -13 -6 -20 41 -20 21
7233 21 39 29 -25 -21 3 40 53 -104 63 -17 -8 33 15 13 -74 19 -12 24 -5 -2 2 20 -10 25 -18 27 44 -18 56 -78 -12
7264 -12 -11 24 48 -26 -9 -21 4 67 -33 19 14 -1 55 28 11 36 77 -25 27 43 2 31 22 11 -10 -30 11 -81 60 29
7294 29 35 48 -57 15 43 -69 46 8 12 16 -8 23 -72 19 -1 -32 -21 -59 21 -5 13 -35 -11 49 7 27 -27 2 -18 -70
7324 -70 46 -46 36 31 -46 -11 -13 24 -9 11 44 -56 64 -30 -16 56 -27 46 4 -43 -11 -13 54 -44 22 32 -88 54 34
7353 34 19 55 -10 61 -19 47 10 20 -22 29 59 -70 27 14 -48 46 -62 27 5 -10 70 -94 24 -117 13 13 -78 18
7381 18 -68 0 -19 -63 31 -5 37 7 -47 15 -25 36 -1 29 24 -21 -19 -15 -42 85 -114 47 32 -16 41 -8 63 -57 70
7410 70 43 -49 35 -57 86 -14 -34 58 -33 35 28 -4 50 -1 38 -59 -12 45 -69 3 -78 -17 6 -77 28 -106 70 25
7438 25 10 101 -12 28 14 19 31 -57 85 -72 82 83 -73 61 -72 71 -24 -94 114 -5 36 3 -31 24 -103 102
7464 102 -11 -57 70 -24 83 -49 -2 48 16 149 -103 84 27 -28 106 -86 114 4 -31 57 -95 62 -75
7487 -75 -3 42 -126 131 -26 70 16 -81 98 -66 57 54 -53 67 -108 19 -56 -31 44 -136 101 19 21 47 -21
7512 -21 107 -125 67 16 -108 114 -36 81 -29 -49 114 -105 96 -40 -87 150 -111 80 -51 18 66 -140
7534 -140 122 -116 82 -16 -61 83 -77 58 -28 -69 60 -176 87 -21 -116 52 -135 80 -95 79 40 -98
7556 -98 135 -20 58 -16 -12 163 -53 113 -3 -72 92 -121 82 -51 62 63 -100 128 -38 40 -35 -112 75 -85
7580 -85 -2 -49 -80 73 -132 169 33 -37 52 -152 151 -103 25 76 -131 110 -150 36 95 -105 41 -87 36
7603 36 -38 10 92 -79 66 -68 -54 80 -42 91 -37 59 72 -133 85 -51 35 24 -44 64 -113 79 -75
7626 -75 9 154 -134 92 -46 54 75 -146 138 -156 27 29 -113 65 -33 100 -12 -53 193 -90 88 -35
7648 -35 -74 30 -90 88 -74 -18 80 -73 122 -90 -30 -9 -97 88 -166 36 30 -101 158 -99 9 -17 -58 90
7672 90 -44 104 -116 2 75 -51 98 -16 55 20 -115 65 -112 37 1 -71 18 -70 82 -32 -4 70 -82
7695 -82 43 -38 42 63 -55 104 -59 96 48 -72 41 -38 52 5 -66 49 -111 54 -86 -69 15 -127 64 -86
7719 -86 43 -11 -66 92 -51 33 23 -37 60 -17 13 -2 16 85 -76 63 -93 -5 19 -91 82 -42 78 29 -94
7744 -94 94 -63 36 -5 -30 49 -54 68 -75 -48 89 -62 92 13 -38 4 -55 61 32 64 -15 -4 68 -102 -31
7769 -31 -48 0 76 15 44 -31 -19 95 -4 -27 -35 24 14 -12 55 -71 21 0 -91 46 16 -21 36 -47 60 -37 43 53 -27
7798 -27 82 -98 9 -40 19 14 -43 26 -55 17 68 -21 60 -61 -14 -4 -50 38 -38 -14 37 -31 44 -44 34 -63 -11 -9 -51
7827 -51 115 -50 -24 10 41 11 15 -13 -6 -41 15 -17 53 -26 -10 73 -55 57 -137 -6 -25 -46 105 -2 -38 4 4 83
7855 83 -21 14 -18 8 38 -20 31 -40 -18 24 -1 27 -20 -29 19 -40 32 -43 -5 -12 -17 -18 -23 82 -2 18 -11 -10 -21 -11 -12 -60 -69
7888 -69 -54 51 -9 -8 50 6 71 -11 81 -59 60 -29 -2 -4 -47 32 -27 93 -91 -36 55 -43 15 -11 -89 2 7 -87 34
7917 34 13 -2 -15 66 34 -56 44 11 0 -47 97 -22 10 -29 3 -47 25 -36 20 -36 40 29 -69 51 9 53 -49 54
7945 54 -10 -65 -17 -29 -27 -34 -12 -10 -58 -2 -12 -17 -9 -13 2 -91 -20 48 -38 68 12 23 -27 64 49 7 8 -47 5 -52 -51 19 21 38
7979 38 64 -14 18 -28 14 7 -58 2 -13 -23 54 -43 -1 -53 65 -9 -4 -17 -78 48 -5 18 -11 -26 12 33 -9 37 -47 9
8009 9 -58 12 -10 -7 -12 -60 30 -42 -48 5 -37 36 -72 -1 -24 61 72 -66 37 -3 10 13 -47 5 -40 -60 -1 -1 -14 -5 14 -1
8041 -1 -26 19 -47 85 71 -52 34 -62 72 32 -54 -20 -39 101 -61 -50 35 -73 38 12 36 70 -19 24 -62 -23 -76
8068 -76 13 46 -49 24 -55 -3 3 27 96 -14 -5 -28 -43 61 -18 12 -48 -44 58 -93 50 -24 -2 85 -13 57 -21 48 5
8097 5 -15 43 -31 46 9 -52 20 -95 7 0 -82 47 -55 75 -69 -31 37 -55 36 30 65 46 -117 146 -11 1 20
8124 20 24 88 -97 82 -40 -43 80 -67 89 -28 5 -10 -79 139 0 54 18 -4 77 -23 14 -42 -45 77 -76 55
8150 55 18 -24 -38 -109 92 -95 -19 56 -37 123 -50 -16 19 -40 54 -70 91 -10 -29 69 1 94 -14 -79 25 -52
8176 -52 67 -83 79 101 -69 17 -134 21 49 -43 58 -68 117 2 -69
8191f9
$$ Imaginary data points
##PAGE= N=2
##DATA TABLE= (X++(I..I)), XYDATA
0 0 0 0 0 0 0 0 -8 8 -8 8 -16 16 -17 24 -32 34 -40 49 -58 69 -80 91 -105 121 -139 158 -179 203 -229 259
30 259 -290 323 -361 401 -449 499 -551 612 -677 749 -830 917 -1013 1122 -1243 1378 -1535
47 -1535 1712 -1919 2163 -2452 2805 -3241 3802 -4545 5576 -7097 9549 -14085 25040 -94889
61 -94889 -88430 161421 -76849 -3311 -31401 90737 -40946 -91301 163119 -111551 10471
72 10471 50685 -62407 61039 -63408 62683 -48477 6507 66921 -132259 123305 -30607
83 -30607 -63265 75494 -31334 26130 -80653 100093 -9766 -121201 155553 -66806 -29389
94 -29389 35035 5470 11829 -90612 127709 -58549 -55616 111279 -85182 36056 -14575
105 -14575 12476 4353 -47463 92998 -100401 45849 43709 -99579 80419 -25602 6726
116 6726 -28682 21569 51864 -125433 107776 -7736 -73137 69902 -27030 22560 -56519
127 -56519 58478 8046 -91495 113414 -59862 -10669 40647 -32224 28176 -49526 67801
138 67801 -42462 -25854 87618 -93328 44696 9261 -26032 16503 -23595 59374 -79464
149 -79464 38205 43479 -92157 68798 -14766 -6474 -7249 3591 41639 -84550 70065 -4388
161 -4388 -53409 62297 -37545 19049 -19992 18251 9338 -53396 76486 -52308 -3327 44839
173 44839 -45713 25372 -19513 30919 -26059 -15192 63931 -72982 32896 16034 -32809 21814
185 21814 -17811 34555 -45379 19945 31444 -64622 52569 -14794 -10395 11592 -10602 26268
197 26268 -45728 41278 -5937 -35707 52311 -37314 11791 1116 -1628 8616 -30777 49041
209 49041 -37274 -2441 37296 -40553 21593 -8922 11145 -9067 -12589 40312 -46179 22224
221 22224 10725 -27515 24373 -16930 17009 -18497 6945 18308 -39036 36694 -13575 -9716
233 -9716 17566 -14833 15165 -21189 20423 -3273 -21795 35117 -26778 6881 6770 -8779 9096
246 9096 -16962 25272 -19456 -2174 23196 -27305 16265 -4681 610 1488 -9528 20454 -23478
259 -23478 12610 5673 -18559 19426 -12360 6249 -4001 167 9938 -20626 21088 -8595 -7003
272 -7003 14090 -12053 8899 -8773 7431 344 -12017 18866 -15051 4211 5450 -8777 8532
285 8532 -9198 10431 -7222 -1951 11862 -15160 10320 -2807 -2211 4529 -6730 9135 -9590
298 -9590 5098 2867 -9848 11207 -7235 2035 785 -2490 5607 -9047 8952 -3502 -3712 7372
312 7372 -6899 4815 -3099 1180 1807 -5275 7164 -5817 1836 2655 -5163 4973 -3771 2733
326 2733 -1294 -1493 4786 -6030 4210 -956 -1590 2811 -3288 3229 -2591 936 1285 -3387 3969
341 3969 -2672 343 1113 -1785 2243 -2696 2238 -616 -1515 2335 -2313 1690 -887 -223 1196 -1532
357 -1532 1425 -1102 411 633 -1614 1490 -723 210 92 -579 1210 -1359 664 -42 -322 526 -728
374 -728 683 -200 -110 140 -170 282 -268 -114 296 -244 184 -119 64 158 -380 177 -76 168 -253 37 75
395 75 -12 -161 120 123 -176 86 -108 260 -263 -15 93 145 -116 -159 92 104 -111 -148 222 -125 45 -170 239
418 239 -27 -202 44 28 -138 86 -138 188 69 -372 416 -373 425 -354 40 534 -821 577 -469 216
438 216 177 -599 834 -718 380 186 -859 1224 -1139 489 55 -529 1170 -1836 1814 -772 -644
455 -644 1410 -1673 1577 -1194 474 616 -1802 2465 -2187 765 934 -2157 2314 -2059 1722 -899
471 -899 -937 2986 -3925 2923 -862 -1027 2101 -2703 2965 -2828 1350 1356 -3985 4810 -3164 587 1252
488 1252 -2166 3263 -4483 4370 -1643 -2554 5429 -5445 3456 -1298 -283 2039 -4355 6217 -5454
503 -5454 1445 3669 -6467 5686 -3536 2055 -772 -2279 6481 -8795 6401 -565 -4661 6462
517 6462 -5689 4693 -4149 1970 3057 -8716 10533 -6364 -582 5029 -5743 5536 -6561
530 -6561 6754 -2669 -5284 11625 -11347 5529 785 -3703 4589 -6504 9555 -9080 2178
543 2178 7770 -13181 10642 -4125 -269 1442 -3702 9138 -13336 10184 99 -10216 13173
556 13173 -9204 4388 -2588 1272 4306 -12743 16340 -9783 -2638 11285 -11337 7451 -6068
569 -6068 6551 -2895 -7303 17276 -17763 7588 4597 -10079 8719 -7751 10160 -10817 2825
582 2825 11365 -20626 16953 -4775 -4788 6616 -6198 10032 -15571 13480 6 -16005 21612
595 21612 -14220 3021 2044 -2069 5589 -14807 20955 -13767 -4187 18786 -19395 10228 -3355
608 -3355 3142 -1762 -8001 21030 -23774 10524 8655 -18471 15023 -8088 7304 -9323 3151
621 3151 13025 -26198 23209 -5540 -10775 14384 -9746 8783 -13696 13851 -494 -19343 28593
634 28593 -19247 1237 9084 -8394 6965 -13414 20838 -15541 -4676 24317 -26953 13488
646 13488 444 -3761 2163 -7770 20492 -25977 12924 11207 -26090 22140 -8906 2097 -3711
659 -3711 1500 12587 -28227 27576 -7293 -15735 23287 -15267 7194 -8515 10948 -840 -19946
672 -19946 33111 -24321 754 16533 -16781 9751 -10156 17097 -15086 -4061 27221 -33290
684 -33290 17518 3632 -12110 8547 -7831 16844 -24065 13852 11500 -31044 28474 -10272
696 -10272 -3780 4468 -2369 10701 -25350 27441 -8442 -17996 29666 -20499 5770 -1209 4093
709 4093 505 -17260 31587 -25450 912 21104 -23964 13114 -5970 9285 -10378 -3451 25331
722 25331 -34313 19695 5285 -19022 15482 -8408 10996 -17637 12023 9892 -31197 31765
734 31765 -12100 -8029 12803 -7720 8744 -19095 23595 -8942 -17368 32732 -25112 5874
746 5874 5318 -3994 3037 -13433 26689 -24461 2214 22327 -29003 16830 -3304 1149 -3774
759 -3774 -3451 20803 -31162 20271 4744 -22506 21257 -10301 5729 -9271 7747 7793 -26911
772 -26911 30411 -13073 -9379 18250 -12903 7632 -11473 15891 -6909 -14254 29850 -25385
784 -25385 6242 9279 -10824 6625 -9395 18182 -18710 2556 19525 -28460 18200 -1731
796 -1731 -5511 3260 -4383 14617 -23537 17272 3515 -21779 23264 -11560 1671 -1215 2139
809 2139 5956 -20132 25351 -12570 -8473 20071 -16220 7345 -5087 7692 -3807 -10689 24258
822 24258 -23006 6691 10125 -14797 9908 -6975 10497 -11804 1823 15219 -24553 17637
834 17637 -1892 -8365 8368 -6110 9677 -15291 12247 2374 -17900 21475 -11835 87
846 87 3993 -2876 5498 -13425 17565 -9736 -6372 17582 -16152 7100 -1095 919 88 -7476
860 -7476 16619 -17038 5656 8670 -14721 10794 -5231 4223 -5027 196 10280 -17675 13975
873 13975 -1809 -8531 10239 -6810 5632 -7637 6582 1829 -12728 16658 -10203 -304 6174
886 6174 -5924 5151 -7866 10267 -6204 -4322 13206 -13507 6409 480 -2757 2818 -5501
899 -5501 10075 -10702 3928 6238 -11961 9907 -4343 1040 -335 -1635 6744 -11207 9458
912 9458 -1581 -6434 9071 -6583 3749 -2965 2023 2016 -8045 10739 -7067 -305 5524 -6205
926 -6205 4597 -4304 4625 -2563 -2994 8385 -9057 4639 868 -3604 3735 -3853 4999 -5091
940 -5091 1788 3880 -7770 6971 -3027 -533 1708 -2343 4066 -5756 4863 -783 -4081 6214
954 6214 -4830 2164 -459 -441 1980 -4334 5558 -3825 -246 3721 -4718 3406 -2124 1428 -239
969 -239 -1990 4437 -4900 2713 537 -2724 3014 -2632 2216 -1719 233 2210 -4049 3801 -1763
984 -1763 -568 1746 -2108 2286 -2429 1822 -40 -2130 3298 -2690 1181 206 -1000 1518 -1999
999 -1999 2090 -1328 -306 1794 -2452 1822 -901 125 542 -1228 1854 -1875 984 341 -1311 1599
1015 1599 -1218 702 -261 -327 979 -1421 1298 -545 -401 985 -1089 867 -606 240 223 -808 1105
1032 1105 -879 319 69 -499 606 -578 416 -182 -229 558 -629 523 -110 -114 311 -475 485 -337 138
1051 138 125 -264 370 -324 130 58 -109 167 -148 131 -27 -208 199 -234 92 -29 -97 140 -125 95 -144
1072 -144 47 -30 -59 63 8 0 39 -5 -55 111 -61 106 -20 -21 -8 43 30 -59 66 2 -30 -88 50 -81 71 29
1098 29 66 26 -3 9 21 63 24 -19 2 140 -121 194 -48 -1 -60 -94 201 -162 163 -21 -58 171 -183 164 -93
1123 -93 -28 168 -399 363 -202 -13 280 -336 434 -486 284 -8 -356 564 -583 380 -138 -233 435 -611
1143 -611 661 -451 -155 705 -1020 859 -502 101 328 -671 1067 -1079 722 98 -873 1140 -929
1160 -929 611 -251 -200 887 -1493 1445 -573 -473 1214 -1357 1274 -1042 637 290 -1437 2191
1176 2191 -1798 658 455 -1124 1327 -1512 1590 -989 -392 2063 -2655 1902 -599 -558 1046 -1533
1192 -1533 2149 -2330 1253 800 -2680 3001 -1978 776 86 -826 1881 -3117 3008 -1255 -1357 3126
1208 3126 -2995 1976 -1189 553 659 -2741 4163 -3581 997 1805 -3024 2791 -2197 2049 -1329
1223 -1329 -880 3721 -5021 3519 -318 -2040 2651 -2624 2933 -3198 1828 1610 -4849 5515 -3231
1238 -3231 105 1550 -1920 2643 -4137 4399 -1780 -2623 5645 -5205 2530 -366 -452 1423 -3593
1253 -3593 5807 -5241 1149 3718 -5893 4590 -2271 1347 -935 -1229 5061 -7271 5308 -37
1267 -37 -4334 5205 -3712 2824 -3062 1970 2073 -6945 8250 -4728 -811 4065 -3895 3420 -4388
1282 -4388 5104 -2383 -3622 8401 -8193 3461 1250 -2736 2652 -4027 6580 -6595 1642 5489
1296 5489 -9197 7154 -2399 -355 704 -1803 5615 -8857 6955 14 -6850 8476 -5360
1309 -5360 2162 -1463 1176 2359 -7932 10276 -6057 -1857 7096 -6733 4037 -3344 4039 -2181
1323 -2181 -3962 10240 -10475 4190 3121 -5844 4585 -3937 5628 -6374 1760 6454 -11689
1336 -11689 9383 -2295 -2816 3468 -2956 5193 -8548 7581 -138 -8560 11572 -7258 1276
1349 1276 1170 -834 2598 -7637 10930 -7295 -2239 9778 -9975 5243 -1783 1787 -1257 -3851
1363 -3851 10669 -12186 5470 4211 -9064 7186 -3986 3695 -4765 1674 6369 -12955 11408
1376 11408 -2873 -5072 6844 -4740 4371 -6874 6873 -451 -9035 13428 -9088 771 3962
1389 3962 -3744 3195 -6321 9781 -7190 -2056 11035 -12288 6218 -100 -1357 953 -3599 9325
1403 9325 -11640 5766 4683 -11206 9600 -4084 1275 -1752 569 5497 -12127 11712 -3169
1416 -3169 -6422 9636 -6601 3494 -3946 4687 -310 -8371 13639 -10134 774 6310 -6682
1429 -6682 4272 -4509 7124 -5996 -1730 10763 -13337 7388 862 -4411 3544 -3635 7223
1442 7223 -9678 5565 4206 -11816 11222 -4627 -611 1340 -1204 4582 -9956 10595 -3425
1455 -3425 -6406 11078 -8208 3099 -1181 1698 560 -6789 11882 -9650 936 7160 -8656
1468 -8656 5285 -3051 3817 -3652 -1408 9036 -12210 7367 1174 -6268 5668 -3806 4581 -6364
1482 -6364 4047 3425 -10594 10988 -4838 -1880 3883 -2966 3653 -6828 7883 -2989 -5474
1495 -5474 10702 -8724 2840 980 -1245 1617 -5012 8969 -8088 1182 6647 -9209 6071
1508 6071 -2162 1012 -1016 -1552 6832 -9953 6707 843 -6580 6841 -4170 2756 -3341 2145
1522 2145 2673 -8436 9517 -4724 -1825 5070 -4366 3324 -4291 4941 -2001 -4152 8789 -7932
1536 -7932 2664 1822 -3087 2615 -3735 5760 -5488 855 5336 -8176 5927 -1597 -806 1075
1550 1075 -1886 4604 -6681 4864 608 -5638 6621 -4030 1431 -636 202 2157 -5727 6839
1564 6839 -3733 -1678 4950 -4720 2930 -2106 2114 -669 -2980 6285 -6075 2248 1893 -3659 3186
1579 3186 -2716 3120 -2899 196 3807 -6107 4806 -1313 -1400 2177 -2256 3052 -3987 2910 447
1594 447 -4058 5166 -3459 848 561 -1093 1989 -3601 4232 -2392 -1205 3884 -4087 2488 -1066
1609 -1066 390 394 -2063 3874 -3857 1538 1474 -3045 2798 -1929 1382 -955 -347 2408 -3858 3172
1625 3172 -829 -1320 2155 -1996 1807 -1838 1171 531 -2476 3286 -2326 385 898 -1341 1649 -1941
1641 -1941 1998 -1086 -883 2367 -2693 1641 -423 -443 834 -1393 1978 -1984 751 848 -1994 1894
1657 1894 -1093 451 12 -631 1381 -1928 1506 -435 -942 1576 -1449 1077 -679 198 494 -1277
1673 -1277 1670 -1219 188 658 -1030 946 -901 692 -192 -568 1208 -1305 860 -114 -458 711
1689 711 -789 843 -692 158 401 -916 913 -535 146 249 -430 636 -714 541 -101 -440 696
1706 696 -710 409 -149 -90 330 -562 547 -360 38 270 -441 374 -264 138 95 -232 328 -359 195 15
1726 15 -279 324 -321 255 -87 -48 233 -207 234 -117 -20 73 -152 178 -154 -19 91 -123 164 -128 137
1747 137 51 -103 77 -153 42 -10 -59 42 -97 52 -78 -41 5 -55 -47 -11 -16 5 -73 41 -86 -49 53 51 38 -84
1773 -84 22 -79 -48 40 -4 35 -13 -64 62 -5 53 7 23 104 -16 94 -84 96 -34 42 21 -62 45 -102 42
1798 42 41 -20 76 -13 -20 83 -115 115 -183 66 -57 -140 143 -212 141 -85 -20 97 -158 242 -200 61 108 -235
1822 -235 264 -230 192 -37 -178 387 -438 305 -46 -162 351 -433 380 -335 143 285 -481 485 -367 146
1842 146 152 -364 506 -625 418 -14 -433 722 -708 509 -198 -106 417 -773 854 -691 -24 591
1860 591 -794 732 -524 265 42 -527 1017 -1125 705 66 -703 894 -777 708 -644 121 694
1877 694 -1398 1339 -686 -105 670 -822 974 -1093 819 -53 -1031 1730 -1484 686 74 -541 856
1894 856 -1278 1552 -1162 -72 1362 -1828 1492 -742 159 232 -935 1784 -2078 1208 321 -1640
1910 -1640 1843 -1327 917 -596 -39 1142 -2356 2424 -1088 -597 1642 -1708 1389 -1280 1052
1925 1052 39 -1768 2904 -2508 835 770 -1400 1486 -1696 1951 -1522 -225 2357 -3147 2250
1940 2250 -615 -581 941 -1395 2175 -2723 1627 683 -2830 3222 -1933 599 62 -502 1649 -3065
1956 -3065 3241 -1526 -1296 2999 -2854 1707 -1069 725 203 -2191 3887 -3529 965 1756 -2741 2299
1972 2299 -1870 1827 -1517 -290 3078 -4511 3315 -548 -1640 2064 -1906 2297 -2868 1904 974
1987 974 -3922 4558 -2596 152 1138 -1327 1928 -3316 3740 -1751 -1824 4402 -4153 2024 -367 -104
2003 -104 692 -2517 4323 -4171 1180 2626 -4195 3327 -1668 1050 -859 -687 3462 -5240 4007 -209
2019 -209 -2962 3507 -2498 1940 -2210 1632 1109 -4579 5516 -3214 -385 2554 -2497 2098 -2830
2034 -2830 3413 -1839 -2125 5383 -5222 2263 547 -1579 1471 -2397 4112 -4287 1296 3175 -5573
2049 -5573 4404 -1617 -81 225 -973 3323 -5400 4349 -293 -3843 4949 -3311 1456 -1165 945
2064 945 1203 -4554 6056 -3709 -754 3794 -3765 2384 -2048 2481 -1300 -2139 5686 -5950 2589
2079 2589 1357 -3017 2563 -2252 3254 -3579 1092 3329 -6131 5039 -1500 -1282 1754 -1581 2825
2094 2825 -4500 3920 -157 -4294 5880 -3863 862 373 -427 1416 -3964 5528 -3616 -1039 4579
2109 4579 -4921 2722 -1027 980 -486 -2014 5088 -5823 2669 1840 -4159 3528 -2134 1973 -2309
2124 -2309 715 2990 -5988 5367 -1556 -2013 2981 -2349 2311 -3296 3095 -110 -4127 6028 -4165
2139 -4165 620 1446 -1627 1708 -3183 4441 -3079 -894 4702 -5311 2914 -375 -424 495 -1859 4177
2155 4177 -4930 2382 1832 -4549 4090 -2115 919 -827 14 2530 -5002 4754 -1370 -2307 3792 -2865
2171 -2865 1791 -1744 1673 144 -3433 5252 -3898 483 2258 -2639 1998 -2130 2802 -2057 -709
2186 -709 4007 -4921 2902 -21 -1491 1482 -1672 2899 -3488 1847 1522 -4229 4102 -1967 119
2201 119 396 -686 2027 -3699 3594 -1270 -2154 3703 -3041 1484 -699 548 515 -2595 4051 -3330
2217 -3330 423 2228 -2978 2080 -1524 1476 -1016 -793 3099 -3960 2499 93 -1858 1964 -1615
2232 -1615 1825 -2062 1018 1317 -3432 3492 -1719 -310 1199 -1232 1586 -2338 2363 -736 -1692
2247 -1692 3155 -2724 1135 69 -503 792 -1777 2703 -2254 227 1928 -2698 2006 -1003 360
2262 360 -107 -842 2186 -2776 1831 83 -1752 2053 -1413 1078 -868 391 992 -2316 2539 -1269
2278 -1269 -388 1295 -1392 1240 -1344 1247 -283 -1297 2311 -2114 917 242 -768 959 -1267
2293 -1267 1532 -1304 98 1348 -1992 1566 -612 -134 366 -844 1328 -1666 1100 134 -1260 1579
2309 1579 -1149 550 -214 -108 734 -1373 1454 -738 -318 1049 -1174 847 -566 315 72 -792 1423
2326 1423 -1319 545 244 -784 820 -720 634 -476 -51 770 -1157 925 -361 -245 542 -612
2342 -612 749 -735 402 213 -759 899 -747 291 56 -326 584 -660 688 -358 -195 636 -628
2359 -628 521 -180 -8 297 -451 646 -543 246 184 -531 520 -381 201 -126 -170 366 -539 366 -121
2378 -121 -216 353 -354 341 -337 148 194 -353 471 -287 69 168 -281 243 -216 151 -53 -160 303 -282 196
2399 196 -38 -97 126 -234 169 -121 -16 146 -175 172 -144 8 84 -116 171 -144 146 -11 -60 147 -124
2420 -124 74 -52 -42 90 -47 39 -68 -31 65 -149 96 -92 26 17 -79 6 -42 -28 32 -31 29 -106 -14 6 -65
2445 -65 79 -97 66 7 34 32 -46 4 -11 -22 34 -10 37 -53 -18 99 -45 83 -36 4 45 -52 73 -28 59 29
2471 29 6 28 21 72 -80 -18 -16 -40 48 -53 79 -4 -12 84 -113 13 4 -42 111 -58 105 -58 50 65 -53 111
2497 111 -103 117 -38 -101 158 -101 105 -74 39 75 -156 120 -174 124 44 -186 234 -192 91 6 -64 198
2519 198 -259 176 -12 -44 172 -234 236 -201 54 109 -309 380 -323 98 140 -232 287 -309 230 -126 -182
2540 -182 324 -473 200 -19 -111 248 -314 406 -361 114 231 -522 497 -377 139 92 -226 462 -509 414
2560 414 -104 -358 519 -579 348 -272 -35 318 -695 782 -509 116 443 -562 519 -440 333 -169
2578 -169 -340 773 -909 570 15 -325 510 -586 708 -516 210 488 -1021 1009 -523 39 218
2595 218 -470 684 -957 795 -145 -704 1139 -902 453 -159 -97 449 -951 1181 -793 -34 811
2612 811 -1114 832 -568 311 -57 -588 1222 -1453 763 170 -851 973 -782 699 -668 122
2628 122 757 -1482 1509 -653 -306 760 -811 883 -1057 896 -93 -1095 1664 -1367 482 233
2644 233 -481 677 -1112 1441 -1031 -174 1376 -1739 1187 -384 64 212 -724 1550 -1804 1037
2660 1037 409 -1431 1483 -1005 570 -473 5 887 -1962 1989 -805 -659 1370 -1316 989 -929
2676 -929 893 -25 -1350 2271 -1876 519 624 -1040 961 -1207 1425 -1119 -196 1830 -2358 1576
2692 1576 -285 -476 633 -927 1686 -1958 1175 572 -1978 2145 -1248 270 20 -289 1025 -2020
2708 -2020 2158 -901 -969 1952 -1866 981 -609 471 66 -1421 2507 -2170 530 1149 -1764 1314
2724 1314 -1029 1118 -926 -302 1895 -2720 1894 -140 -1024 1187 -1068 1355 -1703 1112 654 -2355
2740 -2355 2691 -1490 56 669 -690 1089 -1848 2176 -918 -1112 2409 -2201 1043 -98 -73 431
2756 431 -1435 2457 -2325 512 1401 -2282 1720 -910 593 -509 -339 1829 -2844 1973 -61 -1543
2772 -1543 1757 -1326 1004 -1211 761 673 -2368 2809 -1599 -212 1276 -1252 1118 -1439 1662
2787 1662 -767 -1068 2630 -2506 1078 337 -784 793 -1237 1933 -1988 478 1527 -2602 1997
2802 1997 -810 -19 137 -514 1605 -2476 1966 -35 -1727 2200 -1517 753 -512 307 615 -2069
2818 -2069 2676 -1634 -296 1615 -1670 1184 -1018 1092 -527 -934 2416 -2540 1159 552 -1238
2833 -1238 1076 -1095 1405 -1561 465 1322 -2541 2100 -740 -443 700 -710 1279 -1890 1574
2848 1574 -2 -1655 2270 -1639 474 44 -199 607 -1606 2132 -1369 -380 1701 -1908 1079 -527
2864 -527 385 -90 -802 1925 -2118 1026 563 -1508 1389 -961 872 -814 147 1149 -2158 1920
2880 1920 -591 -629 1034 -941 1009 -1157 1028 -24 -1351 2039 -1512 378 459 -529 746 -1147
2896 -1147 1433 -965 -263 1478 -1770 1120 -314 -89 255 -704 1358 -1600 820 437 -1417 1326
2912 1326 -850 400 -237 -36 819 -1552 1522 -547 -661 1143 -1022 688 -632 511 114 -1042
2928 -1042 1525 -1243 276 528 -792 715 -705 888 -599 -256 1173 -1498 939 -73 -344 474
2944 474 -708 911 -962 432 366 -1156 1152 -709 163 101 -330 547 -965 940 -359 -563 1039
2961 1039 -895 532 -240 78 195 -698 1094 -866 210 459 -809 647 -491 364 -157 -238 781
2978 781 -964 682 -17 -447 532 -493 551 -510 216 288 -739 834 -503 2 180 -336 428 -537
2996 -537 463 -124 -358 685 -641 316 -64 -68 293 -469 571 -405 56 416 -602 446 -319 66 24
3015 24 -286 496 -565 343 28 -256 466 -367 227 -194 -28 228 -480 494 -287 -32 184 -210 262 -261
3035 -261 213 23 -257 345 -384 215 54 -212 290 -260 185 -200 -13 197 -301 296 -107 -39 37 -179 234
3056 234 -223 193 42 -231 163 -190 86 -39 -87 206 -161 187 -61 -58 108 -145 145 -137 34 -16 -145
3077 -145 166 -146 72 11 -87 145 -162 106 -50 -60 65 -160 85 -74 -72 31 -141 100 -112 15 18 -60 61
3100 61 -122 19 54 -50 70 -36 25 -15 -8 78 -61 35 5 -55 -11 -49 -26 -14 -30 -8 -32 73 -58 7 -37 -119 9
3127 9 -32 5 -5 -37 21 16 2 35 13 59 -63 46 -2 -11 18 -68 60 -44 -23 47 -22 41 -42 20 29 -41 13 20 38 -15 51
3158 51 44 -26 80 -44 -49 -35 -49 90 -50 27 -7 -74 24 -69 -5 -65 -78 89 -42 5 -12 -14 16 -15 136 -17 33 19
3186 19 -32 105 -56 77 -56 -28 55 -60 109 -101 15 7 -62 114 -74 18 60 -76 196 -78 60 4 -51 76
3210 76 -156 52 -108 -6 96 -148 190 -145 77 64 -142 151 -251 117 103 -180 151 -215 89 -120 -126 157
3232 157 -292 210 -124 -68 53 -156 239 -252 85 22 -221 288 -223 113 21 -161 243 -285 222 -95 -57
3253 -57 308 -274 250 -104 -20 57 -271 314 -300 145 140 -262 325 -246 187 -131 -50 277 -432 349 -166 -158 251
3276 251 -312 279 -235 93 63 -390 426 -391 84 119 -252 296 -415 350 -98 -198 436 -576 344 -104
3296 -104 -51 193 -284 479 -458 184 170 -489 517 -295 93 37 -188 470 -608 582 -191 -271 531 -510
3316 -510 323 -249 119 123 -513 745 -472 76 299 -427 425 -348 352 -183 -243 687 -746 484 18 -305
3336 -305 411 -442 547 -541 169 324 -807 722 -390 62 133 -248 485 -664 566 -145 -465 740
3354 740 -681 311 -152 -53 252 -633 900 -606 19 559 -763 550 -381 261 -45 -256 769 -989
3372 -989 558 73 -534 568 -468 419 -502 237 441 -944 928 -478 -75 384 -471 534 -655
3389 -655 616 -141 -560 1056 -900 297 66 -247 319 -636 885 -678 -23 745 -939 629 -252
3406 -252 19 64 -357 792 -1035 630 212 -823 828 -606 286 -301 26 430 -1053 1117 -537
3423 -537 -285 601 -635 525 -454 514 -70 -656 1139 -1009 340 254 -434 460 -589 818 -642 20
3441 20 805 -1193 924 -223 -179 235 -390 719 -965 704 148 -983 1030 -641 226 -129 -98 540
3459 540 -903 1012 -504 -389 941 -873 488 -296 295 24 -623 1158 -1010 383 442 -771 643
3476 643 -540 502 -380 -117 815 -1168 887 -112 -379 528 -494 653 -704 488 184 -966 1112
3493 1112 -606 70 266 -249 488 -831 838 -407 -409 964 -960 485 -124 -1 85 -564 960 -958
3511 -958 300 488 -931 670 -407 295 -227 -123 666 -1135 868 -157 -447 687 -572 493 -530
3528 -530 358 180 -877 1073 -650 22 421 -451 485 -605 601 -307 -361 877 -898 436 60 -231
3546 -231 298 -497 770 -712 245 494 -930 715 -360 44 61 -247 549 -842 701 -100 -553 761
3564 761 -600 325 -227 166 149 -683 810 -511 -24 501 -582 433 -409 381 -149 -310 721 -872
3582 -872 413 127 -372 353 -384 459 -499 82 420 -748 723 -197 -57 196 -227 409 -554 497 -52
3601 -52 -456 718 -586 274 -81 -46 212 -492 636 -420 -57 422 -508 321 -285 136 4 -194 536
3620 536 -624 309 46 -418 416 -383 287 -269 -23 273 -495 527 -289 -129 279 -258 310 -276 229
3639 229 115 -372 496 -433 191 39 -186 218 -271 386 -238 -56 290 -440 303 -135 -36 140 -189 361
3659 361 -331 314 49 -274 335 -212 117 -59 -104 182 -374 279 -146 -95 238 -298 186 -135 94 17 -259
3680 -259 328 -307 86 84 -177 209 -188 175 -101 -21 274 -302 189 -71 -154 82 -176 145 -159 93 81 -222
3702 -222 231 -171 22 -3 -116 212 -234 137 -50 -112 246 -164 56 -77 9 69 -134 187 -152 36 99 -221
3724 -221 168 -58 92 0 -70 138 -153 87 -45 -40 98 -110 93 -91 -74 61 -141 142 -22 -25 -1 -81 103
3747 103 -112 113 24 -36 135 -96 24 -17 -35 29 -80 86 -6 -48 91 0 116 -19 -3 2 -25 88 -91 77
3771 77 33 -48 111 0 -28 -10 -19 40 -109 43 -75 -12 54 -107 76 -79 1 -27 -26 40 -65 43 4 28 5 -36
3797 -36 5 -43 -18 31 -18 -41 -8 22 40 -28 49 -21 22 -10 -43 34 -28 35 54 -4 55 -18 48 41 38 18 -31 117 48 -31 66
3828 66 -69 -2 -5 -10 61 -47 6 -42 -51 2 -24 27 27 -37 -6 35 30 -39 39 7 -1 35 -8 -46 -11 -15 28 -31 -7 -68 1 -43 -21
3861 -21 47 -19 58 -4 -6 32 59 80 -16 34 20 2 14 16 72 -3 -44 22 -48 -7 6 7 32 -52 67 -53 -18 26 -107 43
3891 43 -110 27 -30 -15 15 -76 -32 -32 -43 91 -44 -5 -9 -39 41 -93 82 20 -24 26 -66 63 -141 18 -39 -70 27
3918 27 -48 79 17 -45 41 -189 101 -30 -8 71 -131 85 -101 31 -3 -127 182 -140 61 18 -42 122 -56
3941 -56 72 -85 -53 98 -174 144 -54 -27 51 -171 192 -133 70 13 -137 150 -175 118 -44 -73 98 -207
3963 -207 179 -147 -19 121 -109 74 -79 64 8 -155 167 -235 96 58 -117 182 -94 102 -62 -57 178
3984 178 -221 155 -124 -27 89 -164 218 -183 146 80 -195 235 -234 79 26 -43 119 -188 303 -151 -134 251
4006 251 -237 149 -112 -16 39 -137 328 -310 106 106 -271 206 -141 62 -88 -13 206 -274 233 -75 -121 234
4028 234 -242 216 -138 116 95 -316 360 -224 45 144 -148 218 -267 231 -137 -133 356 -326 257 -49 -52 113
4050 113 -178 312 -310 129 117 -420 287 -214 97 -39 -134 244 -393 285 -82 -156 359 -249 138 -154 44
4071 44 90 -317 410 -322 -15 208 -253 278 -235 256 -107 -170 407 -474 171 -18 -192 224 -178 312 -243
4092 -243 56 239 -464 370 -138 -7 87 -203 262 -399 283 -43 -299 521 -282 98 -49 -4 212 -339 458
4113 458 -254 -73 279 -416 255 -233 142 -76 -180 413 -517 263 63 -331 291 -299 190 -245 72 258
4133 258 -483 408 -236 -50 214 -252 250 -306 246 -39 -255 433 -382 77 40 -118 99 -282 401 -271
4153 -271 -31 308 -428 248 -130 47 23 -181 367 -400 203 121 -340 354 -267 215 -125 -76 247 -454 397
4174 397 -184 -93 256 -287 192 -254 85 48 -338 507 -422 114 80 -253 214 -229 241 -221 -13 335 -488
4195 -488 243 -115 -109 227 -268 317 -324 170 100 -356 405 -173 112 -13 -56 133 -379 368 -106 -145 305 -295
4217 -295 216 -72 100 71 -255 439 -306 61 216 -210 261 -178 167 -101 -33 278 -395 285 -4 -111 192
4238 192 -219 166 -226 117 78 -372 350 -194 -3 48 -173 117 -290 249 -73 -189 373 -239 142 -33 -13
4259 -13 113 -217 281 -219 0 140 -198 235 -176 100 -1 -100 260 -298 219 -24 -163 229 -208 172 -174
4280 -174 33 88 -240 246 -123 -32 120 -149 118 -221 176 -66 -72 302 -255 71 -22 -7 38 -160 209 -149
4302 -149 23 158 -233 125 -82 -32 65 -94 135 -182 156 43 -122 202 -128 78 -60 6 129 -184 157
4323 157 -79 12 165 -154 79 -117 61 -32 -97 230 -212 80 51 -70 74 -72 129 -79 -15 67 -225 129
4345 129 -90 -19 59 -118 93 -134 -29 -20 -53 143 -79 52 -74 -51 102 -109 85 3 -52 87 -130 57 -45
4368 -45 -37 -5 -53 44 8 56 64 -72 21 -6 28 31 -53 44 -91 127 37 -27 87 -120 83 -76 50 43 -46 123 -59
4395 -59 25 42 -88 35 -74 20 -19 14 16 -3 70 0 -31 42 -81 -4 -40 -16 -64 -146 60 -9 17 35 -54 67 -58
4422 -58 -42 -13 -15 -2 27 17 5 -51 43 -25 87 13 4 -33 -23 33 -108 76 29 33 25 -45 -45 15 59 41 35 72 -21 10 17 3
4454 3 22 -35 -27 69 11 14 27 12 -35 -70 20 6 55 -6 -21 13 -79 8 -75 16 1 -46 -8 -5 30 8 -30 -15 -1 -15 -16 -2 60
4487 60 -19 -50 84 -50 59 -69 -12 -12 2 33 -6 22 17 -65 1 53 -24 8 -15 -59 -28 82 48 91 -22 23 -13 -9 21
4516 21 -51 -37 7 -6 -44 -11 79 29 14 -19 -38 12 38 -3 -11 -41 42 40 12 4 -76 32 10 10 -20 -8 -56 -25 24 63 -17 21
4548 21 -3 28 -63 -19 21 -52 18 -8 35 6 32 11 -5 -10 -35 -11 -38 -28 21 5 -34 26 16 28 49 32 2 -34 -38 -72 -2
4579 -2 35 -62 3 -31 4 -4 13 23 -80 26 32 -7 -3 -68 -10 -49 -34 7 -9 32 -28 -19 37 -60 -13 -8 -40 -52 -32 90 -70
4610 -70 -11 -21 83 43 -29 35 -39 -43 94 -107 55 -113 -13 14 -80 81 -41 28 -5 -56 18 -35 0 -5 13 45 -72
4637 -72 125 -42 -27 60 36 58 -96 -38 36 9 20 29 48 10 -80 82 -70 45 -7 14 98 -36 51 7 0 8 -51 -4
4665 -4 -37 66 10 -93 112 -93 69 29 -48 104 -119 49 -58 -59 110 -45 68 -64 -40 46 -137 106 -73
4688 -73 5 66 5 27 -104 31 -3 -104 79 -133 92 46 -59 41 -105 113 -70 -23 50 -85 36 -11 -12 68
4712 68 -31 101 -157 143 14 -137 99 -60 48 -70 45 42 -135 83 -98 -37 112 -93 63 -72 22 -37
4734 -37 -104 131 -113 27 74 -104 67 -29 110 -65 -19 85 -155 68 -58 -18 5 -107 85 -141 -26 -8 -85
4757 -85 141 -95 -19 18 8 100 -83 134 -44 -76 94 -170 115 -35 60 31 -86 83 -144 72 71 -129 126
4780 126 -57 82 -57 -45 149 -204 63 -41 -78 70 -93 138 -132 50 49 -139 160 -117 43 57 -76 75
4802 75 -138 94 -59 -114 154 -102 73 -42 -7 49 -89 138 -130 -3 95 -176 42 -46 23 -15 -104 100 -118
4825 -118 121 -2 -55 130 -66 -7 -59 46 -23 -185 177 -108 8 79 -159 84 -30 120 -47 -69 146 -105
4847 -105 73 -4 -68 63 -104 106 -122 -55 64 -146 120 -72 -16 101 -43 49 -121 122 -24 -64 144 -127
4869 -127 -10 0 -33 51 -128 125 -103 -33 111 -166 79 -46 70 -21 -62 154 -131 35 -22 -80 139 -53 123
4892 123 13 -51 121 -212 136 -34 -62 79 -73 95 -141 81 53 -76 140 -94 46 10 -38 48 -103 124
4914 124 -74 10 124 -186 72 -51 -47 12 -117 80 -106 -53 19 -163 127 -146 -2 -25 15 44 -95 64 -47
4937 -47 -46 68 -64 33 15 -45 25 -48 116 -111 22 80 -14 73 -86 40 -2 -17 136 -187 127 2 -34 103 13
4962 13 105 -15 43 28 -155 64 -68 -30 44 -50 20 -123 127 31 -97 140 -118 59 -2 -26 -61 -76 144 -42
4986 -42 -41 60 -110 64 -71 24 26 -110 119 -48 -5 -13 -29 30 -78 90 -35 -46 62 -42 83 -68 -36 24 -107
5011 -107 66 -50 42 6 -41 156 -37 27 37 -94 52 -74 64 -40 -36 36 -27 49 -114 -20 -49 -27 79 -61
5035 -61 -33 4 -95 25 -18 17 -17 -14 -7 -83 35 -13 -6 1 -13 18 -94 -3 45 19 55 14 40 28 -15 10 -5 35 5 46 66
5066 66 -51 2 -19 40 21 -25 -17 -32 24 18 -62 -4 -18 -16 -31 -44 -57 -17 39 7 -41 -37 -10 -2 10 -20 51 -34 28 -104 -7 23
5098 23 -49 27 -60 40 -5 -92 11 -67 25 -35 30 38 -39 14 10 35 11 -32 61 26 -38 -19 2 16 -27 -3 -10 1 49 -56
5128 -56 0 -32 -53 -3 -16 24 26 -29 63 -10 -9 23 -61 9 -15 -23 -1 -6 10 21 37 28 -40 -3 10 1 -26 3 -25 -110 12 -67 16
5161 16 56 -52 39 -69 7 19 -38 -30 -32 -12 14 69 70 -7 14 39 5 13 66 -13 20 16 4 43 35 -33 -37 -6 14 37 -34 57 -89
5194 -89 -9 -37 -44 -46 1 -48 -1 -56 -38 -31 -18 62 -6 -17 -37 9 -5 -58 -32 5 17 68 34 -9 5 33 80 50 49 7 57 9
5226 9 1 -12 20 -10 -28 5 -28 -7 -38 44 51 20 2 15 -75 42 -23 41 -92 7 21 -55 24 -51 32 34 9 14 40 -22 -32 13
5258 13 83 1 81 -16 -99 28 -17 -25 -28 28 33 -109 -8 43 -41 -27 6 -6 -65 -2 -31 5 8 -17 9 45 -25 34 -58 101
5288 101 -7 9 -2 -7 14 -40 -10 3 -9 13 -53 59 -43 -4 -2 -7 -2 -12 -20 -3 23 -11 -61 14 -30 -95 -12 -56 21 8 -56
5319 -56 33 -76 -13 -44 -39 28 -44 1 21 -46 49 -61 73 -57 -14 1 -81 70 0 -21 33 -2 99 -72 31 14 50
5346 50 71 -29 112 -8 -48 47 -8 41 27 40 23 -5 115 -93 41 -13 -68 -3 -72 86 -68 4 27 -49 101 -25
5372 -25 -8 -67 -3 -32 -66 59 2 -50 29 -47 32 35 -38 23 10 -3 -91 -20 10 -51 -6 -8 61 -29 -11 46 -91 23 46 -110
5402 -110 122 -30 62 -51 25 120 -67 85 -29 54 21 -50 97 -17 69 82 -87 119 -80 88 0 19 33 -141
5426 -141 48 -104 39 101 -141 35 -83 48 1 -99 109 -139 10 12 -85 49 -19 83 -1 -27 153 -159 97
5449 97 -93 -98 114 -119 84 -96 77 69 -95 72 -104 -17 49 -103 55 -46 168 -76 -7 89 -162 180 8
5472 8 -74 56 -38 127 -53 89 102 -138 89 -71 49 -54 -65 36 -248 108 -92 -84 66 -90 50 48 6 48
5496 48 -78 123 -102 5 123 -172 81 -43 105 -50 -90 77 -160 90 -1 -106 105 -31 84 -66 11
5517 11 41 -144 117 -117 23 122 -23 141 -188 93 -66 -63 183 -145 128 -58 -4 92 -151 158 -140 21
5539 21 68 -91 92 -39 89 -47 -93 182 -114 46 -21 -96 34 -94 29 -31 2 99 -81 133 -100 -37 175
5562 175 -75 72 -148 99 -11 -129 85 -121 50 28 -17 7 -73 148 -117 -14 144 -123 170 -38 20 26
5584 26 -27 101 -90 81 75 -83 122 -87 18 -31 41 89 -191 124 -117 -18 77 -70 48 -82 102 -48 -94
5607 -94 99 -111 71 -11 -41 75 -16 74 -48 -8 107 -200 146 -42 -80 52 -1 99 -170 78 5 -109 100
5630 100 -33 66 -36 -72 49 -130 81 -85 -45 120 -120 84 -91 96 63 -63 143 -70 24 -2 -108 41
5652 41 -136 34 -21 -118 102 -127 64 24 -82 59 -103 97 -61 -21 -36 -10 138 -80 53 92 -24 61 12
5675 12 104 10 -55 108 -137 29 -64 -46 101 -77 126 -59 22 23 -108 118 -34 -24 -91 -74 132 -58 51 52 -92
5700 -92 14 -84 -24 27 37 48 -84 55 -75 -37 17 -33 68 -21 8 -61 -33 73 -117 -43 4 -73 -5 -79 43 -89
5726 -89 50 10 -46 33 -28 67 91 24 99 -43 -43 -25 12 65 -21 -24 -25 47 32 -43 43 -22 8 26 -51 63 27 7 34 -23
5756 -23 62 -45 93 -2 -11 22 -12 43 -52 -26 -21 -58 -25 -39 -26 -13 -6 17 -42 -89 -24 -23 79 4 -34 1 -67 62 -3 -15
5786 -15 -56 3 38 -68 0 -12 49 10 -20 56 21 64 29 -33 49 -1 22 -8 -59 -29 -22 16 -11 13 49 -25 29 4 -37 18
5816 18 0 43 -72 -18 49 -27 8 0 27 11 -80 45 -47 -13 -9 24 3 -49 34 -67 4 18 -8 58 -62 5 2 28 68 -23
5846 -23 90 -46 -51 -37 -14 23 -4 7 15 -31 -23 37 49 23 1 32 -53 -35 22 24 46 41 83 13 -61 -4 16 -20 -22 47 15 -37
5878 -37 24 36 6 -21 -32 41 -16 -19 10 66 69 -29 -18 -36 -80 -1 -43 -21 75 -50 11 32 26 -24 24 -10 -11 -3 33 1 -82 -9
5910 -9 29 -6 -5 3 -22 -16 -52 74 9 -14 -18 -67 18 19 32 86 -53 -43 -5 1 -17 16 1 -66 45 7 90 8 16 41 26 -14 11
5943 11 -4 52 -47 -57 3 -58 -11 -10 2 -26 -4 33 5 30 78 -38 -51 -24 50 -4 87 26 -5 26 -54 10 1 -78 10 -75 76
5974 76 -103 18 -7 -128 -12 -2 -29 -6 54 12 -15 -20 -12 -63 78 11 -10 -7 8 19 -22 29 19 -28 1 -46 17 -72 22
6003 22 -30 -86 60 1 -15 5 15 91 -19 3 0 -24 -34 -21 35 -19 30 52 -26 63 -40 13 -1 -21 55 -48 70 33
6031 33 -26 61 40 -19 -2 -12 13 -42 80 -13 -10 -4 -10 127 -73 -41 2 -72 81 -71 -23 11 -14 93 -84 93 -60
6058 -60 9 20 -68 91 -63 -65 17 -24 106 -77 -8 62 -82 65 -130 58 32 -23 102 -75 49 -21 18 63 -84
6083 -84 159 -24 -11 21 -44 55 -99 89 69 -62 87 -78 93 -12 -53 -22 -145 87 -21 -11 67 -68 56
6106 56 -136 33 12 -57 72 -164 32 -5 -58 58 -51 57 -131 -76 78 -109 116 -83 5 64 -103 133 -104
6129 -104 116 81 -114 175 -131 25 -80 -17 79 -137 162 -48 -25 172 -111 44 -125 19 41 -97 180 -149
6151 -149 37 -13 -88 160 -116 49 14 -39 104 -119 147 -3 -57 76 -108 71 -120 28 4 -183 131 -155
6173 -155 -1 88 -99 99 -126 101 -49 -74 106 -91 81 -22 -52 28 -69 150 -49 -18 107 -102 87 -65
6195 -65 38 14 3 137 -154 126 -41 -82 83 -48 93 -5 27 -15 -146 178 -102 11 67 -104 88 -102 109
6218 109 -57 -110 75 -152 125 21 0 87 -136 114 -120 28 96 -82 142 -37 35 26 -91 107 -171 43
6240 43 -37 -51 204 -163 30 -54 -4 42 -171 174 -81 29 58 -91 110 -15 16 -6 -23 131 -132 54 80 -99
6264 -99 61 -64 101 -78 -21 79 -184 58 -112 -50 54 -93 96 -78 54 32 -137 103 -77 99 74 -37
6286 -37 24 -149 128 -90 -50 83 -111 105 -59 21 22 -112 94 -114 49 4 -101 127 -89 93 -85 -39 8
6309 8 -151 104 -89 -90 142 -100 134 -48 109 -28 -66 151 -114 49 20 -44 64 -113 80 -52 -55 65 -87
6332 -87 68 -59 10 36 -145 63 -104 13 -4 -112 66 -16 43 17 -69 65 -125 158 -48 -22 93 -54 99
6355 99 -44 64 31 -41 148 -109 51 74 -80 52 -27 61 -18 -1 24 -103 101 -4 -54 54 -59 17 -69 -28
6379 -28 53 -11 71 -36 12 77 20 38 -56 129 -27 -86 102 -41 90 -45 -104 84 -58 70 -29 -36 7 -60 56
6404 56 -27 -8 28 17 107 -108 111 11 -27 30 -33 40 -73 3 16 -32 49 -70 -10 -38 -96 38 0 39 63 -18 72
6431 72 -92 39 84 7 41 -55 48 -101 37 87 -68 69 -50 -43 64 -88 33 -112 48 -15 14 97 -77 -60
6455 -60 -69 -35 28 -80 41 -57 24 21 -68 52 -58 107 6 -29 55 37 -35 43 -107 -10 8 38 16 -12 47 -43 44 -45
6483 -45 8 33 -23 74 -15 16 24 4 2 -70 -22 -27 25 46 -7 15 -48 -25 71 -47 -30 -33 -26 6 -21 -13 -43 -50 36 -39 -46 -65 21 13
6517 13 -4 59 29 -19 -25 32 -10 17 17 -9 -63 6 -58 30 36 22 19 31 -11 -35 -4 -29 45 100 9 64 7 4 10 -4 59 -17 32
6550 32 45 -5 -20 -27 -52 -11 14 16 -34 13 -8 -92 -34 -34 -2 -78 -50 17 -53 -23 -47 9 -1 -43 57 -56 20 -17 -24 20 -2
6581 -2 81 -37 43 20 4 62 -9 44 87 -48 19 -17 10 62 30 2 43 -24 13 21 56 17 30 24 11 64 27 20 1 23 22 -17
6613 -17 0 -32 10 16 -55 12 -38 -95 20 -12 11 -67 -25 -3 -18 13 13 -52 -66 7 -44 -21 29 32 29 6 -35 46 -50 8 12 -107
6645 -107 52 61 -17 -38 21 15 -30 76 -5 -49 37 -35 86 -37 14 -28 -38 41 -43 72 -111 -54 35 -53 7 -59 76
6672 76 -48 -14 -25 -69 36 -8 -17 9 8 -41 -43 31 36 -146 48 26 -15 17 -43 57 -81 85 26 -35 62 -44 17 57
6700 57 -37 44 -60 4 2 -46 68 -74 9 -49 18 12 -74 46 -70 -5 30 -97 57 -51 91 -34 -58 29 -36 27
6726 27 16 50 65 -28 33 -52 -15 30 -59 102 -48 -47 -39 -54 76 -107 47 4 -87 75 -80 57 -71 -7 53 -70
6752 -70 110 -19 26 67 -89 100 -78 11 -48 -10 76 -52 62 -42 0 88 -95 56 -71 29 86 -67 74
6775 74 -128 -26 40 -60 120 -74 27 59 -73 113 -141 58 -88 -65 56 -106 119 -99 5 60 -183 77
6797 77 -73 -23 95 -38 61 -65 87 -2 -57 112 -41 109 -13 74 107 -90 172 4 -6 79 -90 127 -92
6820 -92 81 24 -68 161 -120 98 13 6 82 -141 66 -33 -49 69 -134 119 -26 -64 42 -124 131 -178 78
6843 78 15 -117 118 -73 128 -39 -51 112 -118 136 -61 -14 115 -39 105 -56 95 -9 -71 145 -132 40
6865 40 39 -66 160 -52 87 -69 22 115 -103 47 5 -45 81 -124 127 -143 92 38 -167 115 -92 52 7
6888 7 -51 97 -159 119 -20 -91 86 -98 48 -110 51 27 -128 150 -58 72 68 -91 69 -85 111 -25
6910 -25 -54 177 -199 128 31 -81 74 -129 123 -52 17 28 -179 164 -50 -1 56 -24 129 -98 136 -86 -68
6933 -68 92 -136 122 13 2 61 -150 172 -147 21 115 -66 148 -161 16 17 -29 117 -247 160 -38 -76 116
6956 116 -119 98 13 -63 46 -93 110 -105 -2 103 -100 104 -121 119 3 -63 158 -160 87 7 3 41
6978 41 -129 142 -35 -7 54 -153 90 -70 -12 23 -13 124 -86 56 16 -47 143 -66 51 -69 -21 89 -128
7001 -128 148 -84 -11 111 -72 142 -51 41 58 -110 135 -140 83 0 -56 125 -83 113 -31 0 28 -51 104
7024 104 -25 -67 85 -101 86 -72 33 9 -163 113 -72 106 33 -14 20 -100 127 -83 10 7 -118 33 -29
7047 -29 36 20 -29 66 -45 90 38 -62 103 -46 -17 -44 36 69 -59 82 17 -60 33 -59 83 -23 -5 57 -67
7072 -67 68 -58 29 30 -68 52 -61 84 -18 -38 53 -61 108 -34 26 39 -68 -6 -13 64 47 -28 49 -58 107
7097 107 47 -12 116 -20 43 1 17 74 12 3 21 -84 36 5 97 -44 16 20 -39 1 -42 33 -22 -6 62 -93 80
7124 80 32 -56 -32 -91 50 -29 13 4 -70 74 -84 -61 19 -28 64 -52 18 -21 -23 95 -63 37 -9 -13 70 -2 46 -20
7152 -20 65 55 -47 17 -38 17 -32 24 76 -60 46 10 -58 67 -74 -25 -101 -23 36 -71 21 -39 0 -1 -2 78 -42 46
7180 46 -46 6 123 -43 7 -3 -50 32 -13 -32 3 21 68 -36 37 -15 -51 -1 26 53 -57 -32 41 -66 -21 -42 27 6
7208 6 -23 67 -2 18 -28 -17 -5 -30 14 24 21 49 35 29 -53 -44 -34 2 -21 -18 -29 -55 -12 56 -54 -18 26 -41 -12 -52 -10 32
7240 32 -50 -19 -6 25 -42 -57 -34 -14 15 36 12 -23 -53 12 37 -30 -5 45 109 -43 54 -28 48 -16 52 17 40 23 22 -37
7270 -37 81 -12 32 -1 37 30 -69 37 25 -20 63 -71 -40 -40 -27 -12 -97 30 11 -10 -43 -15 -37 -43 5 37 25 39 -79
7299 -79 65 -12 -54 39 -65 -47 -36 -41 -21 -66 9 -68 10 39 -23 42 23 25 1 12 63 -50 86 10 -17 -1 -14 -15 -55 3
7329 3 -5 -14 37 6 55 -33 79 12 -30 10 6 2 -27 -55 16 -101 33 14 -42 48 -41 -2 -3 -16 43 -41 -7 28 4 -20 -67 41
7361 41 -48 28 -23 29 -11 -150 36 -18 33 22 -90 20 25 31 46 -65 89 -100 -30 50 -64 9 -42 12 73 -65 100
7388 100 -1 8 14 -34 19 -55 90 -34 -9 38 -55 33 -18 -2 42 -46 -13 2 55 69 -94 70 -76 65 7 -15 18
7415 18 -66 77 -38 -20 31 -16 55 -27 6 -8 -69 125 -74 45 -57 24 77 -72 120 -90 -23 93 -112 31
7439 31 6 17 39 -58 104 -120 79 -2 -110 86 -51 100 42 -46 85 -112 90 -89 -13 46 -83 107 -75
7462 -75 9 -4 -73 60 -90 101 60 -51 43 -58 64 -69 -61 142 -84 103 -73 -1 57 -50 101 -118 14
7485 14 86 -68 52 -69 47 -34 -43 83 -123 125 -105 -42 -4 -60 141 14 -38 21 -43 156 -49 -20 13 -73 105
7510 105 -91 87 -1 -66 55 -193 70 -8 -71 -23 -93 105 -59 -19 55 -110 98 -69 21 -37 -39 109 -79 68
7534 68 -32 -51 104 -83 64 -72 -22 92 -137 89 -82 -28 105 -140 109 -59 44 52 -108 95 -117 108
7556 108 64 -61 47 -75 76 -41 20 78 -140 98 -100 24 31 -66 92 -90 -12 -49 -106 111 -161 54 -23
7579 -23 -87 28 -44 7 -115 -10 13 -151 170 -65 21 -4 -30 50 -84 105 10 -39 106 -55 30 -45 -76 84 -61
7604 -61 70 -3 -58 145 -65 73 -16 -12 61 -42 73 -131 26 1 -59 124 -112 60 -99 -35 114 -122 90
7627 90 -3 -8 2 -83 58 -165 63 -52 -110 146 -57 32 -10 46 33 -150 127 -21 -33 37 -137 70 -28 40 75
7652 75 -103 143 -138 53 34 -19 48 -39 50 -45 -37 82 -45 42 7 -41 79 -111 91 -107 1 4 -122 152 -86
7677 -86 20 36 -65 58 -33 95 -113 -33 70 -124 77 -56 -83 26 -114 92 -81 22 37 -143 70 -103
7699 -103 28 -20 -55 21 -109 79 -15 -104 71 -68 148 -63 0 8 -99 107 -93 39 1 4 67 -90 112 -32
7723 -32 -81 117 -96 113 8 -81 57 -71 34 -116 30 20 -109 147 -59 38 69 -17 65 -112 109 3 -110
7746 -110 69 -54 -28 26 7 75 -58 80 -21 -42 40 -61 95 -43 -35 24 17 95 -46 40 -61 2 65 -44 -24
7771 -24 -54 9 73 -74 116 8 0 69 -73 36 -33 81 37 -41 41 -66 40 36 -11 36 6 77 -35 -40 116 -114
7797 -114 -29 -13 -10 -13 -62 131 -8 -17 -4 -15 22 -69 -20 -25 10 -16 -108 41 -23 -47 47 -12 19 -33 -21 78 -71 -42 -33 -34 50
7828 50 13 12 -27 -23 -6 17 55 -63 42 66 65 8 13 54 -71 -64 41 -59 13 14 -39 65 -51 55 -86 -33 36 24 6
7857 6 -87 -57 -4 6 34 -41 42 -19 -5 57 -37 28 -21 46 26 -48 51 -48 36 45 -43 50 -28 32 6 -17 37 -55 -7 -90 -11
7888 -11 61 19 -16 -42 40 5 -2 39 2 41 -64 -45 49 -55 1 -13 -4 35 11 1 -57 -10 -37 -36 -42 -64 -27 -12 -15 38 -28 -30
7920 -30 3 28 -37 -54 -10 -8 -13 5 14 16 18 -45 5 -33 53 29 -19 66 -34 3 -32 -23 16 -10 110 16 -14 -48 -37 -40 -11 24 -42
7953 -42 -10 20 41 23 -15 43 14 -13 12 -36 -3 35 -11 25 15 19 55 -68 -35 11 4 -23 -4 -12 -18 113 67 -35 33 72 17
7984 17 -35 32 38 1 16 -36 24 -12 28 19 -49 28 -2 -34 52 27 78 69 -58 57 14 15 -38 67 -57 11 36 -80 43
8013 43 -13 12 13 -31 43 24 32 -20 21 30 -52 32 21 -8 -77 27 7 -10 2 24 -28 -59 -88 39 61 6 32 -33 16 112 -14
8044 -14 34 68 35 -18 -4 62 -33 41 -53 -24 21 7 0 -27 20 -1 -18 -17 21 26 -24 71 -4 -32 36 -65 29 36 -13 66 -37
8075 -37 54 -39 -54 -1 -5 19 -52 -94 -4 -11 10 -72 -13 56 8 -12 -99 -8 51 -40 32 -86 -31 9 -53 2 -87 33 -65 -7
8105 -7 28 -124 18 -47 -47 15 -30 124 -42 69 15 -78 17 -39 18 -3 -11 112 -5 55 13 29 14 -20 16 1 96 32
8133 32 -58 55 4 78 6 -25 50 -51 86 -60 1 5 -34 65 -52 -30 61 -127 52 -29 10 -14 -76 121 -101 84
8159 84 31 -38 50 -47 58 -50 -20 44 -100 107 -19 -40 95 -84 27 -101 58 38 -35 69 -53 40 -67 -16
8183 -16 42 -65 49 7 24 98 -59 132
8191A32
##END NTUPLES=NMR FID
##END=
