##TITLE=1H_Pr 3-M
 200.13MHz, CDCl3,
 8 sc
 
 11.3.2025
##JCAMPDX= 6.0         $$ Bruker NMR JCAMP-DX V2.0
##DATA TYPE= NMR FID
##DATA CLASS= NTUPLES
##ORIGIN= UXNMR, Bruker Analytische Messtechnik GmbH
##OWNER= pz
$$ XWIN-NMR		Version 3.5
$$ Tue Mar 11 14:13:25 2025 Russian Standard Time (UT+4h)  she@DPX200
##.OBSERVE FREQUENCY= 200.1313
##.OBSERVE NUCLEUS= ^1H
##.DELAY= (6, 6)
##.ACQUISITION MODE= SIMULTANEOUS
##.ACQUISITION SCHEME= undefined
##.AVERAGES= 8
##.DIGITISER RES= 18
##SPECTROMETER/DATA SYSTEM= spect
##.PULSE SEQUENCE= zg30
##.SOLVENT NAME= CDCl3
##.SHIFT REFERENCE= (INTERNAL, CDCl3, 0, 14.3821)
##AUDIT TRAIL= $$ (NUMBER, WHEN, WHO, WHERE, WHAT)
$$ ##TITLE= Audit trail, XWIN-NMR		Version 3.5
$$ ##JCAMPDX= 5.01
$$ ##ORIGIN= Bruker BioSpin GmbH
$$ ##OWNER= she
$$ F:/spectra/data/she/nmr/H-C/1/audita.txt
$$ ##AUDIT TRAIL=  $$ (NUMBER, WHEN, WHO, WHERE, WHAT)
(   1,<2025-03-11 14:11:58.32 +0400>,<she>,<DPX200>,
      <created by zg, POWCHK disabled, PULCHK disabled
       configuration hash MD5:
       00 E9 B6 7A A2 85 ED C7 34 08 36 98 17 FE 4E 26
       data hash MD5: 16K
       53 E1 57 55 EC 7D 38 75 A0 DD B9 AE 75 B3 F0 01>)
$$ ##END=
$$ 
$$ hash MD5
$$ D1 9F FD 31 1A 9E CF D7 2D 74 89 42 6F 3D BE 2C
##$RELAX= 
##$RELAX= 
##$RELAX= 
##$RELAX= 
##$RELAX= 
##$RELAX= 
$$ Bruker specific parameters
$$ --------------------------
##$DU= <F:/spectra>
##$EXPNO= 1
##$NAME= <H-C>
##$PROCNO= 1
##$TYPE= <nmr>
##$USER= <she>
##$AMP= (0..31)
100 100 100 100 100 100 100 100 100 100 100 100 100 100 100 100 100 100 
100 100 100 100 100 100 100 100 100 100 100 100 100 100 
##$AQSEQ= 0
##$AQ_mod= 1
##$AUNM= <au_zg>
##$AUTOPOS= <>
##$BF1= 200.13
##$BF2= 200.13
##$BF3= 200.13
##$BF4= 200.13
##$BF5= 200.13
##$BF6= 200.13
##$BF7= 200.13
##$BF8= 200.13
##$BYTORDA= 1
##$CFDGTYP= 0
##$CFRGTYP= 5
##$CHEMSTR= <none>
##$CNST= (0..31)
1 1 145 1 1 1 1 1 1 1 1 1 1 1 1 1 1 1 1 1 1 1 1 1 1 1 1 1 1 1 1 1 
##$CPDPRG= <>
##$CPDPRG1= <>
##$CPDPRG2= <>
##$CPDPRG3= <>
##$CPDPRG4= <mlev>
##$CPDPRG5= <mlev>
##$CPDPRG6= <mlev>
##$CPDPRG7= <mlev>
##$CPDPRG8= <mlev>
##$CPDPRGB= <>
##$CPDPRGT= <>
##$D= (0..31)
0 0.7 0 0 0 0 0 0 0 0 0 0.03 0 0 0 0 0 0 0 0 0 0 0 0 0 0 0 0 0 0 0 0 
##$DATE= 1741687917
##$DBL= (0..7)
120 120 120 120 120 120 120 120 
##$DBP= (0..7)
150 150 150 150 150 150 150 150 
##$DBP07= 0
##$DBPNAM0= <>
##$DBPNAM1= <>
##$DBPNAM2= <>
##$DBPNAM3= <>
##$DBPNAM4= <>
##$DBPNAM5= <>
##$DBPNAM6= <>
##$DBPNAM7= <>
##$DBPOAL= (0..7)
0.5 0.5 0.5 0.5 0.5 0.5 0.5 0.5 
##$DBPOFFS= (0..7)
0 0 0 0 0 0 0 0 
##$DE= 6
##$DECBNUC= <off>
##$DECIM= 32
##$DECNUC= <off>
##$DECSTAT= 4
##$DIGMOD= 1
##$DIGTYP= 9
##$DL= (0..7)
0 120 120 120 120 120 120 120 
##$DP= (0..7)
150 150 150 150 150 150 150 150 
##$DP07= 0
##$DPNAME0= <>
##$DPNAME1= <>
##$DPNAME2= <>
##$DPNAME3= <>
##$DPNAME4= <>
##$DPNAME5= <>
##$DPNAME6= <>
##$DPNAME7= <>
##$DPOAL= (0..7)
0.5 0.5 0.5 0.5 0.5 0.5 0.5 0.5 
##$DPOFFS= (0..7)
0 0 0 0 0 0 0 0 
##$DQDMODE= 0
##$DR= 18
##$DS= 0
##$DSLIST= <SSSSSSSSSSSSSSS>
$$ [...]
##$SUBNAM0= <"">
##$SUBNAM1= <"">
##$SUBNAM2= <"">
##$SUBNAM3= <"">
##$SUBNAM4= <"">
##$SUBNAM5= <"">
##$SUBNAM6= <"">
##$SUBNAM7= <"">
##$SUBNAM8= <"">
##$SUBNAM9= <"">
##$SW= 18.0517328524113
##$SWIBOX= (0..15)
0 0 2 0 0 0 0 0 0 0 0 0 0 0 0 0 
##$SW_h= 3612.71676300578
##$TD= 16384
##$TD0= 1
##$TE= 0
##$TE2= 300
##$TE3= 300
##$TEG= 300
##$TL= (0..7)
0 120 120 120 120 120 120 120 
##$TP= (0..7)
150 150 150 150 150 150 150 150 
##$TP07= 0
##$TPNAME0= <>
##$TPNAME1= <>
##$TPNAME2= <>
##$TPNAME3= <>
##$TPNAME4= <>
##$TPNAME5= <>
##$TPNAME6= <>
##$TPNAME7= <>
##$TPOAL= (0..7)
0.5 0.5 0.5 0.5 0.5 0.5 0.5 0.5 
##$TPOFFS= (0..7)
0 0 0 0 0 0 0 0 
##$TUNHIN= 0
##$TUNHOUT= 0
##$TUNXOUT= 0
##$USERA1= <user>
##$USERA2= <user>
##$USERA3= <user>
##$USERA4= <user>
##$USERA5= <user>
##$V9= 5
##$VALIST= <valist>
##$VCLIST= <CCCCCCCCCCCCCCC>
##$VD= 0
##$VDLIST= <DDDDDDDDDDDDDDD>
##$VPLIST= <PPPPPPPPPPPPPPP>
##$VTLIST= <TTTTTTTTTTTTTTT>
##$WBST= 1024
##$WBSW= 4
##$XGAIN= (0..3)
0 0 0 0 
##$XL= 0
##$YL= 0
##$YMAX_a= 545650
##$YMIN_a= -684076
##$ZGOPTNS= <>
##$ZL1= 120
##$ZL2= 120
##$ZL3= 120
##$ZL4= 120
##$ABSF1= 10
##$ABSF2= 0
##$ABSG= 5
##$ABSL= 3
##$ALPHA= 0
##$AQORDER= 0
##$ASSFAC= 0
##$ASSFACI= 0
##$ASSFACX= 0
##$ASSWID= 0
##$AUNMP= <proc_1d>
##$AZFE= 0.1
##$AZFW= 0.1
##$BCFW= 1
##$BC_mod= 2
##$BYTORDP= 1
##$COROFFS= 0
##$CY= -3
##$DATMOD= 1
##$DC= 2
##$DFILT= <>
##$DTYPP= 0
##$F1P= 0
##$F2P= 0
##$FCOR= 0.5
##$FTSIZE= 0
##$FT_mod= 4
##$GAMMA= 1
##$GB= 0.15
##$INTBC= 1
##$INTSCL= 1
##$ISEN= 128
##$LB= 0.25
##$LEV0= 0
##$LPBIN= 0
##$MAXI= 10000
##$MC2= 0
##$MEAN= 0
##$ME_mod= 0
##$MI= 1.114404
##$NCOEF= 0
##$NC_proc= 0
##$NLEV= 6
##$NOISF1= 3.799351
##$NOISF2= 2.8
##$NSP= 1
##$NTH_PI= 0
##$NZP= 0
##$OFFSET= 14.38212
##$PC= 1
##$PHC0= -461.94
##$PHC1= 4.192218
##$PH_mod= 1
##$PKNL= yes
##$PPARMOD= 0
##$PSCAL= 0
##$PSIGN= 0
##$REVERSE= no
##$SF= 200.129724274929
##$SI= 16384
##$SIGF1= 3
##$SIGF2= 2
##$SINO= 400
##$SIOLD= 16384
##$SREGLST= <1H.CDCl3>
##$SSB= 0
##$STSI= 0
##$STSR= 0
##$SW_p= 3205.1282051282
##$SYMM= 0
##$S_DEV= 0
##$TDeff= 0
##$TDoff= 0
##$TI= <>
##$TILT= no
##$TM1= 0
##$TM2= 0
##$TOPLEV= 0
##$USERP1= <user>
##$USERP2= <user>
##$USERP3= <user>
##$USERP4= <user>
##$USERP5= <user>
##$WDW= 1
##$XDIM= 8192
##$YMAX_p= 0
##$YMIN_p= 0
$$ End of Bruker specific parameters
$$ ---------------------------------
##NTUPLES= NMR FID
##VAR_NAME=  TIME,          FID/REAL,        FID/IMAG
##SYMBOL=    X,             R,               I
##VAR_TYPE=  INDEPENDENT,   DEPENDENT,       DEPENDENT
##VAR_FORM=  AFFN,          ASDF,            ASDF
##VAR_DIM=   8192,          8192,            8192
##UNITS=     SECONDS,       ARBITRARY UNITS, ARBITRARY UNITS
##FACTOR=    0.0002768,     1,               1
##FIRST=     0,             0,               0
##LAST=      2.2672688,     0,               0
##MIN=       0,             -684076,         0
##MAX=       2.2672688,     545650,          0
$$ Real data points
##PAGE= N=1
##DATA TABLE= (X++(R..R)), XYDATA
0 0 0 0 0 0 0 0 0 0 0 0 0 -8 0 -8 8 -8 8 -13 16 -16 24 -24 32 -32 40 -48 54 -61 69 -83 92 -105 116 -131 146
35 146 -167 185 -206 229 -256 284 -313 347 -383 424 -468 515 -565 624 -687 757 -833 919 -1019
54 -1019 1129 -1255 1402 -1574 1779 -2025 2331 -2723 3238 -3949 4983 -6612 9482 -15514 33048
69 33048 -183946 -684076 119242 484878 -105919 1827 545650 222571 -115563 234534
79 234534 242374 -177449 -88983 102295 -133871 -163896 57102 -101307 -242233 18430 50992
90 50992 -170548 2354 214541 -18045 -127380 82513 42106 -90928 62873 81701 -91789
101 -91789 59047 190059 -133247 -243179 81790 66290 -154502 87163 255039 -87717
111 -87717 -142367 193493 91921 -171365 46897 170019 -94529 -57912 132710 -122618
121 -122618 -283166 4409 9691 -242082 -44030 193792 -43083 -112814 169321 124815 -70951
132 -70951 108249 209275 -24987 -39034 119084 -9413 -107937 57835 40183 -108656 19451
143 19451 86483 -157094 -184866 42768 -11385 -161282 -3083 106413 -16867 20983 136515
154 136515 7919 -69729 71770 56339 -72363 15811 77635 -70038 -65916 71665 -7103
165 -7103 -77309 85568 99953 -78141 -29956 91072 -38418 -98598 54610 27912 -110276
176 -110276 -8707 72142 -81791 -92591 73699 26200 -98669 1437 79857 -14267 -17958
187 -17958 56629 14817 -3784 74276 58209 1896 53964 49918 -59901 -47895 27938 -38861
199 -38861 -93229 -9295 4920 -68873 -35979 23245 -19433 -24728 35494 16437 -13589 36291
211 36291 31903 -24460 20624 64831 -10007 -26778 56714 31160 -55167 -14627 33940 -25618
223 -25618 -39348 16257 548 -25638 16292 7901 -43317 -3632 41409 -9966 -25944 27884
235 27884 9557 -40503 -10406 15846 -13423 -4366 23966 3071 638 30496 8570 -17205
247 -17205 17224 18273 -22995 4812 42864 -9893 -40640 13223 18586 -33527 -24404 7649 -12834
260 -12834 -20030 1263 -11448 -15176 21865 17611 -14421 16130 41640 -7869 -27907 15430 14287
273 14287 -15758 8035 24100 -8139 -8630 13860 -10683 -26326 4115 1459 -23254 3617 22812
286 22812 -13640 -15003 22150 5290 -23541 8888 27900 -4281 -7870 12252 -2080 -7425 12116
299 12116 -3420 -21671 10743 18216 -27212 -24908 19852 8705 -20401 3796 20233 -6219
311 -6219 -10735 4734 -3221 -1262 17635 7147 -6042 17104 19339 -13753 -11755 9582 -12035
324 -12035 -28356 4685 16929 -11272 -10495 13259 4285 -11086 -872 4914 -143 3025 -2680
337 -2680 -14297 1296 19336 2217 -11944 7005 13866 -7056 -10233 6672 7492 -1840 -609
350 -609 3943 6920 9202 2098 -9345 -6477 -455 -8649 -14810 -5281 -805 -10498 -11220 1544 3229
365 3229 -6974 -1013 19136 20556 3466 3670 21956 21170 3291 -30 6234 -702 -11472 -12411
379 -12411 -10115 -7439 -7073 -18372 -25217 -6614 6597 -8389 -12630 8250 10488 -2507 8857
392 8857 22778 10367 3100 10534 3925 -4444 4990 1417 -12193 -1171 7372 -10201 -4634 20903
406 20903 3543 -21931 3555 19263 -12321 -16143 12306 2480 -16842 -213 -1092 -22187 -3151
419 -3151 15244 -16463 -19525 21544 10960 -22411 11208 42219 7096 -3999 29196 17639
431 17639 -10339 9251 12016 -23980 -20116 1391 -21369 -27589 3345 -9495 -36004 -35 21935
444 21935 -14950 -9475 34356 12594 -20199 16019 32726 -2820 4538 29749 -1463 -14976
456 -14976 19254 2713 -35156 -1074 20022 -28329 -28031 23726 4585 -31014 8344 25731
468 25731 -15862 -6482 27577 -6230 -26073 14386 6794 -31980 -1269 25637 -14162 -11697 32664
481 32664 5442 -27918 20321 36123 -15242 -7212 33301 -240 -26384 12086 8559 -28156
493 -28156 -1825 15162 -32811 -30087 19507 -6605 -43202 3843 26109 -15553 -415 41555
505 41555 8776 -12465 31297 27399 -15377 7543 29795 -13864 -19747 16882 -8361 -35877
517 -35877 8675 16241 -34814 -19113 23610 -10746 -33018 13337 15143 -21473 5996 31739
529 31739 -9723 -13785 28155 7045 -25461 12131 22990 -22485 -10061 29811 -2379 -26417
541 -26417 16052 20731 -15371 2483 23060 -13357 -17926 16804 -2848 -30041 5300 15005 -25992
554 -25992 -16160 17060 -9167 -21960 18372 14390 -20732 6302 33178 -2250 -9324 24509 11259
567 11259 -10416 17840 17218 -22681 -8821 20436 -13810 -32672 6216 8045 -23419 -6218 12529
580 12529 -14733 -12285 19623 2891 -18279 11553 19927 -11059 -3722 17859 -3505 -9303 20616
593 20616 10038 -19693 1068 18284 -10288 -14093 11734 955 -13179 9310 10484 -15462
605 -15462 -3986 14395 -8718 -16813 9900 4228 -18550 -1199 11662 -10352 -7141 17595 6452
618 6452 -7813 10865 12530 -7785 961 12471 -7124 -9009 13517 3980 -15666 -192 6863
631 6863 -12892 -8206 8870 -5744 -14751 5997 6249 -11240 -80 12425 -1781 -1736 13798 3237
645 3237 -8322 7634 8777 -12117 -5969 11189 339 -7681 4364 1204 -8764 3548 7830
658 7830 -9174 -6002 9871 -198 -10592 2873 4169 -8187 487 9609 -4152 -6136 8550
671 8550 2556 -9331 1619 6733 -5029 -722 9403 -1408 -4681 9524 4599 -9993 -19
684 -19 8593 -4949 -7281 3639 -2907 -9603 2586 4283 -6935 174 8284 -3949 -5767 8200
698 8200 3393 -7344 3375 7943 -4244 -1354 9416 -585 -7401 4221 3630 -7988 -892 6278
712 6278 -5908 -7275 5059 559 -6792 4441 7005 -6035 -1940 8703 -1252 -7158 4893 4648
726 4648 -5428 908 5837 -5165 -3378 7774 -426 -8567 3278 5058 -7231 -2758 6813 -2741
740 -2741 -6213 6131 3573 -5952 3177 8338 -4930 -5172 6146 569 -5573 4354 4052 -7450 -1669
755 -1669 6705 -3339 -6116 5565 2696 -7734 -424 5636 -3629 -2824 5564 -428 -5137 5423
769 5423 5676 -5915 -1667 5705 -2505 -5478 4520 2482 -5260 1608 4978 -4422 -2685 6817 722
784 722 -5549 3027 3741 -6061 -2620 4394 -2135 -4423 4407 1632 -6264 304 5384 -2403 -2983 4350
800 4350 940 -3250 3822 4828 -2974 -263 5068 -1578 -4400 3406 1997 -5602 -2923 1043 -3709
815 -3709 -2728 3335 -29 -4165 1836 3534 -2338 -562 4968 1030 -2463 2201 2827 -1815 525 2889
831 2889 -1451 -2097 2638 949 -3440 -644 1700 -1774 -1763 1624 -96 -2147 1595 1587 -2963 -1916 1244
848 1244 -745 -2279 514 831 -1725 -394 1935 418 835 3853 2361 -880 836 3026 443 -1272
864 -1272 445 -59 -2413 -1586 -444 -2701 -3241 -1063 -1446 -3234 -383 1996 -172 -685 2198 2460 1150
881 1150 3041 3901 535 -97 2568 735 -2499 -855 853 -1960 -2490 -97 -1304 -2750 32 576
897 576 -2268 -221 2714 -823 -2654 1995 2272 -2166 -465 2441 -591 -1577 1957 591 -3049 428
913 428 2820 -849 -331 3766 974 -2345 2177 2525 -2736 -1068 2871 -2092 -5153 566 713 -4149
929 -4149 -1495 1976 -1765 -1586 3521 728 -2402 3164 4340 -1963 200 5742 904 -3091 2274
944 2274 2395 -3680 -1274 2328 -3245 -4377 1820 -438 -5132 264 2959 -2615 -995 4744 116
959 116 -3632 2836 3316 -3398 -390 4681 -937 -3319 3073 1783 -3016 1352 3306 -2873 -1529 4512
975 4512 -610 -4898 2083 2850 -4435 -1733 3878 -1670 -4200 2150 688 -4634 509 4040 -2632
990 -2632 -1616 5040 1234 -3024 3517 4134 -2688 338 5045 -1430 -4730 2040 1149 -4712 -755 2536
1006 2536 -3467 -2912 2792 -791 -4142 2561 3051 -3895 -399 5322 15 -2812 3177 2345 -3092 825
1022 825 3803 -2262 -2468 2881 -476 -3742 1994 2649 -3596 -454 4267 -1367 -3670 2752 1770 -4167
1038 -4167 -507 3092 -2458 -2437 2928 7 -2943 1979 2365 -2923 144 4212 -1209 -2517 3588 2037
1054 2037 -3481 290 3667 -1534 -2319 1960 -1001 -3127 1629 1197 -3799 -1039 2897 -1604 -2258 3401
1070 3401 1516 -2625 1094 3089 -1830 -1436 3283 350 -2584 1172 1540 -1925 429 1983 -2565
1085 -2565 -1950 3075 318 -3650 585 2680 -1764 -1514 2073 -416 -1898 2046 1035 -2597 5
1100 5 2259 -1468 -1228 2605 229 -2324 1537 2281 -2435 -687 2880 -294 -2460 1039 735 -1874
1116 -1874 443 1574 -2141 -1057 2490 38 -2060 1494 1594 -2511 -343 2853 -409 -1739 1625
1131 1625 1004 -1933 403 1446 -1468 -702 2157 -1106 -2401 1785 1476 -2575 -478 2205 -620 -1443
1147 -1443 1752 564 -2110 737 1705 -1580 -567 2094 -691 -1419 1923 397 -2718 475 2452
1162 2452 -1601 -2059 1702 692 -2226 601 1416 -1273 79 1923 -1122 -1541 2328 1024 -2371 118
1178 118 2022 -1356 -1240 2212 97 -2470 643 1254 -1758 -734 1688 -853 -1532 1800 405 -1916
1194 -1916 1036 2377 -1715 -1235 2356 354 -2137 670 1459 -1417 -307 1590 -628 -1110 1687 480
1210 480 -2062 996 1859 -1752 -1036 2306 -246 -2441 656 1286 -1755 -830 1691 -791 -1599 1256
1226 1256 430 -1529 1020 1968 -1183 -550 2423 306 -1672 1332 1619 -1760 -958 1578 -510 -1702
1242 -1702 738 81 -1766 182 1151 -1458 -778 2213 114 -1687 1200 1934 -1205 -167 2113 -31
1258 -31 -1229 953 669 -1477 57 703 -1282 -970 1108 -373 -1626 1153 1303 -1703 -471 1884
1274 1884 -114 -1501 713 741 -1272 -143 993 -637 -449 1314 -133 -1117 1258 1480 -1168 -528
1290 -528 1535 -49 -1177 679 699 -929 -464 711 -667 -763 345 -235 -1125 518 642 -933 -63
1307 -63 1534 128 -753 1019 1272 -573 -363 820 86 -618 60 -238 -749 -94 176 -981 -243 763
1325 763 -285 -876 578 933 -465 -365 637 203 -275 305 213 -293 -137 328 -440 -18 512 -85 -606
1344 -606 368 841 -155 -325 791 89 -675 -327 300 -338 -670 -242 -187 -216 -103 -128 -324 408 626 -139 -55
1365 -55 778 512 -223 239 692 226 -189 -109 181 -147 -420 -111 -349 -440 -334 -404 -236 130 219 -418 -32 716
1387 716 233 -339 257 844 -112 -426 289 238 -173 -120 -10 -109 118 280 -258 -363 374 270 -687 -273 608
1408 608 -264 -572 293 469 -409 -198 222 -193 -171 194 55 -164 386 347 -141 288 599 -223 -565 445
1428 445 481 -594 -377 321 -260 -309 50 -14 -407 60 -13 -491 25 794 -346 -635 640 419 -376 -185
1448 -185 491 5 -476 92 310 -378 -95 49 -259 -212 456 -222 -385 462 222 -647 -233 540 -76 -629
1468 -629 295 332 -595 -206 316 29 111 309 -100 -212 349 236 -567 -57 539 -224 -595 142 334 -506 -133
1489 -133 302 -254 -315 193 39 -194 206 7 -401 86 587 38 -352 253 291 -344 -172 595 71 -278 264
1510 264 -19 -243 211 53 -198 -27 318 -34 -185 285 266 -237 -24 261 -239 -214 174 7 -230 -15 107
1531 107 -124 -97 234 -139 -61 423 146 -428 18 323 10 -419 202 17 -46 134 187 -4 16 43 -194 -97
1553 -97 167 186 -206 43 212 -28 -110 177 -97 -158 68 285 -286 -105 233 -93 1 191 -108 -131 88 264
1575 264 80 -25 306 -89 -268 161 129 -86 -226 -19 -18 -60 75 11 -64 73 21 -198 7 3 -45 -6 -23 258
1599 258 78 138 146 -123 -72 -59 114 -22 116 -61 -200 -102 7 34 -66 -29 86 -20 -31 24 49 -136 105 103
1623 103 -278 20 199 85 -247 -76 206 -106 -170 -81 17 -259 -49 24 -24 -100 43 -103 -100 275 258 -107 -197
1646 -197 93 13 -85 88 -62 -314 102 60 -136 -156 155 113 -162 97 -88 -379 2 130 18 -102 -77 137
1668 137 -287 -23 88 -46 -184 194 50 -90 103 205 -283 -45 419 -50 -348 158 63 -293 -83 321
1688 321 -362 -225 334 87 -105 101 189 -429 -12 261 -99 -203 243 286 -401 -65 299 49 -241 51 261
1709 261 -298 112 16 -206 60 430 -48 -343 69 287 -424 44 437 -133 -277 248 180 -226 -53 307 -131
1730 -131 -212 278 -145 -283 238 214 -292 17 110 -320 -459 210 115 -432 -31 239 -107 -88 290 11 -425 278
1752 278 293 -416 47 567 -141 -345 366 148 -569 56 415 -128 -364 83 80 -290 17 80 -175 74 431
1773 431 -364 -234 122 311 -493 -148 436 -61 -252 114 231 -301 81 163 -127 -10 327 -123 -89 275 150
1794 150 -515 -83 359 -301 -480 107 56 -137 62 248 -142 -237 244 -41 63 459 125 -295 25 296 -246
1815 -246 -210 216 -62 -246 -90 58 -85 -144 -44 -156 -219 79 142 -255 -117 181 -86 -136 256 196 -197 -38
1837 -38 -153 175 -154 5 307 21 126 -90 -14 180 110 -178 -229 108 -34 -236 -104 179 86 -192 -259 -59
1859 -59 38 -128 203 175 125 18 38 55 52 5 72 73 21 156 -419 -171 86 -105 -184 -152 -38 126 -110 -52 198
1884 198 -114 -77 142 127 -75 68 -25 -62 203 -79 -216 102 340 -48 -337 74 231 -45 -258 119 -70
1905 -70 -144 200 -32 59 -44 -31 -261 -46 278 -152 -401 255 270 -312 -36 271 -208 -159 -104 -67 -76 101 125 -116
1929 -116 200 -6 -400 -306 229 73 -241 -18 236 19 -205 122 68 -33 -11 -3 -112 89 192 -118 -155 173
1951 173 104 -343 74 259 -226 -339 261 320 -223 216 251 -157 37 64 -78 -241 363 -119 -579 -23 215
1972 215 -192 -359 111 140 -451 9 258 -26 23 202 -252 115 278 25 -309 149 345 -360 -105 238 16
1993 16 -304 202 139 -210 -157 168 -44 47 300 17 -96 208 74 -294 -199 176 -137 -398 277 230 -163 24
2015 24 147 -103 -32 290 29 43 295 118 -326 -21 277 -201 -199 300 -40 -302 -18 206 -80 -117 88 -169
2037 -169 -242 138 97 -448 164 406 -294 -67 398 241 -268 213 469 -64 -191 95 -248 -253 206 111 -370 78
2059 78 264 -385 -229 380 -29 -340 327 342 -305 -179 192 -182 -67 496 72 -294 262 285 -512 -361 455
2080 455 -92 -577 234 447 -443 -259 189 -99 -261 230 -115 -360 227 230 -321 -79 441 5 -478 333 338
2101 338 -476 165 567 -11 -420 494 129 -352 261 106 -680 -106 275 -369 -532 568 144 -561 79 633
2121 633 -197 -171 499 11 -397 455 311 -319 -87 502 -184 -470 638 206 -802 -28 654 -373 -461 578
2141 578 229 -436 446 544 -454 -229 443 -268 -498 428 68 -565 105 644 -353 -349 657 77 -559 285 655
2162 655 -370 -52 291 -354 -449 417 128 -578 199 540 -558 -414 630 115 -602 99 592 -382 -52
2181 -52 729 -127 -156 582 134 -592 166 410 -594 -353 363 -142 -708 84 292 -622 -257 628 -168 -425
2201 -425 515 287 -563 126 255 -421 -266 809 -104 -664 247 670 -527 -140 630 -7 -218 364 173
2220 173 -574 105 362 -484 -270 676 -174 -569 342 469 -579 -57 551 -172 -595 431 242 -570 136
2239 136 500 -340 -263 527 -150 -435 348 148 -440 18 561 -160 -443 338 216 -451 -72 284 -122 -153 173
2260 173 11 -293 196 75 -459 87 653 -243 -475 253 227 -344 3 379 69 -183 156 27 -328 47
2280 47 62 -257 -120 345 -373 -284 465 186 -427 -74 394 -104 -126 148 -47 -51 194 344 -241 227 242 -232
2302 -232 -138 234 -53 -332 32 295 -43 -276 8 -51 -71 161 63 49 193 168 -34 -52 377 78 -175 161
2324 161 192 -172 -101 91 39 -127 142 113 -9 158 226 -255 89 146 -111 -44 166 96 -82 39 31 165 -145
2347 -145 -38 80 135 -33 9 -108 83 -132 -176 -21 454 -107 -97 15 72 -284 -135 71 -68 57 42 -86
2369 -86 117 132 -134 -262 118 219 -201 -48 163 216 -120 -170 153 50 -47 90 -231 55 17 -192 -245 108
2391 108 216 -133 7 172 -18 -170 10 301 -84 -145 -52 90 27 20 -217 -185 7 -200 -141 -219 409 -97 -110
2414 -110 7 77 -93 114 168 27 188 -8 -165 -49 259 -37 -291 100 206 -123 -92 97 322 -163 -100
2435 -100 64 19 -16 -53 29 -107 110 -35 -198 269 67 -179 -38 186 -2 -95 97 102 0 -39 -93 276 41
2458 41 108 -66 -131 36 37 -119 56 239 -160 -76 36 135 -21 -58 20 93 163 -9 28 2 119 -32 -88 142 -26
2483 -26 -284 -124 105 -24 -147 -168 -145 92 -41 -73 -87 143 187 -238 -284 333 -321 -236 -170 88 -50 58 14
2506 14 32 15 10 -83 -227 83 70 -334 -127 402 -117 -214 223 141 -154 -46 75 -27 -120 40 -6 -177 17 -217
2530 -217 -364 252 436 -89 -184 322 167 -209 50 355 120 -358 128 27 -301 147 -20 -389 -66 361
2550 361 -135 -347 435 469 -439 -102 503 67 -272 549 57 -122 -65 62 -295 -34 432 -266 -180 487 47
2571 47 -466 60 301 -241 -367 395 35 -414 63 107 -371 6 567 -201 -92 532 154 -601 132 585 -282
2592 -282 -321 422 144 -500 229 398 -154 -74 415 -225 -418 416 63 -513 247 506 -502 -262 692 288
2612 288 -567 197 525 -251 -133 277 -155 -359 368 -154 -638 187 392 -392 -233 656 14 -672 264 570
2632 570 -351 -249 383 -120 -381 537 -36 -524 432 500 -603 -259 995 59 -808 424 577 -417 -210
2651 -210 589 2 -407 261 168 -572 348 368 -611 -104 786 -188 -682 498 686 -659 -245 712 -1 -549
2671 -549 571 416 -386 164 589 -415 -314 648 -177 -508 488 466 -611 -127 620 -40 -491 539 254
2690 254 -511 43 390 -452 -152 460 -170 -499 539 310 -831 -248 666 -246 -565 509 362 -382 18
2709 18 306 -196 0 439 -218 -296 416 229 -715 53 521 -215 -481 415 197 -545 24 428 -299 -316 133
2730 133 -238 -311 384 236 -536 40 564 -320 -472 591 243 -596 76 465 -102 -296 180 47 -238 197
2750 197 196 -172 160 373 -296 -238 419 128 -563 238 287 -270 -41 325 128 -179 219 37 -265 120 180 -306
2772 -306 -68 352 -27 -558 185 222 -207 -189 349 68 -290 93 205 -172 129 55 -288 90 358 -142 -333
2793 -333 149 127 -310 -165 273 20 -295 56 103 -29 66 67 -105 234 373 -296 -208 292 203 -197 72 265
2815 265 -99 -162 223 125 -97 -5 67 -155 38 203 -436 -91 353 -14 -382 112 263 -202 -228 284 123 -231
2837 -231 101 39 -120 37 -149 -185 62 341 -155 -320 313 69 -218 24 484 27 -157 -3 168 80 132
2858 132 112 -228 185 192 -162 -308 230 74 -298 -66 327 -226 -130 107 138 11 -107 52 -116 123 278 -205
2880 -205 -240 70 40 -378 188 206 -106 -352 140 41 -87 -105 102 -179 74 -18 -292 3 332 -111 -346 103
2902 103 251 -289 -288 271 132 -244 -32 101 -26 -95 59 -41 -22 357 -85 -109 -38 217 -296 -194 246 119
2924 119 -400 103 334 24 -24 -8 -24 165 46 -147 -110 252 39 -193 -150 172 95 -196 -28 348 41 -152
2946 -152 19 23 64 -99 -104 -63 27 -63 15 22 147 -94 -373 -9 281 1 -142 247 -3 -37 -40 278 229 73 -47
2971 -47 -45 -5 24 -25 -182 -102 286 -142 -136 40 260 -180 -95 127 310 -323 -231 106 184 -5 -131 31 22 -97 -66
2996 -66 -191 59 139 -210 -142 265 213 -148 16 401 99 -124 18 277 91 68 27 -192 99 64 -219 -247 293
3019 293 168 -277 -306 328 95 -457 -31 88 8 -61 83 150 19 91 -175 -195 129 -81 -302 15 317 -43
3041 -43 -367 288 47 -75 13 285 24 -266 175 62 -87 78 -111 -93 21 475 -98 -269 121 296 -121
3062 -121 -145 512 -94 -281 -29 -79 -214 71 -26 -137 -52 399 -70 -426 310 263 -442 -126 414 102 -85 170
3084 170 296 -205 -142 75 -165 -106 300 -151 -416 329 319 -449 3 396 43 -274 301 245 -188 -62 200
3105 200 -155 -144 125 -237 -218 202 -32 -630 167 378 -225 -311 305 239 -374 -82 340 -221 -93 270 -49
3126 -49 -134 138 72 -180 81 260 -369 -321 300 298 -302 103 419 -199 -224 339 303 -264 210 145 -263 65 184
3149 184 -168 -303 359 242 -412 145 400 -162 -376 237 153 -269 47 133 -57 75 142 -136 -15 205 96
3170 96 -464 133 306 -248 -159 337 110 -263 -192 174 -115 -1 369 -347 -63 286 -107 -296 179 214 -77
3191 -77 -301 212 29 -87 -65 -5 -173 -89 33 -184 -260 130 -44 -96 203 44 -289 95 261 -30 -89 -112 60
3214 60 -200 -155 149 -121 -150 214 -61 57 277 166 -345 -27 112 -20 -254 75 83 -171 -32 -63 126 -81
3236 -81 68 -152 -11 50 -149 -211 59 147 -135 -172 148 1 -307 28 181 -10 112 196 97 -86 201 69
3258 69 -174 -5 181 -39 -146 192 -78 -103 193 -63 79 -285 61 -199 34 163 49 -79 104 -105 -183
3279 -183 94 119 -60 -319 173 -50 52 -80 24 -9 -76 -70 -164 -7 82 -19 -92 84 108 -120 -229 237 261
3302 261 -120 68 168 -53 20 62 107 32 152 2 -132 102 176 -287 -35 179 81 -69 10 79 -58 110 121
3325 121 -52 -128 -23 -39 -154 154 -53 -86 17 188 -112 -183 114 182 -253 -46 175 146 -240 -1 11 131
3347 131 20 -98 -180 -83 121 -23 -128 209 110 -186 56 197 247 -35 72 -2 111 129 49 -50 -23 264 -77
3370 -77 -120 67 216 -75 -48 105 -6 23 -130 -22 -102 22 -21 -135 89 -46 -231 -76 138 -136 -127 52 177
3393 177 19 -196 159 37 -163 24 41 187 2 78 36 -7 58 1 -171 -100 87 203 -58 23 95 -311 -76
3416 -76 -22 9 -193 -47 3 31 -4 -43 -52 -8 40 -172 -165 61 79 -170 -114 109 131 -104 150 246 108 193 50 -27
3442 -27 -18 -27 -244 -226 45 64 -142 93 176 -157 80 51 194 -22 17 -107 51 -15 66 -108 138 228 -174 31
3466 31 20 233 -39 47 -17 -16 66 -79 -45 21 -90 -15 175 183 100 56 -68 35 43 235 -7 85 65 -107 -73 67
3492 67 -48 108 71 141 -86 65 138 140 -2 75 -2 -82 54 -17 -11 38 67 72 -53 -23 188 61 -117 113 203 55
3518 55 -25 35 11 -64 147 11 172 -99 167 85 9 72 -88 -94 42 153 -120 18 -59 -15 -121 -31 109 151 22
3543 22 17 -148 -62 22 -31 -38 57 144 -46 -25 -89 -97 -65 -3 52 73 -99 -75 -101 69 40 -58 29 136 106 93 -137 167
3571 167 29 -228 104 -26 164 -42 54 -27 -49 91 -70 83 76 101 -214 -44 -29 -97 -92 -36 58 44 -133 30
3595 30 -43 -59 68 5 -166 -152 41 -28 73 204 12 -130 39 151 31 -16 115 0 -10 163 -72 -12 0
3618 0 14 22 46 81 -133 -108 0 44 -202 -39 220 109 -146 12 69 -66 20 23 -189 -1 41 -37 -136 122 206 -34
3644 -34 -78 59 -25 37 2 85 50 -12 17 191 -64 -6 25 -164 -11 74 -288 141 121 -373 148 -22 23 -40 -35 59
3670 59 -64 -67 -153 -156 -128 -39 -158 -58 -13 90 -194 109 183 -96 -165 119 140 123 -73 60 151 -13 60 -108 -89
3695 -89 137 48 22 66 166 125 59 238 104 -30 -195 -38 -114 79 -22 -97 -140 -72 -66 -112 10 122 33 -30 137
3720 137 23 19 149 -5 1 42 -42 -134 -3 135 -39 -4 144 -112 35 67 -102 -41 128 1 115 -22 -169
3743 -169 -72 54 54 65 -127 175 31 -122 -63 -54 59 113 13 105 38 -87 -140 -94 -119 -14 -124 18 -2 47 98
3768 98 24 16 -17 -114 -86 22 49 12 -8 202 -78 115 26 -53 -52 50 -85 -110 29 70 -73 173 202 -13 -109 -18
3794 -18 72 14 -8 -127 28 40 119 -54 -61 90 -102 -153 -61 22 54 14 -62 -51 -124 55 -21 150 -20 111 29 -88
3820 -88 -73 -92 -69 85 57 70 -20 50 -24 -108 44 11 -95 55 -21 95 -215 -112 -55 -56 -61 8 -37 -17 180 -17 -44
3847 -44 -44 250 8 -83 53 125 -17 -67 -32 233 101 145 8 98 98 -42 -45 -26 113 -88 7 147 -46 23 -57 7
3873 7 30 -149 -31 -40 49 135 205 19 32 85 82 139 151 52 -47 -36 -104 -96 -50 -39 -9 -105 7 100 -176 88 -90 107
3901 107 33 -41 42 4 22 -18 -61 78 162 -114 -55 72 -218 110 -8 -114 -23 -2 -109 -113 -8 5 5 -57 26 51
3927 51 -40 -120 -66 -6 59 89 -91 -133 67 -67 108 -76 -179 -5 62 83 132 -50 55 12 -51 50 -40 -31 -61 27
3953 27 121 -105 -9 84 7 -83 45 -131 -80 145 132 -2 48 -83 -227 -164 14 101 -19 126 -31 -107 -53 -47 20
3978 20 129 -75 327 21 21 17 39 42 -87 4 106 -46 11 88 -60 -63 70 -16 -6 27 70 -6 -116 135 -10 -136
4004 -136 72 117 172 -43 -100 -182 64 -54 -25 -92 112 95 -91 -49 -60 79 -114 134 13 21 -143 26 37 -9
4028 -9 -39 3 168 -129 97 70 160 -78 -70 -29 25 34 -69 -190 -47 53 -82 -77 -1 -37 66 -22 -54 -9 -91 -198 -17
4055 -17 59 -169 14 -35 -115 -60 -18 -15 -103 22 32 96 124 116 -82 43 13 80 28 -88 8 43 -89 -229 -56 10 0
4082 0 36 -2 190 -91 -72 -158 -87 -18 -3 -50 -77 39 13 -40 -52 -31 -68 -117 158 -157 -122 -63 -111 -13 135 -12 -110
4109 -110 41 12 -34 -86 43 20 174 -94 99 -24 -32 -41 122 -37 102 27 46 68 -44 42 122 64 -82 -153 27
4134 27 -27 -37 -64 53 71 -29 -103 -187 83 -88 19 -217 -19 -67 32 67 -223 101 92 31 -72 -1 -7 -60 7 149
4160 149 74 -8 19 -24 -4 -68 3 -117 124 -112 2 69 -90 26 53 -102 -56 -34 119 -63 121 96 -15 3
4184 3 14 -8 -116 -114 -36 -22 -58 130 176 46 56 43 -43 47 -60 -44 -159 89 -191 14 52 72 101 -42 -125 -141 -29
4211 -29 -38 88 -8 9 -3 133 14 91 33 70 156 -85 -9 188 -57 2 57 43 -108 -42 -49 143 73 29 80 15 156
4238 156 13 9 -300 -83 142 95 63 21 154 42 47 -65 -192 38 -113 13 -199 -9 -116 -84 63 94 -76
4261 -76 -77 80 80 20 173 70 -34 -164 -129 1 25 3 -178 52 149 172 51 -120 135 224 -97 103 -20 -70
4285 -70 24 30 14 21 16 71 -167 -74 45 -46 -53 169 -113 -135 56 -92 -12 -156 -30 40 -278 126 70 27 209 -14
4311 -14 -89 -4 66 16 -120 176 197 -97 47 -49 7 -167 10 114 78 128 43 -2 -6 -17 -73 131 -1 82 -56 13
4337 13 -28 -18 -97 43 -71 104 86 -40 8 -136 131 13 34 160 -76 24 -78 -73 -7 -29 28 56 -39 101 -73
4362 -73 -18 -91 41 63 -132 88 96 -66 41 191 -28 -102 -27 80 47 151 -93 172 -184 110 -65 96 -41
4385 -41 -22 -13 -39 -68 -160 -123 -9 -141 205 -28 57 48 25 53 38 156 72 92 -20 95 53 69 -78 178 1 76
4411 76 41 107 139 -161 -19 20 -47 -90 77 -45 -99 81 -28 0 -107 41 -37 -19 96 12 94 148 -34 -61 -118
4436 -118 156 62 -15 51 -76 19 -87 -1 -33 -13 -23 -63 -81 -141 -90 26 188 -119 161 13 -19 -29 18 -114 -36
4461 -36 164 -90 -151 -261 -28 -100 -144 -60 75 -63 -41 -24 138 -84 -198 159 -161 -12 124 -92 26 -42 -101
4484 -101 -21 33 -116 -50 51 -45 37 -122 79 -336 -128 -24 56 -97 -134 277 -71 -51 217 35 -214 -18 33
4507 33 -2 -36 -136 -192 -73 -35 76 94 103 53 48 51 13 15 55 -79 -158 -76 -23 61 -89 -12 218 170 100 -142 -16 -36
4535 -36 52 -109 -123 58 119 -42 91 -71 -6 -107 1 108 -126 -32 145 33 168 -170 28 -104 -131 -96 -260
4558 -260 -106 -58 -23 173 -8 88 -19 104 145 61 -21 -30 34 45 -18 -76 -165 -16 -68 -71 -88 -34 -38 110 -7 -10 -29 -63
4586 -63 79 -38 80 26 -98 -56 -52 -226 -81 -160 57 -57 48 -4 122 84 86 -40 -97 -78 -34 -59 52 -191 6
4611 6 80 12 -29 16 -65 51 -77 -55 9 148 -34 -96 4 -125 -91 39 -193 -70 -125 -141 -93 78 143 118 63 5
4637 5 37 -189 -58 73 -56 117 31 81 49 34 -35 57 46 205 -108 39 -30 74 -60 -65 -114 -11 52 60 46 159
4663 159 3 12 20 49 239 -10 2 9 29 -21 -171 36 122 -67 -58 -90 184 -65 76 33 -41 -62 -112 159 65 142 153
4690 153 -87 -29 62 96 108 42 25 33 -23 -47 -1 -61 -65 151 3 106 35 -147 -61 -159 69 -183 22 23 57 89 -46
4717 -46 40 -78 -10 -33 19 -31 -114 39 75 91 -69 87 47 70 6 60 26 -20 -38 17 -20 -14 -100 45 12 42 129 -118
4745 -118 -9 182 96 131 -66 73 14 -120 87 -14 -57 34 11 -24 133 -106 37 -18 -39 -279 43 51 -29 -2
4769 -2 -172 117 -6 178 -48 6 -48 -115 142 2 -105 30 46 80 34 77 -207 0 -118 -15 50 -10 66 -61
4793 -61 117 -24 -46 125 -44 -121 -42 111 -116 66 120 -39 -84 -226 -69 8 223 -85 33 49 4 -118 -105
4816 -105 8 30 67 57 216 268 -23 63 238 -92 72 -54 35 41 21 106 75 54 46 -19 11 36 -71 -55 -44 98
4842 98 93 1 -39 -112 66 250 -181 -5 -1 -54 131 7 112 -24 15 -52 128 -103 11 -94 155 86 41 -111
4866 -111 -59 92 -65 -47 32 28 69 30 -25 -101 -25 37 25 138 -87 -18 -106 -36 30 -39 133 -39 -3 101 -319 56
4892 56 182 139 16 39 67 -83 -79 -45 176 26 -105 -74 19 -17 216 -175 -80 -127 60 -39 -28 157 -61 41 -58
4917 -58 -30 -35 -69 40 -80 26 -21 30 109 23 129 -17 57 97 -56 27 -160 55 -27 -59 -28 -149 -57 31 1 114
4943 114 -96 -8 -58 49 -124 130 -128 46 -174 38 162 -20 11 86 51 -12 -118 25 -42 -42 4 -22 -71 14
4967 14 -88 -70 3 72 5 -56 1 -114 -86 -2 189 -155 -126 42 75 -29 -7 -109 -169 175 -15 50 63 39 -205
4992 -205 -88 46 6 46 2 0 59 65 36 64 -51 -23 129 81 50 61 -65 131 63 98 36 4 -115 147 82 -12 166
5019 166 -93 96 0 -38 -9 -72 -120 -118 76 -102 -23 -92 -16 2 143 59 74 -40 -53 106 6 92 -4 157 91 152
5045 152 131 73 56 26 -231 -21 -34 210 157 133 97 48 110 4 -12 -150 -41 -99 -57 -40 -12 95 13 124 69 59
5071 59 75 243 -13 147 49 56 -71 -55 7 121 40 36 -146 144 100 57 -149 -229 -222 112 -2 -24 47 42 33 108 95 68
5099 68 104 1 102 -99 -140 22 -87 -83 -35 -221 -97 15 -38 44 108 -152 -88 -85 237 79 -13 -32 63 19 -20 63
5125 63 45 13 42 93 -140 60 -88 -64 144 -17 101 -42 56 204 -15 18 29 -54 34 -254 -5 -117 33 -119
5149 -119 10 47 12 236 -188 20 10 -36 53 37 63 75 110 -7 17 -18 104 67 157 -8 -35 -4 -149 93 -65
5174 -65 33 9 12 -20 -40 -22 -87 5 67 -33 76 126 -47 83 -50 36 -16 -75 -61 168 53 71 81 4 -96 46
5200 46 69 69 86 5 -108 98 20 -126 -48 155 -145 103 8 86 156 69 14 -100 5 20 101 32 -53 -3 -133 -129 4
5227 4 -68 -23 -78 44 -66 -23 13 -85 -90 -95 43 81 187 83 -108 107 174 -129 96 -41 -21 41 -4 -224 74 34
5253 34 29 81 -50 32 -106 139 102 -74 120 -40 37 -20 -97 45 -170 -35 33 159 -81 56 -1 124 -59 -9
5277 -9 -25 30 -6 -131 -73 7 -14 63 58 165 315 49 55 37 131 -62 114 93 -15 44 71 -182 -71 -47 -11 15 -93
5304 -93 1 -107 15 -83 -25 38 108 -22 0 -12 63 -23 25 104 -51 90 94 257 40 -72 75 19 -66 70 -33
5329 -33 -22 -46 21 46 -119 113 50 139 11 -58 1 55 -106 195 -65 11 -61 96 57 -151 175 164 -12 19 -94
5354 -94 -36 -55 -87 78 89 27 -133 99 95 -33 35 -126 -126 -107 171 -53 -192 -105 74 142 -111 -126 99 -88 -45
5379 -45 63 36 118 110 -153 -55 0 83 -35 -145 -100 37 81 -72 -69 116 -44 -197 -250 -45 118 -80 -45 -118 -37
5404 -37 -68 -211 -20 125 -53 7 56 -76 -35 -12 -20 31 -24 -85 -108 194 31 -4 26 81 -73 -80 -23 -15 -147 0 98
5431 98 -168 55 -121 26 103 20 130 186 -48 5 103 -2 49 136 -186 -35 58 -9 2 -32 58 7 45 17 59 106
5457 106 -28 -38 34 113 77 -55 -159 -11 -120 -40 58 89 29 82 -85 -135 37 24 -153 -95 -24 -128 -178 -12 204
5482 204 -191 70 -9 -54 -11 5 71 195 11 -228 135 135 -49 43 2 216 58 19 0 -19 10 199 46 53 79
5507 79 -8 14 -101 64 -6 -37 73 -148 -74 47 77 13 -107 -49 170 -18 -45 -68 80 -68 117 -21 -101 -64
5531 -64 -104 14 -92 -48 70 -23 -216 112 34 80 50 73 -94 55 57 61 42 13 -75 292 9 -114 -52 -15 -42 -22
5557 -22 -112 -34 -4 58 90 -67 -136 -4 -80 -122 124 25 -76 -76 203 230 25 -31 153 195 -116 -65 -1 -131 19 -52
5583 -52 68 23 -42 2 31 -98 110 -101 104 18 9 -38 -46 5 -127 72 -182 142 38 -76 60 13 29 -56 -3
5608 -3 73 9 -34 -86 -122 71 -47 -6 -15 -56 126 -49 -3 44 152 39 52 -95 -66 -48 -42 34 192 47 -27 74 -25
5635 -25 -19 -15 -61 107 -13 28 -14 -178 187 -226 -59 -20 -57 -119 59 -110 -34 74 -18 38 -163 158 -119 -71 55
5660 55 -48 19 19 9 -70 80 -108 84 97 -51 118 66 -18 94 -105 22 89 70 -149 36 -46 157 153 61 104
5685 104 96 -6 -8 47 -5 114 -100 -12 46 52 -19 -115 121 50 40 12 -90 30 -30 208 9 39 184 -19 -45 -106
5711 -106 -91 -89 -42 -22 -89 49 10 -83 35 39 -69 17 -23 -39 -23 64 -14 -92 -47 -61 45 -37 76 100 -198 51 -34
5738 -34 -192 -114 130 -25 -138 84 -32 -5 79 79 30 -70 -22 -213 -175 205 -12 97 -35 37 22 283 118 29
5762 29 88 1 126 -112 20 -126 25 48 72 -116 -82 -2 64 -195 61 -17 -5 15 52 -1 66 171 60 -170 17
5787 17 -18 104 -87 127 -44 -80 -85 -28 -63 9 19 -153 -10 49 119 74 -41 1 223 88 -67 -104 -24 -87 -204
5812 -204 -137 110 -111 -37 22 -54 -76 -85 -28 -192 -16 93 -48 39 -141 36 91 70 11 -27 -62 82 -20 88 178
5837 178 -69 -49 -32 -74 63 168 33 -118 13 -70 214 31 -161 -42 25 -82 -122 1 -95 -118 123 116 -121
5860 -121 -127 -123 -130 24 -208 111 141 -58 -3 -74 97 61 159 112 -8 41 -3 -11 135 94 82 26 63 -47 139 38 -158
5887 -158 -180 -17 -52 -69 -150 108 50 28 58 -18 -86 -17 -131 -52 -61 -17 -76 -58 59 -143 25 21 166 -36 36 177
5913 177 -61 5 54 -19 0 -11 15 -65 10 10 -1 95 69 1 29 -23 -132 -118 -185 0 -69 40 -57 44 125 -194 34
5940 34 -166 95 79 140 -65 -74 -85 -38 56 -32 -147 73 6 91 -87 21 -168 -102 29 53 72 -25 48 -37 -22 0
5966 0 -21 28 -71 123 -162 11 -10 -27 -217 108 -5 -122 -88 -156 -207 -32 -4 -167 21 -35 -85 142 -41 7 -62
5991 -62 161 -89 -24 89 -71 -11 -18 -20 7 28 -61 -50 -1 126 55 -4 -69 -106 15 -9 -74 -67 -72 5 -10 -91 114 -121
6019 -121 -66 -166 -10 103 62 34 -105 -21 -7 -27 -147 80 -47 55 -86 -6 -152 82 68 -135 -148 61 78
6042 78 5 187 -56 149 -2 48 72 14 -4 78 -181 15 14 -102 -210 -2 69 -88 -102 -40 39 -161 80 16 73
6067 73 -51 -112 -193 148 47 119 -54 78 5 24 -7 -4 -143 5 166 74 134 60 -65 -28 -31 3 -26 -10 191 17
6093 17 -61 -42 82 23 59 81 -44 10 -30 24 -164 2 -117 -227 -71 -58 71 6 -87 99 150 -60 -66 107 -76
6118 -76 117 -14 61 -54 -21 -185 43 -48 -153 190 76 8 30 7 -184 44 80 -84 18 10 -17 -21 66 -15 -236
6143 -236 198 65 89 -16 34 -2 -93 -139 98 -141 49 17 -101 -4 133 -120 89 -10 4 10 66 1 -7 14 -58 -135
6169 -135 104 115 25 -9 -102 152 36 -73 -45 -31 -62 -240 39 19 166 236 111 88 -63 -54 -15 161 -117 -51 65
6194 65 85 146 -2 6 34 -26 -95 -20 -113 -67 -179 104 -49 -43 -60 -71 34 -24 132 -3 -17 -18 217 144 70 -193 95
6221 95 -69 -86 -7 116 -93 0 158 -201 -50 179 15 -92 6 47 113 1 154 -76 -109 -199 51 -8 -182
6244 -182 70 41 183 61 28 63 113 79 -6 53 55 -27 37 47 179 -68 -23 -8 99 119 -24 -16 -36 102 10 70 -167
6271 -167 185 67 66 56 -71 -117 50 -145 12 -133 -38 -2 10 -57 15 -50 -101 -73 256 19 178 89 -79 91
6295 91 -4 40 -119 152 -49 -80 41 190 113 -58 -165 6 -14 -10 118 75 -38 -10 -15 140 -6 129 121 -64 26
6320 26 71 24 -156 21 39 118 3 52 81 46 -35 17 26 12 -80 116 90 -86 41 199 42 269 -39 80 16
6345 16 97 86 102 150 9 -85 87 -4 -27 -97 96 14 59 -49 -48 121 -56 67 -126 -46 -63 1 48 -154 172 156
6371 156 -107 -53 138 89 3 -137 -23 55 275 -20 19 -56 -85 -49 -176 45 -16 19 115 -236 42 -70 109 58
6395 58 -136 25 -65 -92 60 -1 8 70 -10 12 -164 -12 2 -53 14 0 -135 35 21 60 -167 97 -186 -55 47
6420 47 -93 -39 -37 224 97 87 -118 32 -175 33 -43 -91 23 -3 43 -8 -145 39 -175 -94 161 85 33 23 70
6445 70 13 34 -72 13 -35 -83 -102 -167 56 189 -128 137 -70 86 58 119 1 -78 -190 -62 -29 178 -102 6
6469 6 227 3 -3 -172 -56 179 -63 -93 -40 -70 -8 -141 177 86 46 -39 -58 71 -18 -208 -175 -28 39 114 -118
6494 -118 -1 100 -50 -138 15 51 50 125 -9 32 -169 26 102 -25 207 -11 -16 219 -7 -117 -139 12 -97
6517 -97 -92 46 71 1 -235 -10 68 108 -86 -102 131 69 -27 -87 81 223 42 -61 136 -34 -84 -102 -90 -116 23
6542 23 6 -99 72 53 47 -142 49 155 -30 44 -61 76 134 -61 -6 67 -48 15 63 164 -26 -41 23 15 -31
6567 -31 -34 123 -33 -9 -15 -38 -110 28 42 -85 -17 2 51 -50 -21 -55 -31 75 -4 -26 170 14 -41 38 78 -118 215
6594 215 -87 -9 -34 66 72 -235 -63 91 43 -29 -160 1 -74 -120 -82 5 -79 -26 -21 -152 -135 96 71 -27 -113 80
6620 80 197 -214 22 -112 -38 18 4 126 46 90 87 -16 96 74 -69 37 56 -22 -138 -40 -166 -1 -70 120
6644 120 169 -82 -49 101 90 41 157 23 192 -56 41 73 275 128 -293 87 21 191 130 -188 105 31 115
6667 115 -107 -5 -47 -33 -10 -63 -23 22 -72 -88 151 -60 -175 13 45 -12 88 19 53 19 -160 -6 -181 -50
6691 -50 44 37 -131 60 -78 -108 9 91 8 67 134 163 10 33 -144 34 62 22 -103 19 152 -23 -27 90 -32
6716 -32 -63 93 4 -17 -45 -11 36 84 -38 89 19 63 -64 -77 -12 113 -30 -4 -143 4 -61 -75 111 29 123 -193
6742 -193 -9 -129 -2 29 -17 -16 -31 52 -15 197 78 -80 -85 27 53 61 -30 31 45 36 -86 -88 -139 19 44 -151 12
6769 12 68 29 109 111 22 12 35 -9 -60 55 158 100 44 -69 -87 -139 75 -43 4 20 -41 4 -108 -162 -48 110 15
6796 15 -69 27 47 -18 80 78 -76 -53 72 124 115 -11 -65 185 -105 104 160 -102 38 168 56 -55 3 36 69 86
6822 86 148 -34 174 -94 99 101 107 -226 37 22 -33 -58 100 43 -71 24 -74 -3 -91 -83 -95 59 2 -34 108 15 -36
6849 -36 187 -174 223 -87 -54 101 1 -167 10 -134 137 34 -133 57 -57 -20 -167 -240 14 -1 -55 -56 -80
6872 -80 119 -62 -108 28 -21 15 89 -2 -92 52 -133 15 38 -93 -137 102 26 234 90 -214 -106 112 161 40
6896 40 179 102 57 75 -176 -108 40 -140 -98 25 -117 -80 55 14 -10 69 -5 73 24 63 21 61 -30 44 -192 -1
6922 -1 39 -3 38 -48 104 -48 20 -1 69 112 48 -96 147 -125 -169 43 -109 50 -11 129 108 82 -136 -121 -185 12
6948 12 10 32 55 10 12 -39 100 20 18 -138 -84 -30 26 -41 48 115 38 -132 -94 -60 118 3 -143 19 76 150 33 80
6976 80 -22 -33 -37 -23 -78 9 -80 30 -16 -218 12 17 -22 63 125 -54 -26 142 40 -95 -130 171 -24 -91 -51 57
7002 57 183 -45 -60 34 -85 -48 -139 -31 -2 61 -5 74 145 58 -15 49 222 101 -66 -44 -70 98 -251 43 20
7027 20 105 -141 -183 -58 -198 -62 142 62 113 83 -67 -116 71 58 -51 -134 111 135 -20 -28 -141 124 -52 26
7051 26 44 -21 0 111 13 12 -71 99 -36 73 70 103 58 -70 12 29 -87 -15 -89 -182 40 48 -93 19 60 -73 -7
7078 -7 78 -76 -6 126 -35 6 -23 24 -90 49 52 -20 -84 -70 91 7 -43 -46 57 90 23 99 -24 87 -22 94
7104 94 119 21 -120 -99 0 63 52 17 71 -103 103 -3 63 121 -42 -13 -152 -33 -102 -156 -87 -161 -142 5 72 -47
7130 -47 -214 -254 -4 -180 67 33 -29 122 217 -136 20 -19 -7 143 -68 -91 -115 72 49 -37 -45 61 165 227 4
7155 4 -21 -9 -144 -23 -143 85 -77 49 7 46 40 18 44 120 58 -14 -29 -125 -114 112 194 113 -186 7 -32 -54 85
7182 85 14 135 184 -62 95 -3 56 -53 -18 -36 53 145 -21 160 10 -28 27 1 52 326 3 -24 175 -53 96
7207 96 117 -51 124 -116 -96 -54 10 68 -70 -24 -64 -13 0 52 42 -35 45 -131 13 -66 -78 -19 -76 72 -95 -77
7233 -77 -103 -31 -34 -60 104 -29 -106 51 -53 -66 97 -56 -77 -20 -14 45 -14 35 -139 -30 -73 -12 -53 25 -116 -247
7259 -247 -142 78 -142 69 37 -94 -32 59 24 -42 -98 -2 87 123 47 69 -31 -139 70 -119 -29 -45 168 -94
7283 -94 -67 -42 78 -30 203 42 93 -96 65 109 -106 -181 -31 73 -165 -189 -29 -83 -48 56 71 -68 16 112
7307 112 -100 17 -39 -84 40 103 170 -30 -12 -120 -132 -87 -124 -19 97 40 -56 141 95 -5 13 111 37 -14 -14 2
7333 2 -82 -46 97 93 98 -157 18 -173 -77 28 -100 54 12 148 -75 -62 46 13 234 -38 11 12 -45 95 85 -61
7359 -61 -64 -239 60 192 129 -92 -13 -108 -59 -75 46 9 153 88 -39 -58 74 138 -58 -96 33 85 -89 -50 -50 -147
7385 -147 -19 96 64 102 -5 38 -58 219 88 -125 83 20 -89 -23 67 -60 -42 22 10 7 127 174 73 20 -62
7410 -62 -19 83 -128 -14 32 28 -29 -15 -185 -43 12 -143 13 -25 -56 -39 12 -59 -91 137 -14 169 -22 88 -64
7435 -64 -6 45 9 2 -55 -282 72 -88 -55 71 123 -145 127 -16 21 -20 -53 31 -17 52 -121 -8 95 -5 -76
7460 -76 -154 -33 312 20 -78 -154 -66 -98 3 50 -69 117 -97 -89 -45 223 -20 -99 124 -21 124 101 38 -62
7484 -62 -74 -45 132 58 145 -53 -62 -108 -119 57 -43 -173 -117 18 149 106 77 -44 120 142 -60 -7 159 -14 45
7509 45 67 13 -24 -3 71 64 198 141 60 58 -184 95 -98 -6 78 -16 59 -38 -72 18 -176 86 33 55 8 56 18 139
7537 139 -195 -32 50 -32 -25 -29 25 25 6 0 -3 -121 24 78 48 26 -83 -98 -171 60 112 -46 68 42 65 72 110 -62
7565 -62 -85 -57 -112 18 162 -155 -93 32 39 -12 191 -57 -23 27 12 -1 50 -70 35 -112 127 -117 -182 -223 35
7590 35 56 -21 -86 -47 128 -108 61 37 21 75 87 170 -16 107 263 -36 131 9 52 -17 38 -3 -15 12 -97
7615 -97 -157 97 -90 5 -16 62 -249 40 144 64 104 182 -39 131 50 -159 96 -70 -104 14 -4 21 42 126 -132
7640 -132 166 1 93 98 -181 32 35 49 74 -173 86 -132 -4 -276 32 -40 -99 -48 16 -69 -55 79 -77 -31 -48
7665 -48 140 -65 -63 -110 -229 -87 198 -166 -13 9 8 -197 -59 -124 148 123 4 71 48 -41 119 30 73 117 146
7690 146 106 -119 -93 20 74 90 36 111 -8 -167 89 -131 16 106 -65 -98 48 -203 -60 116 -16 -92 34
7713 34 131 67 -14 104 -13 83 -1 23 115 24 135 -225 -29 -109 45 66 -174 110 -132 90 63 -47 150 -14
7737 -14 121 -119 -1 86 -4 29 -51 6 23 93 -77 -175 -103 35 11 -45 -83 -251 -12 24 48 -74 152 111 -130
7762 -130 -32 -39 -26 -77 -19 -53 -27 -99 -89 16 127 137 25 111 75 89 -53 0 -8 134 -17 -67 -100 25 -115 -9
7788 -9 12 36 -7 61 -7 -30 -113 -77 52 -143 114 -43 9 60 77 -47 -66 166 -12 49 67 -59 103 126 -108 57
7814 57 -87 42 -4 40 -11 -134 6 24 119 51 28 35 8 -9 -52 27 130 210 -69 145 -140 -5 134 43 -2 -103
7840 -103 -51 -3 -32 -149 -69 -84 21 82 -58 -110 32 153 -134 25 -67 -34 -4 -45 52 237 -13 13 47 -51 -172
7865 -172 2 86 82 92 -87 -26 -30 -58 69 -102 93 -31 -169 -158 148 -62 -12 -148 -123 7 33 -132 -79 -91 -18
7890 -18 -144 33 -90 61 -130 -45 33 -83 -93 118 -37 137 50 138 -89 -72 36 132 -101 63 -12 -126 153
7913 153 -5 -153 -77 24 -34 -31 71 91 -28 -74 -218 -29 -108 -72 -17 -39 -50 -145 -71 69 -25 98 116 -24 -50
7938 -50 -29 -34 259 94 142 -8 -13 46 25 -40 86 -83 -108 -72 58 -200 -148 -30 -45 -6 62 39 -14 -22 37 12 188
7965 188 24 -23 -40 75 48 83 221 -69 -50 29 -15 23 4 66 14 122 -33 82 72 32 -181 58 -138 131
7989 131 109 160 29 60 59 -103 -11 15 16 -193 -66 3 104 -16 136 -14 0 85 -22 -15 48 5 -4 70 67 60 -102 143
8017 143 145 -224 -5 -36 -28 -30 38 6 14 2 -80 -21 -197 -91 -91 105 27 108 41 113 63 14 -113 -79 92 -170 -19 14
8045 14 37 22 76 96 22 46 126 144 -13 5 -43 1 169 -76 3 43 -220 23 -25 41 76 61 110 -42 101 76 -23
8072 -23 83 -85 122 -49 94 -80 98 -94 126 -44 45 -102 4 -71 28 58 -110 94 -151 -68 -27 188
8094 188 -53 -40 -120 -71 -11 -70 -12 70 -115 -95 -63 98 49 41 -50 191 207 45 23 45 228 -210 -50 21 -27 66
8120 66 35 84 60 -25 70 -123 104 103 -16 11 77 98 -43 146 -147 -109 24 99 63 -62 3 -134 60 -59 143
8145 143 -65 42 118 -87 -104 -42 -3 -41 238 -30 -160 -56 -6 58 22 9 49 1 -63 -78 -99 23 2 156 -84
8170 -84 -195 -192 118 -89 -117 -131 -34 37 -126 -157 147 -70 12 -49 40 -84 38 28 -58 66 -114
8191a14
$$ Imaginary data points
##PAGE= N=2
##DATA TABLE= (X++(I..I)), XYDATA
0 0 0 0 0 0 0 0 8 -8 8 -8 8 -16 24 -24 32 -40 52 -64 80 -96 112 -136 160 -191 223 -257 302 -349 400 -459
30 -459 527 -601 681 -772 871 -983 1103 -1237 1383 -1540 1715 -1906 2114 -2340 2589 -2861
46 -2861 3157 -3481 3836 -4227 4656 -5131 5654 -6238 6894 -7633 8472 -9437 10556 -11877
60 -11877 13461 -15405 17852 -21042 25391 -31704 41742 -60199 105415 -454488 -349666
71 -349666 411048 -299747 -276331 291360 144458 -301284 130261 304747 -59148 -35918
81 -35918 288308 79693 -36658 166034 80898 -150915 54004 115904 -141913 -90961 128277
92 128277 -98734 -257851 -18104 46644 -105351 33628 134699 -24390 33900 179110
102 179110 -90873 -236817 84076 130959 -158197 -32949 161043 -138241 -242115 131162
112 131162 134103 -144982 47564 265960 20336 -30849 187542 10366 -199158 59922
122 59922 125177 -173059 -90653 146353 -91603 -254525 18679 42003 -187030 -47835 127170
133 127170 -65887 -100185 127295 86109 -31476 131235 171511 -5373 49006 135316 -83036
144 -83036 -154262 73084 46975 -155348 -47389 86190 -57341 -87539 44737 -32880 -120344
155 -120344 35276 79643 -53764 2274 99016 -28738 -64833 78940 32495 -79197 43112
166 43112 85976 -89501 -66505 97429 15085 -71446 78469 93418 -64126 -6437 97587
177 97587 -42990 -96543 62903 36758 -118244 -44958 55648 -47470 -86531 6339 -7095
188 -7095 -44115 32013 44891 -16811 27167 62753 -14825 -1712 96261 51433 -25420 38151
200 38151 56358 -41779 -44612 15336 -29945 -63974 -7732 -11973 -54789 -12641 8833 -38182
212 -38182 -4660 56053 -347 -29599 52399 46216 -44062 -11939 56123 3170 -28781 29891
224 29891 25590 -20489 6195 12733 -37261 -11484 40661 -5536 -36895 16959 14704 -39584 -13403
237 -13403 26772 -4513 -13155 15939 -2790 -21927 3160 -7125 -34431 -86 21548 -10267
249 -10267 9509 53648 12716 -24769 26306 39880 -19506 -21115 18719 41 -21818 -511
261 -511 -4312 -18160 8195 8939 -26768 -8664 21506 -19003 -40298 11430 25183 -8894 6889
274 6889 31822 2156 -7975 18465 2793 -19642 7109 12917 -16974 -2425 19878 -13548
286 -13548 -24850 13001 5591 -27533 -148 25971 -6627 -16832 11405 6287 -6828 11171
298 11171 6238 -13844 10531 23836 -16728 -20205 25305 16529 -23582 -7604 13442 -13775 -23594
311 -23594 173 589 -3764 12688 7457 -8714 9194 17706 -11667 -12125 15880 4144 -15159
324 -15159 12316 25761 -7534 -15183 9699 3220 -17561 -7124 3782 -3979 -4035 -2399 -8144 4247
338 4247 20548 2749 -15544 827 9783 -11402 -15977 4237 7533 -3910 -1490 7138 8415
351 8415 8069 3814 -2875 2531 11864 5768 -2424 3793 5811 -7240 -12897 -4343 -4718 -16820 -15077
366 -15077 471 -900 -17812 -15032 7462 12397 -298 2946 19018 19450 11139 13361 16824 13745
380 13745 7229 -5721 -14780 -3742 2982 -16474 -26730 -7597 -1898 -15838 -7632 9104 -928
393 -928 -9827 2169 4123 -2565 7134 10715 -1548 5086 15521 -1211 -5368 14596 1979 -24655
407 -24655 -1482 21711 -5644 -13767 18558 15850 -9385 3259 11531 -10433 -3196 14311 -15624
420 -15624 -30408 4320 -62 -37514 -12676 24310 -6849 -23437 17157 21831 -5301 14217
432 14217 31658 2689 1910 29133 10797 -9154 12781 3777 -30683 -9085 14147 -24905 -34365
445 -34365 7493 -4984 -41438 -6803 23805 -8125 -8058 27293 9457 -9444 24649 22075 -17714
458 -17714 5296 32893 -12780 -26369 23311 12098 -33558 -2872 25423 -15444 -17762 22826
470 22826 1034 -26591 12163 18227 -24096 -5531 27486 -10904 -25926 16365 976 -38731
482 -38731 2203 30772 -17961 -18670 32203 13176 -18968 20257 32201 -8220 4990 29977
494 29977 -12056 -23737 22788 4207 -43909 -8839 19775 -26884 -30021 14554 -7482 -36128
506 -36128 8633 22900 -17531 834 37474 4352 -9655 31519 20293 -15966 17154 31574
518 31574 -22216 -22009 23621 -3978 -38395 3850 16794 -25314 -10647 22840 -12290 -26294
530 -26294 18782 11329 -26700 3938 26726 -16681 -16335 27274 4099 -28644 10954 26133 -14411
543 -14411 -7271 22274 -5196 -17185 21394 14569 -17405 10522 27850 -14730 -17485 17784 -4228
556 -4228 -30202 3086 6932 -31883 -14148 20403 -9329 -23672 15762 16290 -10414 12643 24222
569 24222 -11372 -4374 30894 5279 -20718 15719 24229 -14695 -9198 14033 -11205 -20736 9334
582 9334 -449 -27135 -1623 15533 -14501 -13360 15682 2097 -11138 15516 12720 -18936 -2967
595 -2967 20855 -4997 -15648 12644 9316 -11195 6663 14751 -10576 -5363 17473 -1057 -15400
608 -15400 9738 9686 -17132 -6115 11598 -9261 -14253 10401 3244 -16375 -25 9447 -9762
621 -9762 -4743 13121 -230 -6375 16324 12482 -9978 2495 15101 -4160 -6907 10556 -1125
634 -1125 -16230 1628 6237 -13636 -7509 8998 -3103 -8668 7399 2504 -11257 3288 10464
647 10464 -8350 -5167 14696 5886 -7911 3601 5678 -6164 1344 8632 -6919 -7829 9199
660 9199 2438 -11035 1423 7639 -5596 -1732 9049 -3134 -9309 5169 2778 -10817 -1950
673 -1950 7488 -4165 -4354 7375 61 -6724 6414 6248 -8144 -244 12100 -467 -6424 5741
687 5741 2900 -6658 2756 6483 -6335 -4081 5245 -4829 -9991 3912 3025 -9173 -248 8199
701 8199 -3025 -3569 8811 2125 -7130 4284 7067 -5237 -1398 7898 -2592 -7432 5077 3475
715 3475 -6700 1298 6139 -6765 -5812 6545 -372 -8958 3180 6782 -4490 -717 6700 -2074
729 -2074 -4031 7444 2167 -8127 1770 6889 -5700 -4454 6745 -654 -7347 3972 4441 -6573
743 -6573 -420 6941 -4790 -7289 5890 3658 -5190 3084 6192 -4910 -2035 7857 -392 -6606
757 -6606 4238 3918 -7767 -2314 6138 -2337 -4919 4484 943 -5530 3224 5773 -5909 -3951 6008
772 6008 -333 -5637 3833 4422 -4960 -488 5232 -3059 -4255 5898 1956 -6033 1470 5307 -4135
787 -4135 -2815 6387 840 -4142 3447 2841 -6162 -1776 4777 -2877 -5798 2384 1116 -4356 1474
802 1474 4304 -2856 -1443 5394 928 -3029 4330 4651 -3500 -1889 3742 -445 -2214 2847 288
817 288 -5573 -999 1863 -3963 -3645 2787 214 -4010 1056 3314 -1232 41 3598 -114 -1854 3158
833 3158 2179 -2790 -599 2702 -535 -1710 2092 947 -1716 1164 2232 -2056 -1889 2022 547 -2227
849 -2227 -199 611 -2633 -1972 569 -1065 -1601 857 169 -2482 -273 2915 1631 -56 2288 3234
865 3234 1134 1644 2867 380 -1321 278 -395 -2751 -2092 -331 -2510 -4112 -1200 -217 -1728 -422
881 -422 1362 -574 -905 2675 2703 71 1585 3918 1521 -161 1757 751 -1884 -97 548 -2563
897 -2563 -1598 1729 -1151 -3300 1082 2559 -1899 -1348 2574 178 -2055 1070 814 -3295 -817 2447
913 2447 -1307 -2162 2406 751 -2719 1415 3736 -1061 -122 4475 742 -3107 2240 3510 -2691 -2071
929 -2071 2210 -1792 -3835 661 -980 -5097 -680 2418 -3028 -2027 4854 1826 -2992 2716 4881
944 4881 -1013 201 4530 -107 -2816 2659 1535 -4398 -618 2951 -2851 -3282 2716 -588 -5284
959 -5284 980 3318 -3205 -1716 4551 102 -3697 2487 3045 -3035 -242 3480 -2042 -2101 4200 1028
975 1028 -4463 2347 4983 -2567 -1717 4432 99 -4320 1571 1884 -4543 -1038 3219 -2874 -4259 3023
991 3023 752 -4636 1017 3971 -2579 -1185 5378 500 -3465 3502 4476 -2446 -179 4247 -1458
1006 -1458 -3069 2515 -143 -5132 411 2359 -4518 -2847 4034 -130 -4308 2004 3097 -2735 -118
1021 -118 4228 -1199 -2585 3066 1324 -3283 1538 3368 -2897 -1609 4139 -376 -3988 2365 2762
1036 2762 -3332 -700 3686 -946 -2999 2509 874 -3525 542 1917 -3289 -1792 3083 -1059 -3481
1051 -3481 2679 2794 -3217 116 4570 -190 -2286 2393 1135 -2233 1493 2186 -3169 -1544 3091
1066 3091 -926 -3396 1657 1371 -3788 -534 2768 -1467 -2148 2855 1226 -2598 856 2670 -1270
1081 -1270 -309 2345 -1520 -2060 2791 1164 -3637 -61 3153 -1400 -2041 2151 387 -2117 1078 1636
1097 1636 -2729 -863 2579 -872 -1867 2012 759 -2669 772 2537 -1931 -1496 2822 499 -2645
1112 -2645 925 1871 -1483 -126 1850 -1289 -1539 2147 287 -2776 389 1663 -2115 -1218 2790 -43
1128 -43 -2178 1424 1545 -1801 -132 1924 -868 -1124 1712 -410 -2163 1535 1869 -2487 -1011 2318
1144 2318 -233 -2236 1215 1054 -2155 89 1796 -1159 -1171 2207 321 -1783 1491 1073 -2236 6
1160 6 2866 -1087 -2454 1823 1278 -2102 -271 1457 -1143 -902 1464 -917 -2066 1841 1484 -2201
1176 -2201 -239 2566 -589 -1357 2306 1029 -2174 644 2028 -1214 -1037 1583 -428 -1910 901
1191 901 665 -2046 386 2197 -1444 -1858 2257 714 -2245 319 2080 -1156 -887 1758 -169 -1583
1207 -1583 1359 655 -1911 246 1962 -1302 -1482 2449 728 -2260 498 2336 -1198 -1162 1531 -416
1223 -416 -1976 565 783 -1920 -127 1395 -1403 -1415 1839 495 -1865 771 2122 -1194 -785 2168
1239 2168 590 -1354 664 971 -1193 21 1046 -1324 -1485 1346 -197 -2488 339 1585 -1250
1254 -1250 -997 2004 521 -1296 986 1242 -835 -19 1508 -615 -829 1262 255 -1562 345 1426
1270 1426 -1697 -1002 1719 21 -1667 336 1081 -972 -681 888 -296 -811 825 -48 -1306 540
1286 540 1268 -1483 -928 1500 520 -865 593 1534 -408 -169 1228 190 -726 451 133 -1173 64
1303 64 364 -1089 -907 842 -182 -1256 532 1165 -492 -473 1219 678 -233 460 537 -5 385 501 -636
1322 -636 -474 741 -82 -1158 27 673 -670 -789 692 224 -525 88 441 -202 -166 381 -114 -137 352
1341 352 67 -587 173 643 -356 -267 655 461 -340 221 810 122 -282 130 113 -73 -58 -125 -603 -249 -147
1362 -147 -625 -672 223 386 -446 7 557 429 -222 355 696 453 69 325 154 -114 -149 -97 -290 -12 -36
1383 -36 -465 -491 80 -93 -604 -213 678 -79 -476 178 563 109 -189 178 34 98 128 -134 -227 268 335 -439
1405 -439 37 719 75 -305 248 451 -297 -420 435 -149 -279 11 12 -346 19 75 -281 -166 579 -174 -586
1426 -586 645 521 -360 -198 669 305 -171 91 258 -361 -269 -4 -509 -251 340 -118 -681 224 423 -524
1446 -524 -356 647 137 -258 313 450 -136 -50 385 -224 -206 413 123 -604 274 195 -575 -194 564 13 -565
1467 -565 226 503 -156 -333 400 147 -198 228 -41 -535 69 305 -586 -152 660 80 -468 290 573 -344
1487 -344 -163 398 105 -261 365 125 -236 24 50 -320 -131 531 -154 -447 58 302 -393 -202 581 203
1507 203 -296 145 60 -169 324 178 -395 -78 371 -51 -380 247 216 -374 -143 305 -9 -202 77 131 -264
1528 -264 -73 39 -57 45 170 -145 -238 267 -123 -325 45 139 -104 -258 86 161 -152 87 155 -114 132 248
1550 248 -159 0 81 36 -220 14 175 92 -111 88 -34 -156 63 112 -233 -69 311 -92 -173 155 -25 -190
1572 -190 143 211 -108 -150 66 76 -221 41 56 -144 -102 177 74 27 214 121 -39 42 232 -153 -81 20 -1
1595 -1 -167 -80 -166 -100 -191 84 0 -69 94 191 30 109 123 -90 -29 13 91 -138 -35 98 106 -119 -113 -64 -39 -67 12
1622 12 -84 -76 106 47 -246 200 107 -77 -89 19 78 -223 -139 51 58 -281 24 178 11 77 140 -227 -22 222
1646 222 48 -74 28 81 -126 4 279 -139 -102 68 72 -91 232 118 -161 80 213 -37 -423 257 196 -241
1668 -241 -45 272 -116 -218 136 167 -227 -32 359 -264 -20 301 -67 -271 231 181 -207 -286 293 -114 -353
1689 -353 173 2 -225 46 173 -252 46 376 -79 -289 295 281 -334 -79 377 178 -244 140 244 -380
1709 -380 101 176 -159 -124 236 -72 -526 181 409 -414 -235 457 -40 -378 49 100 -346 -24 380 -88 -278
1730 -278 127 66 -352 56 222 -238 59 617 -119 -552 357 433 -382 -87 288 -350 -297 342 -37 -385 -100
1751 -100 277 -121 -50 398 -20 -156 446 397 -367 -193 394 -37 -193 84 186 -222 -17 258 -206 -273 368
1772 368 -167 -488 312 400 -230 -149 488 -63 -571 104 246 -402 -29 192 -137 -51 282 45 -194 368 278
1793 278 -286 -72 465 -78 -276 78 88 -306 -7 281 -106 -232 119 -77 -176 45 148 -304 -66 486 63
1814 63 -74 199 274 -312 -38 166 -119 -200 -9 -38 158 119 -141 -134 -33 265 -25 -193 116 266 -261 -207 31
1837 31 3 -155 69 11 -195 -49 86 10 41 262 -73 -152 298 140 -240 -217 306 11 -105 -122 75 -26 -178
1860 -178 -77 22 -50 -50 -13 -68 132 23 13 14 105 71 88 93 284 -13 -107 151 187 -91 -320 -50 -98 -124 -75 -59 119
1887 119 149 134 -145 29 90 292 -189 -23 266 51 -73 163 259 -95 -74 105 -114 -84 22 47 71 -102 -13
1910 -13 -223 41 314 -79 -282 234 87 -345 -230 267 32 -256 124 290 -140 106 175 -148 94 204 -77
1931 -77 -104 200 222 -358 -176 263 -36 -283 -78 25 -30 15 73 -304 -124 175 63 -172 294 273 -404 -69
1953 -69 262 -101 -457 5 197 -250 -145 302 -65 -87 132 -42 -45 267 117 -341 62 163 -176 -150 319 315
1975 315 -320 -79 62 80 71 98 24 -171 318 -78 -438 85 437 -318 -55 375 206 -349 21 290 -97 -279
1997 -279 245 -102 5 31 -122 -234 155 -13 -329 -123 349 9 -310 67 115 -220 -88 286 43 -245 96
2018 96 -40 -91 124 67 -162 -65 330 -88 -289 170 302 -123 -139 310 194 -134 222 59 -288 67 -44 -158
2040 -158 19 192 -191 -319 378 6 -396 -50 359 42 -180 162 94 -107 94 205 -227 -75 231 -347
2060 -347 -258 282 41 -712 120 333 -240 -221 129 -52 -143 180 147 -260 -22 315 -275 -155 456 44 -491
2081 -491 350 383 -459 -168 318 117 -332 228 59 -338 87 346 -366 -167 462 -24 -408 316 528 -556
2101 -556 -151 469 -18 -372 399 41 -299 172 218 -389 51 500 -185 -571 339 332 -361 -65 550 -60 -334
2122 -334 251 219 -462 147 403 -281 -257 593 -4 -325 275 300 -705 -33 650 -302 -462 434 293 -615 3
2143 3 418 -285 -144 473 -73 -405 462 263 -657 -103 630 -141 -551 528 149 -824 137 431 -195 -203 552
2164 552 225 -259 413 269 -587 78 728 -439 -591 532 43 -790 -75 475 -455 -277 500 -204 -341
2183 -341 306 487 -526 51 746 -228 -348 882 145 -634 74 516 -538 -332 565 -51 -447 224 378
2202 378 -539 83 496 -204 -387 558 3 -620 168 607 -275 -142 523 209 -382 246 401 -438 -34 259
2222 259 -463 -314 471 274 -433 270 289 -532 -314 666 11 -564 190 211 -505 -205 315 -123 -439 407 159
2243 159 -268 207 475 -513 -161 578 -77 -544 305 415 -413 -84 195 -126 -465 38 158 -442 4 87
2263 87 -235 -83 499 -141 -457 162 197 -487 -304 334 42 -313 357 265 -266 274 286 -261 -18 362 -122
2284 -122 -294 265 248 -331 -200 276 -105 -361 260 31 -188 42 359 5 67 397 -136 -228 378 172 -317
2305 -317 63 460 -84 -330 128 22 -7 30 -2 -106 -31 151 -165 44 289 -29 -314 208 199 -83 12 213
2327 213 159 -171 68 203 40 -45 144 -22 70 172 33 -72 316 11 -308 -97 202 -52 -122 90 -1 -117
2349 -117 160 12 0 77 80 1 -54 130 32 -230 -115 168 6 -43 39 -19 7 -17 -3 69 57 73 -24 86 185 -43
2375 -43 -106 48 8 -141 -100 238 -104 18 10 -30 173 247 -219 -287 202 72 -191 -100 185 -137 -242 -2 266
2398 266 1 -76 80 -24 29 205 140 -184 133 -61 -76 -9 296 -99 -107 102 206 -45 -229 212 -28 -170
2420 -170 -55 -170 150 157 62 -168 30 293 -50 -115 227 32 -102 -96 11 4 116 45 4 -188 -7 -82 -107 245
2444 245 -109 -180 -164 202 182 -53 41 316 126 67 160 174 69 31 -56 -208 70 51 -122 -12 207 19 -173
2467 -173 -135 119 -30 -132 145 200 48 -23 -128 136 298 23 -194 95 271 -203 -118 86 95 -19 -144 129
2489 129 234 85 -104 -54 106 90 -154 -241 358 69 -185 -111 91 50 -243 53 54 0 98 -102 -98 81 80 -219
2513 -219 55 53 45 -63 41 215 -71 -120 40 -16 -53 96 -98 -152 186 25 -73 -69 427 -4 -307 175 211 -223
2537 -223 -33 412 235 -233 223 206 -57 197 84 -302 -57 361 -242 -545 246 49 -323 68 325 -139
2557 -139 -269 75 19 -143 101 256 -104 -67 105 -269 -390 508 69 -508 -43 615 -270 -626 357 320 -693
2578 -693 -76 366 -214 -116 169 -58 -269 527 65 -601 92 692 -429 -547 496 191 -426 -15 497 -338
2598 -338 -219 271 -142 -403 361 233 -693 -86 722 -430 -427 668 351 -695 56 672 -250 -290 493 5
2618 5 -366 455 308 -424 170 641 -527 -489 640 105 -740 152 668 -372 -454 472 185 -333 427 211
2638 211 -532 99 540 -419 -283 568 58 -780 -2 690 -544 -215 495 274 -435 326 397 -434 13 647
2658 647 -352 -296 552 171 -783 203 570 -641 -469 512 41 -582 402 371 -373 29 287 -231 -220 598 40
2679 40 -537 260 538 -626 -269 640 -15 -613 388 422 -501 -16 441 -208 -281 381 76 -531 359 484
2699 484 -416 -228 902 79 -452 285 193 -496 -270 453 -126 -328 303 54 -459 139 328 -576 -73 658
2719 658 -181 -441 492 499 -487 -21 355 -111 -377 375 111 -349 112 276 -451 -10 295 -228 -533 293 402
2740 402 -534 -195 544 -177 -348 316 124 -156 78 52 -262 -98 409 -275 -286 414 138 -603 -96 299 -208
2761 -208 -299 279 8 -301 -7 19 -258 -23 167 -228 -185 414 -79 -493 124 308 -122 -315 406 296 -272
2782 -272 152 190 -170 47 70 16 23 283 -134 -190 105 260 -314 -165 409 161 -278 -108 176 -129 -273 75
2804 75 -243 -31 316 -39 -314 426 248 -165 -23 438 -111 -287 223 266 1 -28 122 -55 113 6 -210
2825 -210 -213 360 53 -460 20 353 -223 -227 186 206 -134 57 169 -265 -14 -25 -206 36 382 48 -388 161
2847 161 279 -216 -207 335 81 -239 165 25 -2 1 11 -260 -76 141 -78 -219 259 70 -402 21 367 -19
2869 -19 -78 50 143 -90 -62 97 5 51 110 -17 -88 296 210 -404 120 382 121 -209 63 135 -120 -146 157 182
2893 182 -155 111 50 -47 233 -204 -268 22 111 -114 -134 207 104 -355 111 191 162 -86 -204 68 -122 54
2915 54 -18 -210 84 234 -134 -132 132 31 -394 -10 145 104 -45 61 146 -48 -172 -12 -109 98 161 -47 -127
2938 -127 116 118 -345 -37 267 89 -170 -34 76 68 -139 39 90 -43 100 -29 169 157 -6 -171 63 89
2960 89 -22 -236 -9 169 -49 -90 46 252 27 -88 -129 -80 82 8 -178 -155 166 -34 -195 65 80 -281
2982 -281 -185 118 167 -91 -15 75 -9 64 94 -12 7 272 -96 -124 200 319 20 -111 57 270 -300 -151 103
3005 103 -31 -178 -16 140 -143 89 85 -95 -5 184 -23 -251 136 70 -310 -263 431 39 -265 -234 214 -179
3027 -179 -160 65 147 -24 -50 -29 -81 134 219 -146 -47 425 -16 -118 -30 248 -119 -200 226 -20 -213 7 143
3050 143 -95 43 166 -250 217 365 -113 -361 99 234 -298 -228 240 2 -351 27 110 -100 0 238 -164
3071 -164 -9 423 -32 -263 177 258 -196 -165 517 101 -355 129 170 -391 -62 219 -130 -12 227 -111 -327
3092 -327 125 347 -282 -193 394 -22 -417 216 312 -161 32 273 -200 -176 67 108 -260 114 160 -286 -5 362
3114 362 -61 -341 224 -11 -440 -148 456 69 -345 64 107 -171 67 93 -252 -63 285 -275 -406 121 231
3135 231 -379 -29 331 131 -339 264 41 -144 -27 -1 -142 -232 213 -44 -414 317 398 -502 1 226 -170
3156 -170 -221 280 230 -312 -12 160 -77 -128 180 -174 -273 220 5 -490 104 251 -133 -105 46 81 -205 -12
3178 -12 223 -46 -19 153 -29 -66 101 -81 -364 35 191 -308 -271 352 172 -330 44 52 -111 -105 144 -84 -26
3201 -26 143 59 -212 -4 292 -103 -143 255 8 -380 -31 307 -54 -16 51 71 -62 247 29 -193 191 181
3223 181 -457 4 229 -55 -284 -11 215 -107 -99 113 36 -158 -103 -50 -33 98 -88 -45 174 331 0 -217
3245 -217 25 175 -370 1 323 -32 -133 -95 -90 128 133 -3 -71 -18 122 -248 -41 180 90 -161 -151 124 45
3268 45 -155 -110 178 -31 69 -5 -118 179 58 -225 -71 320 -6 -162 -21 94 -89 -94 111 -34 -162 56
3290 56 117 -92 139 32 -118 12 251 -156 -96 250 139 -77 -61 234 -27 -6 -48 18 -52 156 13 -227 96
3313 96 55 -276 -174 135 48 -381 -21 95 -65 -216 5 137 -216 79 55 -60 100 133 48 -175 77 95
3335 95 -194 164 73 -245 -47 121 -21 -42 94 60 10 124 -171 -236 -41 131 78 -297 250 361 -152 -264
3357 -264 40 -27 -21 80 -9 137 -141 109 -155 48 -162 -13 11 30 56 -56 85 76 -6 -193 102 114 -76 -140
3381 -140 87 -97 -48 -1 -5 -131 75 139 -195 22 71 -107 -84 -60 132 -205 -197 151 107 -20 -94 49 -121 43
3405 43 117 -138 -69 290 109 -179 71 86 -1 -193 112 3 18 123 29 58 59 -113 -79 -51 181 -126 -63 112
3429 112 179 -157 -131 50 -150 -172 34 64 -104 37 78 161 21 114 -31 140 -131 59 -199 -155 263 -47 -101
3452 -101 124 3 132 -38 120 -69 -15 -228 101 85 106 22 -26 -58 -31 0 -203 234 93 77 -168 -100 24
3475 24 -25 -227 -116 -29 -35 41 40 -54 26 54 -35 -56 -26 22 -123 86 111 -82 -93 -109 -7 -12 -18 21 -208 -29 -185 -4
3503 -4 -3 -20 -7 -217 145 53 14 97 60 -103 22 -27 148 -147 -177 -75 -177 -65 37 71 -20 -77 33 113 -33
3528 -33 248 46 -74 91 241 54 -205 183 180 39 -91 -138 -34 23 73 11 47 10 224 -120 159 294 -220
3551 -220 44 66 32 -132 -46 -61 88 -89 -134 -36 26 112 -31 -276 25 -24 -58 -108 133 4 -135 32 47 -64
3575 -64 58 -9 60 -49 55 -74 -23 91 194 -85 -87 249 -61 -149 -58 140 -78 -17 141 21 -42 105 -31
3598 -31 -107 -44 46 -36 167 138 10 -177 194 -40 -102 12 -32 242 -96 33 154 -45 -47 105 -85 80 -97
3621 -97 56 3 137 147 -181 -74 26 53 -59 -61 -31 -43 51 112 -15 -72 78 105 49 190 126 -21 7 -1 -76 -86
3647 -86 152 -107 -83 -59 -3 -73 77 96 -67 -149 57 198 -117 -21 -108 19 -128 246 72 -64 -4 236 -78
3670 -78 19 135 -125 -103 -163 93 -132 5 122 -184 -159 25 74 -142 -36 316 -60 40 -64 56 -19 -16 -73
3693 -73 -71 -11 7 41 -133 76 -67 -104 32 -89 -46 -96 -174 50 -23 105 7 -108 26 4 58 214 -83 -116 102
3718 102 -65 -106 -39 -108 104 27 -15 81 -91 -93 77 -57 -35 -142 66 -28 -5 125 86 3 -183 -40 -9 -24 9
3743 9 149 41 -109 76 60 -93 -155 -208 -53 229 122 -43 157 137 -34 85 -16 142 -41 -65 18 68 65 -48
3767 -48 -32 -29 -26 -126 60 47 -35 -10 -98 198 -47 -15 -177 78 157 134 -170 -280 -118 133 58 -50 145 -67 -161
3792 -161 216 96 -217 45 111 -126 119 56 18 -49 19 -61 -141 -6 44 48 -1 -202 129 50 -123 60 35 -215
3816 -215 22 200 86 38 84 -119 4 86 83 11 78 38 -259 56 48 -231 152 -73 -35 23 -85 69 -124 -10
3840 -10 188 108 76 5 1 -11 50 -36 -164 -103 129 117 69 109 116 48 -150 205 -7 -65 -18 -37 167 -116 37 -8 -51
3867 -51 -28 -99 -45 -12 188 24 22 -55 -36 106 81 -22 -44 -173 28 -151 -78 244 -12 -86 -53 56 46 -230 -88
3892 -88 -20 40 77 -6 -148 -57 83 27 -64 -29 -2 -39 -90 -31 114 -143 -45 -16 9 89 -16 -50 47 -151 71 -89
3918 -89 -48 187 -73 65 153 0 3 32 -96 -83 36 58 31 -46 195 -78 167 -85 41 33 -12 59 6 -111 55
3943 55 -82 -123 28 -59 -88 91 36 -102 12 -29 -10 -10 265 164 88 -93 39 -21 -60 14 156 -67 -115 -108 -90 0
3969 0 -116 -33 -83 24 112 -82 -118 -19 -119 -70 -21 17 -138 45 115 -18 -290 -17 -79 46 36 -112 54 -136
3993 -136 142 -49 -4 -34 -56 85 -200 79 46 -10 -72 -19 18 78 -34 -117 33 -9 -104 23 -67 -33 193 -14 -3
4018 -3 151 -72 -71 44 -50 16 24 76 118 45 43 276 61 29 -26 22 177 24 76 -162 123 36 -24 15 84 -117 -46
4045 -46 -43 116 -178 -47 79 99 81 -74 113 72 33 45 54 -60 120 38 131 20 -22 16 43 -152 66 -94 79
4070 79 102 -170 117 39 250 91 -52 -105 -134 40 110 -102 34 72 14 51 97 100 -44 84 -23 -27 -184 28 -26
4095 -26 -94 -134 -122 -92 -126 147 163 -80 97 -36 -77 -51 -46 -100 7 -99 2 78 28 15 -68 116 -85 69 -3 -40
4121 -40 81 -90 -63 172 3 26 -120 86 131 -222 -221 -60 96 130 5 -128 91 0 58 -119 -54 105 -56
4144 -56 76 25 159 -70 -68 -6 163 35 39 16 -57 3 55 3 49 -40 -47 210 -88 252 -105 -3 90 131 271 16
4170 16 24 -125 -182 185 -4 86 49 117 -85 -48 -83 -24 78 -32 -21 -94 53 81 55 -131 -165 -160 41 12 -98 43
4196 43 39 248 -126 -194 95 -19 133 46 -78 17 1 55 144 8 -22 14 60 45 -2 72 -31 203 67 -48 -14
4221 -14 12 52 24 62 -155 -177 -70 52 -21 -126 38 54 177 194 32 52 5 -37 -96 32 64 -35 7 64 21 -322
4247 -322 21 73 -40 17 59 170 119 -165 89 92 -218 -60 -54 -5 81 30 -122 91 -55 -49 49 -104 3 49 26
4272 26 101 91 19 49 -90 16 56 43 -64 -106 142 -34 -263 -45 -73 -41 -3 -268 79 109 2 29 -67 206 35
4297 35 46 -171 15 -173 -10 -9 3 -18 -50 -39 -31 50 -20 20 53 155 158 23 19 62 63 -91 57 97 16 -74 -25 79
4325 79 36 16 -29 6 -92 37 -122 9 179 -38 -55 81 -25 -152 54 94 8 30 14 10 115 151 0 98 134
4350 134 -121 -38 -23 101 -34 -65 55 -74 12 -34 5 -54 -43 55 -9 -2 48 19 -50 158 82 34 -16 -134 6 -54
4376 -54 -147 34 -115 33 -13 115 -36 -222 -13 128 51 29 37 44 -25 106 127 -88 243 85 43 -114 -110 119 -110
4401 -110 99 -4 -50 -47 81 -84 -63 47 -114 -28 112 8 -15 -81 102 97 231 -27 153 -53 9 100 -12 36
4425 36 107 -88 -105 138 3 130 -128 -20 128 72 -6 178 102 39 -174 43 70 91 -118 -79 128 -96 -188 25
4449 25 9 -133 70 -92 -161 38 125 -158 -52 -125 65 -68 31 -14 29 -117 -62 59 131 -127 58 -24 46 75
4473 75 -16 22 120 -57 -65 83 -38 162 66 -53 105 57 -32 -70 24 -34 -24 -24 -87 -3 -11 81 83 -29 -114 3 120 -73
4501 -73 -170 -93 -29 168 125 94 -3 190 -26 7 87 103 -140 90 -96 154 8 -124 -80 83 25 -150 -113 -32 141
4526 141 -89 -109 -191 48 -132 -33 -132 33 14 -79 96 46 -49 -94 124 -93 -13 -3 55 -53 122 126 -12 -38 -44 60
4552 60 -91 -53 -125 176 -100 47 -100 96 49 -62 68 -65 179 64 80 -48 20 172 -109 35 -35 16 8
4575 8 49 159 92 -35 -208 96 40 66 61 -123 -34 5 -119 31 -81 142 84 40 -156 -4 -15 75 18 157 148 47
4601 47 69 -19 -17 10 -57 67 10 -118 -66 -187 -56 65 42 -124 103 54 -148 -112 -76 -66 -29 -163 3 -16 -23 38
4627 38 133 -52 -3 49 82 162 66 39 109 138 -100 17 95 23 -36 110 99 -75 -98 -15 134 -216 1 -14 -55 116
4653 116 277 -86 -107 31 34 -151 136 40 146 42 143 -64 -33 -77 58 -163 -6 4 -200 -30 -109 26 -177
4676 -177 -180 -42 10 62 -117 -136 29 70 -76 49 67 45 -17 47 -23 53 -127 -25 -27 -7 -142 27 1 7 -76 -40 -152
4703 -152 -88 36 -84 16 23 -71 -36 -205 46 -76 -27 5 -109 -144 -107 64 39 96 -81 -3 32 32 14 -119 -17
4728 -17 15 -23 91 52 6 -7 234 43 19 176 -163 105 17 21 140 45 2 -166 -44 61 -51 147 38 15
4752 15 40 -119 -78 27 119 113 35 -113 -67 23 -86 -69 63 33 89 77 5 -105 -43 -22 108 -67 -72 17 -17 -83 6
4779 6 -10 102 51 6 80 44 53 8 -106 24 -55 -19 -41 19 18 16 -33 39 23 15 205 -11 136 4 171 67 -3 26
4807 26 -44 -1 111 -56 135 -215 134 207 -58 150 -39 54 123 -54 27 -49 4 -84 -13 103 63 -56 -126 45
4831 45 -58 75 -52 179 137 -100 -180 157 56 -41 -157 -65 -92 55 71 69 -48 -141 45 128 -167 43 -88 14
4855 14 33 56 187 -69 34 -2 -88 -93 -7 93 32 61 -139 -22 98 92 35 186 131 -71 -44 -54 -267 -78 44
4880 44 111 106 81 -54 77 33 -45 2 40 -80 56 16 22 95 -106 49 -43 58 -93 -12 -12 -52 -50 -24 -124 -60 -49 -49
4908 -49 -82 -17 -53 -37 78 -72 -103 -68 32 -6 49 160 -103 9 98 -136 29 -81 -58 -68 -26 -11 22 52 14 104
4934 104 -53 -33 -141 -225 29 35 185 -79 -11 68 28 -28 96 -49 -25 48 18 167 -80 96 11 -74 -145 -112 3
4959 3 4 92 -34 -68 -41 -107 -89 -70 97 59 6 -114 41 47 -17 -27 78 -96 89 3 6 86 -9 20 -61 -70 3 -90 -94 25
4989 25 3 76 -189 95 -42 -154 70 -123 34 56 109 -94 -23 111 -13 37 17 23 79 45 -194 -24 -100 -73 58
5014 58 22 -44 -50 -83 85 67 -109 81 -219 60 39 -103 -108 31 -19 139 69 87 6 -76 28 21 35 48 23 188 8
5041 8 23 -30 23 125 -87 8 -3 -87 -110 47 -53 -75 26 5 -1 24 83 50 160 114 -89 30 8 -2 -67 -27 -32 250
5069 250 8 -17 10 -6 66 81 -12 -75 -114 88 -145 -12 13 -4 -99 -32 -89 -106 120 -12 -49 52 13 -17 -68 -20
5095 -20 107 93 97 -63 -54 145 121 45 79 14 112 4 55 -46 -5 -90 -26 -39 111 -42 59 143 16 39 -6 110
5121 110 -96 54 46 -54 31 -1 -31 -104 -27 129 73 217 73 6 -82 23 -119 49 -5 -155 92 53 43 -79
5145 -79 105 -57 -5 24 -80 -36 116 -36 33 103 11 1 -14 -48 35 -6 139 18 61 -135 -112 40 77 -103 33
5170 33 -137 -131 -71 -290 -124 54 -54 20 126 -141 95 -19 -46 91 61 -43 -62 -49 15 176 -65 -31 -56 214
5194 214 100 -62 -23 141 -4 -136 63 -3 147 -55 185 -141 -43 112 39 295 -50 33 -3 -7 7 -93 -174
5217 -174 -37 56 -19 -83 40 -21 -53 -41 176 11 48 200 -114 -57 192 -94 121 -59 -101 20 207 47 4
5240 4 -9 -163 119 18 49 150 47 94 -217 -47 -36 6 -8 73 -63 62 3 161 -41 -37 -134 -74 37 -59 -67 -31
5266 -31 -197 -129 -128 -43 -74 -19 113 112 41 -19 -106 -221 100 -5 13 72 -82 72 82 86 -206 52 -73 4 56 65 -52
5293 -52 -139 4 -160 86 -26 72 80 54 -74 -5 -46 9 91 -67 -161 -141 -153 -34 -12 135 23 -105 -153 31 157
5318 157 92 37 -20 164 -51 26 -86 6 46 152 -126 73 -187 -95 123 -4 110 -83 43 -88 -18 226 9
5341 9 -40 -220 -101 -130 31 35 -53 120 -92 -20 59 -59 -3 274 29 24 110 57 100 -66 -105 -20 72 153 175 33 18
5368 18 -13 -41 80 -51 177 47 -170 10 -32 -57 -92 138 -22 -228 127 20 56 116 -52 18 -46 15 2 -279
5392 -279 17 -14 -116 11 59 115 81 86 -114 133 -13 -118 105 31 -7 -174 -165 113 -5 -159 85 -112 -252
5415 -252 0 12 72 83 13 107 54 -116 -74 139 -67 -55 93 -38 -2 -14 27 -99 136 116 20 61 6 -214 4
5440 4 -90 75 -69 103 140 -74 77 -24 -14 49 -26 61 -97 -61 134 -45 -227 30 -80 48 -151 67 -28
5463 -28 -155 98 -91 97 -50 55 -20 76 34 -130 -191 -20 65 -101 -1 -71 -6 -81 81 -65 -114 116 177 -13
5487 -13 -76 -109 25 91 -143 -157 167 69 56 -49 -71 -1 8 0 40 4 -39 -106 -95 18 -116 -71 -58 -176 -146 -54 31 -45
5515 -45 66 67 -65 -136 201 -32 -75 93 -3 42 -38 -118 24 36 -12 2 60 52 4 -60 -82 -50 -12 181 23 -3 75
5542 75 44 22 148 192 15 -4 -39 -97 112 -59 137 23 38 64 -76 135 99 -59 -1 51 13 2 26 170 -43
5567 -43 197 -99 64 -132 133 -39 -52 17 38 -26 39 11 143 25 -203 17 -50 -98 200 -74 -3 -67 130 -15
5591 -15 86 -183 -76 143 139 -116 -107 -108 -14 90 16 19 10 4 43 -77 45 -32 -69 -54 -114 4 22 72 -48 -58 -80 -26
5619 -26 -72 36 83 -130 -215 -102 6 21 38 -7 26 -57 -122 -73 -109 -48 71 -51 26 -37 67 160 -78 -74 -41 140
5645 140 -132 46 -28 -45 125 46 -31 -72 -125 185 48 -111 -164 19 147 83 79 -78 -92 79 80 38 -44 49 -31 -30
5671 -30 -48 33 2 34 31 -61 -34 28 -15 1 -86 32 -73 -14 0 -55 -171 89 -189 -42 -109 -67 70 -146 267 -59
5697 -59 -16 83 -28 29 144 41 8 102 -13 -5 88 -96 -184 30 -48 -66 -115 -99 -100 86 -153 -43 82 80 -23 -33
5723 -33 60 84 -53 14 -24 9 -237 115 36 172 99 -94 -1 47 109 -138 24 -86 -41 -188 145 -246 142 -10
5747 -10 -185 -12 134 -24 62 84 7 -113 -26 136 192 16 57 -92 28 111 -43 -16 -33 15 135 -141 58 -94
5771 -94 46 -59 -129 159 108 74 -60 -35 9 -105 -87 -21 107 -30 -21 21 123 -22 61 36 9 117 44 -8 -128
5796 -128 -89 -40 -65 -68 -3 -32 4 -6 -90 237 46 34 -142 81 -123 -100 19 -14 -64 97 16 50 23 3 -68 -19 25
5823 25 -78 20 -198 -12 24 -117 -82 -41 42 -84 53 48 17 28 -32 17 -22 -13 65 -72 161 -67 199 28 -35 108
5849 108 -1 28 -108 -9 14 -244 30 -61 3 184 157 38 -23 -70 52 -24 14 131 24 -150 28 44 -4 -68
5873 -68 14 -139 -5 164 -16 -18 -135 -173 48 2 68 -102 -319 -45 -90 86 -41 237 -140 91 12 21 -104 -125
5897 -125 131 49 -112 -82 81 127 -105 157 118 110 -109 -64 -44 162 14 143 95 4 -109 -37 3 25 62 92 8
5922 8 -78 7 96 31 122 -43 -14 71 85 73 60 -13 -16 -60 -156 70 -91 70 -62 49 61 116 1 9 -91 2 56 135
5950 135 -84 141 -56 97 -151 165 -25 85 -51 209 195 67 -9 -42 -47 -65 -24 -76 -109 9 25 -175 -85 82
5974 82 -24 -61 -107 -114 48 29 1 -83 37 -42 95 23 -49 -204 14 124 180 102 -113 13 -185 45 -14 -117 -142
5999 -142 102 -23 -125 -118 -87 26 -261 67 141 95 -50 -56 -29 51 28 251 41 -218 -23 -133 33 69 48 -16
6023 -16 -6 -11 -136 -130 47 80 152 -44 -81 193 121 -118 -26 -1 -6 22 -7 83 -21 -22 -47 2 -64 -6 85 137 25 -1 56
6052 56 141 -4 -149 -17 46 71 143 -138 -3 44 54 134 29 177 44 27 155 26 136 -105 -60 -120 -68 -88
6076 -88 -36 130 -53 25 -223 32 -47 -50 0 -69 95 -79 -19 -48 82 62 -44 -27 -177 -6 -7 4 83 -47 72
6101 72 -86 -143 -28 80 52 98 99 57 -79 58 -34 145 -72 119 90 181 135 53 -6 -62 -43 -53 -68 -35 -36 -45 77
6128 77 40 -65 -16 222 -108 51 130 -9 -41 -55 14 104 70 -10 -156 70 125 76 7 -7 -52 38 -109 -159 -2 -102
6154 -102 90 -16 5 135 42 129 103 184 -55 -68 105 -39 -178 10 -134 94 -183 -20 100 -32 -55 16 43
6177 43 61 -65 -15 -181 160 65 -39 -17 -24 100 33 10 67 16 69 45 227 75 135 -108 74 58 54 100 -89 -20
6203 -20 5 -16 64 142 -35 16 -75 -69 21 42 103 73 32 -168 -59 65 23 99 31 -42 63 5 -18 -30 -67 -122 -180 -49
6231 -49 -37 -50 -52 -22 120 134 -4 -42 -113 72 -94 165 61 42 95 -213 -69 -4 124 35 8 -26 -77 6 100 -187
6257 -187 -56 34 -45 57 -55 126 79 203 -100 46 -41 -4 11 35 -3 -67 197 -117 143 -119 70 94 -56
6280 -56 38 32 70 43 -103 16 135 90 20 -299 83 -50 -101 -14 219 146 47 79 18 -88 1 -47 -58 -1 -60 130
6306 130 -195 137 -70 -47 73 122 -174 149 -92 210 32 18 139 -116 84 31 -87 151 72 4 105 105 118
6329 118 -6 -127 -16 -58 -140 -36 -82 34 25 -37 216 -149 95 -89 50 83 40 -137 -46 168 -35 -108 -208
6352 -208 149 117 -42 76 -21 130 240 69 0 -247 -25 -46 78 234 71 -15 181 64 -102 -7 -53 315
6374 315 36 32 133 47 189 -39 140 -12 -38 -47 -29 10 -17 49 -101 71 -22 -47 -18 6 -77 -37 -3 104 -3 7
6400 7 -93 61 161 21 161 -121 -33 -96 -84 227 -70 86 52 -1 -50 58 -150 29 86 41 -43 80 74 -80
6424 -80 24 -28 47 96 -21 107 -37 30 -26 -10 -279 -128 89 -182 122 -110 -166 116 80 -49 115 -104 134
6447 134 -92 57 -16 69 -119 21 -214 -18 105 52 -38 -41 80 -46 38 59 85 -15 87 -29 -15 -30 85 13
6471 13 -25 67 30 -137 -58 -78 226 74 -65 256 16 160 101 -96 79 -69 -103 -146 50 -37 24 -236 75 75
6495 75 56 61 -25 -260 -114 -25 -50 -65 -75 -55 119 -107 137 -44 -59 16 -93 48 -24 12 -17 -72 30 39 40 162 -93
6522 -93 86 120 59 -31 47 -37 -176 -68 -19 29 18 -46 112 33 66 -80 33 118 -17 51 38 -31 -150 152 93 203
6548 203 -68 -40 101 83 -110 -144 -235 -60 -73 -93 -10 8 47 -37 -91 0 7 -148 -62 -91 -53 -87 -103 35 156 -113
6574 -113 10 54 -125 -143 -110 -195 -92 -45 -32 -68 -11 108 57 -18 -2 80 39 -59 -54 -157 -78 -71 131 -64 276 -137
6600 -137 -220 83 -2 -57 33 42 -38 63 -48 84 55 -88 52 15 26 -69 -44 88 -131 12 -52 -180 108 -51
6624 -51 60 -52 -82 67 33 66 19 -4 -192 -130 -85 16 -102 -127 -60 10 -65 -234 109 -23 113 -1 59 -87
6648 -87 8 40 -16 55 60 -17 91 -115 66 65 -105 59 -99 -38 114 31 -3 -40 -3 3 118 198 64 57 62 160 -170 -27
6676 -27 -42 -8 75 30 72 -87 52 -124 174 9 -100 103 84 150 74 -61 60 68 39 -166 248 9 -43 -54 179
6701 179 87 -22 -28 -30 -61 71 137 16 105 79 39 248 -87 -45 129 139 1 -135 109 28 28 11 -14 -191 55 -35
6727 -35 103 -142 196 -130 72 170 61 50 -77 90 -9 -8 75 -121 -152 -78 -44 105 34 -78 101 170 -149 8
6751 8 -44 2 42 92 71 -27 185 98 -106 -110 -162 67 -88 -117 -26 -145 -129 93 35 -160 -61 177 -50 -20 -26 -53 116
6778 116 -105 -44 17 51 -151 143 83 63 -81 94 -43 -28 -36 -18 -20 20 20 -166 235 -27 166 134 46 -139 59
6803 59 100 79 -8 130 -30 -106 -31 103 6 -160 -39 -33 84 -40 -4 -32 -137 186 -46 -53 -11 76 53 103 172 -130
6829 -130 -102 -151 12 56 -29 35 106 190 60 99 5 -93 148 76 145 52 -60 -26 -23 182 86 -73 85 91 123 89 -133
6856 -133 113 -93 -32 36 -46 29 175 95 0 20 11 54 168 -31 66 229 -7 -191 -105 -113 65 -38 -40 260 -82
6881 -82 146 173 -93 -159 -23 65 -57 -55 96 180 -40 141 -33 -64 -161 -136 152 -30 -48 -153 167 172 42 -24 13
6906 13 8 39 -61 109 58 -9 -7 37 -65 -29 -37 30 59 -114 -52 135 13 -75 27 81 18 19 -70 -5 22 111 122 -47
6934 -47 -2 -35 138 46 -5 -86 -125 -64 24 2 -28 -10 -40 -3 -37 -66 36 5 -25 4 -20 32 -87 -61 68 -47 -275
6961 -275 73 74 -27 15 85 -19 138 -90 42 -64 -72 -79 46 -18 -185 49 27 -130 150 7 -206 -5 15 -158
6985 -158 -89 -24 158 -17 54 -97 114 148 108 88 69 1 99 -47 -161 49 11 -1 89 37 88 -105 -136 -17 1
7010 1 -128 130 -38 -66 312 44 -42 45 -6 -54 116 -23 22 148 84 11 68 -29 29 -23 65 -114 -186 -94 145 -49
7036 -49 0 92 36 12 61 39 17 131 -114 133 -173 88 0 -103 211 -76 -19 -1 7 97 96 120 161 34 -66 104
7062 104 -38 146 -40 -190 -42 47 92 -38 -79 -129 80 -38 -33 249 -8 -29 150 77 -9 -143 -149 -64 -122 -77 51
7087 51 42 -134 92 -37 4 130 84 -24 -43 -37 3 -8 -77 107 140 -40 77 -40 -103 41 15 -112 50 73 5
7112 5 -79 21 -7 158 37 -123 -33 -17 -17 92 -101 -64 -21 -10 100 -25 -79 60 91 -50 -73 -101 131 -18 143
7137 143 -75 17 -17 -114 -72 -25 -260 56 48 -50 127 -42 180 15 -132 -36 -79 -72 146 33 169 32 8 19 -5
7162 -5 102 -38 -119 -29 247 -34 178 -101 207 -56 68 -32 53 -206 121 81 54 -21 81 -91 54 -68 -54
7185 -54 -27 -48 4 141 208 -164 -23 -151 -99 130 174 -20 1 -139 133 145 25 -21 82 -108 -26 82 -113 250
7209 250 136 117 -74 -39 97 152 68 -38 96 -29 104 68 -69 106 51 17 20 -58 -167 114 -52 115 5
7232 5 -86 11 -29 -115 27 60 13 -9 30 81 -62 68 -18 111 89 -50 -116 185 -80 5 -36 57 147 17 70 -42
7258 -42 18 6 50 -178 -18 -25 57 24 -52 34 -99 106 -21 -37 49 -63 20 -64 -123 102 -5 62 59 4 -173 -59
7284 -59 -95 -57 38 81 22 30 -146 96 -28 -120 36 -76 14 -22 14 116 71 -119 63 -53 -67 -101 -41 55 -92 28
7310 28 -138 81 101 -120 -14 -104 15 22 -79 -47 -69 -5 -176 -37 -66 12 -91 -26 29 -174 -14 -112 200 14
7334 14 30 -127 -61 46 -3 77 122 7 -70 -71 -83 28 -214 -58 -66 157 -6 64 -70 61 -34 53 64 58 152 -52
7360 -52 143 -123 82 -60 -50 50 176 -169 -89 -56 116 -175 -82 123 -118 116 34 102 -32 19 -34 161 -115
7383 -115 -27 31 -65 -63 -18 -59 29 123 61 -59 9 -99 -8 17 -80 -35 -105 9 -19 151 272 3 -4 -6 -15 67 -56 -37
7411 -37 -78 19 -59 -126 -111 -49 -15 -65 -86 124 3 -21 -14 52 94 -123 -11 -11 169 96 135 114 -65 54 -1 -144 60
7438 60 25 -50 -134 70 63 -66 83 57 78 -17 -132 -30 271 -122 -70 -311 -36 -44 83 21 11 40 -12 37 -115 -7
7464 -7 -137 75 140 -2 6 -72 -24 256 -11 33 -75 -98 -124 -69 -27 99 65 -9 17 -63 -10 -56 -26 -19 -120 -5 -63
7491 -63 -29 -50 -88 151 85 -8 -59 -70 51 -99 50 108 43 45 -6 -38 -49 -49 -75 91 12 -7 76 58 33 -109 3 -63
7519 -63 -96 -110 32 181 23 73 -49 -60 123 115 116 24 -283 -61 169 -2 150 80 -42 -29 -36 21 16 -125 17 42
7545 42 85 110 120 -79 61 -61 -114 59 57 70 25 -116 68 104 -17 19 128 64 -112 127 -25 68 67 -22 -50 -88
7571 -88 18 -27 -22 -35 21 11 98 43 127 73 37 81 -1 11 93 88 93 -79 88 -45 -14 -49 26 -47 -107 142 72 3 31
7600 31 50 -95 -155 -99 -124 -47 -34 2 96 -26 3 12 -103 -76 51 -61 -32 -46 65 -21 8 -178 -164 26 -15 123
7626 123 -129 -41 -7 -119 28 73 93 -87 -53 -40 -52 -101 42 -56 106 51 -36 7 141 49 -202 73 -18 183 22
7651 22 -35 43 -79 20 -22 -24 -49 99 -13 71 -90 43 37 -40 27 -40 12 20 -3 -42 107 35 109 43 81 25 0 -16 -3
7680 -3 -62 -8 -65 -40 55 10 -5 -273 10 -66 130 2 -51 -42 117 -179 126 -50 198 13 29 11 -127 -243 -10
7705 -10 122 81 83 -78 -1 23 -103 -200 -122 -105 -53 -38 80 69 -11 -76 -75 -92 97 -111 81 -52 75 110 15 24 3
7732 3 104 -3 42 -59 40 131 80 -45 117 36 -133 -200 -6 -14 55 -46 0 -30 38 130 -18 82 96 68 70 -124
7758 -124 -22 -40 153 -85 121 -31 50 92 28 14 -30 -94 14 -106 123 168 88 176 -17 125 26 50 -6 -61 74
7783 74 61 50 -36 40 22 122 36 100 45 124 104 223 -15 -183 74 -44 106 22 14 84 -145 -85 -100 93 -222 -4
7809 -4 25 20 -14 -74 -123 1 86 52 149 40 35 17 -181 37 -91 -45 74 -48 -10 78 -102 -170 42 8 57 62 -46
7836 -46 34 -52 36 -233 -122 -89 -73 127 -112 5 -55 116 -3 -189 -117 107 81 96 -49 107 38 134 95 -80
7860 -80 -118 103 -122 -51 10 62 -213 -20 108 -20 -80 -51 115 -39 110 -145 112 -121 -185 138 157 146 78 59
7884 59 24 119 80 65 75 165 35 -71 -17 -110 144 -107 -1 10 -57 -86 -152 -11 -76 -33 2 50 -52 89 -102 -46
7910 -46 165 116 -45 133 -61 -105 7 110 92 69 15 -39 -243 18 68 3 -114 -8 -33 69 -14 268 -56 -13
7934 -13 79 -4 70 -125 15 132 -132 -6 92 104 14 180 -140 -95 48 -34 64 -185 -29 6 -174 20 -85 -8
7958 -8 -20 16 -179 0 -90 139 -92 78 -125 -15 93 -118 -66 96 59 -90 -94 -106 61 46 -31 -176 -37 -3
7982 -3 -55 -303 90 72 33 57 62 -51 7 173 28 45 -123 -41 189 -8 87 -125 141 136 55 -98 150 11 -90
8007 -90 -8 -25 135 100 -6 -27 151 30 -34 -70 -31 -3 2 204 -71 -1 235 14 146 59 17 53 -159 -21 29
8032 29 -104 112 -27 -125 -92 29 -57 -47 -9 60 -40 26 58 -14 26 59 78 74 69 -73 30 -86 -4 163 -60 -25
8058 -25 115 -35 -14 -127 62 86 49 129 -31 94 22 -111 24 -62 -10 -111 -208 106 152 -136 35 43 -40 -73 -255
8083 -255 82 69 -7 -3 56 131 -13 -74 10 -157 0 83 55 -100 -93 -44 -87 50 -44 -3 18 -178 42 64 -114 65
8109 65 132 97 -167 -154 98 -3 71 117 -16 -221 26 -32 27 81 -44 -59 -31 67 3 -146 -89 6 74 -28 -59 14
8135 14 72 -14 9 -4 62 -54 -41 -10 124 39 -6 -113 98 78 -59 -182 -82 -95 -27 128 6 23 37 -115 -91
8160 -91 -110 -47 8 -64 -165 70 11 46 42 60 -73 180 -6 117 26 -86 91 -209 -112 -7 169 -107 -54 -7 -33
8185 -33 16 49 65 -87 28 39
8191C9
##END NTUPLES=NMR FID
##END=
