##TITLE=1H_Pr 3-DB
 200.13MHz,CDCl3,
 8 sc
 
 13.3.2025
##JCAMPDX= 6.0         $$ Bruker NMR JCAMP-DX V2.0
##DATA TYPE= NMR FID
##DATA CLASS= NTUPLES
##ORIGIN= UXNMR, Bruker Analytische Messtechnik GmbH
##OWNER= pz
$$ XWIN-NMR		Version 3.5
$$ Thu Mar 13 14:38:19 2025 Russian Standard Time (UT+4h)  she@DPX200
##.OBSERVE FREQUENCY= 200.1313
##.OBSERVE NUCLEUS= ^1H
##.DELAY= (6, 6)
##.ACQUISITION MODE= SIMULTANEOUS
##.ACQUISITION SCHEME= undefined
##.AVERAGES= 8
##.DIGITISER RES= 18
##SPECTROMETER/DATA SYSTEM= spect
##.PULSE SEQUENCE= zg30
##.SOLVENT NAME= CDCl3
##.SHIFT REFERENCE= (INTERNAL, CDCl3, 0, 14.3821)
##AUDIT TRAIL= $$ (NUMBER, WHEN, WHO, WHERE, WHAT)
$$ ##TITLE= Audit trail, XWIN-NMR		Version 3.5
$$ ##JCAMPDX= 5.01
$$ ##ORIGIN= Bruker BioSpin GmbH
$$ ##OWNER= she
$$ F:/spectra/data/she/nmr/H-C/1/audita.txt
$$ ##AUDIT TRAIL=  $$ (NUMBER, WHEN, WHO, WHERE, WHAT)
(   1,<2025-03-13 14:37:20.71 +0400>,<she>,<DPX200>,
      <created by zg, POWCHK disabled, PULCHK disabled
       configuration hash MD5:
       00 E9 B6 7A A2 85 ED C7 34 08 36 98 17 FE 4E 26
       data hash MD5: 16K
       BC 33 A1 A8 51 AD 05 29 60 0D 0A AF E8 3C 36 C4>)
$$ ##END=
$$ 
$$ hash MD5
$$ 07 34 C0 00 5A C5 84 5D 01 34 76 53 71 0E 82 A1
##$RELAX= 
##$RELAX= 
##$RELAX= 
##$RELAX= 
##$RELAX= 
##$RELAX= 
$$ Bruker specific parameters
$$ --------------------------
##$DU= <F:/spectra>
##$EXPNO= 1
##$NAME= <H-C>
##$PROCNO= 1
##$TYPE= <nmr>
##$USER= <she>
##$AMP= (0..31)
100 100 100 100 100 100 100 100 100 100 100 100 100 100 100 100 100 100 
100 100 100 100 100 100 100 100 100 100 100 100 100 100 
##$AQSEQ= 0
##$AQ_mod= 1
##$AUNM= <au_zg>
##$AUTOPOS= <>
##$BF1= 200.13
##$BF2= 200.13
##$BF3= 200.13
##$BF4= 200.13
##$BF5= 200.13
##$BF6= 200.13
##$BF7= 200.13
##$BF8= 200.13
##$BYTORDA= 1
##$CFDGTYP= 0
##$CFRGTYP= 5
##$CHEMSTR= <none>
##$CNST= (0..31)
1 1 145 1 1 1 1 1 1 1 1 1 1 1 1 1 1 1 1 1 1 1 1 1 1 1 1 1 1 1 1 1 
##$CPDPRG= <>
##$CPDPRG1= <>
##$CPDPRG2= <>
##$CPDPRG3= <>
##$CPDPRG4= <mlev>
##$CPDPRG5= <mlev>
##$CPDPRG6= <mlev>
##$CPDPRG7= <mlev>
##$CPDPRG8= <mlev>
##$CPDPRGB= <>
##$CPDPRGT= <>
##$D= (0..31)
0 0.7 0 0 0 0 0 0 0 0 0 0.03 0 0 0 0 0 0 0 0 0 0 0 0 0 0 0 0 0 0 0 0 
##$DATE= 1741862240
##$DBL= (0..7)
120 120 120 120 120 120 120 120 
##$DBP= (0..7)
150 150 150 150 150 150 150 150 
##$DBP07= 0
##$DBPNAM0= <>
##$DBPNAM1= <>
##$DBPNAM2= <>
##$DBPNAM3= <>
##$DBPNAM4= <>
##$DBPNAM5= <>
##$DBPNAM6= <>
##$DBPNAM7= <>
##$DBPOAL= (0..7)
0.5 0.5 0.5 0.5 0.5 0.5 0.5 0.5 
##$DBPOFFS= (0..7)
0 0 0 0 0 0 0 0 
##$DE= 6
##$DECBNUC= <off>
##$DECIM= 32
##$DECNUC= <off>
##$DECSTAT= 4
##$DIGMOD= 1
##$DIGTYP= 9
##$DL= (0..7)
0 120 120 120 120 120 120 120 
##$DP= (0..7)
150 150 150 150 150 150 150 150 
##$DP07= 0
##$DPNAME0= <>
##$DPNAME1= <>
##$DPNAME2= <>
##$DPNAME3= <>
##$DPNAME4= <>
##$DPNAME5= <>
##$DPNAME6= <>
##$DPNAME7= <>
##$DPOAL= (0..7)
0.5 0.5 0.5 0.5 0.5 0.5 0.5 0.5 
##$DPOFFS= (0..7)
0 0 0 0 0 0 0 0 
##$DQDMODE= 0
##$DR= 18
##$DS= 0
##$DSLIST= <SSSSSSSSSSSSSSS>
$$ [...]
##$SUBNAM0= <"">
##$SUBNAM1= <"">
##$SUBNAM2= <"">
##$SUBNAM3= <"">
##$SUBNAM4= <"">
##$SUBNAM5= <"">
##$SUBNAM6= <"">
##$SUBNAM7= <"">
##$SUBNAM8= <"">
##$SUBNAM9= <"">
##$SW= 18.0517328524113
##$SWIBOX= (0..15)
0 0 2 0 0 0 0 0 0 0 0 0 0 0 0 0 
##$SW_h= 3612.71676300578
##$TD= 16384
##$TD0= 1
##$TE= 0
##$TE2= 300
##$TE3= 300
##$TEG= 300
##$TL= (0..7)
0 120 120 120 120 120 120 120 
##$TP= (0..7)
150 150 150 150 150 150 150 150 
##$TP07= 0
##$TPNAME0= <>
##$TPNAME1= <>
##$TPNAME2= <>
##$TPNAME3= <>
##$TPNAME4= <>
##$TPNAME5= <>
##$TPNAME6= <>
##$TPNAME7= <>
##$TPOAL= (0..7)
0.5 0.5 0.5 0.5 0.5 0.5 0.5 0.5 
##$TPOFFS= (0..7)
0 0 0 0 0 0 0 0 
##$TUNHIN= 0
##$TUNHOUT= 0
##$TUNXOUT= 0
##$USERA1= <user>
##$USERA2= <user>
##$USERA3= <user>
##$USERA4= <user>
##$USERA5= <user>
##$V9= 5
##$VALIST= <valist>
##$VCLIST= <CCCCCCCCCCCCCCC>
##$VD= 0
##$VDLIST= <DDDDDDDDDDDDDDD>
##$VPLIST= <PPPPPPPPPPPPPPP>
##$VTLIST= <TTTTTTTTTTTTTTT>
##$WBST= 1024
##$WBSW= 4
##$XGAIN= (0..3)
0 0 0 0 
##$XL= 0
##$YL= 0
##$YMAX_a= 903099
##$YMIN_a= -774906
##$ZGOPTNS= <>
##$ZL1= 120
##$ZL2= 120
##$ZL3= 120
##$ZL4= 120
##$ABSF1= 10
##$ABSF2= 0
##$ABSG= 5
##$ABSL= 3
##$ALPHA= 0
##$AQORDER= 0
##$ASSFAC= 0
##$ASSFACI= 0
##$ASSFACX= 0
##$ASSWID= 0
##$AUNMP= <proc_1d>
##$AZFE= 0.1
##$AZFW= 0.1
##$BCFW= 1
##$BC_mod= 2
##$BYTORDP= 1
##$COROFFS= 0
##$CY= -3
##$DATMOD= 1
##$DC= 2
##$DFILT= <>
##$DTYPP= 0
##$F1P= 0
##$F2P= 0
##$FCOR= 0.5
##$FTSIZE= 0
##$FT_mod= 4
##$GAMMA= 1
##$GB= 0.15
##$INTBC= 1
##$INTSCL= 1
##$ISEN= 128
##$LB= 0.25
##$LEV0= 0
##$LPBIN= 0
##$MAXI= 10000
##$MC2= 0
##$MEAN= 0
##$ME_mod= 0
##$MI= 1.114404
##$NCOEF= 0
##$NC_proc= 0
##$NLEV= 6
##$NOISF1= 3.799351
##$NOISF2= 2.8
##$NSP= 1
##$NTH_PI= 0
##$NZP= 0
##$OFFSET= 14.38212
##$PC= 1
##$PHC0= -467.5302
##$PHC1= 6.59221
##$PH_mod= 1
##$PKNL= yes
##$PPARMOD= 0
##$PSCAL= 0
##$PSIGN= 0
##$REVERSE= no
##$SF= 200.129724274929
##$SI= 16384
##$SIGF1= 3
##$SIGF2= 2
##$SINO= 400
##$SIOLD= 16384
##$SREGLST= <1H.CDCl3>
##$SSB= 0
##$STSI= 0
##$STSR= 0
##$SW_p= 3205.1282051282
##$SYMM= 0
##$S_DEV= 0
##$TDeff= 0
##$TDoff= 0
##$TI= <>
##$TILT= no
##$TM1= 0
##$TM2= 0
##$TOPLEV= 0
##$USERP1= <user>
##$USERP2= <user>
##$USERP3= <user>
##$USERP4= <user>
##$USERP5= <user>
##$WDW= 1
##$XDIM= 8192
##$YMAX_p= 0
##$YMIN_p= 0
$$ End of Bruker specific parameters
$$ ---------------------------------
##NTUPLES= NMR FID
##VAR_NAME=  TIME,          FID/REAL,        FID/IMAG
##SYMBOL=    X,             R,               I
##VAR_TYPE=  INDEPENDENT,   DEPENDENT,       DEPENDENT
##VAR_FORM=  AFFN,          ASDF,            ASDF
##VAR_DIM=   8192,          8192,            8192
##UNITS=     SECONDS,       ARBITRARY UNITS, ARBITRARY UNITS
##FACTOR=    0.0002768,     1,               1
##FIRST=     0,             0,               0
##LAST=      2.2672688,     0,               0
##MIN=       0,             -774906,         0
##MAX=       2.2672688,     903099,          0
$$ Real data points
##PAGE= N=1
##DATA TABLE= (X++(R..R)), XYDATA
0 0 0 0 0 0 0 0 0 0 0 0 0 -8 0 -8 8 -8 13 -16 16 -21 24 -29 37 -40 48 -55 64 -75 85 -101 109 -126 141 -162 182
35 182 -205 229 -256 285 -318 354 -392 434 -478 532 -585 646 -710 784 -864 949 -1048 1155
53 1155 -1278 1413 -1568 1745 -1950 2190 -2478 2830 -3266 3831 -4585 5651 -7274 10017 -15506
68 -15506 30672 -161603 -472863 48956 370115 267290 495898 903099 713614 367169
78 367169 338690 149755 -310619 -414748 -273682 -334971 -383025 -262097 -333287 -468224 -318666
89 -318666 -152835 -153997 62050 420210 472680 395430 481968 410831 117744 22391 55249
100 55249 -84811 -135193 12163 -53446 -279514 -270085 -237133 -398509 -360393 -88375 -31453
111 -31453 -14253 304975 479806 248892 151983 268558 120380 -87551 35441 97411 -108114
122 -108114 -108916 41966 -135890 -365826 -248310 -148320 -219507 -49222 231092 185598 90096
133 90096 219208 180804 -62545 -38656 139874 89895 48617 183905 121721 -138995 -209082
144 -209082 -197283 -325659 -306269 -54243 54847 27156 131202 186454 38323 -13885 88400
155 88400 78125 47755 182909 241223 94546 -7792 -46130 -178062 -251569 -162133 -116183
166 -116183 -114962 1313 66914 -36654 -63568 12404 -29808 -46784 140777 244272 142010
177 142010 145718 216294 51611 -142949 -94124 -66104 -179952 -131084 29382 -10236 -92073
188 -92073 -10193 -3209 -121259 -74682 63647 52225 59960 194681 183907 30410 17924 37342
200 37342 -99154 -149381 -9032 27534 -48912 3461 56775 -65758 -137012 -49737 -24563
211 -24563 -43670 71404 174086 114057 62167 67170 -27260 -132138 -87559 -28808 -44969 5774
223 5774 88919 39346 -46288 -38122 -45991 -91614 -32490 75113 90996 89528 119762 65082 -43087
236 -43087 -65982 -55867 -82197 -50990 30704 33218 -7510 -3117 -25906 -90154 -75155 -3314
248 -3314 21744 55493 126711 119921 43301 16403 -3019 -76286 -90104 -16597 8234 -8804
260 -8804 29523 45184 -30278 -76957 -52084 -54074 -57220 17244 83273 75961 73090 76777 14111
273 14111 -49598 -38016 -25164 -36225 4594 55993 24243 -23574 -23322 -47434 -92835 -60918
285 -60918 12673 38217 56765 96966 78571 4763 -28197 -32129 -55091 -43141 21119 51261
297 51261 33788 27470 7605 -56193 -96630 -72250 -37082 -7728 44028 85945 73083 37418
309 37418 12301 -16148 -39547 -26135 8110 29754 37227 31282 1324 -43922 -73155 -73957 -54526
322 -54526 -20588 23458 58385 64274 44413 16773 -10049 -33908 -34640 -2842 32845 47407 49331
335 49331 36633 -5251 -53158 -72742 -70591 -56968 -19566 30164 54291 49122 34491 7328
347 7328 -24930 -29740 -6834 15268 36804 55530 44362 5048 -29099 -56018 -76884 -64593
359 -64593 -19508 18542 38553 49533 36458 -2710 -31230 -36417 -27920 -703 42661 67329
371 67329 65276 49229 7879 -47039 -69731 -59343 -47283 -18899 30059 45101 15184 -4526
383 -4526 -15161 -47352 -54431 -7801 32807 45355 68134 72858 22602 -23241 -27563 -37630 -45299
396 -45299 -473 44002 32361 17046 14800 -31113 -85450 -72698 -36771 -24459 15855 72941
408 72941 67274 28233 19889 -2659 -47589 -34186 18769 28879 32889 66150 45808 -28893 -53225
421 -53225 -44227 -69711 -63281 9626 43832 21144 27712 29545 -29539 -61294 -22650 -2142 1943
434 1943 56397 91730 44624 2880 -2659 -45585 -84900 -39778 14937 16383 35636 67452 26355
447 26355 -38188 -42322 -40280 -56541 -17102 46427 46435 28682 35590 253 -61949 -56679 -20291 -17206
461 -17206 12745 74632 69480 20655 13667 -1205 -55642 -54627 1586 13235 10808 46969 38175
474 38175 -33292 -56505 -40980 -64604 -59119 19658 60706 41240 55655 60938 -7405 -47236
486 -47236 -11563 -4941 -19523 31346 69317 18932 -17513 -9639 -52916 -97547 -44983 12556
498 12556 2708 26071 78295 43668 -19847 -10344 -6126 -43517 -12767 56812 44605 10095 29400
511 29400 7239 -69658 -73258 -27780 -31883 -16774 56542 68021 13978 11204 20566 -31611 -48185
524 -48185 7905 24831 8303 39840 47214 -22277 -55115 -30359 -47111 -63680 -2805 44344
536 44344 24832 31250 51575 2749 -40366 -6012 12801 -7124 24708 66011 29929 -9749
548 -9749 -4387 -38581 -87249 -52502 640 -8995 1614 49477 31344 -20030 -10678 -632 -30752
561 -30752 -5751 59747 54366 22889 40861 27013 -39650 -49565 -18990 -35829 -34448 27591 36341
574 36341 -16813 -17714 463 -40042 -53207 5413 28034 15736 53781 73012 11106 -23961
586 -23961 485 -15463 -44516 -589 36165 5970 1698 23485 -21260 -70041 -36695 -6839
598 -6839 -23625 4392 56983 39190 8533 25291 9095 -40475 -22007 24327 10328 690
610 690 35188 21771 -32758 -33930 -21204 -49898 -40367 22934 36133 13053 31044 36848 -10670
623 -10670 -24085 3567 -4782 -12881 31672 46624 953 -14057 -5517 -41176 -63575 -24789 -2151
636 -2151 -9533 23019 54187 19763 -7592 10745 2536 -20829 9411 40426 19440 13864 29920
649 29920 -6769 -56354 -43538 -25964 -41892 -21011 25837 20189 601 18594 12980 -25588
661 -25588 -13246 27502 23361 19923 50536 42032 -5929 -14888 -12029 -46847 -53674 -9478 3471
674 3471 -13172 5375 17981 -16387 -28438 -1221 -1974 -7968 32407 57881 30821 19177 26605
687 26605 -5833 -39005 -19725 -5677 -21000 -5732 21658 -512 -27256 -16140 -17966 -36538
699 -36538 -13637 24188 23264 24546 46938 32822 -5994 -8327 -608 -18935 -15032 15915 15474 -4675
713 -4675 -426 -5822 -37764 -41554 -14836 -7500 -2014 29325 39232 15256 8359 11868 -10022 -19907
727 -19907 6133 18187 7859 15012 18373 -11329 -32544 -25163 -27181 -31304 -3088 22577 16147
740 16147 14629 22505 3457 -18894 -7441 4963 -242 12778 33467 20145 -3423 -6122 -16654
753 -16654 -37496 -28298 -2808 1005 5424 23847 17798 -8136 -11338 -4847 -13036 -6783 21428 28749
767 28749 15787 14695 8134 -19662 -32292 -19175 -13009 -8480 13537 25146 10607 -204 -1923
780 -1923 -15706 -24545 -6042 12796 15712 22531 27864 8773 -14167 -19163 -21794 -24224 -9002 12301
794 12301 15802 12412 10936 -2340 -19918 -18827 -7397 57 13352 29962 28842 12770 339
807 339 -12363 -26779 -25711 -10732 998 9645 17119 11952 -5062 -16647 -19796 -19967 -8773 12947
821 12947 27462 29247 25609 14073 -6126 -19880 -20196 -14699 -4495 9497 16349 9823 -1988
834 -1988 -13585 -25302 -28083 -15860 1825 16173 27702 30583 19332 2731 -9854 -16264 -15244
847 -15244 -4966 8648 16581 15505 6356 -8796 -23523 -29867 -25040 -11449 6148 21378 28044
860 28044 22573 9070 -4631 -13685 -15791 -8043 6240 17391 18387 11421 -499 -17039 -29494
873 -29494 -28108 -16700 -2201 13725 25836 23147 11605 939 -9907 -16870 -10187 5161 14353
886 14353 17785 18840 7515 -12929 -24934 -26172 -24109 -13004 7174 19236 17645 14194 6545
899 6545 -8480 -15454 -7036 1943 9101 21691 26067 11914 -3998 -12269 -23410 -28849 -15399 905
913 905 6762 12041 15254 2459 -13334 -14898 -11680 -8948 6515 25117 25723 17600 13038 -855
927 -855 -19663 -20340 -9516 -4929 2582 15638 12636 -3213 -10451 -14855 -23701 -18264 1761 12606
941 12606 15176 22688 19208 -527 -10025 -6848 -8893 -6443 11030 19686 10238 4866 -219 -17817
955 -17817 -28079 -16933 -7369 -3505 11512 22582 10653 -1483 -1260 -9047 -16692 -2714 14033
968 14033 12871 13906 19130 4367 -15977 -16272 -13757 -17640 -6291 13639 13019 4900 8360 1485
982 1485 -17237 -15402 -102 1430 4958 21441 19876 1080 -5227 -6611 -19878 -20846 -782 7735
996 7735 5327 13691 15344 -4103 -13911 -6099 -7560 -9476 8621 21668 12270 6633 7866 -8506
1010 -8506 -22829 -12900 -4107 -6186 4970 18914 9144 -4354 -1889 -7553 -18797 -7608 10667
1023 10667 9594 9724 19747 10687 -9628 -11215 -7277 -14398 -8075 11663 12145 2586 6472 3555
1037 3555 -16269 -17965 -4411 -3851 -1902 15938 19839 3477 -385 2337 -11070 -16937 -617 7775
1051 7775 3165 11302 16279 -1940 -13567 -6121 -9853 -16700 -1293 13669 6970 4210 10529 -1600
1065 -1600 -16872 -8065 587 -4598 3535 19587 13240 32 2668 -2588 -18263 -12556 3419 964
1079 964 -379 12765 10480 -7040 -8872 -3634 -12552 -10183 9310 13064 4608 10173 11347 -6592
1093 -6592 -13468 -3048 -4519 -7401 7931 15237 1434 -3035 1748 -9014 -18295 -4833 4325 867
1107 867 9102 17990 4772 -6606 -747 -3107 -13095 -3304 10262 5275 2681 9965 713 -15472
1121 -15472 -10849 -3104 -8834 -3692 12905 11139 2235 5541 2977 -11643 -9892 3821 2879 371
1135 371 12234 12433 -3568 -7077 -3773 -13070 -15038 2020 7843 1334 6931 10971 -3179 -10698
1149 -10698 -2006 -2657 -5926 8072 17108 6479 1283 5034 -5500 -17229 -8695 -261 -3969 2870
1163 2870 13354 4690 -6165 -2346 -3434 -12142 -4103 9965 8548 6565 13622 7006 -8989 -9365
1177 -9365 -3926 -8823 -6474 7797 8929 717 2134 876 -12081 -13379 -1024 1657 1450 12684
1191 12684 15945 3389 -2366 -585 -9093 -13083 -723 6503 2668 5721 8695 -3257 -12241 -7895
1205 -7895 -6932 -8861 3317 14417 9369 5184 7398 -1064 -12339 -7361 223 -1085 4017 13048
1219 13048 8051 -3652 -4428 -7156 -15120 -10420 2589 4908 5314 12174 8527 -4137 -7201 -3461
1233 -3461 -6224 -3484 9274 12820 6114 5050 2450 -9914 -14820 -7446 -3693 -2117 7315 12272
1247 12272 3490 -2136 -1652 -7543 -11250 -1288 7596 7443 9768 12219 2602 -7703 -8069 -7971 -10284 -2168
1263 -2168 7592 7080 3376 4101 -2081 -11494 -9201 -2297 -83 5081 13192 11903 3338 -479 -3999
1278 -3999 -10750 -9940 -1178 3018 3450 7630 5412 -3952 -8579 -6953 -7139 -4032 5905 11629 9390 7467
1294 7467 4593 -4383 -10041 -7187 -3885 -1425 4577 8612 3450 -2348 -4595 -8724 -11007 -4659 3477
1309 3477 7167 9454 11140 5773 -2412 -4763 -5042 -5670 -699 5649 6320 3820 1716 -3677 -10580 -11128
1325 -11128 -6777 -2798 2490 8692 9375 4811 812 -1973 -5442 -4286 1513 5881 7323 8189 4974
1340 4974 -2385 -7992 -9298 -9324 -6595 -348 4925 5555 3938 1287 -3356 -6054 -4340 -75 4209 8279
1356 8279 10569 8016 2612 -2642 -7091 -8961 -6676 -1787 1918 3927 3718 504 -3792 -7117 -6739
1371 -6739 -3506 1243 6445 9677 9391 5890 417 -4275 -6391 -5925 -2593 1310 3804 4033 1489 -3140
1387 -3140 -6905 -7847 -5659 -2042 3679 8575 9260 6741 3006 -1467 -5197 -5624 -2714 215 2793 4500
1403 4500 2766 -1964 -5557 -7355 -7832 -4585 1566 6027 7737 8596 5959 427 -3260 -3477 -3136 -1674
1419 -1674 2543 4748 2405 54 -3169 -7718 -9551 -6113 -1917 1502 6048 8677 6006 1875 322
1434 322 -2251 -3726 -544 3660 4020 3727 3005 -1559 -6979 -8165 -6766 -6349 -1668 4536 5677 4189
1450 4189 4023 1683 -2641 -3147 604 1959 3133 6557 5691 -80 -3394 -4693 -8280 -7989 -2563 1011
1466 1011 1591 3839 4882 44 -2870 -1202 -921 -1189 3867 7296 4732 2221 1689 -3153 -7611 -5582
1482 -5582 -3195 -2633 723 4694 2523 -992 -357 -1507 -4561 -1400 4216 4612 4385 6502 3692 -2599
1498 -2599 -3881 -3542 -5809 -4382 1634 2379 88 1386 812 -4255 -4822 -355 893 1365 6109 7738
1514 7738 2874 649 398 -3829 -6109 -1661 437 -871 1356 3351 -1449 -4877 -2422 -2541 -3604
1529 -3604 1195 6212 4969 3548 4868 1265 -4076 -3005 -815 -2729 -151 3933 2148 -2594 -1586
1544 -1586 -2603 -6323 -4172 1439 2141 2516 6233 5649 -83 -1280 -569 -3163 -2969 2281 3100 461
1560 461 1420 1286 -4480 -6482 -2440 -1896 -1704 3472 6512 2643 1273 2263 -1480 -4668 -845 2016
1576 2016 796 2533 4697 294 -4102 -3105 -3582 -5944 -2085 3588 3046 2265 4467 1868 -3305 -2449
1592 -2449 -260 -918 181 5340 4369 218 -287 -1498 -6034 -5940 -992 -136 -113 4377 4815 -278 -1506
1609 -1506 -629 -2733 -2840 2183 4407 2209 3043 3251 -2363 -5772 -3464 -3110 -3331 1072 4642 2079
1625 2079 515 1396 -1086 -4666 -1659 1931 1789 3315 6153 2812 -2160 -1888 -3015 -5871 -3709 1610
1641 1610 1531 1032 3229 1608 -3248 -3088 -584 -1200 90 5081 5726 2402 1958 533 -4244 -5467 -2012
1658 -2012 -966 -1279 2290 3570 -699 -2420 -1637 -2997 -3399 1237 4710 3560 4262 4773 239 -3571
1674 -3571 -1768 -2047 -3080 202 3103 1010 -985 -215 -1921 -5441 -3136 547 803 2264 5838 4163
1690 4163 471 -116 -583 -3365 -2315 1973 2043 905 2023 853 -3663 -4484 -2853 -2779 -1708 2699 4161
1707 4161 2169 1749 1430 -1804 -2944 257 948 570 3097 4137 205 -2349 -2013 -3429 -4218 -621
1723 -621 1890 1471 1999 2840 26 -2735 -1568 -892 -1111 1453 4296 2952 694 549 -1448 -4383 -3648
1740 -3648 -833 -558 713 3456 2075 -393 -1152 -1435 -2511 -1441 2196 2932 1970 2896 1903 -2137 -3221
1757 -3221 -1916 -2035 -1580 1645 2757 970 153 -15 -2257 -3301 -884 804 1222 3014 3827 1288
1773 1288 -848 -1192 -2428 -3299 -926 1407 1002 1196 1886 -613 -2572 -2275 -1223 -950 923 3336 2825
1790 2825 1314 1230 -603 -2506 -2476 -430 -102 568 2192 1671 -483 -1134 -1539 -2508 -1896 830 1883 1880
1808 1880 2595 1637 -953 -2088 -1735 -1493 -982 778 2274 1152 393 45 -1550 -2642 -1112 400 1076
1825 1076 2238 3031 1350 -77 -589 -1856 -2277 -1142 423 667 1002 1018 121 -1437 -1953 -1417 -970 619
1843 619 2404 2599 1966 1082 56 -1633 -1792 -709 -556 50 1009 954 -299 -1323 -1592 -2117 -1655 -101
1861 -101 1222 1954 2240 1674 617 -337 -802 -1047 -648 558 1248 1033 191 -622 -1667 -2428 -1688 -699 24
1880 24 1305 1634 1572 982 -60 -360 -524 -182 509 1209 1092 755 101 -960 -1532 -2006 -1636 -671 477
1899 477 1100 1050 658 110 -588 -666 -107 439 1385 1334 1021 995 -381 -1279 -1807 -1511 -1289 -488 562 1015 560
1920 560 69 -504 -743 -690 1 844 1337 1605 1233 165 -435 -869 -1467 -1283 -545 -26 124 483 174 -401
1940 -401 -1034 -900 -331 281 1080 1908 1607 1205 403 -234 -1260 -883 -322 21 174 692 -46 -277 -773 -953
1960 -953 -1241 -157 685 1437 1277 1445 804 -445 -389 -634 -597 -108 505 546 -95 -255 -357 -1323 -1262 -548 -138
1981 -138 461 1320 1726 693 220 40 -785 -632 90 663 372 669 597 -738 -1359 -1279 -1287 -1196 208 980 744
2002 744 750 953 -35 -891 -295 272 343 977 1173 556 -420 -553 -1007 -1759 -1134 334 449 655 917 375 -439
2023 -439 -608 -234 -423 -315 1153 1463 616 601 440 -984 -1626 -545 -394 -428 613 688 -171 -99 -204 -901
2043 -901 -966 73 812 729 1296 966 161 -527 -572 -671 -989 -28 714 673 78 211 -449 -884 -647 -100 136
2064 136 754 1247 775 129 189 31 -889 -867 210 263 289 1071 511 -648 -918 -299 -556 -364 667 1222
2084 1222 616 436 204 -649 -797 -122 -63 -39 776 793 -31 -306 -374 -1065 -1270 -26 750 343 657 1072 9
2105 9 -652 -104 -338 -578 235 801 452 4 354 -401 -775 -405 -257 -69 380 1115 472 -299 -87 -344 -733
2126 -733 -428 390 375 161 608 401 -524 -850 -701 -281 -410 374 791 303 174 314 -930 -853 -76 -5 77
2147 77 711 873 -102 -395 -458 -767 -832 -51 304 411 400 455 -397 -545 -558 -262 -388 557 968 422 154 190
2169 190 -444 -768 -354 144 47 371 1125 80 -354 -237 -359 -623 -311 595 273 459 711 -32 -708 -620
2189 -620 -279 -345 -177 689 593 136 -147 -110 -967 -719 -168 123 280 549 801 -163 -285 -17 -507 -611 -3
2210 -3 357 202 371 429 -251 -591 -482 -351 -272 345 787 303 -2 179 -380 -709 -92 84 66 371 632 321
2232 321 -451 -552 -131 -477 -129 344 539 310 309 201 -512 -276 -114 -104 53 678 750 -57 -19 -171 -733 -447
2254 -447 -251 100 413 439 596 -173 -355 -46 -532 -350 185 599 507 254 378 -154 -163 -250 142 -300 82 501
2276 501 -1 -152 30 -312 -376 -64 147 233 365 538 -247 -227 -92 -577 -409 6 417 359 209 254 -195 -605
2298 -605 -223 -98 -213 111 444 522 141 -84 -107 -656 -310 -143 254 320 798 145 -269 -224 -595 -402 -312 118
2320 118 475 391 228 373 -238 -335 -376 -187 -184 324 428 -62 187 177 -679 -478 -305 -45 361 496 840 411
2342 411 -59 -329 -145 -463 65 272 300 437 379 -166 -589 -460 -345 -161 13 567 530 212 22 -10 -455
2363 -455 -221 -69 63 381 396 324 42 -278 -502 -611 -420 -165 255 616 489 264 -66 -192 44 -313 122
2384 122 183 706 395 211 -49 -1034 -876 -517 -358 113 511 347 411 38 -461 -368 -248 -132 606 697 395
2405 395 436 -172 -623 -880 -715 -386 -458 208 696 249 -236 -55 -481 -617 5 52 893 596 242 262 -205
2426 -205 -545 -550 -710 -489 58 389 105 105 -212 -705 -704 -201 184 587 773 966 829 -85 -430 -575 -525 -391
2448 -391 -2 212 313 345 -308 -752 -801 -613 -340 239 835 696 707 360 -58 -256 -533 -260 145 344 447
2469 447 78 -509 -691 -885 -1046 -951 54 445 544 647 923 582 -356 -284 -168 117 444 730 687 -202 -447
2490 -447 -842 -1047 -818 -502 55 298 754 570 -13 -111 -262 -197 157 950 977 726 642 -157 -767 -1006 -959 -607
2512 -607 -608 164 541 160 72 -175 -324 -716 134 707 927 1163 1180 228 -237 -526 -712 -757 -294 130 317 -142
2534 -142 162 -420 -1199 -452 -47 23 527 1057 1002 677 617 109 -517 -498 -248 142 284 595 19 -701 -910
2555 -910 -676 -1055 -428 354 822 937 732 879 -83 -466 26 -215 -206 379 841 -18 -578 -535 -1097 -1273 -924
2576 -924 31 205 680 841 560 -4 -119 -204 -442 313 853 994 691 311 -278 -1062 -1260 -679 -557 -37
2596 -37 768 237 128 26 -263 -261 -494 131 579 713 1275 1010 -68 -563 -195 -716 -925 30 413 85 658
2617 658 314 -635 -861 -733 -84 -176 732 920 551 242 114 -324 -815 -695 19 120 595 717 59 -409
2637 -409 -525 -485 -832 -306 402 626 250 695 188 -735 -369 204 -233 -100 1019 912 177 -95 94 -1248
2657 -1248 -1050 38 162 280 681 812 -254 -275 -158 -526 -589 480 906 417 566 555 -138 -1001 -512 -124
2677 -124 -394 319 831 -37 -308 313 -381 -968 -400 143 -53 188 954 453 -542 -100 -309 -823 -248 427
2697 427 419 284 336 94 -810 -909 -379 -494 -104 861 765 -94 175 84 -530 -792 12 263 183 855 642 -25
2719 -25 -585 -116 -602 -890 166 648 397 465 744 44 -595 -524 -137 -100 370 803 667 9 443 -306 -815
2740 -815 -673 128 -271 56 1083 557 -373 -309 122 -588 -289 437 264 459 413 461 -349 -508 -257 -389 -376
2761 -376 489 454 247 33 -6 -454 -836 -71 -9 220 480 929 542 -60 -217 -461 -743 -144 549 200 243
2782 243 524 -222 -715 -437 -598 -528 58 780 733 561 433 -96 -618 -842 -279 -195 351 880 459 -377 -376 -396
2804 -396 -1135 -1024 157 54 295 564 654 -28 -383 -353 -324 -49 487 894 533 309 157 -522 -871 -381 -280
2825 -280 -318 407 499 250 86 -156 -546 -679 22 456 566 889 777 345 -677 -798 -373 -862 -375 162
2845 162 485 363 324 -266 -527 -613 -255 -133 532 765 808 175 204 -245 -575 -559 -169 116 222 804 201 -179
2867 -179 -596 -596 -700 -402 116 651 455 554 409 -208 -565 -417 -332 182 417 878 397 18 -383 -562 -802
2888 -802 -398 29 151 711 631 597 -291 -631 -645 -469 -10 617 678 617 290 103 -477 -675 -651 -20 333 220
2910 220 419 241 -249 -326 -514 -842 -454 235 352 711 927 97 -54 -490 -606 79 369 474 672 789
2930 789 48 -389 -490 -761 -442 39 252 450 416 59 119 -521 -535 -190 351 384 483 707 512 -240 -382 -640
2952 -640 -671 -287 144 222 164 43 -353 -621 -576 -563 78 516 743 734 894 574 -264 -352 -617 -519 139 363 328
2975 328 224 -186 -419 -576 -865 -552 122 451 906 732 508 -72 -38 -622 -400 114 484 575 299 -64 -620
2996 -620 -906 -881 -679 -420 72 590 523 174 288 -236 -499 -127 81 699 739 774 342 -178 -340 -781 -1087
3017 -1087 -358 -174 122 102 510 367 -319 -204 -220 -83 336 684 456 579 525 438 -601 -652 -387 -268 -346
3038 -346 425 321 -175 -223 -385 -572 -192 3 652 446 700 739 -22 -211 -131 -447 -411 -12 417 223 -256
3059 -256 -170 -582 -850 -611 -343 73 788 856 741 -119 -82 -70 -544 -183 347 156 45 327 -176 -627 -825
3080 -825 -488 -756 -542 739 503 348 667 192 -244 -27 -31 24 296 445 764 -27 -192 -335 -831 -1136 -261
3101 -261 266 185 34 421 -127 -542 -12 200 14 583 1083 631 388 314 400 -677 -609 -339 -350 243 373
3122 373 -3 -268 -370 -450 -943 -54 444 410 460 815 894 -93 -123 -81 -498 -130 324 235 -7 51 -53 -898 -850
3145 -850 -255 -217 72 599 783 412 320 451 -128 -470 168 397 169 418 447 -285 -805 -605 -641 -421 -197
3166 -197 430 249 199 459 360 -176 -37 406 -191 462 901 684 -187 -457 -395 -774 -732 -254 -138 -75 268 467
3188 467 -388 -521 -116 -321 27 418 544 649 613 302 -15 -655 -394 -248 -273 15 152 12 -377 -171 -469
3209 -469 -708 -168 372 410 698 789 683 112 -100 -236 -587 -5 -41 212 -141 87 13 -677 -737 -586 -252 -111
3231 -111 803 552 371 157 190 -107 -336 225 229 46 591 143 -444 -617 -433 -730 -623 0 189 174 301
3252 301 780 -189 -525 -267 56 -138 350 782 495 -228 27 -406 -982 -331 -213 -102 -84 571 213 -9
3272 -9 -456 -32 -154 125 496 406 317 715 361 -609 -559 -382 -529 -232 450 295 230 -98 107 -625 -245 150
3294 150 478 368 637 670 55 -135 -74 -324 -775 53 37 -118 -22 -57 -226 -741 -266 6 -162 376 558 453
3316 453 435 376 246 -382 -387 134 -370 -13 435 -1 -559 -587 -327 -51 -525 570 607 372 441 442 -320 -406 -96
3339 -96 -22 251 79 419 298 -60 -55 -759 -763 -393 -93 118 381 650 402 96 -91 -598 -202 294 284 373 277
3362 277 287 -108 -844 -646 -593 -387 134 427 396 295 312 170 -169 -164 251 163 655 641 352 -9 -354 -424 -640
3385 -640 -662 -84 312 4 272 370 -137 -301 105 52 86 468 756 511 292 -54 -360 -822 -509 -194 36
3406 36 255 293 -197 -343 -451 -582 -319 86 361 454 727 391 -52 -312 -371 -325 -225 -124 207 100 -251 -76
3428 -76 -325 -272 -779 -178 -93 330 695 508 120 142 37 -133 -124 -167 476 95 130 -58 -612 -771 -589 -532 -249
3451 -249 95 545 346 20 163 -287 -152 -145 35 107 502 678 406 121 -252 -541 -306 -58 -158 -49 276
3472 276 2 0 -308 -400 -142 51 341 750 492 364 179 -216 -482 -562 -308 -7 242 215 114 -170 -181 -325
3494 -325 -270 -388 579 292 813 439 426 -25 -108 -427 -398 -110 90 13 145 169 -505 -564 -154 -207 243 295 376
3517 376 273 373 180 -82 -27 -186 117 -106 330 289 -177 -236 -203 -606 -528 -153 1 295 696 653 417 -290
3539 -290 -310 -379 -129 214 383 326 17 119 -105 -457 -817 -560 -340 -2 393 -2 342 47 -305 -29 -18
3560 -18 136 106 269 439 331 156 -344 -171 -284 -317 217 170 303 46 130 -146 -506 -153 139 112 246 669
3582 669 318 73 33 -399 -484 -161 106 -233 -8 127 -149 -345 -223 -258 -457 -34 327 519 251 710 178
3603 178 -200 -283 -214 -447 -60 69 162 78 -132 -121 -798 -527 -418 95 230 309 530 253 15 221 -61 -239
3625 -239 63 58 111 49 -19 -147 -511 -335 -733 -326 185 433 150 170 347 -201 -329 267 183 204 597 311 279
3648 279 -382 -125 -78 -439 -342 -30 168 385 554 -48 -270 56 -6 -42 -177 269 303 148 99 28 -327 -316 -73
3671 -73 -176 -296 132 457 -274 -184 -8 -108 -277 34 274 552 275 388 -53 -381 -262 -348 -168 51 286
3692 286 -4 -84 51 -315 -642 -93 50 -149 153 380 305 -40 139 -19 -182 -155 227 89 -73 82 267
3713 267 -190 -380 -295 -512 -275 334 370 285 92 161 142 -268 210 79 -228 290 479 -298 -54 -96 -450 -463
3735 -463 -467 311 269 58 271 -71 -150 -74 -76 -222 116 234 374 299 31 -376 -668 -328 79 83 258 448 387 -231
3759 -231 53 -338 -272 -174 261 234 168 432 108 -85 -486 -524 -532 -426 377 447 451 87 32 -352 -172 -266 22 280
3783 280 436 768 -34 -52 -36 -313 -478 -486 238 -108 166 268 -162 -208 -196 -216 -135 -136 383 416 238 391 22 -415
3807 -415 -458 62 -220 75 42 225 90 -217 -309 -226 -420 197 140 157 558 -4 38 -115 194 -271 -231 99 492
3830 492 117 -51 92 -256 -448 -456 66 -180 271 297 -99 204 111 -213 -308 212 177 118 -71 85 3 -357 -335
3853 -335 -214 -367 -273 243 372 102 345 320 -386 -194 119 84 233 673 304 2 113 -272 -198 -496 -320
3874 -320 -142 -173 247 204 59 165 -32 -135 103 287 476 193 599 66 -138 -236 -405 -268 -380 -330 245
3895 245 4 -282 -104 -207 -360 74 238 185 453 450 552 9 -120 -152 -353 -358 189 232 -191 -173 -451 -431 -237
3918 -237 -301 -4 391 270 463 325 71 -20 -70 6 -23 30 357 20 19 -421 -566 -275 -574 -343 104 307 389
3941 389 255 35 100 -271 119 -75 -100 13 479 -137 -171 -164 -249 -440 -481 -204 73 113 214 131 -12 -193 340
3964 340 -130 157 236 332 245 147 -86 -241 -518 -530 -272 -227 -185 15 50 112 90 -52 -440 184 283 149 497 282
3988 282 194 -114 -242 -481 -168 -414 -149 -162 54 22 -191 -118 -457 -150 -144 187 424 221 513 34 0 -197
4010 -197 -48 18 96 55 174 237 41 -539 -464 -145 -115 67 279 199 355 108 -128 -28 109 -35 25 -9 74
4033 74 79 -102 -165 -3 -410 -334 -441 -48 233 135 120 36 -196 187 208 -10 19 134 376 87 -6 -329 -201 -519
4057 -519 99 37 73 -9 304 -104 -84 -92 121 54 331 298 330 276 -144 -118 -138 -125 -258 -292 -125 20 285 -173 -57
4082 -57 -189 -345 -98 285 418 399 306 590 96 -113 -399 -340 -251 -65 -109 -18 111 -62 -290 -295 -214 -2 70 407
4106 407 317 367 149 63 -61 -213 99 -52 136 263 167 -9 -305 -99 -370 -177 -114 245 -106 441 378 -213
4128 -213 -24 30 -22 -131 122 349 193 -126 -219 -201 -555 -401 70 -86 213 257 505 -124 20 25 142 -21
4150 -21 144 153 322 -8 257 -141 -435 -183 -63 -92 -64 219 194 221 -101 -85 -33 -40 -31 328 167 141 282 -265 -256
4175 -256 -319 -588 -161 145 75 90 336 430 83 -208 -23 66 110 188 479 -45 119 -109 -462 -395 -551 -275 268
4198 268 108 174 -201 -237 139 -117 -206 464 47 171 185 436 -69 28 -253 -155 -8 -272 206 -404 -258 123
4220 123 -193 -240 -258 82 168 414 239 312 -120 -22 -411 -317 61 69 -6 -16 28 -59 -89 -262 -89 103 28 243 429
4245 429 267 258 58 26 -208 186 44 40 204 100 -133 -296 -419 -402 -445 136 130 136 18 138 265 -47 -102 3
4269 3 121 328 302 -189 201 -214 -225 -342 -250 -40 -198 -247 109 246 -198 -28 135 -92 -13 375 64 289
4291 289 150 116 -128 -321 -271 -189 -27 -85 318 278 57 168 -16 -103 45 276 34 -34 179 204 -274 -255 -190
4314 -190 -327 -104 -102 -28 203 216 70 -137 -198 178 -98 231 365 118 86 170 91 -284 -310 63 -95 192 199 113
4338 113 -195 37 -38 -316 -120 36 191 119 80 237 111 -184 -116 -70 -187 -1 123 229 25 -177 -533 -373
4360 -373 -192 -4 107 302 30 114 -94 -152 89 -161 -50 39 33 100 146 80 -232 -119 -236 -72 -85 224 204
4383 204 189 132 4 -165 -204 -402 -137 -15 431 32 -130 -216 -77 -178 -104 -315 21 216 108 246 96 -58
4405 -58 -161 -95 76 43 183 -14 -118 50 -210 -251 -117 42 -120 40 200 95 59 80 -247 -160 -112 -234 151
4428 151 183 -12 123 -132 -273 -182 17 149 107 25 305 -44 -239 -109 119 -266 -41 -159 -30 -122 18 -58
4450 -58 -46 -190 -134 -197 -74 36 31 76 130 -71 -102 -43 -103 32 32 -175 252 289 -117 -290 -293 -152 8 47 -98 126
4476 126 -254 196 72 -52 -88 -81 -16 158 16 -210 25 -349 -347 -338 8 23 138 210 -65 -83 -53 -211 57 39
4500 39 -21 -125 124 19 -209 -333 -172 -56 -191 -90 111 272 -56 38 -59 -40 -22 -48 64 401 128 5
4522 5 258 -440 -105 -44 -76 -76 214 42 72 94 -11 -153 -41 -182 363 -52 106 320 -292 -230 68 23 95 35
4546 35 -131 -156 101 -347 -240 67 -11 -49 -176 -148 174 227 95 55 -16 112 -107 52 68 4 -229 167 198 -337
4570 -337 -231 -226 -186 -68 -134 232 259 419 330 92 38 93 -132 106 87 49 166 -232 -100 76 -310 -272 -184 162
4594 162 106 257 155 -120 112 -139 -32 -85 253 212 156 26 -267 -172 -190 9 -85 -164 238 -22 79 31 -47
4617 -47 -1 -5 79 339 189 -56 -99 135 -16 -195 -69 134 25 126 189 269 -125 -211 -98 -144 -3 -153 -158 -34
4641 -34 196 112 87 0 74 -65 -123 104 -196 -205 197 171 -145 -99 109 -44 228 195 91 -35 229 -35 -294 44
4665 44 147 91 0 -86 60 -93 -10 -159 -92 -147 163 220 -178 224 -2 -120 -279 -69 20 19 -57 -84 -254 35
4689 35 102 -81 200 227 364 111 140 -173 -12 -218 275 -78 36 -382 -120 -55 -127 -207 387 187 54 246
4711 246 -113 218 326 184 85 279 -34 -334 37 141 -202 -183 152 -137 16 -293 163 75 -355 24 62
4732 62 237 126 87 378 248 17 281 6 -98 -94 109 91 -296 -400 -468 -172 28 5 22 328 -22 469 119
4755 119 -17 -152 -77 -16 -40 -211 -140 248 -199 -162 -97 -28 -61 -12 173 -142 239 -100 100 167 -6 -203 -313
4778 -313 -14 -32 217 -353 113 -382 -237 50 146 -85 44 34 122 -15 -143 263 -57 18 152 117 -61 93
4800 93 -142 -69 -161 -254 -36 5 98 86 155 -124 22 -149 -53 11 -9 121 -43 -118 126 -79 239 -67 -110 -4
4824 -4 -151 -59 -35 -3 -127 -193 -146 -91 29 -33 31 177 -20 -5 -14 11 29 192 -94 -141 58 -120 -242 153 -225
4849 -225 34 6 -39 -97 -279 53 1 64 -10 65 199 -70 35 79 62 42 96 29 49 42 293 157 -103 169 -65
4874 -65 40 -227 178 -99 214 -26 -43 26 106 59 -58 149 -168 -68 323 -48 314 68 -202 52 6 54
4896 54 113 -19 -86 132 262 24 -178 241 -43 201 226 92 101 221 22 -95 -338 -199 -90 220 382 -20
4918 -20 91 122 -88 83 -66 33 30 -166 186 128 38 134 27 -316 -184 166 64 79 -1 -56 -145 112 -341 109
4942 109 117 -9 43 -246 -156 -189 166 -324 -293 173 254 -67 -14 125 48 -24 153 -268 -117 34 -141 164 42
4965 42 -378 124 -136 165 53 -137 14 -144 -146 278 -207 75 -16 -105 133 27 234 232 -15 256 29 -111
4987 -111 -94 56 63 201 99 88 260 -330 -60 -124 -33 -79 -163 76 -87 174 -15 -146 -131 -229 -49 33 4 67
5011 67 175 -331 -92 -169 -411 -94 -17 290 -15 -204 -277 -131 75 3 50 -282 192 80 -35 -21 -9 176 -84
5034 -84 64 6 -249 -98 135 41 -34 105 73 44 43 246 107 98 -133 -10 -135 135 180 23 -329 -200 237 -50
5058 -50 -68 81 17 70 -96 -215 -5 110 180 -29 80 24 169 -35 129 38 176 87 -64 -7 -179 136 119
5081 119 -178 107 116 -209 -8 36 -40 2 -197 197 -120 -16 122 -37 -50 -111 -34 264 -125 95 107 -119 -61
5104 -61 70 -169 63 96 -279 -14 -80 -120 75 145 47 -36 -25 -90 78 65 5 -109 -7 378 -122 -104 -43 -65 146
5129 146 128 -26 -38 -135 -92 162 -100 221 219 87 -113 -220 -206 71 140 -50 275 -79 -148 97 -137 203 -234
5152 -234 -197 -190 -254 -10 46 26 298 -20 40 -71 -78 42 -26 -110 105 -80 -71 -164 -164 87 -154 -29 -183 -66 -103 53
5178 53 -78 -61 73 12 -63 94 -57 -169 49 -29 132 25 91 -38 165 52 304 47 127 2 -237 154
5200 154 72 -41 113 309 311 -45 -312 98 217 46 -202 89 -12 -141 -29 191 284 -59 -360 -19 -39 -28
5222 -28 111 -35 486 -174 -387 162 82 150 96 -55 436 11 265 1 -11 31 82 97 -298 65 -58 -152 41
5245 41 -48 -240 47 -61 76 -145 -90 -104 24 -41 -83 -41 163 -13 137 -55 -180 156 65 87 -25 -75 -194
5268 -194 -185 -61 52 -63 -210 -78 3 -131 -1 154 8 -68 -61 -50 226 -104 175 255 -129 44 -209 76 -37
5291 -37 99 -228 -61 53 -71 184 -140 180 76 47 -173 -81 -83 -136 240 -82 188 29 -22 -145 -186 31 222
5314 222 166 103 -312 -64 -70 -163 57 189 -61 -95 -37 -44 83 38 -202 103 8 -137 110 -100 -198 -145 62 -307
5338 -307 -19 -72 69 119 -144 -217 -137 175 42 -16 -53 -38 12 7 289 61 139 67 155 -2 168 84 35 203 -57
5363 -57 -172 233 -51 -33 177 247 -105 92 37 2 175 -200 66 -123 -10 -97 91 -39 -77 -164 178 -42 5
5386 5 132 -84 -97 -286 -100 78 112 -3 136 58 -30 -109 -68 -233 -175 -25 164 -48 -47 234 4 81 338 106
5410 106 22 15 -138 -308 -19 -7 250 81 -61 140 -196 213 -36 -123 141 -210 116 -50 230 191 57 46
5432 46 -52 -120 63 26 -97 44 164 28 -69 216 49 19 -32 209 36 -22 -139 -140 17 221 186 95 136 -51
5456 -51 44 -51 303 30 -234 14 97 69 198 96 -2 101 102 66 31 -85 81 -160 153 -35 76 5 -66 21
5480 21 -4 102 -24 63 -143 -10 197 -290 397 7 39 -135 80 -318 -236 -237 -241 -242 -81 -158 12 -12 97 77 -268
5505 -268 -127 -104 -26 -168 101 -74 -101 168 -26 3 90 119 -6 115 -330 46 28 -132 -74 213 -178 208 -199
5528 -199 -9 54 -197 183 -21 1 150 12 -108 118 -58 -30 30 -165 103 -40 53 176 241 33 93 -147
5550 -147 -109 -38 -273 128 256 73 -143 -124 35 175 197 -74 121 103 318 -39 -14 -42 85 218 -89 107
5572 107 -5 170 288 -48 39 -103 -140 15 -259 -45 -34 45 -11 43 115 -151 -27 92 202 20 -68 137 63
5595 63 93 -38 19 -372 -61 -299 106 -48 121 -220 -43 -135 177 -50 -209 84 66 -86 -104 129 120 80 -7
5618 -7 -32 59 134 76 10 47 115 -10 -134 202 -87 -45 41 -9 131 138 102 6 -99 39 -273 -71 100 -108 -256
5643 -256 -264 228 152 -58 -46 -87 164 226 21 57 61 -66 -15 272 -40 -238 -132 168 -55 165 60 -342 17
5666 17 230 11 111 -6 -72 41 -19 -314 -110 73 -37 176 -169 78 40 -22 -33 329 -131 -121 178 275 -62
5689 -62 -30 70 -130 -67 -331 13 3 131 -5 0 64 -63 -243 -236 131 188 106 -99 -174 -79 -81 65 -14 -178 -107 75
5715 75 -135 158 -81 125 -10 0 288 30 -8 27 -194 -89 -71 69 162 -49 55 -45 182 -138 121 96
5737 96 -341 -105 -358 173 -77 -312 202 -87 -54 269 38 166 -157 114 -65 91 -1 -124 157 -21 146
5758 146 -48 -74 -295 -42 60 -173 -256 -122 46 38 -30 -198 -64 75 -12 -93 24 -150 -50 142 20 -104
5780 -104 -183 215 270 -104 114 120 -150 -36 -16 152 61 236 85 -120 277 -56 -130 -172 28 50 -40 7 -171 -2
5804 -2 -84 -8 -68 -109 -351 22 131 63 -36 -112 -213 50 -226 200 115 -395 88 -14 138 48 285 -263 31 229
5828 229 54 -116 -186 128 111 264 -62 -12 -113 -43 16 95 22 -58 -24 -21 -114 9 13 74 99 57 -120 -59 -294 -163
5854 -163 -11 -102 21 -109 8 -4 313 127 150 -22 -46 -175 75 40 244 -2 131 239 212 100 -92 -43
5876 -43 -52 28 -308 -8 -51 93 87 50 31 -200 160 55 -34 321 129 148 153 30 253 -54 -23 206 -119 162 -72
5901 -72 -118 -49 -127 63 -179 -164 246 -106 6 -111 389 -38 31 -77 105 85 -66 78 -141 -181 -70 -91 -21
5924 -21 -28 15 -64 -11 100 -198 -135 -167 -169 117 -9 100 174 22 -127 -102 298 -58 180 316 -175 -146 105 49 -96
5949 -96 -158 291 311 86 -68 88 -153 -43 76 200 -106 158 -346 -34 51 112 -267 -146 59 175 8 332
5971 332 -60 -267 -1 -98 227 109 -216 -1 -19 116 -22 -63 151 -84 -168 -85 1 -190 135 -106 70 -50
5993 -50 -42 -93 -188 -83 -121 -4 121 137 -122 93 -99 -28 239 131 -278 75 78 222 -181 35 259 -40 25 33
6017 33 134 -117 -31 -148 444 277 -21 -89 33 -147 -28 -5 -110 123 -96 48 56 -69 30 -188 -76 5 -32
6040 -32 -66 -138 203 66 -38 175 91 -24 -273 46 -86 -94 -14 -92 232 85 111 36 307 188 -54 46 -39 86
6064 86 165 -69 74 232 -123 210 -265 127 23 55 48 86 17 36 59 122 57 -74 -136 73 109 -106 318 50
6088 50 75 -76 -114 209 100 28 112 -21 13 -106 -142 -121 -23 73 -77 12 100 -74 -238 -41 -1 -90 -179 119 34
6113 34 124 162 108 252 111 135 33 -2 127 111 93 79 -146 13 108 -226 40 -195 185 -52 -30 -203 -68 15
6137 15 -96 18 216 231 -266 133 -196 271 -147 284 -111 -357 355 -203 177 37 26 208 -69 -224 32
6158 32 -20 -225 40 119 -3 191 152 174 10 61 389 -111 85 -58 126 76 46 226 14 -257 -166 179 188 25
6182 25 55 -118 122 86 -112 -239 -269 -257 -61 157 -108 32 104 -63 -160 16 -281 -135 172 -27 -288 33
6204 33 49 -44 -228 -115 -140 -185 82 155 275 325 -53 168 -28 56 -67 -178 -186 89 121 27 -72 -151 -3 138 -204
6229 -204 157 -73 145 209 76 120 -12 -48 -280 186 40 -56 -205 -109 -61 -97 86 -243 -24 -14 302 -53 -23
6252 -23 -203 -26 -153 -8 24 31 191 -77 -163 -139 -120 69 36 -194 105 76 102 200 158 -50 31 -98 244 -27
6276 -27 -350 -190 50 5 255 58 42 -36 26 298 -33 -49 -17 129 -181 -99 -85 147 111 407 68 -159 32
6299 32 -35 -196 -292 126 -34 255 241 49 -37 62 224 -80 -164 226 -148 159 -165 -59 145 209 19 -32 171
6322 171 -169 134 -252 -49 81 9 24 27 43 239 -73 179 -310 159 115 112 44 159 -201 -203 -40 -12 -10 -257 -64
6347 -64 72 211 -82 44 159 -154 148 116 -254 361 52 154 -470 -93 -166 50 -55 78 22 -270 -10
6368 -10 -126 240 143 159 23 122 -64 314 27 307 200 130 -107 40 -49 97 33 9 241 -41 64 76 43
6391 43 -153 -194 -173 134 154 -46 -87 -67 -79 -4 -266 -187 -78 152 -110 -266 79 -118 -131 -40 114 308 6 -91
6415 -91 51 -16 323 232 -51 17 -167 -253 -171 -189 -18 -89 82 -29 -198 -186 49 134 172 144 -267 89 37 95 80
6440 80 34 45 87 5 204 87 159 113 -174 -80 -37 -107 10 139 -213 -263 -13 -202 -399 205 -10 -26 -12 0 22
6465 22 244 140 78 145 -326 242 60 227 -120 -55 79 103 -189 -45 -30 162 59 128 -8 24 269 -9 139
6488 139 -19 -196 -92 -14 -274 146 -81 -137 -83 165 -68 249 -71 213 -26 -361 56 66 -110 179 -127
6509 -127 181 318 -133 67 49 -1 73 -73 -175 -156 -72 121 -236 -15 -250 -209 -235 -183 -177 276 201 -123 -28 212
6533 212 -165 45 126 120 -298 23 -91 53 367 2 -150 -9 -138 -288 188 322 99 -177 176 338 13
6554 13 -333 175 -22 -11 90 -39 0 -19 -36 81 -214 43 -194 -141 -161 -73 -81 -93 12 16 61 -14 16 119 -176
6579 -176 81 176 121 110 -258 -135 -206 6 102 200 247 191 -127 242 -20 26 88 37 251 32 124 120 -130 80 -103
6604 -103 -67 3 47 -193 146 -164 -264 -22 30 5 -45 76 145 232 117 -29 59 27 -149 -7 -65 22 -112 -133
6628 -133 102 -155 -226 -93 35 -249 -345 163 -7 -79 4 32 -145 -424 95 82 322 -98 257 126 181 -293
6650 -293 -202 -55 28 85 -56 34 -13 287 -89 20 -63 -76 -4 83 -124 41 229 -140 50 -202 20 -90 370
6673 370 -66 167 -114 129 80 23 151 -262 -77 10 28 108 104 27 188 187 101 -352 -162 89 338 27 156 -45
6697 -45 43 345 -37 -32 143 255 77 83 41 85 39 -173 281 231 159 -302 125 155 -191 111 -126 106 206 -154
6721 -154 -83 -198 -255 114 -168 -138 -48 -72 -158 -123 231 -274 -200 -154 67 90 9 189 233 68 208 -251 -41 84
6745 84 265 -228 25 -31 22 4 90 -170 20 129 -2 385 12 148 84 79 -162 6 86 215 155 -71 -29 -146
6769 -146 -110 -255 -164 10 -313 280 -7 -68 186 -209 9 -349 -5 83 -162 258 -110 -258 -66 -186 -13
6790 -13 40 -75 24 -64 16 -267 98 154 96 -122 121 -181 186 -52 23 -29 -288 35 -213 -73 -69 -27 -25 -85 124
6815 124 -14 -57 -95 -20 -189 77 48 -37 228 -48 150 221 138 -53 87 -8 -274 -37 12 -63 132 -214 100
6838 100 -39 58 81 -8 -132 -107 89 142 -45 -49 87 -162 -131 20 -125 -119 -162 -35 218 -59 266 -31 113 172
6862 172 387 48 -49 6 -44 -104 -257 -18 258 256 -111 -81 -98 -15 -192 -22 -125 2 94 190 -261 25 -56 -98
6886 -98 96 -188 130 312 -3 69 -97 -90 144 -154 69 -297 256 -187 -18 31 107 75 -111 -152 19 14 54 -295
6910 -295 -107 154 237 188 -147 -58 -55 -12 145 64 -256 -242 -18 -27 -156 -5 46 50 -48 45 89 -46 -142 -118 100 152
6936 152 110 -112 -80 -132 -141 174 -134 -90 -236 137 -37 -102 -157 -318 151 -126 -64 -157 -46 -121 -97 -47 410 209
6960 209 48 9 147 -134 -161 63 310 -111 3 -5 94 -32 -159 -142 -170 -243 187 -22 -78 80 193 -40 -119
6983 -119 -53 432 206 -383 -156 -118 -130 364 -176 -81 -124 41 -14 443 140 34 -63 12 -168 10 32 -232 -115
7006 -115 143 11 198 -175 42 125 -9 68 -27 196 212 223 -181 58 77 27 -84 327 254 37 50 25 105 -199
7030 -199 74 -107 -106 -58 -9 -80 -39 -39 -148 -7 -102 -89 24 -136 70 232 25 -57 -45 -37 -182 134 248 82 17
7055 17 180 -59 -39 -52 24 -94 383 -45 28 182 -76 59 -56 -111 44 -119 -102 -44 128 -63 -65 -15 48 113
7079 113 -33 174 -108 80 -91 114 -66 1 221 -56 44 -402 152 -157 32 51 -280 -103 36 145 99
7100 99 152 -76 83 -171 104 361 80 138 -208 -63 -65 120 -5 -72 39 -209 -65 118 -49 -267 -22 -140
7122 -140 -52 -29 -37 74 45 76 -198 -207 1 -282 -8 -62 -222 -80 162 -13 89 221 272 10 -4 21 -110 28
7146 28 253 119 -59 -58 -175 -153 -138 270 -17 42 -106 114 -389 58 142 -52 201 147 -131 57 417 -135 121
7169 121 -153 -161 237 -44 -124 77 -31 -20 7 -211 50 224 -1 54 -36 114 -92 76 234 109 1 67 71
7192 71 -132 231 14 132 -86 -48 192 -92 101 -291 9 -149 165 5 62 13 29 10 96 -115 -13 21 -117
7215 -117 92 8 68 -38 -115 169 -8 -180 -116 -252 111 98 29 -229 71 9 71 191 180 27 -222 -61 -10
7238 -10 15 -79 35 193 71 254 -81 -101 8 -18 -53 -113 -52 -114 59 -46 -168 -37 -9 71 -105 -130 -165 -36
7262 -36 264 99 72 -68 2 -61 -165 38 281 158 153 -164 138 -86 146 -202 -87 54 -141 -114 30 271
7284 271 -39 -278 -58 133 38 279 -84 99 -7 -142 68 -8 -28 -290 301 -75 89 31 -235 -75 -155 115
7306 115 -149 -96 -50 86 159 -214 151 98 -80 -125 113 -190 42 -14 -156 -101 107 -113 -369 112 -28 -206
7328 -206 117 75 -142 -61 -270 -48 62 -129 -119 40 254 -53 130 178 197 -68 -181 73 278 226 -112 5
7350 5 -311 72 -199 197 -204 6 191 101 -38 -167 139 188 -11 111 -128 -118 -53 -143 49 -18 -66 68 -167
7373 -167 -30 47 351 83 -41 140 -128 218 29 -34 191 33 48 33 -116 -252 -10 -70 -159 -3 110 -40
7395 -40 -2 -146 17 -116 47 267 -64 9 195 163 -165 -104 131 116 126 135 37 -118 76 -10 -277 -31 -294 172
7419 172 -135 25 42 -164 -106 -285 97 21 -79 48 170 -13 -84 -49 -63 20 8 -29 42 280 -82 -147 -174 -159
7443 -159 37 52 -4 -23 -20 -25 149 -159 -134 -139 116 13 -319 31 96 -6 -113 -191 168 -223 -335 85 -96 -33
7467 -33 -72 123 -55 -124 326 -105 239 310 -190 161 38 26 47 -13 -16 -115 -26 -126 -203 255 -80 50 8 111
7491 111 277 194 173 250 -231 153 223 132 -110 -325 -87 43 155 -159 61 98 -262 -78 134 87 173 -53 143
7514 143 123 -109 24 283 64 215 180 -251 -93 121 -137 126 -155 140 -141 -88 -110 -172 225 -53 8 -175
7536 -175 -18 -216 -66 110 17 -9 -286 289 158 68 -136 97 -34 -90 103 95 -235 -62 131 46 190 143 0
7559 0 292 -168 -25 -109 119 -256 103 -44 42 25 146 117 -171 171 -47 -23 -133 59 -193 82 -68 188
7581 188 -258 11 -21 169 144 -65 112 -99 -17 -38 4 86 -46 115 -59 -184 -14 -87 18 -64 111 -1 25
7604 25 -27 -226 53 -140 -40 152 -2 -24 -6 267 55 -60 -256 -23 111 -213 45 -32 -164 100 -6 -27
7626 -27 184 95 -107 -89 22 256 174 137 61 113 -60 -13 -104 -454 94 114 -230 175 -109 -32 80 -98 132 -24
7650 -24 -60 51 -122 -77 15 15 4 92 -84 65 -54 -180 -199 232 1 -69 0 -6 300 185 -133 -338 107 12 -10
7675 -10 -77 -8 209 -206 264 9 -125 -46 109 39 -54 -74 181 235 -124 -108 24 -25 -139 219 -275 178 363
7698 363 77 -180 105 -142 -120 49 -79 252 -8 85 6 218 97 86 24 -22 85 -208 342 71 -130 255
7720 255 -1 -99 131 251 64 109 146 156 56 32 119 45 79 208 185 -201 95 -124 147 198 -382 -99 142
7743 142 -77 -12 -236 -162 72 -140 -6 101 -253 150 15 128 177 -52 -173 102 -246 -27 198 -78 -132
7764 -132 -116 -76 -30 -12 -6 187 -45 -56 41 135 16 -109 -411 91 -14 -155 165 -220 -81 -190 -10 -158 2
7787 2 -39 17 40 -78 -82 -195 265 46 -93 -68 332 -3 -51 122 -280 -323 -189 -20 4 -215 -244 132 140 351 -86
7812 -86 -217 172 180 226 126 -162 -171 -17 -99 -169 -277 -333 15 -27 33 64 38 -142 320 -353 69 -190 14 107 10
7837 10 61 -194 -39 -187 156 143 45 -125 144 334 87 55 -76 -93 69 -44 228 -153 178 11 -4 8 51
7860 51 6 -71 -47 -167 168 -110 11 -149 11 57 103 221 43 299 292 -100 -259 -126 200 -217 33 -124 34
7883 34 -341 106 278 1 182 31 -254 95 143 -286 -164 -186 0 -83 4 38 328 174 212 37 155 -268
7905 -268 152 56 87 -13 58 -165 -58 2 -224 73 -27 -74 -1 -135 -110 -131 -33 341 -172 91 -52 -124 128
7928 128 194 16 35 -285 -183 383 117 -132 110 -215 -152 -318 215 -172 -55 -102 -349 -90 -154 -4 146 161
7950 161 247 -67 -204 3 108 -94 201 -162 -77 192 63 -54 125 52 192 -239 67 43 85 -110 -100 212
7972 212 280 -26 196 67 -90 54 -31 -41 7 -39 -162 -351 -102 -91 124 144 -146 -102 -61 118 -385 -217 191
7995 191 -129 -141 -186 307 -252 -55 -39 13 -373 -83 -71 251 -14 -207 -40 45 -47 -25 -206 -123 -21 -79 354
8018 354 207 32 -183 -132 68 -122 25 -31 -225 -255 379 5 118 -212 -150 -140 84 112 -106 -184 -153 -12 -152
8041 -152 219 -143 202 14 -22 -132 37 132 125 -103 -283 -217 -73 -85 -225 -30 -58 90 28 -198 -207 -85 336
8064 336 261 44 215 533 -32 -54 -98 -129 20 219 -138 -180 -186 146 -54 -128 -291 130 -22 62 174 -32 58
8087 58 -26 -134 -239 58 -130 195 103 -111 -38 146 71 -187 -25 187 374 -206 149 99 10 -133 177 69
8109 69 -40 47 -58 -10 53 -287 74 -170 -64 -135 212 5 -68 36 -39 40 -269 155 -42 -82 -125 282 -182
8132 -182 102 -86 56 -255 39 30 26 -15 175 -70 78 -80 -137 -87 63 -242 -73 113 73 -83 49 -29 -99
8155 -99 -110 -214 -45 -181 135 -63 15 54 -47 23 136 185 -95 -52 -33 113 -198 -234 155 -44 69 10 -89 -65
8179 -65 -179 241 65 27 150 50 180 -257 -167 -275 -28 -58
8191e8
$$ Imaginary data points
##PAGE= N=2
##DATA TABLE= (X++(I..I)), XYDATA
0 0 0 0 0 0 0 0 8 0 8 -8 8 -16 16 -24 32 -40 48 -64 72 -94 112 -128 156 -184 216 -248 294 -336 390 -446
30 -446 511 -582 661 -747 842 -951 1065 -1197 1335 -1490 1657 -1842 2045 -2263 2504 -2766
46 -2766 3053 -3365 3709 -4084 4502 -4959 5465 -6032 6666 -7382 8193 -9128 10214 -11500
60 -11500 13040 -14931 17320 -20441 24717 -30959 40972 -59680 106835 -485962 -774906
71 -774906 -138856 -418467 -210166 261222 271905 -56260 211488 422704 262169 289065
81 289065 658601 596687 302172 184891 22213 -348868 -429800 -338989 -410939 -428634 -194264
92 -194264 -147008 -273265 -198582 -32968 -44654 52024 316997 437132 434034 499852 405863
103 405863 124247 -24214 -76256 -245381 -301263 -172651 -177820 -244426 -90640 -13053 -213705
114 -213705 -250926 -26188 28729 9557 233098 373292 226491 202949 287016 74396 -173494
125 -173494 -83434 -16058 -149353 -93969 47917 -118909 -286453 -152128 -118445 -248341 -76901
136 -76901 234778 235019 187653 320368 242272 -40952 -64127 33955 -76957 -93932 113816
147 113816 102833 -117100 -131805 -101459 -274131 -302472 -71276 19616 -3330 162996 278001
158 278001 115315 14253 95342 67836 -1339 107342 170163 51875 2184 1000 -160715
169 -160715 -285428 -199462 -146097 -157710 -8734 136401 54368 2617 102397 64983 -61528
180 -61528 27878 166335 109110 78877 165546 97165 -80124 -104321 -92171 -182124 -171516 -38495
192 -38495 -8663 -26081 48252 55153 -45566 -36488 43823 17389 19464 144069 166754 56662
204 56662 24472 13741 -107794 -167703 -79397 -33364 -38981 42748 95197 12801 -36846 -12052
216 -12052 -51236 -72929 37051 112904 76707 86446 106112 -10360 -122678 -95886 -81082 -111231
228 -111231 -27413 83073 53285 10561 44618 5013 -82843 -36685 52323 41479 55371 128518
240 128518 85101 -34513 -54335 -52860 -119984 -107655 706 27467 863 41351 44517 -44528
252 -44528 -65710 -5713 -3311 -2897 85897 132264 68080 32357 31873 -43518 -116291 -80076 -31867
265 -31867 -34877 -1664 53541 34349 -14974 -22762 -32533 -52235 -17812 42752 64521 73044 80215
278 80215 38471 -25442 -49741 -55429 -61876 -30246 22506 36341 23427 11960 -22504 -64354
290 -64354 -62698 -30250 1635 49210 97499 93810 53193 18775 -25175 -74964 -75928 -34855 -4580
303 -4580 17991 43081 30764 -17218 -45868 -51401 -54163 -28038 29480 65657 68874 67923 45759
316 45759 -8779 -44198 -37995 -25676 -12382 19639 39231 18043 -14882 -36933 -61120 -74715
328 -74715 -48742 506 41118 69252 81710 61047 17997 -17684 -35944 -40856 -26469 6034
340 6034 32585 34189 16883 -9185 -42969 -70520 -64324 -27409 9794 38610 64200 64914 27137
353 27137 -8705 -18714 -27316 -28657 6562 46655 43791 21452 4283 -34512 -81366 -79956 -42317
366 -42317 -16528 17772 65904 70830 33335 9882 -9986 -45164 -40316 12398 40379 39592 55360
379 55360 46354 -18687 -62474 -53716 -54875 -55280 -2232 47218 32484 12220 10753 -22923 -58741
392 -58741 -32354 11271 25718 53892 87579 60104 5732 -14816 -35599 -66789 -47106 6557
404 6557 23540 24465 34142 8023 -46708 -64030 -54345 -49789 -13601 47030 64569 53687 53750 25110
418 25110 -33193 -40808 -9194 -3821 8756 54514 55429 1156 -24280 -34744 -75802 -79275 -17094
431 -17094 19359 22045 54102 62348 -1040 -41296 -25043 -34061 -40795 24146 75633 48548 29858
444 29858 33962 -20526 -80238 -53002 -13596 -13811 25798 79278 49072 -6327 -8198 -29917 -78630
457 -78630 -50249 16210 19101 17371 55588 33231 -40867 -46266 -18720 -37080 -19914 58944 77936
470 77936 40914 42917 31788 -42540 -70785 -26709 -18820 -24808 28636 54559 -22 -29212 -20582
483 -20582 -55316 -73843 -7220 43174 36767 60796 85206 28572 -28026 -18399 -26306 -51328 -5994
496 -5994 47735 22177 -1552 13955 -21580 -78779 -56053 -11734 -11519 22049 82537 63915 10061
509 10061 10637 -1420 -55103 -44752 13979 15608 7127 42472 26835 -45009 -53536 -24640 -43251
522 -43251 -34874 39630 64298 33989 44261 43964 -25207 -51920 -6966 -5110 -25334 20997 48676
535 48676 -4898 -30783 -13377 -48612 -76917 -14324 35305 18037 37087 76355 32580 -20830
547 -20830 -3210 -4114 -38958 -1921 56233 27823 -7226 13370 -11541 -76288 -64477 -20334
559 -20334 -28631 -10200 55180 51045 -989 6601 17154 -26495 -25585 29991 35397 17952 49185
572 49185 45768 -26414 -49999 -22103 -40095 -53140 2081 31084 2776 7713 21073 -27203
584 -27203 -53647 -7204 14834 2706 39042 71920 31993 1851 10709 -21532 -60262 -23256
596 -23256 16022 -3391 -83 30325 1561 -40606 -24023 -16419 -39585 -5907 52431 41340
608 41340 17935 39315 23855 -31326 -28814 -126 -18179 -15162 34038 29528 -20130 -19451 -9545
621 -9545 -45660 -45500 8016 21384 12690 49866 61259 5263 -18235 3607 -15688 -36482 4667
634 4667 27936 -2377 -2190 14023 -27652 -62928 -29024 -7487 -18664 15169 57854 36411 13448
647 13448 29580 10307 -31566 -11711 23883 7966 1890 27189 6344 -40176 -38202 -29977 -52854
660 -52854 -36280 17656 26162 12870 33206 33928 -5914 -10636 14063 4918 690 36419 42118
673 42118 3990 -7166 -6890 -41880 -57039 -25769 -12574 -17720 11410 32263 3473 -11426 5989
686 5989 -2564 -15469 17083 43193 26630 25057 35471 2102 -35242 -26655 -21060 -35808 -16471
699 -16471 16266 5649 -8922 5198 -3995 -33277 -18080 13494 11857 17893 48112 40992 5619
712 5619 281 -1358 -29696 -31545 609 5511 -6267 7823 8699 -24544 -33150 -12831 -13685 -13145
726 -13145 23101 42567 24271 18411 21751 -4771 -26082 -9357 1173 -6128 8020 23180 1582
739 1582 -19923 -16024 -23374 -36587 -14959 14071 15386 19201 33330 19712 -7889 -8883 -4011 -12438
753 -12438 -2972 20922 18965 4360 3500 -7225 -32190 -31948 -12901 -6806 1727 25028 28454 8138
767 8138 -191 -2196 -16622 -17655 4292 15481 13859 20320 16921 -8052 -24302 -22001 -23617 -20260
781 -20260 4279 22712 18584 15011 12573 -5688 -21675 -13580 -2089 2325 16314 27842 16123
794 16123 -1902 -10022 -21936 -32346 -20460 729 8857 15441 23143 13207 -7146 -13442 -11189
807 -11189 -11595 -19 20849 27317 20324 12648 -1755 -23754 -31911 -23093 -13325 -1824 15229 21254
821 21254 9960 -2400 -9676 -17843 -16953 -891 16918 25547 28986 24265 6586 -12894 -22928
834 -22928 -24888 -19393 -4813 9623 13841 9587 772 -11566 -21678 -21200 -9670 6671 21399
847 21399 30663 29577 17184 -264 -15163 -22376 -19358 -8813 4796 14381 13895 4372 -8085 -20787
861 -20787 -25839 -18211 -3213 12535 26087 31328 22268 5652 -8287 -17093 -20082 -11192 4106
874 4106 12471 13736 9579 -3143 -19109 -25671 -21466 -11978 4135 22354 28692 23132 13943 881
888 881 -14698 -19061 -9759 -55 8243 16239 14497 -817 -14055 -21467 -26764 -21663 -3479 12375
902 12375 18473 22967 19583 3060 -10035 -9841 -7915 -3749 10893 22184 16365 6052 -2085 -17650
916 -17650 -30186 -22961 -10456 -2539 10107 21913 13431 -1764 -5819 -10416 -16589 -5063 14957
929 14957 20070 19275 21683 10012 -12076 -18939 -15032 -16208 -8680 10329 14371 3708 529 -4701
943 -4701 -20428 -22633 -5957 4187 8488 22861 27030 10077 -2666 -3945 -12783 -16614 -488
956 -488 12207 8668 9098 9903 -8134 -23930 -18229 -12980 -12223 3940 21990 17222 8398 8442 -2141
971 -2141 -17251 -10859 2484 3489 9044 20076 11660 -7206 -10293 -12362 -22445 -14937 6272 11207
985 11207 9007 16355 11934 -8230 -13537 -5686 -7915 -4966 14036 19505 6442 2817 334 -17402
999 -17402 -23775 -8583 -388 -456 13447 22167 6644 -4950 -1894 -9541 -16291 -594 13684 8549
1013 8549 9683 15331 -448 -18493 -13873 -9683 -14550 -1798 17206 11812 2601 6944 348 -17290
1027 -17290 -13071 2408 1807 5575 20646 16321 -2493 -4214 -3922 -17780 -16794 3385 7874 2821
1041 2821 11160 11602 -8492 -15069 -5404 -8568 -10440 8529 18706 8341 6469 8832 -6890 -17559
1055 -17559 -4866 1233 -3636 7275 19025 6389 -6010 -2839 -9413 -20082 -7855 7337 3571
1068 3571 5028 15903 7172 -9870 -6963 -3055 -10518 -2736 15485 12345 3024 8545 4511 -14043
1082 -14043 -15461 -3749 -5746 -4242 12147 13221 -1818 -1710 1410 -11449 -14292 2493 7938 3319
1096 3319 12761 16496 -1759 -10210 -2765 -7590 -14572 715 11685 3591 2999 8032 -5202 -15929
1110 -15929 -5887 538 -5328 4028 18477 10448 -106 3984 -1550 -15665 -8373 4816 924
1123 924 212 11663 7130 -8448 -7809 -4465 -12765 -8169 9440 10731 3491 9757 9669 -6756 -10498
1138 -10498 -868 -3267 -4649 9730 13315 174 -2634 128 -11345 -17177 -4341 2625 -675 8775
1152 8775 15661 2711 -6301 -127 -3460 -10344 713 11866 6419 4591 9607 -1698 -15299 -10035
1166 -10035 -4789 -9165 -1843 12036 8535 519 3677 0 -12058 -8080 4724 4099 3985 13798
1180 13798 11448 -3120 -6067 -4900 -13576 -11927 3059 6717 2085 6858 7601 -5789 -11161 -3800
1194 -3800 -3619 -3882 9586 16530 7149 2663 3507 -6972 -15281 -6768 15 -1705 5372 12658 2706
1209 2706 -7049 -4413 -6393 -12544 -3507 9517 8856 7987 12612 5195 -8545 -8072 -4414 -7426 -2317
1224 -2317 9586 9227 1365 1451 -2341 -14043 -13838 -2952 512 2323 12456 13463 2491 -1896 -2041
1239 -2041 -8346 -8706 2361 8248 5826 8057 7282 -4751 -12777 -9127 -8596 -7765 2963 11496 7617
1254 7617 4196 3848 -3513 -10677 -5902 1144 2390 7625 13649 7024 -2407 -4724 -8271 -13881 -8425
1269 -8425 2185 4657 5472 8877 4636 -5378 -7419 -4437 -4670 -586 9773 11712 6407 4388 -119
1284 -119 -10165 -12453 -6190 -2494 19 7258 9325 2237 -2602 -3755 -7368 -7794 961 7973 8549
1299 8549 9676 8719 137 -7941 -8203 -8136 -7372 -352 6690 5755 2307 557 -4592 -9992 -6790 -1265
1315 -1265 2815 7724 12714 9808 2595 -1493 -4903 -8372 -6408 669 3859 4132 4564 921 -6230
1330 -6230 -9994 -8744 -6080 -1496 6288 9974 8638 5843 2014 -3609 -6158 -2645 596 3582 6888
1345 6888 7188 1892 -3889 -7740 -10054 -9492 -4824 1529 5426 6726 5968 1828 -2934 -4337 -3181 -750
1361 -750 4494 8712 8724 5265 808 -4652 -9096 -9736 -6421 -1611 2624 4938 4380 1492 -2575 -5139
1377 -5139 -5186 -1953 2832 7378 9506 8528 4002 -1428 -6280 -8481 -6845 -3197 669 3451 4447 1872
1393 1872 -2249 -4844 -5397 -4302 271 5981 9118 8602 6608 1829 -4215 -6973 -6584 -4952 -1547 3020
1409 3020 4058 1355 -762 -3405 -6636 -5958 -1084 3526 6595 9215 9093 4067 -906 -3757 -5650
1424 -5650 -5806 -2063 1824 2183 1884 885 -4042 -7777 -6218 -3561 -1204 4289 9171 8311 5402 3242
1440 3242 -979 -5012 -4115 -750 86 1712 4185 1745 -3657 -5562 -6141 -7150 -4456 2206 5481 5736
1456 5736 6864 5360 -169 -2761 -1250 -1774 -946 3399 4974 1485 -814 -2033 -6712 -8561 -4323
1471 -4323 -832 504 4502 7084 3670 151 75 -1607 -3460 494 4459 3425 2932 3639 -1097 -6760
1487 -6760 -6084 -4645 -5143 -1661 4141 3888 1940 2992 1048 -3339 -2386 1193 1556 2249 6191 4872
1503 4872 -845 -2508 -3088 -7038 -6727 -972 1238 217 3068 3953 -1174 -2838 -445 -776 -1368 4196
1519 4196 6988 3522 2108 2286 -3162 -7124 -3920 -1689 -2958 310 4279 1344 -1864 -813 -1614
1534 -1614 -4130 -456 4321 3762 3985 6442 3018 -3234 -3194 -2456 -4672 -2681 2629 2340 -321 1038
1550 1038 185 -4811 -4547 -148 379 1262 5885 6535 1711 309 335 -3984 -5492 -559 1416 -417 2199
1567 2199 3231 -1733 -4874 -2346 -2779 -3509 1456 5922 3782 3174 3865 -299 -4500 -2562 -400 -1854
1583 -1854 618 4838 2035 -1901 -1311 -2785 -6138 -3395 2000 1999 2544 6271 4472 -1249 -1573 -723 -3435
1600 -3435 -2402 2969 3506 944 1895 884 -4494 -6356 -2571 -1711 -1043 4056 5789 1925 814 1715
1616 1715 -2368 -4275 -337 2342 758 3190 4294 -561 -4099 -3154 -3649 -5192 -1087 3813 2936 2463
1632 2463 4125 838 -3439 -2293 226 -875 1023 5310 3751 -259 -656 -2358 -6455 -5383 -932
1647 -932 177 450 4275 4135 -344 -1168 -141 -2375 -1750 3241 4724 2448 2726 2208 -3067 -5738 -3383
1664 -3383 -3077 -3151 1213 3730 1062 -209 647 -1980 -3803 -260 2443 2182 3918 5792 1959 -2137
1680 -2137 -1811 -2799 -5148 -2514 1639 1112 769 1905 -322 -4183 -2919 -729 -990 967 5205 4849
1696 4849 1820 1556 279 -3824 -3730 -343 192 131 2377 2397 -1384 -3034 -2071 -3362 -2890 1205 3681
1713 3681 2541 2848 3351 -583 -2912 -1581 -792 -919 1835 3640 1331 -799 -616 -2824 -4987 -2485
1729 -2485 324 601 2475 4324 2139 -1217 -636 -973 -2419 -605 2592 2474 1312 2083 -215 -3584
1745 -3584 -3552 -2136 -1770 -545 3066 3111 1314 564 -24 -2567 -2604 429 1405 1329 2980 2808 -377 -2270
1763 -2270 -2163 -2800 -2943 -258 2069 1407 1619 1638 -928 -2466 -1470 -479 -100 2071 3832 2373 93
1780 93 -129 -1953 -3521 -2431 -413 306 1098 2699 1458 -901 -1228 -1296 -1955 -808 2168 2624 2155 2023
1798 2023 541 -1871 -2779 -1976 -1596 -568 1830 2495 1075 201 -601 -2179 -2147 -402 549 1241 2539
1815 2539 2692 260 -1474 -1802 -2573 -2306 -533 1237 1501 1848 1294 -367 -1890 -1466 -689 -163 1362
1832 1362 2601 2161 1060 72 -1170 -2906 -2318 -937 -293 395 1421 994 -124 -1019 -1262 -1458 -412
1849 -412 1299 2172 2069 1873 1041 -875 -1799 -1756 -1676 -836 431 1016 518 77 -574 -1614 -1673 -454 592
1868 592 1228 2037 2563 1316 551 -589 -1287 -1169 -681 430 508 721 442 -597 -1643 -1270 -1360 -773 613
1887 613 1610 1909 1484 890 95 -423 -1066 -188 -76 533 947 632 -461 -1331 -1573 -1887 -1202 -226 597 1383
1907 1383 1257 959 481 -148 -622 -162 325 548 1228 1164 316 -887 -1475 -1843 -1527 -732 420 786 954
1926 954 957 471 11 -462 -172 96 590 1255 1332 605 -200 -697 -1392 -1787 -1158 -257 -141 720 1132 379 -379
1947 -379 -432 -502 -381 368 1476 1306 1299 1041 -4 -1114 -1386 -1034 -757 -67 514 611 -42 -29 -767 -1040 -720
1968 -720 336 851 1535 1635 1243 318 -426 -663 -1242 -1206 -68 150 427 465 120 -738 -1057 -927 -354 53
1988 53 1111 1623 1304 733 606 -375 -1097 -765 -56 232 453 956 22 -758 -820 -1086 -1486 -425 967 1012
2008 1012 1111 1359 753 -472 -391 -38 -442 -236 1115 717 -1 -34 -927 -1641 -1190 -484 -146 203 1482 827
2028 827 74 -131 -108 -453 -572 598 1156 580 757 609 -436 -1269 -746 -836 -719 384 939 423 27 253
2048 253 -375 -932 -205 332 615 1006 1061 565 -316 -577 -670 -1207 -418 297 278 334 833 169 -639 -450 -362 -419
2070 -419 163 1076 776 395 468 -176 -993 -738 -520 -242 123 718 817 13 -852 -229 -690 -810 276 710
2090 710 507 787 770 -251 -854 -445 -385 -494 630 929 219 410 159 -688 -1118 -599 10 122 638 1168
2110 1168 250 -450 -203 -894 -811 -98 552 665 209 632 -129 -758 -329 -314 -511 -92 581 679 381 203 -172
2131 -172 -1044 -609 216 11 402 742 674 127 -450 -422 -478 -415 499 347 188 459 185 -359 -691 -369 -443 -110
2153 -110 440 833 401 125 -216 -501 -798 -213 340 201 489 859 152 -280 -372 -409 -681 31 696 262 290
2174 290 520 -13 -826 -561 -271 -276 208 697 715 234 180 -71 -552 -591 187 42 256 809 527 -336 -371 -349
2196 -349 -822 -232 197 390 88 343 341 -568 -828 -270 -23 78 735 856 336 109 35 -484 -682 -326 -80
2217 -80 -84 30 528 176 -457 -272 -607 -546 -214 809 265 591 544 -47 -652 -311 -229 -107 488 676 458 118
2239 118 -91 -491 -790 -240 133 -65 -26 469 531 -292 -209 -229 -467 -31 157 414 114 379 136 -512 -824
2260 -824 -184 -106 -52 331 659 398 269 -145 -100 -288 173 121 380 301 429 -18 -28 -305 -493 -587 -314 456
2282 456 71 127 324 -133 -473 -128 -386 -14 26 718 95 219 -258 -145 -560 -306 112 258 315 571 41
2303 41 -83 -374 -331 -661 -130 508 331 126 362 289 -241 -546 -217 -120 -39 525 588 28 -213 -74 -329 -519
2325 -519 -193 138 342 807 650 -120 -376 -193 -520 -259 363 546 45 150 378 -79 -384 -203 -176 -144 316
2346 316 332 239 144 -197 -214 -523 -300 53 288 -63 219 19 -182 -431 -503 -230 227 471 416 212 540 261
2368 261 -245 -454 -66 -5 43 274 503 280 4 -302 -628 -800 -227 423 675 741 502 86 -109 -232 -327
2389 -327 -188 202 519 715 361 230 -568 -779 -800 -364 -215 -59 477 451 383 113 55 -407 -302 182 490
2410 490 370 703 -55 -367 -405 -683 -848 -554 -137 282 462 307 43 -7 -326 -219 27 558 765 773 576
2431 576 502 -543 -882 -713 -834 -372 314 275 58 -38 -184 -412 -367 -249 428 838 915 1113 647 -12 -649
2452 -649 -531 -784 -424 -64 72 145 161 -329 -679 -448 -457 -76 604 1141 941 816 540 -85 -482 -300 -467
2473 -467 -184 43 256 213 -529 -696 -856 -871 -587 480 832 905 976 449 126 -251 -238 -215 -77 414 276 30
2495 30 39 -536 -1167 -1220 -713 -185 223 695 955 609 446 165 -374 175 71 419 538 433 356 -527 -899 -1019
2517 -1019 -1194 -784 -213 446 517 547 631 13 -250 -79 456 305 932 1172 535 -98 -419 -803 -1400 -993 -184
2538 -184 59 59 616 26 -575 -223 -312 -252 385 1020 1482 895 888 284 -606 -990 -455 -237 -206 440 447 -292 -532
2561 -532 -756 -713 -848 213 717 900 1133 1050 266 -42 -154 -418 -457 102 854 390 -301 54 -636 -1339 -1026
2582 -1026 -484 -379 485 1092 1054 473 121 -187 -790 50 408 214 356 911 263 -629 -1105 -982 -775 -448
2602 -448 389 622 403 666 260 -745 -620 -148 10 305 1061 1012 149 -186 -516 -1080 -1239 -401 77 421
2622 421 670 587 -40 -654 -382 -523 -270 391 1184 784 377 874 -88 -770 -664 -403 -280 196 1041 238
2642 238 -219 -35 -511 -1117 -793 91 364 677 1225 540 -404 -184 -412 -735 -346 315 605 170 215 182 -769
2663 -769 -834 -441 -358 -223 564 920 333 -74 16 -746 -670 38 458 119 763 1089 -27 -455 -164 -633 -701
2684 -701 -230 689 582 137 482 -130 -997 -618 -316 -6 90 1068 669 25 -13 10 -666 -775 481 176 28
2705 28 672 728 -343 -719 -416 -616 -567 553 784 407 402 570 -458 -491 -414 -257 -231 463 1094 276 -120 -99
2727 -99 -596 -986 -418 206 14 150 891 271 -207 -72 -228 -692 9 597 644 -103 571 -197 -931 -823 -341
2748 -341 -316 -44 707 523 -126 166 -14 -771 -556 105 231 100 865 610 -88 -596 -580 -796 -870 -251 238
2769 238 459 489 348 -228 -522 -661 -230 -188 460 1071 382 523 170 -150 -1075 -482 -250 -70 90 540 351
2790 351 -484 -157 -491 -834 -297 534 420 501 899 413 -487 -440 -428 -510 -311 478 669 -232 -227 -382 -706 -989
2812 -989 -93 201 168 1023 892 436 -75 36 -456 -696 147 371 293 345 319 -205 -523 -903 -378 -500 35
2833 35 375 512 615 221 0 -907 -408 -23 132 454 1022 516 59 -49 -485 -820 -684 103 111 626 529
2854 529 235 -182 -688 -324 -598 -101 615 870 585 325 238 -577 -660 -448 -181 11 583 818 182 -257 -359
2875 -359 -506 -719 -40 426 496 705 622 40 -521 -503 -381 -378 -255 627 592 500 298 -225 -404 -687 -265 -19
2897 -19 331 629 485 -96 -194 -282 -675 -454 277 468 618 873 548 -30 -695 -466 -425 -123 32 572 409
2918 409 147 -78 -644 -798 -581 -278 197 712 941 563 50 -200 -696 -185 -179 240 601 451 621 94 -521
2939 -521 -840 -699 -616 -149 552 734 378 269 -102 -325 -172 -42 31 662 688 827 46 -295 -882 -655 -647 -368
2961 -368 -36 299 351 66 -294 -553 -373 -101 106 259 779 1114 551 112 -339 -798 -642 -583 -147 268 368
2982 368 185 -67 -747 -595 -416 -715 346 736 969 710 535 60 -123 -413 -234 -6 339 271 400 -50
3002 -50 -643 -708 -689 -704 -111 529 645 798 443 103 -40 -215 -126 -121 373 753 513 153 -185 -380 -850 -706
3024 -706 -274 -142 5 340 648 122 -167 -187 -95 -28 536 587 598 749 307 -630 -777 -661 -611 -613 229 308 188
3047 188 -1 -222 -496 -596 17 305 454 852 1036 409 -296 -244 -205 -907 -329 253 321 -19 422 -132 -548
3068 -548 -371 -134 -296 138 502 800 365 404 145 -419 -318 99 157 44 500 240 -353 -717 -595 -528 -369
3089 -369 119 335 275 602 753 -122 -241 192 -25 19 547 923 -88 -26 -54 -510 -815 -767 -164 -33 639
3110 639 672 143 -301 59 65 -80 276 466 446 413 369 219 -489 -535 -489 -579 -353 196 231 104 125 -42 -497 -419
3134 -419 5 118 153 725 865 106 -74 -13 -572 -608 -21 119 -92 72 42 -585 -745 -440 -489 -426 332 1045
3156 1045 626 486 539 -34 -459 -177 325 -89 290 357 42 -379 -549 -606 -775 -485 132 233 183 648 575
3177 575 -272 11 257 143 173 597 532 133 227 -47 -511 -970 -369 -315 -135 301 472 12 190 221 -251 -271
3199 -271 275 314 318 562 837 -109 -714 -245 -565 -853 -23 314 26 -39 147 -231 -678 -102 104 112 544 779
3221 779 660 508 283 -16 -626 -499 94 -128 -199 363 215 -447 -638 -569 -509 164 579 961 693 482 404
3242 404 -145 -240 -332 -100 -32 19 -21 -172 -229 -142 -559 -746 -330 376 -25 726 670 240 -59 86 -160 -112 141
3265 141 489 26 -40 353 -144 -779 -731 -307 -200 69 465 594 51 324 57 -438 -238 430 352 4 618
3286 618 96 -406 -489 -236 -400 -758 17 211 203 475 417 -210 -9 -114 199 282 244 726 254 -156 -108 -409
3308 -409 -538 -410 46 -13 -3 349 9 -281 -65 -186 -311 352 801 628 446 313 42 -655 -316 -477 -552
3329 -552 -271 -179 6 -211 -235 -446 -824 -657 171 470 443 715 396 231 -115 -435 -421 -385 191 297 198 -106
3351 -106 41 -617 -777 -724 -269 57 517 753 841 530 227 -91 -607 -409 94 260 344 256 145 -250 -413
3372 -413 -562 -536 -66 -55 507 437 589 176 -189 -41 161 -2 14 383 353 325 -131 -568 -672 -838 -437 110
3394 110 34 461 645 216 -368 -75 -44 -98 402 494 500 314 146 -222 -754 -803 -429 -199 -342 222 276 303 9
3417 9 -80 -430 -22 192 434 599 573 572 -27 -537 -482 -523 -437 -11 64 156 157 -91 -283 -953 -267 -56 213 584
3441 584 388 564 596 71 -156 -253 -289 -61 163 204 167 -115 -157 -581 -482 -261 222 339 563 338 390 -110 -414
3464 -414 -73 -313 -48 265 503 197 -133 -252 -293 -506 -298 -286 22 185 165 490 58 -98 -70 -258 -5
3485 -5 26 468 301 187 8 -313 -404 -479 -543 145 55 153 409 220 -219 -237 -189 -71 225 542 219 167 239 -273
3509 -273 -259 -448 -398 -145 -91 353 200 173 -161 -328 -224 -258 192 324 727 698 330 29 -162 -306 -332 -399 -112
3532 -112 -112 69 -5 -103 -169 -606 -358 -52 -130 299 654 654 110 88 -124 -246 -68 205 110 269 216 -6 -762 -275
3556 -275 -431 -265 -91 438 547 437 345 300 -269 -72 -64 -15 35 666 288 15 -129 -504 -685 -631 -178 -155 124
3579 124 373 310 26 -48 -128 -6 -165 171 255 135 276 60 -232 -730 -484 -403 -218 -82 15 19 171 -49 26
3602 26 -89 -149 11 369 559 296 472 72 42 -146 -244 -319 46 61 -238 341 -330 -368 -286 11 -178 -244 302
3625 302 653 357 206 64 -287 -328 -62 -100 -111 29 188 -136 -656 -132 -482 -401 274 441 336 403 338 12
3647 12 -157 -106 9 153 255 651 56 -289 28 -448 -493 -155 -3 -135 43 563 300 -53 -131 -108 -133 -398
3669 -398 343 294 515 157 297 -394 -317 -29 -138 -479 62 340 186 14 -11 45 -572 -224 211 194 395 582
3691 582 -97 -179 -78 -251 -650 -16 334 60 -52 143 -52 -420 -236 -18 -42 217 349 334 301 45 0 -144
3713 -144 -503 -150 7 197 299 213 -179 -336 -345 -576 -442 217 225 111 619 112 -151 -336 193 -59 166 107
3735 107 174 88 8 158 -218 -701 -368 90 233 204 555 286 -70 -172 -425 -508 -150 -17 237 313 113 158
3757 158 -247 -430 -33 -177 -142 529 247 -79 141 -79 -500 -414 132 318 177 516 389 239 -318 9 -599
3778 -599 -281 -38 149 169 14 321 -197 -945 -203 -33 -114 548 243 439 166 -92 48 -278 -571 -174 -66
3799 -66 177 354 164 -108 34 30 -277 -184 391 402 293 364 290 -34 -266 -94 -259 -44 63 2 36 295 -316
3822 -316 -227 -326 -29 -22 170 287 696 141 -181 107 -83 -229 19 33 -136 -327 74 -383 -719 -223 -424 -13
3844 -13 138 558 23 338 283 105 -321 -66 -244 24 57 213 98 -389 -299 -327 -208 -209 94 -36 278 452
3866 452 112 -291 -73 -118 2 269 266 294 81 -50 -216 -605 -386 -302 -198 293 305 222 293 -31 21 84 -79
3889 -79 211 271 344 357 131 33 -292 -340 -190 -539 -194 435 237 -116 -58 35 -155 -198 -76 300 424 324 332 194
3913 194 -150 -219 -275 -395 -318 -304 -134 -56 -67 -183 -104 -356 129 14 370 479 326 168 358 -21 -292 -175
3935 -175 -264 -334 46 128 116 -14 9 -481 -278 -275 1 286 194 550 352 117 21 -420 -290 137 148 -65 37
3958 37 -156 -231 -372 -374 -257 -164 114 167 289 220 60 -158 -136 41 -145 11 93 409 26 88 -432 -446 -380 -590
3982 -590 37 494 196 75 132 -56 313 251 56 291 211 240 66 153 -219 -308 -396 -486 -98 -184 40 -37 53 17
4006 17 -206 -141 63 63 599 381 291 440 -41 45 -89 -208 -53 55 -222 -25 -109 -292 -206 -191 -456 10 360
4029 360 454 330 394 394 113 147 -155 -68 -121 176 99 -41 -132 4 -103 -393 -404 15 6 169 448 363 105 42 -30
4054 -30 -4 -305 317 405 30 -282 28 -376 -317 -388 -176 -129 -126 632 157 297 307 132 -101 96 38 444 240
4077 240 265 -58 -390 -311 -50 -392 -23 34 -189 91 -96 192 -179 -120 -5 170 89 326 325 53 -22 -142 -501
4100 -501 -228 21 138 250 49 200 92 -119 -78 -299 -115 -6 438 190 373 -69 -292 -236 -139 -251 -13
4121 -13 -53 182 -98 -133 -205 -289 71 227 38 231 251 195 405 121 29 -198 -354 -192 99 -235 -67 -137 185
4144 185 -469 -151 -170 76 129 506 538 55 16 171 -129 -251 92 -37 -167 8 187 37 -228 16 -252
4165 -252 33 56 111 582 138 281 71 32 49 -70 -338 -118 352 -135 -211 -78 -329 -434 -86 182 312 129
4187 129 563 402 30 -112 -17 242 -23 242 127 230 227 108 -684 -367 -315 -191 -289 210 153 133 116 211 206 -131
4211 -131 106 382 116 141 392 -147 -362 -276 -282 -363 -3 -121 176 207 158 56 -254 -133 87 -24 516 380
4233 380 300 43 315 -122 -250 -393 129 40 -108 227 319 -352 -113 -106 136 -235 285 582 54 532 270 119
4255 119 -118 -74 -351 -291 -180 15 99 -84 -91 -177 -472 -48 182 394 560 308 297 143 89 298 -244 -92 209
4278 209 -5 76 -9 -44 -336 -139 182 -113 134 184 314 -50 190 120 -169 -357 81 -22 -200 141 237 -157
4300 -157 -184 -299 -372 -154 -94 -175 -113 249 326 93 -247 209 -106 222 -67 362 408 239 98 -260 -447 52
4322 52 68 -147 187 -125 18 -52 -54 -104 -11 8 36 -109 181 213 102 -292 -341 -140 -17 -154 214 137 -186 -42
4346 -42 237 50 -138 157 66 211 360 124 245 -147 196 -122 -38 -224 365 -94 116 -16 -177 24 116
4367 116 -162 -170 111 258 157 48 246 181 -124 -207 -265 103 74 -92 135 -53 -14 -209 74 -238 390 71
4389 71 118 138 23 49 -36 -188 -243 70 -97 323 102 297 106 -66 12 -119 -113 -111 24 381 81 420 -166 180
4413 180 -158 81 129 152 192 173 234 128 -5 -144 -245 -202 148 79 118 326 40 -214 -17 -61 -127 -123 92 300
4437 300 52 114 -253 -157 -32 202 491 109 91 35 142 -200 103 -58 -361 46 -115 -12 -28 142 -86 -162
4459 -162 -52 -205 -240 -255 363 -39 -210 -34 -427 -1 -232 -1 407 20 90 229 24 -323 -112 43 241
4480 241 -348 258 284 188 29 -12 3 11 15 122 124 -107 133 60 -150 -281 221 156 143 -145 200 481 -104 4
4504 4 -188 -16 -61 -139 336 219 35 -92 105 -209 -180 21 -61 30 83 177 235 95 -61 -281 -32 102 119 61
4528 61 28 -88 37 -76 -227 -10 -103 28 226 140 -22 49 -118 17 72 -141 -112 -18 272 120 -237 -140 352
4551 352 -153 -150 -180 -105 27 1 -36 -234 -4 -164 13 78 208 231 248 239 -5 -210 -189 -63 171 155 339 170
4575 170 -101 -204 -269 -246 -38 51 38 130 154 415 212 223 -156 6 42 27 6 -38 -308 -446 66 -139 -142 -183 -168
4600 -168 -216 48 -171 -74 -107 -164 -162 -184 -204 38 76 175 -180 -86 -225 -124 102 12 28 225 105 -34 -29 -191 -133
4625 -133 -172 32 -30 103 232 -40 -218 -13 -164 -15 -20 136 165 -162 129 124 54 194 24 235 15 -84 48
4648 48 -25 56 126 -37 -102 -213 -9 1 107 317 75 179 232 68 131 -165 -175 89 -250 288 -142 -129 -222 -93
4672 -93 81 47 -69 167 68 -100 46 18 -63 142 222 -10 83 20 -65 -227 -66 -7 67 -121 99 71 -25 181
4696 181 185 9 -11 -119 155 -193 -90 50 180 134 25 -107 -96 15 30 54 -72 84 -16 -94 141 -298 5
4719 5 274 104 107 -33 338 -265 -350 -118 -158 65 -196 -80 -219 -197 -64 91 -156 -46 -84 70 277 217 92
4742 92 -173 32 244 89 -109 -74 -111 -229 -304 7 -128 -129 98 61 72 221 293 223 126 -188 -179 67 -119 61
4766 61 230 -88 -86 -133 -2 -21 6 -245 33 163 10 72 245 206 -153 377 -224 -133 87 248 214 58 -63
4789 -63 41 -197 -11 -169 -50 -31 105 56 -230 72 -174 -112 61 30 147 -221 -283 233 118 -340 -142 -386
4811 -386 -158 -139 -63 72 156 -264 27 -24 -7 -142 90 -29 129 4 40 -67 -341 -290 -51 -281 -293 264 -77
4834 -77 -229 -120 95 -41 47 133 -96 47 -27 -25 -381 42 206 -182 -195 -309 128 -238 -152 -97 36 33 19 41
4858 41 81 97 160 62 -341 83 122 56 -37 32 -22 172 100 -105 246 -208 -3 66 -144 106 -71 -161 66 -26 -5
4883 -5 -157 -131 0 -92 36 -131 -34 -158 -107 46 -14 83 8 112 -134 -165 -46 65 -80 -275 -121 197 137 247
4907 247 -75 53 -78 -227 -135 -82 97 169 66 24 -223 45 -34 -25 27 76 -102 36 -25 210 -268 -48 227
4930 227 -167 28 -96 23 101 -70 -17 -71 -342 107 -107 53 29 -45 -27 116 -164 119 26 -161 -202 36 73
4953 73 76 277 -147 94 -145 198 72 -168 224 125 162 -84 125 20 191 78 -146 74 75 258 -210 -72
4975 -72 -83 -17 66 203 -88 -240 110 -35 -129 -5 243 -38 135 -94 232 -71 -17 53 227 179 87 173 -53
4998 -53 -269 -12 21 -57 -112 -83 -67 -70 165 272 -267 103 -326 91 -101 -141 92 -49 88 -116 -176 104 -106
5021 -106 -453 -123 -17 -189 -288 347 138 188 20 -167 73 -18 -39 125 -165 -182 -91 138 103 122 190 -94 5
5044 5 146 203 -281 -86 -72 -23 119 120 32 337 -83 101 -64 -63 137 -100 83 -96 263 61 113 -30 -105 126
5068 126 132 139 -85 -248 44 -65 -217 66 -46 -356 -226 -3 177 -208 -206 296 48 99 25 31 265 252 68 -52
5092 -52 -119 -73 103 -195 4 -439 -85 -162 -82 235 -114 -254 -94 -53 64 268 141 -94 101 -304 -5 150
5114 150 -153 -23 -164 36 100 161 -33 -23 -7 1 299 126 -74 -224 -201 21 -19 -138 31 45 190 -306 -282
5137 -282 -80 -150 -56 169 307 -153 -55 53 20 142 -25 -94 -69 176 35 19 -165 4 190 45 98 -148 -360
5160 -360 7 -73 55 161 -120 150 -52 156 -53 -106 35 -163 157 22 -78 -66 162 45 133 106 52 43 -93
5183 -93 -38 52 152 132 46 -110 -257 135 96 84 50 -67 -57 -57 147 -9 -14 307 211 91 -143 62 -157 149 12
5208 12 -185 84 -11 -35 290 -14 -117 -221 -144 -79 108 -102 218 207 -173 -252 53 34 -156 -64 314 69 -194
5231 -194 -52 -270 171 155 -218 3 -135 -42 -13 -66 58 278 224 -109 -61 -49 -256 -7 2 -336 -109 -347 76
5254 76 198 137 -20 -243 -74 -222 -60 -102 76 147 111 290 57 -248 139 -80 -76 -40 111 95 -96 -128 -117 -63
5278 -63 74 74 -152 -23 64 14 -192 164 121 234 20 311 195 -60 -177 3 188 46 -50 -148 38 -244 -65
5301 -65 279 348 -135 -142 -186 -101 -110 -323 -215 27 91 112 236 -18 7 69 202 109 11 93 -32 -152 118 -31 -106
5326 -106 282 210 -108 48 9 259 56 -112 -160 -84 103 -19 296 94 -172 -111 72 87 -45 -75 -143 62 103
5349 103 -136 49 -209 87 82 -34 -186 -81 130 145 12 -117 151 6 59 -64 467 118 -26 -147 7
5370 7 10 -67 -58 194 -26 137 139 -52 120 -103 15 26 -51 -118 -45 -63 -54 -10 -60 -67 38 197 25 129 -64 -199 -17
5397 -17 -247 41 2 107 41 -263 -146 127 -2 -48 96 -20 -111 -68 174 57 34 -138 18 -207 165 -378
5419 -378 -58 172 117 -211 45 111 37 78 -141 240 52 -3 -321 46 137 152 -202 -24 -104 -72 48 -212 34
5442 34 102 -113 -9 15 70 -267 127 -121 -86 -130 -79 -35 62 208 168 213 198 -172 -72 -32 -351 49 -337 -16
5466 -16 -203 94 -127 -145 53 160 -42 45 45 -56 178 -203 -158 -177 128 76 -105 -104 -14 12 180 6 -203 -149
5490 -149 162 -224 -86 194 228 -134 -65 7 122 -94 -92 142 -111 44 -235 -75 140 22 -56 -79 36 -296
5512 -296 -84 -5 -477 10 52 108 -48 -85 -146 58 -43 -70 -210 -55 -104 -128 324 -232 165 -254 49 -13 -2
5535 -2 70 164 -135 -217 71 -43 -185 -153 -25 86 37 -174 -14 86 63 -47 -116 -209 -89 -98 -128 208 220 -65 -50
5560 -50 -99 115 22 101 -77 53 295 0 118 98 -151 83 -235 -156 0 -116 15 -253 61 -380 201 54
5582 54 50 135 71 2 -136 191 275 292 -254 58 -150 111 -10 185 -57 -35 109 -85 -69 180 -11 -1 133 66
5606 66 -28 -94 -1 -39 -200 11 -74 -46 -20 118 -174 226 37 55 123 -49 -40 94 -106 -229 -35 171 -138 -92
5630 -92 119 -75 29 -81 43 6 -42 192 -47 -17 -21 259 -58 -183 -332 -95 206 137 -142 -148 101 257 65
5653 65 48 -189 99 -128 473 17 -113 76 -58 49 -144 1 90 -58 -86 -37 86 -49 48 34 162 -287
5675 -287 -36 59 28 135 67 -6 248 59 248 -60 -239 87 -64 127 -166 -96 -34 203 84 -103 117 225
5697 225 -12 -56 261 68 -126 330 -86 -117 -1 51 -108 45 -132 -8 21 -51 -34 88 31 -20 -153 106 -98
5720 -98 -92 -13 -153 22 -24 69 -368 107 -187 -58 155 -45 69 -13 -34 -26 -231 -191 -221 -321 174 -149 -173 -72
5744 -72 -283 27 -7 -24 113 121 6 151 -151 108 286 -253 -13 -7 18 22 -273 -252 -142 40 45 -27 137 -337 -16
5769 -16 127 30 -131 244 -2 56 -487 -65 101 -209 -72 -261 -89 -56 -56 -32 29 115 159 74 -32 151 83 246
5793 246 105 -71 241 17 -2 34 62 96 120 75 63 60 64 107 -64 137 -132 -162 -146 116 -300 76 21 -224 -5
5818 -5 -45 -95 -135 9 85 18 158 279 -133 243 -59 132 -200 5 -44 -129 -112 17 331 100 143 -383 -186 -46
5842 -46 112 267 -137 197 -118 -236 -313 15 311 93 217 -72 -53 9 106 193 211 -50 -242 -82 296 -17
5864 -17 94 -86 -207 14 126 71 56 -174 160 410 -146 301 -206 -103 54 106 27 -232 51 -195 -4 -127
5886 -127 199 -65 -114 66 173 145 201 -209 85 68 -412 108 171 303 -73 -234 -289 -96 86 -126 60 -92
5908 -92 -74 11 37 -52 -23 234 -132 39 -134 -314 49 -54 205 -89 -81 -181 1 165 -111 -113 -9 -50 -10 88
5932 88 68 37 21 -5 -111 251 39 -118 137 -100 -46 -194 220 -52 -163 -181 47 79 13 150 198 177 -60 -179
5956 -179 -116 145 84 -37 -84 66 -29 -80 -58 -33 -94 -126 92 177 -182 -66 -86 -143 -213 298 49 28 -19 158 3
5981 3 -115 46 332 79 101 89 -49 133 180 -47 -143 46 -93 199 57 249 -74 74 114 -189 17 -130
6003 -130 31 27 16 125 11 93 -155 -35 -19 -82 -221 152 182 -177 14 200 157 -35 -50 100 -100 13 -32
6026 -32 102 417 254 2 -96 173 -189 67 -20 0 121 322 -193 -2 -210 46 -393 -48 255 103 -3
6047 -3 -30 47 63 5 333 -16 -206 -81 -140 192 90 27 -195 -52 197 2 -86 97 -299 124 -15 -77 126
6070 126 -160 -102 -215 62 104 75 -266 -232 -8 -211 162 -56 67 104 -160 29 20 47 -108 70 72 136 184 -210
6094 -210 -143 -277 -152 -173 -88 23 -102 43 -154 -15 -19 -83 14 -214 -25 0 216 -102 169 -83 11 -288 -154
6117 -154 86 -151 -198 111 -159 -185 -47 -171 -134 -118 268 -277 0 48 -63 -105 5 84 -33 -218 88 -81
6139 -81 -26 -85 23 69 -203 -12 153 155 -231 -90 -10 -49 -84 -64 65 7 220 -80 44 -241 20 -128 -15 45
6163 45 -7 163 18 44 -281 60 98 43 97 148 -4 51 29 -22 -302 195 -73 -1 -106 46 -99 41 -200 92
6187 92 303 -2 -162 108 -107 -196 -41 -178 -38 -188 197 -33 -65 -110 -40 105 -30 -40 273 312 -221 -146 61
6210 61 -29 -378 43 102 -94 -21 2 -134 47 55 273 217 9 -63 -271 47 124 -125 -11 91 72 166 75 -164
6234 -164 -118 123 -89 -136 77 -38 -136 127 139 -169 106 -34 -114 5 89 131 24 51 -100 -86 -199 120 96
6257 96 31 -10 157 159 120 129 213 44 -81 29 -10 -420 -11 -180 117 -42 -22 53 51 -17 -77 -59 -45 102 92 -157
6283 -157 69 -6 -24 -89 68 117 -479 75 -256 -180 6 8 -3 -54 43 -100 -24 31 -30 329 -33 -297 233 -130
6307 -130 -233 -368 -101 -150 116 -167 145 38 -82 -140 112 87 145 49 -18 105 -114 -27 -230 -317 72 -78 137
6330 137 76 -63 196 -234 -128 17 141 331 -246 107 -22 188 -5 26 203 -39 -185 -232 -59 70 -23
6351 -23 -128 -133 25 -121 -26 -109 205 -214 94 1 127 -7 -111 -38 125 157 20 99 119 -179 135 337 -164
6374 -164 -120 67 375 288 87 136 -44 -166 100 16 -82 249 -200 73 -99 143 14 -124 -51 -12 72 211 91
6397 91 -116 77 214 -355 -59 -144 -114 -155 33 -182 -148 -22 102 -288 -1 144 -143 -51 -79 -144 -249 -89 -19
6420 -19 40 60 271 -23 185 -67 -187 7 -53 0 -63 23 -86 36 -21 11 -107 -198 -162 -91 6 243 25 256
6444 256 37 48 -153 -52 -42 119 -65 27 102 -272 -244 -250 -118 25 58 -122 70 315 -152 13 36 220 -84
6467 -84 118 42 159 -123 249 -183 -181 -57 -135 -136 78 182 41 -67 77 -162 -1 -12 -138 -176 -201 -14 29 232
6491 232 20 14 -10 74 -6 220 -29 -321 -29 110 -24 70 74 -107 50 41 -114 172 -175 -49 -120 -126 124 83 112
6516 112 85 403 182 -80 200 -119 -210 104 -165 67 242 -92 -32 118 -34 -39 -148 179 -221 -24 49 33
6538 33 269 -282 0 -256 70 163 -112 -89 52 57 -8 -40 97 -19 214 54 -55 214 14 38 86 -187 196
6561 196 261 143 110 -67 -161 -191 -231 57 17 -214 -59 8 -28 -189 48 -9 209 -110 -62 -72 105 -53 286 29
6585 29 16 211 35 -36 54 -47 89 50 112 -85 65 201 -5 186 -28 11 -52 4 -26 -65 222 -180 -116 -207
6609 -207 35 -187 79 -28 102 39 82 -56 156 127 19 -28 -57 6 56 -190 76 23 -119 -111 45 -189 200
6632 200 -416 154 53 26 167 -324 -5 -57 -79 107 -210 41 41 -49 -84 -188 -3 40 337 268 -90 -198 211
6655 211 -17 -42 89 -185 -65 18 70 88 -21 -14 -185 -39 -177 -166 -290 63 -127 282 -71 125 -133 76
6677 76 19 -77 -107 90 283 -17 -130 -198 103 -293 -83 5 -83 -61 -10 49 -97 -291 31 -63 -41 -156 169 -184
6701 -184 -137 77 -255 30 -45 64 -168 -239 -249 83 -386 45 -52 -241 -101 -191 59 76 196 135 30 25 9 42
6725 42 -124 217 86 201 76 -67 -118 -54 -91 -278 224 -2 105 43 -33 105 -158 190 39 68 -83 -415
6747 -415 39 -12 -62 -124 15 -155 -263 48 -67 -12 -41 -178 -161 -145 128 -266 245 201 150 -98 -115 -342 8
6770 8 -123 261 -334 -73 138 -45 31 27 -188 -324 99 -199 -47 81 -5 100 66 68 31 38 62 -38 15 -48 -11
6795 -11 24 -83 -107 101 -94 182 21 -62 -73 1 126 109 171 265 196 81 -112 193 151 75 -162 251 14 52
6819 52 162 88 -441 -39 98 -68 18 109 107 12 -54 166 -87 -39 -176 -180 -130 190 1 107 -53 -167 -166 -79 -116
6844 -116 -129 214 -6 85 -30 157 5 -71 -226 85 -10 20 23 -113 48 8 -334 22 -103 111 -176 40 66
6867 66 -23 140 42 132 264 0 -256 243 40 -300 126 -129 -88 160 186 -232 394 99 43 -134 102 -54
6889 -54 102 105 -335 89 176 147 56 12 -95 290 -72 87 182 174 -45 -173 -15 -114 -17 149 81 -43 107 -7
6913 -7 114 -112 -127 -152 14 201 296 -163 -19 -281 -246 -355 -73 148 236 23 -82 143 79 30 -281 88 -80
6936 -80 162 38 23 -119 -38 296 -213 -177 -108 46 76 189 62 -118 118 186 196 27 165 -125 -251 -16 14
6959 14 102 -204 -156 -92 45 -173 125 49 -21 224 51 -41 219 14 -194 -60 64 45 87 -44 12 -19 -161 140
6983 140 -91 28 -127 53 145 -362 -68 103 72 -103 -184 -150 -82 -97 -99 -71 23 -199 181 -140 -97 130 63 3
7007 3 89 54 188 -247 103 -141 -117 -73 -31 -45 -159 25 -56 114 20 147 176 230 -51 -71 -98 -142 -131 89 178 -121
7033 -121 230 -36 -7 -49 -39 -194 57 -116 -74 -168 -144 25 150 -424 27 55 63 87 -203 -18 23 -1 190 2
7057 2 110 188 -10 128 118 -95 66 -70 40 125 84 75 169 120 33 -143 -177 -286 184 -296 115 6 -23 -75 82
7082 82 -119 -95 -143 172 -90 -53 195 193 -125 -81 -22 -15 -210 100 21 -315 8 -54 -86 254 77 -161 11 -288
7106 -288 177 -83 124 -224 45 -31 -16 35 1 104 -157 -282 -126 49 -168 191 -121 91 -13 142 -211
7127 -211 83 34 -13 -88 -10 67 140 150 46 -49 201 -69 27 -128 39 81 299 102 89 228 133 20 -81 246
7151 246 187 -7 -83 42 -12 39 -79 -122 -2 -105 -21 191 -168 12 -95 -62 -138 16 107 -50 -137 124 81 45
7175 45 -145 -120 -151 -47 302 -64 9 -40 168 -12 -138 52 255 30 126 -10 -89 112 -125 31 -83 74
7197 74 102 -196 -38 -112 -38 263 -8 -58 -139 -240 67 45 52 -304 242 -270 -231 161 112 -197 164 -164 -82 217
7221 217 88 -215 245 -9 149 94 153 -108 -67 257 151 -81 -9 310 -152 45 -86 5 70 149 18 -12 36
7244 36 -62 66 82 -60 -11 -205 -160 -92 -70 -113 69 89 115 3 -2 105 -109 -243 -203 -10 -282 33 -316 -39
7268 -39 26 85 255 -43 131 -35 -172 33 147 -17 106 55 -67 -65 -83 28 0 -87 -40 152 -58 -56 -105 24
7292 24 13 13 -74 29 -60 -152 -113 190 136 -172 -9 169 164 -55 173 18 -133 90 58 -39 -183 117 126 -2 15
7317 15 253 -53 -145 163 53 51 -54 173 186 -23 -162 7 169 19 220 14 -63 78 33 -68 -47 -189 -62
7340 -62 108 -162 115 181 -67 -253 35 -8 172 216 196 -371 -118 81 -60 135 -262 -146 13 87 264 93
7362 93 -62 143 -13 -14 82 -175 -89 100 99 -204 -64 -201 110 -100 -31 -68 251 126 -149 194 8 -82 72
7385 72 -173 -88 231 63 324 25 179 91 -17 137 79 260 174 123 -47 30 -49 -104 -79 207 -100 83 -140
7408 -140 -11 108 188 105 -104 123 109 -27 79 202 239 106 -228 46 -140 -37 -72 287 60 -43 -67 -243
7430 -243 -139 158 265 93 101 98 49 73 -6 -51 222 196 88 303 -11 -8 -17 33 -40 17 38 -133 59 -171 48 67
7456 67 -14 -26 -37 93 -111 -91 199 -58 -58 10 -240 9 10 -51 -59 -27 193 142 -23 231 187 18 -214 -129 180 171
7482 171 -154 -306 -48 -215 105 71 -169 -153 -96 260 158 -88 41 -31 -68 -116 1 -283 -62 -67 -9 59 97 219
7506 219 -170 76 1 -68 118 21 154 100 52 19 -72 49 -244 42 31 195 104 309 76 -99 75 105 -28
7529 -28 -153 -55 -142 -136 132 -1 -257 5 -39 76 37 89 11 -90 -203 212 31 59 53 -226 209 -79 89 65
7553 65 -60 159 2 211 247 -20 141 140 -93 -122 -135 -25 -391 69 171 -58 -15 46 -70 -185 -215 -163 -17
7576 -17 -154 111 -82 -24 -285 -40 45 8 -5 132 -235 -9 133 -107 25 -104 3 -267 -15 -100 -29 38 -156
7599 -156 -14 -142 -162 -43 16 19 -259 6 97 -70 -6 -272 -326 -302 144 135 -221 -189 -99 50 -75 -114 -13 414
7623 414 90 -217 71 -299 200 -88 175 -43 28 -144 -41 209 -119 -200 135 12 174 27 3 -34 217
7644 217 150 19 96 232 120 27 -338 -128 138 -28 69 -121 214 -251 139 -97 -69 -230 160 159 47 14 -175
7667 -175 104 -66 196 99 -13 -42 71 -17 -89 129 -104 -7 -15 57 -155 22 -48 33 -164 32 13 -146 106 -50
7691 -50 -110 400 161 28 5 -18 -69 212 160 -24 54 4 133 -123 -106 6 216 295 215 82 -179 -231 -37 -38 -32
7716 -32 -81 -45 100 -263 -147 221 -78 -147 85 291 -27 55 157 13 -345 21 105 98 -174 -36 -14 78 175 -41
7740 -41 101 242 -158 -244 -101 201 -176 183 134 15 -123 176 -11 225 -158 -55 253 -17 296 -18 -84
7761 -84 89 127 -77 169 -117 207 -218 82 8 -73 -112 -15 208 58 -139 106 -217 -146 -29 129 117 116 10
7784 10 214 61 74 -21 -90 122 -257 85 11 -178 -132 17 -81 62 59 107 -222 38 15 246 126 134 -22 193
7808 193 9 52 -144 -65 -116 -77 47 47 225 131 -56 -289 -440 310 78 11 126 -131 28 -8 254 -39 -73
7831 -73 -107 -136 0 84 -48 -225 78 -16 141 -143 -242 42 -118 264 -72 74 -28 29 -197 0 -190 -140 -74
7854 -74 -164 -172 -196 -7 42 -16 -148 19 -283 -9 -120 13 -33 -314 -117 -12 -197 -188 -49 134 228 -69 -86 105
7878 105 196 273 202 -13 158 128 -7 -176 366 190 -309 -138 261 258 356 328 -67 -112 10 279 -93 -142 228
7901 228 225 -128 274 -57 172 -26 64 91 -95 177 -156 -163 -191 -250 200 109 -110 -146 -277 94 290 -226 -51
7924 -51 52 182 -6 -161 117 29 83 28 86 37 172 223 138 199 -74 95 44 151 113 -254 29 -45 -38 -182 88
7949 88 163 -241 -201 49 53 51 -117 -8 101 -113 -119 -138 149 48 144 72 37 -265 -8 -24 -79 -63 -213 81 166 -10
7975 -10 -53 -255 9 -157 -1 28 9 -76 205 -127 -122 -47 216 214 -126 -147 -163 190 -148 88 -18 -145 108 -160
7999 -160 135 128 165 225 100 -95 115 -55 30 145 -125 101 236 -21 -191 24 166 159 -129 77 -54 96
8021 96 -69 55 168 -173 -113 136 -8 126 35 51 148 45 68 195 -140 111 203 5 -187 -394 130 118 -235
8044 -235 55 -184 -54 -55 202 -96 -235 141 -111 62 -138 68 252 -9 -101 175 -40 28 -68 219 -442 313
8066 313 42 -30 107 82 28 -63 -24 -4 60 -49 38 -67 26 155 -158 102 -44 -103 -172 88 -250 78 35 321
8090 321 -22 -63 55 140 -357 71 20 -144 -47 38 134 293 19 -93 213 12 141 -24 26 -197 272 127
8112 127 -7 -182 -148 108 59 -186 -115 57 -241 -221 74 -60 -96 -94 -168 133 124 -241 30 6 -13 2 -90 247 50
8137 50 -19 -116 223 175 180 -23 -48 -65 117 -52 -70 -92 64 72 -81 125 47 -162 36 81 199 39 -184 -258 68
8162 68 222 -85 -214 26 -28 121 89 -232 48 -105 109 59 108 -520 -262 -102 -70 12 -94 7 15 212 -177
8185 -177 24 2 -182 293 -33 204
8191B04
##END NTUPLES=NMR FID
##END=
