##TITLE=1H_Pr 3-D
 200.13MHz, CDCl3,
 8 sc
 
 11.3.2025
##JCAMPDX= 6.0         $$ Bruker NMR JCAMP-DX V2.0
##DATA TYPE= NMR FID
##DATA CLASS= NTUPLES
##ORIGIN= UXNMR, Bruker Analytische Messtechnik GmbH
##OWNER= pz
$$ XWIN-NMR		Version 3.5
$$ Tue Mar 11 16:25:27 2025 Russian Standard Time (UT+4h)  she@DPX200
##.OBSERVE FREQUENCY= 200.1313
##.OBSERVE NUCLEUS= ^1H
##.DELAY= (6, 6)
##.ACQUISITION MODE= SIMULTANEOUS
##.ACQUISITION SCHEME= undefined
##.AVERAGES= 8
##.DIGITISER RES= 18
##SPECTROMETER/DATA SYSTEM= spect
##.PULSE SEQUENCE= zg30
##.SOLVENT NAME= CDCl3
##.SHIFT REFERENCE= (INTERNAL, CDCl3, 0, 14.3821)
##AUDIT TRAIL= $$ (NUMBER, WHEN, WHO, WHERE, WHAT)
$$ ##TITLE= Audit trail, XWIN-NMR		Version 3.5
$$ ##JCAMPDX= 5.01
$$ ##ORIGIN= Bruker BioSpin GmbH
$$ ##OWNER= she
$$ F:/spectra/data/she/nmr/H-C/1/audita.txt
$$ ##AUDIT TRAIL=  $$ (NUMBER, WHEN, WHO, WHERE, WHAT)
(   1,<2025-03-11 16:24:21.76 +0400>,<she>,<DPX200>,
      <created by zg, POWCHK disabled, PULCHK disabled
       configuration hash MD5:
       00 E9 B6 7A A2 85 ED C7 34 08 36 98 17 FE 4E 26
       data hash MD5: 16K
       C5 42 70 EF 65 23 7A 09 53 B7 1C EE AC EA 4E 11>)
$$ ##END=
$$ 
$$ hash MD5
$$ A4 DF 70 08 DC 4E 97 A8 49 AC BA AC 4E C9 20 44
##$RELAX= 
##$RELAX= 
##$RELAX= 
##$RELAX= 
##$RELAX= 
##$RELAX= 
$$ Bruker specific parameters
$$ --------------------------
##$DU= <F:/spectra>
##$EXPNO= 1
##$NAME= <H-C>
##$PROCNO= 1
##$TYPE= <nmr>
##$USER= <she>
##$AMP= (0..31)
100 100 100 100 100 100 100 100 100 100 100 100 100 100 100 100 100 100 
100 100 100 100 100 100 100 100 100 100 100 100 100 100 
##$AQSEQ= 0
##$AQ_mod= 1
##$AUNM= <au_zg>
##$AUTOPOS= <>
##$BF1= 200.13
##$BF2= 200.13
##$BF3= 200.13
##$BF4= 200.13
##$BF5= 200.13
##$BF6= 200.13
##$BF7= 200.13
##$BF8= 200.13
##$BYTORDA= 1
##$CFDGTYP= 0
##$CFRGTYP= 5
##$CHEMSTR= <none>
##$CNST= (0..31)
1 1 145 1 1 1 1 1 1 1 1 1 1 1 1 1 1 1 1 1 1 1 1 1 1 1 1 1 1 1 1 1 
##$CPDPRG= <>
##$CPDPRG1= <>
##$CPDPRG2= <>
##$CPDPRG3= <>
##$CPDPRG4= <mlev>
##$CPDPRG5= <mlev>
##$CPDPRG6= <mlev>
##$CPDPRG7= <mlev>
##$CPDPRG8= <mlev>
##$CPDPRGB= <>
##$CPDPRGT= <>
##$D= (0..31)
0 0.7 0 0 0 0 0 0 0 0 0 0.03 0 0 0 0 0 0 0 0 0 0 0 0 0 0 0 0 0 0 0 0 
##$DATE= 1741695861
##$DBL= (0..7)
120 120 120 120 120 120 120 120 
##$DBP= (0..7)
150 150 150 150 150 150 150 150 
##$DBP07= 0
##$DBPNAM0= <>
##$DBPNAM1= <>
##$DBPNAM2= <>
##$DBPNAM3= <>
##$DBPNAM4= <>
##$DBPNAM5= <>
##$DBPNAM6= <>
##$DBPNAM7= <>
##$DBPOAL= (0..7)
0.5 0.5 0.5 0.5 0.5 0.5 0.5 0.5 
##$DBPOFFS= (0..7)
0 0 0 0 0 0 0 0 
##$DE= 6
##$DECBNUC= <off>
##$DECIM= 32
##$DECNUC= <off>
##$DECSTAT= 4
##$DIGMOD= 1
##$DIGTYP= 9
##$DL= (0..7)
0 120 120 120 120 120 120 120 
##$DP= (0..7)
150 150 150 150 150 150 150 150 
##$DP07= 0
##$DPNAME0= <>
##$DPNAME1= <>
##$DPNAME2= <>
##$DPNAME3= <>
##$DPNAME4= <>
##$DPNAME5= <>
##$DPNAME6= <>
##$DPNAME7= <>
##$DPOAL= (0..7)
0.5 0.5 0.5 0.5 0.5 0.5 0.5 0.5 
##$DPOFFS= (0..7)
0 0 0 0 0 0 0 0 
##$DQDMODE= 0
##$DR= 18
##$DS= 0
##$DSLIST= <SSSSSSSSSSSSSSS>
$$ [...]
##$SUBNAM0= <"">
##$SUBNAM1= <"">
##$SUBNAM2= <"">
##$SUBNAM3= <"">
##$SUBNAM4= <"">
##$SUBNAM5= <"">
##$SUBNAM6= <"">
##$SUBNAM7= <"">
##$SUBNAM8= <"">
##$SUBNAM9= <"">
##$SW= 18.0517328524113
##$SWIBOX= (0..15)
0 0 2 0 0 0 0 0 0 0 0 0 0 0 0 0 
##$SW_h= 3612.71676300578
##$TD= 16384
##$TD0= 1
##$TE= 0
##$TE2= 300
##$TE3= 300
##$TEG= 300
##$TL= (0..7)
0 120 120 120 120 120 120 120 
##$TP= (0..7)
150 150 150 150 150 150 150 150 
##$TP07= 0
##$TPNAME0= <>
##$TPNAME1= <>
##$TPNAME2= <>
##$TPNAME3= <>
##$TPNAME4= <>
##$TPNAME5= <>
##$TPNAME6= <>
##$TPNAME7= <>
##$TPOAL= (0..7)
0.5 0.5 0.5 0.5 0.5 0.5 0.5 0.5 
##$TPOFFS= (0..7)
0 0 0 0 0 0 0 0 
##$TUNHIN= 0
##$TUNHOUT= 0
##$TUNXOUT= 0
##$USERA1= <user>
##$USERA2= <user>
##$USERA3= <user>
##$USERA4= <user>
##$USERA5= <user>
##$V9= 5
##$VALIST= <valist>
##$VCLIST= <CCCCCCCCCCCCCCC>
##$VD= 0
##$VDLIST= <DDDDDDDDDDDDDDD>
##$VPLIST= <PPPPPPPPPPPPPPP>
##$VTLIST= <TTTTTTTTTTTTTTT>
##$WBST= 1024
##$WBSW= 4
##$XGAIN= (0..3)
0 0 0 0 
##$XL= 0
##$YL= 0
##$YMAX_a= 180802
##$YMIN_a= -212061
##$ZGOPTNS= <>
##$ZL1= 120
##$ZL2= 120
##$ZL3= 120
##$ZL4= 120
##$ABSF1= 10
##$ABSF2= 0
##$ABSG= 5
##$ABSL= 3
##$ALPHA= 0
##$AQORDER= 0
##$ASSFAC= 0
##$ASSFACI= 0
##$ASSFACX= 0
##$ASSWID= 0
##$AUNMP= <proc_1d>
##$AZFE= 0.1
##$AZFW= 0.1
##$BCFW= 1
##$BC_mod= 2
##$BYTORDP= 1
##$COROFFS= 0
##$CY= -3
##$DATMOD= 1
##$DC= 2
##$DFILT= <>
##$DTYPP= 0
##$F1P= 0
##$F2P= 0
##$FCOR= 0.5
##$FTSIZE= 0
##$FT_mod= 4
##$GAMMA= 1
##$GB= 0.15
##$INTBC= 1
##$INTSCL= 1
##$ISEN= 128
##$LB= 0.25
##$LEV0= 0
##$LPBIN= 0
##$MAXI= 10000
##$MC2= 0
##$MEAN= 0
##$ME_mod= 0
##$MI= 1.114404
##$NCOEF= 0
##$NC_proc= 0
##$NLEV= 6
##$NOISF1= 3.799351
##$NOISF2= 2.8
##$NSP= 1
##$NTH_PI= 0
##$NZP= 0
##$OFFSET= 14.38212
##$PC= 1
##$PHC0= -470.0952
##$PHC1= 13.39221
##$PH_mod= 1
##$PKNL= yes
##$PPARMOD= 0
##$PSCAL= 0
##$PSIGN= 0
##$REVERSE= no
##$SF= 200.129724274929
##$SI= 16384
##$SIGF1= 3
##$SIGF2= 2
##$SINO= 400
##$SIOLD= 16384
##$SREGLST= <1H.CDCl3>
##$SSB= 0
##$STSI= 0
##$STSR= 0
##$SW_p= 3205.1282051282
##$SYMM= 0
##$S_DEV= 0
##$TDeff= 0
##$TDoff= 0
##$TI= <>
##$TILT= no
##$TM1= 0
##$TM2= 0
##$TOPLEV= 0
##$USERP1= <user>
##$USERP2= <user>
##$USERP3= <user>
##$USERP4= <user>
##$USERP5= <user>
##$WDW= 1
##$XDIM= 8192
##$YMAX_p= 0
##$YMIN_p= 0
$$ End of Bruker specific parameters
$$ ---------------------------------
##NTUPLES= NMR FID
##VAR_NAME=  TIME,          FID/REAL,        FID/IMAG
##SYMBOL=    X,             R,               I
##VAR_TYPE=  INDEPENDENT,   DEPENDENT,       DEPENDENT
##VAR_FORM=  AFFN,          ASDF,            ASDF
##VAR_DIM=   8192,          8192,            8192
##UNITS=     SECONDS,       ARBITRARY UNITS, ARBITRARY UNITS
##FACTOR=    0.0002768,     1,               1
##FIRST=     0,             0,               0
##LAST=      2.2672688,     0,               0
##MIN=       0,             -212061,         0
##MAX=       2.2672688,     180802,          0
$$ Real data points
##PAGE= N=1
##DATA TABLE= (X++(R..R)), XYDATA
$$ [...]
1515b0J120j702l14J794n78j573J624N94j756K98J479r77j175J848J95j891R83
1532e1J388j749m64J667k32j751J054J103j738P6J628r23j340J714P25k165N73
1549d85J718j290j107J783J77j716O37J538j701n61J900l58j673J187J082k027
1565h96J19K010j134j371J708N71j936N21J505j150j144J949L8k016Q81J656j896
1582e85n17K125n59j709J507Q03j922K29J702r97j272J647O58j938L43J530j420
1599c75n40J931l79j769J089J236j786k80J989p89j582J607N37j818J12J781j025
1616f1j059J730J37j846Q61J549j525p78J838l30j582J007R73j549k43J829p53
1633A98j519J574P55j867N28J466j127q20J696j3k058R80J306j406p88J677q8
$$ y = [-20, 1100, -602, -916, 878, 300, -1273, 351, 945, -811, -513, 966, -11, -1186, 662, 857, -1034, -51, 1337, -412, -876, 791, 559, -1192, -138, 965, -773, -697, 931, 8, -1332, 382, 1107, -1058, -485, 1233, -57, -1164, 619, 796, -920, -283, 1255, -446, -1007, 893, 535, -1138, 49, 1131, -896, -777, 1233, 99, -1272, 436, 1007, -929, -408, 1097, -53, -1197, 752, 790, -1226, -345, 1311, -585, -1102, 1023, 464, -1245, 262, 1065, -857, -628, 1074, 77, -1195, 452, 1110, -828, -485, 1045, -375, -915, 1016, 637, -1132, -43, 1193, -593, -873, 1116, 327, -1255, 352, 889, -929, -817, 964, -61, -1120, 610, 747, -1099, -238, 1311, -214, -992, 846, 516, -1066, -59, 914, -635, -878, 951, 198, -1321, 253, 1008, -859, -331, 1135, 8, -812, 884, 871, -1187, -207, 1099, -307, -1095, 582, 494]
1650D94j673J261P41j576j40K137j047j395J567N88j579L11J548j278p88J617
1666G88r7j795O11J356j433l43J602l42j625J397Q09j641J2J874j145j020J524
1683E32L56j651M48J340j117p90J385J04j346M92J181j407j62J451p47r65J061
1700A65O71j518q8J490p43q67J421Q6j443M78J479j089n81J223j68j230R56N70
1718H12j219j24J203n85j173J234L40j101J11J147m89r87J379K21j328M79J137
1735A057j305k70J150j88j098O38O74j068k59J046j66j093J029M02j024J89Q13
1752E27n15o74J112J02j214L98J098j100k32Q98j66j008P95N07q66M8Q35k70p49
1771d74O84L66j062L17Q02p33m49Q64j16p14N24M14o88r7Q23j98n21L02N00q63
$$ y = [494, -1179, 82, 823, -753, -893, 1244, 197, -1198, 369, 957, -622, -311, 1237, -41, -829, 788, 691, -1104, -493, 863, -570, -913, 689, 347, -1278, 119, 928, -713, -701, 1173, 28, -992, 532, 888, -763, -315, 1025, -92, -882, 503, 607, -739, -247, 934, -473, -635, 816, 69, -896, 165, 836, -682, -770, 720, -23, -890, 531, 617, -826, -348, 1131, 42, -539, 684, 516, -714, 242, 812, -407, -531, 672, 87, -1086, 148, 488, -613, -502, 645, 156, -831, 548, 769, -559, -80, 1057, -248, -518, 632, 444, -654, -16, 658, -410, -669, 377, 211, -882, 147, 549, -475, -286, 527, 12, -662, 450, 552, -662, -264, 834, -266, -498, 400, 234, -774, 21, 528, -338, -290, 545, 275, -474, 210, 576, -486, -169, 633, -100, -549, 315, 199, -515, 9, 423, -265, -362, 461, 263, -258, 44, 544, -319]
1791c19M1Q69n17m88L74N41q86K15P08n98m63Q13q8o13M42L93p21j6N99j29o74
1812e17N99M25p50K6N71k06m28N41j72l56K01M28n58j39N21P5o98K59M40n29k8
1833b95L93j37l74M12K92l72j3M81j99l53M93j22l98J61J93l40p2L79k30l06K03
1854b04K87k55j24L58j24j51L27Lj16J12L03l76q1L08P4l93n7J16oj30J44k49
1876b34J83Rk7n4L0R3j35NJ52r9Q6J14lj46m4o1L03pp5k12K14Mj88j10J58k4L5
1903c3k65L28j9O2k20l1L52n0j75j00J07K42j57M3n2o6j59R5O2L9J66j69j3j66
1927a79L35k00j9J26J32l47J69k4J61k49N9N9j4kJ48m07J29J99K5j65K5L73l19
1950A5j47L49j13l19K87K81l68j0L81k95l67K90Q0k84J41K22l49NL33m0l81M6
$$ y = [-319, -278, 591, 74, -414, -40, 501, -385, -170, 538, -60, -523, 290, 202, -411, 31, 424, -297, -313, 286, 157, -517, 82, 507, -243, -217, 354, 148, -280, 261, 89, -267, -66, 362, -196, -335, 186, 261, -437, -178, 262, -267, -295, 98, -39, -413, -1, 291, -81, -94, 387, 188, -165, 328, 206, -192, -31, 162, -178, -250, 129, -101, -407, -204, 83, -172, -296, 62, -62, -213, 114, 117, 1, 113, 416, 40, -41, 267, 341, -52, -109, 7, 1, -129, 15, -234, -51, -42, -69, -123, -93, 0, -135, -130, 22, -77, 9, 123, 120, -26, -70, -131, 172, 165, 90, -122, 92, 96, -92, -202, -44, -68, -33, -298, 30, 11, 73, -147, -178, 174, 124, -51, -151, -44, 198, 41, 84, 32, -34, -193, -98, -36, 3, 169, 0, -13, -179, 156, -44, -63, 63, 195, -152, 17, -7, 154, -95, -36, 23, 9, 7, 155, -252, -123, 76, 101, -64, -39, 334, 15, -132, 217, 104, -215, 72, 353, -15, -25, 356, 61, -306, -16, 64, -220, -79, 143, -206, -201, 132, 92, -289, -243]
1972b43M94l54q3L47q1l02K75K78m50q6M91k30k67M56j27m34J15L72q0m70N08
1993A29Q1l61K09K81l45l4L43q4m91M19P1l53PN29m74j86L88P8n69K31N29m20
2015b2k95N76N6n94L76K24l73j85L99Mk82K52J08n39P5M19j19m35L50J81l95O9
2037a50L75k28m09O22kl84K78J87m63j01O16j63o37N04L49o88M4M54l20k53M31
2058F2R0m64N9O79n81oM31l1o33M47K64m03l8N33l83k90K37J68l76J67L33k43
2080B2n42O83J50o38K50L57l34k74N90q9m05L47J01n55K79L93m72p7L42J06n03
2101b69K04L48m11j44M79p1m89L92L79n11j91M73m6m50M76J22n67j7P03l32l52
2122b74M15O8m98q3O82m17k53O64j78m39K88L77n10j33O35j74o38L89L10m64K40
$$ y = [-243, 251, -103, -186, 161, 80, -222, 53, 331, -119, -205, 286, 56, -211, 245, 118, -316, -201, 171, 91, -379, 129, 210, -151, 58, 339, -6, -40, 303, 219, -272, 147, 218, -135, -128, 401, -73, -259, 129, 207, -362, -131, 398, -22, -317, 259, 315, -279, 97, 321, -52, -237, 162, 166, -116, 136, 244, -295, -220, 199, 80, -355, -5, 176, -219, -150, 225, -3, -412, 210, 208, -176, 102, 289, -174, -275, 341, 178, -459, 45, 394, -294, -250, 204, -116, -369, 62, 152, -312, -253, 426, -155, -161, 270, 239, -394, 53, 317, -86, -124, 409, 26, -264, -27, 141, -235, -68, 265, 22, -520, 163, 313, -325, -75, 282, -52, -326, 264, 175, -230, 117, 218, -337, -58, 335, -137, -214, 128, 234, -269, -65, 283, -128, -272, 207, 136, -353, 39, 418, -93, -284, 189, 143, -307, 169, 291, -276, -293, 410, 78, -274, 141, 209, -289, -372, 310, -107, -360, 304, 126, -313, -25, 352, -158, -291, 344, 170, -468, -79, 231, -233, 7]
2143GK85l19l80N05J67p02M63M07l91m77P47j42n16K21N30l54k54N77k70m55M57
2164A06K21p20L76L81l84j16K02J7k89K54J05j19k40M13o4m57M49Q2k55l6L63
2185B89k84l07N04J49n38J28L08l58k38M99O9m86J56L63l70N4M36k47l17K70j1
2206F9k71P9L93k39l77M13K90m81Q8J49q9l30L67M2k73J73L29n57J15L72l46q2
2228a66J36K74l97K38J25p3m20M88K7m51M6N18l82j28N00k66l89K87K62k78P5
2249B6Q5j10k06L96K7n70L80J44l41k47N23K5k16m8kJ26k07L67J64m45R3J12k42
2272a66R6J40J08m12L96l3k75pJ67L7k35K24r1P0n8J63r8R5P2j2k50l7J47o3J0
2297a2J61l3l89K30J19j92q9M65k05j35J94n0k02J19K43m58J86K40j60r0J43n5
$$ y = [7, 292, -27, -407, 98, 265, -437, 26, 433, 42, -435, 312, 170, -346, -125, 405, 51, -203, 374, 104, -351, 106, 327, -393, -17, 364, -20, -136, 66, 83, -206, 48, 153, 34, -206, 207, 143, -314, 135, 217, -38, -74, 289, 5, -302, 202, 351, -187, -59, 249, -109, -347, 152, 221, -265, -109, 254, -116, -62, 374, 127, -190, 80, 69, -202, -123, 270, 31, -346, 67, 357, -124, -36, 113, 24, -306, 61, 103, -170, 3, 332, -225, -110, 262, -84, -166, -30, 244, -153, 85, 210, 137, -283, 205, 232, -219, -173, 345, -37, -165, 335, 69, -320, -33, 229, -49, 26, 111, 1, -205, 191, 218, -352, 28, 172, -169, -416, 107, 132, -84, -132, -134, -8, -215, 152, 316, -129, -36, 76, -166, -70, 70, 178, -234, 162, 129, -146, -153, 14, 51, -184, 40, -51, 19, -39, 124, 26, 121, 193, 181, -69, -106, 41, -22, -12, 149, 116, -273, -43, 76, -116, -205, 260, 55, -80, 114, 64, -138, -19, 224, -234, -48, 192, 32, -58, 85, 30]
2319C0j0m3J28j49kO0K9k07n0J96k03l3K59N3j95K92k4l14J28J95j96j40R4J46
2343D4l17K01K2q8r8K47J02j10Q5j65O9R6k1j35J85n5J27k81N6J60j0r1M3n1j55
2368a40J78k61O0J27K98p8j94J57j72q4K17j0J6J22j01q8M5j09o6K20k22J1Op3
2392a41J64K0j1K1L7j51J7j5K03k31J05l7j72L39k5L6k11l7J59O2o5n9j77J08
2416f1M0O3KN2j47J63j64N7L4M1j6q8j39K01j46K23k1Kj72J05P3j55r2J21M3j4
2442Ep5l8J30k86Q5J71m5K52j62q4P1j15J57P4j65m6K6N8k0j01M2J13r6J31R3
2467A75j63qn4K48j4k89J63N9p7J3N5j08O0J33k34N9n6J93j72j14J28j79J37Q5
2491D0k20K81l8p1o4Q2K47l01M2J7J36j76q9L52j88k15K27K3j54N4Q0j33n3J85
$$ y = [30, 20, -23, 105, -44, -46, 14, 43, -164, -214, -18, -221, -254, 5, 58, -137, 155, 131, -183, -55, 140, -56, -196, -102, 44, -273, -72, -50, -138, -236, 11, 113, 3, 88, -77, -8, 88, 67, -68, 117, 62, 189, -92, -36, 124, 114, 23, 66, 15, -140, 38, -223, -163, -36, 262, 184, -10, 147, -25, -109, 108, 98, 114, 236, 135, 47, 92, -17, -83, 137, -85, -74, -68, -141, 23, 43, 32, 53, 90, -61, -44, -59, 144, -87, 18, -19, -191, 148, 123, 159, -52, -89, 70, 132, 67, 8, -169, -61, -21, 42, 44, 96, -51, 112, -52, 5, 39, 80, 64, -24, -163, 38, -108, 115, 94, 96, -76, 29, 102, -53, -145, -24, 19, 5, -70, -108, 22, -264, -179, -8, -53, 199, 37, -47, 24, -91, 66, 140, -25, -71, -45, 13, -7, -108, -66, 47, -49, 82, 175, 12, 4, -50, 198, 184, -105, 58, 117, 40, 53, 108, 0, 60, 193, -41, 18, -38, 155, -17, -131, -3, -182, -45, 40, -180, 101, 63, -8, -72, 10, 257, -44, -2, 15, 151, -25, -114, 238, 50, -165, 62, 85, -69, -15, 65, -68, -121, 64]
2515F4j94R9J49p0j18j33J72o4qJ45L4j98p5L62j89k7J1J68j91N7J45j67n6J16
2539C2k1j49K6J82j34j4J55j23N2m7Q8o9K4Q2K6j44J03m6k53J78J36j68J02K6
2563D4Rj87Q7K15k68M8Mk4J9r4K65k07L9J87k05j8R6K4p9p9J68p0o4P4J32k34
2589a18M49k63k8L2ln3o3J80j72J03j3j51p2J15J68j03m8J45N6k66l8J94o5j62
2613a76J59q4oR5J63j97j46K62r9J8L0J11q1M1m0j65R8K2J55k14N2Q1j13p5l2
2638a41J89j38k3J52m9J24M5j03j93N4K00k19J37n6J04RP7k39J00L8l1k0p7j06
2662a66Q8K57j07Oj37m2J70m3n2J68r9K2j9j84j04Q9J32M8Or6N9r8P0J34Q5k76
2688h9J22r1nJ71o8k33J57M1K05j94q5Op7J93J47o4l21J64J16j53J8J75L9k63
$$ y = [64, -130, -31, 118, 48, -70, -203, -31, -95, -103, 42, 76, -122, -197, 165, -24, -51, -40, 128, -63, -6, 139, -28, -84, 32, 11, -138, -112, 70, -64, -78, 77, -46, 6, -41, 47, -22, 2, 84, 110, -34, 69, 23, -230, -52, 84, -84, 18, 44, 53, -134, -47, 168, -100, -52, -48, -72, -53, -147, 118, -89, -50, 137, -68, -86, 10, 34, -45, -124, 44, -26, -90, -16, 116, -118, 331, 68, 40, 72, 69, 16, -47, 133, -39, 64, 51, -100, -172, -57, 111, 8, -40, 105, 161, -105, -143, 51, -14, -176, -17, -101, -107, -12, 151, -46, -192, 70, -29, -11, 19, 130, 49, 90, 50, -115, -17, 5, 160, -54, -2, 79, -34, -109, -141, 48, -90, -113, 39, -10, 114, 159, 56, -137, -83, 117, -102, 35, -21, 83, 92, 169, -70, 30, 68, 37, 17, -60, -166, -78, 179, 72, 78, -59, -101, 69, 26, -26, 142, 43, 65, 46, -138, -242, -153, -21, 27, 33, -63, -4, -102, -32, 102, 187, -89, 33, -58, -63, 108, 40, -193, -36, 5, 210, 16, -69, -63, -140, 53, 200, 136, -185, -21, 95, -58, -40, 135, 174, -89]
2712h9J01Q0k96K74Q2j32l5L8K0q3qrQ1P6K4n3j31J99Oj32j42qR1j1R1j85J99
2739D8j01J59k26J73j27J5p4J19L0J07k59O9K41k7k2q3j63J84k97L64j38O2k0
2762C4J01j21K1J34k58N7Q8N9j21J0q6J65M7m3J2j24k0o0j02K64j21J50n1k7J9
2787B7J34k98J2K11J75j97M8Jj3j37j52K66j13l6J44m3q3R3M5J2N0o1K1O9j21
2812E4K24k25K9m0j60l1J41L7k07N4J45o8j43K12j01J31o3J4J38mj56P5k17J40
2836b1L0l4l3P6O9j35P9J77k70J21p3J33p4q0Jr2J34l1j1J54k50O4Q9o0N3j43
2862a27J57k42L14l5L0j20p6k4L5L1J43L0j46j1J15q5pN2k2q8K28k53J1P8p7l5
2888a24J08j7p6O4Jj89K59o9J50k04m4Q1P8p6J15j27J34j06N2j8J79k65J02j1
$$ y = [-89, 12, 92, -204, 70, 152, 20, -15, 23, 43, -40, -48, -57, 24, 100, 124, 71, -60, 139, 145, 13, -129, -137, -46, -57, 34, -151, 48, -53, 106, -120, 53, -74, -59, -133, -14, 16, 123, -136, -67, 174, 147, 125, 42, -121, 63, -234, 130, -8, 54, 34, 135, 14, 35, 169, -89, -32, 56, 115, -6, 4, -82, 83, 130, 87, 99, -25, -45, -105, -207, 57, -64, 86, 35, 8, 27, 161, -137, -125, 86, 261, 64, 112, 113, 100, -37, -189, 77, -36, -72, 72, 29, -54, 39, 84, 96, 146, 85, 106, 175, 54, 278, 53, 82, 42, -118, -149, -8, 29, -178, -124, 21, -47, -190, 22, -79, 52, -11, 3, 141, 137, -19, 56, -161, -21, 9, -25, -58, 18, 87, -48, 31, 208, -62, 59, -14, 119, 45, -35, -34, -126, 8, -23, -34, 120, -130, -66, 23, -37, 16, -127, 30, -212, 102, 67, 97, -23, -99, -123, -88, -57, 86, 116, -30, -41, 74, -11, -18, 34, 12, -76, 152, -101, -90, -12, -89, -124, -16, -33, -109, -45, -44, -233, 26, -43, 107, -97, -141, -60, 18, -58, 57, -70, 64, -42, 10, -8, 171, -94, 8, -3]
2912cK38j98N5K5L0j28q1j89L15M1j08J3l6K2j31K24k9J1k35K18NN1j42P9k55
2937b08L73p9j5k61J79N3j36K85k78R5P7L7j10P1l2O0p5p8J71j21O0j87J66n4
2961gmOK6L8p7j44K28l3j75J82k8P0n3M4pj50J11l3J10O1P0l30p0K47m1k3mj37
2989a23P4l4K08k4j29N4k3O3l4j25J02rR9j22L3J08k69J28KJ60j01j65L1m0J47
3014A1K4J2O5k10N9M5j17R4J22l7j72k8M03k34J12k67J15j17K01j75J28J6o6M0
3038B4l9J22j56j23P5J39k78K66R2j57Q3q3J4o2J23j08K2p5K29r7K7qn9k8l7J94
3064A00j01M5N2j45p9K24k4m6l1j8J8L8l5O0j9nk5Q7k37J54q6O9j35J55p5J6J2
3091c1O4pN7j45qqO5K9M3j9j43J97r9Q2lJk9J9k02J11m1k2N4J8O8K43j66J02l46
$$ y = [-3, 235, 37, 92, 117, 147, 19, -62, -251, 64, 105, -3, 10, -26, -4, -135, 89, 60, 71, -164, 54, 59, 110, -32, 47, -208, 165, 86, 71, -190, -11, 42, -94, 191, -87, 8, 85, 122, 12, 83, 51, 111, 36, -42, 129, 8, 68, -119, 47, -7, -11, -5, 21, 59, -18, -162, 66, 33, -142, 40, 12, 82, 29, 73, 66, -84, 27, -6, 104, 165, 235, -95, -165, 82, 41, 18, 14, -123, -49, -83, 125, 101, -28, 26, 3, 66, 32, -93, 9, 0, 99, -23, 10, 118, -151, -23, -21, 139, 38, -127, -96, -136, 11, 35, 47, 112, -98, -39, 6, -111, -17, 105, 68, -104, -132, 271, 37, 149, -118, -3, -120, 81, -94, 34, 50, -16, 24, -15, 107, -49, -172, -97, 42, -236, 30, 122, -35, 48, -35, -21, -83, 40, -68, -46, -121, 108, 11, 38, 30, -29, -57, -94, 100, -1, 44, 96, -49, -128, 96, 72, 26, -5, -23, -5, 33, -2, 58, 39, 34, 9, 96, -141, 13, -73, -4, -139, 16, -59, -43, -31, 33, 26, 83, -62, -70, -78, -13, 16, 59, 40, -103, 94, -5, 77, 74, 75, 46, 65, -137, -26, -67, -89, -35, -17, 51, 294, 128, 230, -116]
3120a16Q1J45j70J34j1J07l23L3J57L0K7j13K98l20q1jJ22k23K57j10Pj0Q4j00
3144i6J13rj5j6L0P3m2J01k20J1O5q0m8K03j6o9m0P7n0o0R1M9J09j12R1R5k18
3171A7j42J53J03j7j73J20k47J27J90j24lj72K71j13N3K9M7k0j59r2J41J48n8
3194G9J3l5j05O8lJ36j93J13j99J61nj79J59m0l9p9L02l53J43J21q1R0j19N9J74
3219A88k48J19l3rN6P9o7q1j63J04J00N2o7k2j74L65k32k7J19K6k15K02K7j49
3243e0M1P8n1l6lO8Q5k09j2J09J8j9N7j22k6K01j62m5N2j5M0J72j53O0j21L0l9
3270e2RJ53r4M8l7j3J4o1Q%M4o6j78K53M7r5j14R7L9O7Q8k21Q5N1r4Q1J27j69
3298A7r4Q8n2J03L0j07O9m8J39k34jK1J03o7R9O6j95K0J2J07K2r0P9m4m2j8J68
$$ y = [-116, -35, 110, -60, 74, 63, 170, -153, -120, 37, 67, 94, -19, 279, -41, -122, -123, -1, -224, 33, -77, -70, -80, 4, -96, 17, 8, -7, -23, 7, 80, 38, 139, -81, -70, -5, -85, -133, 70, 54, -15, -55, 22, -28, -88, 3, 52, 161, 49, 140, 235, 17, -125, 28, 131, 114, -59, 61, -186, -59, 131, 7, 4, -168, 103, -10, 43, 72, 119, 99, -60, -152, -11, 137, 79, 92, 57, -48, 20, 17, 153, -40, 73, -126, 35, 30, -149, 10, -30, -69, -148, 154, -199, -56, 65, -16, 74, -45, 14, 188, -60, 59, 26, 17, 73, 152, 85, 4, -159, -55, 45, 97, 30, 8, -166, 199, -33, -60, 59, 85, -130, 72, 99, -50, -9, 69, 18, -18, -21, 47, 132, -77, -89, 20, 38, 19, 76, -46, -72, 129, -33, -78, -26, -41, -1, 171, 18, 78, -43, -13, -52, -43, 110, 16, 64, 27, 14, 28, -33, -25, -25, 19, -47, -225, 28, 75, -20, -134, -37, 2, 69, 157, -64, 21, 72, -22, 59, 186, 17, -77, 11, -41, 62, 92, -15, 54, 6, 145, -89, -90, -69, 34, -33, 66, 132, -63, -43, -31, 76, 98, 8, 87, 43, 1, -17, 151]
3325A51j43O9k0k38K27N0J9k31K8J76j62J61q2l5oKJ21j01q8kN9l0R6j7l7O5n7
3352b5j3k72K75J07j56L1M4M6m0p5m6N4Q3R4j88P1K1jp8J21L8k49J61j1L9m6l6
3379e1R7R9j61q4j11K10Q4k11L6j9j4M2R6j59J45j4N2kq7K19l09L26k85J24o5
3404d2N8K9j80Q4J95j52J75l30K21j74l1K47J9j31r6K91j98Q2j43J33n6qp4N2
3428b9l5n7J36N0n4K6K5k05J45J4J1L1k0j5O6r6M1j28j7Q2L3j32L09k06j58L09
3454A26j96J18M0k02K71k07J7o9M8O9k7K1L3k21O5K71j85J89q1j98L27j91p6J22
3478F4kj69J56k55O7K37j02j08O4N5J15l9L0J7j53L36l36J3j54J78j78J81NNO
3503C3N0l24K21j39mJ44K4j17P6J49p8j54K44J15k01j29Jk6J04j21K52k20J15
$$ y = [151, 8, 77, 57, -181, 46, 96, 115, -116, -88, 88, -74, 87, 5, -30, -36, -34, 87, -14, -102, -104, -45, -75, 21, 4, -33, 32, -25, -38, -310, -35, 72, -84, -53, -9, 37, -3, -78, -124, -70, 13, 107, -81, -10, 11, 10, -68, 53, 91, -158, 3, -8, 31, -15, -51, 46, 145, -16, -100, -211, -1, 83, -128, -92, -111, -125, -83, 13, -146, -1, -15, 37, 35, -52, 167, -142, 184, -101, 23, -42, 16, 45, -135, -51, 144, -8, 167, -163, 58, -116, -147, 100, 119, -12, -108, 183, -15, 67, -76, 57, 1, -7, -81, -29, -64, -121, 15, 65, 11, 37, 62, -143, 2, 16, 27, 58, 38, 23, 89, -7, 34, -94, -111, -29, 4, -128, 181, -25, -183, 126, -70, 48, 88, -114, 157, -50, -33, -102, -54, 15, -12, 9, 42, -179, -114, 157, -28, 161, 80, -118, 209, 18, -58, 64, 62, -107, 49, -206, -139, 98, -4, -112, -48, 7, 122, 83, 113, 130, -23, 313, -23, -10, -164, 14, -164, 17, 22, 27, 33, 83, -241, -20, -159, -163, -19, 5, -112, -36, 113, 35, -119, 125, 240, 39, -90, -89, -115, -11, -132, 120, -100, 15]
3526A5j00j08K20l0N8J2p6J59j11l9kO9j34J41k7q3r0Q8j56J48K0Q4q5n7O9J3
3552bm5M5N0J6q9Q1N6j46o1k0J00J58r6j13J59j0j17j02K02p5M5m8O6K9m6L3j9
3579E1j20K11k37P4o5K00kj49N0j10K56k05K11k38J08j09J68q0j49P6J79k34J92
3602G8M2j95m8J7J21j59K2J01k7P1j05J0J04pPK4r7J04l2o6Q6K6n7r6K7O9j17
3629i7J65j90K27M8j88r7P2K44j75j28J19j8Q7j9M1j21M7O9nj47J28kjj88K8K59
3655A58l44J35J27L4k30K61k49J70j07m8J51J10k08m0J19j73J90j72J87j98K2
3676a05L7l1J38Nk8K7j05oJ52K6q1j94K66j3N9j2j30J7k1M9j39oJ30O0j8J1ok48
3704a66J11K5Rk6m7J47J49l05L3k1P7J25l6j60J82j15K6k5n0j92J82J82k04L7
$$ y = [15, -85, -193, 27, -3, 55, 67, -9, 150, 39, 0, -2, 67, -67, 74, 47, -36, -126, -38, -194, -46, -26, 58, -27, -84, -15, -2, -47, -2, 48, 64, -25, 56, 112, -34, -95, -115, -15, 143, 47, -66, 93, 83, -34, -136, 66, -9, 36, -12, 54, 83, 37, 70, 51, -69, 142, -95, -21, -86, 114, 112, -37, 13, -97, 159, -46, 165, -73, 35, -74, 94, 14, -135, -59, 120, -114, 78, 120, -75, -123, -106, 15, -144, -122, -21, -48, 23, -82, -72, 32, 25, 32, 56, -41, 63, 31, -35, 51, 77, 20, -76, -49, 20, -97, 68, -122, 105, 153, -35, -132, -60, 184, 9, -119, 0, -18, 69, 50, 91, -30, 17, 86, 81, -66, 62, 60, 59, -129, -101, 158, -186, -51, 76, 110, -120, 141, -108, 62, -45, -93, 58, 168, -40, -80, 39, -134, 56, -116, 71, -127, -105, -68, -99, 39, 44, 16, 43, -62, -68, 84, 110, 29, -165, 101, 88, 147, 135, 5, 22, 1, 50, -89, -95, 35, 95, 77, 88, 82, -166, -55, -30, -21, -47, -94, 53, 202, -103, -70, -91, -14, 111, 75, -85, 97, -18, 8, -17, -67, -259, -77, 105, -99, -62]
3728f2J14P0k34L0j36K87k69L46r3kM8k6q1j15j21J80O5J43o2o5l7r3J96l2J40
3753A91j02j12J1L2j14j5J32m4p0J57k03K3L7j01L33j66Q7j90K16OK7j80r3J4
3777a24L2J02j49K32p1j7l1p4N6J2o6Q0J88j41j40J23j55J39r5J19j61J38O0q7
3801c0j0j17K50k54J60J8O9Q0j35j10J1O0j30J00l2P6P0j60J38q2K05l5m00J92
3825f6Q3rJ6O0j06j08J63j14J75Q1q6j9r0j01J68j07l6M8o7J59L6j45m4K8QK04
3851A31j73N8jO9J05k37p9J61j23M5J76k43Q3r1J22l9nK54n5j93o4o8K52M5k10
3876h0K72l95K53qm2N1j1q9o0K53J79m17Q8L3K1j57J05K7L8r9k7O7j75L1J13K7
3902bP5r9J10j37J52j48J26k71J78K0j7J00Kn9m3O2k2M8o0L9o9L1jk0j3R5j14
$$ y = [-62, 52, 122, -112, -82, -218, 69, -200, 146, 53, 51, 99, 73, -8, -123, -244, -64, 1, 144, 82, 17, -20, -113, 83, 51, 191, 89, -23, -12, 20, -94, -109, 23, -21, -91, 66, -137, -114, -77, -178, 155, -11, 76, -114, 102, 108, 135, -45, -138, -124, -92, 10, -139, 93, 22, 5, -26, -100, -44, -32, -98, -18, 170, 29, -111, 12, -143, -4, -99, 20, -141, -3, 57, -30, -40, -157, 93, -161, -1, 17, 86, 166, 31, -79, -68, -8, -138, -38, -70, 6, 76, -84, 54, -28, 177, 142, -258, -66, 17, 8, 24, 84, -22, -130, 33, -81, 94, 175, 89, 70, -20, -121, 47, -60, -96, -48, -115, 44, 80, -65, -109, -81, -73, 131, -42, 16, 15, 84, 189, -48, -127, 34, -89, -44, 132, -111, -28, -119, 3, -36, -41, 213, 158, -35, -99, -167, 85, 130, -80, 192, -203, 50, 42, 0, 51, 40, -49, -109, 144, 323, -94, -6, 27, 48, -109, -4, 23, 61, -38, -65, 2, -173, -142, -29, -2, 73, -26, 84, -53, 99, -49, 77, -194, -16, 4, -13, 87, 89, 30, -13, 49, 27, 75, 15, 54, -15, 16, 15, -5, -18, 77, -37]
3929c7j4o2K7R5l5p2J96k97K56P1l3j33R7k7Kj00l6N2j8L2N6q3R3pkJ60ql91J09
3958a09J00P2j29R7K3j22K47k24J19k20J5J2J31j21J52k44J86J54k34J67m3j17
3980h8N9l7j10K17j15J82J25m2l93J07O1J17m7j18l4J83j78K7J12L8j17O1K4L9
4004G3n0j16J38l1n7J22q5j6J21k15J44m7M5q2K26k24nQj7M1O5k3j26QJ66j38
4030g5J09Ol0M5M6k23J5K3J15J4L4N6j23j40J69j85k7L62l33j1J06J55j23jJ4
4055bk7J83k73N9K78j83j86K27P1j01k22K17j35O8K09j88k6L9k1k15R8M57l68
4078d1q6J64M9n2J21jj88Q3O8Qq7n1J05j15P1r0O5j54J61J13r6j80K9K16p5m3
4104fL7k82J84J15j9L2j04J18L8J7n2j98m3J84n2p4Q8O1j23J2l6NJ51r5r1J80
$$ y = [-37, -51, -113, -86, 9, -26, -98, 98, -199, 57, 128, 95, -38, 59, 32, 34, -66, -102, -50, -68, -36, 20, -63, 30, 23, 21, 181, 173, -218, -109, -9, 63, -66, 31, 54, -68, 179, -45, 74, -146, -131, -119, 12, -109, 43, -201, -15, 139, -95, 72, 29, -88, -29, -66, -176, 41, -74, 108, 233, 191, -202, -95, -34, 83, 36, -82, -116, 67, -111, -84, 28, 66, -51, 10, 34, 73, 23, -93, 45, 14, -43, 79, -6, -22, 99, -116, 28, -19, 26, -56, 170, -54, -59, -51, -68, -27, 38, 15, -111, -103, 63, -75, 34, 40, 10, 55, 101, -122, -107, -84, 31, 45, 79, 135, 12, -128, 41, -144, -171, 191, -142, -153, -47, 108, -15, -16, -2, -29, 154, -119, -60, 218, 35, -151, 76, 147, 46, -176, 41, -94, -26, 183, -5, -31, 8, -13, -228, -130, 327, -41, -127, 37, 86, 34, 155, 154, -34, 49, 117, 125, 38, -13, 92, -23, 48, -42, 23, -131, 30, 143, 47, -133, -104, 112, 37, -6, 31, -251, -67, 48, 29, 61, -43, 75, 113, 130, 78, -120, -163, 21, -31, -105, -17, 44, -79, -67, -103, -98, 53, -42, -133, 47]
4130D7n3j80K96k51J27n9K28j04N6k30O0M7J55j50n8M9j03O1N9J06p7l0j53K35
4154G8j7J28l77K82k8j19r3O0j2L68j27j56j43P6J51n9j06J71l1m7mo2R3k1k1
4179a6MJ47o0q0QM7j61J15Lo8N0J11Rr0o2K4N2J8k38J8K13j56L9L5M7Nj23P0R2
4208E3M4j10q5J21p2R1j07R8j11J14r2l9K10n4m6N8Qj44L0m0J68k4K2J54k86q
4234d7K05k22j3M1M0L8k12K08Pj25K8m3L2K1M2RJ0j29K10j95K86l00J18j01J43
4259E1r5n6K1J72k18J31j51P5K56k50P4jj34L8L9j34K96j30J91k40N3J34m1j01
4283b0K1m4Q1p6K8J32Q5k48R5P1j12j43Q2o1l6K61J42k09r9N4q6n9L4J25p3L0
4309b5J38j46J01j63P6j26K09q2L6J71k62J88k46L89j18l39J16N3O4j00M0lnN6
$$ y = [47, -6, -186, 110, -141, -14, -73, 155, 51, 107, -123, -63, -16, 139, -11, -69, -20, -123, -62, -3, 103, 26, -4, -157, 78, 61, 189, -188, 94, 66, -53, -146, -86, -98, 270, 143, -13, -156, -80, 71, 12, -94, 77, 46, -1, -5, -67, 26, 5, -16, -12, 135, 75, -5, 3, 50, -111, 4, 7, -61, -11, 100, 109, 19, -43, -19, 33, 51, -187, -169, 44, -112, -73, -38, 9, 14, -109, -39, 53, 97, -13, -98, 23, -49, 42, -65, 33, -78, 36, -56, -95, 115, 61, 15, 73, 81, -63, -33, -73, 95, 71, 93, 247, -39, -47, 158, -64, -77, -36, 4, 42, -170, 38, 45, -80, -52, -95, -63, -42, 0, 9, 19, -110, 100, -95, 191, -109, 9, -92, 51, -44, -100, -79, 93, -125, 6, -145, -70, 186, -64, 10, 9, -125, -87, -48, -182, 114, -16, 175, -65, -12, 122, 81, -20, 1, -43, 38, -38, -10, 122, 207, -41, 54, 125, 13, -130, -48, -109, -145, 116, 258, 49, -50, 4, -82, -141, -107, 18, -55, -25, 113, -33, 68, -95, -19, -145, 64, -18, 18, 189, -73, 115, -131, 258, 140, -199, -83, -30, 34, -66, -26, -29, -34, 22]
4333B2O8j09r6J39M4m6R3o0J3n3L1m0L9q2N0J0j70P4O1Q5j79P8L7k26K96r8J21
4360A02k2q5j04J4Q4l8M1L5J01k30J51L0K6j9k24K00J7L5o7j34J11J42k17M5N5
4385D9j04o1K60j62j13J75j34r2K74N3L7q4kj07n9J14l8L0ML4p5O3N5q7Lk48L23
4412A08J30k67N5J48m3j70KN0pJ7j08N2P2j04n2N8J08k45K31n9J32M3k75K00k3
4437E3j96O5J36r1J17o0l0J07k50J85l4OK2J10j15M1J0M5rj89J37n8m7J09q3P2
4463E3o3M5k0k7p2J37J07k64J7K60j18MR3j44J83k90J33n3j14j68M20j93n8J28
4487dLp4J24j70LJ60L2q8O4j26K94l09J64J13j71k0j36J27j12J76o1j7M4Q8j07
4512cM1j75J9J43oJ59q8j45P2J82n1j22j14M6P1k0r2N3m3R4po7l9J07k6k6J38
$$ y = [22, 90, -19, -115, 24, 68, 22, 115, 55, 68, 15, 46, 6, 45, -37, 13, 23, -147, -73, -12, 73, -106, -28, 9, -217, 79, -19, 102, 80, -5, -109, -95, -11, -49, -8, 27, 128, -102, 49, 79, 105, 86, -138, 62, 79, 114, 47, -87, 24, 166, -51, -6, 49, -55, -116, 144, -18, -131, 44, -90, -182, 92, 145, 182, 98, 96, -11, -70, 44, 6, 36, 40, 74, -1, 62, 117, 30, 33, -215, 108, 238, -29, 26, 174, 131, -39, -37, 13, 6, 23, -85, -33, 39, -65, -117, -59, 49, -196, 35, -24, 108, 151, -124, 76, 53, -143, -78, 58, -33, 84, 24, -6, 101, -149, 36, 2, 8, 30, 140, 25, 66, 76, 121, 112, -77, 60, 2, -45, 64, -19, 53, -10, 35, 15, -12, -84, 53, 160, -104, -87, 173, 55, 59, 152, 8, 191, -99, 34, -19, -133, -301, 119, -74, -132, -4, -1, -75, 49, -121, -118, 42, 74, -14, 50, -76, 218, -91, 73, 186, 15, -5, -141, -14, -126, 50, -11, -28, 16, 104, -3, 38, -137, -118, 25, 19, 178, 90, -55, 17, 199, 148, 26, -88, -42, 29, 9, -83, -30, -73, 21, 14, -53, -92, 15, -11, -37, 101]
4539A01r1k3LL8p4J37o3O1K7l2l5j64K84j19j51J32J20j33p9j5L6J63j95J02o7
4564c7O6L0k8K9m6P8j39R5r1J20q8J48k50P8J11l07K33R7k00J35k13L43j10J5
4588F9j42J90m7j17k6j22K84m6mj21K0J01j04Q9p8N8j22K55j60NJ32p5N2l9jj48
4614i7MJ63r5k9p7J41MR4J3l7k25O9J14o7pL3o3Q1K83l19j40J22O7j45Q0j08J26
4641a5j39J65P1l0j60P5P0k1l7j21L3Q1J08m7j69J34M7j2n1N3j43J39Q7k20J52
4666E0k7q9n6K4J41J1j37qJ47O0j22r1M9P1q2J87j76p8R3Oj08P1R7J00k83K19
4692F9q7j25l5K74j11J6j26J23K8p3On4J05rr2n1K25l65L89r5m1J99j27Q2j63
4717c8q0J42k2n4l7J2J22o7J41j4j87N2N0J39j43k3m4J28j20J75l42M6J67j13
$$ y = [101, 10, -13, -10, 28, -46, 91, 28, 89, 116, 84, 49, -115, 169, 50, -101, 31, 151, 18, -61, -76, -40, 123, -72, 30, -37, 29, 59, 31, 60, 14, 92, -47, 48, -43, 77, -11, 137, -113, -35, 76, -231, 2, 99, -101, 34, -179, 164, 54, 69, -73, 117, 70, -47, -73, -195, 89, 43, 39, -82, -62, 39, -65, 24, -54, 4, -118, 137, -23, -18, 114, 39, 91, 52, 51, -97, -93, 70, -25, -54, -131, 10, 14, 108, 121, 84, -141, -72, 42, -25, -32, 1, -62, 19, 302, -17, -157, -35, 32, -113, -33, -141, -15, -154, 11, 82, 52, -108, -33, 37, 16, -21, -142, -109, -28, 80, 33, -136, -2, 45, 33, -18, 35, -108, 31, 118, -102, 50, 23, -66, -122, -98, 43, 54, -83, -91, 56, 116, -6, -97, -48, 23, -59, 128, -48, -126, -33, -27, -135, -64, 33, 133, -150, 69, -18, -143, -178, 96, -15, 1, -125, -2, 26, -47, -41, -95, 10, 1, -91, -142, 83, -282, 107, 12, -29, 170, 43, 125, -38, -118, 24, 2, -52, -89, -77, 45, -22, 119, 105, -82, -30, 20, 159, 16, -7, -51, 77, -43, 132, -210, -164, 3, -110]
4741a10K99j31pj51R3J31k46M4QJ26k05K29r0K95j34l03K86j86oJ60k24J55j53
4764a20L16k51O6J1n7QM1k0J52m6k65K33n8j95K5K48q7j07J42K1l2n4J2k8M6Q
4790Iq7K00n8k1j56J65K8j58O1J20R5l36J57J51j72j52J33R4j84N6N1k7J3J43
4814A25k01M1J41J24l60J62L2KK7r3O5j31n6J74j23O5j0N4q2m5P1j02J09j4m2
4839f7o0J93O4j31k24L05j47J9o3O4P2k10J18J17j45q1J68j6M2Jn8M8J63j87M
4864a1K6N6k45R9M4q9J42J1O1j71R2K6K0o3j43J40j03J60L5J4j54O7r2Q4p2J22
4890E6n1r1Q3l7M5mP2O2j53k0j53R5K21M7k30L8KK06j92L6j42MP1J66k72R7J9
4917b5j18M4J33J42j01j53Q1Pk2pQ4k96J20k1Q6j7m6O5j3j0R7M7k04J56j44J70
$$ y = [-110, 189, 58, 51, -100, -7, 124, -122, -78, -70, 56, -149, 80, -10, 285, 151, -152, 134, -52, -58, 102, -122, 33, -120, 196, -55, 11, 22, -35, -27, 14, -6, 146, 100, -165, 68, 10, -185, -160, 88, 1, -106, 36, 57, 25, -29, -17, -45, 1, 9, -78, 122, 64, 43, -113, 52, 80, -78, -17, 103, 198, -138, 19, 170, -2, -154, -21, 73, -111, -55, -4, -31, -18, 125, -76, -35, 106, 230, -130, 32, 64, 66, 93, 0, 65, -66, -122, 52, -71, -6, -16, 38, -44, -89, -18, -120, -11, -25, -67, -127, 66, 130, -1, -225, 80, -67, -48, -111, -47, 25, -185, -67, 50, -95, -176, -8, -24, 18, 19, -39, 9, 172, -15, -11, 15, 71, -174, -75, -31, -120, 22, 33, 94, -77, 15, 41, 61, -2, -145, -5, -108, 52, 87, 101, -53, 14, -78, 6, -66, 56, 5, -86, -3, -40, 5, 1, 73, 135, -18, -38, -191, -96, 125, 172, -58, -20, -18, 188, -4, 32, -110, -106, -35, 131, -141, -44, -25, -143, -99, 34, 176, 75, -78, 3, 10, -12, -19, 65, -231, -111, -132, -46, -63, -109, -44, -57, -67, 30, 77, -127, 29, -115, 55]
4943E5J44l5j09j6L0j59K04k02J9n0K43j93K41j77o5K71l07J95j05J45j63P4L3
4966G3r6o1O5Mj08K85r0j88K30j23J39m3r0j4J6%O2k3m1j26M7J40ok1j37K50k42
4993i8K45j40r6p9R2K08j65K76j13j49P7O8k37J62o8KR3k95K41k8k8j2q8R6Q1
5018D5J8%p4P2O9j14j52N7L4J08k2M1rj51J16p1J4J36j28O4k31J25j5n6L0M8J24
5045G8j6NN9k92j8J29J16l6k3Q1L2L1k59q6K09L9k51K4J59k7K0op0J62n6j06J83
5072H1M8k36M1K05k44J62q7k0J10J27m7k7j15J25n1m9mK3o4j09K41k02K83j77
5096A4L2J5k20K93k18J72j23l8Q2L8m8N1r2O7n6rO8M3K4j35O7j12J65mr4j58k5
5123b01J44K1J5k1oJ20M9j76Q0n9J0O1m9kJ58k84J10M4o6o1K05o3kj04J75j02
$$ y = [55, 199, 164, 55, 39, 69, -90, 114, -88, -69, -119, 124, -69, 172, -5, -70, 201, -106, 89, -16, 129, -34, 40, 73, -23, -84, -19, -15, -123, 162, 72, -116, 114, -9, 130, 87, -3, -17, -1, -1, 61, 38, -3, -129, -82, 58, 52, 31, -106, 144, -98, 147, 7, -89, -168, -76, 132, -33, 243, 130, -19, 58, 126, -111, 51, -17, -15, 78, -217, 24, -4, -32, -44, -132, -36, 45, 63, 63, -11, 61, 130, 16, -136, -79, -45, 63, 41, 82, 73, -78, 38, -33, -19, 117, -11, 53, -178, -53, -68, -124, -94, -46, 78, 62, 67, 126, -166, -184, -55, 61, 25, 2, 83, 115, 146, -113, -199, 10, 49, -202, -178, -19, -46, -26, -32, -102, 60, 4, -102, 81, 129, -107, -66, 139, -105, 57, -30, -50, 60, 187, 140, 113, -2, 123, 72, 23, 19, 42, -22, -131, 110, -92, 191, 14, 46, 61, -159, 134, -84, 88, -35, -73, 9, 47, -1, 50, -42, 25, -31, -40, 28, 71, 95, -40, 27, -85, 80, 76, -18, -176, -201, -57, -36, -21, -42, -48, 72, 121, -55, 25, -34, -24, 37, -12, -14, 144, -140, -30, 14, -52, -113, 92, 29, 27, -77, 98, -4]
5149dQ3p0K9J0m6k0Mm4LJ14p1m6O6kn2J06j05R1l0J2J28j39J49j31J1Kk55J97
5177a0l2K1K00n1q1j0J5N6j05M6o4M4r2J20o1J6K4j37K00q7j30K02P4j73qJ77
5203A54o8n2q2o2P7l6KlQ2O2j84J51jL3j02k25J38J34k0j8N6j80K10n3n0J33k48
5230a52J80m1M8q1J20Q6j79L5O6p1r9J48p3J16j65j0N9l5lN7J08o1m3K9j08MQ2
5257A7o5J7o9J16J16K5j63O0j98K41Pj85M3j0o5J31K0l0L3q3j1o4R3J75p7j10
5283c6K70k90R0K0k3l2O8N6jj09j56L66o4l26Q5q2K27J00j21j99Q8J61M8q4l2
5308B4M2K7l8nk18K11j26j6j6J31pk27J61l4K8o0J29L6R1j56M4r2J00L4k4J69
5334B08k32J90j60o7jJ09r2o0J60j18P6j33J42l9n2J49o2J13k69M01l32L7l9N7
$$ y = [-4, 79, 9, 38, 48, 2, -18, -14, -58, -55, 59, -12, -58, 8, 6, -46, 60, -45, 46, 16, 28, 156, 17, 166, 35, 46, 48, -207, -10, -42, -21, 179, 128, 47, 37, 52, 108, 3, 49, -15, 29, -63, 57, -4, 12, 36, -101, 99, 12, -118, 84, 158, -15, -23, 154, 86, 34, -48, -110, -33, -69, -67, -70, 12, 74, -110, 41, 40, 73, -29, -254, -116, 18, -2, -20, 36, -144, 66, 13, -37, 96, -152, 28, -13, 35, -46, 74, 160, -19, 16, 82, 11, -88, 60, -13, 103, -62, -72, -13, -48, -51, 6, 114, 53, 10, 39, -69, -65, 17, -48, -31, -100, 16, 132, 157, -6, 54, -144, 97, 104, -81, -38, -48, -113, 18, 38, 8, 41, -42, -53, -117, -24, 151, 74, -36, 234, -56, 34, 54, 31, -1, 67, 123, 122, 13, -143, 223, 159, -167, -82, -164, 63, 163, 42, -157, -69, 92, 140, 56, 24, 66, 93, 55, 50, -168, 43, -83, -99, -115, 16, 9, -218, -57, -91, -63, -123, 6, 42, 133, -23, 21, -71, 29, 63, 39, 208, -24, 166, 6, -61, -62, 47, -45, -105, 55, -63, 13, -120, 22, -17, -69, 80, 18, 131, -138, 263, -69, -32, -71, -14]
5358a4j13K16R9k91J49j38J38oP6r2j14k3O7O9J35n3L3l18L30j95J97k01pJ87
5382A31J7j52q6K5J50j01j29K34J30k03j13NJ92N3ol12J90j37Q3QK9J39j65O4
5406D6j31K03j70N2N8j52J16N4lq8mKK41k72P2k5n7Q9kM5j01p3PJ73j39K3p2L6
5434g2J38O2k23K27j27k05O2K08p7%P8l5J63l92Q8L2O7K6J49r8j56Q1j37J40Q9
5459H8r6K10k45L6O5j6P6j93L3J08M0o7m3j28J45O2K9j10p7j30O3J10K22o8k62
5484a48M7J8O2J40q3k3J39k16O7N8L8j2q9R8M3r5r7Q5K1L0j05m9r3K39J15j80
5510A0J56j36m8J28j38M1n9K0J26j00l8mj47K37j6n6j9J12m9mR6m5j21N5r8J00
5536Cn2r9N9pJ12j89J17j06J08J50k07K49j34j7k4R9L5j68L6R4Jq1k6Qn4m4J15
$$ y = [-14, -127, 89, 188, -103, 46, -92, 46, 40, 116, 24, -90, -113, -46, 23, 158, 105, 138, -180, 150, -45, 152, -49, -56, 131, 148, -4, -90, -65, 85, -16, -145, 89, 219, 16, -97, -92, 100, 153, 147, -165, 25, -112, -29, -21, 8, 147, -18, 46, -85, 118, -52, 0, 58, -94, 22, 76, 73, -15, -19, -17, 224, -48, 24, -1, -58, 31, 29, 74, -27, -100, -93, 80, -59, -36, -108, -72, 66, 128, -95, 132, 5, -200, -138, 70, -7, -7, 71, 36, 199, -193, -105, -73, -6, 20, 169, 71, -85, -4, -141, -1, 88, -8, 202, -43, -7, 58, 42, 118, -75, -42, 66, 106, 39, -4, -132, 13, 75, 104, -6, -83, -213, -150, -40, 182, 114, -148, -101, -83, -21, 119, 36, 13, 152, -64, 3, 61, 99, 87, -2, 96, 139, 44, -53, 32, 53, 83, -22, -71, -164, 75, 190, 10, 166, 30, -18, 110, -28, 13, -46, -26, 100, 0, -38, -42, -189, 48, 32, -24, -43, 69, 20, 16, 112, 67, -54, 1, -97, 3, -49, -148, -89, -96, 16, -173, -56, -162, -54, 96, -111, 138, 4, -13, -37, 62, 97, -71, -35, 59, 60, -21, -47, -39, -93, -137, -22]
5563b2N8j07q3K60j08jo9P6j74J16O1L3j3m7J8k0N7r7O1rj49L03j44RJ64j46N3
5590H0k05J04l4r9J53J15j28j7mm6o5J47l5O3j40J29l5JL1n4R4L6k05J63j49N8
5616d2N9P2r2n9J19q2O7n4J42k48O0L2m4N8r2J32qm6j13J88j47K62k49qj3mK57
5643A47l35K24n8L30k30Rj91N5R4m1N9k85J89m7M6O8k76J93O0M8q0ro0QJ0Mj0
5670g8J84j13k1J18j28K1J17j43K3j22J53J66l25J69m1J27j41J04r1J1J5r6J48
5693E7R7j94O4M1ll2l3K6m9L7oOk6q3J00o2j7K53j78L3M6k56J39O8k5J01j49K0
5721b5L7r5J52p0J56l13K19K0j06j32Q4m2Q5K10j58k4pK2j17NJ6jjJ82j00J39
5747A36k16P5Q3j00m3P4j1O1p3k6M5Q2n0k52J32M5o5J69j69J14j1R5r7J7lj01
$$ y = [-22, 36, -71, -154, 106, -2, -3, -72, 4, -170, -54, 7, 40, 27, -20, -2, -22, 35, -62, -1, -10, -159, 144, 0, 9, 173, 27, 80, -125, -21, -55, -154, -1, 114, -14, -31, -35, -81, -146, 1, -34, 29, -111, 18, -17, -16, 15, -39, 55, 91, -114, 49, -100, -42, 17, 89, -3, -62, 57, -25, 42, -12, 130, -118, -58, -26, -70, -12, -104, 28, 20, -26, -139, 49, -98, 164, -85, -93, -106, -110, 147, -188, 36, -22, 308, 78, 87, -104, -49, 45, 4, 63, -222, -33, -80, -34, 34, -242, -49, 11, 59, -21, -30, -90, -82, -72, -68, -78, 106, -7, -28, 90, -38, -17, 100, -43, -20, -142, 11, 177, -148, 21, -20, 107, -34, 70, -21, -10, 5, -91, 57, 154, -40, 24, 65, 62, 30, -3, 23, -26, 11, 5, 11, -15, -98, 2, -60, -77, 176, -2, 31, 77, -179, -40, 28, 3, 104, -45, -25, 12, -83, 69, -1, 155, -158, 61, 81, -25, -157, -73, -115, -30, 180, 22, -2, -9, 13, -104, -99, -83, -84, -85, 97, -3, 136, -80, -5, 78, -22, -65, 9, -2, 59, -14, -40, 5, 87, 37, -215, -83, -38, -103, 66, -103, 11, 0, 95, -2, 15, 12, -89]
5773h9J71j57K74l28n0R2J35K5j15P9j7P7J5j1k61J45Q7K0o3q7Kr4N4j9LJ29j11
5800i4L6K1k3Q9p4K5M5N9j10J99j68J50k39J7J34Nl4Q7m3l1M1j08K5m1K9J65l19
5827a57P6J95k86J75nj53K19m7J08j59J6J4J09j44K6LJj94K35j80M3j01M8K16
5851E8l9N8k72J81J03Pj43l8l5J05J70r1k5J25j95J2r7p0J48P5j8P7k01J70l09
5876b44J34J40K2j43J64R4rj6M7q4P1j20Pj44J78n6R9k35L8L5l7Q0pJ45j71Q4
5902G2j30P1K3j8l7M6l5m4J44L6j51l7K34j48j13r7J53jk6R7j34L8K03j29q1O7
5928Cn0NJ77j78QQ0QK5j2j54L0k5P9j45J58Kl1j2m0%P7L1j95J69nL8M2o0m2m5
5958f2l1Q9o4J6J04p6O7p0m9M5k1J03L4k05O4J43J8j70n6m1K33K4r9Kj1R6l8p1
$$ y = [-89, 82, -75, 199, -129, -179, -87, 48, 73, -42, 37, 20, 97, 112, 101, -160, -15, 72, 92, 29, -58, -56, -150, -96, -115, -112, 17, -94, -58, -37, -60, 29, -45, -20, 25, 84, -26, 173, 5, 155, -84, -67, 67, 72, 38, 125, 82, 51, 92, -16, 9, -32, -3, 162, -157, -81, 114, -172, 3, -2, -155, 64, 17, 125, -34, -18, -4, 105, -39, -13, -10, -9, -203, 32, -148, -105, -206, -158, 58, 19, 77, -195, -14, 89, 96, -47, -85, -120, -15, 155, 64, 39, 164, -31, -19, -116, -186, -38, 37, 19, 96, -105, 65, -244, -110, 30, 52, -91, 73, 167, 158, 142, 189, 105, 176, 56, 63, -81, 97, 41, 140, -95, -57, -22, -59, 21, 14, 159, -12, 72, -58, 13, 36, 18, -19, 27, -8, -52, 92, 128, -23, -60, 174, 26, -87, -184, -31, -32, -58, 39, -95, -57, 146, 17, -64, 3, -47, -42, 135, -43, -35, 45, 53, 78, 66, -88, -58, -83, -4, -149, 9, 11, -20, -32, -72, -72, 5, 36, -159, 10, 5, 43, 85, 25, -17, -62, -93, -4, -68, -52, 52, -24, 43, -27, -76, -31, -52, 51, 85, -120, -56, 87, 105, -65, -121, -162, 71, 95, -4, -2, -13, 83, 45, -26]
5986b6n1J99j15K1j48k2J7J0J77p0L4k04J17j07J30R0k31J71J13k95J30P7j16
6009i9J57m5p7M6Ll6J4J2p0J28M7J9k03J18p2J30k07K21J30j69n8Lj49J4K58k21
6035a06oj07J17K48q3M6q3j42n1K70o6j36K09r6J9r0j1J58K4j28J10k76L45j17
6059D8j55J6J97j48N5N6j4j10J33j01J7jJ21k8k9K2M4n4k8j25P1Pj0M3j65J69
6085C1l9O2n1j13l7K8J52j44L4J3L7J36j53K82k16k1L8M7j43n7K85q4j12J72l9
6110A08N4k20Km3N7k1N9J51k5j69L5Pj17O4o0K09l7Lj24O5j04K48Kj83j2l1K31
6137A49j34k35J78L1J97k42L4K4k6Kl4J8J02m9k09M9L02j80j2J35J18j88K3Q3
6161A36j48M8j15J13o1Kk0J90l8N9m5k35N9l1J33RO0j24J47j21j28R6J16Q8k33
$$ y = [-26, -77, 122, 7, 28, -120, -142, -125, -115, 62, -8, 26, -178, -61, -168, -38, 52, -179, -8, 105, -190, -60, 17, -99, 58, 13, -64, -18, -15, -51, -37, -25, -95, 33, 80, 99, -104, 14, -58, 72, -135, 86, 216, 47, -11, -8, -157, -143, 115, -106, -112, -219, -102, 146, 63, 109, 26, -116, -167, 103, 37, -99, 110, 14, 33, -57, -68, 90, 114, -14, 96, -180, 165, 48, -107, -91, 106, -42, 13, 69, 55, -55, 78, -23, -6, -7, 114, 86, 57, 79, 123, 69, 41, -84, -13, -6, -16, 27, -138, 31, -8, 54, 3, -110, -147, -119, 33, -111, -77, -64, -27, 109, -44, 238, 22, 1, 39, 86, -57, -114, 171, 87, -25, 147, 108, 162, -58, -56, -99, -42, -63, -4, 147, 122, -47, -12, -5, -122, -58, -118, 91, 54, 57, -67, -2, -106, 142, 144, -39, -51, -82, 149, 15, -220, -42, -11, 186, -56, -22, 2, -24, -22, -56, -38, 64, 15, -194, -145, 157, -23, -35, 100, 218, 30, 53, 136, -12, 36, -79, 34, -27, -25, -45, 145, 107, 166, 121, -114, -55, -86, 47, 56, 116, -8, 139, 18, -110, -14, 102, 190, -43]
6186d3j38K89j33j37K09j47J21j17J39K7j05R7o2j7l1J53p5%j4J86m38M28j22
6209G0j81O1M2p0r5J62K9Pj15r0J46J41j48l2JJ07K3q5P8n4L6r1N7j13j11K53
6235B8N8k71J87m4P0k00J94l0l2R8o8p4L1K5J03mo6Q1O2j29n7Jj1Q4m1R7N4k38
6263i2mR5n0J99j29n5M1M2q1J41j23J05o8j6j1J37j75R6p7J44j30m8J52n7j42
6288a06j07K94r2N5n7M5j8rl9l1p1K3J15q8J56j51k4J51m6j03K43l20K39k71P1
6313a41J59j40J95jj64J2J13n8O3j47J1j13J22J42j01j02K17M6l23K6K67P6j8
6336A41j20O5ro8O1k07k04L84J4J26k65R8o1R6j18P1j09J8J41j41J96j34q9J82
6360F8j34rQ6Kj15p0J29KJ1l9N1K4m7m5R6o8j3P2k8J01j54J64o7J07j39n3n6j1
$$ y = [-43, -181, 108, -25, -162, 47, -100, 21, -96, 43, 70, -35, 62, 0, -17, -48, 105, 30, 30, 16, 202, -236, 192, 70, -111, -50, -8, -78, -173, -11, 18, 25, -90, -180, -34, 107, -41, -73, -72, 35, 58, -27, 51, -3, 33, -58, -1, -114, -225, 28, 86, -185, 2, -42, 28, -172, 22, -8, -40, 58, -10, -84, -53, -28, 75, 71, 5, 86, 148, 19, -38, -37, -48, 36, -5, 92, 146, -92, -96, -1, -51, 148, 19, -36, 5, 47, -34, 107, -16, 89, 21, 5, -6, 131, -44, 52, -25, 119, -11, -59, 93, 36, -106, -213, 81, -11, 44, -13, 32, 14, 5, -34, -65, -136, -113, 2, -86, 70, -81, -105, 46, 0, -103, 140, -180, 59, -212, -141, 18, -122, 73, 72, -92, -80, 33, -25, 38, -109, -98, -211, -89, 53, -48, -150, 67, 113, -210, -184, 83, 159, 141, 21, 86, 77, 9, 70, -137, -341, 43, 57, 183, -82, 16, -45, 51, -67, 4, -105, -87, 54, -87, 109, -25, -114, 68, -66, -75, 11, 13, -102, -172, -43, -41, -30, -69, -18, 6, -41, -86, 10, -58, -71, 1, -27, 74, -80, 84, 17, 124, -15, -68, -124, -135]
6388a35Pn0K04k8q1J3K20k01m1O9N6O8l11K50o2P8j20J7j5LK1J19J6q0Rj88K2
6415a40k3J03R6K6Rn0r7M1j5K5l1J79p2j7o8J31j04J40k55K30k00n2J56k8mP1
6441E1N6M6Qk30J00J32j00O3j69Q4K7O5n0p9J37k9j5p1j47q3J35M4J98l00J37
6466A0J5j9M6j32o2J20K05j75j82J95J4j27J09q4J2q7j6J59j23Q7NJ09j18p6O7
6491d8K13j34L1M2K1k31J07j30J53j1l9J5O4ok14O1J62o3J49p2O1k37J36J08j23
6516A5k69L22j62J64j61M4M5Q5j75N7M5m8M2j8n5J20o3QJ25o9o7m9O7mr4J7J18
6543D0k35K01Nl8j69K13m9q8J40q1o8K60j20p9J87pO1j72k7MP9nj69J17J35j9
6569A16m4j66J49j56J43j17J43k09J64O4N1j47j05R4J46k09l9J76j5oj2l6o7J61
$$ y = [-135, -128, -178, 26, -2, -83, -70, 150, -51, -92, -23, 33, 101, -210, 40, -22, 56, -64, -47, -62, -59, -38, 81, 97, 17, 26, -162, -140, -163, -60, 36, 62, 71, 21, -76, -35, -50, -25, -56, 123, 51, 34, -34, 97, -7, 133, -122, 108, -92, -144, 12, -16, -20, 51, 107, 153, 161, -69, 31, 163, 63, 126, -43, 41, 68, 133, 83, 4, 141, 112, 97, 26, -121, -204, -69, -25, 173, -127, 10, 25, 6, 52, -80, -142, -22, 183, 8, -174, 21, 35, -92, 17, -67, -55, -142, -158, 1, -122, -35, -30, 79, -39, -115, -48, 165, 31, 62, 104, 125, -106, 1, -129, 24, 13, -26, -11, 53, 47, -167, -106, 56, -7, 142, 70, 131, -106, 30, 138, 15, -254, 68, -94, 70, -91, -47, -2, 83, -92, -35, 10, -38, 4, -14, -69, 51, -12, -4, 121, 52, -15, -64, 3, -1, -95, -78, 40, -195, 6, 11, -27, -196, 17, -32, -120, 20, -61, -129, 131, 11, -68, 119, 112, 173, 1, -26, -22, 57, 52, -117, 0, 135, 116, 72, -94, 55, -101, 42, -75, 68, -141, 23, 87, 138, -9, -114, -20, 126, -83, -122, 54, 39, 33, 21, -15, -82, 79]
6593G9k60K58j80J66j19J6o5O6l6J05j43J8K71r7m2j02O5J16j04L3L3j43L0L5
6617@P5j20o2o4K78n6L6r4p0K34J7k26J51j3o1P2j18P6j13J08k11K27J02k74M7
6642e9O0J70o3o9N9p5j10M4r4J31o0J72j20J35j42r0K14j33j30K45o5N8k2J32
6666A88j02o1k9n7PJ8J1O5P3k2Q0o7j65K13j27j44J57k15J52P1k6j31K93k02k0
6691d0k5j0P7J46l3j91n8K4J12J1M9J78q8k1o1L2j91J63r9M6P6j77K07j67L8J0
6717Hj27R4j4J52p5j14lN5j60J52Q1q5O5j03J48q0J0o9J56L5m2L1k78R7K9J6q5
6744a06J91l2j76jL8J34k13K92j43J2j2M1K3j49K35k06O6l7j31J46J03J7k28N8
6768g8O7N4K6L1m1J27k52J53j52m6K00o9K9J6p8O7k8L3qKQ1j53Oq2k8J22j15J17
$$ y = [79, -181, 77, -103, 63, -56, -40, -105, -39, -75, 30, -113, -95, 176, 79, 37, -65, 0, 116, 12, 45, 78, -65, -35, 0, 75, -45, -107, -171, 107, 51, 87, -7, -77, 157, 174, -52, 99, 86, 25, 97, -21, 55, -58, 50, -161, 66, 168, -106, -59, 1, 171, 108, 39, 98, 23, -87, -43, -137, -6, -66, 106, -14, 121, -21, -111, 103, -30, -160, 85, 20, 78, 56, 188, 86, 25, -4, -61, -54, -36, -25, 40, 113, 91, 171, 104, -61, 152, 25, -119, 38, -177, -25, 46, 20, -111, 182, -20, -40, -65, -75, 2, 148, 115, -76, -134, -110, 2, 13, 62, 240, 152, 131, 70, 102, -89, 74, -25, 21, 97, -80, 127, -40, -2, 8, -119, -25, -39, 113, 38, -76, -79, -24, -184, -32, 49, -36, 29, -74, 74, -6, 4, -65, 91, 126, 84, 115, -163, -66, -37, -21, -106, 85, 53, -123, -124, -86, 48, -165, 127, -16, -4, -16, 25, 48, -101, 134, -72, -6, -43, -174, -28, 75, 92, -136, -78, -11, 43, 69, 100, 59, 186, -66, 87, -65, -111, 89, 20, 49, 65, -13, 54, 26, 59, 51, 53, 134, -19, -13, -95, -123, -1, -116, 1]
6796AK1K0j25N9L9k8J19m9K6j05R0j26LJ70q2J85j26o6Q9p4l8J14j89l9J0N3J15
6823F7l0p5k2J68q8k3M3k21K85L8j1r7l8k7J8j11J39J8j3l6j09K23p9o2Q0J8R6
6850A51m7k1j60M4M6L4j39o7J47R5j27j14O4J39j30k2L2J50j74R0l9o0R1o4Q3
6875BJ80l04Q2R4j87J40L5j8k82R4K50o2j1N2K6P4k30K31j15L0l8j2j43J44J6
6900D8j97L8R6K22n2k76K0M8L6j63L2J93j32N3K6J5O0M6j8o7K7m7K01k30R6k1
6926E4k17J99j82Q5j01J55J74j78Q5Q6j59j9n8J32L7j31oQ6o6m0N8Q6j1j64R7
6951Bl1j45J56O3j02o4n5K11Q3j00J07j4k7j26N0n5K2RQ0L9j40R2r9R1j58J24
6977A3K0j10Q9Q6n4m6l1p1J91k40N7O9O4O1k77J60j4J02j29J2o%J19j77R3k2j58
$$ y = [1, 22, 42, -83, -24, 15, -13, 106, 57, 83, -22, 68, -58, -55, 115, 33, 218, 92, 26, 115, 41, 3, 117, -72, -111, -101, -48, 67, 37, -38, -60, 108, 20, -3, 40, -181, 104, 142, 131, 34, -4, -31, -13, -124, 15, 33, 20, -16, -125, 98, 19, -43, 37, 55, 151, 104, 83, -77, -33, 13, 47, -92, -159, -12, 83, -44, -158, -94, 45, -85, -107, -75, 75, -99, -9, -48, -108, -17, -81, 2, 182, -122, -40, 54, -133, 7, 42, 24, -258, -164, 86, 24, 13, 65, 91, 165, -65, 166, 51, 81, 43, 31, -112, 32, 48, -149, -111, -15, 207, 155, -121, -101, -53, -17, -180, -148, 45, -87, -34, -8, 7, 67, 113, 95, 28, 55, 8, 209, -21, 75, 54, -163, 36, -146, -61, -162, -7, 167, -11, 74, 160, 1, -18, -76, 56, 93, -38, -44, 42, -24, -64, -6, 80, 69, -95, 2, -29, -174, -18, 45, -57, -121, -176, 35, 118, 18, 125, 111, 84, -42, 8, -47, -25, -16, 64, 103, -37, 55, -44, 47, -111, 13, 33, -77, 12, 98, 44, -2, -33, -104, 87, -153, -96, -27, 37, 98, -179, -19, -33, 69, -60, -48, -54, -54, 65, -112, -19, -41, -199]
7004a99R4%J08j47J64j49J01N0J74k62J79n2K0k65K41pn1Mk11L38l5J2j78l1J33
7029C1q4J33Q1k11O3k7N7j84J98m9j0N1j99qK71j48J35lp1nn0L3rJ99l20J43j71
7056a54Q3J21N9o8r2J54o7p5mJ8QQ1O9k42J7J95j46r3OJ00M7j1o3L20k72M5K6
7083F2p0J23r8j11L3n1K20k61J73o1n8J19j2m5k0J60m8O4k49J06J2j08J27O3j58
7108h8J23M0j27P1J17j28L1j11J03Kk3J9o8P0j05Q0j46J60K8%j07N2K01j15j37
7133e8m0K34k08J13L0o5K36k47j34P3J01r3N0j03K36p3o1q3J28j19J42%r5j33
7157a69M2J81k10K33q5K0K1M8j0j07k6J52j9o8J70k91Q7J27P7k7j87J09m7J07
7181A28o5k1J28k20J08j81J71j20l8P8l9J32q8r2J19l7Qm6P5roK9K0P3O5j57l
$$ y = [-199, -105, -105, 3, -144, 20, -129, -28, 22, 196, -66, 113, 61, 81, -184, 57, 50, -1, 3, -208, 130, 95, 107, -71, -102, 31, -53, 80, 161, -50, 13, -14, 43, -141, 57, 8, -2, 49, -150, -158, 113, -35, 100, 97, 26, 21, -29, 4, -5, 194, -126, 17, -154, -71, 50, 109, 41, -51, 103, 36, -39, -43, -25, -17, 64, 133, -109, -92, 103, -43, -136, -130, -30, 17, 6, -57, 263, -9, 36, 62, -8, 115, 17, -94, -61, -112, 108, -153, 20, -41, -99, 20, 8, -37, -57, 103, 55, 119, -130, -24, -12, -120, 7, 70, -88, 35, 75, -52, 19, 136, 8, 39, -72, 31, 33, 10, 29, -39, 31, -74, 6, -140, 20, 48, 48, -59, -7, 194, 79, -58, -98, 136, -72, 41, 71, 6, 242, -5, -139, -66, 35, -58, -8, -111, 125, 52, -9, -92, 36, -83, 59, 59, -36, -169, -127, 54, -156, 77, -8, 12, 33, 81, 71, -36, -62, 90, 71, 3, 173, -118, -31, 96, 173, 146, -41, 68, 21, 128, 63, 42, 170, -50, 58, -123, 48, -72, -110, -32, -71, 61, -27, -119, 0, -37, -29, -75, 0, -9, -15, 14, 34, 107, 172, 15, 12]
7208A2rj39J37J15o6K1j51J50K7k03N7Q3j21l7J29Q0q4M9j57J97K7m5r1K1M2M6
7234I0j2j31J47j55N4m8Q2K19l08J72r9n4R2r3J76j36J2qJ19j84P9r3J98j42n3
7259g6K23r1K0m6L6jr3K3n6J9J18j07o7O0r6K03j7r4J15j99K14k1o4oJ0r6J27
7286C8j69N2p1J94o0J2j9Q8l5j77K37j37J05Nk1l3M5j14J09Nj84L36k55l7R6J55
7312A65r4o9Q3j12J48k46J30r2K3J18k21J54j02Q5m7J33j5j04J6Q0Rjj0jRR5j74
7339d0j57K59n5j28L7R3j04K01j29Om7J50j26l3j7L7MO1M8J6lk59K03K9q6K1o6
7366h5J14K2j21J6n8O6m7K18j47J94j13j81O9J3R5j68K3J79q5j2k8K11k52N7R6
7391G6M6r4p2J8M9J57j48J4L3Q2j98Q2j02m8R0j07K10r3P6k8mP3o4j77k4Q9L9
$$ y = [12, 3, -136, 1, 116, 50, 71, -80, 70, 97, -106, -49, 34, -87, -124, 5, 85, 1, 50, -107, 90, 117, 72, -19, 2, 44, 90, 78, -53, 94, -61, -7, -55, 27, 246, -62, 110, 11, -43, 49, -44, 132, -4, 8, 0, 119, -65, 14, -79, 119, -23, -76, 147, 56, 76, 30, 66, 65, -28, -5, -61, -42, 76, -31, -98, -38, -134, 69, 52, -42, 73, -126, 88, 67, 3, -3, 7, -89, 38, -131, -79, -150, 44, -16, -4, -23, 65, 30, -147, 90, -47, 58, 63, 42, 9, 54, -60, 49, 54, -130, 206, -49, -86, 10, 165, 71, 2, 85, -27, 121, -125, 5, -87, -64, 54, -167, -13, -115, -30, -77, 56, 41, -63, -47, 33, 42, 41, 31, 30, 39, 134, -40, -197, 62, 7, -121, -84, 9, -95, 106, -23, -17, -64, 86, -40, -73, -90, -53, -49, 12, 60, 76, 73, -186, 17, 46, -40, -19, -85, 29, 51, -70, -54, -112, -46, -93, 125, -22, 172, 59, -122, -53, -40, 55, -113, -90, 89, 4, -8, -36, 175, -77, -20, 76, 122, 28, -44, -26, 23, 180, 32, 46, 79, 161, -37, 45, -57, -105, -15, -122, 88, -5, 71, 43, 39, 112, 48, -129, -153, -64, -25]
7418b5J33j62J4J2K42l22J81Mq4q0K93l07J89J0k84J71p4N5J55j45J89j07k24
7441a66J38K53l11O0l4K50j48j79R7n6Q1j23M2K7J11J3J33k46nO5k67J18J91k3
7465B1k28J54J76j87j58L85j11K1j74p3K00j89J62N4j1k8J87l07R0l4J0L5m9l3
7489h7K4Q5J08p3j14n3Q4K2N7j72K7L4l2m3kP6J55j74K04j39L7j78J96m2j08J12
7515Dj9j21Q1j04J11P5L3K6j50J14j49J46j14J67n3m6r3M3L9q3OK07j95J63j57
7540f9J1J16J09k31J00J73j71j72O8K7J57o1l5j01j03K54K6J10k59l5R1j72K82
7563A15j77J00K6k46K31k53L85j32j2J28l4%p0k19O9qJ76oj7k55K65l7O2j30J01
7588F2J10lj32L0m9P6k97J71j00J33o8Q7M6n4j6J95j12k0q3rJ30o6j22J13j44
$$ y = [-25, 108, -54, -40, -28, 214, -108, 73, 77, -7, -87, 206, -101, 88, 98, -186, -15, -89, -34, 121, -24, 165, 58, -166, -28, 225, -86, -26, -60, 190, 42, -137, -40, -96, -15, -138, -96, -69, 42, 55, 188, -58, -63, 2, -265, -147, 44, 21, -207, -53, 123, -64, -222, 163, 52, 73, -101, -174, 26, -163, -1, 53, 42, 14, 201, -106, -16, -50, -40, -5, -54, -87, -63, 22, 130, 57, -57, -110, -26, -4, 53, -119, -92, -58, -90, -133, -135, -59, 96, -78, 126, -13, 24, -154, 42, 0, -108, 4, -15, -136, -55, -159, -48, 27, 60, 86, -64, 50, -99, 47, -67, 100, 47, 1, -92, -49, -10, -93, -87, 120, -75, 88, -69, -58, 58, 167, -64, 36, 209, 38, -134, -66, -39, 118, 57, 22, -79, -182, 72, 98, 208, -51, -86, 5, -167, 115, -62, 38, 64, -182, 49, -204, 181, 49, 37, 165, 131, 131, 61, -158, -89, -97, 79, 73, 56, -199, 66, 29, 91, -39, 62, 172, 169, 37, 67, 18, 94, -203, -32, -132, 1, -67, 20, 66, 12, -4, 191, 79, 59, -24, -33, 97, 31, -91, 22, -122]
7613a22J35j00J70r8o3o4J78J29p4j43J00j26J14N6n9P7o5p5n2K74k79Q7m0L6
7637dM6m1K29k59K1R8j47J08p4K06j94M1R6j01P2l0jj47Q1j42J4J62q6j02J47
7662gq9K27j70l1J72o8j8m4q0K77k83P1L9Q2j38n5J67q6J30j36K03j27m0l5j20
7687a59J52J46p2k01P2n3J08PRj25J37p3j70K84K5m4J00k52Q4J24j66J29j35l0
7711a03J02J23j60J23j40m4L5J82p6m9j18J42Qj49k3R0Q9M0p7J18j92o3J02j43
7735a83K03j84J12J26p5Rr5M1J10L7l0p8m3jj30J82j55K14j89O8j89J23K20n0
7759D3o0K00l4q0J31k71k5J52rR0j37L5J1k78K68K3J54j28j37LQ8N4p2j03O6m0
7785e6j10l9J75L2J06j07O6o8lk9N9M8Lj28k6J59k53J12J93j05Q9m7J49k90q0
$$ y = [-122, 13, -87, 83, -15, -78, -142, 36, 165, 91, -52, 48, -78, 36, 92, 33, 110, 45, -30, -82, 192, -87, 0, -40, -4, 42, 1, 230, -29, -8, 90, -57, 51, -23, 183, -11, 30, 126, 25, 97, 67, 66, -81, 0, -142, -128, 34, -52, -154, -7, -96, 131, -39, -70, 102, 34, 16, -28, -108, 169, -114, -43, -4, 78, -60, -115, 52, -34, 96, -40, 163, 36, -4, -39, -159, -7, 139, 67, -134, -62, -115, -7, 0, 9, -116, 21, -52, -222, 62, 87, 43, 143, -109, -25, 99, -67, 62, -73, -103, -1, 122, -38, 85, -55, -99, -64, 118, 42, -7, -125, 17, 25, -124, -147, -57, 32, 72, -5, 113, -79, -142, -40, -183, 20, -164, -52, 74, -1, 8, -87, -46, 64, 101, 71, -7, -50, -51, -181, 1, -154, 60, -129, -61, -250, -127, 93, 43, -17, 183, 149, 69, 200, -71, -96, 56, 47, 137, 0, 35, 46, -232, 36, 59, 213, 85, -52, -49, 39, 93, 21, -82, -16, -56, -166, -205, -30, 2, 108, 1, 67, -1, -4, -33, 26, 74, 77, -51, -77, 82, -171, -59, 134, 29, 118, 71, 220, -70, -150]
7810a50J78M5k5R1o9j6j05L5R8p4j8l7K3K8p3R2L8k6j35K62k90P4pm0O5l8K23
7837A49o4q6R1p8m0k25L10q1l9n3K41p0J4j88P5J53j59K36k46J52j75P6k18J30
7861i5K08j19K3o9j81K19L2p7o4J82m9K7J0j07P2j20L56k02o9m8k65K79K51k94
7885a00K43j00J65k80O9j04R9K18k44L0qQ5p3K39k04j40J55oj65J55n2k2N1p6
7909f5P6r2J64p0k2j79J14P5J19k29J22k4J05L9l16R7j09J74Pj02K64l13O2R7
7933fr3K3J87L5j70J9L9j30m8J79N9j41L8O9o5Jp9O8R1o3n4J06N1p7j01K15j88
7960c5l6K76k79L7J03N5K0J9l4j47M7m0k0J15j00RN4J0p5R3n7K17J7j65o2j3j27
7987a18p8K52j61K18r4Jj01Q6J17k20l1R1k6mL3j6R1J20j08j11j9J95j31p2J14
$$ y = [-150, 28, 73, 48, 139, 70, 54, -51, -16, 82, 8, -10, -47, -24, 4, -69, 23, 61, 35, -100, 162, -128, -54, -61, -101, -36, -74, 149, 85, -1, 90, 12, -28, -253, 57, -24, -63, -116, 125, 55, 69, -119, -44, 109, -50, 186, -60, 92, -83, -7, -225, -95, 113, -6, 17, -52, -233, -14, 18, -59, -123, 59, 10, 37, 47, -60, 12, -108, 248, 46, -23, -71, -336, -57, 194, -100, 143, 43, 208, -72, -3, -107, -8, 210, -34, -4, -12, 73, 0, 239, 35, -105, 50, 44, -121, 34, -18, -40, 11, -65, 11, -81, 83, 13, -9, -188, -74, 1, 120, -109, 13, -11, 94, 133, -183, -86, -195, -21, -14, -116, 148, -165, -103, -6, -99, -76, 111, 146, -24, -5, 34, -96, -144, 35, 94, -47, -9, 60, -5, -4, -83, -15, 76, 13, -41, 65, 116, 39, -62, 153, -35, -71, 205, -74, -37, 66, 121, 141, 160, 126, -21, 26, -14, -34, 81, -19, -10, 44, 54, -21, 72, 15, 232, 249, 84, 22, 9, -118, -196, 56, -105, 113, 19, 20, -81, 5, 122, -98, -129, -38, -64, -68, -35, -51, 40, 160, 52, -59, -78, 117, -14, -86, 28]
8012B8P8j65OM1M4l3J5J11J7j27Q6r4P2m6j9L3K4p8kJ08Q3p6J6l32K1J36K1L0
8040bJ43q0k46J92J49j44j06MK0J42p5J17j94J08n1J11k7q4j24Q6J77j49Rj2O5
8065B9ML5ml8j29o6K47j32J58n7j14O2k7M0j9Kr4Q9j00P1J24o9RJ20n0j36j88
8092b33J95K4N9j7j30J05j4j6j4n5R9%j14j5L15j15j48j3K70k4j41k13L41k60
8116a14j3j2J77N9j43N4rlj27K5J49k5j78L1L8Q3p1J70j64J76j95J08j44J38j89
8141a79J2J86p7J33p4k7J40k38J28J6R1r4R2j83J66j32rp1K1j09K74k9q7M4M1
8166C5Kj44J30n7K07k41K92j06%j51L8P3n4ok7k6P0j55K98o2pp8j92K27m4
$$ y = [28, 106, -59, -53, -12, 32, -1, 14, 125, 142, 15, 101, 7, 79, 33, 14, 47, 71, -7, -9, 99, 182, 106, 122, -210, -189, -53, -32, -2, 141, 61, -185, 7, 156, 12, -94, -90, -70, 72, -3, 114, -80, 28, -23, 88, 61, -23, -147, -61, 116, -33, -24, -36, 29, 33, 68, 64, 26, -103, -169, 78, -54, 104, 47, -67, -5, -32, 8, -11, -9, -103, -14, -114, -43, 81, 12, 21, 141, 91, -45, -233, -38, -14, 45, 28, -102, 3, -11, -27, -41, -96, 3, 3, -111, -126, 189, 74, -74, -87, 183, 159, 18, -195, 146, -114, -127, -139, 38, 97, -46, 8, -1, -4, -131, -106, 43, 18, -160, -129, -91, -8, -79, 91, -73, 103, -92, 16, -128, 10, -179, -167, 19, -58, 75, 1, -26, 114, -124, 4, 20, 111, 17, 109, -74, 92, -40, -49, -120, -99, -208, 66, 37, -50, -6, 35, 37, -107, 23, -34, 173, -68, 224, 118, 118, -33, 5, 78, 24, 18, -9, -35, 35, -120, 178, 116, 109, 31, -161, 66, 22]
8191B2
$$ Imaginary data points
##PAGE= N=2
##DATA TABLE= (X++(I..I)), XYDATA
0@%%%%%%%%%%%qJ6j6J6k4L2m0M8n6P0p8Q8j10J34j52J76k08K40k73L13l60M09
33B17m65N28n95O68p50Q41r38J044j163J291j429J582j749J930k128K345k585
50a356K848l136L456l813M211m658N165n743O411p192Q124r256J0664j2472J4889
65H142j8308K3550l2688N3118j83014M7410K47142k45077l067K18547k6816j84432
77i5493J26184R0909j40606l3952J54132k3127r4333K9990J2058p0651M2558M8563
89D6232o5483k0432O2107m9653o4127N9566L5465m2900N1915O1116n8700j7473
101b367O0785p0142r1033Q9773O1277r2183K0821J07551p5174q1403J31027M5682
113A04614j46973J1045J39264o6432j12213P4193J3056j17754M5633J18139p9875
$$ y = [0, 0, 0, 0, 0, 0, 0, 0, 0, 0, 0, 0, -8, 8, -8, 8, -16, 16, -24, 24, -32, 38, -40, 48, -62, 72, -80, 96, -112, 128, -145, 168, -192, 217, -248, 280, -315, 353, -397, 444, -494, 550, -613, 678, -751, 831, -918, 1012, -1116, 1229, -1356, 1492, -1644, 1812, -2001, 2210, -2448, 2717, -3026, 3385, -3807, 4317, -4939, 5725, -6747, 8142, -10166, 13384, -19304, 33814, -149200, -101790, 145352, -99725, -102792, 115755, 88939, -95493, 30691, 121600, -19006, -52958, 101174, 78047, -16286, 13704, 25762, -44889, -2331, 46232, -19251, -39683, 22424, -27229, -91356, -31790, 3675, -39225, 12690, 73806, 15106, -2367, 58418, -11724, -102757, -12984, 48293, -43890, -23069, 84482, 9308, -72095, 58932, 104614, -42359, -31314, 107950, 41518, -70695, 3498, 16554, -101200, -55567, 62572, -17303]
124a7303p3134J04446J5760j04400M1050Q5222o4058j0931J15956j2529r9250
135a9171M0956M5827q1618j2092P2702m0012o1279N6681M764q5767K8109P8755
147B7855m8548l0984Q6555R572p4758K7480M7724n6388j3191P0303j4947n8026
159b7353L2080J5922n1910J8313M6169m5901j2388P7538j6314q2812L9709N2031
171D5084p3755j8387Q9894j8928q5307M7947N4709p7246k4425Q2588m003n6878
183c8707M6046L8991n4336l71N7193k4622l5647M6137N463o0475O772L1219m6347
196b8684k1313N3335k209m1960L2073L0884m2242m561M5691j4167k5145M1963
208B3665J1702m6171J1765L6448l7423k3722M5977q26m9262J9754L2622m1661
$$ y = [-17303, -90437, 14009, 29769, -74631, -33581, 51641, -12417, -23348, 92608, 80079, -19171, 21785, 67612, -14006, -26098, 46604, 6592, -54687, 1994, 6758, -79009, -50900, 27855, -20693, -51677, 34878, 44450, -30308, -2828, 44896, -11492, -24683, 45620, 30673, -27353, 4727, 20649, -31261, -12948, 33221, -12680, -25068, 52470, 36156, -46656, -6947, 45084, -28671, -47058, 42836, 23908, -61399, -13452, 41257, -35989, -60414, 22174, 18171, -38707, 7339, 46330, -8006, -8377, 48816, 24194, -11453, 34684, 40147, -20328, -13556, 17663, -28684, -49997, 3338, 1129, -40831, -8758, 22126, -20116, -24677, 21014, 6847, -18298, 23665, 35367, -10804, 961, 37409, -14, -23736, 22241, 21415, -27847, -8093, 24529, -17132]
220a7132j8169M7216l38l6269K5068K6614l5111r001L1075j4937k3919K9426J0808
233A5331l0218R939K5695k4847j2196L3607j798k8055K2338J9708l5959q553L2338
246A7330j4673l0659K6947J8141l4656k837L3535j3161k6904K4966J8450k3880
258g401k9K5042q600j6332J4131N533j3187N651Q224j3425l511Q435j2681j0775
272a8925J6442M005j5048J0225J6932j4736q702J9169r68j9085R921J5388j5705
285a087p657J7972k044j6917R968J3277j4659p917J2399k965j4146N400R513m786
299c649M69J0522N60m932J384j212n565K453K754m754K2N087k783l435M534L51
315A806n892J309L942m586l727M351J347k643N165P422k214l997K547O51o100
$$ y = [-17132, -35301, 11915, 11577, -24692, 376, 26990, -8121, -17122, 13953, -984, -24903, 4523, 15331, -14887, -4948, 20747, -4100, -16296, 17311, 15513, -12542, 9796, 29504, -6455, -15008, 17330, 2657, -28002, -1055, 17086, -17570, -20407, 13128, -33, -26937, -1971, 16479, -7401, -7430, 17612, 9012, -7320, 6811, 12344, -843, 4808, 13032, -393, -3904, 4531, -8150, -18925, -2483, 1522, -13526, -3301, 13631, -1105, -9807, 9362, 8394, -10691, -770, 14618, -1087, -8744, 9228, 7184, -9733, 235, 13512, -1147, -9064, 3335, 370, -13776, -8376, 1137, -3649, -3180, 7342, 7902, 2970, 4354, 3142, -2423, 30, 2784, -1970, -1948, 3139, 356, -3079, 1455, 1806, -4086, -2777, 1165, -3421, -7148, -2797, -1450, -4093, 1072, 8494, 6280, 2283, 4830, 5481, -619]
330f19m179K941K260l009r57O234J720o421j757P308M70p779K32N991l448n440
346f453M237L696l692J36M447o24k001J66j439o0M620R29k018L807K435o298j025
363H63M945n759q152N721K201r865Q12R248n800o102J3096N964j1512L049J4050
378A2759o755r098J1665L774j3569P15J0103q388q675P885q24r800N766O671r004
393f775O4J1138n046o598J1960K118j3345N295J1974j2017p398J5232j475j6026
407a0899R359J2912j5267m387J9682k710j6284J1985J1072j7957m318J5918q003
420A103j5923J1088N714j6108K936J4752r261n792J7335J403j2929J1255J1254
433A6827j5062j646J7334q465j5279J4456M103k3341J306J7784j5840j4946K1242
$$ y = [-619, -4798, -1857, 403, -2606, -3563, 2671, 4391, -2030, -3787, 3521, 3991, -3788, -3556, 2435, -1013, -6453, -2216, 1480, -2212, -2076, 2371, 1747, -254, -88, -1527, -1587, 3033, 3962, 1944, 5751, 8186, 1888, 863, 5808, 49, -8103, -2382, -181, -10046, -9234, 14, -5786, -11888, 1208, 7172, -4340, -1291, 12759, 6004, -3094, 8571, 12345, -1224, -509, 9594, 1206, -7469, 416, -408, -10208, -4442, 2229, -6775, -6711, 4427, -619, -7217, 4743, 6861, -6484, -1189, 10785, -1232, -8630, 6602, 5127, -10899, -1540, 11372, -3895, -8282, 11400, 8690, -7594, 4391, 15463, -2494, -6812, 9106, 1103, -14820, -3732, 1982, -14126, -11190, 3562, -5699, -11491, 5844, 7247, -5682, 5573, 16827, 1765, 119, 17453, 8988, -6291, 8165, 12268, -11073, -9767, 8017, -7823, -22769, -1527]
446a527N299k1869R140K2144j5139j0206K4117K222k2018R277J6161j8019p924
459h342J8887n417j6949J4400Q962j9137J451J8314j2691j2580J8695J882k0639
472a3164R439J5873j9665p912K2861m328k0599J5964J3691k1142O7K5518r723
485F880j8331K2021J1411k4754J184K0890j5477j7621J8183Q35k4175P508J8046
498F600j7734q051K2529j691j6794J7428J3525k0868J429K4468j1741j9027J9641
511I714P172k4249M153J9012j9341j3802K3877j47k6484J1631K1203j9254p681
524a4196K4971m536k1277J7440J4289k3956l511K3358q624j7927J6662O094j9506
537a0719Q870J9463j7636j0559K3500j089k3130J1160J3851k1444l798K2926j0957
$$ y = [-1527, 3772, -18097, -8957, 13187, -1952, -12158, 11959, 14181, -7837, 1440, 17601, -418, -8342, 10545, 5128, -11821, 2579, 11541, -7596, -6145, 12169, -522, -13102, 5593, 7475, -13164, -3725, 12148, -7517, -15429, 7432, 3104, -17495, -1531, 12160, -8982, -8915, 16603, 6880, -11451, 10570, 21981, -2773, -1589, 19301, 3824, -13797, 4386, 5221, -18954, -11446, 6600, -11134, -19185, 3344, 1653, -15141, 2287, 15812, -5056, -3627, 20841, 9100, -9927, 9714, 16886, -7363, -3210, 15802, -3539, -17341, 6536, 6389, -20095, -8464, 12739, -6515, -14196, 10775, 6239, -15038, 2402, 16691, -7265, -10776, 12582, 3958, -13969, 2693, 8787, -10719, -1849, 17614, -22, -10581, 12919, 11830, -11300, -140, 13711, -7733, -11531, 11395, 438]
550D38k1863J9458J3063k4174M7K4181j0778j4567K2523N607k4283Q792K4044
563B2488j6794j5220K0426N44k2291Q572J2585k0480m403K2951o555j9178J5566
576a789J1091j8373L510J9205j4199j2013K2564K119k4868Q046J9768j6205q987
589a0131K0567l963k0120J5228J3786k2450m416K4021o091j8577J4667P623k0576
602a0432K953J9385j3919j4469J9216M599j9391O525J5469j3241l362K0118m972
615H479j8004J4148J1889k0104l320J7879r025j4519J6073L822k1568M831J9767
628A0348j2544j2689J8685L229j7261Q697J4247j6031m928K0395k661j8181R956
641A262J0382j5818j954J4641q478j1874J5555M068j7847M395J5061j1130p580
$$ y = [438, -21425, -1967, 11096, -13078, -13031, 11150, 372, -14195, 8328, 13935, -10348, -1556, 22488, 5694, -9526, 10900, 11444, -10847, -2275, 10310, -10170, -14573, 8378, 1823, -17355, -1789, 9302, -9071, -5561, 13644, -555, -12568, 9996, 12115, -12753, -4707, 15061, -1144, -10131, 10436, 6473, -13647, 1581, 15367, -7083, -11499, 12522, 6431, -12146, 2521, 10144, -10432, -7479, 11906, -2013, -16482, 2734, 7333, -12058, -5533, 9936, -3305, -6667, 13451, 8479, -9525, 4623, 16512, -3592, -6912, 10967, 1942, -12577, 3496, 7318, -14250, -9419, 10348, -2196, -14885, 3800, 7029, -10232, -1535, 12712, -3319, -8247, 12148, 9487, -8694, 1262, 11644, -4174, -6128, 8513, 35, -11839, 3716, 7784, -10063, -5668, 9393, -1737, -9317]
654i317J5957j590j5927J0067J1579j5836m555J8136l254j4319J1218Q144j5791
667e488O46J5805q986j2026J3881N092j5904K300J2662r963o995J3576o60j3620
681i680P378J0050j1885k710J3271l982r447J1253M527j3909J876J3006q922r554
695h728J2598K133j3834M753J0713j0607n440J3721j056j2483P406Q455j0987
708c356k121J1775l970r481R219N390j1607N37J0088o160o733Q866J165r813M619
723a582P633q414l122J0664k329q799P147N524j0135o23J0017m640p929Q231L849
738E492r713J281Q602n939n629Q401R43q808L480P311o752k998Q135r81o844M730
754G11L988o701m40O484l669m953O150J423p026K636O067n735k974P080l48p016
$$ y = [-9317, 6640, 5050, -10877, -810, 10769, -5067, -9622, 8514, 5260, -9059, 2159, 10303, -5488, -4842, 10963, 1977, -10049, 3832, 8924, -6980, -4680, 7982, -1981, -8976, 4600, 3940, -9680, -2302, 7748, -4137, -6847, 6424, 2442, -7005, 4248, 8775, -5134, -3258, 9748, 826, -8728, 3870, 6003, -7831, -3078, 7635, -2972, -8412, 5309, 4253, -8230, -824, 7631, -3356, -5477, 6298, 2328, -7153, 2066, 7456, -4151, -3614, 6474, 314, -6419, 2447, 3612, -6201, -1582, 6051, -2363, -5485, 5179, 2850, -5949, 1198, 6722, -3413, -4036, 5981, 1341, -6588, 1643, 5492, -4221, -2940, 5662, -277, -5906, 2495, 3438, -5370, -1890, 5421, -1331, -4329, 3806, 2825, -4019, 711, 4699, -2002, -2442, 4042, 373, -4580, 1570, 2993, -4033, -1397, 4670, -1065, -4039, 3041, 2693, -4323]
770d323L693N069n786j975O603j408n745L924L422n671l53N531k437m006M371
785I09J890m905J280M530l153k608M161l43m334J939K348l605n17L857j584l248
801c383L546J730l852J008M007k229k630L583P96l666P05K833k307j715K626k53
817G99k589Q84J767j995m67K330l57j577J299Q90j551J67J203n28r09R06k21j068
835a017Q11Q90q86J65J496k85j127O28P83j282o54O82q5j107k84K07j46o11N19
854a303N60J36J07N65Q78k87p8J113L52q34M72N85j493r43M84m71j547k7R24j029
874a836l94J350J16o46J385O85p15O33J420j406q91J928k11k002J002J593k269
891b58j162K587o94k560J843J567k568l41K822j137k493K383J357k960n4L058
$$ y = [-4323, -630, 4439, -1347, -3322, 3281, 1873, -3872, 52, 3474, -2197, -2550, 2981, 544, -3462, 909, 2799, -2106, -826, 3704, 551, -2057, 2104, 1761, -2573, -634, 1714, -1891, -2408, 1449, -135, -3383, 163, 1893, -1959, -951, 3056, 827, -1803, 1780, 2576, -1090, -385, 2448, 141, -1574, 1052, 799, -1790, -906, 861, -1134, -1601, 729, 372, -1205, 94, 984, -567, -400, 803, 275, -634, 272, 51, -1017, -206, 684, -202, -37, 1459, 1174, 47, 675, 1458, 176, -478, 204, 119, -988, -1272, -1065, -1211, -1822, -1303, -743, -607, -500, 65, 943, 656, 578, 1691, 2043, 1209, 1681, 2266, 773, -170, 314, -157, -1704, -1731, -807, -1836, -2230, -880, -764, -1410, -25, 660, -55, 578, 1998, 592, -299, 1629, 1418, -584, 418, 2011, -258, -1420, 1167, 473, -2087, -244, 1323, -1245, -1586, 1236, 99, -2394, -11, 1346, -1614, -1668, 1390]
907A390j652k176L112R30k736J407K779k036j145K839o44l367K011J409l725m28
923b032L159k071l099L539J181l858J100M427k487k263M618N82m230K069L585
938D220l856j749M438j217m698K595K581m562p86M696j726l432L759J946m469
953b260J147M139l067k356M601k66n048K544L653m587j256N636j445m721L891
968F05K956n034j66N555k891m170M642J216n951J406M649m090k859N217L20n651
984d246L235M051m416j123O273j444m738M295K263n778J84N354m022l587N409
999A710M74o375K042N319m606k576O106k69n843L828M067n537j072O275j836m948
1015c241M371K424n883O42N833l884l941N683J200o268K008M750m615k260N853
$$ y = [1390, -262, -2438, 674, 1604, -1132, 275, 3054, 1018, -127, 2712, 2068, -1299, 712, 2121, -1604, -2032, 1127, -944, -4043, -504, 677, -3181, -2081, 2346, -141, -2404, 2214, 2796, -1434, 635, 4220, 364, -1385, 3053, 1836, -2862, -267, 2314, -2248, -3034, 1662, -64, -3496, 263, 2209, -2260, -1113, 3026, -41, -2397, 2204, 1938, -3110, -566, 3087, -1500, -2756, 2880, 1435, -3286, 605, 3561, -1473, -1639, 3916, 1025, -3145, 1497, 2713, -3238, -1832, 2817, -1273, -4132, 1085, 1405, -4246, -1011, 3040, -1376, -2499, 3774, 2330, -2408, 1887, 4150, -1628, -1444, 3910, -112, -3699, 1710, 2184, -4191, -2149, 3170, -1436, -4012, 2094, 1825, -4018, -190, 3877, -1660, -2732, 3543, 1707, -3241, 1130, 3554, -2329, -1687, 4146, 262, -3679, 2004, 3204, -3064, -1056, 3694, -921, -3181, 2672]
1030B672j316n814M175L561o283m47O652k667m447N688K129o635J579O182m068
1045I61m265O041N88o411K465M358n457k299O541j369o081M063M149n751m36O203
1061C300k719m078N585J936o522J473N476m237l406N843l82o150L406M624o240
1076b091j692O522j221n608M248L075n774L17O149l625m311N554K093o284J121
1091a527N363m348k642N725m10o108L629M396n541j748N982j634m724M520K251
1106C184o190R72N927l745m128N531J409n695J720M820m600k594O282o82n750
1121c539K977M103m971j185N546k270m545N073K284o111L60N680l024l574M582
1136A386Q69n242K303M243m652k036N627n97n152L203K979n107J8N480k787m371
$$ y = [2672, 1356, -4458, -283, 3278, -3005, -3452, 3200, 533, -3914, 1774, 3903, -2732, -1153, 5029, 961, -3304, 2737, 3325, -3086, -621, 3737, -1720, -4019, 2522, 1153, -4928, -865, 3284, -2467, -2903, 3300, 581, -3497, 2088, 4024, -2498, -1025, 4451, 214, -3192, 2651, 2269, -3881, -475, 4149, -2091, -3783, 2739, 1518, -4090, 158, 3233, -2541, -2224, 3925, 300, -4011, 1543, 3636, -2648, -1527, 3836, -512, -3154, 2571, 2161, -3947, -318, 4078, -1463, -3211, 2771, 1137, -3587, 933, 3184, -3006, -2034, 3893, 148, -3980, 1551, 2960, -2735, -1015, 3805, -795, -3389, 2893, 2211, -3539, -562, 3541, -1430, -2615, 2931, 661, -3884, 1189, 3473, -2638, -2278, 3402, 378, -3196, 1386, 2255, -2987, -684, 3559, -1093, -3129, 2498, 1901, -3251, -48, 2931, -2176, -2158, 3322, 535, -3836]
1152c836N027K006n449P27M586l133k755M891J86n228K343L987m130j849M711
1167B084q66m236L344K375m698k31N073k210l687L934J708m601J195L815l342
1182c43k303M922q9n073K414L453l887j594M528j100l984L366K573m513j79M408
1198B599j988l144L672J049m281J259L678l386k271M266J37m181K179K774l517
1213a155p02M197j449l089L238J401l874K04L631k411k634L709M95l969J126L357
1229B075k605j830L594Nl193J895K498l234n51L425j230k739K573J328l268M2
1245a215L064k003j979K930M81l201J168K450k096j100K961l70k855J817J622
1260A674k463n87L049j019k267K223J005k544O6K734j529j908K469J95k426Q21
$$ y = [-3836, 1191, 3197, -2252, -1525, 3061, -72, -2827, 2064, 2250, -2978, -635, 3352, -778, -2627, 2084, 1218, -3018, 326, 2701, -1997, -2228, 2845, 635, -3052, 882, 2590, -2011, -816, 2999, -343, -2646, 2276, 2187, -2886, -472, 2981, -906, -2500, 2028, 928, -3056, 310, 2883, -1630, -1809, 2599, 611, -2533, 1139, 2188, -2093, -834, 2844, -542, -2813, 1453, 1590, -2591, -412, 2362, -1155, -1857, 2340, 891, -2198, 1040, 2441, -1433, -1229, 2402, -9, -2643, 1066, 1561, -2408, -1282, 2075, -530, -2360, 1234, 1239, -1954, -59, 2439, -795, -1346, 2079, 849, -1890, 683, 2011, -1257, -1215, 1849, -154, -2133, 797, 1278, -1923, -755, 1695, -401, -1501, 1460, 1090, -1765, 52, 1674, -789, -1376, 1673, 654, -1613, 610, 1615, -929, -863, 1871, 342, -1566, 903, 1098, -1328, -507]
1276e07J850j998j083K421k90k348J687J387j847k45K358o48j629K022M63j928
1292c35K98J533j343j333K000l37j912O14J529j511o80J733q2j505J171J091j120
1309a89q9J432n36r52R99L88j530L62J020q56r24J140R7j339N04R02p74l80R97
1328B72pr25O04P12j214k5J087n38q08Q08M95p54J09R13m08m15N72Ko92N96Q3
1349D67n58l77N40l55l86L27K74m22j22N56m4j35M07K50k70R8K33j60k18K40o1
1370B84j88k67J27k15J10k9J03k32R7J53J23j33k07M56q0m52K59M00m49j83J65
1391a58J99l89N30P9k25PL06r6m35L86L15o04l0M26k22q28N50J34m56r4N57j94
1413b42j76O31K06r13N13R11n81m83P07J47j219L32O47n37o28R59k66p92O29K70
$$ y = [-507, 1343, -655, -1738, 683, 393, -1955, -268, 1119, -728, -973, 1385, 737, -892, 1130, 1593, -335, -37, 1496, 153, -1180, 820, 483, -1429, -815, 714, -797, -1477, 256, 174, -1331, -160, 931, -189, -278, 1154, 618, -334, 665, 1053, -477, -115, 905, 49, -875, 265, 362, -977, -473, 429, -345, -725, 272, 265, -660, -56, 656, -558, -583, 504, -34, -842, -34, 461, -293, -184, 729, 321, -94, 478, 480, -212, 384, 467, -91, -468, 72, -283, -669, -342, -68, -490, -612, -56, -100, -235, 172, 422, 152, 250, 483, 323, 105, 345, 284, 96, -171, -44, -259, -149, -178, -75, -307, -210, -57, 66, -67, -274, 182, 102, -350, -91, 309, -140, -323, -158, 41, -348, 182, 261, 36, 43, 349, 253, -182, 204, 519, -85, -115, 311, 89, -739, -189, -55, -511, -605, -48, -242, -418, 213, 419, -494, 19, 930, 349, -134, 573, 720, -499, -167, 480, -57, -685, 274, 8, -784, -155, 115]
1433A15p24N2J076n43p64J253N7r08L35R97q62n31J095j77j107P76M70j025k40
1452f55J317n26j073J084N60j537J72J354q13r39J267M56j418N54R03q26n16J269
1470F33J4j252O79R77j325m45J613o77j486J432O23j749N6J705q84j064J600J29
1488E79j433O60J370j212q17J834l41j521J020J139j725m70J855p43j394J226
1504B7Q10j648L46J409j177r25J981N6j933Q00J473j338p81J744l14j684J262
1521A08J047j757r6J620n86j516J325P93j837M60J611j127j321K047M6j893J014
1538f2J324j358q63J942n73j551J253R66j786j43J778q23j244J653N17k057N40
1555d87J581j332q57J962L5k028R88J379j774m80J903k94k103J769Q82j961J8
$$ y = [115, -609, -557, 519, -24, -788, 465, 522, -386, -51, 946, 84, -447, 648, 471, -636, 140, 610, -415, -655, 662, 136, -937, 147, 707, -830, -658, 696, -117, -1056, 211, 667, -751, -197, 706, -120, -636, 633, 647, -605, 74, 1051, -274, -719, 894, 217, -1269, 163, 786, -963, -907, 798, -86, -1150, 450, 579, -854, -194, 1176, -36, -853, 981, 640, -881, 139, 1278, -447, -917, 938, 195, -1199, 27, 837, -811, -465, 944, -233, -1158, 823, 879, -1054, -254, 1219, -119, -900, 844, 530, -1154, 108, 1155, -602, -698, 922, 336, -1180, 145, 938, -899, -439, 1172, 45, -1276, 771, 817, -1076, -62, 1262, -96, -959, 983, 410, -1141, 112, 1078, -708, -851, 927, 104, -1140, 513, 1030, -1027, -487, 1094, -238, -1095, 867, 902, -1126, -138, 1241, -533, -1013, 890, 596, -1507, 262, 1144, -817, -799]
1572g99K016j055j219J564M02j956Q34J414j503q13J856K8k079J239J157j600
1588e14m07K045p02j791J572Q11j775J25J618j093j250K087M6j956P16J837j858
1605d89n54K114l94j831J255J206j949k79K055q23j550J541O13j918L36J786j117
1622Bj052J807K00k132Q54J540j447o38J720l61j648J136J130j802j42J860q69
1639A58j473J764N27j725K47J831j397r88J748K75j843O88J271j576l52J495l64
1656B86j469J108R76j461j60J723r73q87J684K66j728K35J636j162q34J441k10
1673D71j624J049J185j652m42J764l71j454J204Q20j732P0J779q59j125J283O52
1690A018j660M56J228j111p25J455K4j725J139Q11j395j57J379n35j044P54P85
$$ y = [-799, 1217, 162, -1057, 507, 909, -1047, -213, 1201, -302, -1115, 741, 769, -1310, -71, 1086, -514, -921, 1124, 422, -1369, 203, 1014, -761, -636, 982, -111, -1361, 726, 772, -1184, -468, 1369, -489, -1043, 1071, 677, -1154, 101, 1307, -642, -921, 1134, 311, -1239, 302, 915, -1003, -667, 1119, 2, -1050, 757, 957, -1175, -321, 1219, -228, -866, 854, 493, -1155, -19, 1111, -691, -833, 1027, 158, -1315, 449, 976, -749, -502, 1329, -68, -1056, 692, 967, -876, -188, 1083, -493, -845, 650, 286, -1183, -75, 901, -560, -720, 1003, 30, -857, 827, 1093, -635, -400, 1236, 74, -760, 681, 471, -1153, -104, 1081, -571, -1013, 751, 380, -1074, 130, 950, -782, -712, 1067, 208, -917, 366, 1018, -642, -186, 1042, -69, -794, 661, 685, -1040, 99, 910, -485, -642, 737, 202, -842, -88, 697]
1707F97j418J0J495q68p90J342K42j391O62J181j116o88J531k21j397O93Q41j344
1725e39j30J246n67q92J046L75j267K54J228p63q62J369J24j289O75Q88r62l89
1743d55Q57K7j176P99N56j223O3J091o30o87R05L96j050K69Q89p49o24J190r3
1762C55r22K84R29p49l58J035m21o98M85P16j009O4R57n41p00P73M08j022J16
1781b98Q69p09m76P93k7q75O32P04q22q6Q12j71p85O02N03r52J41M68j59o20N39
1802H3L92r46L28L16k73l14O37O8o84L80L18n93l3P85k38n40M08L75p49K85K61
1823B66j02l52L56Q9n46K79L63m30j98L77Q0m17J91J91m13k60L73K23m13L04L26
1844B87l41K2K83l56J62Q8J40m57J38J56j49k60K91J30l22J33K41l11O6L71l57
$$ y = [697, -721, -711, 784, -84, -874, 468, 710, -681, -19, 1162, 46, -642, 889, 668, -729, -36, 805, -539, -669, 577, 10, -882, 164, 539, -728, -474, 754, -9, -871, 498, 622, -667, 8, 896, -66, -455, 402, 429, -747, 52, 608, -615, -552, 539, -91, -778, 127, 523, -527, -258, 631, -118, -742, 448, 355, -567, -283, 646, -103, -461, 574, 153, -545, -60, 656, -353, -289, 668, 127, -573, 200, 608, -414, -298, 571, -138, -614, 179, 152, -723, -91, 613, -209, -295, 517, 346, -439, 163, 666, -286, -145, 323, 164, -456, 83, 475, -471, -143, 173, -100, -414, 223, 291, -393, -13, 305, -288, -321, 464, 226, -314, 94, 469, -280, 5, 266, 164, -188, 168, 257, -289, -10, 353, -77, -275, 102, 182, -235, -44, 147, -266, -526, -153, 70, -343, -39, 287, -54, -32, 251, -105, 57, 145, 285, -172, -34, 122, -27, -287, 4, 134, -188, -55, 186, -125, -59, 312, -45]
1865d5k9J51J7j89M7J26o1p2P5J13q2q8j60R5rJ37Q4k16j88M81k61lJ90n2j86
1890a25N9J67n0k10L08l8M6m9r1J10k1j15j10J42j76K0J35L6p3kM5K2P4K7k49
1915a18J62J49n0j41J68o2r5k43K99j04j33K70K0j89Q6J09j25q6N9J34l54K34
1937a0J05j09p7K93j39j77K26R0l11j4L14k91k45N74j70j87k2J98L3n6K95l34
1959a4K8R0Pl67K71J02k6m44L99M0k96K5L96j98l04K97N7k08J68J44k31K5K39
1982B00o6l16L06K20l13j38L44k28k70L48J17j27k09L87j85n11M77P5l83K81J20
2003A29k26K4M91k47m29M05K75n58j79O55k70l84N20k4n24L18K99l40k25N69k5
2024B54p00N20J55l67j72M92j08n37M31M03l55k48L43P9n37O38j45l69L7M94m52
$$ y = [-45, -74, 77, 94, -95, -48, 78, 17, -55, 20, 133, 51, -37, -197, -102, -111, 26, 110, -106, -294, 187, -74, -77, 113, 61, -125, -66, 101, 51, -159, 149, 111, 157, 108, 17, 127, 106, -9, -119, 23, -153, -133, 2, 38, -35, -37, 8, 30, 104, 131, -118, 44, 193, 143, 2, 170, 108, 13, -230, 69, -35, -168, 102, 122, -67, 19, 128, 3, -83, -24, 110, -244, -10, 95, -14, -91, 202, 63, -114, 112, 202, -109, -123, 191, -100, -345, 229, 59, -128, -150, 48, 81, 25, 320, -14, 14, 104, 111, -256, 15, 117, 91, -353, 46, 86, -210, -185, 211, 13, -291, 6, 63, -145, 23, 167, -64, -39, 200, 134, -182, 124, 344, 31, -107, 237, 9, -261, 87, 204, 77, -132, 255, 70, -441, 36, 111, -272, 9, 129, -97, -73, 418, 171, -258, 147, 422, -136, -315, 340, 70, -314, 206, 182, -342, -24, 275, -65, -290, 279, 254, -446, 74, 229, -138, -310, 182, 74, -463, -32, 371, 16, -232, 111, 190, -347, 291, 146, -223, -186, 308, -144]
2045a44k35N88m9m39K26N35m80k89O35k04n99N10O2l80R0M55l49k55M52Q8m80
2066b62K38L87n26q3N08m0n18M37K10l25l55P21l23m60M96K36o75J79M49l89k80
2087c75N86K3n24M23L53n62k54N05Rl71K58L06m55j03M45k33n44N61L80p21lM72
2109A76k05k44M32J17m91K04L96m72q6N37j04n71M17J19n10l9O67j95o18O34J92
2130C56p47J86L20k31j45M97n0n76M20M07n65j25O45j84m17L57J53n03J21N04
2150D23m67j73M18q5m04J63M99m38j63M82o9l71J10M40m28j66K46M5k61K68J39
2171B08m73J56M81k00n46N16k5k40O1L93k90l05M14k6l98K61J63l62j0M26k39
2192c5l13N26j8l73J45L45k00k97M15j5m12L85J10k92j95L23n2m00N40J16n37
$$ y = [-144, -379, 209, 160, -279, -53, 482, 2, -287, 348, 144, -455, 55, 117, -263, -173, 282, -67, -322, 130, 218, -262, -24, 363, -163, -246, 262, 222, -296, 141, 351, 26, -329, 392, 69, -391, 105, 341, -334, -155, 294, -95, -375, 211, 234, -290, 133, 486, -76, -330, 175, 184, -187, 71, 377, -78, -181, 264, 31, -513, 48, 428, -293, -296, 176, -29, -273, 159, 276, -215, -11, 385, -87, -173, 364, 260, -311, 106, 225, -285, -324, 343, 148, -470, 164, 356, -391, -205, 115, -116, -261, 236, 186, -390, 30, 437, -128, -253, 392, 208, -209, 148, 301, -202, -81, 423, -44, -217, 201, 116, -288, -125, 374, -64, -227, 255, 186, -185, -75, 365, -63, -229, 17, 62, -199, 69, 208, -265, -109, 372, 172, -374, 142, 117, -123, -62, 331, 41, -264, 150, 124, -274, -13, 150, -212, -222, 204, -35, -348, 178, 160, -213, -68, 277, 77, -220, 195, 180, -232, 153, 263, -29, -224, 99, 47, -353, 187, 303, -234]
2213b34k3N28m28O6P9J2k51K56K41l28j53M37j89k03J75L16k18k23M46k99j60
2234a53J83k4j63O3K05q8j60J13J76k57M4K44k05j93L38L7k29J38L9r0l4K67p4
2257A77k31J90O4k01k11L67p7k08J73m4k54K24K38k27n3L18k14j83J58K11r6j32
2279a1K71j35k07n0L39m65L19J14k32j53K77J14n04M50p3j62K9K16O6m54M55j1
2301A93j60j14K46j50j75K57p9k06K09P2j59M6J90j11o8j24K50p5j56K37q0j35
2323i2Q6J05j95q3L42j07m4o5Q9k31N2J96j51j94M24j74q6J16R5j85m0K33p0n7
2347c6k4K08l31Q3K47m4j45J29n8j97K01N4k8j3K2M3j85j38L09o8J2O7j24j12
2371a28J10r3R2P3N0o0J2j22K18k15l4J07k6O1l1k0j43J31M0q0j7L52j30k47M8
$$ y = [-234, -257, 271, -157, -91, -12, 0, -251, 5, 246, -82, -235, 202, 13, -190, -15, 301, 83, -140, 306, 7, -153, 30, 6, -157, -94, 111, 23, -137, -24, 152, -105, -61, 183, -22, -215, 123, 160, -69, 69, 108, 18, -16, 251, 177, -54, 136, 200, -1, -212, 155, 78, -130, 43, -1, -255, -31, 207, -20, -73, 245, 31, -152, 6, 217, 121, -11, 260, 125, -82, -132, 207, -258, 61, 175, -57, -210, 67, 181, -323, 127, 54, -108, -79, 137, 203, -251, 204, 193, 33, -81, 165, 15, -160, 97, 18, -188, 21, 93, -66, -20, 170, 59, -9, -133, 117, 42, -114, 123, 43, -92, -6, 99, -96, -179, 163, 56, 12, -53, 36, -195, -143, 53, -98, -292, 132, -42, -128, -12, 83, -102, -142, 91, 21, -36, -60, 148, -183, -100, 147, 103, -42, 87, 29, -168, 33, 87, 59, 46, 68, 111, -74, -212, 97, 29, 41, 108, -16, -128, -18, -111, -19, 54, 104, 44, 56, -66, 152, -63, -97, 10, -16, 45, 14, -6, -149, -18, 22, -58, -75, 277, 147, -100, -52]
2396e2N6Mm5r8Q5j0j0J54k4j3m0m2J68q2n9K4k0L2J61k20L7L7J41l03O8J00j42
2423i3N9k0m6n8K90o4j60J97rj81J40j27J18m9r7J8J72k36P6N7j7MN8O4k19j4
2449a37L05m5m9J06j00l6j38k8J40j27R2l1k3J3p3K26J9n9o4J6J04n2j51M5n9
2474a06J1J2J3M1m8J47j72Q0j3O1n7p0J52Nj57O4l7LM8ok8pP4l8O3j03J81k2k59
2503a68K62j42Q6j9K8j22m3N8lm4R5M7p9l1K80k7k63J25n0j10K3q1J26N5p3j0
2529h0J25J71k56M0j7K01j93j31J11R8k92K47J24j76o2J47Ln0Q2p9L1k24L24j69
2553b5n1J32kM5j44J8O8j44j9R1J18j9O5j02k02K57O5j39R1J05j04p7P6j08K4
2578A9J89j54j37n0K61m7n2O6J79l75N8J15j74Q5L3j3m0M2Nj11M0K39r5k79J85
$$ y = [-52, 4, 8, -37, -135, -50, -60, -70, 84, 60, 47, 7, -35, 133, 51, -8, 16, -4, 28, 189, -31, 6, 43, 184, -119, -51, 49, -93, -34, -54, -100, -158, 132, 68, -92, 105, 96, -85, 55, -72, 46, -3, -100, -82, 90, -146, -70, -13, -30, -26, 32, 96, -123, -137, 168, 123, 74, 180, 80, 44, -94, -122, 18, -109, -17, -48, -71, -58, -131, 95, 114, 55, -9, 7, 111, 59, -92, -47, -106, -95, -83, -70, -29, -77, 70, -102, -22, -35, 26, -31, -101, 51, 56, -101, -37, -74, -71, -23, -29, -57, -64, 10, -28, 35, -68, 113, 91, -168, 94, -48, 38, 19, 47, -75, -118, -60, -63, -107, -12, 35, -44, -75, 205, 178, -85, 40, -10, -120, -97, -178, -52, 3, -70, -80, 45, 216, -40, 0, -17, 184, -9, -140, -29, 69, -223, 24, 148, -28, -90, 57, 60, 10, 92, 13, 44, -180, 144, -25, -76, 56, 54, 99, -45, -27, 41, -103, -122, -31, 87, 68, 133, 31, -171, 86, 151, 12, 103, 208, 104, 27, 103, -5, 19, 208, 54, -83, -133, 128, 81, 29, 95, 274, -101, -43, 72, -102, -17, 16, 3, -37, 5, 10, -101, -61, 178, 83, -196, -11]
2603a1j47J8P0j1J26j43J75q5J21j98J86N7k55J87j19k7J45p6o9j23K12J4j92
2626a45K99k78r3K50L4n0k26K65r8j1L4R1m2q9P4pl8j6K08k68J28J26l3j59J73
2651A29k09N7P4N7k65O5J62R7k53M9J61m3j09lJ28k15J98J0J16j62K88j63k33
2674f4Q6r9N0k1J6R1k2J35l13N4K04k69R1M7J08n6k05K05m2O8J6j37J08j83L77
2699B45j70j85P4K43r4k50K88j84L4K5R2k37N4M4rL0j91K09l6N7p4k0O1j19m5
2724a58J16m0K42j33L0O8j76pP8J67k87K09j28J81k31J20m9Q5j07J67n8o4p0R9
2748E4k05K83l7k19K17q2%L7R2k54J03J9K06j94r7J14Rq7MK4J20n5j7n4O5O7p4
2775C9q1L2l3P7J1O0M9jj52Q4j20o2K00k70K10p2m7J12R9j59K9%lp6M7o0P5p8
$$ y = [-11, -158, -140, -70, -81, 45, -98, 77, -8, 113, -85, 101, 158, -97, 90, -29, -56, 89, 13, -56, -179, 33, 47, -145, 154, -124, -217, 33, 67, 17, -209, 56, -42, -53, -19, 72, 30, -59, 15, 8, -30, -46, 162, -106, 22, 148, 115, -44, 129, -80, -23, 51, 108, -157, -92, 70, 167, -86, -37, 124, 81, -28, -31, 97, -118, 80, 90, 206, 44, 332, 169, -64, 22, -77, -27, -48, -32, 59, 37, 172, -141, -87, 117, -152, -61, -14, 94, 38, -167, 38, -4, 64, 80, -57, 51, -132, 245, 75, -110, -36, 207, 113, -137, 151, -33, 1, 26, 118, -119, -65, -21, -30, 0, -191, 18, -18, 39, -35, -55, 6, -113, -158, -42, -82, 160, 27, 57, 125, -51, -58, 20, 187, -100, 109, -19, 162, -69, 51, 2, 87, -20, 147, 89, 25, -45, 54, -151, 132, 95, -124, 93, 11, 11, 48, 140, -114, -11, 8, 214, 20, -77, 37, 46, -41, -37, -13, 107, 52, 35, -19, 46, 113, 39, -42, -10, -43, 34, 45, 105, 154, 153, 1, 85, -35, -97, 103, -167, 43, -29, -76, 36, 135, -24, 5, 5, 2, -74, -27, -87, -12, -90]
2803i0J97l8j75R4O3j15P0M6o5J85k20p3K41j15j54J75j00J91j52J13j98Q5K1
2826a4l1J02J57p3j11P2j86J13m6k3j01L2K35l5j34J86l5l8j64K7P2r7K04o6o3
2851a7J9k6L3l3K33m00J56j01K08k7j1P8j06jj35J61o2k6ok5J24j20J22m7p8J26
2877C9J08p6qj30j16L76r8m3j7r9P5j04K7L1J48k73L10j00j49K43j96J82k52Q0
2901d2J6J35k43J76J4L3k0j73K21k0j33Q6k02K37K0j69R5Rnj00K75j85o9O8J34
2926A58j85J73j3m1N1q2j5j51J26m8J82k09L5J74j90P0j19K45j67j77K63j26J00
2949E4o1q2J47o0R5j60O1J2N6n5N0j55J97m9r1q9K13P8k21j04J61k6P5j87J65
2974B4j7j71J40l6J66J8n7j02O1P2M5r2J55k80K20k67K2P2KJ66j83PR2L1L9k94
$$ y = [-90, 107, 69, -106, -12, 51, -64, 6, 52, -13, 172, -48, -121, 120, 5, -149, 26, -74, 117, -35, 78, -120, -35, -14, -45, 57, 214, 141, 30, 102, -84, 29, -17, -40, -141, -109, 126, 91, -43, 143, 108, 70, -94, -67, 5, -92, 112, 46, -17, 2, -24, 9, -24, 209, -191, -35, -136, 72, 45, 34, 112, 6, 5, -130, 31, -31, -57, -63, -88, 36, -84, 38, -9, -87, 39, 147, 71, 63, -67, -183, 193, 95, 52, 35, -64, 11, -93, -66, -35, 113, -160, 150, 50, -99, 144, -52, 130, -122, -42, -26, 109, -134, 42, 56, 89, 69, -104, 117, 97, -36, 50, -152, 85, 105, -64, 31, 40, 35, -65, 210, 25, -44, 24, 158, -27, 146, 133, 92, 143, 61, 46, -105, 21, -27, 155, -54, -19, 155, -35, 35, -84, 161, -6, -183, 80, -46, 54, -7, -89, 58, -2, 93, -67, -6, 6, 62, 7, 57, -98, 99, 50, -41, -130, 83, 161, -60, -164, -3, -29, 46, -141, 24, 7, -164, -24, -60, 106, 124, 67, -35, 26, 98, 143, 51, 206, -74, 146, -121, -99, -27, -25, 141, -42, -35, 57, 88, 127, -167]
3000a67K53r9J72n3N9j15k69K98j14J38o4q2K0j71K47o1K87j65l5l7l8J25n8j17
3024d6J06o9P0n0qj8r1J2p0J95o1K31o8k2n0o7p5J58j17L0rK4J41k10Q1j8j9Q0
3052F0j45L6j8r5K30j56J36j3M2q3l4K9J70n9r1P7j98K08o4K9q6P3j05j8R6J4
3078C5J71Lk41r0K32l3j01q1RnJ04R9k20q2N6J57l4N0j71K00p2j21R2P1p6k2M7
3105b3j38J86rN1k37K34j53j25J69l4L7j5J08j14J27n5R4Q9l73L23j66j44J83
3128A5j38J38J9l4K75k28j28J96l24L60%k31L0J14l4JJ13o3l35J82J21j26Q5J
3152Ij01J24m6j16j07L76p8k52M6L28p6k42K83k09J65j42Q5r9nk6J48nk30L03
3176A33k52J66l5j17R2L9j65J91Kn4N8l4j5j00J35j84L1J73n4o8L26l34o5K71
$$ y = [-167, 86, -13, 159, 106, 165, 50, -219, 79, -35, 103, 39, -43, -23, -194, 53, -8, 279, 114, 79, 42, 4, 129, 71, -46, 60, -9, 61, 11, 3, -15, -106, -94, -164, 31, -30, 201, 133, 111, 61, -6, -81, 77, -40, -10, -19, 5, 146, -64, 17, -1, -20, 60, -85, -49, -67, -162, 68, -88, 48, 35, 77, -6, -40, -11, 159, 100, 9, 86, -112, 96, 32, 61, -25, 48, -57, -75, 21, 35, 206, 209, -32, -122, 110, 77, -24, -105, -96, -101, 3, 102, -118, -200, -144, 13, -21, 29, -142, 58, -14, -135, -43, 28, -48, -70, -23, -161, 25, 16, 67, -170, 64, -89, -214, -45, -79, -42, -57, 51, -63, 64, 9, 103, 192, -181, 142, -24, -168, 15, -123, 15, 34, 0, 275, 47, -81, 115, -209, 151, 151, -80, -50, 64, 30, 31, 144, 81, -254, -72, 49, -77, 8, 9, -92, 32, -14, -130, -237, 139, 61, -191, -145, 183, 107, -135, 148, -61, 104, -38, 47, -52, -57, -83, 65, 60, -170, 133, -119, 47, 12, -105, -13, 26, -139, 52, 54, 0, 58, 24, 9, -91, 44, -140, -109, 64, 10, -58, 268, -66, -131, 140]
3200A40j59j5J04mqQ5Lj22j37J17Q4k03P7l1J55q2O3n8K8j01J21m1J27J05k73
3225b5j12J97k3j05k1K11j21j21J5K30k78K59k15L8Lk1J79k59K72j32k06K54L0
3248D9j52J64j7KKJ7rmo3M2L4Qj9L0j55J11p3LJ86j93j6P1R0l7Mo0j98J38m2K08
3278A21n4j76N5N6n4o2J28R2j62O5L7ml9Q5k0j47q1K82j58m0J98j46j02J56J28
3303A58lj16j73L4N8l7J21k3L1l9n4J52j01Q3l5j38K08k20J43j18L4J8J77j11
3327D9k55K33O4k41J69L3Kl6o4J96j83r0N3Q8j51J22o4N0m3P4k1j8Q0j25o8j8
3353a64J53k02K71J14j38j33P6j8J12k11J99j67J0M1r9L17j72Lk41J54J35k9J0
3376B1P0j26rnj05J46j09J57p8j41J41R2k3j39J61m6j6k59J74J05n0k6n1J72M1
$$ y = [140, -19, -34, 70, 66, 58, 143, 146, 24, -113, 4, 88, -115, -38, -69, 86, 4, 67, 9, 37, -64, 57, 16, 143, 248, -25, -137, 60, 37, -68, -89, 122, 1, -120, -105, 125, -153, 106, -109, -71, -68, -89, 90, -169, 103, -29, -235, 19, 49, -103, 61, 44, 46, 48, 65, 56, 52, -11, 31, 65, 73, 54, 84, -71, 40, -33, -30, 156, -37, -53, 18, 108, 71, 75, 15, -183, -45, -87, 121, 67, -109, -54, 2, -52, -114, 14, 106, -56, 9, 46, 42, 3, 88, 68, -79, -160, 122, -36, -76, 122, -24, -126, 30, 158, 155, 39, -134, -100, -42, -79, 42, 19, 50, 11, -43, 109, 8, 91, 56, -82, 126, -94, 49, -69, -35, -17, 160, 49, -206, 27, 91, -150, 19, 52, 54, 18, -46, 150, -33, -123, -70, 18, -133, -11, -75, -25, -68, 6, -15, -33, 47, -78, -146, -164, -11, -213, 58, 172, 34, -99, -23, -41, 71, -140, 59, -108, -98, -57, -156, 161, -11, -8, -249, -95, 40, 11, 21, 91, -35, -44, -49, -154, -8, -117, 40, -38, -179, -38, 54, 31, -108, 53, 7, -9, -268, -94, 11, -39, -65, -116, 56, 97]
3401I7j75qO4L6J25k79J14J4q3J29j49Q4j1K7l6l8J21o2J82n5lk23J92j51J24
3426C6o2n3j4Q5k1o9J50m3L7N2k4l8nk21L26j69J55Q4j91J9r5J90o3pN5j71J77
3453A20r7j37J19J12k52k2K43k43J91OR3j51o2M3L8N5k26K21j71J40m0r1P2j4
3477e3J95j36J30k66J59K5j71J71o0kj0n8Q2Q3j76m6N8K0J8ql0N2J06J48j66O6
3503A31r6l7l5M3L2k26m6K65j15K51k00Q8l3J12J98l64P2N8r8L6j48J84k06J21
3527a3J5J10M5k29n2p7K00k0K9K5N2p8o4P2j87J01lr8K99j69J5L3J1Q4q5J3Kj38
3555a07l9K11N9j50P4o4p0J61J27k71p9o7J87o5J18lM5o7m1L6j27K04j21J42k28
3580a35O4M8Ql0LoJ5L4m1J8k6K40l03K21j49J32j23K3L7o3L8r0M5j34J88J24k73
$$ y = [97, -78, -86, -22, 14, 139, -140, -26, -12, -95, 34, -115, -31, -42, -15, -51, -89, 32, -30, 152, 97, 94, -129, 63, -88, 36, -26, -79, -93, -8, -29, -98, 52, 9, 46, 98, 74, 36, 31, -190, 136, -33, 122, 206, 15, 34, -61, 129, 66, 59, 114, -57, 120, 23, -114, 5, 117, -135, -157, 86, -157, 34, 40, 133, -18, -80, -37, 1, 56, -170, 51, -120, 20, -20, -111, -39, -53, 142, 6, 136, -130, 29, 54, -117, 54, -6, -8, -18, -76, 6, 89, -87, -133, -75, -55, -37, -45, -75, -23, 83, 231, 65, 131, 35, -2, -37, 6, 38, -188, -234, 31, -84, 167, -33, 55, 22, 134, 332, -32, 40, 98, 0, 36, -112, 72, -134, -13, 2, 112, 157, -72, -124, -201, -1, -21, 8, 33, 85, 7, -57, 15, -172, -71, -74, -172, 127, -42, -27, 6, 17, 101, 16, 29, 31, -107, -146, 65, 124, -26, 48, -16, -86, 75, 202, -69, -148, -215, -28, -93, 25, 22, 67, 0, -41, -5, -132, 72, -49, 93, -135, -71, -23, -15, -45, -42, -48, -33, 1, -40, -22, -48, 192, -111, 110, -39, 93, -30, -7, 30, -33, 5, -85, -40, -174, 14, 138, -135]
3607a35K21j53J03j61J59O6r6L1l0P6k10J03J9J5P4k26K48r1j02j2K05k22J01
3630a7o7N0P3n9MJ55j08r4j8n6K00j84l4N1J46n9n5O6L7m4R3j67J56j41nJ15R2
3657A30nj81J0m7J03o7R8j48J20K8K7k8M9K9m0j59J96P8j15r4j16J25O0n7j35
3682a39r2L26j56o6J21p2N1pJ46l29L06J02q1k38R4l8N8K9k4L8k28K32l9M5l8
3707AP7k65L4N3K7j3K09k28lJ62q3J81j34k7J23j20PJ21j31n8K33q3k75J94m0
3732c8RJ48j26j49J76o7OJ91j44K09l9l04K20q0q0J7J46J39l83K19Pk80P1P3k23
3757b82K30P1j84JR2R4m7o9k5k5R4J34j25R9q5P0r7K36p6m9k26K30j7O2j03J28
3783A31j75p7R1q8J30M4R0r9q1L4J2k77K41J26l24J41Q8M4j44k0J81J30j90j49
$$ y = [-135, 86, -67, 36, -125, 34, 100, 4, 35, 5, 81, -129, -26, -7, 8, 82, -144, 104, 13, -89, -101, 104, -118, -17, -84, -34, 39, -20, -16, 139, 31, -63, -81, -137, 63, -121, -155, -104, 42, -17, -72, -6, 31, -13, 80, -87, 69, -72, -77, 38, 130, 125, -56, -46, -93, 10, -57, 41, -107, 13, 41, 68, 40, 89, 118, 78, -81, 115, 193, 78, -16, -132, -7, 53, -4, -139, -231, 95, -61, -127, -6, -78, -27, -34, 112, -217, 89, 191, 110, -128, -34, -72, -14, 15, -9, 29, -199, 33, -6, 39, 1, 78, -187, -153, -100, -73, -86, 123, -105, -108, 54, -29, 152, 18, -9, 114, -6, 1, 122, -9, -67, 166, 83, -192, 2, -38, -29, 119, -7, -156, 20, -47, -41, 150, 6, 215, 176, -128, 92, 12, -68, -51, 95, 234, -149, 70, 77, -203, -132, -59, -282, -52, 19, -165, -164, -72, 22, -25, -94, -119, -144, -50, 84, -41, 58, -27, 43, -54, 182, 106, 57, -169, 61, 44, 106, 3, 131, -44, -121, -30, -118, 12, 56, 146, 47, -34, 0, 12, -265, -24, 102, -222, -81, 7, 51, -93, -113, 68, 198, 8, -141]
3807a41J44O1m8n1J08j66o3J33l4K57k65o2K26k42J45J16K4j14j34J56O9k23J44
3830D0l7Q7o9Pj9M8n5m2Q8J3m1n4J17j35l3R5J42j58n1n0J54k27O1k2L1K27k89
3857a72K75Q7k73M7L3q4J47o8K3r5P7J27k35L04k67K88j41M5M7k49K0k8L2Q6r0
3882f4J57j23N6Mj45K9M1J9J22N3q1j95o3K58j6j3J38J6l82K45j40j04K19m6N2
3907C7k45K4L20j35j8O0j20p5J44qO3q1O0P7J02k04L4r8j60K25j49J35r3J29k3
3932Aj24J85m0j0lJ23JJj29O7j1N2k14L9M0M4j47J24R4O2j78M1o8J11J38r5j01
3959Co0m6K98q1r4j6j8l0LK03k44J88j57J90M1j59K88k49n6Q6j62M9Mj47J59P0
3985F3J16j06k25L3N8J73j00Km6Q5l5m6j0J64k25nR0l5P1q5r1J67J35j68L1o0
$$ y = [-141, 3, 64, 16, -35, 73, -93, -156, -23, -57, 200, -65, -127, 99, -143, 2, 118, 142, 28, -106, 50, 119, -104, 40, 3, 90, 21, 28, 9, 57, 2, -40, 48, 61, 20, -34, 83, -52, -85, 10, 152, -6, -57, -107, 47, -180, -119, -141, -110, 117, -172, 103, 190, -83, -36, -3, -87, 60, -8, 15, -80, -3, 124, -111, 193, -74, 214, 73, 118, 165, -84, -64, -92, -60, 26, -64, 93, -30, 26, 30, -115, -86, -45, -26, 96, 149, 68, -127, -190, 68, 52, 39, 177, 193, -189, 56, -84, -188, 31, -15, 37, -208, -184, 136, 1, -17, 43, -77, -152, -8, -16, 47, -34, 26, 103, 205, 1, 35, -63, -223, 2, -147, -12, -105, 24, 1, -123, 62, 22, 12, 9, 132, 133, 134, 5, 72, 61, 113, -101, -62, -22, 22, -125, -1, 93, 155, -23, 18, -50, 61, 199, 104, 3, -57, -103, 195, 114, 20, 4, -14, -44, -41, 162, -82, 106, -51, 139, 180, 21, 309, 60, 4, 90, -72, -23, -19, -166, -7, 63, 179, 73, -152, -119, -61, 112, 12, 14, -32, 53, 18, -28, -38, 126, -99, -104, -14, -49, 22, -63, -154, 13, 148, -20, 11, -49]
4011d9K34j40m4o9Q2j5k8J25j00L8M1R5j98M9j35J48O7K5l52K21M3q0N6R8n0N0
4037A12m7O4j8k75N1j4Q4J64r2N0J23j59j03Q0p7O5k7P7j30O8k7K1K7O8l2n1q7
4064h5P1j66L5N7K8R1j67J30q4L06l34J86O6k11l1K28q5R8o9r5k5J15O4k19m8
4089a44J51m8o4K02p0j01nN3l7M8J29r8J6j80K37l04Q6K8K85j15o5M8p2lQ0j58
4115a01J42K12k37j10K18J24j76Nk93J85k1Q6Qj22J45M0m2J3j29O3j40K49J2k14
4139h3O0r0K46j00l6J59j81O5Q8j08L5j54Q1OJ65r8LP5j01M6k66K88j09o3P6J3
4165A7p9K75r0j39P4m8J42k33R4JL0J47j59Q1k24M8q4K34lj33J55k00R6L5Kj44
4191a05J57R0j84L0O3J9L0l4j2j61o0J80j19N5J21m7l1j7O9l3N8k64J23J9J9J15
$$ y = [-49, 185, 45, 1, -68, 14, -1, -29, 96, -4, 34, 75, 170, -28, 21, -114, 34, 101, 126, -226, -5, 38, -42, 14, 112, 62, 112, 65, 129, 111, -164, -113, -127, -43, 121, 29, 79, 202, 43, -60, 20, -57, 8, -19, 58, -72, -4, -31, -10, 17, 85, 53, 2, -85, -14, -180, -145, -88, -60, 31, -136, -6, -90, 216, -118, 68, 134, -77, -108, 120, 35, 133, 64, -31, -56, 59, 123, -96, -144, 7, -41, -105, 97, 27, -74, -79, -26, -63, -15, 114, 16, 32, -148, 89, -215, -129, -101, 184, 69, 4, 52, -20, -23, 57, -101, 41, 253, 16, -94, 124, 248, 72, 77, -216, -31, -52, 34, 42, -80, 65, 105, 63, 76, -53, 10, -130, 119, 131, -83, -23, -113, 133, 33, -3, 156, -25, 40, 128, 20, 55, -99, -18, -12, 153, 55, 58, 133, 32, 78, -188, 100, -9, -72, 4, 17, -62, 213, 123, -16, 58, 10, 152, -81, 13, 14, 44, 191, 32, 113, -111, -63, -147, 87, 84, -49, 106, -94, 2, 37, 39, -105, 52, 142, -42, -12, 51, 70, 100, 66, 54, -107, -167, 13, -106, -51, 70, 23, -8, -25, 44, 11, 69, -195, -72, -53, -34, 81]
4217H1l31J90M3p1K93j15o9j6L4j27L5k4J75O9q2n0Q6j49R7J2j71k6J50P1M8j59
4243fj24j0o0K46K6p5%L9j30N9J05j92Q8K0J12J06r3J6r0k2l9J7l9j25J84j18
4269a05J77q6m1k9K33j44r2J34O9k16J38m9k7K13j4j21k9L8L6k0k7m3k24J39n0
4294a40J01M6j06P2O8L1J51j76Pp0j7L1j57N4J74l4j29K21j06p8K9k6l8Q0R8j94
4320a08J11R5q4k6q6K00k8k3l7R9j98N4R6R4p4k64J35j8J05n5N4K4K8q5j04n8
4346a53J66j41K9N1J15j91L5K00k30J13K5r0p7K51p2j68L62j22r9P1n8j10j13
4369b06J32O1j79J90K3J36j30n9K97k72J02j9m7K7J9O8j46J29k5k51J40J34j59
4392c5J7K3J0m5j08Q1M1R5m0j85l0J7J48l2J70q8j05p0K35j61p1K44P7k07J5J70
$$ y = [81, -250, -60, -17, -88, 205, 90, 21, 5, 39, -88, -53, -77, 98, 167, 85, 35, 121, -28, 69, 81, -90, -116, 34, 105, 153, -6, -130, -140, -200, 46, 72, -3, -3, 36, -94, -35, 70, -122, -34, -14, 98, 204, 111, 127, 37, 15, -24, -7, -46, -171, 13, -105, 72, -14, -55, -84, 149, 5, -87, 47, 116, -100, 38, -11, -38, 175, 161, 40, 11, 49, 85, 65, 38, -5, -229, -90, -140, -39, 7, -99, -27, 41, 72, 223, 47, 54, -16, -33, -2, -159, -105, 69, 35, -94, 127, 21, -57, -28, -54, -92, -12, 86, -108, 3, 98, 14, -12, -98, 102, 74, 51, 14, 113, -85, -31, 65, 159, 85, -179, -44, -62, 43, -12, 42, 66, 94, 9, -95, -153, 13, -128, -99, -48, 67, -124, -89, 111, -119, -6, 19, -71, -148, 103, 31, -137, 225, 103, 4, 75, 17, -93, -206, -74, -13, -192, -2, 21, 157, 27, -32, 265, -7, 95, 76, 29, 56, 75, 143, -3, 126, 101, -150, -10, 124, -35, -18, 5, 15, -30, -138, -57, -16, 79, 39, -146, -176, -159, -11, -43, 127, 39, -66, -136, 99, -62, -133, 111, 188, -19, -4, 166]
4418A66o8n3R2m8l37L37Lj03Ln0K07j99J8J52j71J33j40J10P2j29m2o7q5K94m1
4443E4q8l7J22k93J12J71m6k8j9Q0j22Q5O1j59K42j44K7J02k08J49r0n4R6q6P1
4468bk04N0K2K71n4j65J28j5j01J4q5J41J69j13p5j53J53m6j18K11l1J1J9J57
4492A84j98J0O5k83J31J53l1o6K6m5O6o4LK4k2K34k32J67j05r4%J9J2j2r2K69
4518A19j52J13K9j15lQ5j77J02O6m8l7k1OnnJ39q7J7R3j01j39L1Q1J07o6j2J3
4545C3p2p7K42j69nQ5j40J23O9k05M9J39r7n8p0R1L0J12oj15J24j32J05j15q4
4570a43K42l7k2Q0k27K31j46M7J35q3J6q4K15j61mj98J55k30L18j32n5J99k65
4593a49J24j31R0l9N2J35j10P6n0K7J20k45R1J48k80J2o7L6N7J27jJ8o0q3R4n
$$ y = [166, 98, 45, 137, 89, -248, 89, 92, -11, -8, -58, 149, -50, -32, 120, -51, 82, -58, 52, 124, -5, -47, -114, -199, 95, 54, -34, -71, 51, -242, -130, 41, -5, -33, -52, 28, -94, -9, 52, -107, 135, -9, 18, 120, -88, 61, -29, -83, 13, -73, -2, -206, -156, -134, 137, 83, -82, 46, 31, -70, -56, -141, 0, 169, 56, -19, -172, -19, -65, -183, 28, -3, 8, 27, 184, -14, -4, 61, -222, -91, 62, 31, -35, -9, -54, 12, -52, -49, -25, -47, 187, -45, 122, 17, -77, -77, -58, -46, -58, -150, 119, -33, 80, 109, -6, -9, 76, -101, 1, 67, 19, -18, -39, -33, -38, -43, 96, 9, 26, 119, 18, -121, -90, -9, 98, 32, 20, 33, -39, -116, 126, -43, -48, 37, -103, 20, 89, -116, -67, 72, -25, -83, -153, -62, -32, 80, 74, -41, 83, -49, 56, -59, -143, 99, 62, 40, 120, -107, 124, -22, 25, 160, 77, 93, 9, 224, 63, 59, -139, 16, -214, 104, -28, -83, 116, -149, -25, -156, -66, -105, -53, 82, -28, 48, -2, 25, 145, -100, -9, 139, -141, -129, -196, -160, -103, 24, 23, 41, -19, -102, -8, -13]
4619a3M4J1M2k4Mk8K29j69Oj0j22R2p2J47j13qj52n2K50q8l8N4O8j00R2l7R8q4
4647B7j11J39K3j39l1Q9j88K58R5j66J06j73O7r1L69k20k0l3J28k89O9oJ70M8
4671A21j72K85m41pJ64J09k30K33j3O0q0n2K31j89k6J05k34K14k33J62J0n7J05
4694F5j41q5J40P1l1JJ61j67j11J52PM0M5j07Qj25J21j96Q8J74N5q1m9J4k9o8
4720d8J36r6L4j33K97j27q2oJ59k6o7J3j11R1J0n8Nq7J05K7L1%j46MK39j77J1
4747bO8o4L7j2n4O8k1j28K4J02r8J10j04O1r4K36q1k37K53q4j32J44n0LL6oJ82
4774A57j47J38m7j58n8J01r3k7lJ68j5O2k8Q5j23O4j88K4J30p8M8j5J34j13L0
4799D8O6k61J69R8k8k36K88J2j38j63J63P6j29J15j67P4M1q6K6O1m2r6K17q2J22
$$ y = [-13, 31, 42, 84, 60, 64, 36, 265, 96, 102, 92, -30, 62, -10, 137, 24, 16, -136, -188, 62, -26, -64, -10, 58, -42, 50, 13, 111, 27, -84, 55, 78, -61, -92, -3, -191, 67, 162, -4, 102, -71, -4, -95, 274, 54, 34, 1, 129, -160, -91, -97, 73, 121, -51, 234, -207, -214, -50, 59, -171, 62, 49, 109, 29, -23, 208, 19, -7, 98, -136, 78, -155, 7, 17, -40, 65, -76, -161, -21, 50, 19, 20, 181, 14, -97, 55, 62, 102, 147, 40, 48, -77, 44, -152, -64, 110, 165, 84, 35, 49, 20, -48, 88, -8, 26, -107, 190, 63, -19, -25, 134, 108, 41, 54, -57, 34, 44, -14, -9, -96, 9, 36, 67, 67, -79, -75, 164, -13, -2, 66, 2, 39, 27, -27, 41, 20, -108, -84, 18, -80, 30, -74, -13, -107, 129, 48, -189, 64, -20, -152, -8, -58, -55, -19, -25, 157, 10, 148, 101, -57, -115, -14, -107, -134, -137, 31, 16, 78, 50, 135, 12, 76, -112, -88, 42, -36, 12, -3, 131, 18, 48, 114, -147, 22, 120, 92, -144, 144, 156, 18, -145, 18, 94, -35, 80, -87, -13, 28, -58, -32, 29, -13, -109, 108, 26, 148]
4824A48l31M02k15k9J85k0Qj00J51j34j55l9L22j12j03J69j10j1%P7lj03M9kn7
4849a3j44J77Qj87K11J15j93J55j65m9O0J30j35oJ42q4L1p0kqK0J28J4j60p4j00
4875a99K02n2p1K18K0P5k38LM5k1P9j07O7O7j45J69n0j68KN3J20p8qJ42L0k55
4901a00N0K1j15K28l8p4K7R8j5j00j8M4Q0p2L3J62k20j06K59j25J7%p4p7K23J24
4927B32j76k6j33J09j35J44j00J56Q%j70J21O5j81R1J00m3q5r2M6K66q6j14q1
4951h4J93j44p9Q7j9l1K61j91q1O2J2m6K51r8j53RO0NJk1K38j57p6n3J17q9o7
4978i3J23j2j43J6L9Q0j3j4o1O9R7k6m0j2n2o3J68m8K30k99l20L19K4K20k58p9
5004a48J97o0l4J59k12l4K84j59J39n8o5J37j29L1N4k2q7N9P8j00J9k0J96k38
$$ y = [148, -183, 219, 4, -25, 160, 140, 148, 48, 199, 65, -90, -129, 193, 81, -22, 147, 37, 26, 26, 103, 100, -3, 46, 44, -13, -157, 20, 28, -159, 52, 167, -26, 129, -36, -85, -25, 105, -30, -36, 106, 22, 53, -17, -19, -27, -7, 121, 135, -25, -99, -199, 3, -49, -120, 98, 118, 193, -45, -42, 3, -18, 61, -46, 21, 88, -57, 112, 62, -106, -104, -51, 69, -9, -17, 125, 155, -100, -50, -29, -144, 84, 46, -28, -1, 97, 82, -18, -36, 8, 88, 16, 49, 211, -9, -115, 144, 19, 36, 36, -38, -115, 108, 232, 56, 30, -103, 6, -129, 15, -85, 71, 79, 79, -91, 30, 95, -86, 5, 105, 62, -23, -115, -69, 197, 111, -3, -84, 109, -35, -114, -27, -46, -77, 184, -7, -88, -26, -14, -60, 191, 93, -60, -51, 9, 14, 15, -6, 232, 75, -1, -54, 63, -26, -93, 30, 18, -125, -109, -70, 10, -3, -17, -78, -9, 88, 62, 22, 10, -42, -105, 63, 15, 245, -54, -374, -55, -31, 189, -69, -148, 49, -11, -45, 114, -98, -132, 152, -7, 132, 74, 9, 146, 17, 48, 102, 80, -7, 52, 130, 30, 49, 29, 225, -13]
5028a3R8j61P0o4L4mj9J69j64J30j11m9J10j10N4j13L3J78q3m5J46j7j05R5J8
5053G7r2rK6J46Qk58J95j26M9j09J58j5j41O4Q2O6j01L1l5M2p0J39j98j5J13P
5079C4J40k42K9J4K8o4R2N0k16K77o8j04l0R0M6j73JK28j36j17K20j60J87k22
5103i6l9K64p9j16J83r6l0j14J48R0k41K64p5J26k34J74J2k58K2K03j36L8J5P
5127C2O2k24J85j19M0J25r4l8M3j27J28K16j55p4k9N1m1m9J87j38l1M4r9JN8q0
5153a26K75j2k44O7n7J34R3k00K23j07o1n1R2R6k12J44Oj33J27j02J20n8p1m5
5177a02N4l7j1k5Q8k7J45l3q1L8J09j28l0l8r5K79j07Q0N2k75Q0P9n1K05k15J21
5203G5n3j19J74rj33R9j16Q5l7QO7j82L00k44j1J74J30k31P5j5l5j7J2l3P4L5
$$ y = [-13, 85, -76, -6, -70, -36, -40, -59, 110, -54, 76, -35, -84, 26, -84, -30, -143, -110, 68, -15, -60, 86, 69, -36, 59, 77, -15, -24, 2, 148, 156, -102, 93, -33, 16, -93, 65, 50, -91, -27, 55, 121, 20, 51, 16, 58, -12, 127, -71, -86, 27, 34, 174, -68, -39, -25, 3, -61, 31, 81, -135, 142, 74, -30, -60, 30, 76, -97, -96, 132, -4, -121, 99, -61, 126, -96, -135, 129, 50, -66, 117, 21, -9, -123, 25, 115, -126, 138, 63, 189, -45, 129, 141, -117, -95, 108, -28, 10, 25, 32, 94, -130, 55, -64, -24, 101, 7, -31, 12, -115, 13, 229, 74, 0, -29, 22, -19, -68, 119, -19, -50, -6, -105, -104, -46, -126, 149, 137, -107, -40, -97, 37, 130, -70, 153, 46, -15, -66, 26, 122, -90, 54, 60, -73, 54, -48, 72, 14, -57, -102, -48, -85, -96, -121, -33, -60, 85, 52, -29, 9, 118, -10, -40, -78, -173, 106, -1, 79, 131, -144, -64, 15, -36, 169, -46, 75, 22, -97, 77, 68, -65, 34, -82, 3, -34, -26, 41, -141, 159, -85, -96, 78, 208, -23, 52, 37, 2, -15, -3, -36, 38, 73]
5229G3m8P7m8k5J25k08J31j19J8N7L3k76K15k8k1r5R4L14k35K6N1K9j22M7j93
5254a28P1r4J8J32qo0L5kO5Lp3O2L3L9K7j66J73rr0j22oR0j6J99q8K3m8p1n8j4
5284h3r9J51J28j32K2j8m2J21Q3J5Qo9j17J64k2j64j37K27%J1K8n0J8j10Q9m0
5310a8O2m1J33j14Rk79M42j37N3k11L2P8KP6j94J19r8M4P2j80J52J35j77J5rj21
5336a55K13Oj97K20j21r1K6O5p2N0n4K13k79K05n1O6j4j07N1L4q2K63k72LJ67
5361H7j25R3nj7%P8j32L9m6J24j27K8j5j32J66N8j25J38K4j79j1J63q6m4j00K07
5387F1j13j3M2j10k5J49J1p7J21j33J11L5J26k48J92j46l9K79k32L7j05N4J6n3
5411f0J48k48J09J45j09J58k14N1Nj1m6J13nQ7j56J47j81J27j27k2k2L8O1K8q4
$$ y = [73, 25, 102, 54, 29, 154, -54, 77, -42, -24, 33, 66, -210, 5, -23, -44, -139, -45, 269, 34, 60, 111, 140, 18, 65, -128, -57, -151, -133, -1, -9, -69, -34, -36, 29, 32, -41, 21, 54, 93, 120, -46, 127, 118, 28, -94, -100, -10, -26, 173, 85, 108, 60, -11, -69, -83, -182, -31, 97, -35, -13, -31, -73, 48, 131, 146, 154, 85, -32, 132, 110, -54, -191, 36, 36, 47, 75, 25, 43, -67, 22, -18, 44, 3, 136, 22, 31, -248, 194, 57, 110, -101, -69, 9, 11, 87, -107, 12, -86, -42, 30, -150, 2, 137, -40, -25, -34, -155, 58, 64, -133, 87, -34, -125, -99, -34, -106, -56, -110, 103, -176, 29, -22, 44, 30, -77, -26, 8, -74, 189, -83, -80, 87, -38, 55, 50, 33, 33, 111, -21, 18, -28, 96, -31, -3, -18, -150, 16, 74, -51, 87, 111, -68, -79, 84, -2, -46, -146, 61, -52, -65, -23, -133, -158, -9, 2, -75, 46, -87, 24, 59, 185, -63, 129, -17, -56, 223, -9, 28, -77, -23, -7, -60, 88, -160, -51, 94, -15, 143, -71, -20, -15, -26, -72, 41, 36, 123, -33, 114, -67, 60, -67, -89, -111, -73, -12, 16, -68]
5436f8Q7lj57J60R4L9o1k83L6J58Qk0J19o4J76j79n7J1j28J87J19j16Nj0L8o2
5462B9K9j1P0k44J83Q7k14J30J0m7j10POJ01j98K32o1k1j2Oj32J35L2j25N9P5
5488A6J2o3J5MK8L1kn2R4J7j79j5L8L7k0j7m2n0nK24k0NL8j38O8j41J23j56K62
5517A12q4o2J07q2k0J10l7K1p1J8K23o5m34J77L7NJ01j15R5r1o4J42q1J15p9O6
5543D4j86K14j57J41Rj00l9M3J87k20Q7R2j35J37j37J4j42J55K6r6M0m9M7K6J19
5568A20j02l8j12K00k21J21Q6j33J69L4j18J13j49Q4j53j5P4J40k1o8J00o3M5
5591I3o8Q5j59L4K55m29K03k8k0J57k30K07j82O8N3l3LJ15j16J18kj75l0J13j22
5616i0J78Mj11N9j92K20r4o3K6J94p4J4J51j28p3l9j2k4J72k44R5L6l7m9k1L01
$$ y = [-68, 19, 16, -141, 19, 113, 152, 91, -192, -156, 2, 10, -10, 109, 45, 221, 42, -15, -4, -132, 55, 174, 58, 63, 53, 91, 29, 58, 47, 117, -127, 56, 143, -71, 59, 69, 22, -88, -81, -75, 26, -172, 60, -1, -22, -34, -28, -160, -25, 7, -118, -59, 16, 28, -35, -20, -16, 12, 43, 41, -11, 83, 100, -79, -94, -56, -19, -39, -56, -98, -148, -153, 71, 51, 56, 94, -44, 24, -117, 6, -150, 112, 28, -34, 73, -9, -29, 81, 44, 65, -6, 12, 235, 170, -264, -87, -50, -45, 56, -59, 36, -55, -119, 23, -58, 57, -22, 44, -142, 72, -85, 56, 65, -35, -74, -31, 156, -64, 23, 115, -20, 117, -20, -6, -148, 7, 33, -63, -23, -72, -25, 1, 120, 18, -20, -132, 68, -153, -32, 54, -79, 90, 124, 6, 119, -30, 54, -99, -114, -40, 100, 79, 11, 111, 48, 93, 25, 110, -49, -15, 240, -189, 14, -14, -34, 123, -107, 100, -82, -14, 39, 6, 9, 124, 8, 126, 124, -51, -81, 32, -90, 88, 92, -19, 40, -152, 68, -26, -89, -63, 131, 57, 71, 222, 94, 21, -18, -30, -54, 118, -126, -31, 5, -32, -81, -102, 199]
5642A99j71m5J2R2L5l0q0K29k79p8J70j01R8j87N6N5J21j19m1J84k7j04q5K71
5666A75j02J8P7n9m1Lj5j02J45j09p2J54k9J6k25J72R1q0m0m0J93j20J8qO2j00
5692a8K9J18n7pj66J58o5n1o9J50p0J56k16n1K35R5l30J33l7L3l4Q6J46k63k8
5717a23P5q7J47M6k1p3P6q8J3J5N7q2N0J16o2n3qr4P9O1o1O0m9J49j00J05k46
5744i8J42j0j17Q6oJ5R0j2j32J6qJ05j30M4r6R6J72j27j42J49r6J59j07k24J21
5769a10K65j8q2m6n4J4M3k7k6N8n5j9O1J05Pj10J3j17J9K18k23J34J07j76k1P7
5795C7K6j8ro2M1Rk9M3n3m4l3K84k57NN6j12r4M84l69K3J74J2j52r0J57j48J37
5822A8Q0j80LJ52k49K03j97J46m6k1Q4o1J58j15K9R8k6j46Q2M3j03M7n3J36j99
$$ y = [199, 28, -17, -5, 87, 122, 92, 12, 241, -38, -116, 54, -47, 51, -136, -80, -25, 96, -23, -64, 120, 93, -11, -96, 175, 73, 91, 168, 109, 68, 71, 56, -46, 99, -10, -82, 72, 43, 59, -166, 6, 97, 17, -23, -63, 130, 10, 28, 20, 82, -18, 11, 129, 72, 65, -101, 57, -8, -59, -128, 22, -48, 108, -108, -159, 76, 171, -159, -26, -63, -30, -64, 22, 168, -95, -123, -48, -135, 12, 58, 37, -36, 40, -48, -35, -20, 37, -45, 5, 121, 59, 6, -2, -96, -17, 44, -17, 43, -6, 143, 43, 148, -98, 44, 34, -83, 3, -3, 12, 102, 90, -42, -26, -34, 71, -59, -15, -111, -15, 157, 30, -112, 37, -59, 100, -7, -231, -110, 155, 137, 55, 9, -45, -31, 12, -15, -41, 17, -38, -57, 4, 109, 116, 6, 19, -98, -79, 139, -84, 50, 157, -19, -40, 37, 63, 45, 36, -26, 15, 24, -5, 38, -15, -59, -92, 192, -65, -60, -4, -116, -210, 274, -95, -72, 102, 114, -38, -128, 29, -119, 18, 98, -82, -79, 73, -176, 27, -170, -24, -70, -91, -7, -68, 90, -25, 4, 102, 76, -70, 12, 55, -48, -1, -54, 82, -117]
5847a17N6J41r8r1J51r8K05o2n1J4lN2N0j41M8P7k06J61k79m0L83o8j38L4j34
5872a54O8K16j38L0k9rQ0mJ01qk32K7J22p2R0o8L1p3J66k05N9K7R0j70J08K7n0
5899C0Kp3M8l9J52r5nm7J94j79P4L5l4qn9J3O0j3O7j34J93l41J36J38j59J49j93
5926h8j74L9J04J84nO4j80L86l53J25q8J12k94J28k0O6j09Q0Q8n7J8J89k59J43
5950I9p9r8q5J9J72N4Q6m46K87j02j14J36J69L2o4j20J67k39J08j88K19J29j36
5973FM8p1r1q6J34Q4k4O6K4j99p5J08j50J97L6N1k7k8l2r5QR7o9J99j09j66J77
6000A3j6j11M0N0K14j88n4p4J51l1j68M51k56j16M5j27K04Ll3J22r1J2q2J4O0
6025C2j38J04P0r6J51m4j37L8J69P2k56j41J28rR7L3j45J24j07R7j05j7Q6J1P9
$$ y = [-117, -61, 80, -18, -109, 42, -56, 149, 87, 36, 50, 47, 99, 149, 8, 56, 133, -73, 88, -191, -231, 152, 84, -54, -20, -154, -86, 130, -8, 22, -7, -16, 64, 60, 161, 153, -79, -52, 70, -2, 88, 20, 51, -22, 144, -61, -2, 25, 115, -55, 53, 80, 30, 32, -41, 7, -32, 120, 25, 20, -27, 167, -12, 62, 97, 63, 55, -4, 9, 69, 56, 123, -11, 182, -159, -23, 115, -44, 105, -88, -262, -223, -119, 65, 60, 124, -56, 330, -23, 102, 14, 126, -168, -40, -60, 6, -103, -23, 65, 8, 26, 215, -44, 99, 20, -78, -163, -144, 28, 82, 168, -278, 9, -93, -207, -71, 98, 130, 66, -54, 113, -126, -18, -206, 13, 142, 6, 54, -17, -108, -194, -60, 24, 0, 66, 90, -109, -184, -76, -226, -29, 7, 58, 31, 3, -29, -124, -116, -19, -88, 111, 2, -164, 13, -3, -114, -74, -24, 190, 2, -52, -126, 25, -6, -174, 277, 21, -95, -50, -177, 27, 30, -3, 119, 28, 40, -42, -28, 32, -106, -2, 68, -28, 123, 79, -58, -20, 149, 221, -35, -176, -48, -57, 40, 73, -72, 52, -55, 42, -63, -80, 6, 17, 96]
6050I6o2p8o4J92n3m4P6l4K1n2P9j4n7J36j18k07L11M9j80M2q9l0J01L9k52J28
6076f4K22j71MJ17j59p3RK23j01Q6j47J31PK8r9j6l4N5j39J92J07k66P4Q1n0q
6102Ik4N9P6j13o6O6k23P7J80N0j49L7k2j4plL2K14k59KJ11mL4p2P5J69k87L7
$$ y = [96, 34, -44, -108, 84, 31, -13, 63, 29, 50, -2, 77, 63, 6, 142, 24, -183, 128, 177, -3, 39, -50, -80, 21, 60, -192, -64, 158, -13, -9, 108, -51, -124, -115, 108, 7, 93, -54, 77, 84, 112, 13, -3, -37, 18, -121, 71, 178, -88, -14, 67, 17, 9, -15, 44, 120, 7, -59, 7, -216, -139, 41, 91, -58, -21, -43, -57, -64, -67, -35, 179, -80, -78, 33, 29, 63, -9, 66, 235, -52, -15]
$$ [...]
8191E
##END NTUPLES=NMR FID
##END=
