##TITLE=1H_Pr 3-5066-d
 DMSO,8 sc, 
 23.9.2021
##JCAMPDX= 6.0         $$ Bruker NMR JCAMP-DX V2.0
##DATA TYPE= NMR FID
##DATA CLASS= NTUPLES
##ORIGIN= UXNMR, Bruker Analytische Messtechnik GmbH
##OWNER= root
$$ XWIN-NMR		Version 3.5
$$ Thu Sep 23 12:29:29 2021 Russian Standard Time (UT+4h)  she@DPX200
##.OBSERVE FREQUENCY= 200.1314
##.OBSERVE NUCLEUS= ^1H
##.DELAY= (6, 6)
##.ACQUISITION MODE= SIMULTANEOUS
##.ACQUISITION SCHEME= undefined
##.AVERAGES= 8
##.DIGITISER RES= 18
##SPECTROMETER/DATA SYSTEM= spect
##.PULSE SEQUENCE= zg30
##.SOLVENT NAME= DMSO
##.SHIFT REFERENCE= (INTERNAL, DMSO, 0, 15.7039)
##AUDIT TRAIL= $$ (NUMBER, WHEN, WHO, WHERE, WHAT)
$$ ##TITLE= Audit trail, XWIN-NMR		Version 3.5
$$ ##JCAMPDX= 5.01
$$ ##ORIGIN= Bruker BioSpin GmbH
$$ ##OWNER= she
$$ F:/spectra/data/she/nmr/H-F/1/audita.txt
$$ ##AUDIT TRAIL=  $$ (NUMBER, WHEN, WHO, WHERE, WHAT)
(   1,<2021-09-23 12:28:10.00 +0400>,<she>,<DPX200>,
      <created by zg, POWCHK disabled, PULCHK disabled
       configuration hash MD5:
       00 E9 B6 7A A2 85 ED C7 34 08 36 98 17 FE 4E 26
       data hash MD5: 16K
       28 75 48 33 6B 24 3E 0F B0 67 51 67 6C EC E5 9A>)
$$ ##END=
$$ 
$$ hash MD5
$$ BD 0F 9D 13 AD 66 07 FC D0 3D 76 24 3D E5 22 FF
##$RELAX= 
##$RELAX= 
##$RELAX= 
##$RELAX= 
##$RELAX= 
##$RELAX= 
$$ Bruker specific parameters
$$ --------------------------
##$DU= <F:/spectra>
##$EXPNO= 1
##$NAME= <H-F>
##$PROCNO= 1
##$TYPE= <nmr>
##$USER= <she>
##$AMP= (0..31)
100 100 100 100 100 100 100 100 100 100 100 100 100 100 100 100 100 100 
100 100 100 100 100 100 100 100 100 100 100 100 100 100 
##$AQSEQ= 0
##$AQ_mod= 1
##$AUNM= <au_zg>
##$AUTOPOS= <>
##$BF1= 200.13
##$BF2= 200.13
##$BF3= 200.13
##$BF4= 200.13
##$BF5= 200.13
##$BF6= 200.13
##$BF7= 200.13
##$BF8= 200.13
##$BYTORDA= 1
##$CFDGTYP= 0
##$CFRGTYP= 5
##$CHEMSTR= <none>
##$CNST= (0..31)
1 1 145 1 1 1 1 1 1 1 1 1 1 1 1 1 1 1 1 1 1 1 1 1 1 1 1 1 1 1 1 1 
##$CPDPRG= <>
##$CPDPRG1= <>
##$CPDPRG2= <>
##$CPDPRG3= <>
##$CPDPRG4= <mlev>
##$CPDPRG5= <mlev>
##$CPDPRG6= <mlev>
##$CPDPRG7= <mlev>
##$CPDPRG8= <mlev>
##$CPDPRGB= <>
##$CPDPRGT= <>
##$D= (0..31)
0 1.2 0 0 0 0 0 0 0 0.06 0 0.03 0 0 0 0 0.0002 0 0 0 0 0 0 0 0 0 0 0 0 
0 0 0 
##$DATE= 1632385689
##$DBL= (0..7)
120 120 120 120 120 120 120 120 
##$DBP= (0..7)
150 150 150 150 150 150 150 150 
##$DBP07= 0
##$DBPNAM0= <>
##$DBPNAM1= <>
##$DBPNAM2= <>
##$DBPNAM3= <>
##$DBPNAM4= <>
##$DBPNAM5= <>
##$DBPNAM6= <>
##$DBPNAM7= <>
##$DBPOAL= (0..7)
0.5 0.5 0.5 0.5 0.5 0.5 0.5 0.5 
##$DBPOFFS= (0..7)
0 0 0 0 0 0 0 0 
##$DE= 6
##$DECBNUC= <off>
##$DECIM= 32
##$DECNUC= <off>
##$DECSTAT= 4
##$DIGMOD= 1
##$DIGTYP= 9
##$DL= (0..7)
0 120 120 120 120 120 120 120 
##$DP= (0..7)
150 150 150 150 150 150 150 150 
##$DP07= 0
##$DPNAME0= <>
##$DPNAME1= <>
##$DPNAME2= <>
##$DPNAME3= <>
##$DPNAME4= <>
##$DPNAME5= <>
##$DPNAME6= <>
##$DPNAME7= <>
##$DPOAL= (0..7)
0.5 0.5 0.5 0.5 0.5 0.5 0.5 0.5 
##$DPOFFS= (0..7)
0 0 0 0 0 0 0 0 
##$DQDMODE= 0
##$DR= 18
##$DS= 0
##$DSLIST= <SSSSSSSSSSSSSSS>
$$ [...]
##$SUBNAM2= <"">
##$SUBNAM3= <"">
##$SUBNAM4= <"">
##$SUBNAM5= <"">
##$SUBNAM6= <"">
##$SUBNAM7= <"">
##$SUBNAM8= <"">
##$SUBNAM9= <"">
##$SW= 20.0188988654967
##$SWIBOX= (0..15)
0 0 2 0 0 0 0 0 0 0 0 0 0 0 0 0 
##$SW_h= 4006.41025641026
##$TD= 16384
##$TD0= 1
##$TE= 0
##$TE2= 300
##$TE3= 300
##$TEG= 300
##$TL= (0..7)
0 120 120 120 120 120 120 120 
##$TP= (0..7)
150 150 150 150 150 150 150 150 
##$TP07= 0
##$TPNAME0= <>
##$TPNAME1= <>
##$TPNAME2= <>
##$TPNAME3= <>
##$TPNAME4= <>
##$TPNAME5= <>
##$TPNAME6= <>
##$TPNAME7= <>
##$TPOAL= (0..7)
0.5 0.5 0.5 0.5 0.5 0.5 0.5 0.5 
##$TPOFFS= (0..7)
0 0 0 0 0 0 0 0 
##$TUNHIN= 0
##$TUNHOUT= 0
##$TUNXOUT= 0
##$USERA1= <user>
##$USERA2= <user>
##$USERA3= <user>
##$USERA4= <user>
##$USERA5= <user>
##$V9= 5
##$VALIST= <valist>
##$VCLIST= <CCCCCCCCCCCCCCC>
##$VD= 0
##$VDLIST= <DDDDDDDDDDDDDDD>
##$VPLIST= <PPPPPPPPPPPPPPP>
##$VTLIST= <TTTTTTTTTTTTTTT>
##$WBST= 1024
##$WBSW= 4
##$XGAIN= (0..3)
0 0 0 0 
##$XL= 0
##$YL= 0
##$YMAX_a= 61506
##$YMIN_a= -116363
##$ZGOPTNS= <>
##$ZL1= 120
##$ZL2= 120
##$ZL3= 120
##$ZL4= 120
##$ABSF1= 10
##$ABSF2= 0
##$ABSG= 5
##$ABSL= 3
##$ALPHA= 0
##$AQORDER= 0
##$ASSFAC= 0
##$ASSFACI= 0
##$ASSFACX= 0
##$ASSWID= 0
##$AUNMP= <proc_1d>
##$AZFE= 0.1
##$AZFW= 0.1
##$BCFW= 1
##$BC_mod= 2
##$BYTORDP= 1
##$COROFFS= 0
##$CY= 11.3945322036743
##$DATMOD= 1
##$DC= 2
##$DFILT= <>
##$DTYPP= 0
##$F1P= 2.36226072786647
##$F2P= -0.459571619588291
##$FCOR= 0.5
##$FTSIZE= 0
##$FT_mod= 4
##$GAMMA= 1
##$GB= 0.15
##$INTBC= 1
##$INTSCL= 1
##$ISEN= 128
##$LB= 0.24
##$LEV0= 0
##$LPBIN= 0
##$MAXI= 10000
##$MC2= 0
##$MEAN= 0
##$ME_mod= 0
##$MI= 1.114404
##$NCOEF= 0
##$NC_proc= 0
##$NLEV= 6
##$NOISF1= 3.799351
##$NOISF2= 2.8
##$NSP= 1
##$NTH_PI= 0
##$NZP= 0
##$OFFSET= 15.70392
##$PC= 1
##$PHC0= -14073.7
##$PHC1= 8.80088
##$PH_mod= 1
##$PKNL= yes
##$PPARMOD= 0
##$PSCAL= 0
##$PSIGN= 0
##$REVERSE= no
##$SF= 200.130013532006
##$SI= 16384
##$SIGF1= 3
##$SIGF2= 2
##$SINO= 400
##$SIOLD= 16384
##$SREGLST= <1H.CDCl3>
##$SSB= 0
##$STSI= 0
##$STSR= 0
##$SW_p= 3612.71676300578
##$SYMM= 0
##$S_DEV= 0
##$TDeff= 0
##$TDoff= 0
##$TI= <>
##$TILT= no
##$TM1= 0
##$TM2= 0
##$TOPLEV= 0
##$USERP1= <user>
##$USERP2= <user>
##$USERP3= <user>
##$USERP4= <user>
##$USERP5= <user>
##$WDW= 1
##$XDIM= 8192
##$YMAX_p= 0
##$YMIN_p= 0
$$ End of Bruker specific parameters
$$ ---------------------------------
##NTUPLES= NMR FID
##VAR_NAME=  TIME,          FID/REAL,        FID/IMAG
##SYMBOL=    X,             R,               I
##VAR_TYPE=  INDEPENDENT,   DEPENDENT,       DEPENDENT
##VAR_FORM=  AFFN,          ASDF,            ASDF
##VAR_DIM=   8192,          8192,            8192
##UNITS=     SECONDS,       ARBITRARY UNITS, ARBITRARY UNITS
##FACTOR=    0.0002496,     1,               1
##FIRST=     0,             0,               0
##LAST=      2.0444736,     0,               0
##MIN=       0,             -116363,         0
##MAX=       2.0444736,     61506,           0
$$ Real data points
##PAGE= N=1
##DATA TABLE= (X++(R..R)), XYDATA
$$ plain form
0 0 0 0 0 0 0 0 0 0 0 0 0 0 0 0 -8 8 -8 8 -8 10 -16 16 -20 24 -27 32 -40 43 -49 57 -65 75 -87 97 -111 123
36 123 -139 155 -175 195 -217 241 -267 297 -328 363 -398 439 -486 535 -589 650 -714 791 -874
55 -874 965 -1073 1193 -1335 1501 -1700 1943 -2252 2650 -3192 3974 -5220 7499 -13095 61506
70 61506 25660 -76331 -5582 53374 52909 -5234 -11516 18046 26764 8028 16842 9008 2600
83 2600 13234 9990 -17728 -23235 1727 40139 22947 -37652 -42184 9873 24920 879 -27398
96 -27398 -31918 -11921 -3401 -8932 -2624 -8441 -17820 -10121 -12165 -18107 -5869 -2308 -8324 -14134 -18310
111 -18310 -2654 13714 3592 -2676 -6021 -16155 -4370 14230 10185 1490 -4581 925 16586
124 16586 11956 4298 16387 10466 -6866 -406 13642 21348 14744 -1538 4598 14892 2776
$$ packed form
0@%%%%%%%%%%%%%%qJ6j6J6j6J8k6L2l6M4n1N9p2Q3r2J06j22J40j62J84k08K34
36A23k62K94l30L70m12M58n08N64o25O91p61Q37r25J021j124J239j364J505j665
55h74J839k038K266k528K836l201L643m195M902n842P166r194J2719k0594P4601
70F1506l5846j01991P0749N8956m65n8143o282K9562Q718j8736Q814p834o408
83B600J0634l244k7718n507K4962L8412j7192o0599m532N2057J5047k4041k8277
96b7398m520J9997Q520n531O308n817r379P699k044n942J2238L561o016n810m176
111a8310J5656J6368j0122o268l345j0134J1785J8600m045q695o071N506J5661
124A6586m630p658J2089n921j7332O460J4048P706o604j6282O136J0294j2116
$$ plain form
137 2776 3220 13002 4060 -5707 -6081 187 11310 5815 -5038 489 -4033 -12757 -1655 2029 -6889
152 -6889 -11176 -12302 -3656 3463 -6615 -6932 -662 -10851 -13516 -4156 -1656 385 -3793 -8751 1038
167 1038 2874 -3670 2100 1420 -5960 -2484 -444 1856 8881 4387 1480 4044 -69 5345 12796
182 12796 2477 -2339 2898 4050 8188 7355 2467 8112 5159 -4828 -143 3484 1133 2248 -3349
197 -3349 -4569 3840 2156 -211 1149 -6125 -6504 -796 -5246 -3760 692 -4039 -3580 -4187 -6748 1034
213 1034 -199 -9712 -6072 -2786 -3320 878 -1512 -2535 3383 -359 -1717 3149 99 172 3264 -2428
229 -2428 33 6615 4047 5245 3204 -2409 3373 4883 321 3915 3196 469 5406 3964 2980 6480
245 6480 544 -1579 2707 -1360 -1151 3032 -209 -130 88 -4634 -176 2116 -4485 -3605 -4121 -6318 42
$$ packed form
137B776M44R782q942r767l74O268J1123n495j0853N527m522q724J1102L684q918
152f889m287j126Q646P119j0078l17O270j0189k665R360K500K041m178m958R789
167A038J836o544N770o80p380L476K040K300P025m494k907K564m113N414P451
182A2796j0319m816N237J152M138q33m888N645k953r987M685L627k351J115n597
197c349j220Q409j684k367J360p274l79N708m450J486M452m731M59o07k561P782
213A034j233r513L640L286n34M198k390j023N918l742j358M866l050P3L092n692
229b428K461O582k568J198k041n613N782J510m562L594p19k727M937j442r84L500
245F480n936k123M286m067K09M183l241P9K18m722M458K292o601Q80n16k197O360
$$ plain form
262 42 -347 -4402 -903 -2536 -4469 -1025 -4842 -4915 532 -3889 -4889 -298 -1137 2164 2306 -4076 -677
279 -677 2150 -1807 1554 2465 -573 4059 2740 470 5310 3161 -98 2907 59 891 6009 1611
295 1611 1705 5037 1138 2159 3558 -478 2511 2663 -3352 -107 1612 -222 2068 -1502 -4033 1064
311 1064 -1242 -4004 -632 -3102 -2817 632 -3585 -2174 1707 -2614 -2365 -1973 -5615 -1180 261 -4362
327 -4362 -815 85 -2479 754 -862 -2707 2088 -114 -2221 2542 668 793 4032 369 1574 4421
343 4421 -186 999 2887 -381 2228 3029 -93 3300 3554 -453 2372 1384 -459 3403 54 -2016
359 -2016 2684 603 -551 2133 -1521 -690 635 -3859 -2192 338 -2776 -810 -534 -3406 406 260
375 260 -3540 -401 -1448 -3412 -83 -1853 -2509 1517 -839 -1911 1177 -1599 -329 1428 -2397 -490
$$ packed form
262D2l89m055L499j633j933L444l817p3N447m421j000M591q39L301J42o382L399
279f77K827l957L361R11l038M632j319k270M840k149l259L005k848Q32N118m398
295A611R4L332l899J021J399m036K989J52o015L245J719j834K290l570k531N097
311A064k306k762L372k470K85L449m217J411L881m321K49L92l642M435J441m623
327d362L547R00k564L233j616j845M795k202k107M763j874J25L239l663J205K847
343D421m607J185J888l268K609Q01l122L393K54m007K825r88j843L862l349k070
359b016M700k081j154K684l654Q31J325m494J667K530l114J966K76k872L812j46
375B60l800L139j047j964L329j770o56M026k356j072L088k776J270J757l825J907
$$ plain form
391 -490 2093 -1245 1504 2819 -45 3098 1959 -1247 2376 1554 -735 2504 965 412 3862 353
407 353 -258 2985 -103 241 1873 -1039 1198 2937 -943 668 1570 -1325 1068 -483 -3255 368
423 368 -341 -2845 308 -993 -2226 1143 -2295 -2210 974 -2171 -1903 666 -2100 -372 1295 -2207
439 -2207 134 915 -2381 -493 -459 -2353 1550 285 -1752 2337 847 -156 2350 -576 -125 3346
455 3346 -287 -27 2658 242 1632 2231 -1288 1093 1831 -1454 952 952 -1188 2068 764 -949 2140
472 2140 457 -1070 1762 -939 -1229 1233 -1522 -534 1816 -1432 -947 644 -2543 -276 508 -2661
488 -2661 9 329 -2041 962 -516 -1776 1430 -488 -2053 491 -1256 -819 1461 -1625 -345 2001
504 2001 -1047 -191 1181 -1531 1230 1293 -1500 1138 1631 -639 1847 793 -786 2149 -210 -1016
$$ packed form
391d90K583l338K749J315k864L143j139l206L623q22k289L239j539n53L450l509
407C53o11L243l088L44J632k912K237J739l880J611R02k895K393j551k772L623
423C68p09k504L153j301j233L369l438Q5L184l145K68K569k766J728J667l502
439b207K341P81l296J888L4j894L903j265k037M089j490j003K506k926M51L471
455C346l633K60K685k416J390N99l519K381P38l285K406%k140L256j304j713L089
472B140j683j527K832k701k90K462k755R88K350l248M85J591l187K267P84l169
488b661K670L20k370L003j478j260L206j918j565K544j747M37K280l086J280K346
504B001l048Q56J372k712K761O3k793K638M93k270K486j054j579K935k359q06
$$ plain form
520 -1016 2122 -308 -540 2291 -103 837 2109 -832 562 1842 -1249 675 837 -1921 1021 603
536 603 -1816 729 -643 -1863 1000 -1246 -2095 1013 -753 -1103 915 -1503 -232 1349 -2120 -853
552 -853 677 -2057 -411 466 -1972 886 242 -2089 1041 296 -1298 1270 -295 -427 2724 -176
568 -176 -221 2392 -404 180 1703 -1245 304 1445 -1097 1068 1178 -852 1683 1082 -968 1359 400
585 400 -809 1978 364 -930 1683 -158 -132 1746 -1370 -475 1072 -1619 -385 783 -1897 290
601 290 663 -1846 160 -373 -1707 787 -202 -2106 383 -484 -754 983 -1582 -1554 1312 -1461 -1086
618 -1086 829 -1146 588 1079 -1170 732 888 -562 1654 928 -1020 1675 546 -498 2003 232
634 232 -186 1813 -53 -362 1547 -698 458 1604 -775 651 993 -1226 848 986 -1826 140
$$ packed form
520a016L138k430k32K831k394R40J272k941J394J280l091J924J62k758K942m18
536F03k419K545j372j220K863k246q49L108j766l50K018k418J271J581l469J267
552h53J530k734J646Q77k438K858o44k331L130p45j594K568j565j32L151k900
568a76m5K613k796N84J523k948J549J141k542K165J10k030K535o01k050K327r59
585D00j209K787j614j294K613j841K6J878l116Q95J547k691J234J168k680K187
601B90L73k509K006n33j334K494r89j904K489q67k70J737k565K8K866k773L75
618a086J915j975J734M91k249J902J56j450K216p26j948K695j129j044K501j771
634B32m18J999j866l09J909k245J156J146k379J426L42k219K074J38k812J966
$$ plain form
650 140 -93 -1669 477 -565 -1630 1006 -604 -1224 707 -1166 -870 1038 -1360 -462 974 -1394
666 -1394 -216 305 -1955 -167 205 -2035 352 -211 -1192 965 -160 -1097 1580 -19 -259 2107 -96
683 -96 129 1878 -168 441 2112 -445 846 1561 -882 675 1408 -730 1457 764 -689 1503 438
700 438 -640 1219 -236 -915 1014 -641 -682 690 -1717 -798 570 -2130 -674 250 -1901 -368 -136
717 -136 -1882 301 78 -1679 449 -538 -1357 823 -660 -1292 714 -956 -863 1550 -958 26 1110
734 1110 -1050 401 1182 -984 1264 1459 -477 1359 976 -570 2167 763 -530 1444 -165 -314
750 -314 1789 -84 -272 1733 -773 201 1338 -877 46 785 -1123 280 133 -1491 512 -490 -1812
767 -1812 264 -690 -1749 168 -1186 -1380 418 -1263 -1043 687 -1241 -512 794 -1476 -171 550
$$ packed form
650A40k33j576K146j042j065K636j610o20J931j873K96J908k398Q98J436k368
666a394J178N21k260J788L72k240K387n63r81K157j125r37K677j599k40K366k203
683i6K25J749k046O09J671k557J291P15k443J557P33k138K187o93j453K192j065
700D38j078J859j455o79J929j655m1J372k407R19J368k700J456R24k151J533K32
717a36j746K183k23j757K128r87q19K180j483o32K006j670R3K413k508R84J084
734A110k160J451P81k166K248J95j936J836l83j546K737j404j293J974j609j49
750c14K103j873j88K005k506R74J137k215R23P39j908J403j47j624K003j002j322
767a812K076r54j059J917j354j94J798j681K20J730j928P29J306k270J305P21
$$ plain form
783 550 -1344 7 223 -1008 1035 398 -906 1671 401 -298 1854 254 384 1870 93 268 1738
800 1738 -113 692 1394 -569 631 1296 -579 867 880 -1097 1105 372 -936 1002 -62 -1150 1089
817 1089 -312 -840 718 -1124 -877 165 -1670 -615 6 -1834 -578 -89 -1771 -113 11 -1588
833 -1588 367 2 -1441 870 -104 -1133 594 -494 -655 1256 -723 150 1496 -635 357 1186 -324
850 -324 899 1486 -307 1077 1500 -382 1585 914 -428 1224 267 -606 1418 52 -545 983 -723
867 -723 -622 873 -867 46 1019 -1048 -96 205 -1478 -77 92 -1702 162 -689 -1972 400 -660
884 -660 -1271 667 -1032 -1079 566 -963 -706 1009 -678 114 1147 -724 492 992 -761 1023 778
901 778 -407 1168 761 -380 1525 755 -270 1548 416 201 1710 257 100 1411 -766 -178 1104
$$ packed form
783E50j894J351K16j231K043o37j304K577j270o99K152j600J30J486j777J75J470
800A738j851Q05P02j963J200O65j875J446J3j977K202p33j308J938j064j088K239
817A089j401n28J558j842K47J042j835J055O21j840J256M89j682J658J24j599
833a588J955l65j443K311r74j029J727j088j61J911j979Q73J346k131R92Q29j510
850c24J223N87j793J384M23j882J967o71j342J652r57q73K024j366n97J528j706
867g23J01J495j740R13R73k067R52L01j683J401J69j794J864q51j283K372j060
884f60o11J938j699m7J645j529K57J715j687P92J033j871J216N00j753J784k45
901G78j185J575m07j141J905p70j025J818j132k15J509j453j57J311k177N88J282
$$ plain form
918 1104 -886 -110 665 -1454 54 250 -1356 425 -319 -1176 553 -585 -1411 355 -879 -1192 262
935 262 -1507 -723 64 -1176 -502 462 -1461 -142 391 -1287 273 395 -1040 1040 661 -786 1463
952 1463 268 -369 1307 156 518 1799 -59 443 1720 -261 647 1820 -122 1082 1197 -404
968 -404 1043 1096 -648 941 359 -817 865 -154 -795 578 -909 -1122 493 -993 -516 409 -1417
985 -1417 -798 -110 -1545 -561 -2 -1530 -141 -319 -1738 -342 -272 -1478 464 -737 -1131 775 -541
1002 -541 -464 1038 -263 -57 1457 -514 318 1236 -501 612 993 -524 1044 1076 -442 1037 819
1019 819 -323 1561 795 134 1586 135 -65 1130 -245 21 990 -474 -2 537 -1129 -426 -157
1036 -157 -1515 -201 -173 -1419 62 -143 -1438 179 -388 -1098 293 -1078 -900 445 -1083 -800 -176
$$ packed form
918A104j990P76P75k119J508J96j606J781p44q57J729j138q26J766j234l13J454
935B62j769P84P87j240O74R64j923J319N33j678J560J22j435K080l79j447K249
952A463j195o37J676j151L62J281j858N02J277j981R08J173j942J204J15j601
968d04J447N3j744J589n82j176J682j019o41J373j487k13J615j486M77R25j826
985a417O19O88j435R84N59j528J389j78j419J396P0j206J942j201l94J906j316
1002e41P7J502j301K06J514j971Q32R18j737J113L81j517J568L2j518J479k18
1019H19j142J884p66o61J452j451k00J195j375K66R69j464M72N39j666P03K69
1036a57j358J314K8j246J481k05j295J617n67p10J391j371J78J345j528K83O24
$$ plain form
1053 -176 -1185 -277 422 -1384 126 620 -902 510 236 -383 888 466 -331 1177 503 -408 1382
1070 1382 -9 -128 1105 -173 94 1202 -466 565 1119 -436 460 783 -575 633 730 -758 630
1087 630 -27 -892 738 -474 -944 146 -915 -778 352 -1183 -576 291 -1099 -87 647 -1320 -145
1104 -145 367 -1080 80 -7 -974 458 248 -956 660 -134 -564 825 -197 -287 1057 -153 311 962
1122 962 -372 477 1145 -307 502 925 -804 654 568 -664 1014 332 -818 759 128 -640 824
1139 824 -336 -313 668 -543 -92 719 -1260 -348 326 -1170 -117 -11 -1347 -179 233 -829 578
1156 578 -22 -758 817 -406 -806 710 -603 -669 635 -778 -290 748 -700 263 921 -651 270
1173 270 632 -542 1207 805 -372 879 401 -370 1297 238 -414 969 2 -282 825 -308 110
$$ packed form
1053a76j009R08O99j806J510M94j522J412k74o19J271m22p97J508o74r11J790
1070A382j391j19J233j278K67J108j668J031N54j555Q96L23j358J208R7j488J388
1087F30o57q65J630j212m70J090j061J37J130j535O07Q67j390J012P34j967J175
1104a45N12j447J160q7r67J432k10j204J616p94m30J389j022r0J344j210M64O51
1122I62j334Q49O68j452Q09M23j729J458q6j232J678o82j150J577o31p68J464
1139H24j160K3R81j211M51Q11j979R12O74j496J053J06j336J168M12j062J407
1156E78o00p36J575j223m00J516j313o6J304j413M88J038j448R63O58j572R21
1173B70L62j174J749m02j177J251m78p71J667j059o52J383r67k84J107j133M18
$$ plain form
1190 110 791 -674 43 669 -652 318 339 -1161 686 97 -718 240 -399 -1161 250 -505 -1054 243
1208 243 -671 -707 537 -942 -442 465 -634 225 600 -519 458 919 -502 570 382 -678 445 320
1226 320 -242 844 -83 -285 1030 -237 205 940 -295 169 1074 -441 149 699 -577 293 470 -786
1244 -786 517 348 -716 529 63 -493 326 -358 -492 596 -391 -369 568 -721 -564 462 -951 -94
1262 -94 209 -1219 -79 -21 -1089 289 154 -590 578 -27 -452 585 -118 5 1105 -190 -89 922
1280 922 -427 -121 724 -507 100 330 -360 648 708 -657 730 521 -193 940 248 -157 650 10
1298 10 -298 811 -488 -399 631 -740 -389 589 -711 296 279 -834 369 56 -703 368 109 -1145
1316 -1145 524 -11 -784 201 -355 -654 238 -451 -566 356 -325 12 356 -373 -23 679 -759 183 532
$$ packed form
1190A10O81j465P17O26j321R70K1j500J847n89q15R58o39p62J411p55n49J297
1208B43r14l6J244j479N00R07j099Q59L75j119R77M61j421J072j88j060J123j25
1226C20n62J086r27k02J315j267M42P35j235M64R05j515N90N50j276Q70J77j256
1244g86J303j69j064J245m66n56Q19o84j34J088r87K2R37j289J57J026j413Q57
1262i4L03j428J140N8j068J378j35p44J168o05m25J037p03J23J100j295J01J011
1280I22j349L06Q45j231O07K30o90J008O0j365J387k09p14J133o92m05Q07o40
1298A0l08J109j299Q9J030j371L51R78j300J007j7j113J203l13p59J071k59j254
1316a145J669n35p73R85n56k99Q92o89j15R22o81L37L44p29L50P02j438R42L49
$$ plain form
1335 532 -350 526 280 -789 754 175 -451 669 -107 -330 880 77 -10 979 -322 245 853 -330
1353 -330 333 635 -712 136 222 -874 170 218 -885 456 -42 -649 415 -248 -515 669 -478 -343
1371 -343 686 -636 -234 141 -807 -408 113 -801 -13 298 -689 187 -46 -577 498 31 -348 557 92
1390 92 -343 855 -119 -123 843 -313 -68 618 -471 162 688 -336 239 434 -392 741 383 -673 620
1409 620 179 -243 773 107 -248 448 -472 -339 415 -304 -282 453 -700 78 423 -690 122 152 -874
1428 -874 398 172 -758 583 -36 -764 355 -469 -571 225 -389 -213 483 -336 -45 756 -665 -123 361
1447 361 -683 324 80 -578 706 17 -336 559 141 -63 652 -79 -73 441 91 -115 704 -291 -13 546
1467 546 -430 129 475 -461 203 -21 -823 334 140 -454 446 -105 -320 516 -242 -309 517 -521 -564 249
$$ packed form
1335E32q82Q76k46j069J543n79o26J120p76k23J210q03q7R89j301N67O08j183
1353c30O63L02j347Q48Q6j096J044M8j103J341m98o07J064o63k67J184j147J35
1371c43J029j322M02L75r48L99N21r14P88L11r87Q76k33n31J075m67l79R05m65
1390I2m35J198r74mR66j156K45O86j089O33N26j024N75J95q26J133l58j056J293
1409F20m41m22J016o66l55O96r20J33P54p19K2P35j153P78L45j113Q12L0j026
1428h74J272k26r30J341o19p28J119q24j02P96o14J76O96q19K91Q01j421N42M84
1447C61j044J007k44o58J284o89l53Q95m18k04P15p31ON14l50k06Q19r95K78N59
1467E46r76N59L46r36O64k24q02J157j94n94R00n51k15Q36p58o7Q26j038m3Q13
$$ plain form
1487 249 -442 -255 488 -773 -81 264 -594 -64 -79 -678 347 20 -558 726 74 -264 441 62 -294
1506 -294 718 -241 -109 500 -449 -129 649 -29 304 505 -315 485 464 -319 568 595 -278 558 15 -232
1526 -232 765 -262 -277 407 -386 -133 435 -283 -72 369 -479 186 155 -482 309 140 -472 281 -47 -444
1546 -444 403 -201 -556 54 -390 -353 481 -397 -596 408 -232 49 413 -164 94 560 -283 409 11 -637
1566 -637 351 72 -196 650 -173 -249 390 28 -420 233 -259 -97 781 -110 278 435 -353 -71 421 -368
1586 -368 207 230 -659 235 201 -351 129 -101 -280 429 -194 -410 398 -567 -224 237 -623 -159 281 -391 -102
1607 -102 140 -723 -23 27 -333 317 -138 -486 585 -117 -164 606 36 -241 462 -91 -61 557 -153 95 414
1628 414 -348 312 420 -486 609 450 -255 437 472 -210 521 4 -201 484 -41 -218 500 -203 -96 250
$$ packed form
1487B49o91J87P43j261O92L45q58N30j5n99J025l27n78J284o52l38P05l79l56
1506b94J012r59J32O09r49L20P78o78L33K01q20Q00k1p83Q87K7q73Q36n43k47
1526b32R97j027j5O84p93K53N68p18K11M41q48O65l1o37P91j69o12P53l28l97
1546d44Q47o04l55O10m44L7Q34q78j99J004o40K81L64n77K58M66q43O92l98o48
1566f37R88k79k68Q46q23p6O39l62m48O53m92J62Q78q91L88J57p88K82M92p89
1586c68N75K3q89Q94l4n52M80k30j79P09o23k16Q08r65L43M61q60M64M40o72K89
1607a02K42q63P00N0l60O50m55l48J071p02m7P70n70k77P03n53L0O18p10K48L19
1628D14p62O60J08r06J095j59p05O92L5o82P31n17k05O85n25j77P18p03J07L46
$$ plain form
1648 250 -621 -169 -82 -813 142 273 -591 -83 -9 -669 51 -170 -552 165 -177 -436 539 -421 -225 577 -273
1669 -273 70 526 -454 -156 419 -354 161 427 -466 510 145 -592 563 199 -392 462 14 -44 840 -215
1689 -215 91 575 198 127 572 -219 -7 252 -369 372 182 -475 290 63 -507 45 75 -271 84 -155 -373
1710 -373 632 -172 -228 237 -192 -165 260 -95 40 54 -604 175 61 -632 246 219 -565 324 96 -301 450
1731 450 14 2 633 39 19 439 -187 -210 275 -267 223 259 -217 476 232 -500 610 323 -194 478 -83
1752 -83 -314 571 117 -423 285 34 -121 362 -180 -154 194 -483 9 143 -429 388 295 -540 101 -109 -475
1773 -475 195 -232 -173 312 -70 -433 211 -254 -179 617 -147 98 174 -220 187 259 -326 139 426 -385 398
1794 398 283 -505 229 -30 -327 414 -386 -22 638 -284 28 410 -374 42 284 -117 92 352 -383 104
$$ packed form
1648B50q71M52Q7p31R55J31q64N08P4o60P20k21l82P17l42k59R75r60J96Q02q50
1669b73L43M56r80K98N75p73N15K66q93R76l65p37J155l64n91Q54m48n8Q84j055
1689b15L06M84l77p1M45p91K12K59o21P41j90o57P65k27n70N52L0l46L55k39k18
1710c73J005q04n6M65m29K7M25l55J35J4o58P79j14o93Q78k7p84Q89k28l97P51
1731D50m36j2O31n94k0M20o26k3M85n42M90L6m76O93k44p32J110k87n17O72n61
1752h3k31Q85m54n40P08k51j55M83n42K6L48o77M92J34n72Q17r3q35O41k10l66
1773d75O70m27N9M85l82l63O44m65P5P96p64K45P6l94M07P2n85M65K87q11P83
1794C98j15p88P34k59k97P41q00L64O60r22L12L82p84M16K42m01K09K60p35M87
$$ plain form
1814 104 281 -670 138 -281 -461 237 -89 -261 299 -183 -338 321 -84 -321 356 -422 -216 115 -690 15
1834 15 110 -405 -24 27 -517 369 307 -687 133 33 -278 377 171 -97 457 -42 36 443 -259 -174 478 -341
1856 -341 273 279 -322 -4 205 -369 268 163 -300 343 -37 -426 161 52 -351 345 -230 -196 248 -517 -293
1877 -293 67 -624 -28 117 -687 -82 244 -371 149 186 -273 131 47 -565 412 -228 -488 397 -144 -382 308
1898 308 -293 34 162 -245 172 83 2 203 346 -194 99 158 -79 518 58 -333 380 -7 -168 72 -412
1919 -412 -357 428 -317 -31 122 -391 -129 -4 -132 94 260 -329 57 136 -463 204 -109 -151 169 -129 -293
1940 -293 320 -204 -159 675 -138 -30 262 -253 161 264 -147 39 230 -642 100 68 -300 514 -86 -167 363
1961 363 -211 -169 701 -93 -24 272 -138 253 353 -659 6 281 -617 179 80 -406 181 177 -192 324 -195
$$ packed form
1814A04J77r51Q08m19j80O98l26j72N60m82j55O59m05k37O77p78K06L31q05P05
1834A5R5n15L81N1n44Q86o2r94Q20j00l11O55k06k68N54m99P8M07p02Q5O52q19
1856c41O14Oo01L18K09n74O37j05m63O43l80l89N87j09m03O96n75L4M44p65K24
1877b93L60o91N96J45q04O05L26o15N20L7m59M04q4o12R77o40k60Q85n41k38O90
1898C08o01L27J28m07M17q9q1K01J43n40K93N9k37N97m60l91P13l87j61K40m84
1919d12N5P85p45K86J53n13K62J25j28K26J66n89L86P9n99O67l13m2L20k98j64
1940b93O13n24M5Q34q13J08K92n15M14J03m11J86J91q72P42l2l68Q14o00q1N30
1961C63n74M2Q70p94O9K96m10L91J00j012O65K75q98P96r9m86N87ml69N16n19
$$ plain form
1982 -195 -266 345 -49 -299 186 -239 -205 273 -313 -309 350 -277 -66 340 -321 196 -102 -386 185 130 -178 335
2004 335 -226 -44 281 -173 -173 430 -35 -306 507 -136 98 307 -321 158 231 -359 95 -26 -226 34 -87
2025 -87 -266 322 -9 -160 36 -254 -84 231 -232 83 578 -253 86 235 -498 18 178 -470 101 250
2045 250 -473 -119 -179 -330 -65 110 -217 308 -29 32 466 -403 150 613 -340 -308 29 -302 245 325 -262
2066 -262 128 -65 -450 320 127 -96 548 145 -672 414 -41 80 498 -208 -43 182 -401 121 351 -316
2086 -316 -25 281 -330 309 295 4 341 138 -219 270 -35 -44 297 -150 -146 251 -138 -19 364 -359 -74 502
2108 502 -76 158 286 -91 571 25 -127 65 187 70 105 -158 73 219 -10 -300 275 -221 -46 529
2128 529 -398 61 527 -15 172 176 -119 -177 -55 -503 30 223 -305 164 -327 -160 191 -85 -351 440 -282
$$ packed form
1982a95p1O11l94k50M85m25L4M78n86MO59o27K11M06o61N17k98k84N71n5l08N13
2004C35n61J82L25m54%O03m65k71Q13o43K34K09o28M79P3n90M54j21k00K60j21
2025h7j79N88l31j51J96k90J70L15m63L15M95q31L39J49p33N16J60o48N71J49
2045B50p23L54o0j51K65J75l27N25l37O1M34q69N53M63r53L2L37l31N47Q0n87
2066b62L90j93l85P70j93k23O44m03q17J086m55J21M18p06J65K25n83N22K30o67
2086c16K91L06o11O39j4k91L37k03l57M89l05rL41m47ML97l89J19L83p23K85N76
2108E02n78K34J28l77O62n46j52J92J22j17L5k63K31J46k29k90N75m96J75N75
2128E29r27M59M66n42J87Mk95n8J22m48N33J93n28M69m91J67L51k76k66P91p22
$$ plain form
2149 -282 13 281 -232 195 272 -332 -142 112 -307 140 -23 -343 245 -168 -328 173 -36 165 237 -51 88
2170 88 590 -19 -191 193 -245 279 117 -490 64 103 -136 26 73 -263 418 182 -292 304 249 -384 168
2191 168 -129 -86 217 -191 157 108 -262 -112 -19 -287 -86 380 -446 -65 111 -211 167 -95 -300 210 83
2212 83 -419 47 -48 78 327 -222 136 267 -337 -18 159 12 -20 240 -531 204 108 -240 196 353 -386
2233 -386 530 -82 -402 -20 -437 -105 411 -332 62 390 -247 238 37 -396 339 403 -268 -60 275 -107
2253 -107 322 130 -117 318 -229 -241 110 -176 202 184 -43 -226 479 -353 -226 180 -166 107 -45 -209 119
2274 119 48 -288 298 -12 -584 -9 -163 -66 381 -9 92 203 -75 99 81 -341 -163 367 -353 131 137 -45
2296 -45 334 53 -214 52 109 -174 201 -46 -484 64 -105 -244 329 -162 -131 138 -280 141 -47 -286 51
$$ packed form
2149b82K95K68n13M27P7o04J90K54m19M47j63l20N88m13j60N01k09K01P2k88J39
2170H8N02o09j72L84m38N24j62o07N54L9k39J62M7l36O81k36m74N96n5o33N52
2191A68k97M3L03m08L48m9l70J50R3k68K01M66q26L81J76l22L78k62k05N10j27
2212H3n02M66r5J26K49n49L58J31o04L19J77j47l2K60p71P35r6l48M36J57p39
2233c86R16o12l20L82m17L32N16p43L94L28o37M85k01m33P35O4o71K08L35l82
2253a07M29j92k47M35n47j2L51k86L78j8k27j83P05q32J27M06l46K73j52j64L28
2274A19p1l36N86l10n72N75j54R7M47l90J01J11k78J74j8m22J78N30p20M84Oj82
2296d5L79k81k67K66N7k83L75k47m38N48j69j39N73m91L1K69m18M21j88k39L37
$$ plain form
2317 51 160 -126 394 -156 -152 23 80 -343 214 84 -359 106 -187 -118 372 -17 9 144 -450 -368 150 -357
2339 -357 141 147 -294 66 -167 -227 394 40 -47 434 12 92 198 -464 -19 35 -205 21 252 -212 245 58
2361 58 -267 232 291 -442 9 255 -300 244 135 -259 99 238 -334 354 -127 -152 459 -11 -349 53 148
2382 148 52 178 -240 133 207 -212 278 52 -113 131 0 -275 369 -215 -173 281 118 -43 233 -25 43
2403 43 377 -146 -147 -24 -191 35 140 -162 194 8 -181 113 44 -194 294 -288 -263 581 47 -50 -97 -478
2425 -478 -35 221 -472 28 186 -316 170 19 -116 256 -88 -191 231 -139 -156 41 -94 -282 373 -118
2445 -118 -233 215 -402 -99 6 -26 -192 344 -27 189 115 -153 403 333 -125 285 65 -261 -8 166 -147
2466 -147 168 -219 -192 185 -334 62 207 -424 81 186 -120 -55 161 -50 -7 -36 -151 9 -51 -112 64 -263
$$ packed form
2317E1J09k86N20n50MJ75N7m23N57j30m43M65k93O9M90l89K6J35n94Q2N18n07
2339c57M98Om41L60k33o0O21l54q7M81m22Q0J06o62M45N4k40K26K31m64M57j87
2361E8l25M99N9p33M51K46n55N44j09l94L58J39n72O88m81k5O11m70l38M02R5
2382A48r6J26m18L73P4m19M90k26j65K44j31k75O44n84M2M54j63j61K76k58O8
2403D3L34n23jJ23j67K26J05l02L56j86j89K94o9k38M88n82K5Q44n34r7m7l81
2425d78M43K56o93N00J58n02M86j51j35L72l44j03M22l70j7J97j35j88O55m91
2445a18j15M48o17L03J05l2j66N36l71K16p4k68N56p0m58M10k20l26K53J74l13
2466a47L15l87K7L77n19L96J45o31N05J05l06O5K16k11M3k9j15J60o0o1J76l27
$$ plain form
2488 -263 -297 449 -17 -255 348 -57 242 376 -163 269 157 -210 218 -235 42 299 103 -159 114 -95
2508 -95 -151 114 -22 -185 391 66 -99 226 83 -4 280 -85 -74 92 -200 150 -116 -312 46 40 -355 -13
2530 -13 154 -189 225 55 -58 117 36 -72 110 -246 -225 122 -192 71 114 -272 259 29 -219 215 103
2551 103 -162 22 36 -131 264 -151 -311 445 32 -60 409 -355 -61 314 -84 122 35 -253 129 -165 37
2572 37 239 48 -77 239 -12 -208 249 -41 -193 312 -48 -87 162 50 -28 214 -237 5 30 -147 -61 218
2594 218 -126 120 -111 -340 181 139 -321 101 -141 -251 133 -170 151 437 74 64 266 -148 52 8 -264
2615 -264 121 211 -255 -24 150 -201 -125 281 -59 171 -88 27 277 -348 73 194 39 218 84 -334 189
2636 189 194 -260 220 259 -65 220 184 -207 74 -93 16 418 27 -385 27 -64 -225 544 -242 -40 211 -143
$$ packed form
2488b63l4P46m66k38O03m05K99J34n39M32j12l67M28m53K77K57j96k62K73k09
2508i5n6K65j36j63N76l25j65L25j43q7K84l65J1J66k92L50k66j96L58ol95L42
2530a3J67l43M14j70j13J75q1j08J82l56K1L47l14K63M3l86N31k30k48M34j12
2551A03k65J84J4j67L95m15j60P56m13r2M69p64K94L75l98K06q7k88L82k94K02
2572C7K02j91j25L16k51j96M57k90j52N05l60l9K49j12p8K42m51K42K5j77Q6K79
2594B18l44K46k31k29N21m2m60M22k42j10L84l03L21K86l63j0K02m14K00m4k72
2615b64L85R0m66K31J74l51P6M06l40K30k59J15K50o25M21J21j55J79j34m18N23
2636A89Nm54M80L9l24K85l6l91K81j67J09M02l91m12M12r1j61P69p86K02K51l54
$$ plain form
2658 -143 -118 125 -87 25 -136 -178 126 101 -196 113 -123 102 199 196 -16 220 31 114 254 -291 -105 119
2680 119 99 56 14 -325 -62 -181 -251 118 -76 15 -26 -313 -106 235 -27 -154 375 -29 -80 120 -325 29
2702 29 307 -10 318 129 -23 190 99 -86 24 352 -74 -7 -182 63 106 11 -125 455 -141 72 67 -179
2724 -179 10 192 -360 -26 229 -262 3 76 -280 276 105 -112 56 245 -69 110 45 -293 207 -126 183
2745 183 262 -203 13 182 -261 240 203 -250 1 -19 -43 64 30 -87 153 91 -192 86 103 -16 209 -146
2767 -146 -187 84 -88 126 365 -134 19 290 -199 124 -3 -130 103 204 -172 -56 136 -105 425 -88
2787 -88 -76 120 -149 -304 230 -149 -182 109 -218 -166 165 -208 110 99 -317 34 -204 -423 80 163 16 343
2809 343 165 -242 237 -58 -285 -152 -354 -27 42 -59 245 261 21 11 -85 -209 -171 46 70 -53 205 -297
$$ packed form
2658a43K5K43k12J12j61m2L04k5k97L09k36K25R7lk12K36j89Q3J40n45J86K24
2680A19k0m3m2l39K63j19p0L69j94R1m1k87K07L41k62j27N29m04n1K00m45L54
2702B9K78l17L28j89j52K13r1j85J10L28m26O7j75K45M3r5j36N80n96K13nk46
2724a79J89J82n52L34K55m91K65P3l56N56j71k17J68J89l14J79o5l38N00l33L09
2745A83P9m65K16J69m43N01l7m53K51k0k4J07l4j17K40o2k83K78J7j19K25l55
2767a46m1K71j72K14K39m99J53K71m89L23j27j27K33J01l76J16J92k41N30n13
2787h8J2J96k69j55N34l79l3K91l27N2L31l73L18j1m16L51k38k19N03Q3j47L27
2809C43j78m07M79k95k27J33k02L27O9j01L04J6k40j0r6j24L8K17K4j23K58n02
$$ plain form
2831 -297 111 -258 8 394 -77 234 34 -54 23 282 -71 -99 67 -329 172 -107 -371 225 -106 -149 203
2852 203 -65 -272 252 53 -144 102 -111 1 39 29 -162 -102 14 152 100 -100 101 111 -283 38 53 -192
2874 -192 -208 -66 9 358 -191 -69 -19 -121 -184 233 -12 240 258 -106 -12 89 -374 17 191 -258 53 -193
2896 -193 -123 163 -8 90 -29 42 71 135 -121 -24 69 187 132 222 -175 -34 157 -259 255 90 -144 321 -79
2919 -79 -141 38 -97 -166 -58 -36 13 297 -13 -236 412 -103 -24 104 -28 110 135 -258 -125 149 -342 86
2941 86 -38 -191 -164 111 -470 124 -214 -194 327 62 -8 215 -75 -119 261 -278 57 161 -137 -15 342 -226
2963 -226 109 59 0 -156 -247 -3 239 64 -145 431 79 -9 581 -96 -135 96 -81 0 66 -434 -168 207
2985 207 -428 143 -266 -159 175 34 -314 -210 -108 -109 201 -253 -87 -31 -153 -58 137 -223 88 -27 69 -22
$$ packed form
2831b97M08l69K66L86m71L11k00q8P7K59l53k8J66l96N01k79k64N96l31m3L52
2852B03k68k07N24j99j97K46k13J12L8j0j91O0J16J38n2k00K01J0l94L21J5k45
2874a92j6J42P5L49n49J22N0j02o3M17k45K52J8l64R4J01m63L91J74m49L11k46
2896a93P0K86j71R8j19P1K9O4k56R7R3J18n5R0l97J41J91m16N14j65k34M65m00
2919g9o2J79j35o9J08K2M9K84l10k23O48n15P9J28j32J38K5l93J33K74m91M28
2941H6j24j53K7K75n81N94l38K0N21k65p0K23k90m4L80n39L35J04k98J22L57n68
2963b26L35n0n9j56r1K44K42j75k09N76l52q8N90o77l9K31j77Q1O6n00K66L75
2985B07o35N71m09J07L34j41l48J04J02jL10m54J66N6j22R5J95l60L11j15R6r1
$$ plain form
3007 -22 -140 102 170 -25 -172 299 157 -167 52 -18 -182 156 -214 116 262 -313 -231 23 -371 63 -171
3028 -171 -189 115 83 -171 25 -76 -90 -27 -83 -155 239 -108 -299 257 -202 -169 -49 -381 58 215 -193 -76
3050 -76 1 -340 -89 21 -101 29 126 -2 260 -256 -267 280 88 -221 3 -88 124 228 -7 -99 76 -1
3072 -1 158 271 -32 320 -18 -183 87 104 -128 126 56 -169 274 55 112 -9 321 -30 25 -96 -82 -66 -108
3095 -108 -200 41 -168 64 225 38 -28 -170 -101 234 65 -118 104 -23 85 299 -183 317 -218 -179 -27
3116 -27 189 114 -276 -88 -63 13 174 -46 -96 346 -155 259 38 39 253 25 -27 140 26 -194 175 -42 109
3139 109 269 -80 284 196 12 423 -112 -292 -36 -243 -176 154 -81 -47 110 51 80 279 -160 -68 192 -53
3161 -53 200 -129 -60 291 85 -197 323 192 -159 -20 -66 -232 300 276 -236 231 -111 -137 130 -122 -69 144
$$ packed form
3007b2j18K42O8j95j47M71j42l24K19p0j64L38l70L30J46n75Q2K54l94M34k34
3028a71j8L04l2k54J96j01j4O3n6p2L94l47j91N56m59L3J20l32M39J57m08J17
3050g6P7l41K51J10j22J30R7j28K62n16j1N47j92l09K24r1K12J04k35r2J75p7
3072aJ59J13l03L52l38j65K70J7k32K54p0k25M43k19N7j21L30l51N5j21J4J6m2
3095a08r2K41k09K32J61j87o6j42O9L35j69j83K22j27J08K14m82N00n35L9J52
3116b7K16p5l90J88K5P6J61k20n0M42n01M14k21JK14k28n2J67j14k20L69k17J51
3139A09J60l49L64q8j84M11n35j80K56k07O7L30k35L4J57n9K9J99m39R2K60k45
3161e3K53l29O9L51k06k82N20j31l51J39m6j66N32k4n12M67l42k6K67k52N3K13
$$ plain form
3183 144 -179 23 108 -88 112 49 -275 -90 -106 -340 109 -245 -207 -63 36 -73 50 154 -35 267 46 -193
3205 -193 174 -287 286 203 -472 -154 95 -76 101 64 -112 182 -115 -352 18 -96 -14 140 -242 17 230
3226 230 229 -20 208 -89 -203 -34 -98 -58 10 -275 221 170 -263 276 194 -273 126 144 -18 -35 111 -130 122
3249 122 -124 10 216 -53 185 139 -286 86 85 -309 251 46 -242 285 172 -101 -117 257 -134 163 -221
3270 -221 64 159 189 236 -190 109 -15 41 -2 113 20 -40 -287 34 -168 394 161 -304 41 10 -69 38 -7
3293 -7 153 116 -132 -58 357 -40 164 -57 -259 182 -152 14 139 190 -241 4 164 -45 -26 67 28 285 -237
3316 -237 -247 167 -332 -343 119 55 -105 290 -53 226 95 -628 90 48 -184 -1 -31 -31 -132 -203 -338 138 64
3339 64 -57 133 -58 -99 365 -162 -204 252 -221 59 -41 -258 -156 317 -141 215 -109 86 264 -159 -9
$$ packed form
3183A44l23K02Q5j96K00o3l24J85j6k34M49l54L8J44R9j09J23J04j89L02k21k39
3205a93L67m61N73q3o75L18K49j71J77l7j76K94k97k37L70j14Q2J54l82K59K13
3226B30jk49K28k97j14J69o4M0O8k85M96n1m33N39q2m67L99J8j62j7J46k41K52
3249A22k46J34K06k69K38m6m25L72jl94N60k05k88N27j13k73j6L74l91K97l84
3270b21K85R5L0M7m26K99j24N6m3J15r3o0k47L21k02N62k33m65L45l1p9J07m5
3293gJ60l7k48P4M15l97K04k21k02M41l34J66J25N1m31K45J60k09J9R3l9K57n22
3316b37j0M14m99j1M62o4j60L95l43K79j31p23P18m2k32J83l0%j01p1j35M76p4
3339F4j21J90j91m1M64n27m2M56m73K80j00k17J02M73m58L56l24J95J78m23J50
$$ plain form
3360 -9 33 -30 -52 166 -116 -53 145 157 306 369 -202 -94 47 -56 -27 -128 -228 169 73 -180 -32 32 -113 73
3384 73 -187 -71 131 3 268 71 -199 -30 79 -401 112 116 -70 217 208 -187 100 -23 103 43 -268 -156
3406 -156 234 -90 -105 287 55 -159 16 132 7 222 -245 -224 -16 -96 9 -82 -107 -24 -51 -276 30 -49 107
3429 107 130 -86 -267 -42 -99 -98 -9 8 23 59 -236 281 322 16 -162 88 0 -68 -43 -286 -39 -14 -208 -25
3453 -25 103 -139 225 -325 -109 -50 127 -79 84 -43 209 -194 -12 446 -39 -68 161 88 -99 246 -87
3474 -87 -7 -93 -133 -22 -120 -172 -14 288 -69 -122 132 -60 200 -43 -90 -8 -19 -101 -2 -175 -30 3 71 -307 279
3499 279 9 -113 243 39 -191 102 -108 207 -12 129 133 -64 61 -116 100 -399 -55 -62 -82 171 68 133
3521 133 66 -70 13 108 218 162 -53 -22 59 79 -252 288 143 -58 -71 168 -75 70 -70 -38 -237 -95 247
$$ packed form
3360iM2o3k2K18k82O3J98J2J49O3n71J08J41j03K9j01j00L97r6k53J48O4j45J86
3384G3k60J16K02j28K65j97k70J69J09m80N13Mj86K87rl95K87j23J26o0l11J12
3406a56L90l24j5L92k32k14J75J16j25K15m67K1K08q0J05r1k5Q3k7k25L06p9J56
3429A07K3k16j81K25n7JQ9J7J5L6k95N17M1l06j78K50q8o8K5k43K47K5j94J83
3453b5J28k42L64n50K16N9J77k06J63j27K52m03J82M58m85k9K29p3j87L45l33
3474h7Q0q6m0J11r8n2J58L02l57n3K54j92K60k43m7Q2j1q2R9j73J45L3O8l78N86
3499B79k70j22L56k04k30K93k10L15k19J41Mj97J25j77K16m99L44pk0K53j03O5
3521A33o7j36Q3R5J10n6k15L1Q1K0l31N40j45k01j3K39k43J45j40L2j99J42L42
$$ plain form
3544 247 -226 -33 -250 30 -151 -114 142 -287 -75 103 -37 75 -264 -141 89 211 -142 115 -74 -340
3564 -340 -56 173 -364 192 267 -152 170 19 64 61 -256 5 181 -221 -98 -55 163 66 187 18 -64 196
3586 196 180 359 -10 -185 -229 -88 -33 8 -263 -152 -103 -308 -160 61 -91 -26 -185 -48 88 31 -251 -39
3608 -39 -205 -342 168 -175 -47 56 84 268 -103 -91 102 93 171 163 41 -142 -51 255 12 110 -281 -88 23
3631 23 -66 -21 137 -173 -214 38 -101 -180 80 33 -158 186 -294 52 124 -251 124 -31 -108 -38 115 28 221
3654 221 -366 -186 41 -29 -110 144 104 -41 -280 -243 -14 251 -239 -87 43 -247 -187 -17 -279 -10 200 192
3676 192 -69 -164 -157 247 79 -160 228 94 178 135 -208 -4 -66 -86 -16 50 23 19 -225 167 -15 68 -214 37
3700 37 92 255 55 -385 -145 -154 -187 -181 0 -77 286 30 -115 281 233 158 -153 19 -146 -146 -20 132 -52 24
$$ packed form
3544B47m73J93k17K80j81L7K56m29K12J78j40J12l39J23K30J22l53K57j89k66
3564c40K84K29n37N56P5m19L22j51M5ll17K61J76m02J23M3K18r7J21j69q2K60
3586A96j6J79l69j75m4J41N5M1k71J11M9k05J48K21j52O5j59J37J36n7k82K12
3608c9j66j37N10l43J28J03K8J84l71J2J93rP8qj22j83R1L06k43R8l91J93J11
3631B3q9M5J58l10m1K52j39p9K60m7j91L44m80L46P2l75L75j55p7P0J53q7J93
3654B21n87J80K27p0q1K54m0j45k39L7K29K65m90J52J30k90O0J70k62K69K10q
3676A92k61r5PM04j68k39L88j34Q4m3l43K04o2k0P0O6k7mk44L92j82Q3k82K51
3700C7N5J63k00m40K40rl3OJ81p7L63k56j45L96m8p5l11J72j65%J26J52j84P6
$$ plain form
3724 24 -201 -72 -270 -272 214 92 19 -239 -204 200 31 -160 62 117 110 61 95 11 330 78 4 27 14 117 168
3749 168 -247 24 243 -305 -54 -59 -30 -89 101 -337 69 -51 -243 185 85 -20 69 69 -19 90 22 -14 115
3772 115 -23 143 145 45 123 202 -13 -2 -128 44 -110 247 -49 13 -38 165 -161 252 166 101 61 148 369 170
3796 170 -6 133 -23 -34 97 12 172 89 -38 -70 87 -23 65 -80 -61 -332 -183 243 216 167 8 -7 74
3819 74 -39 3 -21 -363 25 -22 -116 -40 -132 115 64 -189 -74 429 35 111 -158 -192 40 97 9 254 -42 -82
3843 -82 244 36 169 -24 -20 231 231 45 6 -24 144 -33 26 188 52 8 -7 1 47 -299 3 8 -224 105 -52
3868 -52 -79 161 101 -156 172 33 -8 -56 -140 -70 -28 59 -74 -44 -84 -17 45 351 -86 -102 10 203 13 -319 297
3893 297 -161 -52 -15 105 -21 -82 -157 -278 205 -69 53 71 -43 70 49 -95 -24 -195 -192 -142 100 -56 -45
$$ packed form
3724B4k25J29j98kM86j22p3k58L5M04j69j91K22N5pm9L4q4L19k52p4K3j3J03N1
3749A68m15K71K19n48K51nK9n9J90m38M06j20j92M28j00j05Q9%q8J09o8l6J29
3772A15j38J66Kj00P8P9k15J1j26J72j54L57k96O2n1K03l26M13q6o5m0Q7K21j99
3796A70j76J39j56j1J31q5J60q3j27l2J57j10Q8j45J9k71J49M26k7m9j59j5Q1
3819G4j13M2k4l42L88m7r4P6r2K47n1k53J15N03l94P6k69l4K32N7q8K45k96m0
3843h2L26k08J33j93MK51%j86l9l0J68j77N9J62j36m4j5QM6l46L02Nk32L29j57
3868e2k7K40o0k57L28j39m1m8q4P0M2Q7j33L0m0O7O2L06m37j6J12J93j90l32O16
3893B97m58J09L7J20j26o1p5j21M83k74J22J8j14J13k1j44P1j71LN0K42j56J1
$$ plain form
3916 -45 -100 -55 -20 -356 -130 256 -208 75 85 -263 229 -85 -143 -136 91 133 -47 191 74 77 -306 -156 281 54
3940 54 -16 112 15 28 47 -91 202 -164 10 26 59 17 203 20 -165 4 -27 4 94 -19 58 -13 31 62 -115
3965 -115 -108 55 -216 -97 -170 206 36 -166 -66 -15 -20 128 -137 -102 -386 -66 4 -145 -34 -118 -91 464 -60
3988 -60 -205 213 64 63 -29 -61 167 -72 -337 -53 134 31 -54 -29 -90 86 140 -49 -124 80 -77 66 18 -289
4012 -289 122 1 25 56 -65 -230 284 37 -99 84 -181 166 196 -211 -11 74 36 198 -79 -116 122 154
4034 154 94 -25 1 -119 10 151 -173 81 -171 119 -111 -77 -121 15 151 -5 245 -89 40 46 -287 113
4056 113 -14 -150 6 -110 -235 41 11 164 143 88 91 122 -105 -64 -15 180 -271 219 -189 200 -127 162 127
4079 127 -32 173 -110 58 -269 246 -161 -164 -34 -142 -151 -283 90 56 68 -11 -143 57 -308 -18 -65 -39 121
$$ packed form
3916d5n5M5L5l36K26L86m64K83J0l48M92l14n8PK27M2j80K38j17Ll83J50M37k27
3940E4p0J28r7J3J9j38K93l66J74J6L3m2J86j83j85J69l1L1R0j13P7p1M4L1j77
3965a15PJ63k71J19p3L76j70k02J00N1nJ48k65L5k84L20P0j49J11q4K7N55n24
3988f0j45M18j49jr2l2K28k39k65K84J87j03q5K5o1J76N4j89p5K04j57J43m8l07
4012b89M11j21K4L1j21j65N14k47j36J83k65L47L0m07K00Q5l8J62k77l7K38L2
4034A54o0j19K6j20J29J41l24K54k52K90k30L4m4J36J36j56K50l34J29Ol33M00
4056A13j27j36J56j16j25K76l0J53k1n5LL1k27M1M9J95m51M90m08L89l27K89l5
4079A27j59K05k83J68l27N15m07lJ30j08rj32L73l4J2p9j32K00l65K90m7K6J60
$$ plain form
4102 121 91 -152 140 156 20 75 132 -228 49 -261 118 -93 59 24 -107 -59 0 204 -62 40 -75 -205
4124 -205 66 165 273 204 257 124 112 85 -436 117 -194 29 -56 18 -84 4 -8 -189 38 -178 58 -18 -5 -286
4148 -286 -46 -252 168 16 83 130 94 33 -13 23 -131 94 272 -224 180 -53 -94 205 -46 -157 53 121 -60
4171 -60 245 -159 204 93 -99 -18 161 -433 92 38 -91 226 -72 -324 88 140 139 47 -217 -281 243 -168 -22
4194 -22 2 147 -26 237 15 39 -58 26 -116 -103 -22 -71 -89 -80 228 87 135 25 -304 152 164 -286 40 9 -59
4219 -59 -111 -76 -28 -32 -137 -112 -162 -8 252 152 28 -141 370 255 -226 -58 -41 -9 -55 -111 -48 -378 53 74 31
4244 31 -38 50 -45 -14 91 -139 4 189 123 -166 -86 80 -99 47 102 120 78 -40 144 308 -60 -186 337
4267 337 -108 64 -86 13 334 168 39 168 -221 -114 166 -126 -8 99 19 -511 65 -133 70 -121 -204
$$ packed form
4102A21l0k43K92J6j36N5N7l60K77l10L79k11J52l5j31M8N9K04k66J02j15j30
4124b05K71R9J08o9N3j33j2k7n21N53l11K23q5P4j02Q8j2j81K27k16K36p6J3k81
4148b86K40k06M20j52O7M7l6o1m6L6j54K25J78m96M04k33m1K99k51j11K10O8j81
4171f0L05m04L63j11j92Q1J79n94N25n4j29L17k98k52M12N2jr2k64o4N24m11J46
4194b2K4J45j73K63k22K4r7Q4j42J3Q1m9j8RL08j41M8j10l29M56J2m50L26l1o8
4219e9n2L5M8mj05K5n0J54K60j00j24j69N11j15m81J68J7L2m6n6O3l30M31K1m3
4244C1o9Q8r5L1J05k30J43J85o6k89Q0J66j79J46N5J8m2j18J84J64l68j26N23
4267C37m45J72j50R9L21j66j29J29l89J07K80k92J18J07q0n30N76j98K03j91q3
$$ plain form
4288 -204 214 -9 -235 -139 -66 -56 42 192 -112 36 -56 -37 -7 -24 -18 114 -15 185 83 -170 102 65 -205 -27
4312 -27 -252 83 -93 17 123 19 -216 -129 2 -69 -217 76 -15 23 13 11 27 -117 74 -153 230 -36 152
4335 152 28 -384 -53 -47 -45 23 213 31 99 -75 -117 -135 -6 -158 23 177 -117 49 39 200 179 4 44 39
4359 39 -135 223 -39 -233 -58 130 -8 -12 -8 -154 24 -83 -30 163 -216 106 -3 14 -121 -212 -231 113 0
4382 0 -204 71 41 19 54 -82 -126 153 -170 -349 -16 -226 -168 -89 -14 14 -1 153 -244 -249 25 -72 19 -220 -146
4407 -146 95 24 201 88 86 99 -208 19 137 71 -11 -12 70 27 -71 71 -143 138 -143 -239 62 12 425 -99
4431 -99 -60 28 -223 -145 23 165 -8 -64 -136 45 35 54 60 36 186 -6 6 -267 34 201 -7 -57 69 -53
4455 -53 -38 39 72 53 256 -6 24 -115 110 -88 -155 116 -123 -245 -59 22 245 -224 -179 -26 36 271 185 88
$$ packed form
4288b04M18k23k26R6P3J0R8J50l04J48r2J9L0j7OJ32j29K00j02k53K72l7k70J78
4312b7k25L35j76J10J06j04k35Q7J31p1j48K93r1L8j0kJ6j44J91k27L83k66J88
4335A52j24m12L31OKO8J90j82O8j74m2j8J29j52J81J54k94J66j0J61k1j75M0n
4359C9j74L58k62j94J75J88j38mMj46J78j07N3J93l79L22j09J7j35r1j9L44j13
4382@k04K75l0k2L5j36m4K79l23j79L33k10N8P9P5K8j5J54l97nK74r7R1k39P4
4407a46K41p1J77j13kJ3l07K27J18o6q2jQ2m3r8J42k14K81k81r6L01n0M13n24
4431i9L9Q8k51P8J68J42j73n6p2J81j0J9Ok4J50j92J2k73L01J67k08n0J26j22
4455e3J5P7L3j9K03k62L0j39K25j98o7K71k39j22J86Q1K23m69M5J53O2K35q6r7
$$ plain form
4479 88 -217 -170 189 -256 -228 -30 -143 36 277 117 -60 109 118 111 29 37 114 -168 -265 130 173 -2 97 58 322
4504 322 106 14 -177 -34 138 88 -180 -127 -16 -50 84 74 -102 25 11 -30 -123 -6 -187 63 -80 -137 -107
4527 -107 -31 148 20 37 -181 -225 225 -169 68 -27 -45 -50 -2 -141 94 344 -205 58 -29 -110 147 95 -128 -55
4551 -55 -67 101 -282 97 -55 -2 -34 -64 -18 -108 -202 42 4 -216 -106 -36 -132 204 -70 -47 -13 -89 186 -41 -157
4576 -157 115 74 7 -27 -310 155 269 -93 -64 -24 -98 -173 25 36 -34 -3 -85 -150 170 12 38 115 -101 313 -69
4601 -69 -75 47 25 -111 139 28 -20 -168 -272 137 133 -130 -82 -15 30 202 211 96 34 25 -71 85 115 -79 -49 -77
4627 -77 89 259 370 71 146 37 228 247 31 -114 -147 -40 -50 -137 130 20 -339 35 83 -62 -45 -11 -240
4650 -240 -251 189 -86 -10 80 131 140 83 258 141 -83 221 88 -171 -48 183 -232 -177 201 112 84 198 109 -54
$$ packed form
4479H8l05M7L59m45K8J98j13J79K41j60j77J69Rpq2QP7k82r7L95M3j75R9l9K64
4504C22k16r2j91J43J72n0k68N3J11l4J34j0j76J27j4m1r3J17j81K50j43n7L0
4527a07P6J79j28J7k18m4M50l94K37r5j8nM8j39K35K50n49K63q7q1K57n2k23P3
4551e5j2J68l83L79j52N3l2l0M6r0r4K44l8k20J10P0r6L36k74K3L4p6K75k27j16
4576a57K72m1o7l4k83M65J14l62K9M0p4p5J98J1p0L1q2o5L20j58K6P7k16M14l82
4601f9oJ22k2j36K50j11m8j48j04M09mk63M8O7M5J72Rj15o2rr6J56L0j94L0k8
4627g7J66J70J11k99P5j09J91J9k16j45l3J07j0q7K67j10l59L74M8j45J7L4k29
4650b40j1M40k75P6R0N1Rn7J75j17k24L04j33k59J23K31m15N5L78q9k8J14q9j63
$$ plain form
4674 -54 77 52 125 96 -15 -170 24 -218 -2 -102 -61 -114 -126 42 18 17 -18 131 19 127 90 -147 101 62
4698 62 -207 -158 -40 68 -93 -38 -38 -56 -80 -114 223 -92 -19 123 -16 72 -349 -5 5 107 21 11 82 -82 -245
4723 -245 102 113 -46 59 -163 57 202 212 -159 193 72 330 278 150 -51 184 -93 -222 -65 -32 -108 -232
4745 -232 204 -81 -25 85 -92 -150 -151 45 -136 -127 46 -148 -125 -13 -91 -143 -144 -53 -18 -16 -65 9 36 -79 42 -230
4771 -230 124 192 181 73 289 -58 -83 -88 -69 -19 -53 -268 17 128 2 -24 -46 -12 178 101 -149 -145 94 141 -140
4796 -140 -170 66 -177 -242 82 172 20 274 -84 -84 303 94 91 167 33 25 150 -282 -197 258 -113 -122 208 93
4820 93 -85 13 -322 157 -140 -133 -211 -55 -208 160 119 50 279 -195 -211 52 120 -225 262 -7 332 -51 -25
4843 -25 -63 -166 -56 64 -307 144 302 186 128 223 -42 81 -190 -271 -183 51 -134 -153 -29 -179 68 -138
$$ packed form
4674e4J31k5P3k9j11j55J94k42K16j00M1n3j2J68k4jl5J49j12J08l7k37K48l9
4698F2k69M9J18J08j61N5%j8k4l4L37l15P3J42j39Q8m21L44J0J02q6j0P1j64j63
4723b45L47J1j59J05k22K20J45J0l71L52j21K58n2j28k01K35k77j29J57L3p6j24
4745b32M36k85N6J10j77n8jJ96j81RJ73j94K3J12p8n2jR1L5Km9P4K7j15J21k72
4771b30L54O8j1j08K16l47k5nJ9N0l4k15K85J11j26k6k2L4J90p7k50MK39M7k81
4796a40l0K36k43o5L24R0j52K54l58%L87k09lP6j34qJ25m32Q5M55l71rL30j15
4820I3j78R8l35M79k97Pp8J56j53L68m1o9K29m74j6K63O8l45M87k69L39l83K6
4843b5l8j03J10J20l71M51J58j16n8R5k65J23k71q1Q8K34j85j9J24j50K47k06
$$ plain form
4865 -138 -81 -101 -216 143 -85 -54 -242 264 -193 -134 -148 -11 -4 48 -121 100 305 -194 199 -25 -279 -88 46
4888 46 -14 -50 64 126 -106 -34 -40 288 -48 91 104 -131 75 52 -174 -139 226 -70 -53 -80 243 -56 6 37 95
4913 95 -217 57 167 270 105 291 185 108 62 -107 69 -87 -8 -122 53 -125 -120 149 158 184 143 -130 0
4936 0 87 -58 -7 64 -42 127 172 -151 162 -210 -96 -77 -286 -61 31 -185 -130 -7 -27 -81 -118 -113 26 60 127
4961 127 245 24 3 31 61 -56 127 78 -226 -257 -69 -105 -33 -53 269 272 -9 -54 -202 86 62 174 -55 58
4985 58 16 104 -40 -75 227 46 -7 48 114 27 -127 237 61 -354 -46 101 170 -45 -62 127 52 64 63 -9 155
5010 155 105 163 184 13 273 0 177 -201 -46 -38 -35 175 168 -138 107 -11 -164 44 -205 24 30 -9 75 -121
5034 -121 -90 55 97 90 -39 -40 37 165 160 108 163 9 -171 -49 -40 151 -112 -140 56 197 -80 -118 30 73 290
$$ packed form
4865a38N7k0j15L59k28L1j88N06m57N9j4J37PN2j69K21K05m99L93k24k54J91J34
4888D6o0l6J14O2k32P2oL28l36J39J3k35K06k3k26L5L65k96J7k7L23k99O2L1N8
4913I5l12K74J10J03j65J86j06p7m6j69J76j56P9j14J75j78NK69RK6m1k73J30
4936@Q7j45N1P1j06J69M5l23L13l72J14J9k09K25R2k16N5J23k0n4l7NJ39L4O7
4961A27J18k21k1K8L0j17J83m9l04l1J88l6P2k0L22Lk81m5j48K88k4J12k29J13
4985E8m2Q8j44l5L02j81n3N5O6q7j54L64j76m15L08J47O9k15j7J89p5J2jp2J64
5010A55n0N8K1j71K60k73J77l78J55QLK10pl06K45j18j53K08k49K29Ol9Q4j96
5034a21L1J45M2pj29jP7J28nn2N5j54j80J22RJ91k63k8J96J41k77l8J48M3K17
$$ plain form
5059 290 -11 -96 -119 32 191 33 0 -79 89 -74 26 193 66 185 -17 -104 61 -69 3 86 80 69 -223
5082 -223 115 46 -81 -65 12 107 -55 48 -87 -64 -244 245 -136 280 191 23 123 150 -30 -85 352 -138 -67
5105 -67 117 -233 -53 82 10 112 150 157 215 -156 -62 95 -240 -49 153 -108 128 203 -408 -31 -89 20 -128
5128 -128 179 -63 -131 181 13 21 84 70 -23 -52 -222 -97 63 -178 168 192 118 332 -327 209 211 -2 -209 -56
5152 -56 7 -64 28 -243 -43 100 -104 136 115 209 98 81 -47 66 -206 20 -100 -162 79 264 -44 202 0
5175 0 170 -237 76 186 -103 12 -136 -107 30 -66 -291 -13 29 -169 -119 -24 -293 -174 138 65 -115 -66 169
5198 169 165 -183 185 -385 -126 -204 -218 -11 -134 125 311 -152 5 -41 -200 135 17 -261 187 -209 -188 -72
5220 -72 3 201 -13 430 34 -218 -178 -157 -56 -89 73 23 -160 -2 -165 -265 115 -178 -251 123 -144 133
$$ packed form
5059B90l01q5k3J51J59j58l3p9J68j63J00J67j27J19k02q7J65j30P2Q3oj1k92
5082b23L38o9j27J6P7R5j62J03j35K3j80M89l81M16q9j68J00K7j80n5M37m90P1
5105f7J84l50J80J35p2J02L8PN8l71R4J57l35J91K02k61K36P5o11L77n8J09j48
5128a28L07k42o8L12j68QO3j4r3k9j70J25J60k41L46K4p4K14o59N36Kk13k07J53
5152e6O3p1R2k71K00J43k04K40k1R4j11j7j28J13k72K26j20o2K41J85l08K46k02
5175@J70m07L13J10k89J15j48K9J37r6k25K78M2j98N0R5k69J19L12p3j80M9K35
5198A69ml48L68n70K59p8j4K07j23K59J86m63J57m6j59L35j18k78M48l96K1J16
5220g2P5J98k14M43l96k52M0K1J01l3J62n0j83J58j63j00L80k93p3L74k67K77
$$ plain form
5242 133 -18 145 217 96 83 -127 11 -130 -109 9 -143 -36 223 -47 -70 74 161 -203 -66 -152 -127 91
5264 91 109 184 -87 -33 -339 196 -142 252 59 -107 -136 117 3 48 -220 2 42 101 -17 -2 124 137 301
5287 301 -115 36 -28 -101 90 -33 -94 -125 123 -297 137 -170 -220 -146 -346 -260 6 53 -153 66 -148 87 -88
5310 -88 182 72 -74 -104 43 57 -83 76 56 -45 -24 92 74 70 -100 29 -19 -36 -58 168 231 -242 107 -44
5334 -44 -182 34 260 189 100 -204 45 202 -149 -87 -207 186 265 -254 -109 -99 -16 -9 -177 -155 32 253 -245
5357 -245 185 -20 295 75 -130 -190 111 -139 -81 135 306 145 84 -106 129 51 212 -31 -68 -135 -45 382
5379 382 -130 -68 -60 -54 112 -149 -270 58 -201 40 -63 77 -129 7 147 142 -66 -157 77 38 -54 -40 -35 -307
5403 -307 -30 -78 -46 60 248 150 -312 126 -179 64 196 -385 40 358 -26 -217 130 50 48 10 -54 64 -50
$$ packed form
5242A33j51J63P2j21j3k10J38j41K1J18j52J07K59k70k3J44Q7l64J37q6K5K18
5264I1J8P5k71N4l06N35l38L94j93j66k9K53j14M5k68K22M0N9j18J5J26J3J64
5287C01m16J51o4p3J91j23o1l1K48m20M34l07n0P4k00Q6K66M7k06K19k14K35j75
5310h8K70j10j46l0J47J4j40J59k0j01K1J16j8mj70J29m8j7k2K26O3m73L49j51
5334d4j38K16K26p1q9l04K49J57l51O2j20L93P9n19J45J0Q3Pj68K2J87K21m98
5357b45M30k05L15k20k05o0L01k50N8K16J71j61o1j90K35p8J61k43l7o7R0M27
5379C82n12O2QOJ66k61j21L28k59K41j03J40k06J36J40nk08r1K34l9r2J4Nk72
5403c07K77m8L2J06J88r8m62M38l05K43J32n81M25L18l84j91L47q0kl8o4J18j14
$$ plain form
5426 -50 -233 94 -55 109 128 -256 -245 297 -27 -130 80 98 142 -15 -35 -110 121 11 0 -64 -209 -181 -96 94
5450 94 128 -87 -91 -123 5 -24 -302 228 174 -80 -268 -160 -116 68 30 -164 -424 151 55 -43 -184 -83 1 180
5474 180 -142 76 20 -263 158 213 28 52 124 -149 -143 -6 -89 -242 157 129 -33 -100 -192 -117 -76 -130 193 -96
5498 -96 83 -21 -27 84 131 2 -144 138 -49 -107 -67 169 246 -41 258 -33 -91 63 -193 -128 100 87 11 281
5522 281 23 49 -147 -146 -7 -321 -70 60 -46 101 -175 -171 5 -79 -109 34 20 142 -20 -102 -190 -154 74 25
5546 25 153 123 27 49 130 161 1 -110 199 -3 456 39 -185 -30 75 115 -21 -295 -11 27 31 -190 233
5569 233 -204 80 121 256 -189 -228 -84 157 -235 -261 -52 -10 62 72 -126 159 221 79 -220 -150 -167 97 -67
5592 -67 -125 -85 54 -108 81 -187 131 -238 -67 -22 199 114 -62 -57 174 220 -45 45 11 46 -68 52 107 11
$$ packed form
5426e0j83L27j49J64J9l84J1N42l24j03K10J8M4j57k0p5K31j10j1o4j45K8Q5J90
5450I4L4k15ml2J28k9k78N30n4k54j88J08M4J84l8j94k60N75r6r8j41J01Q4J79
5474A80l22K18n6k83M21N5j85K4P2k73OJ37q3j53L99k8j62o7r2P5M1n4L23k89
5498i6J79j04oJ11M7j29j46K82j87n8M0K36P7k87K99k91n8J54k56O5K28j3p6K70
5522B81k58K6j96JJ39l14K51J30j06J47k76MJ76q4l0J43j4J22j62q2q8L6K28m9
5546B5J28l0r6K2Q1L1j60j11L09k02M59m17k24J55J05M0j36k74K84L8Mk21M23
5569B33m37K84M1J35m45l9J44K41l92k6K09M2P2J0j98K85O2j42k99P0j7K64j64
5592f7n8M0J39j62J89k68L18l69J71M5K21q5j76NK31M6k65R0l4L5j14J20N5r6
$$ plain form
5616 11 -162 -172 -166 -102 -264 101 -4 21 -57 -180 77 -37 -73 137 -34 197 31 -8 -60 209 349 -273 306
5639 306 31 53 -18 -39 51 -178 63 9 337 78 289 29 98 -154 -179 -42 85 190 119 -97 5 139 -83
5662 -83 -140 -10 -175 62 -24 -114 -41 1 -62 -136 54 196 106 83 -11 199 42 -64 -41 -186 290 -141 170 0
5686 0 -81 118 -320 -78 -265 30 -156 60 269 51 194 242 -38 164 -34 231 153 85 161 81 -24 133 8
5709 8 -150 63 -154 -43 112 56 -157 -11 4 -141 -134 27 -18 127 7 44 -21 -154 -81 -25 -97 13 54 -7 -263
5734 -263 -20 36 -56 79 -14 15 -9 -74 -5 -99 -174 143 -157 155 -101 -339 -123 -15 273 214 186 133 154 13
5758 13 85 -5 6 -143 -227 33 285 1 -208 79 137 -316 -189 -27 15 80 9 19 149 -39 -155 -87 231 304
5782 304 300 133 260 66 121 -83 -14 157 -53 70 40 4 211 -52 -163 165 -226 127 -5 -35 219 84
$$ packed form
5616A1j73j0OO4j62L65j05K5p8j23K57j14l6K10j71K31j66l9n2K69J40o22N79
5639C06k75K2p1k1R0k29K41n4L28k59K11k60O9k52k5J37J27J05p1k16J02J34k22
5662h3n7J30j65K37q6r0P3M2o3p4J90J42r0k3r4K10j57j06K3j45M76m31L11j70
5686@q1J99m38K42j87K95j86K16K09k18J43M8k80K02j98K65p8o8P6q0j05J57j25
5709Hj58K13k17J11J55n6k13J46J5j45PJ61m5J45j20L7o5j33P3N6p2J10M1o1k56
5734b63K43N6r2J35r3K9k4o5O9r4p5L17l00L12k56k38K16J08K88n9k8n3K1j41
5758A3P2r0J1j49q4K60K52k84k09K87N8m53J27J62M2O5p1J0J30j88j16O8L18P3
5782C04mj67J27j94N5k04O9J71k10J23l0l6K07k63j11L28l91L53j32l0K54j35
$$ plain form
5804 84 81 141 -19 -46 31 72 -67 -20 21 324 -230 96 -5 79 -19 -55 110 261 112 154 78 263 -15 30 176
5829 176 -66 86 155 -155 -281 -80 -46 90 129 -168 -95 96 -172 98 349 65 195 15 149 -38 119
5850 119 75 16 -162 -158 -251 46 86 368 14 -29 -99 -142 128 -71 159 -184 41 -147 -16 137 -71 12 -159
5873 -159 68 176 -361 -10 11 154 -221 -104 -193 110 182 -118 69 141 -46 -113 -68 -6 60 -144 76 141 -146
5896 -146 258 151 -49 -157 244 -79 -286 -85 -24 189 -29 -70 -39 -81 69 144 101 98 -137 -219 93 -145 86
5919 86 -8 170 251 -87 -131 17 123 -290 35 75 -97 12 178 111 275 155 -111 -127 -260 55 -114 130
5941 130 251 40 153 -28 -167 91 233 -54 -332 63 -61 304 188 -111 -41 186 346 212 320 222 176
5962 176 -79 -155 108 167 -174 54 2 71 329 -459 50 -99 -100 316 83 215 -246 -39 196 28 47 -117
$$ packed form
5804H4lO0j60k7P7M1j39M7M1L03n54L26j01Q4r8l6J65J51j49M2p6J85k78M5J46
5829A76k42J52O9l10j26K01L4J36L9k97P3J91k68K70K51k84J30j80J34j87J57
5850A19m4n9j78Mr3K97M0K82l54m3p0m3K70j99K30l43K25j88J31J53k08Q3j71
5873a59K27J08n37L51K1J43l75J17q9L03P2l00J87P2j87o7M5O2O6k04K20O5k87
5896a46M04j07k00j08M01l23k07K01O1K13k18m1L1m2J50P5m3lk35q2L12k38K31
5919H6r4J78Q1l38m4J48J06m13L25M0j72J09J66o7J64j20k66j6j33L15j69K44
5941A30J21k11J13j81j39K58J42k87k78L95j24L65j16k99P0K27J60j34J08r8m6
5962A76k55p6K63N9l41K28n2O9K58p88N09j49jM16k33J32m61K07K35j68J9j64
$$ plain form
5984 -117 -163 -20 -25 92 -292 125 342 -64 74 -95 64 185 98 -63 -159 0 52 45 -106 -158 302 -63 86
6007 86 -13 23 170 130 78 353 147 -96 115 -9 -260 -261 -49 211 -228 32 -64 -98 13 -55 -153 -40 61 -103
6031 -103 44 16 -18 213 -19 -114 -72 52 69 -77 31 81 103 138 -128 -94 413 96 36 -249 -27 -44 -50 62
6055 62 -71 204 75 146 203 259 -252 163 -282 203 31 -79 13 -110 121 5 158 -141 -86 -160 108 251
6077 251 -184 31 0 34 -148 57 -155 6 -107 -180 200 166 -90 130 -112 112 124 34 303 10 -18 -46 254
6100 254 -236 10 -199 -137 56 150 80 -35 34 -47 -167 -105 -46 -102 62 -192 -37 -19 -95 -122 140 -125 -93 135
6124 135 260 -21 -218 31 70 -1 35 -84 -240 -85 -3 -54 -109 214 -109 -108 -165 -236 178 62 277 41 -81
6147 -81 -80 147 -77 -51 18 61 145 -48 11 204 -120 -82 -396 -51 368 -164 15 99 -22 9 -21 -20 124 105 -1
$$ packed form
5984a17m6J43nJ17l84M17K17m06J38j69J59J21q7j61r6J59N2pj51n2M60l65J49
6007H6r9L6J47m0n2K75k06k43K11j24k51jK12K60m39K60r6l4J11o8r8J13J01j64
6031a03J47k8l4K31k32r5M2J24J7j46J08N0K2L5k66L4N07l17o0k85K22j7oJ12
6055F2j33K75j29P1N7N6n11M15m45M85j72j10R2j23K31j16J53k99N5p4K68J43
6077B51m35K15l1L4j82K05k12J61j13p3L80l4k56K20k42K24J2r0K69k93k8k8L00
6100B54m90K46k09O2J93R4p0j15O9q1j20O2N9n6J64k54J55J8p6k7K62k65L2K28
6124A35J25k81j97K49L9p1L6j19j56J55Q2n1n5L23l23Jn7p1M14j16K15k36j22
6147h1JK27k24K6O9M3Q4j93N9J93l24L8l14L45M19n32J79Q4j21L1l0JJ44j9j06
$$ plain form
6172 -1 106 80 -65 -126 -169 -50 -61 -145 126 15 -39 -90 70 -3 99 30 119 73 -87 158 71 21 -34 217 68
6197 68 -5 -114 152 -209 201 -232 -82 -168 29 25 126 -19 -231 158 0 -83 54 134 14 -65 304 -171 155
6220 155 -96 -110 -37 86 21 -72 -87 24 -53 -97 56 14 287 -300 -12 68 46 238 -81 147 164 -236 159 64
6244 64 -98 -46 110 -89 -244 -260 120 257 239 0 37 -186 -52 -247 89 31 -8 -115 -13 1 3 -94 39 -52
6268 -52 -26 74 -21 149 -12 34 98 -65 -36 -25 -279 -122 -115 -109 268 79 239 214 -371 73 48 101 -163 -91 -256
6293 -256 134 83 178 -126 53 29 192 54 127 -52 22 25 -112 155 -107 88 46 -159 -99 89 166 199 201 20
6317 20 16 32 -148 267 228 -88 60 -130 -141 -103 141 -169 53 -112 44 150 -228 142 295 61 172 9
6339 9 10 192 348 -255 -53 26 -99 71 116 27 -14 -44 -86 263 -42 -54 -57 -59 -92 414 142 -134 106 -16 194
$$ packed form
6172aJ07k6j45o1m3J19j1q4K71j11n4n1J60p3J02o9Q9m6j60K45q7n0n5K51j49
6197F8p3j09K66l61M10m33J50q6J97mJ01j45k12L89j58q3J37Q0j20p9L69m75L26
6220A55k51j4P3J23o5r3j5J11p7m4J53m2K73n87K88Q0k2J92l19K28J7m00L95r5
6244F4j62N2J56j99j55j6L80J37j8k39L7k23J34j95L36n8l9j07J02J4Kr7J33r1
6268e2K6J00r5J70j61M6O4j63K9J1k54J57POL77j89J60k5n85M44k5N3k64P2j65
6293b56L90n1R5l04J79k4J63j38P3j79P4Lj37K67k62J95m2k05O0J88P7L3Kj81
6317B0mJ6j80M15l9l16J48j90j1L8K44l10K22j65J56J06l78L70J53k34J11j63
6339IJJ82J56o03K02P9j25J70M5q9m1l0m2L49l05j2lkl3N06k72k76K40j22K10
$$ plain form
6364 194 130 -37 29 -187 -103 -163 14 -289 144 92 -133 126 -206 105 8 50 61 262 56 263 81 31 137
6387 137 -93 -8 254 139 -49 -67 44 -123 257 25 41 -98 43 -4 -256 -304 -46 16 -91 -82 -80 194 -31
6410 -31 158 62 -151 -91 87 13 -157 -267 -226 31 -127 109 -134 257 -224 -110 57 11 -23 -220 -67 19 5
6433 5 69 98 51 214 30 72 121 100 52 17 7 146 -198 -29 123 -188 39 -42 128 -48 107 -60 56 -64
6457 -64 13 -119 -33 -147 -49 -64 6 14 97 -177 191 31 -331 -61 -80 8 25 19 -97 -17 -168 173 -148 48 -142
6482 -142 -29 -175 -37 138 -251 273 71 100 -101 87 148 -83 133 -10 -33 -46 68 -479 326 -172 -252 -73
6504 -73 60 -103 -14 5 177 21 -174 46 -47 2 -1 81 -173 -124 107 27 -113 133 184 127 238 145 -262 105
6528 105 14 26 157 84 80 -58 2 -209 9 -21 51 -84 -167 -455 -48 -22 -5 237 36 -100 59 -331 -93 -86
$$ packed form
6364A94o4j67O6k16Q4o0J77l03M33n2k25K59l32L11r7M2J1K01k06K07j82n0J06
6387A37k30Q5K62j15j88j8J11j67L80k32J6j39J41m7k52m8K58O2j07RKK74k25
6410c1J89r6k13O0J78p4j70j10M1K57j58K36k43L91m81J14J67m6l4j97J53Q6j4
6433EO4K9m7J63j84M2M9k1m8l5j0J39l44J69J52l11K27q1J70j76J55j67J16j20
6457f4P7j32Q6j14R8j5P0QQ3k74L68j60l62K70j9Q8J7oj16Q0j51L41l21J96j90
6482a42J13j46J38J75l89N24k02K9k01J88O1k31K16j43k3j3J14n47Q05m98q0J79
6504g3J33j63Q9J9J72j56j95K20r3M9lQ2k54M9K31q0j40K46N1n7J11r3m07L67
6528A05r1J2J31p3mj38O0k11K18l0P2j35q3k88M07K6J7K42k01j36J59l90K38P
$$ plain form
6552 -86 -179 -82 -265 114 44 63 -240 80 130 161 -214 248 75 -264 265 189 -75 220 -39 14 -128 67 88
6575 88 -84 -150 -61 -2 -200 8 -89 17 45 134 262 -119 -178 30 186 205 25 70 34 1 -26 178 59 145 283
6600 283 74 -39 70 39 243 -253 49 -91 135 -51 -19 -128 -179 234 219 -145 2 51 103 120 410 101
6622 101 105 14 -121 42 161 -111 -87 -115 122 61 -257 137 -253 -148 176 -114 123 -14 -219 -64 139 -106
6644 -106 -82 -60 10 -61 27 106 63 -211 -69 170 36 28 -77 162 -56 128 -208 -50 -272 -130 171 60 -151
6667 -151 49 91 50 -51 -143 -22 -164 31 86 101 83 73 59 172 -187 93 -211 104 81 -211 -42 6 89 -102
6691 -102 -15 -202 159 178 323 -143 59 -41 -49 -87 -270 -29 -143 -64 -43 47 -116 -194 -136 -25 18 -309 86 -183
6715 -183 259 245 70 -88 74 149 -40 -41 -214 -149 215 -59 99 68 -118 32 197 -1 -84 -72 265 -216 -123
$$ packed form
6552h6r3R7j83L79p0J9l03L20N0L1l75M62j73l39N29p6k64K95k59N3j42J95K1
6575H8j72o6Q9N9j98K08r7J06K8Q9J28l81n9K08J56J9j80M5l6l3k7K04j19Q6J38
6600B83k09j13J09l1K04m96L02j40K26j86L2j09n1M13j5l64J47M9N2J7K90l09
6622A01Mr1j35J63J19k72K4k8K37o1l18L94l90J05L24k90K37j37k05J55K03k45
6644a06K4K2P0p1Q8P9m3k74J42K39j34qj05K39k18J84l36J58k22J42L01j11k11
6667a51K00M2m1j01r2J21j42J95N5J5j8j0j4J13l59K80l04L15k3k92J69M8Q3j91
6691a02Q7j87L61J9J45m66K02j00ql8j83K41j14P9K1R0j63p8N8J11M3l27L95k69
6715a83M42j4j75j58J62P5j89jj73O5L64k74J58l1j86J50J65j98q3J2L37m81R3
$$ plain form
6738 -123 244 -157 192 -63 59 254 -23 3 -147 -51 5 38 76 3 152 210 -42 -252 259 44 -90 92
6760 92 -107 -63 -7 141 -93 149 -26 -128 45 -54 -33 -52 -318 -21 57 -111 -229 105 -18 -32 -202 83 28
6783 28 -91 -205 115 -161 41 85 19 47 140 -260 189 62 -130 -60 -160 -175 273 -126 -323 -129 197 -12
6805 -12 126 108 142 -160 -156 253 72 -371 2 -283 8 43 -233 -226 135 150 -94 -85 -60 46 -121 125 156 55
6829 55 -45 -183 -42 21 -120 131 92 -45 118 -168 164 25 -3 -95 121 -168 -49 41 -33 -47 -1 -51 140
6852 140 -109 103 273 137 -3 -106 164 -125 54 196 106 -192 -117 47 -145 -141 73 134 -121 -106 172 -7
6874 -7 66 133 33 189 -94 -70 13 35 77 -90 -131 -2 -24 -45 44 -60 -225 -39 274 -7 -72 -41 176 8 -76
6899 -76 -157 119 5 -160 -24 37 -36 -185 135 330 80 -264 -203 93 222 -157 -101 197 239 65 117 133 -3
$$ packed form
6738a23L67m01L49k55J22J95k77K6j50R6N6L3L8p3J49N8k52k10N11k15j34J82
6760I2j99M4N6J48k34K42j75j02J73r9K1j9k66K97P8j68j18L34j23j4j70K85n5
6783B8j19j14L20k76K02M4o6K8R3m00M49j27j92P0j00j5M48l99j97J94L26k09
6805a2J38j8L4l02MM09j81m43L73k85K91L5k76PL61J5k44RK5J06j67K46L1j01
6829E5j00j38J41O3j41K51l9j37J63k86L32j39k8r2K16k89J19R0p4j4M6n0J91
6852A40k49K12J70j36j40j03K70k89J79J42r0k98P5J64j92MK14O1k55J5K78j79
6874gP3O7j00J56k83K4Q3K2M2j67m1J29k2k1Q9j04j65J86L13k81o5L1K17j68q4
6899g6q1K76j14j65J36O1p3j49L20J95k50l44O1K96J29l79N6K98M2j74N2J6j36
$$ plain form
6922 -3 -25 -56 178 -198 -156 -87 -87 200 -46 -146 182 42 -174 200 -94 40 124 -23 -53 145 -45 75 48 -46
6946 -46 156 129 -146 207 -209 -327 196 19 132 -96 -70 161 -148 80 -192 -183 231 -48 105 -209 159 213
6968 213 47 44 167 8 271 73 83 -9 -16 33 -183 129 -150 28 -5 132 129 153 46 -47 -36 -68 140 68 -32
6993 -32 214 -59 69 -10 34 -218 186 -182 164 43 -94 74 -4 -38 -102 188 -59 -148 35 -17 54 62 -87 -38
7017 -38 -211 -97 -203 44 62 -178 -10 448 187 -60 -281 -130 -70 184 113 197 -14 -270 -105 -47 91 -84
7039 -84 213 145 66 5 155 -153 168 176 73 -37 223 -200 112 -163 -189 -48 -173 139 91 -156 -35 -92 174
7062 174 95 -136 -146 -111 88 -27 -44 -240 13 94 207 175 -15 -5 248 46 -39 200 -152 246 -91 -41 -157
7085 -157 42 -239 -223 98 -76 28 119 -95 85 121 13 -39 -171 269 -112 -249 62 73 -145 263 -96 -145
$$ packed form
6922ck2l1K34l76M2O9%K87k46j00L28j40k16L74k94J34Q4j47l0J98j90J20k7r4
6946d6K02k7k75L53m16j18N23j77J13k28K6K31l09K28k72RM14k79J53l14L68N4
6968B13j66lJ23j59K63j98J0r2pM9k16L12k79J78l3J37lK4j07r3J1l2K08p2j00
6993c2K46k73J28p9M4k52M04l68L46j21j37J68p8l4o4K90k47q9J83n2P1Qj49M9
7017c8j73J14j06K47J8k40J68M58k61k47k21J51O0K54p1Q4k11k56J65N8J38j75
7039h4K97o8p9o1J50l08L21Qj03j10K60m23L12k75k6J41j25L12m8k47J21n7K66
7062A74p9k31j0L5J99j15j7j96K53Q1J13l2j90J0K53k02q5K39l52L98l37N0j16
7085a57J99k81J6L21j74J04R1k14J80L6j08n2j32M40l81j37L11J1k18M08l59m9
$$ plain form
7107 -145 -219 179 -47 -64 -136 118 -245 -33 -3 -35 -184 165 -47 256 180 -53 126 198 -28 272 97 170 229
7130 229 -107 30 -69 127 -166 -37 144 37 6 74 -136 -4 -36 153 -258 28 96 85 1 -197 4 -141
7152 -141 96 158 89 -238 84 53 -142 110 -415 86 -224 251 285 154 238 205 40 90 -35 41 20 38 187
7175 187 27 172 -81 -104 -44 112 85 96 -21 -108 334 -8 -5 -10 131 117 78 24 -39 96 -19 277 -50 -212
7199 -212 74 -3 -79 -27 -80 72 168 -21 57 -71 -194 -70 155 -88 174 -8 61 -8 -53 -31 150 -64 40
7222 40 142 -102 179 155 -170 -265 173 144 -225 1 83 -251 66 25 -22 -90 5 262 -94 -211 -89 -57 31 13
7246 13 163 -115 306 -236 218 118 -28 -123 -114 -5 80 -98 -175 260 27 -16 31 67 -195 -7 -116 -65 40
7269 40 -61 -11 24 -101 271 131 -60 -140 -65 68 -36 -3 160 67 158 4 -78 136 -178 -285 -44 3 20 -13
$$ packed form
7107a45p4L98k26j7p2K54l63K12L0l2j49L49k12L03p6k33J79P2k26L00j75P3N9
7130B29l36J37r9J96k93J29J81j07l1O8k10J32l2J89m11K86O8j1q4j98K01j45
7152a41K37O2o9l27L22l1j95K52n25N01l10M75L4j31Q4l3j65N0j25P6k1J8J49
7175A87j60J45k53k3O0J56k7J1j17q7M42l42LnJ41j4l9n4o3J35j15K96l27j62
7199b12K86p7p6N2n3J52R6j89P8j28j23J24K25k43K62j82O9o9m5K2J81k14J04
7222D0J02k44K81k4l25r5M38k9l69K26Q2l34L17m1m7o8R5K57l56j17J22L2Q8j8
7246A3J50k78M21n42M54j00j46r5RJ09Q5j78p7M35k33m3M7L6k62J88j09N1J05
7269D0j01N0L5j25L72j40j91q0P5J33j04L3J63r3R1j54q2K14l14j07K41M7J7l3
$$ plain form
7293 -13 122 -54 -280 29 294 -57 17 31 -221 -109 -61 -59 -15 1 -185 452 -71 -126 160 269 -95 167 -20
7316 -20 213 193 26 110 82 155 46 -209 12 51 14 -45 -214 335 -52 -18 257 114 -80 105 -79 95 102 3
7340 3 -205 -95 64 -68 44 73 -30 -199 123 159 -7 -252 101 -45 128 -91 -303 155 -63 165 127 89
7362 89 90 140 -281 -44 17 275 -333 141 23 -87 204 -6 -333 89 -85 247 -146 -147 159 -54 -30 188 -150
7385 -150 1 86 114 -375 13 -367 -288 44 -263 -120 -37 -102 -2 79 24 -126 -20 -172 155 286 64 27 -119
7408 -119 302 60 -162 -162 183 -341 26 -23 353 81 -268 -92 -31 80 141 -103 168 65 -175 56 213 -78
7430 -78 53 -133 59 95 -259 -85 -281 -212 57 -92 -67 -44 -84 195 -57 198 263 -194 73 46 -117 -136 -216
7453 -216 148 -34 -298 35 -237 -177 -105 -30 -160 16 175 -7 186 -152 133 -268 -39 76 -284 10 -197
$$ packed form
7293a3J35j76k26L09K65l51P4J4k52J12M8KM4J6j86O37n23n5K86J09l64K62j87
7316b0K33k0j67Q4k8P3j09k55K21L9l7n9j69N49l87L4K75j43j94J85j84J74Pr9
7340Ck08J10J59j32J12K9j03j69L22L6j66k45L53j46J73k19k12M58k18K28l8l8
7362H9JN0m21K37O1K58o08M74j18j10K91k10l27M22j74L32l93jL06k13K4K18l38
7385a50J51Q5K8m89L88l80P9L32l07J43Q3o5J00Q1n5j50J06j52L27J31k22l7j46
7408a19M21k42k22%L45n24L67m9L76k72l49J76O1J11O1k44K71j03k40K31J57k91
7430g8J31j86J92L6l54J74j96O9K69j49K5K3m0K79k52K55O5m57K67k7j63j9q0
7453b16L64j82k64L33k72O0P2P5j30J76J59j82J93l38K85m01K29J15l60K94k07
$$ plain form
7474 -197 206 121 -115 66 -50 -8 -172 84 -182 -72 -103 -130 14 153 108 -103 -172 147 91 -88 -52 43 -86
7497 -86 109 141 156 151 -135 58 -151 215 -66 4 -230 -187 88 104 120 -86 -221 -78 47 -100 194 335 54
7520 54 114 62 -188 -72 324 -278 -25 239 21 115 414 79 97 113 25 -214 -106 -146 73 134 -128 80 -27
7543 -27 21 108 -137 -324 -124 -175 2 178 80 66 -51 -144 71 38 219 304 118 -154 -95 -9 42 149 189 -23
7567 -23 -113 -77 -52 -182 -31 -66 -10 294 5 -159 2 87 80 -123 176 177 -236 -10 -51 61 -57 151 321 5
7591 5 -163 36 -302 124 -22 74 -176 -192 -80 -42 43 15 -12 151 141 -104 150 65 -321 25 155 -327 199
7614 199 -172 -8 -122 329 83 -90 100 -193 50 30 -58 -11 -36 -109 -76 131 -134 -126 122 -23 231 119 237
7637 237 -13 -11 45 210 -196 -91 458 349 -167 6 87 -29 102 122 218 -1 -163 271 -258 25 80 224
$$ packed form
7474a97M03q5k36J81j16M2j64K56k66J10l1k7J44J39m5k11o9L19n6j79L6R5j29
7497h6J95L2J5nk86J93k09L66k81P0k34M3K75J6J6k06j35J43J25j47K94J41k81
7520E4O0n2k50J16L96o02K53K64k18R4K99l35J8J6q8k39J08m0K19O1k62K08j07
7543b7M8Q7k45j87K00n1J77J76r8j4j17r3K15l3J81Q5j86k72N9Q6N1J07M0k12
7567b3r0L6K5j30J51l5N6L04k89j64J61Q5pk03K99Jm13K26m1J12j18K08J70l16
7591Ej68J99l38M26j46R6k50j6J12L8Q5k8k7J63j0k45K54q5l86L46J30m82N26
7614A99l71J64j14M51k46j73J90k93K43k0q8M7k5p3L3K07k65QK48j45K54j12J18
7637B37k50KN6J65m06J05N49j09n16J73Q1j16J31K0R6k19j62M34n29K83N5J44
$$ plain form
7659 224 -49 -78 93 -40 110 152 134 -101 89 206 -198 -79 -81 -107 190 -37 -113 153 29 177 111 39 245
7682 245 270 260 -47 35 0 -33 150 -36 7 -65 18 -52 12 -56 8 -135 24 -19 -149 -123 214 -88 96 -145 -68
7707 -68 61 46 -33 -68 140 39 31 272 71 109 55 43 -122 220 -180 -158 -147 29 -149 -97 24 -38 51 -113 43
7732 43 119 -229 214 -157 104 67 -127 -153 36 -16 -200 -61 79 37 83 178 193 257 32 -172 -53 -286 218
7755 218 72 -38 198 148 -80 -273 -54 105 6 -57 -121 149 137 200 -128 165 119 -52 -237 74 -63 -52 150
7778 150 66 -23 37 80 65 21 -94 -56 55 148 199 -65 201 -99 235 -65 -268 37 -213 -294 -94 129 201 -15
7802 -15 -287 168 83 60 175 -87 51 -96 29 -146 12 -120 -205 39 140 138 -148 95 -137 -400 27 384
7824 384 -3 -193 -62 68 -136 -99 -246 83 -116 146 -154 92 287 -128 1 260 -112 -114 -82 245 -160
$$ packed form
7659B24k73k9J71j33J50M2j8k35J90J17m04J19kk6K97k27p6K66j24J48o6p2K06
7682B45K5j0l07Q2l5l3J83j86M3p2Q3p0O4o8O4j43J59m3j30K6L37l02J84k41P7
7707f8J29j5p9l5K08j01qK41k01L8n4j2j65L42m00K2J1J76j78N2J21o2Q9j64J56
7732D3P6l48M43l71K61l7j94k6J89n2j84J39J40m2M6R5J5O4k25k04J19k33N04
7755B18j46j10K36n0k28j93K19J59r9o3o4K70j2O3l28K93m6j71j85L11j37J1K02
7778A50q4q9O0M3j5m4j15L8J11R3N1k64K66l00L34l00k03L05k50q1K00K23P2k16
7802a5k72M55q5k3J15k62J38j47J25j75J58j32q5K44J01kk86K43k32k63M27L57
7824C84l87j90J31J30k04L7j47L29j99K62l00K46J95m15J29K59l72kL2L27m05
$$ plain form
7845 -160 94 -93 -71 -88 -48 -16 107 131 -69 14 47 24 215 103 -44 22 121 29 5 -141 -82 124 60 143 545
7870 545 6 142 -217 -199 59 -77 98 6 8 -83 333 4 164 -52 35 101 -72 -227 -3 147 -56 -188
7892 -188 -208 -163 -64 25 -269 102 -28 -99 105 -83 136 37 -161 198 166 250 -103 81 10 115 -198 121 13
7915 13 193 92 -34 47 191 94 125 162 -140 62 -62 -339 -106 -288 40 -102 86 31 -226 -85 151 -69
7937 -69 53 -9 -269 -101 149 -103 47 166 -196 125 -286 222 -117 81 119 145 -151 55 155 -393 -113
7958 -113 177 330 -134 19 -188 -157 75 -34 180 -111 -102 126 178 156 50 -89 -156 77 145 5 3 -379 -111
7981 -111 60 -135 -86 -58 64 3 9 382 208 -8 -167 128 213 -72 -33 48 153 255 -257 15 -201 -65 -59
8004 -59 -50 141 189 -248 -119 55 -220 6 343 -91 -243 -28 -32 -58 -181 -179 -152 13 -162 42 -40 -78 121 19
$$ packed form
7845a60K54j87K2j7M0L2J23K4k00Q3L3k3J91j12j47O6R9r2k4j46N9K06o4Q3M02
7870E45n39J36l59J8K58j36J75r2Kr1M16l29J60k16Q7O6j73j55K24J50k03j32
7892a88k0M5R9Q9k94L71j30p1K04j88K19r9j98L59l2Q4l53J84p1J05l13L19j08
7915A3J80j01j26Q1J44r7L1L7l02K02j24k77K33j82L28j42J88n5k57J41K36k20
7937f9J22o2k60J68K50k52J50J19l62L21m11N08l39J98L8K6k96K06J00n48K80
7958a13K90J53m64J53k07L1K32j09K14k91RK28N2k2j06j39o7K33O8j40kl82K68
7981a11J71j95M9K8J22o1OL73j74k16j59K95Q5k85L9Q1J05J02n12K72k16J36O
8004e9RJ91M8m37J29J74k75K26L37m34j52K15mk6j23KK7J65j75K04q2l8J99j02
$$ plain form
8028 19 73 -150 -196 -29 -79 -35 138 -180 -116 -61 168 318 -81 54 168 117 104 91 296 48 106 -171 -11 -126
8052 -126 -89 177 -21 -7 40 -12 305 -498 81 161 65 110 -218 42 -87 48 106 -90 -102 -120 68 -136 101
8075 101 10 -133 16 306 -86 -74 -337 53 221 68 -152 -196 46 37 26 -134 -204 81 -107 -152 218 111 43
8098 43 -150 224 216 93 -67 -15 -76 194 -209 -76 268 -109 -36 231 170 13 -34 96 78 10 -6 -140 -138 366
8122 366 137 113 -165 6 -193 -227 -104 -202 370 -102 -84 61 -74 -161 78 5 -96 73 -197 74 120 62 -62
8145 -62 181 -222 -76 -239 -103 153 -363 178 97 -103 86 52 -282 -109 -155 175 148 -88 -39 -66 -19 154 8
8168 8 110 -52 115 112 -248 -122 83 -105 -20 -258 -344 -14 -132 -52 95 23 -94 13 -84 -8 37 90 -32
$$ packed form
8028A9N4k23m6J67n0M4J73l18O4N5K29J50l99J35J14n1j3j3K05k48N8k77J60j15
8052a26L7K66j98J4M7n2L17q03N79Q0r6M5l28K60j29J35N8j96j2j8J88k04K37
8075A01r1j43J49K90l92J2k63L90J68j53k20m4K42rj1j60p0K85j88m5L70j07o8
8098D3j93L74qj23j60N2o1K70m03J33L44l77P3K67o1j57m7J30j8o8j6j34KN04
8122C66k29k4k78J71j99l4J23r8N72m72J8J45j35q7K39p3j01J69k70K71M6n8j24
8145f2K43m03J46j63J36K56n16N41q1k00J89l4l34J73m6L30k7k36M9k7M7J73j46
8168HJ02j62J67ll60J26K05j88Q5k38q6L30j18Q0J47p2j17J07r7P6M5N3j22
8191c2
$$ Imaginary data points
##PAGE= N=2
##DATA TABLE= (X++(I..I)), XYDATA
$$ plain form
0 0 0 0 0 0 0 0 0 0 0 0 0 0 0 0 0 0 0 -8 8 -8 8 -8 8 -16 16 -16 19 -24 24 -32 32 -40 44 -49 56 -64 72 -80 89
39 89 -100 109 -124 137 -150 166 -183 203 -224 246 -270 299 -329 363 -401 444 -492 546 -611 684
59 684 -773 879 -1013 1180 -1404 1717 -2185 2967 -4487 8596 -44496 -116363 -12787 61460
73 61460 38118 -24327 -26435 15854 29868 5020 8915 12575 4346 13249 15950 -4128 186 27866
87 27866 49269 26028 -26861 -21619 38496 47020 6475 -17870 -10786 14465 24024 9393 6613
100 6613 2637 -9196 -3654 -61 -8896 -1393 1505 -9967 -14172 -13090 -1949 9359 -6175 -20715
114 -20715 -17900 -19978 -10295 6841 -2121 -15983 -17163 -10632 2182 -620 -13646 -4591 -3525 -17309
128 -17309 -7827 10372 12564 3598 -9139 -3197 12503 4194 -157 12010 6899 -3114 3863 11979
$$ packed form
0@%%%%%%%%%%%%%%%%%qJ6j6J6j6J6k4L2l2L5m3M8n6O4p2Q4r3J05j20J36j52J69
39H9j89K09k33K61k87L16l49L86m27M70n16N69o28O92p64Q45r36J038j157J295
59F84j457J652j892K193k584L121l902N152p454J3083n3092p1867J03576P4247
73F1460k3342o2445k108M2289J4014k4848L895L660q229Q903K701k0078M314K7680
87B7866K1403k3241n2889N242O0115Q524m0545k4345P084K5251R559j4631k780
100F613l976j1833N542L593q835P503K898j1472m205J082J1141J1308j5534j4540
114b0715K815k078R683J7136q962j3862j180O531J2814k802j3026R055J066j3784
128a7309R482J8199K192q966j2737N942J5700q309m351J2167n111j0013O977Q116
$$ plain form
142 11979 18388 13417 -70 4471 6666 -1103 8007 14209 2730 -1249 1817 7160 11458 67
156 67 -5721 1887 -4725 -9789 1387 2895 -1248 -4371 -8936 -1892 1424 -8096 -6408 -2958 -10675
171 -10675 -7319 -1737 -2615 601 -2942 -8580 -4282 -4411 -3120 3991 -4306 -9995 327 3739 4453
186 4453 4534 -793 2794 4867 -3583 1310 8753 4456 3844 2687 851 8914 8267 1140 2539 -930
202 -930 -2241 5901 3488 1486 6511 1516 -1192 1514 -1210 2106 2477 -8155 -5927 1052 -1677
217 -1677 -375 -1916 -6358 -1827 -3304 -7483 -2197 -3112 -5696 -1549 -4578 -3972 3233 311 -2783 -1785
233 -1785 -6557 -1852 3013 -2510 -368 2389 -1305 2216 3659 558 3883 1307 -2169 4261 3730
248 3730 1589 7221 4891 2136 3968 705 2648 6567 -155 -961 2483 26 3689 4912 -1466
$$ packed form
142A1979O409m971j3487M541K195p769R110O202j1479l979L066N343M298j1391
156F7n788P608o612n064J1176J508m143l123m565P044L316r520J688L450p717
171a0675L356N582q78L216l543n638M298j29J291P111q297n689J0322L412P14
186D453Q1n327L587K073q450M893P443m297o12j157j836Q063o47p127J399l469
202i30j311Q142k413k002N025m995k708K706k724L316L71j0632K228O979k729
217a677J302j541m442M531j477m179N286r15k584M147l029O06P205k922l094R98
233a785m772M705M865n523K142K757l694L521J443l101L325k576l476O430n31
248C730k141N632k330k755J832l263J943L919o722q06L444k457L663J223o378
$$ plain form
263 -1466 819 1277 -2673 151 -1453 -3831 1714 -1289 -5233 -202 -928 -2108 -1106 -7004 -5366 -333
279 -333 -4387 -3410 -187 -3805 -955 263 -4037 -302 -307 -4841 -620 -241 -1525 3699 898 -1923 2810
296 2810 890 -1 3216 -76 1202 4214 -352 1874 6411 2855 3133 2514 -1274 3504 3803 -1309
312 -1309 1654 1728 -177 3664 761 -828 3092 -297 -2711 157 -2024 -461 2652 -2648 -1748 797
328 797 -2922 -1600 -1377 -4974 -1809 -1985 -5232 -772 -543 -2818 100 -2211 -3256 959 -1910 -2820
344 -2820 1361 -1397 -635 2365 -1043 1272 2981 -1726 279 1871 -908 2465 1944 -626 3729 3499
360 3499 653 3124 1662 -191 3342 11 -368 3896 659 627 2620 -980 644 2371 -2401 -455
376 -455 1181 -2481 492 689 -2319 1296 180 -3117 -45 -1842 -3104 -150 -2903 -2902 997 -2394
$$ packed form
263a466K285M58l950K824j604k378N545l003l944N031p26j180J002n898J638N033
279c33m054R77L223l618K850J218m300L735nm534M221L79j284N224k801k821M733
296B810j920q91L217l292J278L012m566K226M537l556K78o19l788M778K99n112
312a309K963P4j905L841k903j589L920l389k414K868k181J563L113n300R00K545
328G97l719J322K23l597L165j76l247M460K29k275K918k311j045M215k869r10
344b820M181k758P62L000l408K315J709m707K005J592k779L373n21k570M355k30
360C499k846K471j462j853L533l331l79M264l237l2J993l600J624J727m772J946
376d55J636l662K973J97l008L615j116l297L072j797j262K954k753JL899l391
$$ plain form
392 -2394 -2224 721 -2372 -1173 340 -3387 -182 1092 -2207 561 1507 -813 1708 321 -2297 1652
408 1652 534 -1154 1869 33 283 3841 -1 203 3132 375 1248 1997 -1232 1837 3235 -823
424 -823 1768 1631 -1385 1596 -33 -2097 1416 -535 -2052 1063 -852 -584 1942 -1683 -1058 1141
440 1141 -2388 -1615 540 -1991 181 192 -2898 -328 260 -2590 -363 -1428 -2244 1257 -384 -1737
456 -1737 1794 -139 -603 1549 -1636 -423 2193 -1278 -252 1872 -873 1011 1418 -1194 1620 1942
472 1942 -1092 1579 721 -927 2585 950 -656 2872 124 -603 1769 -919 -453 1659 -1900 -60
488 -60 1774 -1405 337 555 -1949 866 399 -2554 298 201 -1379 937 -1184 -1645 1737 -1331 -2260
505 -2260 265 -1448 -943 989 -2138 -455 1322 -1195 289 958 -1712 794 309 -2368 1078 797
$$ packed form
392b394J70K945l093J199J513l727L205J274l299K768R46k320K521j387k618L949
408A652j118j688L023j836K50L558l842K04K929k757Q73P49l229L069J398m058
424h23K591j37l016K981j629k064L513j951j517L115j915K68K526l625O25K199
440A141l529P73K155k531K172J1l090K570N88k850K227j065q16L501j641j353
456a737L531j933m64K152l185J213K616l471J026K124k745J884M07k612K814L22
472A942l034K671q58j648L512j635j606L528k748p27K372k688M66K112l559J840
488f0J834l179J742K18k504K815m67k953K852r7j580K316k121m61L382l068r29
505b260K525j713N05J932l127J683J777k517J484O69k670K506m85k677L446k81
$$ plain form
521 797 -1537 1694 64 -904 1640 -843 -494 2128 -389 312 2003 -257 1346 2510 -554 569
537 569 1317 -962 1132 949 -1670 1597 780 -1193 1050 -458 -704 1827 -1016 -1369 1624 -1101 -645
554 -645 1259 -1255 -171 667 -2551 -380 534 -2279 -215 -243 -1845 769 -246 -2083 1314 -135
570 -135 -1399 972 -1365 -1003 1985 -653 -142 1226 -1216 135 1162 -1424 198 1007 -1165 1175
586 1175 927 -1284 1753 957 -657 1767 220 -354 2297 75 -143 2312 -549 190 1866 -1009
602 -1009 -134 861 -1690 531 731 -1801 913 1088 -854 775 -551 -1737 894 -986 -1978 544
618 544 -1271 -1121 895 -1973 -1317 747 -1827 -437 501 -1908 -47 703 -1591 777 410 -1510 1034
635 1034 302 -1346 1122 -365 -821 2245 -98 -210 1646 -26 628 1930 -850 267 1869 -792
$$ packed form
521G97k334L231j630r68K544k483L49K622k517P01J691k260J603J164l064J123
537E69P48k279K094j83k619L267q17j973K243j508k46K531k843l53K993k725M56
554f45J904k514J084Q38l218K171R14k813K064k8j602K614j015j837L397j449
570a35j264K371k337L62K988k638N11J368k442J351J027k586J622Q09k172K340
586A175k48k211L037p96j614K424j547n74K651k222k18K455k861P39J676k875
602a009Q75R95k551K221K00k532K714J75j942J629j326j186K631j880r92K522
618E44j815J50K016k868O56K064k574J390R38k409J861P50k294K368l67j920K544
635A034p32j648K468j487m56L066k343j12J856j672O54J302k780J117J602k661
$$ plain form
651 -792 844 1333 -948 1278 990 -1261 477 111 -1027 1514 -284 -1073 1411 -610 -505 1092 -1056
668 -1056 -310 852 -1948 -643 507 -1647 -211 195 -2420 155 -463 -1881 535 -310 -1610 794
684 794 -622 -1108 1313 -311 -565 1368 -773 -711 1318 -497 407 1336 -850 900 1184 -715 1452
701 1452 1211 -457 1745 1115 -64 2070 282 -27 1962 -130 -415 1396 -769 -142 1215 -1412
717 -1412 -250 766 -1455 -144 199 -1571 552 7 -1904 611 -446 -1516 420 -874 -1644 298
733 298 -1486 -1538 494 -1642 -828 593 -1423 -184 790 -1211 518 802 -1231 657 868 -765 1193
750 1193 1010 -864 1432 170 -582 1835 66 -173 1941 141 440 1975 -199 686 1627 -704 818
767 818 1057 -973 946 453 -907 1246 -42 -1232 462 -727 -1060 643 -946 -1042 684 -1445 -888
$$ packed form
651g92J636M89k281K226k88k251J738l66j138K541j798p89K484k021J05J597k148
668a056P46J162k800J305J150k154J436M06k615K575o18j418K416q45j300K404
684G94j416m86K421j624k54J933k141O2K029j815R04R29k186J750K84j899K167
701A452k41j668K202o30j179K134j788l09J989k092k85J811k165O27J357k627
717a412J162J016k221J311L43j770K123n45j911K515j057j070J936j294p70J942
733B98j784n2K032k136Q14J421k016J239R74k001J729K84k033J888K11j633J958
750A193j83j874K296j262p52K417j769k39K114j800K99J535k174Q85R41k331J522
767H18K39k030J919m93j360K153j288j190J694j189l33J703j589r6J726k129N57
$$ plain form
784 -888 524 -1620 -544 221 -1868 -358 -219 -1719 416 -159 -1417 619 -197 -1252 1140 59
800 59 -389 1086 -382 54 1829 -345 408 1347 -813 393 1422 -814 1051 996 -525 1536 706
817 706 -303 1603 667 -507 1504 -89 -554 1422 -405 -416 1224 -1148 -675 410 -1284 -284 558
834 558 -1636 -236 -179 -1680 168 -47 -1557 431 -574 -1464 125 -786 -1399 516 -788 -822 879
851 879 -876 -306 932 -672 206 1077 -549 897 1318 -297 1212 859 -393 1509 692 -154 1360
868 1360 178 -223 1734 -85 208 1690 -116 413 1345 -725 204 964 -1079 423 388 -1327 217
885 217 177 -1352 340 -986 -1725 273 -960 -1266 384 -1249 -1147 401 -1344 -725 322 -1147 -301
902 -301 467 -1097 382 652 -935 590 429 -851 1104 617 -327 1712 195 -116 1755 113 477
$$ packed form
784h88J412k144J076P65k089J510J39j500K135n75j258K036q16j055K392j081
800E9m48J475j468M36J775k174P53R39k160J206J029k236J865n5j521K061q30
817G06j009J906r36j174K011j593m65J976j827j1J640k372M73J085j694J000Q42
834E58k194J400N7j501J848k15j510J988j005q90J589r11o13J915j304l4J701
851H79j755N70J238j604Q78Q71j626J446M21j615J509l53j252J902q17q46J514
868A360j182m01J957j819K93J482j806N29R32k070R29P60k043J502l5j715J544
885B17m0j529J692j326p39J998j233l06J650j633J02J548j745O19J047j469Q46
902c01P68j564J479K70j587J525j61j280J955m87r44K039j517l11J871j642L64
$$ plain form
919 477 1636 -63 539 1702 -284 471 1117 -542 677 889 -770 787 742 -401 978 -72 -681
936 -681 1033 -316 -981 722 -1102 -1204 511 -1435 -846 73 -1605 -728 -62 -1761 -241 4 -1382
953 -1382 46 -205 -1161 474 -284 -1026 785 -458 -538 968 -554 184 1206 -466 536 1625 -270
970 -270 719 1493 -166 1325 1117 -178 1297 629 -339 1689 473 -225 1226 -4 -382 1226 -157
987 -157 -369 1044 -619 6 799 -966 -102 398 -1192 -187 82 -1655 159 -388 -1635 137 -673
1004 -673 -1486 43 -1036 -1014 435 -958 -709 600 -764 -421 658 -1051 262 415 -644 647 183
1021 183 -788 909 671 -440 1391 516 151 1673 346 168 1524 143 188 1424 -189 339 1206
1038 1206 -512 199 748 -833 506 422 -740 715 -65 -819 476 -272 -1234 504 -692 -798 242
$$ packed form
919D77J159j699O02J163j986P55O46j659J219K12j659J557m5j143J379j050o09
936f81J714j349o65J703j824j02J715j946N89R19j678Q77O66j699J520K45j386
953a382J428k51r56J635p58p42J811j243q0J506j522P38J022j672J002J089j895
970b70R89P74j659J491k08j295J475o68r68K028j216o98J451j230l78J608j383
987a57k12J413j663O25P93j765Q64N00j590J005K69j737J814n47j247J772q10
1004f73q13J529j079K2J449j393K49J309j364L43J079j709J313J53j059J291m64
1021A83r71J697k38j111J831q75l65J522j327j78J356j381M5J236j613N28Q67
1038A206j718P11N49j581J339q4j162J455p80p54J295p48r62J738j196j06J040
$$ plain form
1055 242 -993 -614 581 -1207 -770 191 -1162 -364 169 -902 178 97 -1122 561 190 -645 844
1072 844 -262 -927 740 -167 -299 1121 -191 -119 890 -438 170 1124 -148 780 1210 -584 807
1089 807 722 -497 1262 336 -391 823 -30 -1064 697 -397 -497 812 -640 -295 592 -1024 -199
1106 -199 367 -1089 178 231 -1185 214 171 -1360 228 -91 -1230 469 -467 -895 610 -575 -523 925
1124 925 -552 -264 1195 -379 81 830 -691 393 767 -647 566 713 -995 877 333 -403 791
1141 791 326 -372 1005 -114 -206 980 -275 86 765 -731 -91 698 -962 102 97 -840 157 227 -1092
1160 -1092 331 -111 -1213 729 -321 -961 687 -374 -952 448 -783 -495 590 -790 -279 792
1176 792 -698 381 698 -657 378 641 -315 1010 511 -499 844 -9 7 1335 -71 -107 802 -128
$$ packed form
1055B42j235L79J195j788M37R61j353P98N33j071J080q1j219J683l71q35J489
1072H44j106o65J667r07j32J420j312P2J009j328O08R54j272R28M30j794J391
1089H07q5j219J759r26p27J214q53j034J761j094j00J309j452L45Q87j616Q25
1106a99N66j456J267N3j416J399m3j531J588l19j139J699r36m28J505j185N2J448
1124I25j477K88J459j574M60P49j521J084L74j414J213J47j708J872n44p36J194
1141G91m65o98J377j119r2J186j255L61O79j496O40P89j660J064nr37R97P0j319
1160a092J423m42j102J942j050o40J648j061n78J400j231K88J085j380N11J071
1176G92j490J079L17j355J035K63r56J325m99j010J343q53J6J328j406l6R09r30
$$ plain form
1194 -128 290 1051 -484 296 934 -397 366 957 -501 641 78 -952 555 -89 -878 446 -382 -849
1212 -849 287 -766 -742 431 -581 -637 390 -961 -70 752 -971 253 215 -817 -39 -1 -959 541
1230 541 -118 -901 609 -182 -422 851 -371 -146 1002 -565 -287 953 -368 257 688 -603 278
1247 278 534 -630 475 518 -327 834 105 -735 941 19 -483 955 -171 -346 825 -358 -201 597
1265 597 -742 -60 448 -956 -1 45 -1027 60 84 -639 532 -186 -982 108 -347 -823 547 -348
1283 -348 -719 896 -491 -344 595 -594 -23 408 -920 -23 520 -416 620 620 -413 695 152 -559
1301 -559 1042 -5 -383 496 -192 -74 655 -431 236 818 -589 -54 589 -394 443 729 -535 491
1319 491 246 -310 450 -42 -666 326 -39 -668 350 -481 -478 285 -966 -231 644 -576 -309 297 -604 178
$$ packed form
1194a28M18P61j535P80O38j331P63N91j458J142n63j030J507o44p89J324q28m67
1212h49J136j053K4J173j012n6J027j351Q91Q22j723J224l8j032P78L8r58J500
1230E41o59p83J510p91k40J273j222K25J148j567K78J240j321O25M31j291Q81
1247B78K56j164J105M3q45J161p29q40J676r22n02J438j126j75J171j183J57P98
1265E97j339O82N08j404R55M6j072J087K4p23J171p18p96J090m55m76J370q95
1283c48l71J615j387J47R39j189N71M31j328Q97N43r36J036%j033J108n43p11
1301e59J601j047l78Q79o88J18P29j086O67N82j407N35O43r83Q37K86j264J026
1319D91k45n56P60m92o24R92l65o29J018q31LP63j251P35Q75j220K67O06r01P82
$$ plain form
1339 178 -20 -965 227 162 -815 479 -106 -717 557 -49 -546 684 -75 22 849 -216 -13 896 -152
1358 -152 285 778 -493 400 515 -623 565 348 -529 413 -26 -343 537 -386 -352 1180 -93 -43 618
1377 618 -619 -158 465 -652 -226 315 -819 -208 39 -1052 284 -114 -846 692 -111 -497 328 -193
1395 -193 -373 547 -599 -456 443 -483 -194 666 -553 206 425 -534 179 656 -176 679 535 -165 502
1414 502 188 18 422 -44 -504 596 -190 51 711 -377 -261 401 -439 455 625 -516 284 597 -800
1433 -800 65 37 -597 123 -31 -550 310 -238 -449 244 -470 -653 423 -332 -169 443 -816 -30 246 -851
1453 -851 -127 149 -723 18 179 -806 262 -150 -618 423 -73 -573 690 -186 -14 925 207 175 635
1472 635 -363 153 635 -467 395 322 -350 240 232 -556 681 190 -519 724 -41 -107 781 -523 -238 394
$$ packed form
1339A78j98r45J192o5r77J294n85o11J274o06m97J230p59R7Q27j065K03R09j048
1358a52M37M93j271Q93J15j138J188k17q77R42m39l17Q80r23L4J532j273N0O61
1377F18j237M61O23j117M26N41j134O11K47j091J336l98p32J538q03l86Q25n21
1395a93j80R20j146J43Q99r26K89Q60j219P59K19r59P13M77q32Q55j44p00O67
1414E02l14j70M04m66m60J100p86K41O60j088J16O62q40Q94J70j141Q00L13j397
1433h00Q65k8o34P20j54n19Q60n48k11O93p14j83J076p55J63O12j259P86K76j097
1453h51P24K76q72P41J61r85J068m12m68J041m96n00J263q76J72R39p18l2M60
1472F35r98N16M82j102Q62p3o72N90qp88J237m91p09J243p65o6Q88j304K85O32
$$ plain form
1492 394 -629 179 310 -437 -2 181 -1015 22 106 -500 94 -129 -613 512 -54 -354 576 -163 -453
1511 -453 403 -154 -212 502 -683 -157 524 -520 36 457 -343 369 454 -442 621 130 -659 827 30
1530 30 -467 368 85 -382 576 -183 -303 604 -177 81 297 -593 -10 183 -348 233 212 -723 343 128
1550 128 -165 177 -125 -637 315 -198 -584 234 -544 -245 217 -431 -201 496 -634 25 530 -486 -149
1569 -149 207 -613 305 231 -419 319 -212 -170 355 -156 -315 637 75 -34 595 -190 254 592 -429 206
1589 206 255 -379 215 149 -401 661 109 -485 610 24 -401 677 -94 23 601 -352 -259 486 -570 -241
1609 -241 325 -688 63 237 -695 278 198 -950 183 73 -244 317 -212 -280 380 -142 -519 680 -272
1628 -272 -22 624 -313 -185 305 -532 359 280 -543 282 491 -560 661 156 -407 566 170 -486 591
$$ packed form
1492C94j023Q08J31p47M35J83j196J037Q4o06N94k23m84J125n66l00R30p39k90
1511d53Q56n57n8P14j185N26O81j044N56M21q00P12Q5q96J063m91p89J486p97
1530C0m97Q35k83m67R58p59j20R07p81K58K16q90N83J93n31N81k1r35J066k15
1550A28k93L42l02n12R52n13l86Q18p78K99M62o48K30O97j130O59N05j016L37
1569a49L56q20R18p4o50P38n31M2N25n11j59R52n62j09O29p85M44L38j021O35
1589B06M9o34N94o6n50J062n52n94J095n86m25J078p71J17N78r53R3P45j056L29
1609b41N66j013P51J74r32R73q0j148J133j10l17N61n29o8O60n22l77J199r52
1628b72K50O46r37J28M90q37Q91p9q23Q25K09j051J221n05n63R73l96o56J077
$$ plain form
1647 591 -162 -277 375 -352 -182 618 -319 19 477 -283 104 289 -324 312 144 -438 324 -108 -413 60
1667 60 151 -369 151 -328 -650 216 -327 -424 382 -456 -135 102 -264 -179 292 -400 393 504 -484 603 205
1688 205 -494 515 -223 -222 568 210 -24 1104 -260 -68 972 -132 273 697 -252 300 521 -536 322
1707 322 187 -385 240 15 -554 521 -28 -170 449 -85 -282 503 -214 -205 -22 -466 -73 117 -334 81
1727 81 124 -593 141 13 -355 349 38 -331 354 -475 -84 376 67 -257 235 -271 7 216 -349 64 363
1748 363 -460 196 168 -420 474 370 -140 332 273 -486 292 268 -52 509 -274 -343 707 -266 -130 247 -55
1769 -55 -9 242 -283 115 134 -385 469 -74 -577 203 -111 -219 118 -282 -437 332 -132 -612 431 -296 -201
1790 -201 232 -281 143 444 -283 -35 362 -582 184 150 -459 201 -106 -353 172 -118 -169 326 21 131 364
$$ packed form
1647E91p53j15O52p27J70Q00r37L38M58p60L87J85o13O36j68n82P62m32l05M73
1667F0R1n20N20m79l22Q66n43r7Q06q38L21K37l66Q5M71o92P93J11r88J087l98
1688B05o99J009p38JP90l58k34J128j364J92J040j104M05M24r49N52K21j057Q58
1707C22j35n72O25k25n69J075n49j42O19n34j97P85p17RJ83m44L93J90m51M15
1727H1M3p17P34j28l68P04l11l69O85q29L91M60l09l24M92n06K78K09n65M13K99
1748C63q23O56k8n88Q94j04n10M72n9p59P78k4l20N61p83o9J050r73J36L77l02
1769e5M6K51n25L98J9n19Q54n43n03P80l14j08L37m00j55P69m64m80J043p27R5
1790b01M33n13M24L01p27K48L97r44P66l4o09O60l07k47N25k90n1M95l05J10K33
$$ plain form
1811 364 -253 187 641 -537 162 459 -475 156 212 -198 69 96 -439 163 39 -603 -36 -4 -457 426 -114
1832 -114 -365 227 -359 -454 58 -286 -250 184 -543 0 97 -463 251 -38 -222 294 30 -260 349 55 -330
1853 -330 307 18 -139 316 -301 -131 454 -153 -119 181 -218 24 301 -38 299 143 -317 11 91 -337 408
1874 408 137 -54 436 -102 -232 598 -374 -289 360 -396 -8 -107 -460 7 333 -368 165 272 -333 242 -170
1895 -170 -100 171 -193 -475 228 -266 -208 395 -366 -121 317 -317 -58 132 -309 -15 280 -286 365 391 -207
1916 -207 360 53 -120 259 50 -299 521 148 -240 502 -148 136 414 -226 -220 411 -390 12 134 -449 324
1937 324 87 -146 234 -11 -606 244 -271 -463 407 -270 -123 200 -428 166 23 -600 -216 207 -356 57
1957 57 79 -367 142 48 -338 308 10 -253 547 145 90 323 -164 -156 379 -395 -35 474 -467 254 238 -398
$$ packed form
1811C64o17M40M54j178O99K97r34O31N6m10K67K7n35O02j24o42N67L2m53Q83n40
1832a14k51N92n86r5N12l44L6M34p27N43R7n60P14k89j84N16k64k90O09k94l85
1853c30O37k89j57M55o17J70N85o07L4L00l99K42K77l39L37j56m60L28Q0m28P45
1874D08k71j91M90n38j30Q30r72Q5O49p56L88r9l53M67L26p01N33J07o05N75m12
1895a70P0K71l64k82P03m94N8O03p61K45M38o34K59J90m41K94K95n66O51K6n98
1916b07N67l07j73L79k09l49Q20l73l88P42o50K84K78o40OO31q01M02J22n83P73
1937C24k37k33L80k45n95Q50n15j92Q70o77J47L23o28N94j43o23L84M23n63M13
1957E7K2m46N09r4l86O46k98k63Q00m02n5K33m87QN35p74L60N09r41P21j6o36
$$ plain form
1979 -398 -96 295 -301 320 90 -230 440 159 -40 494 -64 -308 317 -243 -168 300 -664 -239 67 -329
1999 -329 122 303 -346 258 -60 -155 24 94 -428 174 -38 -61 161 -124 -105 263 -154 -131 356 -343 -73 510
2021 510 -139 234 285 -381 230 331 -639 121 192 -337 356 31 -249 250 -60 27 351 -350 191 131 -280
2042 -280 -6 356 55 -106 173 -247 44 20 -663 86 100 -399 317 -171 -64 509 -53 -138 603 53 -69
2063 -69 143 -470 -9 494 -385 60 230 -295 159 203 -262 150 5 -445 415 -165 -235 247 -341 -253 333
2084 333 -133 -320 309 -181 189 266 -239 -88 479 -112 -4 -57 -11 375 65 -206 481 -101 -8 377 146
2105 146 -505 327 -128 -216 200 -393 -12 -15 -510 -136 132 -501 182 -133 -245 127 -13 -355 406 -13 -286
2126 -286 229 -284 -230 460 -220 -242 297 -185 -274 317 -250 193 181 -389 -85 275 -144 112 75 -422 351 -213
$$ packed form
1979c98L02L91n96O21k30l20O70k81j99N34n58k44O25n60P5M68r64M25L06l96
1999c29M51J81o49O04l18r5J79P0n22O02k12k3K22k85J9L68m17K3M87o99K70N83
2021E10o49L73N1o66O11J01r70P60P1n29O93l25k80M99l10Q7L24p01N41o0m11
2042b80K74L62l01j61K79m20K91k4o83P49J4m99P16m88J07N73n62q5P41n50j22
2063f9K12o13M61N03q79M45J70n25M54M4m65M12j45m50Q60n80p0M82n88Q8N86
2084C33m66j87O29m90L70P7n05J51N67n91J08n3M6L86l10k71O87n82R3L85k31
2105A46o51Q32m55q8M16n93L81lm95L74K68o33O83l15j12L72j40l42P61m19k73
2126b86N15n13N4O90o80k2N39m82q9N91n67M43j2n70L04L60m19K56l7m97P73n64
$$ plain form
2148 -213 -26 123 -141 -64 429 -72 -271 363 -250 -92 447 -246 172 176 -281 153 -108 -260 91 206 -275
2169 -275 456 69 -35 389 -124 2 348 -249 28 111 -41 -97 433 -214 157 155 -465 310 -161 -218 43 169
2191 169 -50 341 -56 -93 373 198 102 191 -295 51 253 -161 -299 297 -270 158 260 -86 64 281 -328
2212 -328 216 69 -426 123 -96 -119 334 54 -376 199 -147 -198 424 -334 55 243 -428 -87 32 -117 161
2233 161 148 -540 406 74 -184 402 -142 -240 468 -149 -371 440 -140 -181 286 -329 28 305 -153 -81 388
2254 388 -13 41 372 -98 221 105 -225 156 -196 15 171 -26 -153 314 -130 72 256 -142 112 174 -520
2275 -520 5 230 -131 246 -10 -285 200 -18 -89 456 -11 -186 195 -314 -191 404 -65 -242 260 -369
2295 -369 -124 76 -429 60 136 -276 -4 -106 0 239 31 -250 322 -117 -267 321 -71 64 32 -218 -366
$$ packed form
2148b13J87J49k64P7M93n01j99O34o13J58N39o93M18Mm57M34k61j52L51J15m81
2169b75P31l87j04M24n13J26L46n97K77Q3j52n6N30o47L71ko20P75m71n7K61J26
2191A69k19L91l97l7M66j75r6Q9m86L46K02m14j38N96n67M28J02l46J50K17o09
2212c28N44j47m95N49k19k3M53k80m30N75l46n1O22p58L89J88o71L41J19j49K78
2233A61j3o88R46l32k58N86n44r8P08o17k22Q11n80m1M67o15L57K77m58P2M69
2254C88m01N4L31m70L19j16l30L81l52K11J56j97j27M67m44K02J84l98K54O2o94
2275e20N25K25l61L77k56k75M85k18p1N45m67j75L81n09J23N95m69j77N02o29
2295c69K45K00n05M89P6m12K72j02J06K39k08k81N72m39j50N88l92J35l2k50j48
$$ plain form
2316 -366 163 -119 -198 247 106 233 433 -522 270 24 -173 242 -166 -323 465 -212 -435 138 -299 48
2336 48 277 -27 -173 329 -92 -97 -108 -182 -42 244 -164 510 296 -279 66 147 -136 462 -202 -162 297 156
2358 156 14 42 -293 -11 146 -445 123 230 -38 189 261 -334 -68 250 -329 56 91 -95 -19 -124 -614
2379 -614 132 -64 -217 77 -69 -132 133 -31 -173 -15 21 248 21 -159 430 164 -548 -69 214 -351 332
2400 332 93 -372 79 12 -500 -35 -71 18 569 -199 301 397 -331 201 141 -67 22 -139 -462 127 189 -22
2422 -22 111 -12 -1 404 -252 -336 275 -143 -338 386 -229 -54 19 -214 -95 81 -147 123 186 -213 403 -157
2444 -157 -416 364 -204 -203 341 -141 -73 274 -209 -42 167 -200 -14 166 -384 3 -13 -441 35 33 -106 177
2466 177 39 -302 93 -242 -79 144 -365 -96 180 -41 29 41 -313 -158 157 -317 120 -12 -188 -21 -28
$$ packed form
2316c66N29k82p9M45j41J27K00r55P92k46j97M15m08j57P88o77k23N73m37L47
2336D8K29l04j46N02m21nj1p4J40K86m08O74k14n75L45Q1k83N98o64M0M59j41
2358A56j42K8l35K82J57n91N68J07k68K27P2n95K66L18n79L85L5j86P6j05m90
2379f14P46j96j53K94j46o3K65j64j42J58L6K27k27j80N89k66p12M79K83n65O83
2400C32k39m65M51o7n12M65l6Q9N51p68N00R6p28N32o0k08Q9j61l23N89O2k11
2422b2J33j23J1M05o56q4O11m18j95P24o15J75P3k33J19J76k28K70O3l99O16n60
2444a57k59P80n68JN44m82O8L47m83J67K09l67J86J80n50L87j6m28M76kj39K83
2466A77j38l41L95l35J63K23n09K69K76k21P0J2l54J55L15m74M37j32j76J67p
$$ plain form
2487 -28 -237 -50 -83 -327 260 16 -213 171 -153 -7 416 -227 56 392 -422 -101 155 -207 0 219 -381
2508 -381 4 31 -189 329 74 -288 -19 174 83 94 35 82 108 -21 -21 263 -441 30 155 -418 53 188 -249
2531 -249 -40 173 -276 96 -55 68 208 -247 -273 114 -178 -159 206 24 -111 447 -174 -66 299 27 -114
2552 -114 93 -393 215 59 -369 213 -412 -221 472 16 -24 10 -69 -84 225 -223 -388 336 -314 255 293 -99
2574 -99 61 99 -170 175 -59 165 556 141 -365 278 252 23 166 -107 -152 174 -248 -335 243 -107 127 61
2596 61 99 279 158 -387 94 -39 -201 -114 75 -470 -11 47 -307 124 -82 195 335 -2 -209 225 -116
2617 -116 -104 229 -253 154 61 -184 212 67 -119 290 85 -259 58 -86 -53 473 -296 -81 376 -140 -11
2638 -11 116 -358 14 -23 -284 -221 104 -73 187 191 127 -22 -59 -196 301 -19 -321 274 57 -159 186 -90
$$ packed form
2487b8k09J87l3k44N87k44k29L84l24J46M23o43K83L36q14L21K56l62K07K19o00
2508c81L85K7k20N18k55l62K69J93r1J1n9M7K6j29%K84p04M71J25n73M71J35m37
2531b49K09K13m49L72j51J23J40m55k6L87k92J9L65j82j35N58o21J08L65k72j41
2552a14K07m86O08j56m28N82o25J91O93m56m0L4p9j5L09m48j65P24o50N69L8l92
2574i9J60L8k69L45k34K24L91m15n06O43k6k29J43k73m5L26m22q7N78l50K34o6
2596F1L8J80j21n45M81j33j62Q7J89n45M59N8l54M31k06K77J40l37k07M34l41
2617a16J2L33m82M07r3k45L96j45j86M09k05l44L17j44L3N26p69K15M57n16J29
2638a1J27m74L72l7k61O3L25j77K60Mo4j49l7j37M97l20l02N95k17k16L45k76
$$ plain form
2660 -90 -387 -21 -269 227 10 -227 54 -8 -231 148 320 -372 311 -183 20 320 -156 -190 119 -116 146
2681 146 141 -275 -164 318 -113 285 150 -103 -42 -56 -427 52 4 -225 254 150 -175 329 62 15 166 -58
2703 -58 -232 260 41 33 68 -75 391 86 -280 181 25 -232 106 -143 -274 309 -221 134 -56 299 -16
2724 -16 -162 -72 -180 113 21 144 -35 -83 3 317 -125 -62 -10 -434 280 31 -469 60 -381 -339 200 105 -148
2747 -148 386 198 -58 163 -145 181 -88 -288 -149 43 260 -28 -10 68 325 -77 -261 -26 -102 -93 154 -5
2769 -5 -67 297 -113 5 379 -98 -360 39 -166 -69 280 -231 71 11 -2 258 70 -208 188 185 -46 165 -67
2792 -67 -60 284 18 -75 -199 54 -16 14 -260 -183 230 -299 80 2 -199 150 -180 -421 236 82 -140 110 -17
2815 -17 -113 346 -147 -136 31 -176 -58 80 -178 75 -188 -103 180 66 112 -67 150 -178 281 -174 83 406
$$ packed form
2660i0k97L66k48M96k17k37K81o2k23L79J72o92O83m94K03L00m76l4L09k35K62
2681A46nm16J11M82m31L98j35k53O1j4l71M79m8k29M79j04l25N04k67m7J51k24
2703e8j74M92k19qL5j43M66l05l66M61j56k57L38k49j31N83n30L55j90L55l15
2724a6j46R0j08K93r2J23j79m8Q6L14m42O3N2m24P14k49n00N29m41M2N39r5k53
2747a48N34j88k56K21l08L26k69k00J39J92K17k88J8P8K57m02j84K35p6RK47j59
2769eo2L64m10J18L74m77k62L99k05R7L49n11L02o0j3K60j88k78L96lk31K11k32
2792f7PL44k66r3j24K53p0L0k74P7M13n29L79p8k01L49l30k41O57j54k22K50j27
2815a7r6M59m93J1J67k07J18J38k58K53k63Q5K83j14M6j79K17l28M59m55K57L23
$$ plain form
2837 406 33 -112 158 81 -222 58 47 -258 115 -203 61 45 -532 -44 30 -239 198 170 -245 43 56 -56
2859 -56 462 109 -263 207 -92 -158 92 -170 -16 150 -240 71 460 -21 -74 171 -231 252 227 -95 -89 -265
2881 -265 -509 110 221 -214 47 -135 -306 119 104 -132 47 -76 288 203 -170 151 -309 -241 -85 48 -323
2902 -323 106 200 -161 67 296 356 78 -143 288 352 -104 135 184 -204 26 127 -173 145 184 -364 -185 40
2924 40 -22 189 -59 -317 235 -55 -121 161 -16 -156 310 -194 68 108 -149 53 287 -323 113 -35 -41 67
2946 67 176 -211 200 83 226 31 42 -52 156 -57 -11 286 32 -74 240 -34 -32 152 -96 32 -24 -206
2968 -206 194 152 92 -60 9 -56 101 59 -232 199 59 6 -38 -138 -15 52 -16 -63 188 -42 168 31 -229
2991 -229 141 223 -94 255 -93 -227 428 -37 -358 -79 -15 57 161 -55 82 355 -209 -74 -132 -288 383
$$ packed form
2837D06l73j45K70p7l03K80j1l05L73l18K64j6n77M88P4k69M37k8m15K88J3j12
2859e6N18l53l72M70k99o6K50k62J54J66l90L11L89m81n3K45m02M83k5l22Oj76
2881b65k44O19J11m35K61j82j71M25j5k36J79j23L64q5l73L21m60O8J56J33l71
2902c23M29R4l61K28K29O0k78k21M31O4m56K39M9l88K30J01l00L18L9n48J79K25
2924D0o2K11k48k58N52k90o6K82j77j40M66n04K62M0k57K02K34o10M36j48oJ08
2946F7J09l87M11j17J43j95J1r4K08k13M6K97k54j06L14k74KJ84k48J28n6j82
2968b06M00m2o0j52O9o5J57m2k91M31j40n3m4j00J23O7o8m7K51k30K10j37k60
2991b29L70Q2l17L49l48j34O55m65l21K79O4P2J04k16J37K73n64J35n8j56O71
$$ plain form
3012 383 118 37 201 -60 -26 204 -56 -208 -90 -37 -324 83 -158 -194 156 -41 51 165 -93 -155 381 10
3034 10 -98 545 -5 156 49 -163 139 65 18 322 -130 -238 361 -57 -148 155 -2 147 28 59 166 222
3056 222 -164 61 -84 -279 73 168 219 86 -93 29 301 -126 39 149 -23 -129 128 -46 129 92 19
3077 19 -113 129 -366 -20 145 -268 257 65 -10 68 -21 81 510 -161 90 333 -111 251 101 -228 225
3098 225 306 -380 -64 102 -227 -121 181 -67 40 -29 -68 -57 280 26 -35 121 75 65 -40 17 181 -249 -293
3121 -293 45 33 -51 105 17 59 -116 -93 58 97 -454 281 -87 -15 -239 -69 -109 176 -35 21 108 103 18 -281
3145 -281 -32 -150 -19 -103 120 221 -66 30 -40 21 87 -122 -190 218 -196 -4 50 -100 5 184 68 -135
3167 -135 224 -166 197 182 19 125 -25 -132 58 -92 -162 -33 196 -137 191 74 45 333 -91 -47 130
$$ packed form
3012C83k65q1J64k61L4K30k60j52J18N3k87M07k41l6L50j97R2J14k58o2N36l71
3034A0j08O43n50J61j07k12L02p4m7L04m52j08N99m18r1L03j57J49j19L1J07N6
3056B22l86K25j45j95L52R5N1j33j79J22K72m27J65J10j72j06K57j74J75l7p3
3077A9j32K42m95L46J65m13N25j92p5P8q9J02M29o71K51K43m44L62j50l29M53
3098B25Q1o86L16J66l29J06L02k48J07o9l9J1L37k54o1J56m6j0j05N7J64m30m4
3121b93L38j2q4J56q8M2j75K3J51L9n51P35l68P2k24J70m0K85k11N6Q7nq5k99
3145b81K49j18J31q4K23J01k87R6p0O1O6k09o8M08m14J92N4j50J05J79j16k03
3167a35L59l90L63j5j63J06j50j07J90j50p0J29K29l33L28j17k9K88m24M4J77
$$ plain form
3188 130 37 8 421 46 149 89 -25 156 34 -100 -30 -5 -184 162 250 -29 88 -115 -87 30 -230 -139 34
3211 34 -256 -58 310 -92 7 -62 -201 11 0 -128 25 199 35 181 -73 49 143 177 -282 122 64 -117
3233 -117 152 -259 -213 56 98 -149 118 42 213 262 172 13 -147 -209 131 -47 101 139 -130 -50 2 145 90
3256 90 -89 -53 22 286 105 -236 -81 -50 133 55 -62 -50 -112 -214 94 -111 -92 54 -4 -329 127 -69 -149
3279 -149 39 -215 -14 -21 -161 -83 95 9 -58 26 90 -71 170 -264 205 195 -229 240 -255 -50 192 139 -151
3302 -151 186 -112 55 93 -120 38 311 173 40 12 -20 -69 35 141 7 460 -100 -115 71 -119 161 278
3324 278 8 192 24 -165 89 91 67 47 -222 -189 15 -303 135 21 -99 307 123 -178 269 -286 2 235
3346 235 43 -241 100 125 67 -50 -224 -87 97 159 -205 11 -24 90 256 -107 236 -122 -22 247 24
$$ packed form
3188A30r3k9M13l75J03o0j14J81j22j34P0K5j79L46Q8k79J17k03K8J17k60R1J73
3211C4k90J98L68m02R9o9j39K12j1j28J53J74j64J46k54J22R4L4m59M04n8j81
3233a17K69m11M6K69M2k47K67p6J71M9r0j59j60o2L40j78J48L8k69Q0N2J43n5
3256I0j79L6P5K64j81l41J55L1J83p8j17J2o2j02L08k05J9J46n8l25M56j96q0
3279a49J88k54K01pj40P8J78q6o7Q4O4j61K41m34M69j0m24M69m95K05K42n3k90
3302a51L37k98J67L8k13J58K73j38j33k8l2m9J04J06j34M53n60j5J86j90K80J17
3324B78k70J84j68j89K54Kk4k0k69L3K04l18M38j14j20M06j84l01M47n55K88K33
3346B35j92k84L41K5n8j17j74J37J84O2l64K16l5J14J66l63L43l58J00K69k23
$$ plain form
3367 24 -121 -3 -105 42 177 22 307 280 -85 -84 144 -254 -12 28 -192 -54 -10 -343 79 -56 93 195
3389 195 87 -168 353 -75 -245 267 -228 -97 -125 77 -141 50 106 -36 89 -248 161 54 -166 209 -79
3410 -79 -22 31 -104 -234 82 -258 13 67 -165 -125 241 -71 194 46 -135 35 -1 -172 43 17 45 63 52
3433 52 -144 50 25 92 85 -194 -19 184 -130 170 -33 -252 172 152 -64 -223 131 -115 433 291 -33 170
3455 170 -238 24 45 219 66 60 -23 -21 31 -224 -172 -14 -102 102 123 -80 13 122 1 -32 6 -76 -7 70 -304
3480 -304 80 -266 -39 201 -164 100 135 -350 -22 152 -159 34 132 -129 -161 29 -270 340 172 -36 118
3501 118 179 -157 -37 -192 -76 22 -112 -94 254 -57 36 280 -355 -29 168 -220 232 28 -86 65 7 -144
3523 -144 22 121 -321 15 -59 -8 -74 -247 -112 77 -76 -214 187 19 171 -55 -268 218 -19 39 87 167
$$ packed form
3367B4j45J18j02J47J35j55K85k7l65JK28l98K42M0k20J38M4l33M22j35J49J02
3389A95j08k55N21m28j70N12m95J31k8K02k18J91N6j42J25l37M09j07k20L75k88
3410g9N7N3j35j30L16l40K71N4k32M0L66l12K65j48j81J70l6j71K15k6K8J8j1
3433E2j96J94k5O7pk79J75K03l14L00k03k19M24k0k16j59L54k46N48j42l24K03
3455A70m08K62K1J74j53oq3KN2k55N2J58q8K04K1k03R3J09j21l3L8q2O9P7l74
3480c04L84l46K27K40l65K64L5m85L28J74l11J93R8k61l2J90k99O10j68k08J54
3501A18O1l36J20j55J16R8j34J8L48l11R3K44o35L26J97l88M52k04j14J51n8j51
3523a44J66R9m42L36p4N1o6j73J35J89j53j38M01j68J52k26k13M86k37N8M8Q0
$$ plain form
3545 167 -98 38 5 -208 -21 -4 237 -23 -38 173 -130 -184 194 -5 -260 -33 129 186 -16 173 -80 322
3567 322 -105 -190 103 51 43 -90 -123 -191 -58 -36 -155 69 119 -292 -53 -38 153 121 231 187 -31 -137 150 91
3591 91 -65 199 -24 -129 154 93 34 244 -184 16 12 -138 50 -293 -110 -114 279 -314 74 -428 16 283
3613 283 -53 65 304 -72 -28 358 -90 -138 22 -3 167 132 -55 157 320 -36 -156 150 18 -16 -57 -288
$$ packed form
3545A67k65J36l3k13J87J7K41k60j5K11l03n4L78j99k55K27J62N7k02J89k53M02
3567C22m27q5K93n2qj33l3o8J33K2j19K24N0m11K39J5J91l2J10m4k18j06K87n9
3591I1j56K64k23j05K83o1n9K10m28K00mj50J88l43J83mL93n93L88n02M44K67
3613B83l36J18K39l76M4L86m48m8J60k5J70l5j87K12J63l56j20L06j32l4m1k31
$$ [...]
8191a6
##END NTUPLES=NMR FID
##END=
