##TITLE=1H_Pr 2b_2OMe
 200.13MHz,CDCl3,
 8 sc
 
 25.6.2025
##JCAMPDX= 6.0         $$ Bruker NMR JCAMP-DX V2.0
##DATA TYPE= NMR FID
##DATA CLASS= NTUPLES
##ORIGIN= UXNMR, Bruker Analytische Messtechnik GmbH
##OWNER= pz
$$ XWIN-NMR		Version 3.5
$$ Wed Jun 25 15:48:45 2025 Russian Standard Time (UT+4h)  she@DPX200
##.OBSERVE FREQUENCY= 200.1313
##.OBSERVE NUCLEUS= ^1H
##.DELAY= (6, 6)
##.ACQUISITION MODE= SIMULTANEOUS
##.ACQUISITION SCHEME= undefined
##.AVERAGES= 8
##.DIGITISER RES= 18
##SPECTROMETER/DATA SYSTEM= spect
##.PULSE SEQUENCE= zg30
##.SOLVENT NAME= CDCl3
##.SHIFT REFERENCE= (INTERNAL, CDCl3, 0, 14.3821)
##AUDIT TRAIL= $$ (NUMBER, WHEN, WHO, WHERE, WHAT)
$$ ##TITLE= Audit trail, XWIN-NMR		Version 3.5
$$ ##JCAMPDX= 5.01
$$ ##ORIGIN= Bruker BioSpin GmbH
$$ ##OWNER= she
$$ F:/spectra/data/she/nmr/H-C/1/audita.txt
$$ ##AUDIT TRAIL=  $$ (NUMBER, WHEN, WHO, WHERE, WHAT)
(   1,<2025-06-25 15:46:31.21 +0400>,<she>,<DPX200>,
      <created by zg, POWCHK disabled, PULCHK disabled
       configuration hash MD5:
       00 E9 B6 7A A2 85 ED C7 34 08 36 98 17 FE 4E 26
       data hash MD5: 16K
       C6 DE 83 AA A5 79 CA EE 18 AF B0 05 6F 93 F6 9A>)
$$ ##END=
$$ 
$$ hash MD5
$$ 7A 7A 43 E8 A0 AF 91 8B A5 A5 95 59 DF CB E6 EB
##$RELAX= 
##$RELAX= 
##$RELAX= 
##$RELAX= 
##$RELAX= 
##$RELAX= 
$$ Bruker specific parameters
$$ --------------------------
##$DU= <F:/spectra>
##$EXPNO= 1
##$NAME= <H-C>
##$PROCNO= 1
##$TYPE= <nmr>
##$USER= <she>
##$AMP= (0..31)
100 100 100 100 100 100 100 100 100 100 100 100 100 100 100 100 100 100 
100 100 100 100 100 100 100 100 100 100 100 100 100 100 
##$AQSEQ= 0
##$AQ_mod= 1
##$AUNM= <au_zg>
##$AUTOPOS= <>
##$BF1= 200.13
##$BF2= 200.13
##$BF3= 200.13
##$BF4= 200.13
##$BF5= 200.13
##$BF6= 200.13
##$BF7= 200.13
##$BF8= 200.13
##$BYTORDA= 1
##$CFDGTYP= 0
##$CFRGTYP= 5
##$CHEMSTR= <none>
##$CNST= (0..31)
1 1 145 1 1 1 1 1 1 1 1 1 1 1 1 1 1 1 1 1 1 1 1 1 1 1 1 1 1 1 1 1 
##$CPDPRG= <>
##$CPDPRG1= <>
##$CPDPRG2= <>
##$CPDPRG3= <>
##$CPDPRG4= <mlev>
##$CPDPRG5= <mlev>
##$CPDPRG6= <mlev>
##$CPDPRG7= <mlev>
##$CPDPRG8= <mlev>
##$CPDPRGB= <>
##$CPDPRGT= <>
##$D= (0..31)
0 0.7 0 0 0 0 0 0 0 0 0 0.03 0 0 0 0 0 0 0 0 0 0 0 0 0 0 0 0 0 0 0 0 
##$DATE= 1750851990
##$DBL= (0..7)
120 120 120 120 120 120 120 120 
##$DBP= (0..7)
150 150 150 150 150 150 150 150 
##$DBP07= 0
##$DBPNAM0= <>
##$DBPNAM1= <>
##$DBPNAM2= <>
##$DBPNAM3= <>
##$DBPNAM4= <>
##$DBPNAM5= <>
##$DBPNAM6= <>
##$DBPNAM7= <>
##$DBPOAL= (0..7)
0.5 0.5 0.5 0.5 0.5 0.5 0.5 0.5 
##$DBPOFFS= (0..7)
0 0 0 0 0 0 0 0 
##$DE= 6
##$DECBNUC= <off>
##$DECIM= 32
##$DECNUC= <off>
##$DECSTAT= 4
##$DIGMOD= 1
##$DIGTYP= 9
##$DL= (0..7)
0 120 120 120 120 120 120 120 
##$DP= (0..7)
150 150 150 150 150 150 150 150 
##$DP07= 0
##$DPNAME0= <>
##$DPNAME1= <>
##$DPNAME2= <>
##$DPNAME3= <>
##$DPNAME4= <>
##$DPNAME5= <>
##$DPNAME6= <>
##$DPNAME7= <>
##$DPOAL= (0..7)
0.5 0.5 0.5 0.5 0.5 0.5 0.5 0.5 
##$DPOFFS= (0..7)
0 0 0 0 0 0 0 0 
##$DQDMODE= 0
##$DR= 18
##$DS= 0
##$DSLIST= <SSSSSSSSSSSSSSS>
$$ [...]
##$SUBNAM0= <"">
##$SUBNAM1= <"">
##$SUBNAM2= <"">
##$SUBNAM3= <"">
##$SUBNAM4= <"">
##$SUBNAM5= <"">
##$SUBNAM6= <"">
##$SUBNAM7= <"">
##$SUBNAM8= <"">
##$SUBNAM9= <"">
##$SW= 18.0517328524113
##$SWIBOX= (0..15)
0 0 2 0 0 0 0 0 0 0 0 0 0 0 0 0 
##$SW_h= 3612.71676300578
##$TD= 16384
##$TD0= 1
##$TE= 0
##$TE2= 300
##$TE3= 300
##$TEG= 300
##$TL= (0..7)
0 120 120 120 120 120 120 120 
##$TP= (0..7)
150 150 150 150 150 150 150 150 
##$TP07= 0
##$TPNAME0= <>
##$TPNAME1= <>
##$TPNAME2= <>
##$TPNAME3= <>
##$TPNAME4= <>
##$TPNAME5= <>
##$TPNAME6= <>
##$TPNAME7= <>
##$TPOAL= (0..7)
0.5 0.5 0.5 0.5 0.5 0.5 0.5 0.5 
##$TPOFFS= (0..7)
0 0 0 0 0 0 0 0 
##$TUNHIN= 0
##$TUNHOUT= 0
##$TUNXOUT= 0
##$USERA1= <user>
##$USERA2= <user>
##$USERA3= <user>
##$USERA4= <user>
##$USERA5= <user>
##$V9= 5
##$VALIST= <valist>
##$VCLIST= <CCCCCCCCCCCCCCC>
##$VD= 0
##$VDLIST= <DDDDDDDDDDDDDDD>
##$VPLIST= <PPPPPPPPPPPPPPP>
##$VTLIST= <TTTTTTTTTTTTTTT>
##$WBST= 1024
##$WBSW= 4
##$XGAIN= (0..3)
0 0 0 0 
##$XL= 0
##$YL= 0
##$YMAX_a= 223207
##$YMIN_a= -312825
##$ZGOPTNS= <>
##$ZL1= 120
##$ZL2= 120
##$ZL3= 120
##$ZL4= 120
##$ABSF1= 10
##$ABSF2= 0
##$ABSG= 5
##$ABSL= 3
##$ALPHA= 0
##$AQORDER= 0
##$ASSFAC= 0
##$ASSFACI= 0
##$ASSFACX= 0
##$ASSWID= 0
##$AUNMP= <proc_1d>
##$AZFE= 0.1
##$AZFW= 0.1
##$BCFW= 1
##$BC_mod= 2
##$BYTORDP= 1
##$COROFFS= 0
##$CY= -3
##$DATMOD= 1
##$DC= 2
##$DFILT= <>
##$DTYPP= 0
##$F1P= 0
##$F2P= 0
##$FCOR= 0.5
##$FTSIZE= 0
##$FT_mod= 4
##$GAMMA= 1
##$GB= 0.15
##$INTBC= 1
##$INTSCL= 1
##$ISEN= 128
##$LB= 0.25
##$LEV0= 0
##$LPBIN= 0
##$MAXI= 10000
##$MC2= 0
##$MEAN= 0
##$ME_mod= 0
##$MI= 1.114404
##$NCOEF= 0
##$NC_proc= 0
##$NLEV= 6
##$NOISF1= 3.799351
##$NOISF2= 2.8
##$NSP= 1
##$NTH_PI= 0
##$NZP= 0
##$OFFSET= 14.38212
##$PC= 1
##$PHC0= -1201.509
##$PHC1= 20.7922
##$PH_mod= 1
##$PKNL= yes
##$PPARMOD= 0
##$PSCAL= 0
##$PSIGN= 0
##$REVERSE= no
##$SF= 200.129724274929
##$SI= 16384
##$SIGF1= 3
##$SIGF2= 2
##$SINO= 400
##$SIOLD= 16384
##$SREGLST= <1H.CDCl3>
##$SSB= 0
##$STSI= 0
##$STSR= 0
##$SW_p= 3205.1282051282
##$SYMM= 0
##$S_DEV= 0
##$TDeff= 0
##$TDoff= 0
##$TI= <>
##$TILT= no
##$TM1= 0
##$TM2= 0
##$TOPLEV= 0
##$USERP1= <user>
##$USERP2= <user>
##$USERP3= <user>
##$USERP4= <user>
##$USERP5= <user>
##$WDW= 1
##$XDIM= 8192
##$YMAX_p= 0
##$YMIN_p= 0
$$ End of Bruker specific parameters
$$ ---------------------------------
##NTUPLES= NMR FID
##VAR_NAME=  TIME,          FID/REAL,        FID/IMAG
##SYMBOL=    X,             R,               I
##VAR_TYPE=  INDEPENDENT,   DEPENDENT,       DEPENDENT
##VAR_FORM=  AFFN,          ASDF,            ASDF
##VAR_DIM=   8192,          8192,            8192
##UNITS=     SECONDS,       ARBITRARY UNITS, ARBITRARY UNITS
##FACTOR=    0.0002768,     1,               1
##FIRST=     0,             0,               0
##LAST=      2.2672688,     0,               0
##MIN=       0,             -312825,         0
##MAX=       2.2672688,     223207,          0
$$ Real data points
##PAGE= N=1
##DATA TABLE= (X++(R..R)), XYDATA
$$ [...]
1681E16n56l73N4N39O09L00p84l94m91J36O36K31j6m07o82K28N35L48Q2j56n00
1702a45l83J87L95O21j94k05p51m40N32Q27m7j03l55q71N2M89O38O44n55m80o52
1723g96J24N03Q12J48j96m40r20K27O46M43J51p12l63jP7O84L03j57n47m13m11
1744h38P77M37L58k66q62l91K52L19N30J90n71l64m12L87O52Q7J01l00m20l26
1764f60P90L1K28k33m63L86l3J52N90o07l31j67K35L63J95j16j42p33o8K71M50
1785A38Q8j19m28j05n4L52L21l4k09k98j54K04O00J59k63k54l68j1N41L57M8j67
1807C44n91k61L93M53N39l37n68j27m56N03M43M89Jo71o33p9L65N40J74n97k86
1828c62k65J36N19L75k10k38m73l70M54L84O59k3o29m38J26K61P16K26m04n48
$$ plain form
1681 516 -40 -413 -359 180 789 1089 305 -89 -580 -444 192 423 407 0 -682 -454 81 429 511 355 -145
1702 -145 -528 -341 54 675 481 276 -475 -915 -383 444 397 294 -61 -932 -880 -391 247 891 336 -144 -796
1723 -796 -672 -169 643 791 595 155 -765 -538 108 551 702 -10 -373 -374 -297 387 690 533 -14 -427 -838
1744 -838 -61 376 734 468 -394 -785 -533 -214 316 506 -65 -429 -841 -454 198 285 386 86 -334 -660
1764 -660 130 161 389 156 -307 79 46 198 788 181 -150 -317 -82 281 476 360 218 -515 -583 -312 138
1785 138 226 107 -321 -426 -480 -128 193 159 -50 -348 -502 -298 302 461 198 -56 -424 -435 106 463 511 344
1807 344 -247 -508 -115 338 877 540 -28 -155 -611 -108 335 824 825 154 -479 -558 -193 347 521 -76 -362
1828 -362 -627 -491 28 403 193 -45 -518 -888 -434 -50 609 586 -43 -481 -355 -94 622 848 444 -104
1848a04l10k83O75M42K09O4p42l25l3J69M41J94k71n32j1K30L94n4P4j61m49L2
1870c51L83J72K9j84n32p2K35PO24j57j9l65O3L45M21M5J22l92n12J93P4J10J52
1893C91j72l14L5j24K21p6k15j77lJ28L15K52q6k19m66j02N59J48K46L32n34l29
1915a90L03k30N40l0m20p2m83M44K22J58rJ15k25l54K94M36m0l65l19k77J27L94
1937A9J88k55o7l19m85J12P92J84M09k95m48j67K04K93K55O1k75l57J15N02K01
1958F67m9j58l98m96J42L65J31j88J8l04j71J95M39J93l26k3o96L08L26K36l9
1979A72n5n95k7K05M9L31J89m28J8MK16N2J15j46Jj69J91J77J00j24m19j22K23
2002d2K76O2J1k86k25m13K66L68K03k38j15k39J11Q4K74J18K6j90j12qJ30L08
$$ plain form
1848 -104 -414 -697 -22 420 629 693 -49 -374 -407 -238 203 397 126 -406 -417 -187 207 153 227 66 -383 -351
1870 -351 32 204 233 49 -483 -555 -320 -313 311 154 135 -230 -167 178 599 644 766 374 -138 55 129 239 391
1893 391 219 -95 -60 -184 37 -39 -254 -431 -434 -306 9 261 175 -44 -510 -612 -53 95 341 673 139 -190
1915 -190 113 -117 423 393 -27 -99 -582 -138 84 242 233 348 123 -231 63 499 459 94 -225 -502 -375 19
1937 19 207 -48 -115 -434 -919 -807 -15 169 578 283 -165 -332 -128 165 420 481 206 -151 -36 466 667
1958 667 618 460 62 -434 -292 73 204 16 34 -270 -441 -246 193 386 60 37 -659 -351 -25 211 172
1979 172 117 -478 -505 -300 -251 80 269 -159 -141 -137 79 131 246 100 101 -68 123 300 400 276 -143 -265 -42
2002 -42 234 296 307 21 -204 -617 -351 17 220 -18 -133 -372 -261 -177 97 215 241 51 -61 -69 61 369
2024C69k05j13k68l7R6M61l3j77j58o3j40K32J17K16p2m38L6j44K92M41j27k89
2046dq7n20J83L30L3L36m63j57K4J06J97L77j54j86j75P6L53K73k0L7m82m93K50
2069a66K13K5J28rn33j37K97J28J65N3j52m61m8L29J22J34K16m25q3k02L20J21
2091C5L0L3k29j33K10M59m3l23j40n9R9k4K74J42j00l50R6J87m6L2q7j77l1P3
2115g2j49K35L4J3j37n32L80K23J30j72k46J77j02L71jJ9j6P8l35n9N37k62k0
2138I4J27l66qr4K91L03j87m8l98J49J34K32p2J0j42l90J13J57L53r6m04j15q3
2161d40L28Q4K3j40Q7j05K5K66n0J98j27j54O3p1O8J23M1j72q7M9k43j8L77n2
2185G3j76J5j22J57K36k49K19l55K6O2J27n2L31j06k10lJ13o4K68k76Qo8r1rK55
$$ plain form
2024 369 164 51 -217 -254 -158 303 270 93 -65 -128 -268 -36 81 297 225 -213 -177 -321 -29 412 285 -4
2046 -4 -91 -611 -428 -98 -65 271 -192 -349 -325 -219 -22 355 201 15 -160 -84 269 542 522 559 77 -416 -166
2069 -166 47 72 200 191 -342 -479 -182 -54 111 164 12 -449 -497 -168 -46 88 304 -121 -204 -406 -86 35
2091 35 65 98 -131 -264 -54 405 362 39 -101 -160 -61 -85 189 331 231 -119 -23 164 118 150 63 -114 -145 -72
2115 -72 -221 14 48 61 -76 -608 -228 -5 125 -47 -293 -116 -218 153 152 171 155 233 -102 -161 376 114 94
2138 94 221 -145 -153 -247 44 347 160 112 -286 -137 -3 229 157 167 25 -365 -252 -95 258 162 -242 -357 -440
2161 -440 -112 -28 -5 -145 -58 -163 -138 128 78 276 149 -5 58 -13 55 178 219 47 -40 9 -234 -252 125 73
2185 73 -103 -88 -210 -53 183 -66 153 -202 -176 -114 13 -39 292 186 -24 -27 86 22 290 14 22 -46 -137 -146 109
2210A09r1R6k49l4R1J90J73n0j58j09m9M0nJ16k4k60K1k2J83l4J16k31R3R7nQ2
2236H6K24l25n4p4oM15j49K40j01k82m7JJ00J59j40J9k21N5j72M05L3j24j27L4
2260e1J40J33o6k6Kj77k8J07N9J53j70j69m4N1j3J4K87q5k72J61J2j12J31O2R2
2285A91j20r9j08L28J99n21K10q7l70L07N7R7K11l78K51r1P9j50RJ14k25L5J45
2308H4Kj14J86j84Q2J3R5q5Nj07L3r2l1J66M1J22j03k42K11m0J00OJ6j19K1M6
2334A12j80O1p9j36P2J45J23j50p8K20k90k9K46K3j3P6k46o7J10J38K0J6j44l21
2358c71K80M1J01Q3p1j29j13K07j16%J42K1p7Ol3l4J49R0j29k4j04J26j09J47
2382H3J98m39r3k8J35J74J2o0n8o4K52k02K11n5L3r6j99OJ34Q3j6N1r5M8K36l09
$$ plain form
2210 109 18 114 -135 -169 -78 112 285 235 77 -32 -81 -41 -46 70 46 -214 -193 -215 -32 -66 50 -181 -88 9 4 86
2236 86 310 -15 -69 -143 -149 266 117 357 256 -26 -73 -72 28 187 47 66 -155 -100 -272 133 166 42 -85 -51
2260 -51 89 222 156 130 132 -45 -73 34 93 246 76 -93 -137 -86 -99 -85 202 117 -155 6 18 -94 37 99 191
2285 191 71 -28 -136 192 391 -130 80 -7 -377 -70 -13 84 295 -83 168 77 156 6 15 129 -96 -61 84
2308 84 86 -28 158 -26 56 69 164 79 84 -23 10 -82 -113 53 94 216 113 -129 82 42 142 148 164 45 66 112
2334 112 -68 -7 -86 -222 -150 -5 118 -32 -110 110 -180 -209 37 60 47 123 -123 -190 -80 58 78 94 -50 -371
2358 -371 -91 -50 51 134 63 -66 -179 28 -88 -88 54 75 -2 4 -29 -63 86 176 47 23 -81 45 -64 83
2382 83 281 -158 -251 -279 -144 30 42 -18 -76 -140 112 -90 121 66 99 3 -196 -190 -56 27 11 62 -33 15 251 -58
2408e8N9m2m1J06j5J5k2J9n3q9N6M7o9J18K94k88j11j49L8M1K61j05L3m4K87l19
2434c1mK07k56pJ84k84R0J21j57O7J5J5m5Q7j1J77k30O8J58l8j10N3j32p8K36
2459I5j17J90k29Q3K50k96N5rrm7j85Q8K21j6j75K82q7k7M2k33J51rj82J60j79
2484a83J29K1J4J58r6J1M6j96J36J19j5j36l5J58n4j66j9Q3p2K75m5j36m0J87
2508A44o7m8j71J13J42j34PP3n1p6L8J71j17J08q0N2p2jk31J54P5o0pj80J94O3
2534C9q4j23J66j4k1M4M1J21j39k17J79o4O2k07L00r1Q1M4j57P1J53J2l2j65k4
2559b5n5J59j4j80kJ44m6J22j97L6j16J46j03N7NK5J01m62L96K7L8j15J40r9J0
2584hL8o4k9L4Oj36R7P5j23J16L8j38J31k31K03j78J67Q3l6j79J96J07l0k64J23
$$ plain form
2408 -58 1 -41 -82 24 9 24 2 21 -32 -121 -65 -18 -87 31 325 37 -74 -223 -185 -144 117 12 45 1 288 -31
2434 -31 -35 172 -84 -91 93 -191 -101 20 -137 -70 -55 -40 -85 2 -9 168 -62 6 164 126 16 69 -63 -141 95
2459 95 -22 168 -61 22 272 -24 31 22 13 -34 -219 -131 90 74 -101 181 94 67 109 -124 27 18 -164 -4 -183
2484 -183 -54 -33 -19 139 43 54 100 -96 40 159 144 8 -27 131 77 -89 -108 -25 -97 178 133 -3 -43 144
2508 144 77 29 -142 -29 113 -21 -14 59 8 -68 -30 141 24 132 52 104 32 31 -200 -46 29 -31 -38 -218 -24 39
2534 39 -45 -168 -2 -16 -37 7 48 169 30 -187 -8 -72 -10 -217 83 -8 73 117 -40 31 184 196 164 -1 -25
2559 -25 -80 79 65 -115 -117 27 -19 103 -94 -58 -174 -28 -131 -74 -69 -44 57 -405 -9 18 56 -59 81 -18 -8
2584 -8 30 -34 -63 -29 -23 -159 -62 13 -110 6 44 -94 37 -194 9 -169 -2 81 45 -134 62 169 139 -125 -2
2609bq4m2P4J45L0l4j35K55k73L19k62j45Q9j6J22m2K37k06N5j22J07j86R1j67
2633a92N3J49j19k42M53j50J47k18J40J35r2j52K10k31J78K6j06K5r5K99m81L53
2655I0j38o7L88k16O7k23l0J15J53n2j78q6M2O8J55RR8k05M1J92k34N4j40P2k21
2680b46J03Lj09J18Q0NK38l95J20K43q3j74J67j49o9L05j29Q0M2k59K31l9m1M4
2704H6q3J45j27k16J28j24J34O9K56k66j74J13M6J10q1P4j98l6J57j74K42k14
2726a33J37J93k67k43K45J77j27K38l84J25k70N98j17k29p8P8N8P2nM3N5m00J65
2749f9j01J84j8K6j30J67k21R6R0J48j87J62j48n0L4J38l5m4k1k20J08q6Q0J99
2773A02Pj55j85J39K32k64J40j89R0K0K4J35J7r2r3R3J4NJ56j68j80M5K7J38k8
$$ plain form
2609 -2 -86 -128 -54 91 121 87 -48 207 -66 253 -9 -154 -65 -81 41 -1 236 30 85 -37 70 -116 -25 -192
2633 -192 -139 10 -109 -351 102 -48 99 -119 21 156 64 -88 122 -109 69 95 -11 14 -81 218 -263 90
2655 90 -48 -115 273 57 124 -99 -129 -14 139 87 -91 -177 -135 -67 88 97 195 -10 31 223 -11 43 -97 -25 -246
2680 -246 -143 -140 -249 -131 -51 -46 192 -203 -83 160 77 -97 70 -79 -148 157 28 108 150 -109 122 83 42 86
2704 86 3 148 21 -195 -67 -191 -57 12 268 2 -172 -59 -13 97 16 90 -108 -144 13 -161 81 -133
2726 -133 4 197 -70 -313 -68 109 -18 220 -164 -39 -309 289 172 -57 -135 -57 1 73 68 111 166 -234 -69
2749 -69 -170 14 -4 22 -108 59 -162 -66 24 172 -15 147 -1 -51 -17 121 86 42 21 -199 -91 -177 -97 102
2773 102 109 -46 -231 -92 140 -124 16 -173 -83 -63 -39 96 113 21 -72 21 35 40 196 28 -152 -107 -80 58 30
2798C0L0J59q8j95J21O6m4j05J18j51J8o9J91p4J01l81Q0J54l7Q6J7o8j2M5j54
2823a62K43k9L5k40j7M3J12J38k2Qq3k15J96l1L19k32j8J42l19K05j30J71O8j60
2847B2k70M8K17kR9j52p4O6j82J19J68k7Pl7j4%R9P4j07k2j14j31K02J74j39M
2873B8k27J29q9L46k25K15k30j20K8J67j6l90M72k27K20j35o7K30P1j60j81K73
2895A12J3Q9j37Lj56M3q6J23O3O7M9m80L7L51j0R7k08n8q7L32l02K39p7J4k0j29
2921a18J92l2K33l19R2j53O5j85P8L25j94j6p0O0l7K19j45J76k49j7j10J41L14
2944B50k4k88k75J68o3L46mq9j03j25o9L60oJ06j6k29M7L7K0Q6m9j06n5N4j23
2969a50K22oj26K3r1M4K81j39l0l1K04k86lM9J54P1k03J9n9qK67r1P9k17K6Jq5
$$ plain form
2798 30 60 219 131 -64 57 123 79 -26 92 -59 -41 -110 81 7 108 -273 -193 -39 -76 10 27 -41 -53 -8 -162
2823 -162 81 52 87 -153 -170 -127 -15 123 101 109 26 -189 7 -24 295 63 45 187 -132 73 -57 114 182 22
2847 22 -248 -200 17 15 114 -38 -112 -46 -228 -109 59 32 39 2 -12 -12 87 161 54 32 -82 -213 -11 163 24 28
2873 28 -199 -70 -159 187 -38 177 -53 -173 -145 22 6 -384 88 -139 81 -54 -121 109 180 20 -161 112
2895 112 125 214 77 80 -76 -33 -119 4 67 134 183 -297 -260 91 81 178 -30 -88 -175 157 -145 94 17 31 11 -118
2921 -118 74 42 275 -44 48 -105 -40 -225 -147 178 -16 -32 -102 -42 -79 140 -5 171 -78 -95 -205 -64 250
2944 250 226 -62 -337 -169 -232 114 110 21 -82 -207 -276 84 78 184 168 -61 -14 23 43 129 80 -26 -81 -27 -150
2969 -150 72 66 -60 -37 -128 -84 197 58 28 -3 201 -85 -88 -39 115 186 -17 2 -57 -65 202 111 190 -27 -1 0 -85
2996h5J74n0k07J50O7j32J48k5j42J35j11m2J06j0J30n8j19j0J63j16l1J62k86
3019a89O3R0n9K53q1j38K30k24K28K8J4r0R6l63j01K57J79j61j99J34j69Q4J33
3042A5P0m1j24j96J09K40p4J58m3l4k23J0N6K37j40j8N4l27K71m6K61j62J21j91
3066a7j6n4J7M8O4Q4m5k28OJ72J31l23k2N9P3OO9K5J18j73N6n6p5K15j38R4l02
3093b12J84K9J04M9r6m6K2l2k55L33L9J59m05%Q1j67J58Q8n2J88m51J59Q2j10
3117a51lM0j9J15P5J11n8P6m31K54q2J31J20p8pr8j15L08o6k72K17k46M2P1K82
3142B16k7j62q1j6j40K75J34k24q1Q1k00R5J38K38j77p5Rj17J83N9J18j19L3l25
3166a65K9J91J00j1k2k65j5P8lL43j46j25j22Q0j25J31J37o6k3k18J0J3J98K9
$$ plain form
2996 -85 89 39 -168 -18 49 -83 65 40 -102 33 -78 -120 -14 -24 106 48 -71 -81 82 -34 -65 97 -189
3019 -189 -126 -36 -95 158 77 -61 169 -55 173 201 215 125 221 -142 -243 14 193 32 -167 -33 -202 -118 15
3042 15 85 44 -80 -276 -167 73 -1 157 114 80 -143 -133 -77 160 20 2 56 -271 0 -46 215 53 174 -17
3066 -17 -33 -87 -70 -22 42 126 81 -147 -141 31 162 -161 -183 -124 -51 -45 24 49 167 -6 50 -6 -81 134 -4 90 -212
3093 -212 -28 1 105 154 58 12 34 2 -253 80 119 278 -127 -127 -46 -213 -55 33 -19 169 -282 -123 -41 -151
3117 -151 -154 -114 -133 -18 57 168 110 186 -245 9 -73 58 178 100 93 -5 -120 188 122 -150 67 -179 -137 -66 216
3142 216 189 27 -54 -70 -210 65 199 -25 -106 -25 -225 -130 8 246 69 -6 3 -114 69 128 246 127 160 -165
3166 -165 -136 55 155 144 122 -143 -158 -80 -83 260 114 -11 -133 -53 -178 -47 90 24 1 -217 -207 -194 4 33
3190C3M1J22l10j3j0L17p6j31P2r0n7K00pq9m2K9j65L08k5o6Q7j28j30Q9J0o0
3216i1J35l21L52k64L61l48J45J44k88K91k28L2m2K18k00O2j57L19J40j61K3k85
3238a63K83j80Q3J35J7k23P2l66K67K93o5l4j33k09l8J26K51j21N3l1j80l2J55
3261d0J54P9k16j93J53r4N9L08Q8j11l17j0J64l4K8M03m85N8qJ10k5J17m5k64
3285a21k8Q2K04p7K4j94J45l13K02J32J21mj50k9n0j25L53J53j37o3k76j1L67
3308B05k10j1k05J11j91K52L0J53k75J48m5p3M1J38K03j68j98l9K84n7J5K6k61
3331a27P1k87K61Q8k2J92j60n2K7J25j06K9k28K3J54J41j00J09k4j56L0K1l54
3354c45M18M0k59K3j77L36N2j15J11j82n0n3K54L46l36K80m58m1r6L25N6j17N3
$$ plain form
3190 33 74 196 -114 -127 -137 180 104 -27 45 -45 -102 98 91 2 -40 -11 -176 132 107 41 128 0 -130 -41 -31 -91
3216 -91 44 -277 75 -189 172 -176 -31 113 -175 116 -112 -80 -122 96 -104 -42 -199 120 260 99 122 -163
3238 -163 120 -60 23 158 175 -48 24 -342 -75 218 153 119 -14 -223 -261 -135 116 -5 48 17 -163 -195 -40
3261 -40 114 193 -23 -216 -63 -157 -98 210 298 187 -130 -140 24 -10 18 421 -64 -6 -14 96 71 188 143 -121
3285 -121 -149 -67 137 60 84 -110 35 -278 -76 56 177 173 23 -6 -56 -181 172 325 188 125 -151 -162 205
3308 205 -5 -16 -221 -110 -301 -49 -19 134 -141 7 -38 -111 -70 68 271 103 -95 -134 150 93 108 134 -127
3331 -127 -56 -343 -82 6 -16 176 16 -36 -9 116 10 39 -189 -166 -12 129 29 138 114 -42 -12 9 -345
3354 -345 73 113 -146 -123 -300 36 88 -27 84 -98 -148 -201 53 399 63 343 -115 -156 -252 73 129 12 65
3377F5k99K63j59J71p5J09j15m3k5J07j8K79k33j7j4M5k13J40K36Q7m54K79j50
3400c4L1O4j77j2q6J45L7J66N8j88j20J88k9n1o4J13P4m33K8L71k19L24j07p5
3424Dr5J48k75K36l2k39L07j3r8j4K21j36l55L31j61M11k99J94j81j42m1M8M7
3447a34R3J97k54J62j87pJ75J12k90Q1j88J82q2K44P4k53m9k38Q4L96r1j60K97
3470A64l66J12q8L26M8P1l94R7r4k5K62j86N2Mj54j53M71o0j3j22n4j89K07J51
3494F7Q1k48k5R4k44K63J63j63lJ42k49J9P9o3K21j18m6k68K03J73J13q0r2j6
3518Cj47L52j64J58J20l81k5J14o3J51m9j78K0o6QL45j72j69J26J4Q6k61l1O9
3542a40J77J91k92K55k38J61k08Q0nj07j00K59l06J24N5O7K38j83J3P1j89m7K11
$$ plain form
3377 65 -234 29 -130 41 -34 75 -40 -83 -108 -1 -19 260 27 10 -4 41 -172 -32 204 291 -163 116 -34
3400 -34 -3 61 -116 -128 -214 -69 -32 134 192 4 -116 72 43 -8 -72 41 115 -318 -290 81 -138 186 79 4
3424 4 -91 57 -218 18 -14 -253 54 41 -57 -71 150 14 -341 -10 -171 240 -59 135 -46 -188 -229 -181 -134
3447 -134 -41 156 -98 64 -123 -130 45 157 -133 -52 -240 -58 -140 104 178 -75 -124 -362 -278 118 27 -133 164
3470 164 -202 -90 -178 148 196 267 -127 -30 -124 -149 113 -73 -21 -17 -171 -324 147 87 74 -48 -102 -291 -84 67
3494 67 148 -100 -125 -31 -275 -12 151 -12 -15 127 -122 -103 -24 -87 134 16 -30 -298 -95 78 191 111 19 3
3518 3 -144 208 44 202 322 -59 -84 30 -33 118 69 -109 -89 -155 -147 198 26 -143 -17 -3 83 -178 -209 -140
3542 -140 37 228 -64 191 -47 114 -94 -14 -19 -126 -226 33 -273 -149 -94 -27 211 28 41 112 -77 -124 87
3565H7M4k50L22j31r0j63N3K27Q9j85o4j67j37L42J78k5k12j15J46k63K89K57
3587B32n6j13Q9n9l02L75l55P1O4K6j30P1J42J02j3k15K1j50K87L54l27o5l2j75
3611a58k1K02J57j21p9P0k50K77k1L8k5j46k45J78L10j64K15j97k9L5k1N0J88
3634B43l5o1k28j60J51L37j01j04k37R2j39P7P7J39N9j91K8l7Q7K84l28K53k52
3657d6r2j8K67J31j77j99J5L09l57L09l08K47n3k3j71M83j21l07J18M8j22J01
3679C4m4q5l6J02l1j13K16j20J36k45O1L0j56L87K10n34K30j9OJ08R3l9j28l2
3703C1j85J27K62p8O6m05J1Q1J2J40J73j09j12r7n7Q1J09o7J44l07K41j09j71
3726b19M81k88j49R0k6K0J65p5K33j08j12l0J08l7K09j41O2k06p7K22j22J22P3
$$ plain form
3565 87 131 -119 203 72 -18 -181 -128 99 188 3 -61 -228 -365 -23 155 130 -82 -197 -51 -314 -25 232
3587 232 176 63 152 93 -209 166 -189 -118 -54 -28 -158 -87 55 157 144 -71 -50 -200 87 441 114 49 17 -158
3611 -158 -179 23 180 59 -20 50 -200 77 56 94 69 -77 -322 -144 166 2 217 20 -9 26 5 55 243
3634 243 208 147 -81 -241 -90 247 146 42 -195 -103 -242 -165 -88 51 110 -81 -53 -90 -3 281 -47 206 -46
3657 -46 -138 -156 111 242 65 -134 -119 190 -167 142 -166 81 28 5 -166 317 196 -111 7 55 -67 34
3679 34 -10 -95 -131 -29 -60 -173 43 -77 59 -186 -125 -95 -251 136 346 -188 42 23 29 137 230 191 63 31
3703 31 -154 -27 235 157 223 -182 -171 -90 -78 62 235 126 14 -83 -140 -59 50 -17 127 -180 61 -48 -219
3726 -219 262 -26 -175 -85 -111 -91 74 -1 232 124 12 -18 90 53 262 121 183 -23 -100 122 0 122 195
3749A95k53p5J87j28K46j57J26j67o6j6J24L7j02l7J8K8OK48j0l75Q0p8J98o1
3773c2J44j75p6K51k61K71p4j19J68k47q4J98K29p5j89r2Q0l5K44l8J30k41m9
3796g2L7q7J78O6k14O8l28J25K43J01qK3j31k42L18j51L58J8l52j40R7J1L14j39
3820I3K3o1l37K36K3jJ56O9n29K94L2o7J77q5o6q6n5j1L07K9K21l73k69R6O4J79
3846E9J29j39Q3j87J79j51K60L1k07k06R3J9K76k91J94j62j92L50l44J52K36l32
3868a50P0K2q0J51Q1OK7j99J49j04J2K97k63l5J5J67j65J06j98k3P4l22L72Q8
3892I8q7rj1p8L1K05k38L41k61j58J97m6j7J35j40j39J78j44R0R5QK9j92j45L05
3917D7Q4n7j37q2K04N7J84k47R6k5k41J03k61K93K30k25Q8l40J86k28K91R1j4
$$ plain form
3749 195 -58 -133 54 -74 172 15 141 -26 -92 -108 16 53 -49 -86 -68 -40 -34 214 204 -171 -91 -169 29 -32
3773 -32 112 -63 -139 112 -149 122 48 -71 97 -150 -234 -36 193 118 -71 -163 -83 -118 126 88 218 -23 -72
3796 -72 -35 -122 56 122 -92 -24 -352 -227 16 117 109 132 1 -241 77 -74 284 302 -50 -190 -93 -82 232 93
3820 93 116 55 -282 -46 -23 -24 132 201 -328 -34 -2 -69 108 23 -43 -129 -184 -195 112 141 362 -11 -280 -184 -120 59
3846 59 188 49 132 -55 124 -27 233 264 57 -149 -56 -37 239 -52 142 -20 -212 138 -206 -54 182 -150
3868 -150 -80 -58 -138 13 94 100 127 -72 77 -27 -15 282 19 -16 -1 166 1 107 -91 -114 -40 -362 10 98
3892 98 11 2 -9 -87 -56 149 -89 252 -9 -167 30 -16 -33 102 -38 -177 1 -143 -53 42 50 79 -113 -258 47
3917 47 131 74 -63 -145 59 116 300 53 149 124 -117 -14 -275 18 248 23 111 -229 -43 -271 20 111 97
3940I7j2l1k24rJ84j22L23k60j64P4K61k2p4K06m51K14J24O8L7j94N9j16L7j3
3964hP7jJ67j57q2j58L34j40P1j96j3j13K83p3O4j17p0J06l05L75l4J24k2k50
3988a38J06J18o9K02l1k26J07j69O5Q1j32K10j39Oj02J01K00q5J54l66j74K47
4010c4J6N9j5M8j01m0K26J13j7k05k7j38PJ24k8K60m75K96l1k01K24J55o4k21
4034f9j25P7J60J17r0K47n68K28j03j3K52L4j16j75J69p5K5K7J65k17j11j25L75
4057H9j3q0L5J89k75j49K00o3J7L90j93l75L1K15J1J4m6k18J08j72L05Q3n1j60
4081a08K95l2n4j83O5Q1j45mJ38O9j40J29m4j5j15K78j38nN5j58MO0J36k42K21
4106A48J07l83P7L7lM6N2j33j77K49j53K94J23k89R5j47K40m7j7k22j5K1J40j10
$$ plain form
3940 97 85 54 -170 -179 5 -117 206 -54 -218 -144 117 95 21 227 -224 -10 114 182 219 25 84 -32 5 -8
3964 -8 69 68 235 78 -4 -162 172 32 103 -93 -106 -219 64 -9 55 -62 -132 -26 -331 44 10 134 112 -138
3988 -138 -32 86 17 219 188 -38 69 -100 -35 46 -86 124 -15 -9 -111 -10 190 105 259 -107 -281 -34
4010 -34 -18 41 26 74 -27 -67 159 272 255 50 23 -115 -108 16 -12 248 -227 69 38 -163 61 216 152 -69
4034 -69 -194 -117 43 160 70 317 -251 -23 -126 -139 113 147 31 -144 25 -50 -25 2 167 -50 -161 -286 89
4057 89 76 -4 31 220 -55 -204 -4 -67 -50 340 147 -228 -197 18 29 43 -3 -221 -113 -285 20 103 52 -108
4081 -108 187 155 101 -82 -17 64 -81 -85 53 122 -18 111 67 52 -63 215 77 72 127 -31 -27 33 169 -73 148
4106 148 255 -128 -51 -14 -17 29 81 -52 -229 20 -133 161 284 -5 90 -57 183 136 119 -103 -118 -97 43 -67
4130f7J40j00J14k90O4L97l70J00N7J4k84K11o3K20l39J95Q5k87O9J27J96N1l28
4153h8j03K41j30r8J35J35M0k21R0r2M2J8K0k60K18J63r6M3k74M10k35j29K92
4176A21k1j47K00j92j03O5j18J75K23k33l0L8j99J20J53l4L6J64k71Q9l9RO0m16
4200c50K63J15P2k3J9j78j86L87k92K68k09K21j80N9j15O5j43L25k52L4K2J43
4222F5l1j40P3J52j14j09J49P7k71R5J55j49J97J13j61o1k41R6L6oJ04R9n8j38
4246f8K26l12J00N1O4p7k8q0K30j81N9m1L0QN7o6K7J63j61Q9k51K63j69j13P3
4271a07L71k28j87L66l00m6J04Q9k43J02L4PK54k44Q6J5k04K21j72Q1M7P5r8P3
4295I6l9j53O4p4J50k02Q3J72j34R0j78j9L53k55p5P5r5J24m8j35J03J60q0J46
$$ plain form
4130 -67 73 -27 87 -203 -139 258 -112 -12 45 59 -225 -14 -77 143 -196 -1 84 -203 -134 -7 189 240 -88
4153 -88 -191 50 -80 -178 -43 92 132 -89 1 -91 -49 -31 -11 -271 -53 110 14 57 -217 193 -42 -171 121
4176 121 100 -47 153 -39 -142 -77 -195 -20 203 -30 -60 -22 -221 -101 52 18 54 218 -53 36 -3 6 66 -350
4200 -350 -87 28 100 77 96 -82 -268 119 -173 95 -114 107 -73 -14 -129 -64 -207 118 -134 -100 -78 65
4222 65 34 -106 -33 119 5 -104 45 122 -149 -54 101 -48 149 262 101 40 -201 -105 -69 -75 29 128 70 -68
4246 -68 158 -154 -54 -3 61 -16 -44 -124 106 -75 -16 -57 -27 -19 38 -28 -1 162 1 90 -161 102 -67 -180 -107
4271 -107 264 36 -151 215 -85 -131 -27 62 -181 -79 -45 -38 216 -28 58 73 -131 90 -82 -1 46 121 23 96
4295 96 57 -96 -32 -106 44 -158 -75 97 -37 53 -125 -144 209 -46 -121 -46 -141 -17 -65 -200 -97 63 -17 129
4319A29R5k68N2J87j72kk31K72p7M2oR1p9l05K64n4M3nL7j4q8p2L84k72K94l18
4345g3J34O7r8J01J09j03P5l92O9J83j50j06R1N9j39J67M7M9Q6L1j66J3N1Mj32
4370b3J27J17l03k0J36j77J59j10J39j17J72r9r6K15q7P7j30Q8m0M5j31o4N3Q8
4394A9J7LK4L1l17J21m6K27r2rMJ47M1k89Q5L5K60k45j98m7J51R2M9n1o0R1l5
4421Ho2l7K0P5J4o1j06J68J25J59l5m08K15q1k6mj53J56O0J97j94l5J18j71o1
4446a19J57N3j59Q7n2J3r1q3K12O9Q4j07o7o2K92o9j16M1q0j55L1Q0l2R2k55L14
4472G8l85M22j25Ko7P4Mk45L37j64Q5L5m7p5J52J51j81r3j5R6k64J03K11mk87
4497b02L27j18j3j0j77L26J53j62j25L9q4J03M5k06J69o2J72l50R1J22Kj65R8
$$ plain form
4319 129 224 -44 8 195 23 21 -210 62 -15 27 21 112 33 -272 -8 -62 -19 -24 13 -1 -89 -161 223 -49 245 -73
4345 -73 61 128 30 131 240 137 212 -180 -111 72 -78 -184 -93 -34 -173 -6 41 90 176 207 41 54 105 109 -23
4370 -23 104 221 -82 -102 34 -143 16 -94 45 -72 100 1 -95 120 33 110 -20 68 28 73 -58 -122 -69 19
4394 19 36 39 63 94 -223 -102 -148 79 -13 -22 -18 129 170 -119 -34 1 261 16 -182 -229 -78 14 63 12 -48 43 8
4421 8 -54 -91 -71 4 18 -43 -149 19 144 303 268 -140 75 -6 -32 -36 -189 -33 27 224 30 -5 113 -58 -119
4446 -119 38 91 -68 19 -33 -20 -111 -194 18 87 171 64 -3 -65 227 158 42 83 3 -152 -121 -41 -73 19 -236 78
4472 78 -307 115 -10 -8 -75 -1 3 -242 95 -69 16 51 4 -71 81 232 51 -42 -57 39 -225 -122 89 85 -202
4497 -202 125 7 -6 -16 -193 133 286 124 -1 38 -46 57 102 -104 65 3 175 -175 -84 38 40 -125 -27
4520b7P7L0j19J5J3K1Q2O8p1r9j29K23J13j67J30j82N1j15M0L4p5j01K49L28l46
4545D3N5k4j47L49l12k1NN2k2O4J29j28k37J51m2j4K88p1q2N5j62j07J38Q2J22
4570A64k31o6L10M7l48J17qj23l8L2Q6J35p0nn3j85L20j7P4j94q4J98k4R3l9Q2
4596A73p9j4p7j68K71l9k47J66J44j72q4J29J05Mk05q3K41j23O4J15j59K6j8J30
4620A00K5l02K81j85N1n3N9kJ66j81J76r5j72K51j72R9N0J46l39J53km6l9m8J20
4645D1pj82J30rK2n5j23J90m6k3j80P0M8J13l1j21N4L29l35J42q8J11P0M7l69
4670b02N9J8M7jR9J5p4O7j72K02N3j21o2J83o3rJ0N4kPj34l0J4Nm4R4l3m2J03
4699D1k32K22R8l9m1k93J30J05K15k51K07o9p7rj30j26J54N6j19K05j39K55k19
$$ plain form
4520 -27 50 80 -39 -24 -11 10 92 160 89 -10 -139 84 197 30 160 -22 29 -86 -46 -12 -87 -188 61 389 43
4545 43 98 74 -73 276 -36 -57 -52 0 -22 42 171 43 -194 -43 -85 -99 189 118 36 91 -71 -178 -40 42 164
4570 164 -67 -133 177 224 -124 -7 -15 -138 -176 -144 -58 77 7 2 -51 -236 84 67 141 -53 -137 61 37 130 91 173
4596 173 94 80 3 -165 106 67 -180 -14 130 -42 -126 3 108 112 -93 -176 65 -58 6 121 -38 -12 -30 100
4620 100 125 -177 104 -81 -30 -83 -24 -26 140 -41 135 40 -132 119 -53 46 96 242 -97 56 54 8 -31 -79 41
4645 41 34 -148 -18 -27 -5 -60 -183 7 -39 -62 -242 -172 -124 -11 -42 -163 -109 220 -115 27 -61 50 120 167 -202
4670 -202 -143 -125 -78 -79 20 35 -39 28 -144 58 111 -10 -72 111 48 39 49 103 101 108 -26 -56 -42 -37 -81 13 -20 -62 41
4699 41 -191 31 129 90 49 -244 -114 -9 206 -45 162 93 16 7 -123 -249 -95 -39 -158 47 -92 163 -56
4722e6J26p7J7R5j97L08k01j14Q6L7j58K3P2J49qk61J19j30J96J07j22j58Q9J14
4746E6j65L55k49Q0l5J01j49J78k33K33k47M0J45r7J21j13J9k24K67p3Mn7J80
4769A37k11k31K79J62k01M6J36k37J79j51J03l7J31n2n6L4j5r3J3L2o5Q7pj19
4793a36O1oJ39j5m6j13K99p1m5j42o2M2J2J99j88O3L5j15R3J05k33K98k21n6J96
4818I3m4j04k9J69k8j57Kj6R3R2j48J37J4l48M0L42j66N3r9R4j67K31p5J34J15
4843B28l45M5O5J03j98J86k33J6J88M7j48j39J46J77j10M9J16k48jj12K54J35
4865B21m07L03l1%l07J00J60j35J43k1J14k29j81K37j31J99J70k90K9J18j30K53
4887A85q7l77J67q2M46k51m6J29k44M9R7K4M1j07J37J02j65r2Rr9P2J22j03L1
$$ plain form
4722 -56 70 -7 10 105 -92 216 15 -99 -13 24 -134 -111 -39 110 102 -159 -40 -170 26 133 11 -147 -58 56
4746 56 -109 246 -3 77 42 143 -6 172 -61 172 -75 -35 110 13 134 21 40 -184 83 10 14 -43 137
4769 137 -74 -305 -26 136 -65 -19 117 -120 59 -92 11 -26 105 53 -3 31 16 -77 -64 -32 -97 -10 -17 -136
4793 -136 -75 -81 58 43 -3 -116 183 112 67 -75 -137 -95 -83 116 -72 -9 26 -89 4 109 -124 174 -47 -103 93
4818 93 49 -55 -84 85 57 -100 -98 -114 -21 71 -77 60 74 -274 -234 108 -58 -5 -104 -10 -177 54 -21 113 228
4843 228 -117 -72 -7 96 -102 84 -149 -133 55 102 -46 -185 -39 138 28 77 193 -55 -56 -168 86 221
4865 221 -186 117 86 86 -221 -121 39 -96 47 26 140 -89 -270 -33 -164 35 205 -85 -56 62 -68 185
4887 185 98 -279 -112 -194 252 1 -45 84 -160 -111 -14 10 51 -56 81 183 18 -74 -65 -164 -92 30 -73 -42
4911d2l23K69J91L1r0k90K26J30j08O5j5r7m5J54p3K8K67j61L2o2j04J86l07l1
4935a69K53j67n5J15N1L8r8J02l7j6j82O2N8K6J02l4M7p2q6o9Q8p6J03l4k6J04
4961B8j28L3R9r3N3L0OK08j97k5Q4K9j25J95m7j37M7J32k8Q9j15n0jo4j00JO7
4988iJ4K3j75J90j05J89l23J66O8j39O7q9J90mj00Q5j60J19o9J01k32J77L3P8
5012I5k74J72N5M8K07l39J15j14K06m0k66K04N5k5j26O0r1j62L63k09J20j25q7
5035a58J73j4J7K44k29j5k3k81K78J38j59L4j1j92N6J16r3J00K9R9o2o2K5J32
5059A42m06M9O8K2P8r7J37J91O6j65n7n5J57Q7j35j82ko5P3J04j02p6L86l10K52
5084A60j90j32J97k42J58m3n1K31j27J7L4j15M1J21N1j76K08k22J0O9J31k9j6
$$ plain form
4911 -42 -365 -96 95 126 36 -254 -28 102 -6 59 44 -53 -98 56 -17 11 278 117 149 87 -17 169 -138 -169
4935 -169 84 -83 -138 -23 28 66 -32 70 33 17 -165 -103 -45 -19 83 49 96 24 -62 -131 -43 -119 -16 -50 -76 28
4961 28 -100 -67 32 -61 -8 22 28 236 39 14 98 127 2 197 150 13 60 192 164 253 138 88 87 23 -77 -76 -9
4988 -9 5 28 -147 43 -62 127 -196 -30 38 -101 -34 -123 67 63 -37 48 -112 7 -62 39 -193 -16 17 95
5012 95 -179 -7 48 96 303 -36 79 -35 171 131 -135 69 124 99 -27 33 -58 -220 143 -66 54 -71 -158
5035 -158 15 1 18 262 33 18 -5 -286 -8 130 -29 5 -6 -198 -142 -26 -119 -19 10 109 47 -15 10 142
5059 142 -264 -215 -147 -125 -47 -144 -7 184 250 85 28 -27 130 217 82 -100 -102 -167 -94 10 -92 -168 218 -92 160
5084 160 -30 -162 35 -207 -49 -92 -143 88 -39 -22 12 -103 -62 59 110 -66 142 -80 -70 -1 130 101 85
5107H5j39J68q8j68l5K29J0k99J09K15O4l84J12L4j3J4P5K5L0j0J1J83l8m8j79
5132c7j71N18m61K54O9j93j93J22K35j26m2j09J25N5k0j44J30r2K4K3J42j97j82
5155b70K87j40J52k2j77K39k58J0J38q4j49L90j50j6M7j69K18M9n9J6m2Q6p6p
5179A3j23J35n4r6L02j13j16J5l3L4k49L77k36lK56l01L05r3p2p1J82k73K89k5
5203E0p6J28l38O9J31J79k69K04k01o3L16K9l03K34j06m9K8Q7q1J18q7j7J21r6
5227Hj87Q6K72l13K09q9n6L1O7k30L25q7k49K82j10N0J5P9l3J27j45o1K1o2J13
5252F3j62J50r3j44K08N0Rk07L6N2K31k51L0r4J20P7k05L16m1q4j89R6J33l45
5276b44J58k9p0L04q1J06k11J35q2q9J11O1k33J67L6j42J44l1j53m6K05K4j83
$$ plain form
5107 85 -54 114 26 -142 -177 52 62 -237 -128 87 151 -233 -121 -87 -100 -86 -11 14 44 34 45 228 190 142 -37
5132 -37 -208 310 -151 103 172 -21 -214 -92 143 17 -25 -134 -9 46 26 -118 12 -80 -56 -33 109 -88 -270
5155 -270 17 -123 29 7 -170 69 -189 -179 -41 -125 -274 116 -34 -50 -3 -172 46 95 36 52 10 96 20 13
5179 13 -110 25 -29 -125 177 64 -52 -37 -70 -36 -285 92 -144 -147 109 -192 113 20 -52 -123 59 -214 75 50
5203 50 -26 102 -236 -167 -36 143 -126 78 -123 -186 130 159 -144 90 -16 -65 -37 50 -31 87 0 -17 104 8
5227 8 -179 -93 179 -134 75 -14 -70 -39 28 -202 123 36 -213 69 -41 9 24 103 70 197 52 -9 12 -50 63
5252 63 -99 51 -42 -186 22 72 81 -126 -90 -38 193 -58 -28 -122 -2 75 -130 186 145 61 -128 -32 101 -244
5276 -244 -86 -115 -185 119 38 144 -67 68 -14 -103 8 69 -164 3 39 -103 41 10 -143 -189 16 40 -143
5299a43N9j00K87Np9j79J60R3j12K06q4k58J09J66M1k32K06q6J41k14j17K12l15
5322b34L08j55K9K66k17J48l26L56k18J68k4j69m1Q2J88j84J52m6j12N0N0r7j62
5345a88J95q8l02M37K1p3J07J3j93K83j00j05J44q4J70j43l55L43k23N4L27l83
5367a43Q4K33j20k29J05m9J50J32j65m5j3nP2j0Rk68M07j40j9N0j29R4k10J42
5391f7J93J04k61k9j34K98j03J03n9J7j4J43k85K71k28k2J85k7r5P8k11J81J7
5414E5K2%Qj23P8j32P2n5J78l2j14o7j2R8k91J74J22J8J53k22M8j41j3L13j84
5439d7m0J29O4p7q8Q1j76J34j17R3K00l65K22K20k16k2j32J55l9jj56L58m6p7
5463E7J70j33j71J31j23K0J05L0L3%j19qq0Rk3O7o4K81j17o2o3j2J13j77J30J77
$$ plain form
5299 -143 -84 -184 103 108 29 -150 10 103 -9 197 113 -145 -36 130 171 -61 145 59 200 -14 -131 81 -234
5322 -234 74 -81 -52 214 -3 145 -181 175 -43 125 101 -68 -109 -27 161 -23 129 83 -29 21 71 -26 -188
5345 -188 7 -81 -383 54 75 2 109 122 -71 212 112 7 151 67 237 94 -261 82 -141 -87 240 -143
5367 -143 -59 174 54 -175 -70 -119 31 163 -2 -47 -60 -65 7 -3 6 -262 145 5 -14 36 -93 1 -209 -67
5391 -67 126 230 -31 -60 -194 104 1 104 45 62 48 191 -94 177 -51 -73 112 85 -10 68 -143 38 55
5414 55 77 77 85 -38 40 -92 -20 -75 103 71 -43 -110 -122 -24 -315 -141 -19 -1 152 -70 -22 -163 -176 137 -47
5439 -47 -87 42 106 29 -59 22 -154 -20 -137 -44 156 -209 13 233 17 -5 -137 18 -21 -22 -178 180 134 57
5463 57 227 94 -77 54 -69 -49 56 86 119 119 0 -8 -88 -79 -102 -35 -99 182 65 3 -60 -72 41 -136 -6 171
5489A71k94m9K95k06M3O6jj12r1N2J31o1O7K5j38nJ77o4j36J64j38K13j6q0K93
5514C06k24r6J17M0m4r2k3J83l13K05L4J78m12J61P3r2M5j17O2j8P3J02j77M0
5538A1l8J13j81M05l07j55J97j89J64M1l9m1oJ07M4j08n0O2K37m77L20O0j14k7
5562B9J10j94M5p3J86r8R4n1M6Ll0j05R0r8J31q2q1P4l8K9o9k7n8J93ql5P2j08
5590e3q1j40Q6L0K63k55R8L11l73K83j13J0m7l1p2m9O8N7J26j31n4j7KO5j02Q8
5616c1l5J69j47L79m55J31P9l6r3Q2O1j52K2J91n8M8k30J5K9L5j64K9J75O9o2
5641E1j5J9m1L6L4L8n2J36k23J1O4j21l0J47J72k48P9j04Q2N2j30o2J22J81k23
5666b5J08p3k1p1mK42j10J3J7j18k7Q8J75o4jk33K12j66j73K76P5j02M1p8l7L00
$$ plain form
5489 171 -123 -172 123 -83 -40 26 25 -87 -178 -126 5 -56 11 36 -102 -107 70 6 -130 34 -104 109 93 13 306
5514 306 82 -14 103 143 99 7 -16 167 -146 59 93 271 -141 20 93 1 46 -71 -9 -27 46 148 -29 11
5538 11 -27 86 -95 310 3 -152 45 -144 20 61 22 -19 -25 82 126 18 -32 30 267 -210 110 170 56 29
5562 29 139 -55 -10 -83 103 5 99 48 94 97 67 -38 52 -46 85 3 -78 -4 -42 -13 -82 -109 -167 26 18 -17 55 -53
5590 -53 -134 -274 -188 -158 105 -150 -52 259 -114 169 56 66 19 -12 -84 -133 -65 -8 118 -13 -67 -84 -82 -17 -119 -31
5616 -31 -66 103 -44 335 -120 11 90 54 -39 43 104 -48 -26 165 107 155 -75 -60 -31 4 -160 -131 44 113 51
5641 51 36 55 14 50 84 122 70 206 -17 -6 58 -63 -93 54 226 -22 57 -47 35 87 -43 -105 17 198 -25
5666 -25 83 10 -11 -82 -86 156 46 59 76 -42 -69 19 194 130 129 -104 108 -58 -231 45 120 18 59 -19 -56 244
5692B44j96K7k93K34P3j49o7j82K57J61k15L11j30J56l56Q3J27k08J92j42l2K51
5714A46Ok31K94k18qP5k1j32J57k03J21m9q1K20m1L1m1J61k95J11K5j13K62J0
5738A86l82K85n7J36r9k48J06j32K39j58O0j15K05n0L4kj81J41p0j3k5k4L16k84
5762a32K19k06K51J14j68P7k4k13N1KJ02p0J5J01j38j9P5R1o6Q9k58J34j68L68
5786B27k96K69k73L1j18J48j0Q3r6J37J41l20J38k4l7O3j3J23j25J07j93J42j09
5809eN9j28RR9P0j48N5L7p5nP6%J16l6l17J45m8K23l37M58l94K90k08J03k9J3
5835B3J03k29K16j85O0N6R8Q8k37j28M2J37l6L7l1p1J8Rr5K79j54j14J92j91K13
5860A00k28l4J94J34k80J67q9M9K29j28j96O3K27j04J54o0l71NJ86j34K35n9m8
$$ plain form
5692 244 48 75 -218 16 89 -60 -127 -309 -52 109 -106 205 75 231 -125 -42 85 -123 69 -73 -105 146
5714 146 152 -79 215 -3 -11 64 43 -89 68 -135 -14 -63 -144 76 35 66 25 186 -109 2 27 -86 176 186
5738 186 -196 89 32 168 69 -179 -73 -205 34 -124 -64 -179 26 -24 10 8 -173 -32 -102 -115 -140 -164 152 -132
5762 -132 87 -119 132 246 78 155 131 -82 -31 -29 73 3 18 119 -19 -38 37 128 62 151 -107 27 -141 227
5786 227 -69 200 -73 -42 -160 -12 -22 61 -35 102 243 -77 61 37 0 63 50 173 48 155 -38 104 -5
5809 -5 54 -74 -65 34 104 -44 11 48 -27 -32 44 44 160 124 -193 -48 -96 127 -210 248 -146 144 -64 39 10 23
5835 23 126 -103 113 -72 -12 44 142 230 -7 -135 -93 44 8 45 14 -57 -39 -30 -125 154 0 -114 78 -113 100
5860 100 -128 -162 32 166 -114 53 -36 13 242 114 -82 -19 208 104 258 198 -173 -168 18 -116 119 60 12
5883A2j74L77j06l18L77k6k83J04k2N4R2R1p3j81%L29k60J51j22k73J43J81M2
5906A15j45Oj27J45r6N9J91l03M2K74r7rn8j2P0rqj40L3L38k18j16J46Qp6Q4k11
5933a14Q5J38j58Q6o2j39kK83j07o4L03k85k0O3J60m1j55m7K3J87k12Q3J70m7
5957A28j13L8M7Q0lk07O4j11R1O2l7J26j06j00J65j48r3n9M11j64j32o6QM06l04
5982a7Q2j55M2J6o3J32J03j52J1n2pj26K86j28M6Ok8k2j55L51j83K27j10n2p4
6007b2O2k7J28j88J23j24J24J73k16j55n3K31J31k17k2p9J31L6K9j58K34j38k20
6030b17M43j74R9l88J34O6P3j8Rp3j89L14J49j06k95L03P4l32J2j45L78j58m5
6053h6L4l4L65m66R7o5K30K6k57P3N9Q9j97L83k73j72K72j02K40q8q7n9k5N1R0
$$ plain form
5883 12 -162 215 109 -209 168 142 -141 -37 -59 -5 87 178 105 -76 -76 253 -7 144 22 -251 -108 73 115
5906 115 -30 -24 -151 -6 -102 -43 148 -155 -113 161 64 55 -3 -15 55 46 38 -102 -69 269 51 -65 81 89 13 97 -114
5933 -114 -29 109 -49 37 -25 -164 -166 117 10 -54 249 -36 -56 7 167 126 -29 -76 -53 134 -78 5 175 128
5957 128 15 53 100 180 177 -30 34 -77 14 76 39 165 59 -41 124 -24 -117 -176 235 71 -61 -127 -119 287 -17
5982 -17 65 -90 -48 -32 -95 37 140 -12 -1 -53 -60 -186 100 -28 18 24 -4 -26 -181 170 -13 214 104 52 -22
6007 -22 40 13 141 -47 76 -48 76 249 33 -122 -175 56 187 -30 -52 -131 0 36 65 -93 141 3 -217
6030 -217 226 52 151 -237 -103 -37 36 18 27 -46 -235 79 228 122 -173 130 204 -128 -116 -261 117 -41 -86
6053 -86 -52 -86 279 -187 -90 -155 75 101 -156 -83 -24 65 -132 251 -22 -194 78 -24 216 128 41 -18 -43 8 98
6078I8r4O7k63K12j26j48L20k6m3J12k41J83Qj03N7Q7j86N2p5J98j25J04k78L13
6102A03j63J24l94K74Q5J7J69l12K14r9J2j4K38k55n9M5m7p0N2J03l7Q4L9N6q7
6127G8j65o2Q9j11RK00J63n1j05j40O1m4K1j0R8p4j96K23M7m2j32J46k54L98o8
6152G9j2m6j4Lm2J40l5J47k01Q1q4O6J9j08J16K6j01n2j81J95Q9j32j62J86K74
6177B51j34J60l72kJ09Kl0N8M8L3j61%r7J27q1K08k63J65l5M5K9j5M9j13J76m0
6203A17mj61j40K45J41k45p1J61K75j08j46j63lJ99K07l41J94j22r8O4j02J32
6225C1J9j14M5l9K2J13l7q4l8K0K6nJ00k47L7K97j50J21j32M7N3k92kR8K13K3
6251A25k45J31p3J71k52K82j87o9l4R6J57k29O0j6N4n5K6J76m1J22r2J0j54K43
$$ plain form
6078 98 4 71 -192 20 -106 -254 66 40 -3 109 -132 51 59 -44 13 100 -86 -34 -109 89 -36 68 -210 103
6102 103 -60 64 -330 -56 29 46 215 -97 117 18 30 16 254 -1 -60 -15 -62 -132 -80 23 -14 70 109 165 78
6127 78 -87 -149 -60 -171 -162 38 201 150 45 -95 -34 -78 -57 -67 31 -43 -239 -16 31 -11 -143 3 -251 147 79
6152 79 67 21 7 10 -32 108 73 220 19 100 16 82 101 -7 109 135 34 -18 -199 -4 85 -47 -209 -23 251
6177 251 117 277 -95 -97 12 14 -16 42 90 123 -38 -38 -135 -8 -89 119 -144 21 -14 31 60 45 94 -19 157 117
6203 117 113 -48 -188 57 198 -47 -118 43 318 210 64 -99 -102 97 304 -37 157 35 -63 1 -101 31
6225 31 50 -64 -19 -58 -36 77 40 -44 -82 -62 -36 -41 59 -188 -151 146 -4 117 -15 32 85 -207 -209 -111 102 125
6251 125 -120 11 -62 109 -143 139 -48 -117 -151 -55 102 -127 -67 -83 -29 -84 -58 118 77 199 107 117 -37 206
6275B06k80k7P7P1J87k43m6j57O0Q6J52j71Q5J10J94N0m83J82j32j46J37j11L80
6298A81j78J46j88N2L1j42K4J05j49M8J8O3j3j8N3j38j0J53l00J95J33p9r9L31
6322B19q7j95o2K47j84j02J22J77q1K1j60J25L8k35O6O5J10m6o5P1j05n6K22j84
6346g9J59j46l2Pk8M2p1J41m6R8p3L44k47j43Qk0pr6L1J86k3q0P7j27j00K66l2
6373IJ26m0J3R7j89J77k17J89k81J92k13P4K08o1K9j16L3P0j4j06l29L94n9r6
6397a10M7M5J39k85L3l7K23j86K17q3M2l3o4K27l17K72j21o7m0K61k11J63q9P
6421C3o0M9k26J34j07J67J6K44j50m3l9J04k88k9L62l92J77j40J07l4r6Q4K13
6444H6M7q3K49m21J27N2K2o8j15J61j71Q7k8J21l02K80j04m8J82p2n7J38k52J77
$$ plain form
6275 206 -74 -101 -24 47 234 -9 -55 -212 -152 -66 86 -85 0 110 304 354 -129 53 -79 -225 -88 -199 181
6298 181 3 149 -39 13 44 -98 -74 31 -118 -70 -52 11 -2 -20 33 -105 -115 38 -262 -67 66 -13 -112 219
6322 219 132 -63 -125 122 -62 -164 -42 135 54 75 -85 40 78 -157 -91 -26 84 38 -27 44 -61 -117 105 -79
6346 -79 80 -66 -98 -91 -119 -77 -148 -7 -53 45 -28 316 69 -74 -66 -86 -93 -189 -158 28 5 -75 2 -125 -225 41 9
6373 9 135 95 108 205 16 193 -24 165 -116 76 -137 -63 145 84 113 -3 30 100 86 -20 -349 45 -14 -110
6397 -110 -63 -18 121 -164 -131 -168 55 -131 86 3 45 12 -52 175 -142 130 9 -58 -98 163 -48 115 26 33
6421 33 -27 22 -204 -70 -177 -10 6 250 100 57 18 122 -166 -195 167 -225 -48 -188 -81 -115 -211 -127 86
6444 86 133 50 299 -122 5 57 79 11 -104 57 -114 -27 -55 66 -236 44 -60 -108 74 2 -55 83 -169 8
6468Hj7L1N8r9J84j78j5j20K45k02J10J33R3j78j5o6K50k04K01k36P7j34N2n3
6492g5K17j49k48J56J21n7pK8l5L6K0J07K2k47Q1O0N6j84N1L5k39L15k50J6J57
6517a3l4k9J40n0k51L00l14K02j76K05q7l2K09J29j25Oj82L16M4k67rn8K04j39
6541a1J57l61R5L37l0l73L86j76j32J37J7o0P9n6o1j00O5J47j38R1P2kk7kj01
6566d7N8k3j30o5J42o4L0L8J30j73J50N1j79r4J84j19P8R2o4J85k00J5J67m04
6590b42J69l9P4K31k48Q7J39l47K3J86Kl9j3K31l42J09M5l8K24j28P2k87N7K23
6614A49j18q9P6J02j59Q8p5q6O1KJ85j13k51L10j34R1Mo7N4m2j2O0l20J54J19
6639a1R8q7J2J46k22mJ58j5j53J45O9r5k57K61rj34Q2Oq7L7p2J24R6j12j10r7
$$ plain form
6468 8 -9 22 80 -19 165 -13 -28 -148 97 -105 5 138 231 53 38 -28 222 18 219 -17 60 -74 -22 -75
6492 -75 142 -7 -255 -99 22 -35 -42 -14 -49 -13 7 114 136 -111 -30 30 86 -98 -47 -12 -251 64 -186 -170 -13
6517 -13 -47 -76 64 14 -237 63 -251 -49 -225 -20 -107 -139 70 199 74 80 -102 214 258 -9 -18 -76 128 -11
6541 -11 146 -215 -120 217 187 -186 200 24 -108 29 46 -14 65 9 -52 -152 -87 60 -78 13 85 83 56 54 -47
6566 -47 11 -12 -142 -207 -65 -129 -99 -61 69 -104 46 97 -82 -176 8 -111 -33 59 -5 180 -20 -5 162 -242
6590 -242 -73 -112 -38 193 -55 32 171 -176 -153 33 35 -4 -17 214 -128 -19 26 -12 212 84 156 -131 -74 149
6614 149 31 -58 18 120 -39 49 -26 -112 -51 -49 136 23 -228 82 -52 39 43 -24 30 -12 -24 36 -284 -130 -11
6639 -11 87 0 12 158 -64 -68 90 75 -78 67 136 41 -216 45 36 -98 -16 -10 -97 -60 -132 -8 88 -24 -134 -231
6665b31L06J80k52o3r1L62j73j19m7J59Q2j1k84J35K14k82J08oJ0j22K08p6j2
6688eQj19J6J12N1k87L65j78P3j04j4J11j54N1JQ8j54mJ55K0j6KQ2q9j15J45J08
6715A49j65j20K94q8j47L9q1K72l42J40n5j0J61j96j24O7L3J18q6K01qj5N4k84
6739a93J90p6K7K21j46P8l2j05J79L0k14K14j66j31J47k8J07K7K3j86J17n5K9
6762E7j13M4J58k95j61n0L16J33k02K31j09P2j82K63j06R6j95l8j7QJ97j16J32
6785A23m6o7n2J87l50L37L7j80k36K02L62k68L7Ko9JnN9J8k16J68p9k12J12O8
6810f7o3N4O1j79K44K1R4j32k9K0R5r3q0K04l37J76o0j12R0NR1m2p1J90m1J89
6836B28j89J37j65j87J67j05J25m5J91k53J03m5J98j90O7L7o1j11N5L0O4k12K05
$$ plain form
6665 -231 75 255 3 -60 -151 211 38 -81 -128 31 113 102 -182 -47 167 -115 -7 -13 -3 -125 83 7 -5
6688 -5 3 -116 -100 12 63 -224 141 -37 36 -68 -82 29 -125 -74 -73 15 -139 -143 12 32 16 18 100 11 -104 41 149
6715 149 -16 -136 158 70 -77 -38 -119 153 -189 -49 -104 -114 47 -149 -273 -206 -173 -55 -141 60 52 37 91 -193
6739 -193 -3 -79 -52 169 23 101 69 -36 143 173 -41 173 7 -124 23 -5 102 129 152 -34 83 28 57
6762 57 -56 -12 146 -149 -310 -360 -44 89 -113 118 9 81 -101 162 56 152 -43 -81 -98 -90 107 -9 123
6785 123 77 10 -42 145 -205 132 169 -11 -247 -45 317 49 86 88 19 20 15 74 92 -124 44 -35 -247 -135 -67
6810 -67 -130 -76 -15 -194 50 71 165 33 4 24 119 26 -54 150 -187 -11 -71 -183 -93 -88 3 -39 -110 80 39 228
6836 228 39 176 11 -176 -9 -114 11 -34 157 -96 7 -38 160 -30 37 74 13 -98 -43 -13 51 -161 44
6859D4k23M2P9K8M2k89K69n0M2j36M87m78K40j62J37j27J7L03l84J93j5J56l06
6882i1mJ38J4k39L28k17l4R0J35j23O1j41J78K1J9J27m14K33Qo9P7p8K7j6j03
6907g3J6J63j72J50o7j55M1K25j06N0o9j3r4K91k94M3J40N7o5l03K67J5Rq3l08
6932c35L44j81O9j45J84J03j04nO8k2k26L13j36k1M12k18L5r3j26Q0O6Q1k93J74
6956B4N9j05l05L52p9K5J7K6j9J69j09P8j81J0o5J6j65L2L20j66J96j05j57J74
6980D2m3o8l4J51j37J06P7p0R1j54j12J23j08J48N0m3O6j59J55Lj63Q5j20J72
7004E8N2m7r2K41j07j09O0j39K31p0j93J74k4o4N3j02n5K79k44M0R7o8J53j76
7028e2K73j46m1n8J97q8J94k50r2o2p0K65K08k96n8M4j08N9K18k27J71N1O2j55
$$ plain form
6859 44 -179 -137 -58 -30 12 -277 -8 -58 -16 -152 335 -143 97 -65 72 -55 -38 265 -119 74 59 215 -91
6882 -91 -95 43 57 -182 146 -71 -105 -15 120 -3 58 -83 95 116 135 262 -152 81 89 20 97 19 46 30 -73
6907 -73 -57 106 -66 84 17 -138 -97 128 22 72 3 -10 -104 187 -107 -64 76 133 68 -235 32 47 56 -27 -335
6932 -335 9 -172 -103 -248 -64 39 -65 -70 -2 -24 -250 63 -73 -94 318 100 135 42 -84 -4 62 143 -150 24
6956 24 83 -22 -327 25 -54 -29 -12 14 -5 164 55 133 -48 -38 -103 -87 -252 -220 100 -66 130 25 -132 42
6980 42 -1 -69 -103 48 -89 17 94 24 115 -39 -151 -28 -136 12 62 19 85 -74 81 84 -79 6 -114 58
7004 58 110 63 -29 212 105 -4 56 -83 148 78 -115 59 35 -29 24 -78 -133 146 -98 -58 39 -29 124 -52
7028 -52 221 75 34 -24 173 85 279 29 -63 -125 -195 70 278 -18 -76 -32 -140 -81 137 -90 81 132 194 39
7052C9r5k5J48n6p6K22j80L9Q1j16J55j94J46j44R5J5j62L32M6m03k49M78r0j44
7076a38L28m9p0k30J06N2J9j6p1J0J50j93J56N4q4J60j39Kj73J11L8oo2j37M03
7101B21k99j5K74kl43J46j49J23J50K1o6j15J6j7J58lj48j08J91o5L11k88K8k86
7125b65K01J42k36J01M22j76j66J55l04L20m4q1j69nJ31n5R3j85K21k85M72l13
7147b6L4J0nj07K4l1J65o1j2q9rJ29j57L12k85K76k27J42j16Om8L9M6j44K61l
7173A24j94J2k4K33l36K5J25R4j87K06m5R6j88O3j0J29q8l8j37K22p9j46J16j75
7197b02K77j67J54R1k50j20N3L48j9J8k83P9Q3j51n8J29j99K14M9q2rn7O3o2L48
7222B47m52J56o4J25L7j17J18j51J05O5k0l29K52J31R5j17j76r9L69k27J5K39
$$ plain form
7052 39 -56 -81 67 11 -65 157 -23 16 97 -19 136 -58 88 -56 39 54 -108 224 270 -133 -382 96 6 -138
7076 -138 190 141 71 -159 -53 -1 18 2 -69 -59 91 -102 54 108 24 184 45 47 -126 -15 23 17 -45 -182 221
7101 221 -78 -93 181 179 -164 -18 -167 -44 106 127 61 -54 -38 -55 103 100 -48 -156 35 -30 281 -7 21 -265
7125 -265 -64 78 -158 -57 365 189 23 178 -126 194 150 69 -100 -105 26 -29 64 -121 100 -185 287 -26
7147 -26 8 18 13 -94 -70 -101 64 3 -9 -98 -107 22 -135 177 -108 168 -59 83 -33 -27 -75 -36 10 -134 127 124
7173 124 -70 -58 -82 151 -185 -160 -35 59 -128 78 33 129 -59 4 -6 123 35 -3 -140 82 3 -143 -27 -202
7197 -202 75 -92 62 153 -97 -217 -164 184 165 183 -100 -21 62 -89 -147 -18 -217 -3 46 -36 -45 -102 -39 -101 247
7222 247 -205 -49 -113 12 49 -68 50 -101 4 69 49 -280 -28 103 198 81 -95 -194 175 -52 -37 202
7244B02p9k09k1N5P4k7K11j21j20K36j23J57l79J67q1J38j24O7m9O5J67l4j62
7267A0l1J6k8N4o6N9N1kj06K2K9rkj42K01j61M85l51j46P5J08n6J61k18J31j73
7293h9M6J44J07l22J11p7R6Nj4j95K44l3J26J68k66Oj65J83j88rR6q0J34J14L9
7318A81m66K22J30p2k0J00j13J15K5j85r6K76j37q7J91j28r8L87k06LN9QL8n2
7342G5k30K01M3j62K26k53M3J30j94K76l08o8K82o7O8j57J28n0J51m0l28J48J45
7365E9o1p6K27k08J34K20l53r4J55l3r9K22m8j08J93l67K56k39K90q2P7j5N7o2
7389D5l3K20j82p6J91n6l00OK18J66k42n9J16m4kJ9K2J15l25M1J57K9o1j16J81
7414C0O3k09n9R6L3J05j22L88j79j01l2l3J93r5l17J39K47l6r6RJ0M5R6j37k20
$$ plain form
7244 202 123 -86 -107 -52 22 -5 206 85 -35 201 78 235 -144 23 -58 80 -44 23 -26 39 206 172 10
7267 10 -21 -5 -33 21 -45 14 65 63 -43 -21 8 -1 -3 -145 56 -105 380 29 -117 -42 66 10 171 -47 84 -89
7293 -89 -43 101 208 -114 -3 -80 16 21 7 -188 56 23 149 317 51 57 -108 75 -113 -122 -26 -106 28 142 181
7318 181 -285 -63 67 -5 -25 75 -38 77 102 -83 -179 97 -40 -127 64 -64 -162 225 19 22 81 89 127 75
7342 75 -155 46 89 -73 153 -100 -57 73 -121 155 -153 -221 61 -6 62 -95 33 -17 134 94 -234 -86 59
7365 59 -2 -78 149 -59 75 295 -58 -152 3 -30 -129 93 45 -63 130 -237 19 -220 70 -12 65 50 107 45
7389 45 12 232 50 -26 165 109 -191 -185 33 199 -43 -102 14 -30 -32 -13 9 124 -201 -160 -3 26 -35 -151 30
7414 30 93 -116 -175 -79 -46 59 -63 325 146 45 13 -20 173 78 -239 -100 147 111 15 24 34 79 175 38 -182
7439a82J22J42j27j49K38l1L2J04l04K07L6j86N5j33J31o0K20k60J90j36N3K1
7461a7j10M09l30qj26K97j79J1J3J55K5J38k94L6N4m0k8R6k06K40j60J70k13q0
7485a47J25K73k57r6J45nj59j11K67m4J80j58R0j86J39m7n7N4k84L95k02J38k70
7508b17K74j0K0j4K6j96j15M30j92M4j0j7k7k9L4j09Q7oL3Rm9j44J87P3k33J10
7534d1R7k2q7J82k9j28L07k6k84M2j25j34k5L27p6Jr7K28n2j29K36p8k71J96p4
7559f2J78j01k32K60j23O2L3j48J07q7O3K4J17j37q8Q1M4j01j9K15k42K54K01
7582B99l51j52J31Q9K9j10q1J05J27r9R5K5j11M5o8l0l9J50n7P4J80k23m8K4l1
7607b7N6l20L74j06J17J99l01o8J43k13J18o3L50l65N1r3l1L7Q5O7P2J06j06j94
$$ plain form
7439 -182 -60 82 -45 -194 44 13 45 149 -155 52 88 -98 -43 -176 -45 -105 115 -145 45 -91 -38 -17
7461 -17 -127 282 -48 -56 -182 115 -64 -53 -40 115 140 278 -16 20 74 34 6 102 -104 136 -24 146 -67 -147
7485 -147 -22 251 -6 -102 43 38 -121 -232 35 -9 171 13 103 -83 56 9 -48 6 -278 117 -85 53 -217
7508 -217 57 47 67 53 79 -117 -232 198 6 50 40 23 -4 -33 1 -108 -21 -27 6 15 -34 -178 9 82 -151 -41
7534 -41 56 34 -53 129 100 -28 279 253 -31 11 -114 -248 -273 54 -22 -21 -118 110 58 -71 165 87 -184 12 -62
7559 -62 116 15 -217 43 -80 -18 15 -133 -26 -113 -50 -26 91 -46 -134 -53 -9 -110 -129 86 -156 98 299
7582 299 -52 -204 -73 16 45 -65 -146 -41 86 -13 82 107 -4 41 -27 -57 -96 54 -3 71 251 28 -20 4 -27
7607 -27 29 -291 83 -23 94 293 -8 -76 67 -146 -28 -91 259 -106 -55 -148 -179 -142 -57 10 82 188 82 -112
7631a12K31k4K1j38M3q0O1K0P2k42J85k50J02L0K55k33pj50K06j9P2j59m1L93
7655B36j95P7j20J28k21L44k84l3o8J9J27J6j15K16m9q4n0K32k74J27Qm07L16
7678e4J7J16j28K0l7j9qJ24j36Q7j27J65q0J66m5o3J48j72q1K16l02L17j72n1
7702i9K00o6J00j94J97j05p7k6K3J45J88n02J84k07K09J95j31r8N9l1L6j94M5
7725a49N9J23m4p0K70k66J24K13l61L57k71o1L33l81P9j16J2k02L23lJ62k73J96
7748E4O8k67k9J1m8K65J5o6J41j24P7j88J59k92J46K2Q3j2Q7J10j54q9k9nJ01
7773C6K6Nj28J58r3J62j02j29nK5p0Q8j8J50o7l4J34k61P0N2o6O4k4J99k57m8
7799a33oK96N7m76M16j15N5k20J19p0L9Q3m8P3k07M0K0j9l2K29J30j86p6J50K9
$$ plain form
7631 -112 119 95 116 -22 21 -59 2 22 94 -148 37 -213 -111 -81 174 -59 -66 -216 -10 -29 43 -116 -157 236
7655 236 41 118 -2 126 -95 249 -35 -68 -136 -117 10 26 -89 127 78 -6 -56 176 -98 29 37 -370 -54
7678 -54 -37 79 -49 -29 -66 -85 -93 31 -105 -18 -145 20 -60 106 61 -2 146 -26 -107 109 -193 124 -48 -99
7702 -99 101 35 135 -59 138 33 -44 -70 -47 98 286 -216 -32 -239 -30 165 34 -64 -5 -36 0 -194 -149
7725 -149 -90 33 -11 -81 189 -77 47 260 -101 256 -15 -76 257 -124 -45 -161 -149 -351 -28 -31 131 -142 54
7748 54 122 -145 -174 -163 -211 54 69 3 144 20 97 -91 68 -224 -78 -56 27 15 102 212 58 -31 -60 -65 36
7773 36 62 67 -61 97 4 166 64 -65 -70 -45 -115 -27 -45 105 38 4 138 -123 -53 -1 -67 -3 -27 172 -85 -133
7799 -133 -139 157 214 -262 154 39 94 -126 -7 -77 -38 45 -3 70 -137 -97 -77 -96 -128 101 231 45 -31 119 148
7824A48m3k06L6K0J90o1k93R5K89k04l1P0J83k01R1j00K9J18j01K7o7JnJ70o7
7849H8k2j39J11r9N9J27j16K09j38Nk6j10K6JJ56Oj65j77J35j19Q7Q3L3R2n8p4
7875b5k05J35K60k09Q9q6N1Q6k28J90QN9J65j74q7P3q0L9j14P9l9N4j35K52om05
7901b53J06k0M56n22J22M3J84%r5J0m0J87j76Q1K56m09r1K78j8J14l13J50l40
7924b90J17M07l03mJ42j94N8M8J25p3j05M0m5L99m53J32r2L04j42j02o5K53NM
7948A66k94J79o6P8o3N1j80l4RK96k10l0K62j38Qj10J7Q5l0k10K9J26l0J41M5
7973I7l2j40N3Q7P9k38P0J10l17J70rN8q5j8J92j10P8k0n5n6k2jK56l16K25M4
7999A00Qj07r0N5J92l18K19j09J45n8j39Q0J00j4lJ8o6K1p6J17j40K1p9J63k1
$$ plain form
7824 148 105 -101 -65 -45 145 84 -209 -114 175 -29 -60 10 193 -8 83 -17 12 130 29 56 -11 -10 -15 155 88
7849 88 66 -73 38 -61 -2 125 9 218 80 85 59 -51 -25 -24 132 138 -27 -204 -69 -188 -101 -18 15 107 49 -25
7875 -25 -230 -95 165 -44 45 -41 10 96 -132 58 66 125 290 116 29 102 22 61 -53 26 -13 41 -94 158 152 -253
7901 -253 -147 -167 289 -233 -111 -68 116 116 21 31 -9 178 2 83 339 -70 -161 117 99 213 -100 50 -290
7924 -290 -173 234 -69 -73 69 -125 -67 -19 106 33 -72 -32 -77 322 -131 1 -91 213 71 -31 -96 157 162 166
7948 166 -128 51 -15 63 0 51 -129 -163 -154 142 -68 -98 164 26 34 -76 -59 26 -4 -214 -185 -59 -89 52 97
7973 97 65 -75 -22 65 144 -94 -24 86 -231 -61 -70 -12 -97 -115 77 -33 45 25 -30 -86 -108 -109 147 -169 56 100
7999 100 108 1 -89 -34 158 -160 59 -50 95 37 -102 -22 78 64 61 79 13 34 -42 75 -65 -44 -123 40 19
8024A9K6m5K58k73J28k9j62R9j03J09j18K41l56K00j75J62j53M08j68k13K15j87
8046a17J90J6M5k05J29R6N0j18j59j55J57J74j28J06j34j27K08j79J71Q2m9j70
8068a17J41J13k43K3P5L4l5R9l20K08j29l7kK40j37K24p0j28K95k37p8K22j70
8091b9O0J85l19J70Pj28P4L7N4nk9o3R7k3m5j35l7Q5p0J82k4j14K44L1M9l64J43
8118C3k14K10J6k4r4J35N3p2m9n8K05j63k6Q2nk9J08j69J83l37J84k26J76J42
8142F1J2j18j46J15L62l39J1Q9k23J04m0L2J44l8q3k1K75l86K67K8j56o1n3J42
8166b2R0j3j01rm2K74k10p0Q7p8L5R3J11l02J25O3p7p8L8L35k6m38K22R4l00
$$ plain form
8024 19 45 0 258 -15 113 84 -78 21 -82 27 -91 150 -206 -6 -181 -19 -172 236 68 -145 70 -117
8046 -117 73 89 134 -71 58 154 204 86 -73 -228 -71 103 -25 81 -53 -180 28 -151 20 102 53 -117
8068 -117 24 137 -106 -83 -8 26 -9 90 -230 -22 -151 -188 -190 50 -87 137 67 -61 234 -3 -81 141 -29
8091 -29 31 216 -103 67 74 -54 20 57 111 106 77 14 111 88 43 -92 -129 -44 -114 68 44 -70 174 205 254 -110 33
8118 33 -181 29 45 21 -73 62 115 43 -6 -64 141 -22 -48 34 29 0 108 -61 122 -215 -31 -257 -81 61
8142 61 73 -45 -191 -76 286 -53 -42 47 -176 -72 -112 -80 64 26 -57 -78 197 -189 78 106 -50 -111 -164 -22
8166 -22 68 55 -46 -55 -97 177 -33 -103 -16 -94 -59 34 145 -157 -32 31 -46 -124 -86 249 223 -215 7 101 -199
8191a99
$$ Imaginary data points
##PAGE= N=2
##DATA TABLE= (X++(I..I)), XYDATA
0@%%%%%%%%%%Qj6J6j6K1k9L2m0N0n8P2q8J04j25J49j75K04k36K71l11L57m06M61
33B45n22N90o66P50q42R41j052J174j304J447j606J778j963K168k391K633k903
50a523L199l523L884m285M732n233N801o451P202q082R128j0397J1979j4013J6731
65I149k0582K6500l6861O0282k12474K3248L26869j58873j60389L8117J56983
76E1969l8254o8622K5545O4017l0129M767K0761l3571n6837P0455J15759j9307
88A06553j45766k1705J06335M3935o2253l3925R284n556j3609M5818L8355n2281
100A5185n7932L4298L2929l5203k7308M5185M3534l5862o1789j4127N180J6858
112c9052M4265J2826n3711l6339M7210O5430k0705n9569J3825M6629j0584k6224
$$ plain form
0 0 0 0 0 0 0 0 0 0 0 0 8 -8 8 -8 13 -16 16 -24 26 -32 40 -48 56 -69 80 -95 109 -127 144 -167 190 -216 245
33 245 -277 313 -353 397 -445 496 -556 618 -686 761 -845 933 -1030 1138 -1253 1380 -1523
50 -1523 1676 -1847 2037 -2248 2484 -2749 3052 -3399 3803 -4279 4849 -5548 6431 -7582 9149
65 9149 -11433 15067 -21794 38488 -173986 -150738 176131 17258 -143131 -105014 51969
76 51969 13715 -54907 -29362 34655 4526 9293 30054 -3517 -60354 10101 125860 106553
88 106553 -39213 -60918 45417 89352 27099 -6826 2458 -3098 -16707 29111 67466 15185
100 15185 -42747 -8449 24480 -10723 -38031 7154 50688 14826 -46963 -61090 -55910 -39052
112 -39052 5213 18039 -35672 -72011 -24801 40629 19924 -39645 -25820 20809 10225 -15999
124a5999K1735L3507j1042k1694K1316O672n1360j4211N7848J6096o8124m0686
136f5942O0159O4533l0648n3937Q997K1772q401o461J0131R28j5386J910K1626
149I281o408j8525K2883K9003k4212m8430m786M2902K4086j4045k515J930k4826
162a3662j4914K6379L1671l398j9506P557Q073k6576j4487K4947J3374k1294k4161
175b5997J249J3532K264P255J5514j1800k5371M499K3261R076j1304q224L057
188b989r127o118L3395L4457j1232l2382j2365M401q101q206K9972K9908k3473
201A8140m1088o830K1434J9558M013m68o237j9125m828J5576N489o053k70K316
215A627m444j1707M884K2405p5k3838r293R053J0015N412M027L70j8786j8024
$$ plain form
124 -15999 5736 39243 28201 6507 27823 34495 -16865 -31076 26772 42868 -25256 -65942
136 -65942 -5783 58750 28102 -25835 -16838 4934 -3467 -9928 203 1131 -14255 -12345 9281
149 9281 2873 -15652 7231 36234 12022 -36408 -41194 1708 25794 11749 9234 11164 -13662
162 -13662 -28576 -2197 29474 26076 6570 14127 22200 -4376 -18863 6084 19458 -1836 -25997
175 -25997 -24748 -11216 -8952 -1697 13817 2017 -23354 -18855 4406 13482 2178 -6046 -2989
188 -2989 -12116 -18234 15161 49618 38386 6004 -6361 -1960 -10061 -18267 11705 41613 18140
201 18140 -22948 -29778 -8344 11214 15227 14759 8522 -10603 -15431 145 5634 -419 -689 1627
215 1627 -2817 -14524 -9640 12765 12690 -11148 -20441 -11388 -1373 4039 8066 8436 -10350 -28374
229b8374J9662L2378M690j2264q773l297p564p548J1795J6923l985j2169o197
242d723k460P464J1561L426j1996k2157l940J7932Q992l849k533j844k653k797
256i577R840J9394j701k1997j0694J423M076R247J2149O224j2877k1052J160J7075
270B690J1837L743r037j7027r297M132J5432J1628n538p968m975p751N72J3913
284B354J5679M03k1762j8584M820J1643Q594P678q97j0116j0679l08J3230Q506
298A0561j636k356q207j0276K191J1087R834L29r410n188j113M50Q712O046o354
313D670j1429p890M338J1315L812J524O56q880r345Q13R481J0809r93q016n269
328d404o045m96J1059P468k22m084m886p45L58O77M722l2n984r92J980M079L987
$$ plain form
229 -28374 -8712 23666 28356 16092 7319 4022 -3542 -11090 705 17628 13643 1474 -4723
242 -4723 -7183 281 11842 15268 3272 -18885 -22825 -4893 4099 250 -2283 -4127 -6780 -9577
256 -9577 263 19657 17956 -4041 -14735 -13312 -9236 11 12160 18384 5507 -15545 -14385 2690
270 2690 14527 18270 9233 -7794 -17091 -12959 2473 14101 8563 595 -4380 -12131 -11559 2354
284 2354 18033 18436 -3326 -21910 -17090 -5447 3147 10825 9928 -188 -10867 -11175 2055 10561
298 10561 8925 6569 -1638 -11914 -9723 1364 11198 11527 2117 -3071 -4184 -3734 4978 11024 4670
313 4670 -6759 -14649 -10311 1004 4816 6340 6996 -1884 -11229 -10416 -935 9874 8881 865 -4404
328 -4404 -10449 -10945 114 7582 7360 3276 -1610 -2355 -1997 -1320 3402 3370 -2614 -3606 -1626 2453 6440
345F440k041k589j057k475M272N894j960n942p465k311N254M044N200L537q437
360C64j0200p01N260Q828L274l663n746o207L00R807O973J060k648p646l820K693
376b072N047P077k277j2090q442O47R717J1741K380n639q051q727K333J1344O749
391I737k29q124j1302k574O063J2618J1150l478j2129j0745n979O825J3484N633
405A0950m874j3638r377O197J2353Q980J421q293q558l994N84R642J0417n35q325
420B950j0312m096P550J0532O103l377j3170p316N125Q616O179k243q751l575
434e785K86J855N683M627J080n517j0703l643O355P589M842l819j0299k866N777
449d538Q267M250n992o384o35L24J694K260L482M033k359p426R47O988L557k644
$$ plain form
345 6440 4399 1810 753 -1722 2550 8444 6484 542 -6923 -9234 -3980 64 5264 8801 364
360 364 -9836 -10537 -5277 3551 6825 3162 -2584 -8791 -8491 1316 8289 9349 6701 -945 -4765 -2072
376 -2072 2975 10052 7775 -4315 -12757 -12110 -2393 9348 11728 6089 -1962 -10689 -8356 2988 9737
391 9737 9508 1384 -9918 -12492 -6429 6189 17339 13861 1732 -9013 -14992 -8167 5317 10950
405 10950 6076 -7562 -16939 -10742 1611 10591 12012 3719 -4839 -8833 -8249 1393 11810 11275 2950
420 2950 -7362 -11458 -3908 6624 12727 9350 -3820 -11136 -6011 2605 8784 6541 -2210 -5785
434 -5785 -5499 -3644 2039 6666 7746 2229 -8474 -12117 -5762 1827 6669 2850 -7449 -10315 -4538
449 -4538 3729 7979 1987 -4397 -5032 -4708 -3014 -754 2728 6761 4402 -3024 -2077 4911 8468 5824
465E824p363l768J154J292N773N782l623p471m759K896R191K770n024m496l428
480e250j027K119K102L777N42m996m079k766J986J0258O800m398j0676p916M786
495h738J0690L049k772l761k327K986J284R14O001L667m150q579p375L235J0850
510D974N691j984q770p847K240Q015N658n59q437n864K053J181M49L639M993J09
526E541j0094j0272N756J2544N358k750q531n528R13L206P169M208m662o109k965
541f216J053M654L110J946J061o684o276L457O637M481j738n085j305J94P90N271
557E350K632m489q196n410O448J1416P73o707m539k87J431j294J036N505l84p142
573c857l874J104P344P459n1n358p483l200Q414Q145l590q421m494L965M397j396
$$ plain form
465 5824 -1539 -5307 -4153 -2861 2912 8694 5071 -2400 -7159 -4263 4928 7698 2674 -1822 -5250
480 -5250 -6277 -4158 -2056 1721 2263 -2733 -6812 -9578 -7592 2666 9466 5068 -5608 -13524 -8738
495 -8738 1952 5001 2229 -1532 -3859 -873 411 1325 7326 10993 6843 -1736 -9111 -5876 4974
510 4974 10665 8681 -89 -7936 -5696 2319 7977 7418 -1019 -6883 -4830 -3649 -3200 439 5432 5541
526 5541 -4553 -14825 -9069 3475 8833 6083 -2448 -7976 -7063 -3857 3312 7520 2858 -3251 -6216
541 -6216 -5163 -509 2601 4547 5608 -1076 -7352 -3895 2742 7223 5485 400 -905 -711 79 5350
557 5350 7982 3493 -4703 -10113 -3665 7751 8524 1817 -2722 -3009 -1578 -2872 -1836 3669 3285 -3857
573 -3857 -7731 -6627 717 8176 8125 2767 -4716 -7916 498 8643 5053 -3368 -7862 -3897 500 -896
589h96K687O625l248j0663m255P348J1642J423o995n049m783q77P022Q106K347
604A0434n602r500k176L674M047M480K16n929p083k565N553R445K379k941m699
619b67n954k65N979O534L085n483q209k709K064P019O318j554n302n279l332L418
635c937O319L440J96m021m540m84J371M798M723k377o246n038L03O843L250l740
651H60k889j349n10P22R71M896K653n025n022k79K891N275K220k373k682k219
667a860oL295J184l62n52k962k135K90J224L078pk860m23P80J822K684j66j801
685A223k375j630L020L540m14j023l032l518O20K741L452J847l102l153k345n16
701d665L876M715o47k794l986m79M846L074O39j441m753m096K52L310N347N32
$$ plain form
589 -896 1791 8416 5168 -5495 -9750 -2402 9240 10663 3668 -1381 -6164 -7041 -19 8087 10434
604 10434 4832 -4668 -6844 -3170 877 5357 5573 -356 -7439 -10004 -4451 4994 7373 4432 -267
619 -267 -6221 -6486 -507 6027 9112 3629 -4580 -7289 -5225 1794 8112 6558 1256 -4023 -7355 -3937
635 -3937 2382 5822 6018 1997 -2543 -3027 -1656 3142 7865 5488 -758 -5796 -5493 1350 4600 860
651 860 -2029 -3378 -3888 -3166 -2195 2701 5354 329 -4693 -4972 -2081 3194 5414 3041 359 -1860
667 -1860 -1866 1429 2613 2251 1699 -1263 -3398 -3108 -1884 1194 1187 -1673 -2096 -1316 506 3190 3024 1223
685 1223 -1152 -2782 238 3778 3364 2341 -691 -4209 -3589 -848 2604 4451 1349 -1804 -4149 -4665
701 -4665 -789 3926 3279 485 -3501 -3980 866 3940 4579 3138 -1615 -5711 -5459 -2149 3198 3730
717C730m901l647j548K044N973M371o16n421o765j10N740N926M128k280o707l695
733c778k87L774N896J174l487n326m526J687N713M074mn183n750M6L555M839L598
750F015k914n922l969K17M841M844J00k069m796l166K756M907L588K37m658m284
766d273r3K992N551K916k456k980k253K69L485J286j424j913m007j122K827K983
782A788K115k119m275k047p6K266M394k03l045k206j115K357L686Q28p18k802
798a172k669J136K342J983J834k177k983q43J030M084K787k002k991k338J91M077
814B289K260K74j083m845l360J479K256L785J163l438l902j951R41M251J988j127
830I80j906l398o73L142K965L018n07l890k685n6K334L900J165k029k726k943
$$ plain form
717 3730 -1171 -4818 -6366 -4322 1651 6022 5406 -15 -6780 -6890 -1150 4776 8904 6624 -83 -3778
733 -3778 -4065 -291 5605 6779 3292 -2034 -6560 -4873 840 4914 4910 -273 -6023 -5977 -2422 2417 6015
750 6015 3101 -2821 -6790 -6573 -1732 3112 3212 1143 -3653 -6819 -4063 844 4432 4669 11 -4273
766 -4273 -4366 -1374 4177 7093 4637 1657 -596 -327 3158 4444 3020 1107 -2900 -4022 -1195 1788
782 1788 3903 1784 -2491 -4538 -4614 -2348 2046 1843 -1202 -3408 -4523 -2166 1520 2348 1630 -1172
798 -1172 -3841 -2705 -363 1620 3454 1277 -1706 -2549 -1519 2565 5352 3350 359 -1979 -1788 2289
814 2289 4549 4823 3740 -1105 -4465 -2986 -730 3055 4218 780 -3122 -5073 -4132 119 2107 980
830 980 -926 -4324 -4997 -1855 1110 4128 3621 -269 -2954 -3010 -676 3224 4389 2360 -366 -3309
846c309J325M034K163L02k343m461j930J715L229L577p66l197l108k095J962M011
862A109J215m71l101k875L79K578K903J339k333k703q39L75L445K761o94j393
878A695j816k051J893K806J085j061l322j995J345K064K208O71l226k251q10L68
894b397K372N95o49q16k138J17K884J620j32k082l070K49K076K108K307j259l070
911a285j140Q53L452K438j084j647k349j884K293L812Q79q77l584k702N17J993
927c15L325J292l181l862j851J094M635K178j726k780l397q49L413L950J844j591
943B179m486j749j1K233M558J955k247l671l009J703N237K649q80l282l881j04
959b806K352J968K434p14l233k711p83K364L409M29j612k717k896J044L634K710
$$ plain form
846 -3309 -1984 2050 4213 4515 2172 -2289 -4219 -2504 725 4302 3536 339 -2769 -4864 -2902 1109
862 1109 2324 1853 -1248 -4123 -3744 -1166 1737 3076 743 -1960 -2799 -2424 1021 3782 3088 1695
878 1695 -121 -2172 -279 2527 3612 2551 -771 -2766 -1421 643 2851 3522 296 -1955 -2765 -2397
894 -2397 -25 570 -79 -895 -3033 -2916 -32 1588 1456 -626 -3696 -3447 -1371 737 3044 1785 -1285
911 -1285 -2425 -1572 1880 4318 3234 1587 -762 -2646 -353 3459 4338 3461 -123 -2825 -2308 -315
927 -315 3010 4302 1121 -2741 -4592 -3498 1137 3315 1589 -1191 -4588 -5437 -2024 1926 3770 2179
943 2179 -2307 -4056 -4067 -1834 2724 4679 2432 -1239 -4248 -2545 2692 5341 4461 1179 -2702 -2806
959 -2806 -454 1514 3948 3234 1 -2710 -3493 -1129 2280 2709 1097 -1620 -4516 -3472 162 2872
975B872M14l259k788P29O93J632K215k96j936k252o86K735J720k42L31j092k090
992a300l70J516K494Q42k949j781N67P65J245K82o65q92j840j74K407J64m54m2
1010a85j005r46Q3Q30K860O0k037o56k14J554K437k41j945j139p88J453J495n0
1028A566M28j522j636j7K47J488J703j345j946j786p40L115L189j18k427l065
1044b866m35J947J030R58J366j809k573p00J768L185J423j453j942j731m35L268
1060A001K812R74j993l828j394J514K157K093k17l098k432j076J620K900N50j050
1076E33k119l035J63K681K473J964j206l418j648J008K904K598j509j876p60l99
1092a646J420K106J497j78k863k232Q66J949J442Q23j357j752j246K25L310J096
$$ plain form
975 2872 3286 27 -2761 -2032 -1339 293 2508 2212 276 -1976 -2662 73 1793 1551 1882 790 -1300
992 -1300 -1670 -154 2340 3182 233 -1548 -981 -216 1029 1311 646 -246 -2086 -2260 147 311 -143 -185
1010 -185 -1190 -2136 -2053 -1223 1637 1697 -340 -996 -1210 344 2781 2540 595 -544 -1332 121 1616 1566
1028 1566 1994 472 -1164 -1181 -934 554 2257 912 -1034 -2820 -3560 -445 2744 2626 199 -2866
1044 -2866 -3301 -1354 -324 634 2000 191 -2382 -3082 -1314 1871 3294 1841 -101 -1832 -2267 1001
1060 1001 3813 4787 2794 -1034 -2428 -914 1243 3336 3119 21 -2411 -3487 -1867 1033 1583 533
1076 533 -1586 -4621 -4458 -1777 696 2660 1454 -1964 -3612 -2604 300 2898 1389 -487 -1247 -1646
1092 -1646 -226 1880 3377 3199 336 -1896 -1030 919 2361 3184 1827 75 -1171 -946 2364 3460
1108C460k556j974q47J93Q38O75Q00n13k901p07J366J331R03j23j389p15k0J612
1126e67K884M1k129j540l16J344J708P25P84j960k365L86J376J288Q43j272j864
1143f34j103j12K944J984j155j438j644j553J043J594J843l0k416j938O98R29
1159i88J788J023j185k152j512M13K551K051M56m69k624j494R54J747K239m10
1175B388k262r96q20N54K222J474q59k104k063j24J613J426J568o79k051j285
1191a998K56J423J630Mq26o03j607O66K196J310j57j628k006J16L33J161J795
1208B065l10k065r46K53J302N84k20k49j530j051J195R99O82R7j219r38j16K71
1226a196J317P26j171j007OJ003J308K78j24n84j334Q8J898Q24L75n08j474m52
$$ plain form
1108 3460 904 -1070 -1917 -1724 -886 -211 589 76 -2825 -3532 -2166 -835 68 -55 -1444 -2159 -2179 -567
1126 -567 2317 2358 229 -1311 -1627 -283 1425 2150 2934 974 -1391 -1005 371 1659 2502 1230 -634
1143 -634 -1737 -1849 1095 3079 1924 486 -1158 -2711 -1668 -74 1769 1739 -677 -2615 -1917 -988
1159 -988 800 1823 638 -1514 -3026 -2613 -62 1989 2445 1976 -648 -2142 -1188 559 2798 2388
1175 2388 126 -870 -1690 -1136 1086 2560 1701 -403 -2466 -2590 -977 449 2017 1338 -713 -1998
1191 -1998 -1742 -319 1311 1315 489 -114 -1721 -1055 1141 2451 2294 666 -1340 -1224 -891 270 2065
1208 2065 1755 -310 -1256 -1003 299 883 663 414 -1116 -2167 -972 27 709 806 -413 -1351 -1467 -1196
1226 -1196 121 847 -324 -1331 -1325 -322 986 1264 1140 556 -778 -690 1208 2032 2407 1899 425 -27
1244b7J48P72J556r75j902p61l54J171J563l9r68j705j628J120J986O70J36j418
1262f55j375R8N77K289J143j454k138r04K19K181J895O02q60k699r12J182K023
1279A212R60K37j496j403p35R07K382Q94j164j819j835j56J473J681P19j211k544
1296a898p31P83J213J463J23j200j383p49J039K464L44n7r08j739n9J049J465
1313A219P78r23j521n00l5J196R36j19o13r83o92J103P91L25k0q78j332L30N36
1332d02Q77J66j004o99j68k22J128R21m21o12q69K21J044J81P34l7p77l50L7P94
1352E42J146j90j226l34m76N71R16L00n11j199j090O99O00M21P67p13j594j27
1370a498M67J475J008l66r89r49o89R77J684R7k88j325r24K24O91J225P53j359
$$ plain form
1244 -27 121 893 2449 1474 -428 -1189 -1543 -372 1191 1152 184 -1521 -3149 -2029 -43 627 763 -655
1262 -655 -2030 -1932 -1355 934 2077 623 -1515 -2419 -2200 -19 1876 2478 1618 -1081 -1993 -811 1212
1279 1212 2172 2409 913 -490 -1225 -318 2064 2958 1794 -25 -1860 -2016 -543 1138 1857 646 -1898
1296 -1898 -2629 -1846 -633 830 953 -247 -1630 -2379 -1340 1124 1468 1411 503 -1236 -1295 -246 1219
1313 1219 1997 1074 -447 -947 -982 214 1150 1031 418 -565 -1257 -154 637 962 942 64 -1268 -938 -402
1332 -402 475 641 -363 -1062 -1230 -1452 -324 597 176 -436 -1305 -1084 -40 141 875 838 61 -289 -252 542
1352 542 1688 1498 272 -62 -538 33 949 1249 738 -461 -1551 -852 -252 169 936 223 -1371 -1498
1370 -1498 -1031 444 1452 1086 97 -852 -1541 -564 1120 1217 929 -396 -1320 -1096 -405 820 1573 214
1388B14j180m02N53J475J165j50j137j554o47J325J140Q41m97j645q72j3P98J462
1406H76N69j285j246q75J10J803R65L86o38j315n46J103J196P11o28j391o19L9
1424g85O84J220j74m07j256o86M00J024N79J15p70j079K13N28Q08N54o33q39l36
1443h40j73J574L80m65o91o19k19R39K81K89j83j178j8N64J117N72l45r98n37
1462e50m54Q74J609J12j158q78p91O12P73N97M5q03j329L1P77R84R99o69j181
1481d00o82j71Q83J491n2l60j320p87J009Q33L98O79j450j142l81J04J513J192
1499A357n62q45r71l02J167R14P88k74j397r59M07J024R23J24p92r06q79L7J078
1518f8R44J71n97r20l72O15L38Q31j47j066p06l16O75J436J98l83p85j107K00
$$ plain form
1388 214 -966 -1368 -815 660 1825 1675 538 -1016 -1663 -338 802 1643 1146 -499 -1371 -1384 -586 876
1406 876 1445 160 -1086 -1961 -1851 -48 917 1303 665 -650 -1196 -93 1103 1814 1186 -205 -824 -785
1424 -785 -101 1119 945 538 -718 -1404 -1004 20 599 714 -56 -1135 -922 -394 414 968 335 -504 -840
1443 -840 -1013 561 941 476 -215 -834 -1053 -114 167 456 273 -905 -923 -359 758 1330 985 -13 -550
1462 -550 -1004 -130 1479 1591 433 -445 -1236 -624 149 746 791 -12 -1341 -1310 -533 451 1450 781 -400
1481 -400 -1082 -1253 -370 1121 1069 709 -611 -1398 -389 444 842 1521 71 -1071 -1452 -1348 165 1357
1499 1357 795 -50 -1021 -1323 -156 758 1546 1272 -125 -1084 -677 347 1270 1394 602 -304 -1183 -1146 -68
1518 -68 876 1047 450 -470 -842 -227 111 942 795 -271 -977 -1293 -618 818 1016 633 -152 -1259 -1059
1537a059O75M31M88k27j170m9J79P85N13L6n69l90l93P62J122k59m3m77o84K12
1557a17K32M67r6n45m23J27L46O66r1l52n43n81j55J111M04O6k02q53j56O88K53
1578B46L87l20j147J18P8N45R10k42o84p22m26N38J115Q5J09p13p37L52Q81N00
1598H73N78j068j099rm3J132Q19n1n68j468m00R68R94O7J4q00r94NP52J468L71
1619A541j185o53n54K19Q94Q68k62n20r56o10P03N56M69k88p26m77p1N18J296
1638G62K57p59n97m32J35O02O59L47n05q00j26K83M30K50k13o45R2j64M53M10
1658D39J11j50m30l72L09M69K07p9m69m87K83L42K74J70q25l83j87K08M91L60
1678B81l53J9o49R4L22M62K45k12n39M8J08L41N03P1o49n19k35L51O18L00qn63
$$ plain form
1537 -1059 -384 47 535 308 -862 -911 -732 53 566 602 33 -357 -750 12 1134 875 832 355 -329 -117
1557 -117 115 582 486 -59 -482 -355 -9 657 566 214 -329 -910 -1065 46 450 516 314 -539 -695 -7 246
1578 246 633 313 -834 -716 -638 -93 817 575 -109 -831 -1257 -719 396 481 590 -123 -860 -508 373 873
1598 873 1451 383 -716 -725 -768 364 1183 1132 564 -904 -1304 -336 658 725 739 -61 -1055 -1050 -298 1170 1541
1619 1541 356 -297 -851 -632 262 1130 868 348 -608 -1218 -515 41 510 222 -504 -981 -1052 -534 762
1638 762 1019 260 -337 -769 -634 -32 627 974 469 -331 -457 -174 256 506 293 -352 -260 -424 29 439
1658 439 550 400 -30 -402 -93 376 583 504 35 -452 -169 173 447 617 -208 -591 -778 -570 -79 281
1678 281 -72 -53 -702 -608 -286 176 421 209 -330 -282 -174 167 670 741 92 -427 -662 -311 307 607 599 36
1700C6m62p6L84L98N26m89n34j61j37O58N76J87o77o57n25L12O68L36K88p60p36
1721h45K83K65N07K99k90o17k59J14O66N32K16l26r11l39P6O64O48K60o49o90
1741c96k35K51N29N43j87m6r68R0N04K47K58l2p49k85J53K46N83l8n51n29L2K42
1763c38M86L78k49l99p35M66K73M14K95n98l74p7J39L19N30j03l33j38n4K12M34
1784E48k38k37m87K94K23R1J00R3n84j36k37M81O37k72m34n28J10P1N42L65j51
1805B51m60l90J25K19L83L83q3p98j00M20L93K46l92k4o92p8P07M93J48r5m94
1826A62n69J52R9O09J83k41m31o68m1N79K96m3L8o33n17M88O59M21O6o27l31l2
1848c81N5N58J89j56l39k28M9N51J45j95o7k70m57L78J51M78n8j5n92l99K13N51
$$ plain form
1700 36 -426 -502 -118 280 806 317 -217 -378 -515 143 719 906 229 -428 -953 -641 27 363 651 -109 -845
1721 -845 -562 -297 210 509 219 -398 -657 -543 123 655 871 545 -366 -705 -629 35 683 943 294 -396
1741 -396 -631 -380 149 692 505 459 -509 -419 85 332 590 558 -191 -476 -323 -77 506 468 -83 -612 -580 -338
1763 -338 148 526 277 -122 -857 -391 -118 296 591 -7 -381 -458 -319 0 530 427 94 -44 -98 114 548
1784 548 310 73 -414 -120 103 194 294 387 -197 -333 -570 -89 548 276 -158 -686 -576 -505 37 402 251
1805 251 -209 -599 -474 -255 128 511 428 -370 -470 -50 343 589 197 173 -519 -597 110 603 751 656 162
1826 162 -407 -255 -156 453 636 395 -36 -704 -745 -166 130 87 125 -508 -1025 -537 122 543 609 -18 -349 -381
1848 -381 -326 232 421 265 -74 -302 -253 298 443 248 181 -89 -546 -168 -17 461 403 388 -204 -603 -390 161
1870A61K02k23j3m85kL03J74N4k97l08k60L07Q5L20mk89K29l14M63K82O8l11j36
1893Fm4K96k14L20K30m56l16j27J53J09J92k98K14l51M8J79K40j21j24k63k27
1914e54M96K12K74Q9l99p9k07K22K05L4k1o41k64K78O91J72J24j76q71J87J44
1935h4M70K13j63m00j16l05L71k6J81l06m22j55M04K94K15Pl20l51N2K65L83L58
1957E65j4l80n97K10O70J48K52l27p67p1M4L52J74J89l90k20m6mL27J50k10P6
1979A31l37J98K54k79K64m18k31k36L31R4K43r1p5j40j96M59p7K63r6j39N0K37
2001B09N8j14L07l47l57J82K10j31K50m61J82Ok24J77O6j81J3k80j55L07L08J91
2023B16J36n47j12MJ28L45Q8k71j17j13K73J05q9K02k01k95J22K17N1J49J12l62
$$ plain form
1870 161 363 140 127 -358 -360 -57 117 171 -126 -434 -694 -387 -302 18 14 -275 -46 -360 103 385 453 142 6
1893 6 -38 258 44 364 594 138 -178 -305 -152 -43 149 -149 65 -286 -238 -59 181 60 -64 -327 -554
1914 -554 -58 154 428 517 118 39 -168 54 259 293 272 -369 -633 -355 336 508 632 456 -415 -228 -84
1935 -84 386 599 436 36 -80 -385 -14 -40 141 -165 -587 -742 -338 -44 171 178 -142 -493 -441 -176 207 565
1957 565 551 171 -426 -216 454 602 854 527 -240 -311 -267 85 259 448 58 -162 -208 -212 115 265 55 131
1979 131 -206 -8 246 -33 231 -187 -418 -654 -323 -229 14 -77 -152 -292 -488 -29 -106 157 61 -78 -28 209
2001 209 267 153 460 113 -244 -62 148 17 267 -194 -12 -6 -230 -53 13 -168 -155 -435 -590 -283 25 216
2023 216 352 -195 -307 -303 -175 170 258 -13 -130 -243 30 135 46 248 47 -248 -126 91 142 291 403 41
2045D1j40m0K10n2L66k23k44m08J34K50L00P3l33l98r2lN02L97j33m3l04l2J69
2068cK96p1K63m72O7p7J63O3K1j29J19m24K25k2K29j44j82j96j6L54j62J31R9
2091A32l86R4q0J19J24R2N5l72j1j8R7K88Q9l08j98K41J11O2J25k04q7J89l08
2114a54J97M31m44J97j86j22J96r1o3L03o04L65j90K05R8j37j4j95l1J65L60j36
2136A50p5k97j14J85J11L29j27j61%q9J17O0J90m6m82M5O8J89K94k51J26k14j99
2159a91o8K86M1l7J46l92k8ML84k1n3k89J67l4L48l92L09o0j67r6Q9N4K49J56
2183D05l76k41j1J78P3J51o4m7j37j53L45j72J44j69R3P8k19J05J35j40M2L5j72
2206a17KM8J63m0j35q0n9J72qq3L23l81J75j35J23L57l43k20K84nq2K25N0k19
$$ plain form
2045 41 -99 -139 71 19 385 162 -82 -490 -356 -106 194 267 -66 -464 -556 -559 -57 340 207 164 -140 -172 -3
2068 -3 293 222 485 13 80 3 166 229 250 121 240 -184 41 19 248 104 -78 -274 -290 64 -98 33 132
2091 132 -254 -160 -240 -121 3 95 150 -222 -233 -251 -154 134 223 -85 -283 -42 69 131 256 52 -35 154 -154
2114 -154 43 474 30 227 41 -81 115 24 -39 264 -340 25 -165 40 138 1 -13 -208 -239 -74 286 150
2136 150 75 -222 -336 -151 -40 289 162 1 1 -88 29 89 279 233 -249 -204 -136 53 347 96 222 8 -191
2159 -191 -259 27 68 31 177 -215 -243 -239 145 124 71 -218 -51 -85 263 -129 180 120 -47 -143 -54 0 249 405
2183 405 29 -212 -223 -45 28 179 115 68 -69 -222 123 -49 95 -74 19 97 -122 -17 118 -22 20 55 -117
2206 -117 -115 -67 96 56 -79 -159 -218 -46 -54 -137 186 -195 -20 -155 -32 325 -18 -238 46 41 -41 184 234 15
2230A5n2j70J36p5J45m1j59K78j63K24j76J74j33P8k52J09O9J10j47L5Q4m5p8
2253c4L4Q5j71j31J32l9R8J11R2k47J99j68j68J89K67P1l13o9J60k16O9K05j73
2276a7j33K40k47m1L64j19Pn7Qk02O4K65m6k7o1l2j31K45Q4R6k10k62P1J06kK8
2302iK16k85N0k28J54J56j23N4j61P9j7J90j33J7Lj01K19q9K69l22J78k08P6J42
2326A27m7j55K10l40M8K05j61L63l2k37j15K17j16J23j01p7j31J29nQ1J15p4Q7
2349A14p8j44k2K87j07K4l1Nk38J41M5L7r1J46j0j13R2J65m9l41O5l5K52q5M1
2374G0Jj71n0J33J06J55j79J02k60q4K10o9kJ85j19k21J26L8Q0pQ1j71J20j38
2398f4P5j63J90Q8O5k16q1Q7J34k92L59q1l48K57r4l6j2J79k03K31k9J34k13J14
$$ plain form
2230 15 -37 -207 -71 -146 -1 -42 -201 77 -86 138 -38 136 3 81 -171 -62 7 117 -30 5 89 44 -34
2253 -34 0 85 -86 -217 -85 -124 -26 85 177 -70 129 -39 -207 -18 249 320 7 -62 98 -118 -49 156 -17
2276 -17 -150 90 -157 -198 166 47 54 -3 5 -197 -133 132 86 59 -2 -34 -165 80 164 260 50 -212 -141 -35 -37 -9
2302 -9 207 -78 -28 -256 -102 54 -69 -15 -176 -97 -114 76 -57 -40 -37 -138 81 -8 261 -61 117 -91 -15 127
2326 127 80 -75 135 -205 -157 48 -113 250 218 -19 -134 83 -33 90 -11 -88 -219 -90 -95 -14 101 27 114
2349 114 36 -108 -130 157 50 74 43 48 -190 -49 -4 33 -58 88 78 -35 57 222 173 -168 -103 -138 114 29 70
2374 70 71 -100 -150 -17 89 244 65 167 -93 -177 33 -36 -38 147 28 -193 -67 -29 51 44 125 -46 74 -64
2398 -64 11 -152 38 126 191 -25 -106 -19 115 -177 182 101 -247 10 -84 -120 -132 47 -156 75 46 180 -33 81
2422H1J04j97j08J65m4J24j45R1k1j63L6K69l79K86j92J2J26J23k55L0Q7k00R4
2445g6K57k29K1o7l5L04k45L5M0M8mj59J21j15J73nn7J35l09J92L8L1k7J47l57
2470a43J46l3J18J2k48lLK34j94N0k2K7J41k36K31Q4j11N5j61J21j57M1J19j83
2494a09l9J69j41P5J48l28J77QJ69n7r8J05j94L5q9M9J67J00j12j12q2j0J30R9
2518F0L7r7j76K01j00p4J69R0j98J50j61n5k8K69j49J06j75K22j06n1J15j30J87
2541A06m24L11J93j22k42K43j31O8R2%q0m2R8l9Q1j42k1P3J05j54k20K30J56k9
2565A10l20L03k37J1K10j33J44N2j49o1q7J43K73k12r4m9J62p2J01l4p5O5Q2k62
2589a29R1K31j24p9Q5j6k4P2K6k72Q3o2J22j56N5K91q9k38J57n9j06N9J76nq8
$$ plain form
2422 81 185 -12 -120 45 1 125 -20 71 50 -113 -77 192 -187 99 -93 -81 45 168 -87 -57 30 -170 -76
2445 -76 181 -48 -27 -94 -129 175 -70 -35 5 53 49 -110 11 -104 69 64 7 142 -167 25 63 94 67 214 -143
2470 -143 3 -30 88 100 -148 -151 -148 86 -108 -58 -80 -53 88 -148 83 167 56 111 -50 71 -86 -45 74 -109
2494 -109 -148 21 -120 -45 103 -225 -48 -40 129 72 -26 79 -115 -80 -169 -120 47 147 35 -77 -159 -169 -39 60
2518 60 97 0 -176 25 -75 -149 20 110 -88 62 -99 -154 -182 87 -62 44 -131 91 -15 -66 49 -81 106
2541 106 -318 -7 186 64 -178 65 -66 2 94 94 14 -28 70 31 112 -30 -51 22 127 -27 -247 -17 139 110
2565 110 -210 93 -144 -133 77 -56 88 140 -9 -70 -157 -14 259 47 -47 -96 66 -6 95 61 -14 51 133 -129
2589 -129 -38 193 69 -10 75 59 35 107 133 -139 -56 -118 4 -152 -97 194 105 -133 24 -35 -141 -82 94 89 1
2614Aj02J82O8M2o5p6p8j78L55J6k18j4J48m77M01mM8Q9j04R0Q7k01J12j91K93
2639B24l53m0L14k85L80k59r8J09j98J82J66j89J75j78p6J14J26j42J00J1j78
2660i5L64l17N0J88k79j96K49K07l5r4O7l26K18m0M0Q0o3J12j25n6K1p8j58K21
2684d5J69l50L19j40K05k51j36J30r0N2K67k34Q6l0P7n7J3J19j98K42J03l55R9
2707eq5N8kJ95l66O3K42j25K6J51j18jj31K6K4j3J78Q5k96M7P3j31O7J72j57m3
2733f6L2j61L00j24L22k12j79J23j47O1K04p7N0k36J1J23O0L0j68p8j37K70Q4
2756H5J6P5k62j20J3K05m9J16m5k06m7lK49j4L08k20k00j9J67l7K0j08N9J95l39
2781a61K75j53j29J23N8l4k3k1N7k7k28L26j11P3J69n2k39l2l3P4J89n4P5k26
$$ plain form
2614 1 -101 81 149 191 126 50 -28 -206 149 165 -53 -67 81 -396 5 1 49 138 34 124 211 10 122 -69 224
2639 224 -129 -169 145 -140 240 -19 -117 -8 -206 -24 142 -47 128 -50 -126 -12 114 -28 72 83 -95
2660 -95 269 -48 2 190 -89 -285 -36 171 136 42 109 -217 1 -39 1 81 18 130 5 -51 -30 -108 -266 -45
2684 -45 124 -226 93 -47 158 -93 -229 -99 -189 -137 130 -104 -18 -48 29 -28 -15 104 -94 148 251 -104 -5
2707 -5 -90 -32 -34 161 -205 -142 100 -25 1 152 34 33 -98 -72 -48 -61 117 202 -94 -47 26 -105 -38 134 -23 -66
2733 -66 -34 -195 105 -19 303 91 -88 35 -112 -51 153 76 126 -110 -99 24 84 114 -54 -132 -269 1 85
2756 85 101 176 -86 -206 -193 12 -37 79 34 -172 -219 -222 27 13 321 101 -99 -118 49 12 32 -76 -17 178 -161
2781 -161 114 -39 -168 -45 13 -21 -44 -65 -8 -35 -263 63 -48 25 194 142 -97 -129 -162 -88 101 47 122 -104
2805a04j8K14k6n6K92j35k05%j48L01l2L3m4m7l39J69J33R2o3j8j40L1j8K06L9
2830A17m0j33j48L15j42K0J61j52j7j14K3K52j08J82k93K6o4l1L21o7l1p9J7k42
2854b27K80K26l59K01k57J91j65J64J60k09L1m6J10j84o0L24L1k96J45R9j0j19
2876C0K6o8j4J43l19J65J2j5k3k0j9R3jp6J75j46J14k5l7j05K61o4k03QL32j26
2902I8j25Pj03J86j69K56j27rL4j4lk7J31j47J7j6j76L04l75L27m2N2k29k19J55
2927b14K67J76J18l87l7l18K81jO4j35J7j41J86P0j12L44j26j76K57j13m3L62
2949C39j62j23Pk43J27J06j71J82j10J7l5J52Q0j25J18j79R1k45J33J45j18NJ12
2972A03L7l61J09P4J37k58j34J35J94l4J69k41J38j64j0K3K3J82M4j47J49k38
$$ plain form
2805 -104 -122 92 66 10 302 167 -38 -38 -186 115 83 116 72 25 -314 -145 -12 80 17 -1 -141 -110 -128 78 117
2830 117 77 -56 -204 111 -31 -11 150 -2 -19 -133 -110 142 34 216 -77 -51 -115 -146 175 108 77 -2 15 -227
2854 -227 53 279 -80 121 -136 55 -110 54 214 5 36 -10 100 -84 -144 180 211 -85 60 159 149 30
2876 30 56 -12 -26 117 -202 -37 -25 -40 -63 -83 -102 -9 -10 -86 89 -57 57 32 -5 -110 151 87 -116 -108 224 98
2902 98 -27 -20 -123 63 -106 150 23 14 48 34 31 4 135 -12 5 -11 -187 117 -258 69 27 79 -150 -369 -214
2927 -214 53 229 347 -40 -77 -395 -114 -115 -51 -186 -169 -310 -124 -54 -166 178 52 -124 133 20 -23 339
2949 339 177 54 61 -182 -55 51 -120 62 -48 -31 -66 86 166 41 159 -20 71 -174 -41 104 -14 -9 103
2972 103 140 -221 -112 -38 99 -159 -293 -158 36 2 171 -70 68 -96 -106 -83 -60 122 166 19 168 -70
2994g0K9J91j43j04R2n8Q2J52r8Rn2k09Q9J55lj4P4k82J77K2J3N7j79J4j1J4K99
3021B46k88j24L4J13r3k7J75K54j71l5j3J25l9J94j01k06j72Q6o3L17j09j6j79
3044i2l06J17M12P7j69j86J42O6o9k71O70k96K7k42k7J54k4J49j45J25k46j32
3066b66L48j56J51j8J5l29L77J4j99J47k92J90m0q5J23J14J55j07l36m8m9M47
3088A56k51MP2l9J29j24N4N4k10J7o5K23K30k77K31k74q1K09p4J36j50J93j07
3111E6k71m1L29O1k82J97j17j88J73K71q5k17Ln3J02q4L91k00L4j07J6J37j54
3134b9J01j59l2L1J02L42m24L11j53q7j42l6J71J54j10n9K19m26K42M7J04n3k79
3157a65o8J25L3p3K61j81n2l0J10M3J13j38L0M4k74J45K99R1k36j44l6J40l28
$$ plain form
2994 -70 -41 150 7 -97 -5 -63 19 171 73 82 30 -179 -90 65 62 48 122 -160 17 39 52 109 -70 -56 -67 -53 246
3021 246 -42 -166 -132 -19 -112 -139 36 290 119 84 71 196 157 351 250 44 -128 -42 -105 212 103 87 -92
3044 -92 -398 -281 131 208 39 -147 -5 61 -8 -279 391 95 122 -120 -147 7 -17 132 -13 112 -134 -266
3066 -266 82 -74 77 59 74 -255 122 136 -63 84 -208 -18 -58 -143 -20 94 249 142 -194 -242 -291 156
3088 156 -95 -91 -19 -58 71 -53 1 55 -155 -138 -203 20 250 -27 204 -70 -151 58 -16 120 -30 163 56
3111 56 -215 -256 73 134 -148 49 -68 -256 -83 188 103 -114 -111 -164 -62 -146 245 45 79 -28 -12 125 -29
3134 -29 72 -87 -119 -88 14 356 -68 243 90 3 -139 -175 -4 150 40 -19 200 -226 16 63 167 114 -165
3157 -165 -233 -108 -75 -148 113 -68 -120 -150 -40 3 116 -22 8 52 -222 -77 222 313 77 -67 -103 37 -291
3180b91K98m8l5N3j03j12K76Nn3j6j1Q4r8R8M3r2J53k49o0K6K92k59P6j17J08
3205c2K9r9P5L1Q0j33J43j21J42k1p6m9N9N7n8K89m40o5N1J68p8J91j21k96J73
3230a01kJ66O2K17m83K58k42m8K20K01l75J73J60m15k5K01j12K70j31j46L4kK75
3253A55n4N4j34l3j43K17N6J79j53j79k5j94M03Lm3l0k53j2l3M12O3j42j81m4
3277a11n7K27Q6K4k4Kk61J24j2K09r9j06k40J87k05K96p0K15j40k6j72Q0j5L14
3301B26k08l9j06m6R8mL2P6j02L4L2o3J35Oj00j36k3L1O5J81j4j16K5p9J26K21
3327B52j07n2q5p4j12J27J26j07j58m1O3L00k10o4K87k01J32k51N1K01J39k81
3349f5p5J9J96O3p0j74J14j66K8M9J73k04j14l7N4K82n7j15L90j89j89K36M0j25
$$ plain form
3180 -291 7 -41 -76 -23 -126 -238 38 43 -10 -26 -37 47 -51 47 90 -2 151 -98 -158 -132 160 -99 -23 -140 -32
3205 -32 -3 -102 -27 4 84 -49 94 -27 115 94 18 -31 28 85 27 316 -124 -189 -138 30 -48 143 22 -274 -101
3230 -101 -103 63 125 342 -141 117 -125 -173 47 248 -127 46 206 -209 -234 -33 -145 125 -6 -152 -118 -120 155
3253 155 101 155 21 -12 -155 62 118 297 144 -35 -60 -254 149 152 109 79 -174 -186 -219 193 256 114 -67 -111
3277 -111 -168 59 145 169 145 147 -114 10 -2 207 108 2 -238 -51 -256 40 -30 185 45 19 -153 -73 -88 226
3301 226 18 -21 -127 -173 -75 -79 -47 29 -73 -39 -7 -70 65 71 -29 -165 -188 -157 -92 89 75 -41 -16 -95 31 252
3327 252 145 93 8 -66 -178 -51 75 -32 -190 -231 -168 132 -78 -142 145 -56 76 -175 -124 77 216 -65
3349 -65 -140 -121 75 138 68 -106 8 -158 -130 -81 92 -112 -226 -263 -209 73 16 -99 291 102 -87 149 189 64
3373F4K42k28r8j19J23kJ54p7o5j71Q9J12j72K88l3k41K1R9OK77l8R6l04J4k17
3398a80J65O5P6j07j58l82L10M1Q9N0o4M1j20L12N1j77K85l38K37o3m8J38l75
3421a52J41o3L5J97l27M20j78k56J14j11L2J87J5k7N0j72J17M4m4K19j55j70P4
3444a0r1K73j27R6l68L68j27O5J52j74J29k69p6K81Q8j38l3k0j87j30K53K13M3
3467B11p2l53J92k58L84k00o1L17m24K25J9J50r8P7q3r5j59P3M32k49j15l1n0
3490a68J35O3J07k48j49J18N7J3L6J73p9j60m3n7L04J05j52J25j49j07j83L66
3512A07p7j9mn9J26k12L17j35k46K92q0j68J17O0J78j40m3q0No4L18k42Oj93J42
3537i4O7r6r6Q9R2j58J91L9M0pk02k4J18J75L3K30l01k09p0K03K61j42k33j2J47
$$ plain form
3373 64 306 78 -20 -139 -16 -18 136 59 -6 -177 -88 24 -148 140 107 -134 -113 -14 -8 269 231 327 23 37 -180
3398 -180 -15 50 126 19 -139 -521 -211 -170 -81 -31 -95 -54 -174 138 189 12 297 -41 196 133 85 223 -152
3421 -152 -11 -74 -39 158 -169 251 73 -183 -69 -180 -148 39 54 27 77 -95 22 66 22 241 86 -84 -10
3444 -10 -101 172 45 141 -227 141 14 79 231 57 186 -83 -159 122 210 72 39 19 -168 -298 -45 168 211
3467 211 139 -214 -22 -280 104 -96 -157 160 -264 -39 -20 130 32 109 26 -69 -228 -155 277 28 -87 -118 -168
3490 -168 -33 30 137 -111 -260 -142 -85 -72 -36 137 58 -102 -145 -202 102 207 55 180 31 -76 -259 107
3512 107 30 11 7 -52 74 -138 179 44 -202 90 10 -158 -41 19 197 57 14 -66 -61 -125 193 -49 -43 -236 -94
3537 -94 -27 -123 -219 -130 -38 -196 -5 34 74 67 -135 -159 -41 134 167 397 96 -113 -183 20 281 139 -94 -106 41
3562D1l95J77J27K19M3m33L88j44o3J9J76k6l44J54J16J26j96j74K21j52k2J96
3584E4n3J78m01l7J11R4j7J40J75j54j08l8j42L98L8m8j1j40j43J63k86M32k55
3607e0j52Q8j40L68l4P2j69J40l22R3P3N3K14j15k17k56L56K63j50j96J1j86K54
3630bn6J54j25nL3k33J42R9K4J16j65R4j78p2L10p9p2M0M4l52L12k0j11L0kj16
3656a90K50%p5j29M7k8J14m7J44j20QO1k55J27M6J18R0N2l11J22K05j01m0o9K39
3681B58j84j51L31J5j69k5j93k14L78q7K2J08k99J65mJ07l4m8Pl5O2J21J2k02
3705e9K48m7l32K26j48P4J61j7j31k0o5j17K84K9q8j38O6P7N1O6Q5j70k94K91
3729C2j41Q0K78l17R6j78N0j50K40k1j11j48K64Q6k1K6l8K6r6J75j14RM6R4k3
$$ plain form
3562 41 -354 -177 -50 169 212 -221 167 23 -40 -21 155 129 -215 -61 55 181 -15 -189 32 -120 -142 54
3584 54 1 179 -222 -259 -148 -54 -71 69 244 90 -18 -56 -198 200 238 190 179 39 -104 59 -227 205 -50
3607 -50 -202 -114 -254 114 80 152 -17 123 -199 -106 -33 20 234 119 -98 -354 2 265 115 -81 -70 -256 -2
3630 -2 -58 96 -29 -34 -1 -234 -92 7 31 147 -18 76 -102 -174 136 57 -15 25 69 -283 29 9 -102 -72 -74 -190
3656 -190 60 60 -15 -144 -97 -125 -11 -58 86 -34 -26 35 -220 -93 -47 71 161 213 -98 24 229 128 88 19 258
3681 258 74 -77 254 269 100 75 -118 -332 46 -41 -19 89 -210 -45 -49 58 24 -24 -17 -52 10 131 143 -59
3705 -59 189 142 -190 36 -112 -38 123 106 -25 -45 -110 -227 57 86 -2 -140 -74 3 54 120 205 35 -259 32
3729 32 -109 -29 249 -68 28 -150 -100 -250 -10 -31 -142 -290 -26 60 39 65 27 53 -43 132 18 27 73 167 144
3754A44k52J46Nj31L53j69l53P5J24P5N0n8k40M18q8k75K57l67K69L6j6O0J19
3777A82l03J14J00m53K59K44j16O9n4r4K00j87K10k33J4j2N9Q3n5J7Q1o4R5l39
3801a83JJ25j74J06l4j2P3j77L99L5k7q2m8P3j0P5j75K18M5j47o8p6K94j82K57
3826C06l07J19k02PJ45j00j38K16k19K05J47O0k82R8J76n29J23K05N4q5l9j05
3848a45N0J16j3j8M0J3j80L39j33J08j60Jn7J71k13J75Mj1j07j68K38j05o4Q4
3872c5r3n4L49l31K81k44J58k78J60m4P1J63k23K38k16J81j74K66pk2j33o4j99
3895b50K15k0J06k9p7j00K01J71j45j27Q9J09j45j31J47J73k42Ok53J18L63j45
3917C4J69r9l24L4Q3K64j03j8j09m8J62k9J94j06j7j13o4K1J79r2Q9j57j2P1J26
$$ plain form
3754 144 -108 38 43 -88 265 96 -257 -182 -58 17 67 9 -231 187 99 -176 81 -286 -17 19 3 63 182
3777 182 -121 -7 93 -360 -101 143 27 96 42 -52 148 -39 171 -62 -48 -60 -1 82 27 44 125 61 156 -183
3801 -183 -182 -57 -231 -125 -159 -171 -98 -275 124 159 132 50 2 75 65 140 -35 183 228 81 13 -63 231 49 306
3826 306 -1 118 -84 -77 68 -32 -170 46 -173 32 179 239 -43 55 231 -298 -175 30 84 -1 -40 -145
3848 -145 -95 21 8 -10 30 43 -137 202 69 177 17 18 -39 132 -81 94 98 87 -20 -188 50 -55 -119 -35
3872 -35 -128 -182 167 -164 117 -127 31 -247 -87 -131 -60 103 -120 118 -98 83 -91 175 168 146 13 -51 -250
3895 -250 -35 -55 51 22 -55 -155 46 217 72 -55 34 143 -2 -133 14 187 -55 -49 -302 -184 179 34
3917 34 203 104 -220 -186 -103 161 58 40 -69 -117 45 16 210 104 87 -26 -90 -69 110 18 107 -50 -62 9 135
3942A35k25K25m3l14J04p3K45mJ33j29Rj37j68K51q8L90k13n7p1j17K95J88l55
3965a9q8n7R2J35J59j53L6N0l14O0j2M88k09Q4l27j26J53k9j7J36j00K3O8j25
3989i2Q0L1o8j8j12J63J49k4k64J12l7m3K11q4N9k60J94r8L0J30o7J65l41J12
4013g2j31J97K71j27o2j05O4l97L45k6J66n1j41j49L3J44K03j22j37j39R6o0M54
4036B54k0k69p2O7j40L23j19M9Oj5j38o6J80%j5K94k57j84J77q0j29M23m13L4
4060a10J46L0n1O5J40l37J89o6K24k8J02k44L3k27K65m4k08j86L05j06J01j14
4082a21J56n5J21k58J34J35k2J8M9k99J25j15K11j98k7J40n9R8N5k6j23J80p4
4105D5r6R9j84J33Pj4O0Q5p8rj3m0j57k31J44L35q5K21m7k22M7O7jP9L2j31j4
$$ plain form
3942 135 -90 135 92 -222 -118 -191 54 50 183 54 63 -74 -242 9 -79 311 98 41 -30 -147 148 336 -19
3965 -19 -107 -164 -72 63 222 69 105 155 -159 -99 -111 377 168 252 -75 -201 -48 -77 -94 42 -58 -35 33 -92
3989 -92 -12 19 -49 -67 -179 -16 133 109 -155 -43 -80 -123 88 4 63 -197 -3 -101 -71 59 -8 157 -184 -72
4013 -72 -203 -6 265 138 76 -29 35 -362 -17 -43 123 72 -69 -218 -185 -41 162 40 -97 -236 -140 -200 254
4036 254 234 -35 -107 -40 -180 143 24 73 79 64 -74 -140 40 40 25 319 62 -122 55 -25 -154 269 -144 -110
4060 -110 36 66 15 80 220 -117 72 6 230 202 304 60 93 -134 131 87 -121 -307 -2 -108 -7 -121
4082 -121 35 -20 101 -157 -23 112 90 108 157 -142 -17 -132 79 -119 -146 -6 -65 33 88 62 -61 119 45
4105 45 -51 48 -136 -3 4 -10 50 135 57 48 35 -5 -162 -393 -249 86 1 222 175 -47 0 67 66 145 177 46 32
4132C2j17J78j83m2K52k75J44L1n1K2J29l2p4r2r9J45Q9j43K00j84M4m5N8J66
4156A53L9j45j96J82j79J80R4k5k2k99p2L09kK51j63l1l2l9l9L84j95l09k8P5
4180a09K45j47M4O6q9r7j74J40J60K70k77k49N9R1M8j0P2Q8k87q3K55j99P1J75
4204F3k9j23K70k85Po7J22L2ORn0p3l9J77l2R1K21j5k57j04J85j35j19J45J66
4229A66q2j64Nj69K08m9O3J69m0j16L4Q7O7j25K73m11n5L6j3K20j66k78K04j5
4253a51J63q6J02jl3l0r8K07l7j0j71K62j45r2J91K73l05J41j89j83J08J53j88
4276a19R6j05M8m3J84L8j98K53j41O6n8P9r4J71p6o3O2k1p7J09NN1l40K14j29
4301h8N2r4J63k37O9J70M5L7k00Q3M3p7j2k20K02m7nJ11M1P7j96J01l8Q6Qj09
$$ plain form
4132 32 -85 93 -90 -132 120 -155 -11 20 -31 -9 120 88 14 -78 -177 -32 57 -86 114 -70 -26 -71 -13 153
4156 153 192 47 -149 33 -146 34 128 103 81 -218 -290 19 17 268 105 74 42 3 -36 348 153 -156 -184 -109
4180 -109 136 -11 33 99 10 -87 -261 -121 39 309 32 -217 -158 -67 -19 -29 43 131 -156 -239 16 -183 -112 63
4204 63 34 -89 181 -104 -97 -164 -42 -10 -4 5 -45 -118 -157 20 -12 79 300 285 28 -76 109 -26 -145 0 166
4229 166 84 -80 -75 -244 -36 -85 -22 147 107 -9 25 112 179 54 327 -84 -139 -103 -116 104 -62 -340 -136 -151
4253 -151 12 -74 28 27 -6 -36 -134 73 36 26 -145 117 -28 -120 71 344 39 180 -9 -192 -84 69 -119
4276 -119 -23 -128 -80 -123 61 99 -99 154 13 79 21 100 6 177 101 38 100 79 2 111 116 167 -173 41 -88
4301 -88 -36 -130 33 -204 -135 35 80 117 -83 0 43 -34 -46 -266 -64 -111 -116 -5 36 113 -83 18 -20 66 74 -35
4327c5J20Rn3k30J25M8l6k06L08Lj62J33j38N9J98k25J6Oq0K72k06J12k6j6l6
4352d0j4J89r6l2m3j62J83j84L63j89J00k47p4J56j5K65O2l3j27r2l3J05N3K9
4376A24l50K56k66J3L12q0k2Kr7m6J42J57j69r1m1l8J64n1J12M6k3M3k54K88j53
4401b2R4m7J67k76j14k8K20j35J92n7k15K15p0q9O8o7m4L28j77J62p6qr1J06j5
4426B1j41k0J21K8P3j40j2L32j63J6m2j29J11k4J33Q2l29q0K98l26P6R9J21L0
4450A35j64Q2k4K9j96J17k8j65N6J50K98l99R8Q7OJ6j56N9kQ4j62K55l87K93k9
4475E3r9Mql7L6J14q6Q7n9p9n0K02K03J4j00L1l68J47j68L24l31R3j07K09k28
4500b03K45j35l7J39N2J44j16J39l03KMK6J16J69j11K9k98m8K36j70J25k6l3L4
$$ plain form
4327 -35 85 94 41 -189 -64 -16 -52 -258 50 53 -109 24 -114 -55 143 -82 -66 -60 -140 132 -74 38 12 -4 -40
4352 -40 -54 135 39 7 -36 -198 -15 -199 164 -25 75 -172 -246 -90 -105 160 222 189 62 -30 -63 42 95 124
4376 124 -226 30 -236 -223 89 9 -13 -11 -108 -154 -12 145 -24 -115 -156 -194 -30 -81 31 77 54 97 -157 131 -22
4401 -22 72 25 192 -84 -198 -226 -6 -141 51 -6 -221 -6 -76 -165 -97 -164 -208 120 -57 105 29 21 -70 36 21
4426 21 -120 -140 -19 9 82 -58 -70 262 99 115 73 -56 55 31 164 246 -83 -163 135 -191 -115 -16 105 135
4450 135 -29 53 29 58 -138 -21 -49 -214 -158 -8 290 -109 -11 76 82 98 -58 1 -1 83 -79 176 -211 82 53
4475 53 -46 -42 -50 -87 -51 63 -23 64 5 -74 -124 78 281 295 195 226 -142 5 -163 161 -170 -77 -184 25 -203
4500 -203 42 -93 -130 9 61 205 89 228 -75 -73 -69 -43 73 242 131 160 -138 -186 50 -120 5 -21 -54 -20
4524b0k17K37l4K18j27q3n8J25J7L1N4J0j74J14K9m5p6N6N3j09j05J63k4J26j17
4549D4L2k55J65K90m04K23M8l14L97j10j51K12k23j21P5j28J20K12nq0J6L1j26
4572e2N9oN3j0j86J28J37j47K01k28J54l92M1J89J08k82K21j95J17j0j1P6J39
4595A04Q0l51m2J89K22j45J32l03J12l04L53o2J30L5j26k29K95j04k44L61o2l11
4617b70J78N2j01K92k34Q3J6K%RJj07q1L08j86Q2j16J20j57J0l7K42j44K7J22
4642A11l4j03LJj94M70j74j50J50q8j12M6Nj7J7j53K28J65J7j66j57R7P6P8j47
4667c1J69m08K22j12K2K10K9j8j20o9j67J25K36q0j5k30N4K58O2j0j61NR4m8J26
4692A43q6k68J86J70k64J17q0j30K17Lk8j5K6N0m6J6J04p4Rj36K26Jj74j84k10
$$ plain form
4524 -20 -237 0 -34 184 57 -26 -84 41 58 89 143 153 -21 93 122 77 1 57 110 1 -104 59 35 161 44
4549 44 76 -179 -14 276 -128 95 143 -171 226 116 -35 177 -46 -167 -92 -220 -100 112 107 27 43 74 -52
4572 -52 7 1 54 44 -142 -14 123 -24 177 -51 103 -289 -248 -59 49 -233 -12 -207 -90 -100 -111 -35 104
4595 104 184 -167 -209 -20 202 57 189 -114 -2 -306 47 -15 115 150 24 -205 90 -14 -258 103 41 -270
4617 -270 -92 -40 -141 151 -83 0 16 18 18 27 28 -79 -160 148 -38 44 -72 48 -109 -99 -136 106 -38 -11 111
4642 111 77 -26 -23 -22 -216 254 80 -70 80 -8 -120 -74 -69 -86 -69 -222 6 171 188 22 -135 -38 38 116 -31
4667 -31 138 -270 -48 -160 -138 72 101 83 -37 -106 -273 -148 88 8 -7 -237 -183 75 137 127 -34 -29 65 17 143
4692 143 57 -211 -25 145 -119 -2 -82 -212 5 8 -20 -35 -9 41 -5 11 115 41 50 -86 140 141 -33 -217 -427
4717d27L61J18m2m2O1Lk29L70k67J76k9PK7k02L2O0j22J47p0J31Q9j71J93j10
4741F4o0J55j2k4j82P9J32k95J65r7Q5J7R4j9k49K76j48jJ07o7j08m5L94k33o1
4766c3m7j57K28j01J54k5K0J9o5j36J39p9N4j55M0Q3J20N3Lm3K7j1l34J49J2J58
4792G3N0j94O5n9j13K51m0j60K7J23l3J07Q6j90R2o8k17K35j61J03PKj35J3J5
4817a21J55J13J6k81L18k31O4j04K06l38L44j89%O4L0M2k2l5j01l5O6K18k6q2
4841G1J37k58J24J49k12J84j44J41n8k92K8Q0r8J56j10K60l71J84j5J68j10N6
4863G0rm2l8L13k28j09N1K21l7k17M9k3J04k11r1J40kK30j27l61R5K45Qj3k1j12
4889a15J93j09k7J62q3q7J03r7mj04K74k73K18j93J70%l7k6J20k30K39M2j8k8
$$ plain form
4717 -427 -66 52 10 -32 29 32 -197 173 -94 82 53 60 87 -115 -83 -23 -145 2 -68 63 152 -19 174 64
4741 64 4 159 147 123 -59 20 152 -143 22 -75 10 27 121 102 -147 129 -19 -20 87 20 -88 -133 261 28 -33
4766 -33 -80 -237 -9 -110 44 19 39 58 -7 -143 -4 -83 -29 -184 -144 -61 59 112 115 72 99 88 -246 -97 -85 73
4792 73 123 -71 -6 -65 -178 73 33 -127 -100 23 -10 97 183 -7 85 17 -200 35 -126 -23 -16 -14 -149 -136 -121
4817 -121 34 147 163 -118 200 -31 33 -71 135 -203 141 -48 -48 16 46 88 66 31 -70 -105 -39 179 153 71
4841 71 208 -50 74 223 11 195 51 192 134 -158 -130 -50 -148 8 -102 158 -213 -29 -44 124 14 70
4863 70 61 19 -19 294 66 -43 8 229 192 -25 24 1 105 -106 -197 -57 -59 171 44 -317 -222 23 31 18 -3 -115
4889 -115 78 -31 -58 104 21 -66 37 -60 -64 -168 106 -167 51 -142 28 28 -9 -35 85 -145 94 136 118 90
4913I0n0l6K2j14J50P6k67K25N4j12k41J22J0R2k5k2J07j58K06k54J88k46K90
4936A07M0j28R8n7q4q4L7J5j48K93j68j74K33r9O2J25j79JK72j80J6l9N4J61j04
4961G0J1J18j09j89J69k16K07j98K81k00l4n1K32q4Jk14K02n3J93JPk41O8J26
4985I7R6k49o0J17j49J56k26K20m7K37j21j28J57k11O4K7j1J33K1k23L52k07m
5008D1j44J78lL4n0j66P0%Q5j32R7k05J66J46N7j56K58j99l02J60J72k29n2R8
5032g6J18P8j80n9J22nq2K18j51L0om7M0J89j70m3J1m1K58q6J88m11J21j6R4j39
5058d5K85k56j33O9M8J47k56K06j66n3K06P2j80n6K63j30j86P1J59j44K3J04k08
5081a60P5K23j5o9n3J38j63j52J05j72M14k43m4J04k70L29%j82J20l8K05j31J5
$$ plain form
4913 90 40 4 26 -88 62 138 -129 96 150 38 -203 -81 -71 21 -4 -26 81 -77 129 -125 63 -183 107
4936 107 147 19 117 60 -24 -108 -71 -56 -204 89 -79 -253 -20 -119 -57 68 -111 -110 162 -18 -2 -41 13 174 70
4961 70 81 199 90 -99 70 -146 61 -137 144 -56 -90 -141 91 7 8 -206 -4 -57 136 137 144 -97 -29 97
4985 97 193 -56 -116 1 -148 8 -218 2 -45 192 71 -57 100 -111 -47 -20 -31 102 123 -100 252 45 41
5008 41 -103 75 72 106 56 -110 -40 -40 45 -87 10 -195 -29 117 174 18 276 77 -225 -65 107 -122 -174 -76
5032 -76 42 120 -60 -119 3 -2 -84 134 -17 13 7 -40 0 189 19 -24 -13 -54 204 118 306 -105 16 0 94 -45
5058 -45 240 -16 -149 -80 -32 115 -141 65 -101 -154 52 124 -56 -112 151 21 -165 -94 65 -79 -56 48 -160
5081 -160 -85 138 123 54 1 139 -24 -176 -71 -243 171 -72 -116 -12 -282 47 47 -135 -15 -53 152 21 36
5104C6R1j68O8l3J51k49p4K38O6j57J42j89K24k39j32J19J21k26K27N5j9n8J29
5127A23k39K03n0j25%j2J78j87J45K5j15O5M3j24L22l45l2J86j04PJ07k32J80
5150A9Q2qk49K91j90p8K04Jm7j62m2L36k9r2o6K49n0k17J76j78M5M9J24k85J43
5175B6K6p6j99J89K9r1J57r1J62r7J27l33J17L0J54r9jj0m1K57l72k8o6N11j56
5200A25k89J38r0J93J07q6j36J15J01n0q3M3P1p5k01J12J4j65R4J76k12K17K2
5223A41j67J45l30K83j46N4J75k25J57k27K12M9r5l9L6r8Q8j4j3M0l3M0K3j25
5247f9Q4k12L86j30j42j2j8K34R7l58K37L7k03Q9j07O6J29j16O8Pm9qj29J36k2
5272eo0J6O1J15O5k87J86q2j49J07j5j60L73k87J23p9Q2k62K23r6J37J41j22j92
$$ plain form
5104 36 127 -41 27 -6 145 -104 -178 60 126 -31 111 -78 146 -93 -225 -106 15 -211 16 71 52 -6 123
5127 123 -116 87 37 -88 -88 -100 78 -109 36 61 -54 11 54 -70 252 -93 -125 61 -43 -36 71 -161 19
5150 19 101 93 -156 135 -55 -133 71 72 25 -137 -179 157 128 36 -30 219 169 -48 128 -50 -5 44 168 -117 26
5175 26 52 -24 -223 -34 -5 -96 61 -30 132 35 162 -171 -54 -24 130 31 30 20 -21 236 -136 -164 -230 281 125
5200 125 -164 -26 -116 77 184 98 -38 77 178 128 45 88 159 84 -117 -5 9 -156 -62 114 -98 119 141
5223 141 -26 119 -211 72 -74 -20 155 -70 87 -140 72 121 26 -13 23 -75 13 -1 -14 26 -7 33 56 -69
5247 -69 15 -197 189 59 -83 -95 -113 121 218 -140 97 134 -69 20 -87 -21 108 -8 60 67 18 10 -119 17 -5
5272 -5 -65 -49 12 127 192 -95 91 9 -140 -33 -48 -208 165 -122 1 -78 4 -258 -35 -131 6 147 25 -167
5296a67L07j24m4l8O2J13k99K15j15Q1J18k30Qo2J02l8N2J79K5j55J71l94K55
5319B2l4j25K31m6j19L0N9rN4q5P9o0J2K3P0k59K98l4j65J87l20J77K81j02o9
5344I6j15j1O0R8q0l11K56j94m4L65k98L17r2j21N4j4L8J04j90L22k71K4o9R3
5368A7K94l11J85k34k0J02o9K82j73j19L0M8M4q3j7NJ81j72r0J57m6N6Q3k25M4
5393c1R3J7J57k65L2q4K2P3K03k80K3Q9j09J32j76j12P4J94J10j49n9j28J52l1
5417e3K79R8l79m1O4q3K27l8m8l0K57k02j40LJ76j05j99J67j8K20j93R5k09N3
5441i9J00j80m5K83O6j15L0r8L9nJ37j06MK9k00K76j85O2lOk59L72k55J5Nn7K18
5468C5Mo8L2J09j36K95k94P3j01j26P1K82j92j23O5R7K7k98J78l7K15L9j61L0
$$ plain form
5296 -167 140 16 -28 -66 -4 109 -190 25 -90 -9 109 -121 -113 -175 -73 -111 -59 120 145 -10 161 -233 22
5319 22 -12 -137 94 48 -71 -41 18 9 63 -22 57 -3 9 32 102 -157 141 107 -58 129 -191 -14 267 165 96
5344 96 -19 -30 30 128 48 -263 -7 -201 -245 120 -178 139 47 -74 -20 -34 4 108 -82 240 -31 -7 -76 17
5368 17 311 0 185 -49 -69 33 -36 246 73 -46 -16 32 76 -7 -24 -19 162 -10 -100 57 11 67 150 -75 -31
5393 -31 62 79 236 -29 3 -81 -59 14 217 -63 -40 49 -60 72 -104 -216 -142 52 162 13 -46 -174 -22 -53
5417 -53 226 324 -55 -96 -32 -115 112 74 26 -4 253 51 -89 -86 90 -15 -214 -47 -65 155 -38 57 -152 -99
5441 -99 1 -179 -224 59 125 10 40 -58 -19 -24 113 7 11 40 -160 116 -69 -7 -10 -4 -263 109 -146 -131 -126 -183 35
5468 35 39 -29 3 112 -24 271 -23 50 -51 -177 -106 176 -16 -139 -74 23 50 -248 -70 -107 108 147 -14 16
5492A6L4k04R8J76j44m2l6O4j02K28k39J98R4j75L1j26J36J21r8j1K5n9o6K53
5516A72k80L5O5pR9q5K36j44j57p5K05m6j11N8P6J07k19Q0j8l5K21j90J6n4Q8
5541C7j25K47k19J97M5k74ML31l00n1J48P6o1m6j43p0L20k54K18j51J76N8k95
5564a32L8R6K26j25J03l26K80l08J08mJ84k90J27j54K36p7K03j87k8P4j37N8n0
5587h5K30k00O7N7J94n18M77q6n5m7k60MJ07L07j07j42Mj09Q9j1k1K52j56J30
5611A21q8k3o4K20k36j22L60k66J19R7l31J80n1O4J08k80J37O8l7jk5p3K13Pj21
5636b4o0j07L3K37%k00KJ04j40J57k6r6j6J75n4q3J24K3jr9m9J64k5p2q6R2K31
5663B04k73J52J1P1k80J27M1j03J30MLk04R9J02j12J48j6O6j43j0j31L0Q4n4M
$$ plain form
5492 16 50 -154 -56 120 -24 -66 -102 -38 -140 88 -151 47 141 -34 -3 -129 7 128 30 19 44 -15 -81 172
5516 172 -108 -73 -8 -15 84 -1 235 91 -66 -141 64 18 -93 -35 41 148 -71 9 -9 -44 177 -13 3 -51 37
5541 37 -88 159 -60 137 182 -92 -88 243 -57 -108 40 116 55 9 -134 -204 116 -138 80 -71 105 163 -132
5564 -132 -94 2 228 103 206 -120 160 -148 -40 -44 140 -150 -23 -177 59 -18 185 -2 -30 44 -93 -35 -85
5587 -85 145 -55 12 69 263 -255 222 136 81 34 -226 -222 -115 192 85 -57 -53 -162 -73 -84 -105 147 -9 121
5611 121 33 10 -54 166 -70 -192 168 -98 21 118 -213 -33 -84 -20 88 -192 -55 13 -24 -25 -50 -123 90 97 -24
5636 -24 -84 -191 -158 79 79 -121 -119 -15 -155 2 -24 -120 -136 39 -15 -98 26 49 48 -51 -100 64 39 -33 -119 -27 204
5663 204 -69 83 94 165 -115 12 53 -50 80 84 87 -117 -18 84 -28 120 104 170 27 17 -114 -84 0 -54 -50
5688e0n3O5J30J24k71J77j39oJ39p3r3L2Nj11o2K61J40j40m05K33K22l38K52K5
5712F4n9N1Q0j32O2j34n4K0J54j44M6N5m3j18J63J21j43Q2L1l1o5j79J57J29r8
5737A5J37j97J96k8qj99j11K35o9NJ88m73K81N5Mq4L0NL0j3K16k36J58j93LMP0
5764B1r1jJ87j25j11R2k84N05j59l0J5K9j71J79k33N6K59k26j1J64m3o5J28r3
5788hj07k3J00n7J79k02r8K64r0J46j20P2q8L5k7J67N4l3j81J63N9j85J22j68
5812b6J19j08J09k51K35n7j38J41OK7Q6J24k38J6n0m9J00j32l0J07mR6j97K18
5836A04j66J37L1m1j60QJ76q5j07K7K29p6r3J65k17jP9O0j1l1j08Q7P9m0j84L13
5862A75p8o6j28l8R1n2O8o8L7rl0N5J54k06L9O0J19j26n7J40l8n2O4m1r0n1l7
$$ plain form
5688 -50 -103 -38 92 216 -55 122 -17 -23 116 43 -50 -18 -13 -124 -186 75 215 75 -330 -97 125 -213 39 64
5712 64 5 56 136 4 66 -68 -122 -102 52 -92 -46 9 -34 -152 11 132 -11 71 102 71 6 -173 -16 113 15
5737 15 152 -45 151 123 115 -84 -195 40 -29 -24 164 -309 -28 27 31 -53 -23 -18 12 -1 215 -21 137 -56 -53 -49 21
5764 21 -70 -71 116 -9 -120 -28 -312 193 34 4 19 48 -123 56 -177 -121 138 -88 -99 65 22 -43 85 -8
5788 -8 -115 -138 -38 -95 84 -118 -216 48 -42 104 -16 56 -32 3 -24 143 197 164 -17 146 205 20 142 -26
5812 -26 93 -15 94 -157 78 21 -117 24 30 57 143 267 29 45 -5 -54 46 -86 -116 -9 -13 83 -114 104
5836 104 -62 75 106 65 -95 -87 89 4 -103 -76 153 77 -16 149 -68 -69 10 70 59 28 -80 7 86 46 -138 175
5862 175 97 31 -97 -135 -44 -96 -28 -96 -59 -68 -98 -43 111 -95 -56 4 123 -3 -60 80 42 -10 54 13 -77 -128 -165
5889a65M4J74n1O6j42R4n1rJ67j27K3J27j74n3O8J10r4L9L06l21j28k2j06JM27
5914B03j02J0k49P0l5K73j86m7K93k10J03r3j6p1Q9n2j20M54m20K25j06O0oJ07
5938A74nj18p1K0j5J44j54K67k79J52r7p4O8J15n4k00K55l88M00j36P2K6r3j38
5962a29J98j3K4m9q7R1J86j80M2N8o9K7o5q9J83p2j72R3k56L91j19j12J68q2P0
5987C7Lm2l4j12j38M36k20O5L9j56K11k34J43P9k32J92q4N8m9K24p1N8j47J08
6011A34r4q2J07l42J54J26j22P3Ornk02N57j29k73K22k97K65j37K15l42R2R9K00
$$ plain form
5889 -165 -121 53 2 68 -74 20 -31 -40 127 0 23 150 -24 -77 -9 101 7 46 352 31 -97 -119 -225 -224 203
5914 203 101 111 -138 -68 -103 170 -16 -63 230 20 123 30 14 -57 32 -20 -140 314 -106 119 13 73 67 174
5938 174 169 51 -20 0 -15 129 -25 242 -37 115 18 -56 12 127 73 -127 128 -260 140 4 76 102 9 -129
5962 -129 69 56 80 31 -56 35 221 41 83 141 72 99 34 -55 128 56 -116 -23 -279 112 -7 -119 49 -33 37
5987 37 40 -2 -36 -148 -286 150 -70 -5 34 -122 89 -145 -2 77 -155 37 -47 11 -38 186 115 173 26 134
6011 134 40 -42 65 -277 -123 3 -119 -46 -40 -49 -54 -256 301 172 -101 121 -176 89 -48 167 -175 -83 16 216
$$ [...]
8191I7
##END NTUPLES=NMR FID
##END=
