##TITLE=1H_Pr 2CDCl3-TMS
 CDCl3, 96 sc, 
 18.10.2019
##JCAMPDX= 6.0         $$ Bruker NMR JCAMP-DX V2.0
##DATA TYPE= NMR FID
##DATA CLASS= NTUPLES
##ORIGIN= UXNMR, Bruker Analytische Messtechnik GmbH
##OWNER= root
$$ XWIN-NMR		Version 3.5
$$ Fri Oct 18 13:58:07 2019 Russian Standard Time (UT+4h)  she@DPX200
##.OBSERVE FREQUENCY= 200.1315
##.OBSERVE NUCLEUS= ^1H
##.DELAY= (6, 6)
##.ACQUISITION MODE= SIMULTANEOUS
##.ACQUISITION SCHEME= undefined
##.AVERAGES= 96
##.DIGITISER RES= 18
##SPECTROMETER/DATA SYSTEM= spect
##.PULSE SEQUENCE= zg30
##.SOLVENT NAME= CDCl3
##.SHIFT REFERENCE= (INTERNAL, CDCl3, 0, 15.7039)
##AUDIT TRAIL= $$ (NUMBER, WHEN, WHO, WHERE, WHAT)
$$ ##TITLE= Audit trail, XWIN-NMR		Version 3.5
$$ ##JCAMPDX= 5.01
$$ ##ORIGIN= Bruker BioSpin GmbH
$$ ##OWNER= she
$$ F:/spectra/data/she/nmr/H-F/1/audita.txt
$$ ##AUDIT TRAIL=  $$ (NUMBER, WHEN, WHO, WHERE, WHAT)
(   1,<2019-10-18 13:57:12.34 +0400>,<she>,<DPX200>,
      <continue with go, POWCHK disabled, PULCHK disabled
       configuration hash MD5:
       00 E9 B6 7A A2 85 ED C7 34 08 36 98 17 FE 4E 26
       data hash MD5: 16K
       36 9C 68 01 F8 30 6D 19 3C 4C 50 B6 86 41 19 1D>)
$$ ##END=
$$ 
$$ hash MD5
$$ 99 C7 37 54 FF 28 14 44 F4 08 9B AC FC 1D FF A1
##$RELAX= 
##$RELAX= 
##$RELAX= 
##$RELAX= 
##$RELAX= 
##$RELAX= 
$$ Bruker specific parameters
$$ --------------------------
##$DU= <F:/spectra>
##$EXPNO= 1
##$NAME= <H-F>
##$PROCNO= 1
##$TYPE= <nmr>
##$USER= <she>
##$AMP= (0..31)
100 100 100 100 100 100 100 100 100 100 100 100 100 100 100 100 100 100 
100 100 100 100 100 100 100 100 100 100 100 100 100 100 
##$AQSEQ= 0
##$AQ_mod= 1
##$AUNM= <au_zg>
##$AUTOPOS= <>
##$BF1= 200.13
##$BF2= 200.13
##$BF3= 200.13
##$BF4= 200.13
##$BF5= 200.13
##$BF6= 200.13
##$BF7= 200.13
##$BF8= 200.13
##$BYTORDA= 1
##$CFDGTYP= 0
##$CFRGTYP= 5
##$CHEMSTR= <none>
##$CNST= (0..31)
1 1 145 1 1 1 1 1 1 1 1 1 1 1 1 1 1 1 1 1 1 1 1 1 1 1 1 1 1 1 1 1 
##$CPDPRG= <>
##$CPDPRG1= <>
##$CPDPRG2= <>
##$CPDPRG3= <>
##$CPDPRG4= <mlev>
##$CPDPRG5= <mlev>
##$CPDPRG6= <mlev>
##$CPDPRG7= <mlev>
##$CPDPRG8= <mlev>
##$CPDPRGB= <>
##$CPDPRGT= <>
##$D= (0..31)
0 1.2 0 0 0 0 0 0 0 0.06 0 0.03 0 0 0 0 0.0002 0 0 0 0 0 0 0 0 0 0 0 0 
0 0 0 
##$DATE= 1571392321
##$DBL= (0..7)
120 120 120 120 120 120 120 120 
##$DBP= (0..7)
150 150 150 150 150 150 150 150 
##$DBP07= 0
##$DBPNAM0= <>
##$DBPNAM1= <>
##$DBPNAM2= <>
##$DBPNAM3= <>
##$DBPNAM4= <>
##$DBPNAM5= <>
##$DBPNAM6= <>
##$DBPNAM7= <>
##$DBPOAL= (0..7)
0.5 0.5 0.5 0.5 0.5 0.5 0.5 0.5 
##$DBPOFFS= (0..7)
0 0 0 0 0 0 0 0 
##$DE= 6
##$DECBNUC= <off>
##$DECIM= 24
##$DECNUC= <off>
##$DECSTAT= 4
##$DIGMOD= 1
##$DIGTYP= 9
##$DL= (0..7)
0 120 120 120 120 120 120 120 
##$DP= (0..7)
150 150 150 150 150 150 150 150 
##$DP07= 0
##$DPNAME0= <>
##$DPNAME1= <>
##$DPNAME2= <>
##$DPNAME3= <>
##$DPNAME4= <>
##$DPNAME5= <>
##$DPNAME6= <>
##$DPNAME7= <>
##$DPOAL= (0..7)
0.5 0.5 0.5 0.5 0.5 0.5 0.5 0.5 
##$DPOFFS= (0..7)
0 0 0 0 0 0 0 0 
##$DQDMODE= 0
##$DR= 18
##$DS= 0
$$ [...]
##$SUBNAM2= <"">
##$SUBNAM3= <"">
##$SUBNAM4= <"">
##$SUBNAM5= <"">
##$SUBNAM6= <"">
##$SUBNAM7= <"">
##$SUBNAM8= <"">
##$SUBNAM9= <"">
##$SW= 24.0689530833862
##$SWIBOX= (0..15)
0 0 2 0 0 0 0 0 0 0 0 0 0 0 0 0 
##$SW_h= 4816.95568400771
##$TD= 16384
##$TD0= 1
##$TE= 0
##$TE2= 300
##$TE3= 300
##$TEG= 300
##$TL= (0..7)
0 120 120 120 120 120 120 120 
##$TP= (0..7)
150 150 150 150 150 150 150 150 
##$TP07= 0
##$TPNAME0= <>
##$TPNAME1= <>
##$TPNAME2= <>
##$TPNAME3= <>
##$TPNAME4= <>
##$TPNAME5= <>
##$TPNAME6= <>
##$TPNAME7= <>
##$TPOAL= (0..7)
0.5 0.5 0.5 0.5 0.5 0.5 0.5 0.5 
##$TPOFFS= (0..7)
0 0 0 0 0 0 0 0 
##$TUNHIN= 0
##$TUNHOUT= 0
##$TUNXOUT= 0
##$USERA1= <user>
##$USERA2= <user>
##$USERA3= <user>
##$USERA4= <user>
##$USERA5= <user>
##$V9= 5
##$VALIST= <valist>
##$VCLIST= <CCCCCCCCCCCCCCC>
##$VD= 0
##$VDLIST= <DDDDDDDDDDDDDDD>
##$VPLIST= <PPPPPPPPPPPPPPP>
##$VTLIST= <TTTTTTTTTTTTTTT>
##$WBST= 1024
##$WBSW= 4
##$XGAIN= (0..3)
0 0 0 0 
##$XL= 0
##$YL= 0
##$YMAX_a= 169560
##$YMIN_a= -102013
##$ZGOPTNS= <>
##$ZL1= 120
##$ZL2= 120
##$ZL3= 120
##$ZL4= 120
##$ABSF1= 10
##$ABSF2= 0
##$ABSG= 5
##$ABSL= 3
##$ALPHA= 0
##$AQORDER= 0
##$ASSFAC= 0
##$ASSFACI= 0
##$ASSFACX= 0
##$ASSWID= 0
##$AUNMP= <proc_1d>
##$AZFE= 0.1
##$AZFW= 0.1
##$BCFW= 1
##$BC_mod= 2
##$BYTORDP= 1
##$COROFFS= 0
##$CY= 11.3945322036743
##$DATMOD= 1
##$DC= 2
##$DFILT= <>
##$DTYPP= 0
##$F1P= 20.1720416913024
##$F2P= 0.152960286110954
##$FCOR= 0.5
##$FTSIZE= 0
##$FT_mod= 4
##$GAMMA= 1
##$GB= 0.15
##$INTBC= 1
##$INTSCL= 1
##$ISEN= 128
##$LB= 0.24
##$LEV0= 0
##$LPBIN= 0
##$MAXI= 10000
##$MC2= 0
##$MEAN= 0
##$ME_mod= 0
##$MI= 1.114404
##$NCOEF= 0
##$NC_proc= 0
##$NLEV= 6
##$NOISF1= 3.799351
##$NOISF2= 2.8
##$NSP= 1
##$NTH_PI= 0
##$NZP= 0
##$OFFSET= 15.70392
##$PC= 1
##$PHC0= -9567.447
##$PHC1= 8.60089
##$PH_mod= 1
##$PKNL= yes
##$PPARMOD= 0
##$PSCAL= 0
##$PSIGN= 0
##$REVERSE= no
##$SF= 200.130013532006
##$SI= 16384
##$SIGF1= 3
##$SIGF2= 2
##$SINO= 400
##$SIOLD= 16384
##$SREGLST= <1H.CDCl3>
##$SSB= 0
##$STSI= 0
##$STSR= 0
##$SW_p= 3612.71676300578
##$SYMM= 0
##$S_DEV= 0
##$TDeff= 0
##$TDoff= 0
##$TI= <>
##$TILT= no
##$TM1= 0
##$TM2= 0
##$TOPLEV= 0
##$USERP1= <user>
##$USERP2= <user>
##$USERP3= <user>
##$USERP4= <user>
##$USERP5= <user>
##$WDW= 1
##$XDIM= 8192
##$YMAX_p= 0
##$YMIN_p= 0
$$ End of Bruker specific parameters
$$ ---------------------------------
##NTUPLES= NMR FID
##VAR_NAME=  TIME,          FID/REAL,        FID/IMAG
##SYMBOL=    X,             R,               I
##VAR_TYPE=  INDEPENDENT,   DEPENDENT,       DEPENDENT
##VAR_FORM=  AFFN,          ASDF,            ASDF
##VAR_DIM=   8192,          8192,            8192
##UNITS=     SECONDS,       ARBITRARY UNITS, ARBITRARY UNITS
##FACTOR=    0.0002076,     1,               1
##FIRST=     0,             0,               0
##LAST=      1.7004516,     0,               0
##MIN=       0,             -102013,         0
##MAX=       1.7004516,     169560,          0
$$ Real data points
##PAGE= N=1
##DATA TABLE= (X++(R..R)), XYDATA
$$ plain form
0 0 0 0 0 0 0 0 0 0 0 0 0 0 0 0 0 -3 65 -95 96 -96 96 -96 105 -164 190 -192 216 -269 291 -332 372 -417 470
33 470 -529 582 -652 727 -809 898 -994 1100 -1221 1349 -1494 1654 -1830 2041 -2268 2532
49 2532 -2842 3202 -3630 4164 -4834 5703 -6876 8597 -11327 16444 -29428 169560 100749
62 100749 -26286 44651 59736 48735 6034 41842 54386 32274 -3948 29275 54960 34213
74 34213 -9393 13104 39909 26804 -8540 7644 31482 14927 -20240 -5685 24722 11567
86 11567 -25735 -19010 12111 4457 -29593 -25629 3917 -4469 -39854 -37624 -4855 -6858 -44250
99 -44250 -47850 -15049 -11689 -45853 -53855 -20794 -13813 -49067 -59890 -27420 -14994 -47580 -63800
112 -63800 -34639 -17841 -45332 -63772 -38236 -17875 -41649 -63540 -39577 -14375 -35929 -59930
$$ packed form
0@%%%%%%%%%%%%%%%lO8j60J91j92J92j92K01k69L54l82M08m85N60o23P04p89Q87
33D70r99J111j234J379j536J707j892K094k321K570k843L148l484L871m309M800
49B532n374O044o832P794q998J0537j2579J5473j9924K7771m5872J98988o8811
62A00749j27035P0937J5085j1001m2701L5808J2544k2112l6222L3223K5685k0747
74C4213m3606K2497K6805j3105l5344J6184K3838j6555l5167J4555L0407j3155
86A1567l7302O725L1121p654l4050L964K9546q386l5385K230L2769k003l7392
99d4250l600L2801L360l4164q002L3061O981l5254j0823L2470J2426l2586j6220
112f3800K9161J6798k7491j8440K5536K0361k3774k1891K3963K5202k1554k4001
$$ plain form
124 -59930 -38716 -11673 -29727 -55377 -36887 -9415 -23943 -49070 -33687 -3928 -14921 -43055
136 -43055 -29966 2844 -7014 -35993 -25125 7393 1976 -27420 -19672 13192 11898 -18049 -15175
149 -15175 19046 22764 -7696 -9564 25694 32072 2004 -4124 27961 39126 10339 1120 30284
162 30284 45400 20088 5783 32749 49694 27584 9120 35441 53059 31056 12857 34973
174 34973 54326 35766 15376 33763 55570 38208 16191 31857 54176 39809 14692 27299
186 27299 52729 40261 12156 22100 47515 38104 10732 15618 42239 38073 8713 7880 35752
199 35752 34480 4458 905 28305 29282 -957 -6997 18760 24084 -4683 -15036 10116 17691
212 17691 -8559 -22185 493 13795 -12633 -28511 -7729 6030 -17933 -33955 -15821 637
$$ packed form
124e9930K1214K7043j8054k5650J8490K7472j4528k5127J5383K9759j0993k8134
136d3055J3089L2810r858k8979J0868L2518n417k9396P748L2864j294k9947K874
149a5175L4221L718l0460j868L5258O378l0068o128L2085J1165k8787r219K9164
162C0284J5116k5312j4305K6966J6945k2110j8464K6321J7618k2003j8199K2116
174C4973J9353j8560k0390J8387K1807j7362k2017J5666K2319j4367k5117J2607
186B7299K5430j2468k8105R944K5415r411k7372M886K6621m166k9360q33K7872
199C5752j272l0022l553K7400R77l0239o040K5757N324k8767j0353K5152P575
212A7691k6250j3626K2678J3302k6428j5878K0782J3759k3963j6022J8134J6458
$$ plain form
224 637 -19617 -39557 -22524 -4281 -23142 -43905 -28334 -7651 -25302 -47931 -34301 -11220
236 -11220 -25813 -49492 -38019 -14926 -25068 -49144 -42062 -15146 -22806 -48159 -42997 -16116 -18759
249 -18759 -45321 -42696 -16960 -14850 -40341 -41338 -15557 -10306 -34243 -38278 -12842 -3453 -26938
262 -26938 -33589 -9572 1372 -20595 -29408 -6020 7245 -12798 -23582 -2527 14537 -2871
274 -2871 -17713 2451 19996 3334 -11726 6096 25010 11602 -6380 9952 30297 18758
286 18758 422 12873 34990 26769 4633 14931 38576 32891 9670 16447 40798 37160 13088
299 13088 16589 41511 40051 16796 15777 40355 42557 18367 14423 38529 42964 19322 12856
312 12856 35550 42205 19993 10471 31702 39996 17495 7363 26380 36570 16082 2692 20729
$$ packed form
224F37k0254j9940J7033J8243j8861k0763J5571K0683j7651k2629J3630K3081
236a1220j4593k3679J1473K3093j0142k4076P082K6916p660k5353N162K6881k643
249a8759k6562K625K5736K110k5491r97K5781N251k3937m035K5436R389k3485
262b6938o651K4017J0944k1967q813K3388J3265k0043j0784K1055J7064j7408
274b871j4842K0164J7545j6662j5060J7822J8914j3408j7982J6332K0345j1539
286A8758j8336J2451K2117q221k2136J0298K3645n685k3221O777K4351l638k4072
299A3088L501K4922j460k3255j019K4578K202k4190l944K4106M435k3642o466
312A2856K2694O655k2212r522K1231Q294k2501j0132J9017J0190k0488j3390J8037
$$ plain form
325 20729 32445 13315 -2098 13718 27465 10199 -6809 6606 23329 7350 -13364 -1099
337 -1099 17008 4051 -17238 -8655 11294 376 -22734 -15152 4842 -2699 -25959 -22313 -2371
350 -2371 -5944 -29326 -28227 -8026 -8932 -31566 -33071 -11702 -11835 -33008 -37054 -15080 -13221 -33310
364 -33310 -39387 -19760 -13007 -32089 -40858 -20478 -12304 -31784 -41948 -21816 -9536 -28373 -40946
377 -40946 -23153 -9030 -25002 -38101 -24020 -5822 -18854 -34176 -19967 -1507 -14145 -29657
389 -29657 -17953 911 -7860 -25067 -16234 6053 -825 -19194 -12631 9179 5481 -13694 -8817
402 -8817 13543 12327 -8184 -4728 17181 18316 -1034 -627 20537 23791 4212 3549 23055 28755
416 28755 9717 5646 26141 33200 14541 8116 26168 35150 18807 9645 26773 37996 21700
$$ packed form
325B0729J1716j9130j5413J5816J3747j7266j7008J3415J6723j5979k0714J2265
337a099J8107j2957k1289Q583J9949j0918k3110P582J9994p541k3260L646J9942
350b371l573k3382J099K0201r06k2634j505K1369j33k1173m046K1974J859k0089
364c3310o077J9627O753j9082q769K0380Q174j9480j0164K0132J2280j8837j2573
377d0946J7793J4123j5972j3099J4081J8198j3032j5322J4209J8460j2638j5512
389b9657J1704J8864q771j7207Q833K2287o878j8369O563K1810l698j9175M877
402h817K2360j216k0511L456K1909J135j9350M07K1164L254j9579o63J9506N700
416B8755j9038m071K0495P059j8659o425J8052Q982j6343r162J7128J1223j6296
$$ plain form
429 21700 9999 25830 38645 24197 10030 25470 38210 25482 10530 22210 37244 26362
441 26362 8151 17371 33448 25704 6725 13052 31459 22948 3961 7724 27038 20008 682
454 682 3612 20967 18173 -1890 -2371 15425 15180 -5432 -8574 10429 10763 -9701 -13199 3788
468 3788 6846 -11655 -18821 -3004 3771 -15800 -23838 -7562 291 -17695 -28591 -13174 -2926
481 -2926 -19139 -32271 -17452 -6151 -19532 -33312 -20990 -7690 -20840 -35053 -24946 -10108
493 -10108 -19107 -36261 -26229 -10811 -18351 -34385 -27270 -10131 -16947 -31058 -27739 -9455 -11649
506 -11649 -30850 -27456 -8143 -8634 -26494 -25541 -6642 -5161 -22372 -23212 -5237 -1061 -16482 -20438
520 -20438 -1228 4615 -10903 -16045 1289 10163 -5163 -12486 4819 14489 178 -6923 6849
$$ packed form
429B1700j1701J5831J2815j4448j4167J5440J2740j2728j4952J1680J5034j0882
441B6362j8211R220J6077p744j8979O327J8407q511j8987L763J9314p030j9326
454F82K930J7355k794k0063m81J7796k45k0612l142J9003L34k0464l498J6987
468C788L058j8501p166J5817O775j9571q038J6276P853j7986j0896J5417J0248
481b926j6213j3132J4819J1301j3381j3780J2322J3300j3150j4213J0107J4838
493a0108q999j7154J0032J5418p540j6034P115J7139o816j4111L319J8284k194
506a1649j9201L394J9313m91j7860R53J8899J481j7211q40J7975M176j5421l956
520b0438J9210N843j5518n142J7334Q874j5326p323J7305R670j4311p101J3772
$$ plain form
533 6849 19206 5790 -4153 9327 23525 10313 -507 12004 26806 17420 2676 13378 29350
546 29350 20501 6256 13866 31258 24520 8229 14768 31649 27632 10637 14135 32123 28159
559 28159 10470 13577 29982 29703 11297 11671 26613 29691 11778 8958 26480 29032 11040 5491
573 5491 21650 25136 9110 2968 17818 22663 7264 -1642 13037 19620 4891 -5994 6280
586 6280 16765 2226 -9887 979 12977 -185 -14108 -4365 8031 -3343 -17136 -8975 3804
599 3804 -5300 -21295 -15192 740 -7985 -23588 -18370 -4517 -9422 -25276 -23050 -8253 -10800 -26743
613 -26743 -27057 -11261 -10983 -26876 -28642 -12783 -11347 -26818 -29340 -13755 -11128 -25334 -29401 -14701
627 -14701 -8713 -23302 -28536 -13617 -6528 -21444 -28265 -13441 -3580 -17260 -24889 -11393 -480
$$ packed form
533F849J2357j3416r943J3480J4198j3212j0820J2511J4802r386j4744J0702J5972
546B9350q849j4245P610J7392o738j6291O539J6881m017j6995L498J7988l964
559B8159j7689L107J6405k79j8406L74J4942L078j7913k820J7522K552j7992n549
573E491J6159L486j6026o142J4850M845j5399q906J4679O583j4729j0885J2274
586F280J0485j4539j2113J0866J1998j3162j3923R743J2396j1374j3793Q161J2779
599C804r104j5995O103J5932q725j5603N218J3853m905j5854K226J4797k547j5943
613b6743l14J5796K78j5893j766J5859J436j5471k522J5585K627j4206m067J4700
627a4701N988j4589n234J4919P089j4916o821J4824R861j3680p629J3496J0913
$$ plain form
640 -480 -12958 -23404 -10157 2133 -6919 -19976 -8306 5875 -2327 -15325 -6369 8187 2202
653 2202 -11639 -3713 12184 6652 -5675 -225 14415 12470 -1477 1371 18365 16378 2658
666 2658 4885 19967 20264 6243 6264 20875 23313 8762 7718 21488 26556 12201 7826 23946
680 23946 28593 13391 6694 22694 28846 15818 8505 20740 28517 17743 7608 17662 29388
693 29388 16285 5052 15757 26826 15950 3849 12232 23834 14958 1999 8343 19726 13569
706 13569 -1184 3087 15788 9913 -4184 -785 12462 9127 -6712 -5558 7543 5625 -8649
719 -8649 -9124 3485 2810 -11925 -13393 -119 9 -14604 -17926 -4518 -1717 -16479 -21145 -6964
733 -6964 -3640 -18267 -24194 -11267 -5130 -19043 -26874 -14707 -6748 -18188 -28762 -16872 -6919
$$ packed form
640d80j2478j0446J3247J2290r052j3057J1670J4181q202j2998Q956J4556n985
653B202j3841P926J5897n532j2327N450J4640j945j3947K848J6994j987j3720
666B658K227J5082K97j4021K1J4611K438j4551j044J3770N068j4355m375J6120
680B3946M647j5202o697J6000O152j3028p313J2235P777j0774j0135J0054J1726
693B9388j3103j1233J0705J1069j0876j2101Q383J1602q876j2959O344J1383o157
706A3569j4753M271J2701n875j4097L399J3247l335j5839J154J3101j918j4274
719h649m75J2609o75j4735j468J3274J28j4613l322J3408K801j4762m666J4181
733f964L324j4627n927J2927O137j3913p831J2167P959j1440j0574J1890R953
$$ plain form
746 -6919 -17783 -28973 -18274 -7466 -16453 -27256 -19330 -7749 -14725 -26739 -19641 -5995 -12223
759 -12223 -23576 -18918 -3899 -9231 -21854 -16120 -2614 -5675 -17667 -13841 -418 -2860 -14064
772 -14064 -13362 2773 3203 -9846 -11593 4402 5670 -6587 -7110 6961 10243 -1379 -5458 8225
786 8225 16038 3460 -1461 9891 18574 7733 514 12413 21600 11726 2970 12986 22833 13631
800 13631 6205 13475 24432 16371 7261 14097 25806 19174 8250 13908 25117 20124 8713 14324
814 14324 25311 19306 7113 10427 23833 20809 6925 8448 21801 19575 5819 5859 19472 18885
828 18885 4158 3849 15565 16644 3748 -1312 11012 15239 346 -5683 6372 12335 -776
841 -776 -7408 2234 8013 -2807 -11753 -2226 4119 -4682 -14795 -6442 1593 -6741 -17017 -9405 -479
$$ packed form
746f919j0864j1190J0699J0808q987j0803P926J1581o976j2014P098J3646o228
759a2223j1353M658J5019n332j2623N734J3506l061j1992L826J3423k442j1204
772a4064P02J6135M30j3049j747J5995J268j2257n23J4071L282j1622m079J3683
786H225P813j2578m921J1352Q683j0841p219J1899R187r874q756J0016R847r202
800A3631p426P270J0957q061r110O836J1709o632j0924N658J1209m993j1411N611
814A4324J0987o005j2193L314J3406l024j3884J523J3353k226j3756M0J3613n87
828A8885j4727l09J1716J079j2896n060J2324M227j4893o029J2055N963j3111
841g76o632R642N779j0820q946R527O345q801j0113Q353Q035q334j0276P612Q926
$$ plain form
856 -479 -9132 -19463 -13025 -2910 -9603 -21763 -15859 -5292 -11108 -23280 -18019 -6307 -11026 -23727
870 -23727 -20727 -8488 -10481 -22801 -20783 -8269 -8484 -22293 -22759 -9219 -7481 -20960 -22451 -8694
884 -8694 -5927 -17450 -21636 -9046 -2934 -14248 -19160 -6789 -888 -11574 -17246 -6403 1397 -6440
898 -6440 -14601 -4529 3660 -4324 -11755 -1418 7926 249 -7674 816 10877 4353 -5210 3226
912 3226 13945 7533 -2788 3745 16376 11597 171 6270 18070 14816 4471 6859 20905
925 20905 18080 5474 6801 19668 19667 8208 7738 20105 22658 10286 8669 20039 21937 11473
939 11473 7255 18933 22535 12508 5735 16459 21791 11572 5268 14364 19891 9806 2251 12203
953 12203 18422 9521 1013 8879 16847 8469 -1731 5047 13925 6054 -4700 672 11450 3793
$$ packed form
856d79q653j0331O438J0115o693j2160N904J0567n816j2172N261J1712m719j2701
870b3727L000J2239j993j2320K018J2514k15j3809m66J3540J738j3479j491J3757
884h694K767j1523m186J2590O112j1314m912J2371N901j0686n672J0843P800p837
898f440q161J0072Q189p984p431J0337R344p677p923Q490J0061o524r563Q436
912C226J0719o412j0321O533J2631m779j1426O099J1800l254j0345K388J4046
925B0905k825j2606J327J2867jj1459m70J2367K553j2372j617J1370J898j0464
939A1473m218J1678L602j0027o773J0724N332j0219o304R096N527j0085p555R952
953A2203O219q901q508P866P968q378j0200O778Q878p871j0754N372J0778p657
$$ plain form
967 3793 -5982 -3143 7609 2056 -10690 -7247 4773 -463 -11153 -10846 502 -1082 -14220 -12886
981 -12886 -2692 -2974 -14745 -15697 -5329 -4800 -16046 -19315 -9049 -5233 -16699 -21624 -10072 -7032
995 -7032 -17096 -21686 -10969 -6368 -16350 -22078 -11977 -5715 -14967 -21349 -13096 -5109 -13442 -20539
1009 -20539 -13053 -4514 -11157 -19208 -13099 -2819 -8635 -17938 -11975 477 -5567 -15646 -9255 1316
1023 1316 -2029 -12644 -8160 3341 2353 -8794 -6548 5029 4879 -4217 -4673 7736 8262 -2287
1037 -2287 -2835 8643 11324 1123 348 10618 15249 4320 2164 12446 16527 7068 3430 13618
1051 13618 18616 8722 3871 12918 20238 11336 5252 14256 21002 13357 5222 12603 20805 13701 4236
1066 4236 11674 21343 14535 4778 11417 20543 15332 4317 8232 17472 13992 4517 5936 15055 12295
$$ packed form
967C793r775K839J0752n553j2746L443J2020n236j0690L07J1348j584j3138J334
981a2886J0194k82j1771r52J0368N29j1246l269J0266L816j1466m925J1552L040
995g032j0064m590J0717M601r982n728J0101O262r252o382Q253P987q333p097
1009b0539P486Q539o643q051O109J0280n816r303N963J2452o044j0079O391J0571
1023A316l345j0615M484J1501r88j1147K246J1577j50r096m56J2409N26j0549
1037b287n48J1478K681j0201p75J0270M631j0929k156J0282M081r459l638J0188
1051A3618M998r894m851R047P320q902o084R004O746p645q135P381Q202p104r465
1066D236P438R669o808r757O639R126n211j1015L915R240l480r475J419R119k760
$$ plain form
1081 12295 1911 2727 12734 10904 -349 -326 9332 9811 -1771 -2395 6452 7917 -3363 -5956 3093
1096 3093 5642 -4381 -8775 871 3078 -5778 -12289 -2989 1142 -8426 -14149 -6350 -1200 -10576 -17066
1111 -17066 -9953 -2880 -9701 -18612 -11634 -4177 -9985 -19372 -14134 -5237 -10233 -20822 -15391 -6747
1125 -6747 -9988 -19640 -15386 -5714 -9127 -19580 -16642 -6081 -7997 -17455 -15695 -5151 -5985 -15941
1139 -15941 -15029 -5509 -2920 -12592 -14234 -3174 -1015 -10760 -12787 -1918 1458 -7970 -10620 -589
1153 -589 3147 -4055 -8053 901 6152 -510 -6063 1567 9228 2882 -4216 4816 11582 5919 -710
1168 -710 5647 13024 8252 1414 7006 15220 11587 2302 7968 16039 13582 4022 8252 17768 14769
1183 14769 6777 8584 18401 15808 6733 7971 17184 16965 6858 6857 17137 17546 7110 5963 15722
$$ packed form
1081A2295j0384Q16J0007j830j1253K3R658M79j1582o24Q847J465j1280k593R049
1096C093K549j0023m394R646K207q856o511R300M131r568n723P799N150r376o490
1111a7066P113P073o821q911O978P457n808r387N238Q897m996j0589N431Q644
1125f747l241r652M254R672l413j0453K938J0561j916r458J760J0544q34r956
1139a5941R12R520K589r672j642J1060K159r745k027J0869L376r428k650J0031
1153e89L736p202l998Q954N251o662n553P630P661o346p098R032O766n663o629
1168g10O357P377m772o838N592Q214l633r285N666Q071k457r560M230R516k999
1183A4769p992J807R817k593r075J238R213k19j0107jJ0280M09j0436j147R759
$$ plain form
1198 15722 17144 6920 5178 13736 16000 6650 2689 11521 14700 5208 1098 8988 13237 4093
1212 4093 -1586 5660 11222 2995 -4794 2182 7894 438 -6967 -1756 6118 -597 -9035 -4059 2593
1227 2593 -2137 -10559 -7042 356 -3106 -12433 -9794 -1092 -4243 -13473 -12090 -4024 -4700 -15036 -14490
1242 -14490 -5823 -6811 -15824 -15650 -7515 -5227 -15500 -17837 -7545 -6124 -15201 -17863 -9232 -5356 -14427
1257 -14427 -16632 -8981 -5145 -12474 -16955 -7799 -3855 -11389 -16959 -7429 -1980 -7923 -15036 -7259 -119
1272 -119 -5703 -12311 -6158 2625 -3172 -10229 -5766 3566 106 -7686 -4211 5181 3491 -5108 -1964
1287 -1964 8296 5730 -2040 607 9342 8776 10 623 9595 11118 2782 2419 12486 12490 5400 4171
1303 4171 13634 15208 7348 4535 13579 16457 8424 5309 14681 17554 8862 4697 12933 18133 10385
$$ packed form
1198A5722J422j0224j742Q558K264r350l961Q832L179r492m110P890M249r144
1212D093n679P246N562q227p789O976N712p456p405N211P874o715q438M976O652
1227B593m730q422L517P398l462r327K639Q702l151r230J383Q066o76j0336N46
1242a4490Q667r88r013J74Q135K288j0273k337J0292J421r077k662Q631L876r071
1257a4427k205P651L836p329m481R156L944p534n570R530N449n943p113P777P140
1272a19n584o608O153Q783n797p057M463R332l460p792L475R392j690q599L144
1287a964J0260k566p770K647Q735n66q766O13Q972J523q336l63J0067Mp090j229
1303D171R463J574p860k813R044K878q033l115R372K873q692m165Q236N200p748
$$ plain form
1318 10385 3887 10808 17794 10175 3388 9699 15933 9383 4067 8220 15057 10441 1814 5968 13082
1333 13082 8193 946 3354 11086 8543 -948 2117 9056 6594 -2859 -1961 6342 4982 -4820 -4515
1348 -4515 3699 2595 -6216 -7998 944 1436 -7164 -9558 -1685 -444 -8762 -12577 -3809 -2314 -10408
1363 -10408 -14295 -7098 -2678 -11096 -15187 -7958 -3840 -9960 -17711 -9832 -4187 -10090 -16342 -12255 -4770
1378 -4770 -9803 -16619 -11737 -5240 -8996 -16456 -11941 -4238 -8136 -14269 -11622 -3330 -5398 -13930 -11878
1393 -11878 -2520 -3842 -11638 -10680 -1143 -2298 -8966 -8687 179 498 -8204 -7263 1285 3033 -4477 -5712
1409 -5712 2282 6471 -2422 -3299 4587 8424 1778 -2080 5830 10827 3873 -1092 6789 12762 5311
1424 5311 1454 8059 12494 8033 2190 7999 15781 9801 3370 8812 15569 11264 4505 8503 15722
$$ packed form
1318A0385o498O921O986p619o787O311O234o550n316M153O837m616q627M154P114
1333A3082m889p247K408P732k543r491L065O939k462r453Q98Q303j360r802L05
1348d515Q214j104q811j782Q942M92q600k394P873J241q318l815Q768J495q094
1363a0408l887P197M420q418m091P229M118o120p751P879N645n903o252M087P485
1378d770n033o816M882O497l756p460M515P703l898o133K647Q292k068q532K052
1393a1878R358j322p796R58R537j155o668K79Q866L19q702R41Q548J748p510j235
1409e712P994M189q893q77P886L837o646l858P910M997o954m965P881N973p451
1424E311l857O605M435m461n843N809P782n980o431N442O757m305o759L998P219
$$ plain form
1439 15722 12422 5127 8376 15541 11383 5022 6832 15515 12698 3789 6832 14139 12627 4537 3531
1454 3531 12097 12595 3939 2702 10336 10441 2651 -428 7561 9307 2336 -1866 5573 8535 957
1469 957 -3210 2787 7089 -1931 -6129 -654 4233 -3118 -8368 -3479 1991 -2921 -9689 -5190 -252
1484 -252 -3856 -11533 -7674 -848 -5470 -12961 -9710 -3615 -7285 -13328 -10459 -3816 -5399 -14988 -11526
1499 -11526 -5483 -5666 -14043 -13329 -5785 -5284 -14662 -13342 -5960 -5192 -12618 -14246 -4868 -4763 -12033 -13727
1515 -13727 -6016 -3394 -8897 -12293 -5072 -928 -8299 -12650 -3848 -98 -6331 -9588 -2755 1388 -3956
1530 -3956 -7361 -2021 4508 -768 -5749 -508 7291 1585 -4488 1304 7689 4449 -1743 3219 10086
1545 10086 5736 -342 3216 10616 9369 2008 3475 11824 10574 3414 4376 11815 11493 4772 5039
$$ packed form
1439A5722l300p295L249P165m158o361J810Q683k817q909L043P307j512q090j006
1454C531Q566M98q656j237P634J05p790l079P989J746o971m202P439K962p578
1469I57m167N997M302r020m198N475M887p351n250M889N470m912o768M499M938
1484b52l604p677L859O826m622p491L251O095l670o043K869O643j583r589L462
1499a1526O043j83q377P14P544N01r378J320P382P68p426j628R378J05p270j694
1515a3727P711K622n503l396P221M144p371m351Q802L750o233l257O833M143n344
1530c956l405N340O529n276m981N241P799n706o073N792O385l240o192M962O867
1545A0086m350o078L558P400j247p361J467Q349j250p160R62P439l22o721K67
$$ plain form
1560 5039 11605 13818 5977 4139 12907 14698 6340 4890 11641 13806 7739 3650 11621 13263 6811
1575 6811 3593 9976 12875 7555 1385 8708 12306 5769 1629 7396 11221 5560 553 3346 8341
1590 8341 3789 -2246 1637 8370 4061 -3480 -1030 5978 2117 -5219 -3096 2783 815 -7309 -5395
1605 -5395 2202 1011 -7407 -8061 -1615 -1849 -8908 -9975 -3811 -1873 -10566 -11561 -4949 -2539 -11352 -12826
1621 -12826 -6833 -4654 -11255 -13195 -8172 -4570 -11291 -13858 -7560 -4531 -9727 -14324 -8196 -4842 -8895
1636 -8895 -13803 -8215 -2800 -7371 -13564 -8051 -1736 -6475 -12338 -8609 -1570 -4679 -10394 -7076 264
1651 264 -1923 -8823 -6073 1423 -718 -5935 -5156 3549 3533 -4492 -3842 4136 4421 -1969 -2030 4443 6333
1668 6333 783 -513 6198 9048 2898 459 7139 10368 5280 1468 8965 11822 4955 3305 9014
$$ packed form
1560E039O566K213p841j838Q768J791q358j450O751K165o067m089P971J642o452
1575F811l218O383K899n320o170P323L598o537m140N767L825n661n007K793M995
1590H341m552o035L883O733m309p541K450P008l861p336K123N879j968q124J914
1605e395P597j191q418o54O446k34p059j067O164J938q693r95O612K410q813j474
1621a2826N993K179o601j940N023L602o721k567O298L029n196m597O128L354m053
1636h895m908N588N415m571o193N513O315m739n863L729P039l109n715L318P340
1651B64k187o900K750P496k141n217P79Q705j6q025O50P978K85o390o1O473J890
1668F333n550j296O711K850o150k439O680L229n088l812P497K857o867j650N709
$$ plain form
1683 9014 13227 7167 4133 8533 14219 9331 3993 9438 14068 9116 3789 8143 13954 9084 3722
1698 3722 6828 12956 9138 3561 6306 12752 9738 2504 4338 10399 9699 1963 2529 8684 9367 1729
1714 1729 -411 6835 6965 226 -1117 5505 5375 -1463 -2348 2413 4039 -2476 -4736 1058 2944 -4274
1730 -4274 -7189 -1837 1801 -4615 -8704 -3907 -29 -6038 -10397 -5821 -594 -6380 -11882 -6574 -2363
1745 -2363 -6359 -12676 -8097 -3658 -7272 -13169 -10428 -3633 -6977 -13904 -11016 -3982 -6312 -12352 -9493
1760 -9493 -4541 -5000 -11777 -10746 -4353 -3919 -11584 -10324 -3129 -3443 -9685 -10025 -2536 -943 -8198 -7926
1776 -7926 -829 -404 -5967 -7706 -974 2041 -4233 -6026 1039 3505 -1921 -5011 2231 5791 696
1791 696 -3245 3281 7757 3079 -1979 2407 7877 5263 245 4129 9962 8090 1976 5324 10498
$$ packed form
1683I014M213o060l034M400N686m888n338N445M630m952n327M354N811m870n362
1698C722L106O128l818n577K745O446l014p234J834O061p00p736N66O155O83p638
1714A729k140P246J30o739j343O622j30o838q85M761J626o515k260N794J886p218
1730d274k915N352L638o416m089M797L878o009m359M576N227n786n502N308M211
1745b363l996o317M579M439l614n897K741O795l344o927K888P034k330o040K859
1760i493M952m59o777J031O393M34p665J260P195l14o242l40P489J593p255K72
1776g926P097M25n563j739O732L015o274j793P065K466n426l090P242L560n095
1791F96l941O526M476m678n058M386N470k614n018L884N833j872o114L348N174
$$ plain form
1806 10498 8919 3112 4722 11918 9864 3329 5746 11939 10383 4771 6177 11364 11196 4649 4601
1821 4601 11083 11255 4820 4310 10830 11131 4669 2823 8846 11754 3835 1342 7357 11255 3908 381
1837 381 6819 9313 3667 -1250 5055 7749 2290 -2477 1408 6765 2749 -3114 -277 3389 -70
1852 -70 -5371 -3453 3492 -1080 -7073 -3712 845 -2870 -8053 -7383 -876 -3911 -9412 -7459 -1813 -3379
1868 -3379 -9698 -9437 -3625 -5003 -10040 -11739 -4800 -3587 -10372 -12273 -5429 -4041 -10203 -11682 -5259
1883 -5259 -4422 -9874 -13354 -6025 -3217 -8617 -11499 -6609 -2960 -7148 -11243 -4660 -2026 -5957 -10615
1898 -10615 -5700 -966 -4408 -9463 -4927 1474 -1615 -7955 -3147 2271 -1541 -5744 -2460 3278 512
1913 512 -3945 -1872 4796 3944 -1982 -496 5213 5261 552 514 6785 7623 876 796 7670 8803 3326
$$ packed form
1806A0498j579n807J610P196k054o535K417O193j556n612J406N187j68o547m8
1821D601O482J72o435n10O520L01o462j846O023K908p919k493O015L898p347l527
1837C81O438K494n646m917O305K694n459m767L885N357m016n863K837L666l459
1852g0n301J918O945m572n993L361M557l715n183O70O507l035n501J953N646j566
1868c379o319K61N812j378n037j699O939J213o785j901O844J388o162j479O423
1883e259Q37n452l480P329K808n400k882M890L649m188m095O583K634l931m658
1898a0615M915M734l442n055M536O401l089o340M808N418l812m203L284N738k766
1913E12m457K073O668q52n926J486N709M8m709l8O271Q38o747q0O874J133n477
$$ plain form
1930 3326 2132 8189 9841 5356 4073 9126 11074 5556 3341 9936 11464 6155 3633 8319 12031
1945 12031 7916 3071 7504 12583 8475 3713 7696 11761 6539 2434 6521 10701 7558 1895 5161
1960 5161 8890 6492 994 3710 8245 6089 -273 2363 7425 5508 -1459 -1025 4857 3637 -3256
1975 -3256 -2038 2029 2792 -4452 -3720 1010 836 -5129 -6785 -1677 542 -6544 -7344 -2368 -768 -6176
1991 -6176 -9579 -3982 -1926 -7601 -10455 -4820 -2468 -6756 -11668 -6248 -2338 -8022 -12800 -7787 -2835
2006 -2835 -7802 -12994 -8912 -2747 -5970 -11792 -8597 -2704 -4925 -10685 -8959 -2314 -5609 -10053 -8407
2021 -8407 -1814 -3462 -8769 -7384 -1486 -1410 -7138 -7201 -419 -766 -6210 -5645 400 2133 -3536 -3052 2226
2038 2226 3673 -1946 -2882 2188 4772 155 -2785 2825 7067 2003 -718 4487 7782 3960 1314
$$ packed form
1930C326j194O057J652m485j283N053J948n518k215O595J528n309k522M686L712
1945A2031m115m845M433N079m108m762L983M065n222m105M087M180l143n663L266
1960E161L729k398n498K716M535k156o362K636N062j917o967M34N882j220o893
1975c256J218M067P63p244P32M730j74n965j656N108K219p086q00M976J600n408
1991f176l403N597K056n675k854N635K352m288m912N420L910n684m778N013M952
2006b835m967n192M082O165l223n822L195N893k221n760J726O645l295m444J646
2021h407O593j648n307J385N898P6n728o3O782l47n444N65O045J733n669M84N278
2038B226J447n619r36N070K584m617k940N610M242n064k721N205L295l822k646
$$ plain form
2053 1314 3533 8743 5579 1909 6094 10227 6909 2499 5696 10952 7810 3174 6504 10494 8698
2068 8698 4576 6392 10357 9194 3577 4733 10295 9633 3187 4328 10027 8325 3842 4280 9262
2083 9262 8384 2493 1902 7958 8180 1555 36 6556 6651 2009 -303 3489 5880 581 -1699 3236
2099 3236 5469 -242 -3230 537 3866 -417 -4913 -1260 1688 -1879 -6984 -3438 795 -2788 -7308
2114 -7308 -5120 -1504 -4763 -8926 -6055 -1126 -4478 -9975 -7904 -1755 -5100 -9930 -9086 -3667 -4287
2129 -4287 -10152 -9245 -3721 -4291 -10016 -11276 -3866 -4898 -9725 -10899 -4776 -2981 -7848 -9099 -4241
2144 -4241 -2593 -7450 -8051 -4374 -2153 -6891 -7339 -3008 83 -4281 -7524 -3382 -344 -2639 -5475
2159 -5475 -2573 2740 -1707 -5468 -1702 2889 447 -1728 -686 4483 2506 -2160 652 5750 3586
$$ packed form
2053A314K219N210l164l670M185M133l318m410L197N256l142m636L330L990j796
2068H698m122J816L965j163n617J156N562o62o446J141N699j702m483M38M982
2083I262q78n891n91O056K22o625j519O520R5m642k312L792K391n299k280M935
2099C236K233n711k988L767L329m283m496L653K948l567n105L546M233l583m520
2114g308K188L616l259m163K871M929l352n497K071O149l345m830Q44N419o20
2129d287n865R07N524n70n725j260P410j032m827j174O123J795m867j251M858
2144d241J648m857o01L677K221m738m48M331L091m364l243M142L038k295k836
2159e475K902N313m447l761L766M591k442k175J042N169j977m666K812N098k164
$$ plain form
2174 3586 -1588 1558 6908 6380 1256 2198 7026 8015 1867 3205 7534 8742 3230 2632 9425 9630
2190 9630 4211 3019 8656 10017 4621 3261 8428 9845 4931 2916 8206 9953 6042 3124 7061
2205 7061 9922 6027 1178 6357 8764 4501 1072 5516 7609 4930 288 3568 7127 3113 -1119
2220 -1119 2419 6210 3388 -1810 -831 3830 1619 -3453 -846 3393 -129 -4495 -3815 2090 43
2235 43 -4998 -5638 -291 -563 -5465 -6444 -2524 -965 -7615 -6936 -2846 -1996 -7831 -8270 -3699 -2796 -6957
2252 -6957 -10096 -4693 -2461 -7170 -9812 -5595 -3254 -8218 -9982 -6120 -2861 -7298 -9491 -6796 -2205
2267 -2205 -4904 -9923 -5761 -2329 -5642 -9131 -6244 -2378 -3773 -8222 -5396 153 -1721 -7330 -5247
2282 -5247 1063 -342 -5957 -3629 1310 1195 -4541 -3618 1270 2786 -1673 -1907 4517 4891 -138 -2149
$$ packed form
2174C586n174L146N350n28n124R42M828R89o148J338M329J208n512n98O793K05
2190I630n419j192N637J361n396j360N167J417m914k015N290J747l911k918L937
2205G061K861l895m849N179K407m263l429M444K093k679m642L280L559m014m232
2220a119L538L791k822n198R79M661k211n072K607M239l522m366O80N905k047
2235D3n041o40N347k72m902r79L920J559o650O79M090Q50n835m39M571R03m161
2252f957l139N403K232m709k642M217K341m964j764L862L259m437k193K695M591
2267b205k699n019M162L432l313l489K887L866j395m449K826N549j874n609K083
2282e247O310j405n615K328M939j15n736R23M888J516m459k34O424L74n029k011
$$ plain form
2298 -2149 4699 6445 849 1539 4213 6333 3465 1693 5463 7704 3562 1763 5392 8734 4990
2313 4990 2552 6601 9734 5466 3870 6322 9584 6989 3144 6302 10022 7633 2164 5877 9739
2328 9739 6887 1902 3828 9028 7362 1882 3162 8381 5838 2181 2684 7129 7212 557 1972 6207
2344 6207 5402 411 -525 4264 3493 -248 -1533 3368 3700 -2769 -3977 1187 2808 -2140 -4401 -179
2360 -179 2107 -3192 -5849 -841 376 -4241 -6884 -4324 -369 -4149 -7774 -4852 -718 -4141 -8999
2375 -8999 -6119 -1722 -4706 -9581 -8533 -2864 -4186 -9321 -7340 -3418 -4804 -9335 -7132 -3445 -5018
2390 -5018 -8368 -8139 -3692 -3115 -9169 -8413 -3482 -3187 -6345 -8060 -2822 -2258 -6948 -6923 -2105 329 -4684
2407 -4684 -6210 -1235 1396 -3617 -5945 -636 2136 -2950 -4459 166 3687 -349 -2491 6 5301
$$ packed form
2298b149O848J746n596O90K674K120k868j772L770K241m142j799L629L342l744
2313D990k438M049L133m268j596K452L262k595l845L158L720k389n469L713L862
2328I739k852m985J926N200j666n480J280N219k543l657N03M445Q3o655J415M235
2344F207q05m991r36M789p71l741j285M901L32o469j208N164J621m948k261M222
2360a79K286n299k657N008J217m617k643K560L955l780l625K922M134l423m858
2375h999K880M397k984m875J048N669j322n135J981L922j386m531K203L687j573
2390e018l350K29M447N77o054P56M931K95l158j715N238N64m690K5M818K434n013
2407d684j526M975K631n013k328N309K772n086j509M625L521m036k142K497N295
$$ plain form
2422 5301 2204 -2021 917 4949 3213 -739 2553 5568 4977 643 3514 7495 5710 1045 3047
2437 3047 7711 7027 2050 4286 8688 7516 3414 4651 8900 8815 4135 3820 8300 8836 3729 2774
2453 2774 8289 6285 4611 2479 6687 8860 4652 2817 6611 7335 3132 1008 4712 6079 2966
2468 2966 -249 2670 6050 2820 -626 1857 5678 1269 -2253 121 4311 670 -2909 -625 1832
2483 1832 703 -4442 -2437 1677 -1119 -4798 -4145 -28 -1688 -6534 -5884 -2669 -2267 -6800 -6746 -2055
2499 -2055 -2514 -6482 -8537 -2019 -2997 -6980 -8568 -3022 -2210 -8238 -9246 -4031 -3353 -6889 -8596 -4637
2515 -4637 -2807 -6058 -8833 -3605 -3063 -6957 -8319 -5689 -2463 -4868 -7001 -5227 -228 -3694 -7416
2530 -7416 -2878 -306 -3029 -6111 -3281 -308 -1832 -4311 -2966 1983 1229 -3490 -2307 3311 1614
$$ packed form
2422E301l097m225K938M032j736l952L292L015n91m334K871L981j785m665K002
2437C047M664o84m977K236M402j172m102J237M249q5m680l15M480N36n107r55
2453B774N515k004j674k132M208K173m208j835L794P24m203k124L704J367l113
2468B966l215K919L380l230l446K483L821m409l522K374M190l641l579K284K457
2483A832j129n145K005M114k796l679O53M117j660m846O50L215M02m533N4M691
2499b055m59l968k055O518r78l983j588N546Q12o028j008N215O78l536j707L959
2515d637J830l251k775N228N42l894j362K630L226k405k133J774M999l466l722
2530g416M538K572k723l082K830K973j524k479J345M949p54m719J183N618j697
$$ plain form
2545 1614 -1675 -936 3860 3319 -283 644 5210 3957 425 1485 5224 5436 1521 953 5378 8296
2561 8296 2914 1333 6981 7684 2671 2782 6270 8490 4020 2593 5475 7987 5332 2691 5998
2576 5998 9096 5830 2638 4621 8542 5382 2923 4551 8145 5218 1854 4017 8431 4524 942
2591 942 2856 7155 3870 71 2115 5280 4000 -361 855 3957 3255 -1618 -560 2885 2095 -2320
2607 -2320 -3421 2217 1061 -2735 -4325 -635 268 -3167 -4901 -2306 137 -4212 -7187 -1872 -1094
2622 -1094 -4125 -7232 -3604 -2062 -5267 -7461 -5446 -1725 -5220 -8269 -5109 -1879 -5205 -8837 -6261
2637 -6261 -2146 -4811 -8914 -5911 -1702 -4622 -7841 -6967 -2735 -3069 -7246 -5335 -1438 -3095 -6380
2652 -6380 -5579 -868 -2171 -5904 -5580 -1181 -1683 -4709 -4295 -64 259 -3662 -4008 612 2331 -1781
$$ packed form
2545A614l289P39M796n41l602R27M566j253l532J060L739K12l915n68M425K918
2561H296n382j581N648P03n013J11L488K220m470j427K882K512k655k641L307
2576E998L098l266l192J983L921l160k459J628L594k927l364K163M414l907l582
2591I42J914M299l285l799K044L165j280m361J216L102p02m873J058L445p90m415
2607b320j101N638j156l796j590L690R03l435j734K595K443m349k975N315P78
2622a094l031l107L628J542l205k194K015L721l495l049L160L230l326l632K576
2637f261M115k665m103L003M209k920l219Q74M232l34m177J911L897j657l285
2652f380Q01M711j303l733L24M399n02l026M14M231L23l921l46M620J719m112
$$ plain form
2668 -1781 -3141 1754 2394 -742 -1997 2474 4855 1006 -1552 2257 5922 1174 -602 3380 5974
2683 5974 3577 411 3800 7343 4363 903 4863 8180 5458 1796 3926 8178 6365 2547 4540
2698 4540 7566 6544 2674 4219 7743 7015 2633 3532 7187 6381 2395 2674 7172 7199 2182 2508 5591
2715 5591 6783 2486 -73 4526 5206 1597 -364 3748 5042 280 -17 3127 4481 -298 -1623
2730 -1623 1265 2561 -845 -2983 -811 2978 -709 -4678 -738 1131 -2655 -4625 -3313 -368 -2184
2745 -2184 -6288 -4299 -371 -1126 -7165 -6016 -1461 -2256 -6851 -6448 -3669 -3109 -6753 -6705 -3054 -3703 -8240
2762 -8240 -8024 -3538 -2860 -7011 -7731 -3854 -2150 -6697 -7340 -3623 -2667 -5958 -7460 -3061 -1252 -4930
2778 -4930 -7000 -2738 416 -3128 -5773 -2200 199 -2275 -6102 -1735 736 -678 -4639 -628 3080
$$ packed form
2668a781j360M895O40l136j255M471K381l849k558L809L665m748j776L982K594
2683E974k397l166L389L543k980l460L960L317k722l662K130M252j813l818J993
2698D540L026j022l870J545L524p28m382Q99L655q06l986K79M498K7n017L26L083
2715E591J192m297k559M599O80l609j961M112J294m762k97L144J354m779j325
2730a623K888J296l406k138K172L789l687l969L940J869l786j970J312K945j816
2745b184m104J989L928p55o039J149M555p95m595M03K779N60l644M8L651o49m537
2762h240K16M486O78m151p20L877J704m547o43L717R56l291j502M399J809l678
2778d930k070M262L154l544k645L573K399k474l827M367K471j414l961M011L708
$$ plain form
2793 3080 793 -3044 -1093 2794 1345 -2099 288 4584 2957 -718 1384 4889 3957 -641 838
2808 838 6072 5600 1827 1808 4989 4868 2401 1946 6628 7152 3562 2193 5533 7363 2977 2725 6196
2825 6196 8222 3208 2551 5709 8464 4496 2732 5621 7189 4383 1989 4706 7476 4279 1229
2840 1229 3797 7127 3675 970 2822 5424 2696 150 1735 3952 2536 -1302 1228 3289 2096
2855 2096 -1825 -748 3268 784 -3053 -2079 2553 -224 -3307 -3379 -126 617 -5261 -4466 -62 -606
2871 -606 -3912 -5069 -2290 261 -4485 -6426 -2707 -2804 -5875 -6823 -2962 -1727 -5217 -6956 -4009 -1831
2887 -1831 -5164 -8009 -4589 -1878 -5299 -7159 -4689 -1994 -4328 -6941 -6317 -1123 -4065 -6818 -4473
2902 -4473 -2099 -2906 -6015 -4779 -1350 -2304 -5247 -3890 -209 93 -3886 -3031 -720 -50 -3407 -2176
$$ packed form
2793C080k287l837J951L887j449l444K387M296j627l675K102L505r32m598J479
2808H38N234m72l773j9L181j21k467m55M682N24l590j369L340J830m386k52L471
2825F196K026n014o57L158K755l968j764K889J568k806k394K717K770l197l050
2840A229K568L330l452k705J852K602k728k546J585K217j416l838K530K061j193
2855B096l921J077M016k484l837R74M632k777l083p2L253P43n878P95M404n44
2871f06l306j157K779K551m746j941L719r7l071r48L861J235l490j739K947K178
2887a831l333k845L420K711l421j860K470K695k334k613O24N194k942k753K345
2902d473K374q07l109J236L429r54k943J357L681L02l979Q55K311O70l357J231
$$ plain form
2918 -2176 932 1935 -1659 -2804 1596 2455 -1082 -1715 1397 4045 418 -720 3150 5432 1828
2933 1828 448 4374 5707 3145 367 4055 5409 2979 2156 4416 6857 3667 1932 5183 7517
2948 7517 3890 1522 5043 7601 4802 1635 4520 7816 6628 2099 2616 6805 6360 2533 2987 6438
2964 6438 4866 2505 2730 5345 4988 1638 891 5134 4070 170 -270 3843 3983 438 -158 2529
2980 2529 3192 -1031 -1446 1259 2029 -1075 -2606 -140 1237 -1973 -4164 -1860 167 -2646 -4854 -2822
2996 -2822 -833 -3331 -4458 -2750 -955 -2831 -6906 -4124 -622 -3371 -7034 -5495 -2012 -3257 -6019
3011 -6019 -5504 -2121 -4088 -6890 -6169 -2249 -3246 -6525 -6520 -2810 -2904 -5425 -6953 -2030 -1971 -5195 -5541 -2980
3029 -2980 -1954 -4809 -5707 -1374 -1206 -3503 -4720 -775 478 -2815 -2857 -1581 1543 -1929 -2571 -760
$$ packed form
2918b176L108J003l594j145M400Q59l537o33L112K648l627j138L870K282l604
2933A828j380L926J333k562k778L688J354k430q23K260K441l190j735L251K334
2948G517l627k368L521K558k799l167K885L296j188m529N17M189m45l827M54L451
2964F438j572k361K25K615l57l350p47M243j064l900m40M113J40l545n96K687
2980B529O63m223m15K705P70l104j531K466J377l210k191K304K027k813k208K032
2996b822J989k498j127J708J795j876m075K782L502k749l663J539L483j245k762
3011f019N15L383j967k802P21L920r97l279NL710r4k521j528M923N9l224l46K561
3029b980J026k855q98M333J68k297j217L945J253l293m2J276L124l472o42J811
$$ plain form
3045 -760 1929 -161 -2807 59 2585 270 -2209 1028 3189 2329 -388 2460 3943 3327 -164 1544
3061 1544 5271 4051 338 1378 4883 4434 1486 3615 5587 5603 2834 2531 6453 5974 3068 2545
3077 2545 4944 6379 2694 2423 4689 5692 2889 2396 5641 6887 3639 724 4747 5744 2752 422
3093 422 4062 5115 1971 286 2104 4356 2195 188 1834 4048 1486 -739 922 3732 1117
3108 1117 -2516 -260 2841 543 -3145 -1698 1154 -419 -3717 -3173 218 -995 -3849 -2706 -522
3123 -522 -1278 -6766 -4427 -879 -2078 -3963 -5743 -1958 -2025 -6017 -6607 -2496 -1398 -4659 -6249 -2084
3139 -2084 -2258 -5515 -7167 -3777 -1497 -4280 -7819 -4157 -1516 -4390 -6244 -3933 -924 -4748 -5231
3154 -5231 -3460 -845 -2981 -5886 -3808 -18 -1577 -4318 -2553 -408 -1330 -3219 -2995 1148 73
$$ packed form
3045g60K689k090k646K866K526k315k479L237K161q60k717K848J483o16l491J708
3061A544L727j220l713J040L505m49k948K129J972J6k769l03L922m79k906n23
3077B545K399J435l685k71K266J003k803m93L245J246l248k915M023R97k992k330
3093D22L640J053l144j685J818K252k161k007J646K214k562k225J661K810k615
3108A117l633K256L101k298l688J447K852j573l298N44L391j213k854J143K184
3123e22p56n488K339L548j199j885j780L785o7l992n90M111J098l261j590M165
3139b084j74l257j652L390K280k783l539L662K641k874j854K311L009l824m83
3154e231J771K615k136k905K078L790j559k741J765K145r22j889K24M143j075
$$ plain form
3169 73 -2521 -1767 2234 491 -1675 -1419 1952 2291 -973 -255 2820 2811 -235 147 3940 5529 1538
3186 1538 425 3547 4751 1614 602 3817 5123 3371 608 4743 5682 3458 2262 4422 7076
3201 7076 3204 1674 4602 6762 4269 2318 3716 5837 3894 1729 3197 6388 4428 1692 3411
3216 3411 6078 4410 1699 3026 4751 3273 788 1461 5699 3652 -284 133 3250 3138 -512 -638
3232 -638 2059 2466 -1303 -1650 1152 2516 -1735 -2203 -296 503 -2362 -3579 -2273 9 -2728 -4949
3248 -4949 -2205 -343 -2863 -4790 -2747 -1706 -1694 -4850 -2624 -1309 -3567 -5640 -4387 -2703 -4167
3263 -4167 -5227 -4719 -2144 -3245 -4913 -4510 -2382 -3438 -6208 -5137 -1775 -2819 -4882 -4094 -1359 -2623
3279 -2623 -6123 -4735 -1513 -1927 -3694 -5317 -835 -887 -4089 -4436 101 -36 -2771 -3303 -445 926
$$ packed form
3169G3k594P54M001j743k166K56L371L39l264P18L075rl046L82L793J589l991
3186A538j113L122J204l137j012L215J306j752k763M135R39k224j196K160K654
3201G076l872j530K928K160k493j951J398K121j943k165J468L191j960k736J719
3216C411K667j668k711J327J725j478k485O73M238k047l936M17L117j12l650j26
3232f38K697M07l769l47K802J364m251m68J907P99k865j217J306K282k737k221
3248d949K744J862k520j927K043J041J2l156K226J315k258k073J253J684j464
3263d167j060N08K575j101j668M03K128j056k770J071L362j044k063P88K735j264
3279b623l500J388L222m14j767j623M482n2l202l47M537j37k735n32K858J371
$$ plain form
3295 926 -932 -2217 577 1464 -837 -883 1082 2435 868 -568 782 2866 1440 -675 1666 5658
3311 5658 2260 392 1235 3198 2094 1555 1641 5802 3639 1393 2939 5673 4173 1828 2215 5188
3327 5188 5041 2269 3004 5412 5065 2154 2667 5851 4998 2588 2006 5606 5656 1460 1108 5265 4850
3344 4850 1458 1370 2799 4998 957 1063 2567 3278 1064 -710 2773 2817 876 -676 1499 2861
3360 2861 448 -2005 623 1350 870 -2534 -1329 1248 -1371 -3966 -2862 988 -1587 -4132 -3356 -522
3376 -522 -2350 -4286 -4086 -1190 -1239 -4877 -4010 -1450 -2147 -5250 -5181 -1917 -2625 -5420 -6382 -2795 -2666 -4794
3394 -4794 -4973 -1127 -2651 -4667 -6031 -1209 -1551 -5657 -5183 -3791 -1272 -3783 -4946 -3024 -942 -3913
3410 -3913 -4083 -1817 -239 -2676 -3179 -1081 1015 -1720 -3925 -1949 1669 -25 -2721 -1507 2040
$$ packed form
3295I26j858j285K794Q87k301m6J965J353j567j436J350K084j426k115K341L992
3311E658l398j868Q43J963j104n39Q6M161k163k246J546K734j500k345L87K973
3327E188j47k772P35K408l47k911N13L184q53k410n82L600N0m196l52M157m15
3344D850l392q8J429K199m041J06J504P11k214j774L483M4j941j552K175J362
3360B861k413k453K628P27m80l404J205K577k619k595J104L850k575k545P76K834
3376e22j828j936K00K896m9l638Q67K560o97l103O9L264p08k795r62L587J29k128
3394d794j79L846j524k016j364M822l42m106M74J392K519k511j163J922K082k971
3410c913j70K266J578k437n03K098K096k735k205J976L618j694k696J214L547
$$ plain form
3425 2040 981 -2177 -1230 2318 1381 -479 -398 2316 2382 -205 629 3621 3681 743 666 4191 3976 1597
3443 1597 1640 5487 5438 2646 2072 4165 5789 1995 1090 4795 5056 2636 1629 3890 5568 3853 2056
3460 2056 2986 6615 2832 2243 4581 5707 2226 85 2600 5579 3571 358 2225 3783 2581
3475 2581 699 1119 4241 2915 -129 989 2711 1799 -467 -1 3044 1647 -2261 -990 2292 1496
3491 1496 -2585 -2319 -142 -337 -1830 -2428 -938 -365 -3111 -4675 -1302 -1364 -3972 -4618 -553 -834 -4341
3508 -4341 -4664 -2757 -1502 -4590 -4541 -3398 -1536 -3364 -6408 -3087 -986 -5118 -5657 -3069 -1881 -2886
3524 -2886 -5212 -3316 -1697 -3715 -5843 -4788 -976 -2428 -4040 -4292 -477 -2884 -4722 -3179 -1567
3539 -1567 -752 -3219 -3365 371 -724 -2081 -2242 -148 843 -2028 -1962 701 1756 -1074 -1088 791 1866
$$ packed form
3425B040j059l158R47L548r37j860Q1K714O6k587Q34K992O0k938p7L525k15k379
3443A597M3L847m9k792n74K093J624l794r05L705K61k420j007K261J678j715j797
3460B056R30L629l783n89K338J126l481k141K515K979k008l213J867J558j202
3475B581j882M20L122j326l044J118J722r12k266M66L045j397l908J271L282p96
3491A496m081K66K177j95j493n98J490N73k746j564L373o2k608o46M065k81l507
3508d341l23J907J255l088M9J143J862j828l044L321K101m132n39K588J188j005
3524b886k326J896J619k018k128J055L812j452j612k52L815k407j838J543J612
3539a567Q15k467j46L736j095j357j61K094R91k871O6K663J055k830j4J879J075
$$ plain form
3556 1866 65 -102 2594 2420 429 458 2652 3028 1917 898 2984 4029 2441 -63 4003 4426
3572 4426 2843 303 2588 5206 3538 1504 3298 5878 3211 1479 2741 4815 3488 1687 2659
3587 2659 4855 4418 998 1688 4603 3687 1657 1338 4382 4634 1254 1468 3878 4128 1844 482 4060
3604 4060 3272 140 366 2015 3033 505 -1946 1770 2828 -496 -1947 18 1004 -1165 -2539 -988
3620 -988 562 -1620 -2861 -1255 -121 -2239 -3925 -3215 -785 -1561 -4787 -3245 -472 -2720 -3694 -2955
3636 -2955 -1422 -1939 -5152 -3961 -1838 -3310 -4919 -4251 -1338 -2078 -4578 -3957 -1406 -1874 -4130 -4301
3652 -4301 -1886 -1504 -3639 -4756 -1654 -507 -4281 -4515 -870 -779 -3079 -4053 -1255 -319 -2467 -3202 -1863
3669 -1863 739 -1692 -3080 -428 520 -222 -2099 -37 1684 -660 -1339 85 2012 588 -1903 -71
$$ packed form
3556A866j801j67K696j74j991K9K194L76j111j019K086J045j588k504M066M23
3572D426j583k540K285K618j668k034J794K580k667j732J262K074j327j801R72
3587B659K196m37l420O90K915r16k030l19L044K52l380K14K410K50k284j362L578
3604D060p88l132K26J649J018k528k451L716J058l324j451J965R86k169j374J551
3620i88J550k182j241J606J134k118j686P10K430p76l226J542K773k248r74P39
3636b955J533n17l213J191K123j472j609O68K913p40k500O21K551m68k256j71
3652d301K415L82k135j117L102J147l774k34L645R1k300r74K798R36k148p35J339
3669a863K602k431j388K652R48p42j877K062J721k344o79J424J927j424k491J832
$$ plain form
3685 -71 3069 1335 -1057 2327 3318 2717 -219 2834 2289 2617 1364 1801 3816 3520 1935 1640 4948
3702 4948 4295 1998 1522 5160 4508 1857 1853 4124 4132 2554 757 4532 4437 1649 1763 3846 4839 2399
3720 2399 998 2640 5000 2167 167 2581 3644 2129 -462 687 3916 610 -1819 1626 1432
3735 1432 1463 -522 491 1641 1136 -2182 -993 1524 -263 -2161 -2536 576 -186 -3118 -2620 -738
3751 -738 -500 -1940 -2202 -533 -1094 -3484 -3445 -1441 -816 -3219 -4769 -2601 -1564 -4203 -4597 -2386 -1266
3768 -1266 -3425 -5014 -2732 -1519 -4295 -5811 -1683 -1424 -3595 -4678 -2808 -1364 -3438 -4911 -3410
3783 -3410 -1475 -2128 -4564 -2677 -814 -1689 -2903 -1871 -306 -983 -3193 -1089 409 -593 -2705 -1546
3799 -1546 1146 287 -1595 -433 1269 2283 -193 -1210 2171 1050 -678 -179 2097 3508 548
$$ packed form
3685g1L140j734k392L384R91o01k936L053n45L28j253M37K015k96j585k95L308
3702D948o53k297m76L638o52k651mK271Qj578j797L775r5k788J14K083R93k440
3720B399j401J642K360k833k000K414J063j515k591J149L229l306k429L445j94
3735A432L1j985J013J150n05l318J189K517j787j898l75L112p62k932M98J882
3751g38K38j440k62J669n61k390L9K004O25k403j550K168J037k639l94K211J120
3768a266k159j589K282J213k776j516M128K59k171j083J870J444k074j473J501
3783c410J935o53k436J887J863q75j214J032J565o77k210K104J498j002k112J159
3799a546K692q59j882J162J702J014k476j017L381j121j728M99K276J411k960
$$ plain form
3814 548 -118 2942 3384 930 140 2560 3346 1574 327 2921 3734 1299 1273 3448 5090 3334 1591
3831 1591 2630 3367 2801 1047 3013 4612 2940 964 2737 5117 2752 1801 2782 4530 3431 1221
3847 1221 799 3292 3061 706 1276 3205 3015 129 20 1853 2556 410 34 994 1675 -1230 -761
3864 -761 1270 930 -812 -2040 579 516 -1157 -2638 272 520 -833 -3430 -1577 1016 -2393 -4098
3880 -4098 -1115 -1159 -1891 -3676 -1911 -610 -2103 -3886 -2901 -1121 -2707 -4059 -3143 -1183 -2282 -4120
3896 -4120 -3240 -1157 -3127 -4647 -4452 -1741 -1497 -4147 -4800 -1175 -1266 -4208 -4015 -914 -2187 -3816 -2962
3913 -2962 -774 -739 -3463 -2983 -1478 -380 -1742 -2808 -1782 911 -1336 -1989 66 353 -1004 -1595
3929 -1595 143 1574 498 -1277 674 2432 886 335 1340 1689 836 -412 1345 3144 2456 234
$$ packed form
3814E48o66L060M42k454p90K420P86j772j247K594Q13k435k6K175J642j756j743
3831A591J039P37n66j754J966J599j672j976J773K380k365r51R81J748j099k210
3847A221m22K493k31k355N70J929j90k886j09J833P03k146l76R60O81k905M69
3864g61K031l40j742j228K619o3j673j481K910K48j353k597J853K593l409j705
3880d098K983m4p32j785J765J301j493j783R85J780j586j352R16J960j099j838
3896d120Q80K083j970j520J95K711K44k650o53L625r1k942J93L101j273j629Q54
3913b962K188L5k724M80J505J098j362j066J026K693k247o53K055K87j357n91
3929a595J738J431j076j775J951J758j546n51J005L49q53j248J757J799o88k222
$$ plain form
3945 234 1488 3003 2972 810 1450 4052 3518 584 1992 3823 3839 1674 1769 3616 3725 2013 1122 4172
3963 4172 4771 1927 1747 2885 3679 2291 1978 4342 3330 1469 452 2701 3768 2219 1804 3008
3979 3008 3905 926 33 1706 2263 1204 -992 1472 1733 96 -1152 56 1276 1005 -709 -575
3995 -575 1125 -339 -1689 -1588 496 -825 -2996 -1238 -351 -1223 -3122 -2354 -532 -1642 -3827 -3060
4011 -3060 -957 -1959 -3912 -3003 -1299 -2033 -4173 -3520 -1249 -1086 -3574 -4469 -1363 -2080 -2828 -3806 -1556
4028 -1556 -2062 -2860 -3824 -2583 -1392 -2643 -3398 -1483 -1203 -2751 -3390 -3471 -458 -1259 -2736 -739 305
4045 305 -1571 -2682 -1144 1156 -787 -2612 -1459 81 954 -1685 -955 1347 1058 -1603 -466 2445
4061 2445 1744 269 84 1963 2921 -779 -6 3177 3091 1092 1015 2695 3797 625 946 2761 3626
$$ packed form
3945B34J254J515l1k162O40K602n34k934J408J831J6k165R5J847J09j712q91L050
3963D172N99k844j80J138P94j388l13K364j012j861j017K249J067j549m15J204
3979C008Q97k979q93J673N57j059k196K464K61j637j248J208J220k71j714J34
3995e75J700j464j350J01K084j321k171J758Q87q72j899P68J822j110k185P67
4011c060K103j002j953R09J704p34k140O53K271J63k488q95L106p17p48r78K250
4028a556n06p98r64J241J191j251p55J915K80j548o39q1L013q01j477J997J044
4045C05j876j111J538K300j943j825J153J540Q73k639P30K302k89k661J137K911
4061B445p01j475j85J879R58l700P73L183q6j999p7J680J102l172L21J815Q65
$$ plain form
4078 3626 2597 1152 3255 4673 3115 919 2736 4464 4070 1562 4082 3313 3100 1405 3105 4182
4094 4182 2364 1585 3694 4766 3054 -529 2555 3261 2044 1078 1223 3843 1793 841 845 2805 130
4111 130 -972 -469 2198 1451 -322 -955 469 1047 -530 -1895 367 1373 -2194 -2176 -510 -179 -2464
4128 -2464 -2166 -1116 -906 -3597 -3170 -1497 -44 -2466 -3560 -2339 -276 -3112 -3778 -1847 -1968 -3021
4144 -3021 -4189 -1653 -1603 -2298 -3601 -2327 -1621 -1885 -3778 -2652 25 -2608 -2718 -2220 -501 -1710 -2951
4161 -2951 -2344 -254 -1824 -3613 -2566 -1132 -1142 -2356 -2945 -692 123 -1414 -1506 89 196 -1730 -1948
4178 -1948 384 475 -1914 -658 1674 1562 -528 -821 1172 2673 590 54 1398 2749 1144 -33
4194 -33 2184 3230 2418 364 2811 3075 2577 1030 2005 3742 2840 783 2989 4023 3561 2332 3288
$$ packed form
4078C626j029j445K103J418j558k196J817J728l94k508K520p69k13j695J700J077
4094D182j818p79K109J072j712l583L084P06j217r66J45K620k050r52MJ960k675
4111A30j102N03K667p47j773o33J424N78j577j365K262J006l567J8J666L31k285
4128b464K98J050K10k691M27J673J453k422j094J221K063k836o66J931j21j053
4144c021j168K536N0o95j303J274P06k64j893J126K677k633j10M98J719j209j241
4161b951O07K090j570j789J047J434j0j214n89K253Q15j537r2J595J07j926k18
4178a948K332R1k389J256K332j12k090k93J993J501k083n36J344J351j605j177
4194c3K217J046q12k054K447K64m98j547R75J737r02k057K206J034m62j229R56
$$ plain form
4211 3288 3706 3194 1674 1579 2942 3135 974 1304 4162 4518 306 1482 4237 3598 928 1067 2690
4228 2690 2367 1702 416 2235 2849 -236 651 2627 1709 204 329 626 2445 -730 -1389 1136 1401
4245 1401 404 -1213 27 746 -771 -2412 104 285 -847 -3452 -1974 -11 -598 -2888 -2103 -959
4261 -959 -1734 -2889 -3026 -273 -1431 -3437 -1637 -414 -1734 -3927 -3600 -879 -2245 -3579 -3430 -1520
4277 -1520 -2218 -2695 -3003 -902 -1859 -4431 -3656 -1840 -1227 -2426 -2350 -603 452 -2937 -2904 -735 210 -1756
4295 -1756 -3541 -1126 -343 -865 -2088 -50 -467 -918 -1880 -1235 1785 -594 -1772 -239 1912 1194 -304
4312 -304 -149 2527 2449 -692 993 1191 1785 608 838 3537 1896 498 1885 3082 2723 1322 1120
4329 1120 4042 2488 1428 777 2713 2597 796 1317 3255 2329 2257 2005 2736 4165 2198 783 2664
$$ packed form
4211C288M18n12j520r5J363J93k161L30K858L56m212J176K755o39k670J39J623
4228B690l23o65j286J819O14l085Q87J976r18j505J25K97J819l175o59K525K65
4245A401r97j617J240P19j517j641K516J81j132k605J478J963n87k290P85J144
4261i59p75j155j37K753j158k006J800J223j320k193L27K721j366j334J49J910
4277a520o98m77l08K101r57k572P75J816O13j199P6J747J055l389L3K169R45j966
4295a756j785K415P83n22j223K038m17m51r62O45L020k379j178J533K151p18j498
4312c04J55K676p8l141J685J98N94j177K30K699j641j398J387J197l59j401k02
4329A120K922j554j060o51J936j16j801N21J938r26p2k52P31J429j967j415J881
$$ plain form
4346 2664 3422 2447 1766 2474 4240 1372 571 1964 3240 714 463 506 2233 2022 -950 1017 1315
4363 1315 997 -808 46 972 1376 -576 -46 1482 153 -1755 -1120 876 -825 -1894 -2135 538 -492
4380 -492 -2850 -2141 -594 -1274 -2059 -2429 -1281 -1141 -1602 -3765 -1171 -1112 -2007 -2363 -1677 -1070 -2655 -2610 -1054
4399 -1054 -1973 -3101 -3164 -2278 -1659 -2714 -3310 -2465 -1349 -2630 -3001 -3128 -1315 -1814 -3219 -2885 -615 -1148
4417 -1148 -2634 -2074 10 -1359 -1755 -2192 322 468 -1042 -1656 590 -74 -1634 -456 712 818 157
4434 157 -245 297 1534 -652 -506 1733 2061 749 30 1313 1963 873 886 1763 3428 1647 478
4451 478 1847 3121 1480 964 2593 3419 1810 1009 3176 3224 1594 1031 2686 3740 2084 1126 2122
4468 2122 3470 3190 1394 2171 3139 2094 399 1391 2728 2397 935 1079 2583 2032 1034 388 2046
$$ packed form
4346B664P58r75o81P08J766k868q01J393J276k526k51M3J727k11k972J967K98
4363A315l18j805Q54R26M04j952N30J528j329j908O35J996j701j069k41K673j030
4380d92k358P09J547o80p85l70J148J40m61k163K594N9q95l56O86O07j585M5J556
4399a054r19j128o3Q86O19j055n96Q45J116j281l71j27J813m99j405L34K270n33
4417a148j486N60K084j369l96m37K514J46j510o14K246o64j560J178J168J06o61
4434A57m02N42J237k186J46K239L28j312p19J283O50j090J3Q77J665j781j169
4451D78J369J274j641n16J629Q26j609q01K167M8j630n63J655J054j656r58R96
4468B122J348k80j796P77R68j045j695R92J337l31j462J44J504n51r98o46J658
$$ plain form
4485 2046 2535 94 437 1053 1662 -211 -946 1142 1965 -73 -612 -725 886 -1123 -1953 -23 655
4502 655 -1738 -2366 -998 813 -1444 -3078 -747 -1014 -1536 -2021 -1045 -398 -1491 -3213 -1824 -820 -2174
4519 -2174 -3138 -2575 -1084 -1633 -2556 -2663 -1463 -1395 -3848 -3486 -128 -886 -3432 -2814 -466 -1783 -3220
4536 -3220 -2644 -909 -1391 -2780 -2203 -953 -803 -2585 -3019 -656 -920 -1827 -2538 -1008 -655 -917 -1772 311
4554 311 512 -622 -1353 738 1755 -45 -652 246 1888 456 -1833 806 1730 660 -45 2187 2207
4571 2207 242 -65 1256 2007 1854 665 508 2446 2445 824 1478 3426 2757 887 968 3252 1204 1335
4589 1335 1786 3854 3738 1493 1089 2650 3409 1883 1173 2282 3313 1615 1085 2083 1942 1553 838
4606 838 1834 2716 961 730 1293 1624 1729 -491 378 1659 585 -1138 -57 2668 489 -324 -564
$$ packed form
4485B046M89k441L43O16O09j873p35K088Q23k038n39j13J611k009q30J930O78
4502F55k393o28J368J811k257j634K331k67n22m85R76O47j093j722J389J004j354
4519b174r64N63J491n49r23j07J200O8k453L62L358p58k546O18K348j317j437
4536c220N76J735m82j389N77J250J50j782m34K363k64r07p11J530L53k62q55K083
4554C11K01j134p31K091J017j800o07Q98J642j432k289K639R24j070p05K232K0
4571B207j965l07J321P51j53j189j57J938jj621O54J948o69j870Q1K284k048J31
4589A335M51K068j16k245m04J561P59j526p10J109J031j698n30R98j41l89p15
4606H38R96Q82j755k31N63L31J05k220Q69J281j074j723J081K725k179q13k40
$$ plain form
4623 -564 727 -476 -990 -1041 436 -160 -2060 105 -450 -898 -2191 -1667 -1042 -1067 -2963 -2637 -128 -107
4641 -107 -2147 -2347 -1574 -955 -2006 -2998 -1462 -2185 -2981 -3366 -1483 -1164 -2915 -3191 -1325 -1259 -2798 -3741
4659 -3741 -1110 -1360 -2274 -4263 -1214 -571 -2023 -2664 -1523 -647 -2406 -2815 -1522 -407 -973 -1851 -141
4676 -141 -108 -592 -1569 -55 -125 -319 -1371 -580 1581 51 -1362 609 2095 1170 -587 -315 1417 1625
4694 1625 431 53 1374 2050 1011 512 2041 2803 1404 2018 2912 3137 1140 976 1608 1791 1825 629
4712 629 2444 2314 2491 1546 1645 2830 1482 888 2382 3065 1461 1472 1840 3402 1707 349 1054 2065
4730 2065 407 584 507 2119 1109 1003 478 2226 2027 -150 1143 2380 568 -704 -453 1163 1305
4747 1305 -875 -966 791 -320 -936 -196 -129 -44 -1343 -2004 -303 54 -873 -2137 -1106 266 -1889 -2986
$$ packed form
4623e64J291j203n14n1J477n96j900K165n55m48j293N24O25k5j896L26K509K1
4641a07k040k00P73O19j051r92J536p23p96l85J883L19j751k76J866O6j539r43
4659c741K631k50r14j989L049O43j452o41J141Q76j759m09J293J115n66q78J710
4676a41L3m84r77J514p0j94j052P91K161j530j413J971J486r25j757K72J732K08
4694A625j194l78J321O76j039m99J529P62j399O14Q94K25j997j64O32J83L4j196
4712F29J815j30J77r45R9J185j348n94J494O83j604J1L68J562j695j358P05J011
4730B065j658J77p7J612j010j06n25J748j99k177J293J237j812j272K51J616J42
4747A305k180r1J757j111o16P40O7Q5j299o61J701L57r27j264J031J372k155j097
$$ plain form
4765 -2986 -1409 -1196 -2062 -1704 -531 -696 -2103 -2615 -2231 -874 -1293 -3660 -1745 -758 -2253 -3287 -2403
4782 -2403 -655 -1692 -2495 -1284 -1316 -1270 -2993 -1827 -248 -1213 -1225 -1458 -216 -1040 -2006 -2203 -669 -1333
4800 -1333 -1516 -1033 261 -251 -1036 -1470 232 294 -683 -591 128 1811 -925 -1396 1406 1459 -688 -277 1037
4819 1037 1122 483 16 1038 2124 627 613 1105 2848 1652 670 854 3793 2389 695 1627 2259 1832
4837 1832 1851 1435 1720 2514 417 900 3760 2418 660 979 2157 2400 746 443 2480 3203 655
4854 655 222 2890 2665 1061 -256 1733 1749 -15 -770 727 2095 486 -46 1599 1496 -105 -56
4871 -56 -27 1009 29 -1242 -702 1634 -983 -1066 -439 675 -604 -1463 -1068 -879 11 -2734 -1152 -51
4889 -51 -326 -1627 -1321 -1029 -1332 -1464 -1563 -1125 216 -3466 -2715 -296 -894 -2070 -1843 -680 -1141 -3048
$$ packed form
4765b986J577K13q66L58J173j65j407n12L84J357m19k367J915R87j495j034Q84
4782b403J748j037q03J211l2M6j723J166J579r65j2k33J242q24r66j97J534o64
4800a333j83M83J294n12p85m34J702O2r77R2P19J683k736m71K802N3k147M11J314
4819A037Q5o39m67J022J086j497j4M92J743j196r82J84K939j404j694R32O32m27
4837A832J9m16K85P94k097M83K860j342j758L19J178K43j654l03K037P23k548
4854F55m33K668k25j604j317J989J6j764p55J497J368j609n32J645j03j601M9
4871e6K9J036r80j271N40K336k617q3O27J114j279q59L95J89Q90k745J582J101
4889e1k75j301L06K92l03j32r9M38J341l682P51K419n98j176K27J163m61j907
$$ plain form
4907 -3048 -3169 -1647 -501 -2386 -1764 -380 -359 -1862 -2548 -375 -1455 -1428 -1949 -477 349 -1832 -2378
4924 -2378 -73 -190 -911 -2550 -1162 -147 573 -1891 -1133 912 -507 -969 -209 348 772 -519 144
4941 144 1519 2367 -505 -364 811 1113 -96 91 2215 1507 72 561 2253 2089 792 652 2320
4958 2320 1361 1445 -71 1934 3154 783 1472 3130 1594 1675 561 2890 2507 1551 1278 2099 1236 1127
4976 1127 801 2103 1203 694 1238 871 2645 2110 958 1504 2378 790 -398 713 2041 1536 -819
4993 -819 112 823 363 -549 -83 240 856 -201 -183 932 -727 -467 -400 233 57 -615 -1512 -540 -657 -968
5013 -968 -1902 -434 -396 -1174 -1313 -1472 -730 -1395 -1925 -671 -869 -1980 -1429 -659 -1024 -2015 -2935 -1815 -1558
5032 -1558 -1710 -3060 -1606 -628 -1592 -1791 -1853 -381 -2135 -1612 -2367 369 -1137 -2817 -1402 -775 -627
$$ packed form
4907c048j21J522J146j885O22J384K1j503o86K173j080K7n21J472Q26k181n46
4924b378K305j17p21j639J388J015P20k464P58K045j419m62P60N57M24j291O63
4941A44J375Q48k872J41J175L02j209J87K124p08j435M89J692j64j297j40J668
4958B320r59Q4j516K005J220k371O89J658j536Q1j114K329l83r56k73Q21q63j09
4976A127l26J302r00n09N44l67J774n35j152N46Q74j588j188J111J328n05k355
4993h19R31P11m60r12M66L23O16j057J8J115j659K60O7O33j76o72q97R72j17l11
5013i68r34J468L8p78j39j59P42o65n30J254j98j111N51P70l65r91r20J120K57
5032a558j52j350J454R78r64j99o2J472j754N23p55K736j506j680J415O27J48
$$ plain form
5049 -627 -1599 -1400 -1030 181 -2226 -1932 -197 -478 -1225 -809 -99 207 -755 -893 456 491 -1888 -187
5067 -187 396 1216 -374 -263 1553 1758 185 -418 1449 1771 985 -142 1103 1768 2218 573 37 2297
5085 2297 1366 485 3526 2251 1452 615 1338 2300 2498 209 1250 2838 313 702 2218 2257 1918 426
5103 426 1096 1989 149 526 1171 1463 2022 1021 650 1251 1607 -311 -331 668 2145 -55 -866 881
5121 881 427 365 -66 345 651 -303 314 426 105 -969 -2544 -688 463 -797 -1094 -320 -324 -1497 -1774
5140 -1774 -1017 -529 -698 -1548 -1414 -632 -866 -3125 -1830 -173 -970 -1964 -1948 -1164 -207 -2314 -2201 -893
5158 -893 -2779 -1958 -2210 -1384 -695 -1589 -2613 -222 -140 -2140 -2942 -860 -724 -1495 -1493 -1119 -640 -1851 -1368
5177 -1368 -113 518 -1148 -1819 -5 -825 -744 -1245 -78 680 -509 -701 555 466 457 -883 218 991
$$ packed form
5049f27r72J99L70J211k407K94J735k81p47M16P10L06r62j38J349L5k379J701
5067a87N83Q20j590J11J816K05j573o03J867L22p86j127J245O65M50j645n36K260
5085B297r31q81L041j275p99q37P23R62J98k289J041J588k525L89J516L9l39j492
5103D26O70Q93j840L77O45K92N59j001l71O01L56j918k0R99J477k200q11J747
5121H81m54o2m31M11L06r54O17J12l21j074j575J856J151j260k97P74mj173k77
5140a774P57M88j69q50J34P82k34k259J295J657p97r94J6P84R57k107J13J308
5158h93j886Q21k52Q26O89q94j024K391Q2k000q02K082J36p71KL74M79j211M83
5177a368J255O31j666o71J814q20Q1n01J167P58j189j92J256q9rj340J101P73
$$ plain form
5195 991 406 -769 183 1624 41 -968 496 1155 1115 -348 1054 1180 1541 905 1271 2837 1375
5212 1375 966 1610 3270 2111 709 -65 2040 2455 347 2024 1772 1894 1630 449 1294 1700 630
5229 630 1456 2119 1623 757 661 2147 1936 65 28 1173 901 -392 -823 1097 2384 310 -1022 -55
5247 -55 1574 1102 -807 1517 516 -446 -737 -479 454 292 -225 -59 -591 -1096 -2253 -900 763 -784
5265 -784 -2124 -1553 499 -266 -1614 -889 -819 -154 -3005 -2132 -1258 -1338 -1522 -2211 -1277 -755 -1316 -2101 -1363
5284 -1363 -824 -1397 -968 -1747 -642 -1415 -1894 89 -889 -261 -1789 -1024 -689 -231 -1929 -1017 6 266
5302 266 -893 -772 100 391 -346 -1243 -30 -471 -1717 -932 1050 360 -568 74 1050 41 -501 -999
5320 -999 900 952 133 22 1448 1069 1540 566 795 883 -361 1450 958 1582 639 444 1849 1407 1753
$$ packed form
5195I91n85j175R52J441j583j009J464O59m0j463J402J26L61o36L66J566j462
5212A375m09O44J660j159j402p74K105M15k108J677k52J22k64j181Q45M06j070
5229F30Q26O63m96q66r6J486k11j871l7J145k72j293m31J920J287k074j332R67
5247e5J629m72j909K324j001r62k91K58R33j62n17J66n32n05j157J353J663j547
5265g84j340N71K052p65j348P25P0O65k851Q73Q74q0j84o89R34N22n61p85P38
5284a363N39n73M29p79J105p73m79J983r78O28j528P65L35M58j698R12J023K60
5302B66j159J21Q72K91p37q97J213m41j246P85J982o90r28O42R76j009n42m98
5320i99J899N2q19j11J426l79M71r74K29Q8j244J811m92O24r43j95J405m42L46
$$ plain form
5339 1753 678 2087 3453 1056 691 1559 2414 1902 1155 1580 2476 2108 459 998 2341 2194 1159
5356 1159 395 1590 1962 122 479 1389 1194 178 -4 928 1080 -771 515 1489 1554 366 -252 730
5374 730 405 -622 457 579 1143 -455 -577 499 -557 -1065 -2307 -430 -40 -790 -1170 -840 -215 -516
5392 -516 -1210 -1177 403 -638 -1284 -1558 110 -998 -1829 -1172 -92 -1977 -1775 -1463 -448 -530 -1205 -1604
5410 -1604 -1428 -288 -2214 -2195 -477 -2399 -1630 -542 -1199 -824 -1008 -990 -640 -608 -1138 -1355 -827 -279 -1813
5429 -1813 -1343 -1146 294 -678 -647 429 648 -1307 -991 769 -158 -531 -539 -266 1460 125 -136 329 1242
5448 1242 -196 -865 866 348 994 57 766 1828 610 -15 840 2640 1343 843 667 2160 2604
5465 2604 982 1353 1279 968 868 843 1833 1925 486 1472 2427 1824 1318 326 1932 2114 1034 290 683
$$ packed form
5339A753j075J409J366k397l65Q68Q55n12p47M25Q96l68j649N39J343j47j035
5356A159p64J195L72j840L57R10j95j016j82R32J52j851J286R74O5j188o18R82
5374G30l25j027J079J22N64j598j22J076j056n08j242J877L90p50l80L30O25l01
5392e16o94L3J580j041o46k74J668j108q31O57J080j885K02L12J015q2o75l99
5410a604J76J140j926J9J718j922P69J088o57L75j84J8L50L2n30k17N28N48j534
5429a813M70J97J440r72L1J076K19j955L16J760r27l73qK73J726j335k61M65R13
5448A242j438o69J731n18O46r37P09J062j218o25Q55J800j297n00j76J493M44
5465B604j622L71p4l11j00k5R90R2j439R86R55o03n06r92J606J82j080p44L93
$$ plain form
5484 683 1480 554 398 667 1949 -229 358 1122 1208 576 -772 573 1190 681 -353 212 278 219 -1419
5503 -1419 -217 589 -171 -977 -272 491 -29 -555 -753 99 -1160 -525 -418 467 -137 -1688 -2300 -13
5521 -13 -149 -2231 -1132 -969 -1497 -1097 -834 -78 -626 -2163 -1402 -354 -534 -1923 -1968 -667 -1787 -1743 -1082
5540 -1082 259 -466 -1896 -2036 -1526 -221 -1010 -1553 -625 409 -951 -1239 -1299 -298 -994 -2690 -213
5557 -213 -89 -479 -814 -57 280 -1102 118 -956 25 641 -1030 -843 532 403 0 -515 727 1110
5575 1110 779 40 636 1123 168 -423 1001 2122 746 510 1048 1687 1018 483 828 1550 1042 1154 715
5594 715 833 1603 898 921 1189 994 1454 1454 1796 655 259 1590 2596 795 998 599 1423 766 -97 810
5614 810 2732 1070 -124 -36 1776 1001 -25 1694 2281 307 -658 220 1581 146 -845 -34 221
$$ packed form
5484F83P97r26j56K69J282k178N87P64Q6o32j348J345O17n09j034N65O6n9j638
5503a419J202Q06p60q06P05P63n20n26j98Q52j259O35J07Q85o04j551o12K287
5521a3j36k082J099J63n28M00K63P56n48j537P61J048j80j389m5J301j120M4O61
5540a082J341p25j430j40N10J305p89n43R28J034j360k88o0J001o96j696K477
5557b13J24l90l35P57L37j382J220j074R81O16j671J87J375j29m03n15J242L83
5575A110l31p39N96M87r55n91J424J121j376k36N38O39o69n35L45P22n08J12m39
5594G15J18P70p05K3K68j95M60%L42j141l96J331J006j801K03l99Q24o57q63R07
5614H10J922j662j194Q8J812p75j026J719N87j974r65Q78J361j435r91Q11K55
$$ plain form
5631 221 -949 -343 248 108 -49 -659 -1666 230 369 -1257 -544 -573 -421 -1309 -1547 -232 -70 -1774
5649 -1774 -1353 -793 59 -1007 -2470 -966 44 -1249 -2277 -2024 -839 -1199 -1970 -1049 190 -1229 -2707
5666 -2707 -1800 -732 -996 -1515 -1404 45 -599 -1637 -1236 -749 -833 -1959 -1132 -612 -765 -705 -1342 -226 -732
5685 -732 -1633 -1226 -367 -93 -1105 -796 225 382 14 -586 552 678 -158 -471 609 843 551 742 1524
5704 1524 1235 158 209 503 962 514 828 1609 1787 452 89 323 1560 971 781 373 1704 1041 411
5723 411 570 1922 1485 1035 1423 1891 622 609 -33 2684 1036 1365 427 1807 1646 449 821 1111
5741 1111 881 741 533 1358 2002 -15 -241 452 386 360 557 -202 471 -103 333 -1377 934 567 -1054
5760 -1054 -104 121 676 -785 -342 96 -1384 -713 -1708 -189 -292 -1167 -808 -188 -14 -1033 -498 -251
$$ packed form
5631B21j170O06N91j40j57o10j007J896J39j626P13k9J52q88k38J315J62j704
5649a774M21N60Q52j066j463J504J010j293j028K53J185l60p71R21J239j419j478
5666b707R07J068k64n19J11J449o44j038M01M87q4j126Q27N20j53O0o37J116n06
5685g32r01M07Q59K74j012L09J021J57l68o00J138J26q36l13J080K34k92J91P82
5704A524k89j077N1K94M59m48L14P81J78j335l63K34J237n89j90m08J331o63o30
5723D11J59J352m37m50L88M68j269j3o42K717j648L29r38J380j61j197L72K90
5741A111k30j40k08Q25O44k017k26O93o6k6J97p59O73n74M36j710K311l67j621
5760a054R50K25N55j461M43M38j480O71r95J519j03q75L59O20J74j019N35K47
$$ plain form
5778 -251 385 -1266 -763 -1308 -853 -828 -299 -573 -926 -1337 -1072 -226 -324 -1132 -1528 707 -395 -1627 -211
5797 -211 -1161 -943 -143 -2113 47 565 -1060 -1739 -305 -427 -952 -997 341 -377 -1126 -1144 -162 89 42
5816 42 -1007 -337 945 53 127 32 1649 715 603 212 1045 1097 811 -501 498 615 -549 274 2487
5835 2487 1382 -89 1145 1154 1421 1134 425 1609 676 648 1047 1928 1840 735 57 1603 1867 48 1010
5854 1010 438 1446 1179 744 1399 1642 392 763 1149 1879 1515 187 1150 1069 1110 264 187 1518 904
5873 904 -932 143 1162 467 -872 65 -546 278 -611 -380 965 526 -1112 -3 504 262 -1118
5890 -1118 -311 412 -6 -1028 -703 -644 -1557 -519 -1444 -453 185 -1847 -1212 -873 448 -1761 -1806 -772
5908 -772 -1503 -486 -1261 -1260 -924 -934 -1606 -404 -122 -1065 -2307 -1155 -677 -329 -1944 -1229 -288 -952 -1999
$$ packed form
5778b51O36j651N03n45M55K5N29k74l53m11K65Q46r8q08l96K235j102j232J416
5797b11r50K18Q00j970K160N18j625o79J434j22n25m5J338p18p49j8R82K51m7
5816D2j049O70J282q92P4r5J617r34j12l91Q33N2k86j312R99J17j164Q23K213
5835B487j105j471J234RK67k87p09J184r33k8L99Q81q8j105o78J546K64j819R62
5854A010n72J008k67m35O55K43j250L71L86P30l64j328R63q1M1q46p7J331o14
5873I04j836J075J019o95j339R37o11Q24q89K31J345m39j638J109N07k42j380
5890a118Q07P23m18j022L25N9r13J038r25R91O38k032O35L39J321k209m5J034
5908g72p31J017p75JL36j0o72J202K82r43j242J152M78L48j615P15R41o64j047
$$ plain form
5927 -1999 -581 67 -741 -10 -1291 -189 -233 -1428 -635 697 -39 -839 -1042 -20 415 -428 95 613
5945 613 87 -85 -785 419 1213 245 -206 1288 406 216 -202 -660 1110 411 230 1691 1970 -177
5963 -177 -259 844 -358 790 990 769 1010 993 45 158 1919 1326 411 794 1434 983 1177 1149 1424 1661
5983 1661 498 219 1274 1560 616 183 1321 488 -383 110 81 -538 -66 437 1004 846 503 30 453
6002 453 1229 546 -314 556 1147 -17 491 881 -90 727 -1138 440 359 -843 -1162 295 476 -1249
6020 -1249 -1241 -974 475 -703 -574 -726 -211 -538 -1749 -1247 -105 -962 -1315 -658 -245 -1494 -1616 -1337 -229
6039 -229 156 -1409 -1517 -516 -461 -2426 -1157 -1606 -783 -2295 -1067 -939 -874 -1955 16 361 -1328 117
6057 117 -826 -770 17 -1336 -955 -140 -6 -1355 -959 375 261 -1017 -820 749 553 -261 -1241 311
$$ packed form
5927a999J418O48q08P31j281J102m4j195P93J332p36q00k03J022M35q43N23N18
5945F13n26j72p00J204P94r68m51J494q82j90m18m58J770o99j81J461K79k147
5963a77q2J103j202J148K00k21K41j7r48J13J761n93r15L83O40m51J94k8K75K37
5983A661j163k79J055K86r44m33J138q33q71M93k9o19M72N03N67j58l43m73M23
6002D53P76o83q60Q70N91j164N08L90r71Q17j865J578q1j202l19J457J81j725
6020a249QK67J449j178J29j52N15l27j211N02J142q57l53O57M13j249j22K79J108
6039b29L85j565j08J001N5j965J269m49Q23j512J228J28O5j081J971L45j689J445
6057A17r43N6P87j353L81Q15J34j349L96J334j14j278J97J569j96q14r80J552
$$ plain form
6075 311 1121 536 289 -510 -311 182 -504 424 700 818 429 1475 1215 1089 496 481 1810 820 -313
6094 -313 880 1292 926 563 -64 1473 1246 1349 445 981 1596 -108 -137 316 1333 69 623 1473 973
6113 973 1061 472 1253 388 -119 81 -55 -250 -24 -74 1178 672 130 -959 188 4 971 -624 910
6132 910 799 111 -201 -359 823 -510 -398 42 597 -206 -1137 -292 -367 789 -1098 -944 95 141 -1465
6151 -1465 -813 -18 -163 -1151 -788 -308 -1284 -456 -698 -1179 -508 -1594 -443 -407 -20 -1098 -1766 -1061 -933
6170 -933 -1102 -1906 24 376 -734 -2494 -1095 -705 -701 -956 -610 -66 -101 -995 -673 -212 233 -143 -1200
6189 -1200 -261 183 -1443 -886 851 -725 58 -549 697 -161 -503 412 -240 268 -155 -303 1400 1556
6207 1556 373 595 449 2316 186 890 442 1591 -777 57 657 1098 -86 -181 1388 1059 1043 489
$$ packed form
6075C11Q10n85k47p99J99M93o86R28K76J18l89J046k60j26n93j5J329r90j133
6094c13J193M12l66l63o27J537k27J03r04N36O15j704k9M53J017j264N54Q50n00
6113I73Q8n89P81q65n07K00j36j95K26n0J252n06n42j089J147j84R67j595J534
6132I10j11o88l12j58J182j333J12M40N55q03r31Q45p5J156j887J54J039M6j606
6151a465O52P95j45r88L63M80r76Q28k42m81O71j086J151L6L87j078o68P05J28
6170i33j69q04J930L52j110j760J399L90Mk55L46N44l5q94L22M61M45l76j057
6189a200R39M44j626N57J737j576P83o07J246q58l42R15o52N08m23j48J703J56
6207A556j183K22j46J867k130P04m48J149k368Q34O00M41j184r5J569l29j6n54
$$ plain form
6225 489 882 1286 153 624 677 943 765 284 1045 983 1061 243 103 1005 739 1103 1227 1930 1682 -236
6245 -236 110 5 71 -688 94 542 1084 -370 395 755 432 929 128 1315 1410 259 -1188 364 -59
6264 -59 31 -686 -377 101 963 -544 0 74 442 -648 221 -226 -884 -666 -73 623 144 -324 -773 452
6284 452 -753 -1203 -1782 -399 -1346 -970 -1055 -893 -616 -1850 -939 -47 -170 -1726 -664 171 -52 -1064
6302 -1064 -151 363 -260 -1177 -919 272 289 -395 -1020 361 254 -174 -888 -306 -177 -861 -772 91 245 250
6322 250 134 -141 171 -243 -807 -296 948 -292 242 87 236 -35 -84 -457 382 230 182 -737 323 1304
6342 1304 -151 1186 750 290 54 332 358 808 -354 1045 789 718 -213 863 854 1069 -315 299 506
6361 506 1575 -307 896 1202 115 298 188 -212 696 101 894 -198 1351 451 -406 1634 398
$$ packed form
6225D89L93M04j133M71N3K66j78m81P61o2P8q18j40R02k66L64J24P03k48j918
6245b36L46j05O6p59P82M48N42j454P65L60l23M97q01J187R5j151j447J552m23
6264e9R0p17L09M78Q62j507N44P4L68j090Q69m47o58K18N93O96m79m68m49J225
6284D52j205m50n79J383r47L76q5J62K77j234R11Q92j23j556J062Q35k23j012
6302a064R13N14o23r17K58J191J7o84o25J381j07m28p14N82J29o84Q9Q63J54N
6322B50j16k75L12m14n64N11J244j240N34j55J49k71m9l73Q39j52m8r19J060R81
6342A304j455J337m36m60k36K78K6M50j162J399k56p1r31J076rK15j384O14K07
6361E06J069j882J203L06j087J83j10m00R08n95P93j092J549r00q57K040j236
$$ plain form
6378 398 -60 232 18 508 -432 -300 -239 434 -61 253 96 291 -296 -457 -551 636 -705 -469 54 768
6398 768 -430 -2446 -519 -694 -24 -1178 -1098 211 -241 -932 -1778 -1411 -866 -369 -702 -1024 -915 -725 -1544
6417 -1544 -426 -409 -877 -244 -904 142 -943 -364 -75 88 -1357 -1161 -1161 -125 -280 -915 -488 -662 -374
6436 -374 -1275 24 -121 -808 -982 -103 3 -536 -884 799 816 116 -403 536 845 96 -1239 554 703
6455 703 61 220 -227 160 108 122 -717 774 1418 437 589 937 456 -393 -202 1855 443 927 1033 634
6475 634 227 64 1056 -116 560 -222 325 1485 1123 1002 525 604 756 682 -283 1067 990 1126 121 -185
6495 -185 797 824 316 569 385 -498 353 207 -475 277 -973 155 1512 115 130 -493 338 158 -298
6514 -298 -309 462 463 242 580 995 -132 -523 -1238 428 228 273 -1273 -1070 -258 -562 -88 -986 -726 -711 -1608
$$ packed form
6378C98m58K92k14M90r40J32O1O73m95L14j57J95n87j61r4J187j341K36N23P14
6398G68j198k016J927j75O70j154Q0J309m52o91q46L67N45M97l33l22J09J90q19
6417a544J118J7m68O33o60J046j085N79K89J63j445J96%J036j55o35M27j74K88
6436c74r01J299j45o87j74Q79J06n39l48J683J7p00n19R39L09p49j335J793J49
6455G03o42J59m47L87n2J4q39J491O44r81J52L48m81q49J91K057j412M84J06l99
6475F34m07j63R92j172O76p82N47J160l62j21m77P9J52p4r65J350p7J36j005l06
6495a85R82K7n08K53j84q83Q51j46o82P52j250J128J357j397J5o23Q31j80m56
6514b98j1P71Jk21L38M15j127l91p15J666k00M5j546K03Q12l04M74q98K60J5q97
$$ plain form
6535 -1608 -240 -687 -1148 -1440 536 -185 -1062 316 -201 113 -692 -702 -924 -258 60 -704 -354 -740 -987
6554 -987 -1573 -103 61 -685 -1083 -503 663 379 -1621 -701 787 -646 -542 -718 227 -1023 -110 239
6572 239 -232 559 -65 143 -183 1054 -251 -949 -470 288 -90 252 761 503 -1000 -327 652 664 451
6591 451 149 753 288 1244 455 152 423 17 684 659 32 932 -526 -149 766 1467 -26 -656 979
6610 979 -138 685 777 388 301 574 614 -157 1109 281 244 865 987 489 -422 517 79 164 134 395 -103
6631 -103 -153 -467 490 -54 -1302 -446 -693 375 -357 -70 856 252 78 37 -137 26 -57 -782 321 188
6651 188 -449 -1006 -1020 458 -498 -146 -453 -348 108 -1678 -820 -1326 -693 528 229 -15 -73 -179 -208 -417
6671 -417 -984 -676 -170 -210 299 -1091 29 -968 250 -260 -790 -529 -575 -389 -272 -551 104 90 -1033 -343
$$ packed form
6535a608J368m47m61k92J976p21q77J378n17L14q05j0k22O66L18p64L50l86k47
6554i87n86J470J64p46l98N80J166k84k000R20J488j433J04j76R45j250R13L49
6572B39m71P91o24K08l26J237j305o98M79P58l78L42N09k58j503O73R79J2k13
6591D51l02O04m65R56p89l03K71m06O67k5o27R00j458L77R15P01j493o30J635
6610I79j117Q23R2l89q7K73M0p71J266q28l7O21J22m98r11R39m38Q5l0K61m98
6631a03n0l14R57n44j248Q56k47J068p32K87R26o04j74m1j74J63q3p25J103j33
6651A88o37n57j4J478r56L52l07J05M56j786Q58n06O33J221k99k44n8j06k9k09
6671d17n67L08N06m0N09j390J120r97J218n10n30K61m6J86J17k79O55j4j123O90
$$ plain form
6691 -343 63 -207 -415 -540 -67 -944 -129 303 -121 262 674 151 -350 -686 -124 -195 375 -114 -265 -75
6711 -75 -78 1318 395 -789 1465 15 262 -397 -59 921 -635 748 526 624 -437 500 1454 732 -114
6730 -114 482 765 -53 946 126 625 997 -85 795 900 439 -38 -140 958 503 -218 35 475 659
6749 659 1188 412 -42 399 26 32 -465 520 98 549 1352 -374 -98 -953 -261 -247 -164 -294 391 935 965
6770 965 -1586 -95 463 -148 -1097 -235 902 -1229 -409 -1385 478 -567 -750 -943 -562 525 -298 -611
6788 -611 -216 643 -774 -323 -1017 -157 -1675 421 -808 -2043 -318 -119 -528 -926 -309 -1395 -108
6805 -108 -816 -388 39 -91 -669 -754 -1676 4 -857 -383 -1129 442 -201 -1120 434 16 -300 -545 -305
6824 -305 -772 135 1184 -558 10 406 724 -617 -587 1183 -176 281 -379 184 952 25 -109 1199
$$ packed form
6691c43M06k70k08j25M73q77Q15M32m24L83M12n23n01l36N62p1N70m89j51J90
6711g5lJ396r23j184K254j450K47o59L38R80j556J383k22R8j061R37R54p22q46
6730a14N96K83q18R99q20M99L72j082Q80J05m61m77j02J098m55p21K53M40J84
6749F59N29p76m54M41l73Om97R85m22M51Q03j726K76q55O92J4Q3j30O85N44L0
6770I65k551J491N58o11r49Q62J137k131Q20r76J863j045j83j93L81J087q23l13
6788f11L95Q59j417M51o94Q60j518K096j229j235J725J99m09l98O17j086J287
6805a08p08M28M27j30n78q5r22J680q61M74p46J571o43r19J554m18l16k45K40
6824c05m67R07J049j742N68L96L18j341L0J770j359M57o60N63P68r27j34J308
$$ plain form
6842 1199 253 574 247 533 335 550 806 963 -76 556 416 792 -267 459 255 717 483 228 -1456
6861 -1456 713 551 61 816 188 1444 -758 -129 26 1130 4 89 -409 815 367 131 1013 333
6879 333 -82 -449 -630 -112 -196 1127 108 -124 -550 710 -175 -91 -714 -203 -270 230 789 -1318 -1161 365
6899 365 508 -1164 -14 -1103 476 156 -397 543 205 -974 -554 455 -177 -658 -639 -257 -943 -701
6917 -701 -375 39 -304 -991 655 -364 432 71 -490 -350 -484 137 -1410 -537 253 -275 -609 -1731 -761
6936 -761 390 -865 -342 -412 222 -884 587 -67 -252 584 -169 367 771 -12 578 106 -75 -597 -648
6955 -648 -1023 -709 -281 -752 -530 -153 783 -132 444 406 -251 -207 112 -242 -381 -159 -563 48 104 -198 368
6976 368 610 527 -461 -29 1642 448 1107 1061 -323 -120 -95 -295 114 320 -447 94 909 604 248 -259
$$ packed form
6842A199r46L21l27K86j98K15K56J57j039O32j40L76j059P26k04M62k34k55j684
6861a456K169j62m90P55o28J256k202O29J55J104j126Q5m98J224m48k36Q82o80
6879C33m15l67j81N18q4J323j019k32m26J260q85Q4o23N11o7N00N59k107J57J526
6899C65J43j672J150j089J579l20n53R40l38j179M20J009o32m81J9L82o86K42
6917g01L26M14l43o87J646j019P96l61n61J40j34O21j547Q73P90n28l34j122R70
6936g61J151j255N23p0O34j106J471o54j85Q36p53N36M04p83N90m72j81n22n1
6955f48l75L14M28m71K22L77R36r15N76l8o57M4L19l54j39K22m04O11N6l02N66
6976C68K42q3r88M32J671j194O59m6j384K03K5k00M09K06p67N41Q15l05l56n07
$$ plain form
6996 -259 388 334 1237 272 -179 1527 -374 -269 1041 406 -462 62 0 724 695 -198 948 -149 704
7015 704 -139 286 55 -321 -527 -146 137 46 85 387 -62 831 -169 -244 -679 440 -1046 226 -208 -149
7035 -149 741 -627 411 18 -429 -764 54 -107 25 -1207 240 -646 -650 -421 -680 -460 -858 210 1235
7054 1235 637 -951 -1385 -378 -14 216 -72 -844 19 -96 -278 264 464 -456 -40 -239 273 -455 -211
7073 -211 -89 -987 591 -813 228 353 4 -861 424 703 -536 636 -64 -82 1243 121 -507 1273
7091 1273 -466 2 -331 427 52 -160 342 123 -725 676 309 1090 197 -880 604 -44 1634 425
7109 425 224 1555 200 488 990 103 573 139 78 106 -96 -228 718 -339 181 435 447 179 1025 613
7129 613 3 13 1514 34 -143 -578 41 12 1223 -368 439 121 719 158 -329 706 609 -474 474
$$ packed form
6996b59O47n4R03r65m51J706j901J05J310o35q68N24o2P24k9q93J146j097Q53
7015G04q43M25k31l76k06L81K83r1L9L02m49Q93j000p5m35J119j486J272m34N9
7035a49Q90j368J038l93m47l35Q18j61J32j232J447q86mK29k59K20l98J068J025
7054A235n98j588m34J007L64K30k88p72Q63j15j82N42K00r20M16j99N12p28K44
7073b11J22q98J578j404J041J25l49q65J285K79j239J172p00j8J325j122o28J780
7091A273j739M68l33P58l75k12N02k19q48J401l67P81q93j077J484o48J678j209
7109D25k01J331j355K88N02q87M70m34o1K8k02j32R46j057N20K54J2k68Q46m12
7129F13o10J0J501j480j77m35O19k9J211j591Q07l18N98n61m87J035r7j083R48
$$ plain form
7148 474 11 -424 -593 150 95 -100 -384 861 391 -197 -1154 1040 -103 -227 -839 -1120 537 -715 -447
7167 -447 -481 -849 -198 -577 -89 134 -356 -729 -621 300 -809 -412 957 -554 406 -858 -577 261 -313
7186 -313 -1046 201 248 773 335 -634 148 512 166 -1085 247 468 33 -645 917 309 -410 -138 23
7205 23 -169 659 -511 442 827 658 -943 562 560 -590 -17 -196 350 1211 403 -198 332 868 -45 -282
7225 -282 993 436 151 220 760 714 560 804 1021 -403 140 509 -415 356 -57 563 -177 783 -116 272
7245 272 707 760 330 355 347 418 296 -491 -256 -297 -50 687 -207 605 357 -469 516 -2 -341 -439 371 232
7267 232 303 -91 -678 820 246 -306 356 48 342 -438 52 -290 -547 -867 -259 -1187 -621 335 366 -634
7287 -634 409 -470 -1102 -513 -260 -946 -1848 279 152 -80 -393 -546 -1176 58 -203 -355 -376 -666 -1096
$$ packed form
7148D74m63m35j69P43n5j95k84J245m70n88r57K194j143j24o12k81J657j252K68
7167d47l4l68O51l79M88K23m90l73J08R21j109L97J369j511R60j264K81Q38n74
7186c13p33J247M7N25m38r69P82L64l46j251J332K21m35o78J562o08p19K72J61
7205B3j92Q28j170R53L85j69j601J505kj150N73j79N46Q61q08o01N30N36r13k37
7225b82J275n57k85O9N40m6j54K44K17j424N43L69r24P71m13O20p40R60q99L88
7245B72M35N3m30K5qP1j22p87K35m1K47P37q94Q12k48q26R85n18l39r8Q10j39
7267B32P1l94n87J498n74n52O62l08K94p80M90l42k57l20O08r28N66R56L1j000
7287f34J043q79o32N89K53o86r02K127j27k32l13j53o30J234k61j52k1k90m30
$$ plain form
7306 -1096 -735 -864 -378 -284 -831 54 -393 -116 137 223 -456 -804 -175 817 -86 -313 336 47 -114 -547
7326 -547 623 -225 143 -337 -451 311 -3 128 -461 -1130 -337 578 -46 544 649 -376 -43 961 125
7345 125 -309 670 7 308 -271 73 -314 729 388 -1119 140 -78 129 903 522 958 -476 749
7363 749 941 567 -114 561 -219 810 528 -577 1001 -112 -657 -528 -25 -132 523 488 389 -4 -305
7382 -305 -324 910 164 -312 -775 -47 653 664 -16 136 489 201 -301 1106 -616 730 -54 189 805
7401 805 -190 527 -307 -436 -160 -766 -195 2 -250 321 3 -269 -1232 -470 199 -365 -411 -1203 100 -231
7421 -231 -64 -167 -533 841 -16 -281 -449 -1016 208 -453 76 505 -558 -418 482 149 -499 -393 -588
7440 -588 102 95 -765 -171 492 -298 876 -415 -742 359 -527 -1140 -339 -40 -245 -359 917 -3 -307
$$ packed form
7306a096L61j29M86R4n47Q85m47K77K53Q6o79l48O29R92r03k27O49k89j61m33
7326e47J170q48L68m80j14P62l14J31n89o69P93R15o24N90J05j025L33J004q36
7345A25m34R79o63L01n79L44l87J043l41j507J259k18K07P74l81M36j434J225
7363G49J92l74o81O75p80J029k82j105J578j113n45J29N03j07O55l5r9l93l01
7382c05j9J234p46m76m63P28P00J1o80J52L53k88n02J407j722J346p84K43O16
7401H05r95P17q34j29K76o06N71J97k52N71l18k72r63P62O69n64m6p92J303l31
7421b31J67j03l66J374q57k65j68n67J224o61N29M29j063J40R00l33o48J06j95
7440e88O90pq60N94O63p90J174j291l27J101q86o13Q01K99k05j14J276r20l04
$$ plain form
7459 -307 -956 -562 -202 268 -333 -391 377 139 -177 -59 82 240 285 804 121 -262 -312 274 262 -92 623
7480 623 -1224 -13 -558 434 -441 564 188 -110 -7 -221 1255 390 -374 -467 181 424 -126 549 -146
7499 -146 -340 -793 -54 -547 189 253 1225 1421 -178 -278 -698 100 66 275 320 71 362 -572 -968 91
7519 91 535 -366 605 514 649 508 -342 -247 84 162 -613 -206 34 -321 85 432 -379 -1108 -936 -533 -738
7540 -738 -704 -1487 200 -716 -408 -187 -705 430 -1215 -272 -917 779 -449 273 -238 -542 -408 198 -177
7559 -177 -672 10 593 -862 -777 -202 -722 82 -478 857 -269 -366 -422 -84 -247 -563 126 -564 2297 -1269
7579 -1269 -251 -139 38 -719 376 20 -169 -565 823 101 387 -323 11 -1051 345 -340 564 645
7597 645 185 -177 -93 538 -275 732 -72 459 743 -448 -329 292 320 596 -88 1713 228 -526 -960
$$ packed form
7459c07o49L94L60M70o01n8P68k38l16J18J41J58M5N19o83l83n0N86j2l54P15
7480F23j847J211n45R92q75J005l76k98J03k14J476q65p64r3O48K43n50O75o95
7499a46j94m53P39m93P36O4R72J96j599j00m20P98l4K09M5k49K91r34l96J059
7519I1M44r01R71r1J35j41q50R5L31P8p75M07K40l55M06L47q11p29J72M03k05
7540g38L4p83J687r16L08K21n18J135j645R43o45J696j228P22n11l04J34O06l75
7559a77m95O82N83j455Q5N75n20Q04n60J335j126r7n6L38j63l16O89o90K861l566
7579a269J018J12J77p57J095l56j89l96J388p22K86p10L34j062J396o85R04Q1
7597F45m60l62Q4O31q13J007q04N31K84j191J19O21K8K76o84J801j485p54m34
$$ plain form
7616 -960 413 537 1098 -999 -2 460 -146 -608 363 -406 407 -741 1508 -439 -177 908 -402 -657
7634 -657 674 83 -641 192 -145 -26 206 546 -703 313 -263 586 -367 -598 203 328 59 74 -594
7653 -594 -174 -428 117 24 -28 -117 -905 148 398 -352 -168 -257 -338 -482 499 -484 -425 -733 1148 -657 36
7674 36 64 219 330 79 -119 208 108 -155 -914 411 142 179 -427 -405 1 -226 -1143 677 -1594 264
7694 264 197 -157 -314 -127 -3 839 -259 -329 -359 -595 -371 255 -171 -26 -111 130 235 -235 113 563 297
7715 297 231 424 -371 1086 -1273 494 846 -867 -662 564 -163 1182 703 402 -6 64 230 1006 641
7734 641 189 -157 547 356 -227 164 469 780 921 -4 1019 -158 781 377 458 564 1559 15 641
7753 641 333 -589 -97 -69 1161 92 492 1301 -247 629 200 616 -742 -676 88 -592 -494 -663 -38 802
$$ packed form
7616i60J373J24N61k097R97M62o06m62R71p69Q13j148K249j947K62J085j310k55
7634f57J331n91p24Q33l37J19K32L40j249J016n76Q49r53k31Q01J25k69J5o68
7653e94M20k54N45r3n2q9p88J053K50p50J84q9q1j44R81r83N9l08J881j805O93
7674C6K8J55J11k51j98L27j00k63p59J325k69L7o06K2M06k27r17J820k271J858
7694B64o7l54j57J87J24Q42j098p0l0k36K24O26m26J45q5K41J05m70L48M50k66
7715B97o6J93p95J457k359J767L52j713K05J226p27J345m79l01m08P0J66P76l65
7734F41m52l46P04j91n83L91L05L11J41r25J023j177R39m04Q1J06R95j544O26
7753F41l08r22M92K8J230j069M00Q09j548Q76m29M16j358O6P64o80R8j69O25Q40
$$ plain form
7773 802 -264 -460 -466 585 -208 1 -417 -126 -307 -792 16 -362 -604 -440 -656 265 -374 -742 625 14
7793 14 -302 -1030 471 -484 -568 255 -563 -207 215 -391 -2 980 -686 -390 -798 -44 593 -716 289
7812 289 9 75 -488 -199 176 316 -91 -453 -370 402 -457 -75 173 128 -131 108 88 -240 40 202 425
7833 425 940 -190 -75 -157 891 28 124 184 94 723 713 -11 -223 219 231 28 -139 387 489 318 358 93
7855 93 202 803 -424 371 1750 796 484 164 -1016 477 -397 -132 -626 1385 470 -721 146 -513
7873 -513 1563 667 272 -90 903 960 107 288 1486 -613 294 -22 -209 751 281 822 775 884 294 -107
7893 -107 1250 -14 -319 -404 -557 131 -268 383 -43 19 -220 231 501 -386 -166 370 -94 -473 623 -71
7913 -71 142 62 -782 284 -605 -104 -155 612 -603 -89 268 327 -374 -616 802 -665 -289 -933 -1098 751
$$ packed form
7773H02j066j96oJ051p93K09m18K91j81m85Q08l78k42J64k16R21o39l68J367o11
7793A4l16p28J501r55q4Q23q18L56M22o06L89R82j666K96m08P54O37j309J005
7812B89k80O6n63K89L75J40m07l62Q3P72q59L82K48m5k59K39k0l28K80J62K23
7833D25N15j130J15q2J048q63R6O0r0O29j0p24k12M42J2k03j67N26J02j71M0k65
7855I3J09O01j227P95J379r54l12l20j180J493q74K65m94K011r15j191Q67o59
7873e13K076q96l95l62R93N7q53J81J198k099R07l16j87R60m70N41m7J09n90m01
7893a07J357j264l05q5j53O88l99O51m26O2k39M51K70q87K20N36m64l79J096o94
7913g1K13q0q44J066q89N01n1P67j215N14L57N9p01k42J418j467L76o44j65J849
$$ plain form
7933 751 -587 316 -767 -349 349 -31 746 630 837 -187 -652 -783 41 180 7 -740 71 -510 -177
7952 -177 1086 -151 -189 -513 563 500 -133 -229 469 -451 151 -233 -755 -451 -525 -320 1348 1143 -252 1406
7972 1406 106 788 -178 9 57 -575 163 171 629 175 318 -863 1044 -191 112 599 212 464 42
7991 42 -112 93 419 -406 -69 -109 1157 -852 1125 286 -656 -279 -370 710 680 -53 456 -62 -515 -420
8011 -420 -93 -264 295 15 201 724 102 355 359 -998 299 237 -521 312 -298 561 449 364 -569 85 -288
8032 -288 109 331 -511 732 231 62 -411 240 1153 -180 -743 181 -972 -356 -333 -836 -7 629 -272
8051 -272 -693 176 653 604 1145 -769 72 -13 -1160 -960 245 279 -1662 -2 456 -1070 -107 -1243 -920
8070 -920 -891 -48 -220 141 703 329 -145 -388 -415 144 -9 -136 -132 -348 -327 281 -90 25 -1109 45 235
$$ packed form
7933G51j338R03j083M18O98l80P77j16K07j024m65j31Q24J39j73p47Q11n81L33
7952a77J263j237l8l24J076o3o33r6O98r20O02l84n22L04p4K05J668k05j395J658
7972A406j300O82r66J87M8o32P38QM58m54J43j181J907j235L03M87l87K52m22
7991D2j54K05L26q25L37m0J266k009J977q39r42L77r1J080l0p33N09n18m53R5
8011d20L27j71N59k80J86N23o22K53Mj357J297o2p58Q33o10Q59j12q5r33O54l73
8032b88L97K22q42J243n01j69m73O51R13j333n63R24j153O16K3n03Q29O36r01
8051b72m21Q69M77m9N41j914Q41q5j147K00J205L4j941J660M58j526R63j136L23
8070i20K9Q43j72L61N62l74m74k43k7N59j53j27Mk16K1O08l71J15j134J154J90
$$ plain form
8091 235 -493 -324 -235 272 -207 -644 -983 309 -490 1034 1122 337 759 231 -86 388 -5 43 791 -129
8111 -129 480 -173 8 -743 391 658 864 1356 217 318 605 887 1006 89 -502 558 391 296 376 -73
8131 -73 -289 321 435 559 211 503 374 83 -397 -259 -264 98 71 -48 825 437 603 -42 34 90 -683 -798
8153 -798 -580 214 268 -683 -713 -299 164 117 177 -291 -390 93 627 -405 207 -509 -878 -1157 378 -88 -363
8174 -363 -686 43 23 -272 -306 -427 121 8 -177 940 -93 -969 171 -102 -1177 -401 -487
$$ packed form
8091B35p28J69Q9N07m79m37l39J292p99J524Q8p85M22n28l17M74l93M8P48r20
8111a29O09o53J81p51J134K67K06M92j139J01K87K82J19r17n91J060j67r5Q0m49
8131g3k16O10J14J24l48K92j29k91m80J38nL62k7j19Q73l88J66o45P6N6p73j15
8153g98K18P94N4r51l0M14M63m7O0m68r9M83N34j032O12p16l69k79J535m66k75
8174c63l23P29k0k95l4j21N48j13j85J117j033q76J140k73j075P76q6
8191d87
$$ Imaginary data points
##PAGE= N=2
##DATA TABLE= (X++(I..I)), XYDATA
$$ plain form
0 0 0 0 0 0 0 0 0 0 0 0 0 0 0 0 0 0 0 0 0 0 -1 6 -18 35 -54 62 -77 79 -86 92 -104 114 -134 151 -169 185 -203
37 -203 231 -254 275 -309 339 -376 420 -462 514 -581 634 -709 802 -905 1033 -1186 1381 -1630
55 -1630 1986 -2496 3331 -4910 8899 -16843 -102013 -22184 11287 -14985 -53698 -26432 -5138
68 -5138 -32985 -60079 -31444 -3518 -30275 -66629 -45821 -13520 -29919 -62397 -47659 -21251
80 -21251 -36335 -66740 -49322 -19273 -31754 -65801 -56224 -21721 -28249 -59559 -54524 -21742 -26644
93 -26644 -60447 -52019 -16129 -17228 -52759 -52186 -15129 -10508 -42436 -48015 -11053 -3495 -34522 -42867
107 -42867 -6597 7116 -23077 -37429 -3743 15858 -10193 -27216 2212 24032 -462 -19171
119 -19171 6364 32330 12238 -12039 11200 38287 20735 -3515 15929 44843 28776 5041
$$ packed form
0@%%%%%%%%%%%%%%%%%%%%jPk4N3q9J16j39J56j65J78j96K18k48K85l20L54l88
37b03M34m85N29n84O48p15P96q82R76j095J215j343J511j707J938k219K567l011
55a630L616m482N827q241J3809k5742q5170P9829L3471k6272l8713K7266K1294
68e138k7847k7094K8635K7926k6757l6354K0808L2301j6399l2478J4738K6408
80b1251j5084l0405J7418L0049j2481l4047R577L4503o528l1310N035L2782m902
93b6644l3803Q428L5890j099l5531N73L7057M621l1928n579L6962P558l1027q345
107d2867L6270J3713l0193j4352L3686J9601k6051j7023K9428K1820k4494j8709
119a9171K5535K5966k0092k4277K3239K7087j7552k4250J9444K8914j6067k3735
$$ plain form
131 5041 20465 50404 37057 9867 22537 53117 43715 14036 24226 55529 47087 18038 25237
144 25237 54937 52347 20832 23285 54933 55210 23035 20477 51181 55196 22320 14602 45716
157 45716 52589 21478 10712 38234 48858 21087 5363 30529 44412 17530 -877 21657
169 21657 38878 13663 -7574 12897 31268 9720 -13836 4070 23608 3751 -19278 -4505
181 -4505 16543 -616 -27064 -14332 9536 -4969 -33307 -22982 1571 -8514 -37161 -31336
193 -31336 -4730 -12218 -40639 -38949 -11910 -13812 -44235 -45584 -17278 -15700 -45010 -49513 -22448
206 -22448 -16017 -43334 -50528 -25675 -15587 -41379 -52227 -26702 -12938 -37760 -50337 -27197
218 -27197 -11756 -34035 -48076 -28499 -9999 -27550 -45643 -26265 -5027 -22539 -41310 -21651
$$ packed form
131E041J5424K9939j3347k7190J2670L0580r402k9679J0190L1303q442k9049P199
144B5237K9700k590l1515K453L1648K77l2175k558L0704M015l2876p718L1114
157D5716O873l1111j0766K7522J0624k7771j5724K5166J3883k6882j8407K2534
169B1657J7221k5215k1237K0471J8371k1548k3556J7906J9538j9857k3029J4773
181d505K1048j7159k6448J2732K3868j4505k8338J0325K4553j0085k8647N825
193c1336K6606p488k8421J690K7039j902l0423j349K8306J578k9310m503K7065
206b2448O431k7317p194K4853J0088k5792j0848K5525J3764k4822j2577K3140
218b7197J5441k2279j4041J9577J8500j7551j8093J9378K1238j7512j8771J9659
$$ plain form
230 -21651 -329 -15013 -36455 -19781 4970 -8262 -29786 -15675 11132 1533 -21628 -10786
242 -10786 16953 11455 -14770 -6674 21234 18625 -7678 -4185 24903 26076 1003 1672 28295
255 28295 32516 9387 5595 30335 38561 14759 8112 32860 42049 20436 10856 34468 45126
268 45126 24363 12024 33675 45574 28439 12375 31478 47954 28576 12264 29336 47492
280 47492 30417 11089 25713 44985 30652 9926 20605 41713 29674 7005 15195 36840
292 36840 26509 1878 8502 30424 24201 -1636 1639 22880 20795 -5069 -7117 16371 16300 -9347
306 -9347 -13370 9519 10870 -13745 -20382 1787 6510 -16942 -24873 -5191 1502 -20313 -32115
319 -32115 -11957 -2107 -23618 -36519 -18645 -5083 -25420 -40531 -23194 -9445 -26505 -43562
$$ packed form
230b1651K1322j4684k1442J6674K4751j3232k1524J4111K6807r599k3161J0842
242a0786K7739n498k6225Q096K7908k609k6303L493K9088J173k5073O69K6623
255B8295M221k3129l792K4740Q226k3802o647K4748R189k1613r580K3612J0658
268D5126k0763j2339K1651J1899j7135j6064J9103J6476j9378j6312J7072J8156
280D7492j7075j9328J4624J9272j4333k0726J0679K1108j2039k2669Q190K1645
292C6840j0331k4631O624K1922o223k5837L275K1241k085k5864k048K3488p1k5647
306i347m023K2889J351k4615o637K2169M723k3452p931J9682O693k1815j1802
319c2115K0158R850k1511j2901J7874J3562k0337j5111J7337J3749j7060j7057
$$ plain form
331 -43562 -27365 -11233 -25916 -44845 -31601 -12001 -24124 -43417 -32370 -12794 -21690 -42560
343 -42560 -33359 -12712 -19889 -39364 -33486 -11333 -13690 -34007 -31373 -9121 -9294 -30344 -28763 -5485
357 -5485 -3770 -24453 -26346 -2168 2143 -17521 -21572 859 7331 -10987 -17081 4180 14384
370 14384 -3865 -12392 7212 19995 3021 -7335 11332 24474 9637 -3209 13601 29685
382 29685 16669 1580 15873 34513 22021 4950 18576 37279 26354 8823 19485 38935
394 38935 30479 11541 18540 37684 32738 12774 17122 37227 34005 13574 16291 34841 34595 13365
408 13365 13244 33707 32878 13076 9399 29620 33279 10316 4910 22710 29215 8851 -225 18057
422 18057 26258 6926 -3830 11892 21539 3514 -8378 5493 17878 1673 -13249 251
$$ packed form
331d3562J6197J6132j4683j8929J3244J9600j2123j9293J1047J9576q896k0870
343d2560R201K0647p177j9475N878K2153k357k0317K634K2252j73k1050J581K3278
357e485J715k0683j893K4178M311j9664m051K2431O472j8318o094K1261J0204
370A4384j8249q527J9604J2783j6974j0356J8667J3142j4837j2846J6810J6084
382B9685j3016j5089J4293J8640j2492j7071J3626J8703j0925j7531J0662J9450
394C8935q456j8938O999J9144m946j9964M348K0105l222k0431K717J8550k46k1230
408A3365j21K0463q29j9802l677K0221L659k2963n406J7800O505k0364r076J8282
422A8057Q201j9332j0756J5722R647j8025j1892J3871J2385j6205j4922J3500
$$ plain form
434 251 11294 -2531 -18702 -7342 7555 -4656 -22915 -14077 3202 -8757 -26982 -19355 -1744
447 -1744 -9807 -29407 -24275 -6593 -12607 -31765 -27587 -9146 -12987 -31077 -32011 -12952 -13606 -32398
461 -32398 -33702 -15022 -12833 -31660 -35722 -16858 -11983 -30829 -34585 -16035 -10446 -27068 -34033
474 -34033 -16368 -7009 -22930 -32258 -16379 -3133 -17695 -29325 -12664 393 -12925 -24816
486 -24816 -11779 4099 -8496 -20993 -7666 7954 -1104 -16536 -5435 12228 5415 -10783
498 -10783 -1360 16091 11841 -5686 515 20196 16985 -1273 3651 23251 21163 4121 5622
511 5622 23815 25846 7964 7980 26087 30463 12833 9382 27023 32930 15061 10696 26474 34017
525 34017 17663 11059 25860 34592 19110 8520 24259 32892 19482 8572 19736 31788 18440
$$ packed form
434B51J1043j3825j6171J1360J4897j2211j8259Q838J7279j1959j8225P627J7611
447a744q063j9600N132J7682o014j9158M178J8441l841j8090r34J9059o54j8792
461c2398j304J8680K189j8827m062J8864M875j8846l756J8550N589j6622o965
474c4033J7665R359j5921r328J5879J3246j4562j1630J6661J3057j3318j1891
486b4816J3037J5878j2595j2497J3327J5620r058j5432J1101J7663o813j6198
498a0783R423J7451m250j7527O201J9681l211j8258M924J9600k088j7042J501
511E622J8193K031j7882J6J8107M376j7630l451J7641N907j7869m365J5778P543
525C4017j6354o604J4801Q732j5482j0590J5739Q633j3410j0910J1164J2052j3348
$$ plain form
538 18440 5307 17448 29342 17960 2000 13704 27393 17084 414 7758 23472 14766
550 14766 -2252 3334 18852 10608 -6974 -3156 12652 9026 -9289 -7626 8308 5098 -12681
563 -12681 -14035 1957 2152 -15635 -19194 -2101 4 -18500 -22078 -6850 -3711 -19828 -26262 -10906
577 -10906 -6016 -21506 -29223 -15364 -7399 -21799 -31596 -16687 -7800 -21505 -31657 -19412 -7220
590 -7220 -20525 -32022 -21697 -8004 -18499 -31056 -21771 -8043 -15063 -29975 -21918 -5281 -11635
603 -11635 -27199 -21171 -3804 -9668 -24250 -18655 -2583 -4308 -19388 -17454 371 -300 -14926
616 -14926 -13886 3346 6077 -10107 -11260 7039 9908 -4365 -8123 9201 15082 418 -4210
629 -4210 11136 19026 4610 -1297 12715 21748 9702 1384 16220 24858 13080 3840 16706
$$ packed form
538A8440j3133J2141J1894j1382j5960J1704J3689j0309j6670P344J5714q706
550A4766j7018N586J5518q244j7582L818J5808l626j8315J663J5934l210j7779
563a2681j354J5992J95j7787l559J7093K105j8504l578J5228L139j6117o434J5356
577a0906M890j5490p717J3859P965j4400r797J4909Q887j3705j0152J2245J2192
590g220j3305j1497J0325J3693j0495j2557R285J3728p020j4912Q057J6637o354
603a1635j5564O028J7367n864j4582N595J6072j725j5080J934J7825o71j4626
616a4926J040J7232K731j6184j153J8299K869j4273l758J7324N881j4664m628
629d210J5346P890j4416n907J4012R033j2046q318J4836Q638j1778r240J2866
$$ plain form
642 16706 27112 17494 6441 16440 29638 20613 7473 16094 30900 23043 8503 16256 29697
655 29697 23985 9089 13213 29182 24293 9542 11369 26025 23611 8252 9084 22941 22717 7066
669 7066 5180 19773 19990 4892 2421 17605 16924 1505 -2861 11700 13884 -851 -6529 6976
683 6976 11611 -3501 -11099 1271 9642 -5187 -14259 -3362 4774 -6359 -18723 -9162 2653
696 2653 -8973 -21832 -12094 -1820 -10838 -23903 -17546 -4135 -11868 -25929 -20164 -8024 -12685
709 -12685 -26301 -23393 -8317 -12390 -27472 -23589 -10156 -11727 -26402 -24317 -9403 -10696 -24446
722 -24446 -25190 -10259 -8299 -22878 -24112 -8952 -6168 -19595 -23025 -8125 -3179 -15497 -21481 -7279
736 -7279 -98 -12282 -18860 -5262 4311 -5794 -14999 -2940 7808 -1874 -11914 -1224 10655
$$ packed form
642A6706J0406r618j1053R999J3198r025j3140Q621J4806p857j4540P753J3441
655B9697n712j4896M124J5969m889j4751J827J4656k414j5359Q32J3857k24j5651
669G066j886J4593K17j5098k471J5184o81j5419m366J4561K184j4735n678J3505
683F976M635j5112p598J2370Q371j4829r072J0897Q136j1133j2364R561J1815
696B653j1626j2859R738J0274r018j3065O357J3411p733j4061N765J2140m661
709a2685j3616K908J5076m073j5082L883J3433j571j4675K085J4914j293j3750
722b4446p44J4931J960j4579j234J5160K784j3427l430J4900M946j2318n984J4202
736g279P181j2184o578J3598R573j0105r205J2059J0748r682j0040J0690J1879
$$ plain form
749 10655 1944 -8035 1357 13398 7119 -3646 2516 16284 10927 -541 5944 20120 14196 2948
763 2948 8061 21892 18193 7036 9100 22077 21317 8720 8578 22759 23424 9263 9694 23874
777 23874 24961 10265 8319 22116 25531 11964 7568 21691 25377 12449 5193 18765 26149
790 26149 13049 4824 15369 23272 12125 3161 12308 21340 10307 -194 7879 17632 8055 -2824
804 -2824 4008 14147 5319 -5691 56 11202 3195 -8395 -5285 7510 1481 -11982 -9293 4132
818 4132 -597 -14699 -12999 -430 -2092 -16622 -15666 -3707 -3261 -18373 -19464 -6962 -5655 -19372
832 -19372 -23400 -9688 -7062 -20060 -24902 -12071 -7477 -20341 -25881 -14075 -7886 -18698 -25337
845 -25337 -15115 -7671 -17066 -24855 -16079 -6309 -14049 -22264 -14576 -4277 -11227 -21625 -14044 -3187
$$ packed form
749A0655q711r979R392J2041o279j0765O162J3768n357j1468O485J4176n924j1248
763B948N113J3831l699j1157K064J2977p60j2597j42J4181O65j4161M31J4180
777B3874J087j4696j946J3797L415j3567m396J4123L686j2928p256J3572P384
790B6149j3100q225J0545P903j1147q964R147R032j1033j0501Q073R753r577j0879
804b824O832J0139q828j1010N747J1146q007j1590L110J2795o029j3463K689J3425
818D132m729j4102J700J2569j662j4530R56J1959M46j5112j091J2502J307j3717
832a9372m028J3712K626j2998m842J2831M594j2864n540J1806O189j0812o639
845b5337J0222P444r395p789Q776R770p740q215P688J0299o950j0398P581J0857
$$ plain form
859 -3187 -9487 -18606 -11503 -1039 -5160 -16442 -10528 2690 -1556 -13557 -8507 5733 1941 -9039
873 -9039 -6492 8212 6881 -5171 -3967 9745 11632 -843 -1595 10740 15390 2224 475 13346
887 13346 17836 6372 2990 14854 19897 7963 4015 14828 22664 12010 5213 14837 23815 13318
901 13318 5868 15452 23486 16044 7438 14417 23404 15249 6409 13207 22599 16133 5797 11526 22467
916 22467 16716 4076 8943 20222 15315 3040 5121 17662 14967 910 2216 13751 13118 -214
930 -214 -1211 10659 10351 -2355 -5376 6180 7947 -3779 -8730 3157 5079 -6513 -11169 -1690
944 -1690 3452 -8437 -13557 -4822 18 -10463 -17474 -8635 -1783 -11043 -20399 -11283 -4047 -12106 -21187
959 -21187 -13475 -5311 -13119 -22417 -14165 -5692 -12268 -22338 -17945 -6114 -11289 -22472 -18501 -6249
$$ packed form
859c187o300r119P103J0464m121j1282N914J3218m246j2001N050J4240l792j0980
873i039K547J4704j331j2052J204J3712J887j2475p52J2335M650j3166j749J2871
887A3346M490j1464l382J1864N043j1934l948J0813P836j0654o797R624Q978j0497
901A3318p450R584Q034p442q606O979Q987q155q840O798R392o466j0336N729J0941
916B2467n751j2640M867J1279m907j2275K081J2541k695j4057J306J1535o33j3332
930b14r97J1870l08j2706l021J1556J767j1726m951J1887J922j1592m656R479
944a690N142j1889n120Q735M840j0481p011Q839O852r260r356R116P236q059r081
959b1187P712Q164p808r298Q252Q473o576j0070M393J1831n175j1183L971J2252
$$ plain form
973 -6249 -8667 -21349 -19749 -7136 -8134 -19830 -18524 -5846 -5567 -16630 -16467 -4301 -3033 -14363
987 -14363 -15609 -3567 -927 -9795 -13214 -2743 3784 -7091 -10805 766 4631 -3778 -7989 2685
1001 2685 7501 251 -5273 3725 11542 3719 -3664 5678 14473 6956 -853 6699 16971 10422 1502
1016 1502 8523 19185 13537 3571 9130 20473 16395 5613 9515 20373 18164 6996 9868 20428
1030 20428 19291 7758 9112 19927 19706 8196 7350 17741 19824 8130 5404 16406 17779 7666
1044 7666 4439 14597 18363 7113 2256 11423 15552 5974 -872 8164 14213 3676 -3269 4788
1058 4788 10806 3167 -5892 629 8469 862 -9381 -3355 5748 -2040 -11215 -6951 3555 -3869
1072 -3869 -14003 -9124 211 -4993 -14990 -12443 -3423 -5607 -17628 -15690 -5181 -6255 -17109 -16873
$$ packed form
973f249k418j2682J600J2613r98j1696J306J2678K79j1063J63J2166J268j1330
987a4363j246J2042K640q868l419J0471O527j0875l714J1571L865q409m211J0674
1001B685M816p250n524Q998P817p823p383R342Q795p517p809P552J0272o549q920
1016A502P021J0662n648r966N559J1343m078j0782L902J0858k209j1168K872J0560
1030B0428j137j1533J354J0815k21j1510q46J0391K083j1694k726J1002J373j0113
1044G666l227J0158L766j1250m857R167M129r578o846R036O049j0537o945Q057
1058D788O018p639r059O521P840p607j0243O026R103p788r175M264J0506p424
1072c869j0134M879R335n204r997K547R020k184j2021J938J0509j074j0854K36
$$ plain form
1086 -16873 -7901 -6341 -16631 -19090 -7966 -6107 -16208 -18961 -9091 -6978 -15991 -19682 -9685 -4939
1100 -4939 -16111 -19308 -9653 -3804 -13456 -18400 -9726 -2249 -11187 -17093 -10004 -706 -8467 -15054 -6766
1115 -6766 229 -5605 -12878 -6420 3110 -2395 -10702 -5565 5728 2215 -7719 -3663 7355 3943
$$ packed form
1086a6873Q972J560j0290k459J1124J859j0101k753R870K113r013l691R997M746
1100d939j1172l197R655N849r652m944Q674P477q938n906P089R298p761o587Q288
1115f766O995n834p273O458R530n505q307N137J1293l513r934M056J1018l412
$$ [...]
8191A50
##END NTUPLES=NMR FID
##END=
