##TITLE=1H_Pr 2C6-nBoc
 200.13Hz, D2O.
 8 sc
30.8.7.2026
##JCAMPDX= 6.0         $$ Bruker NMR JCAMP-DX V2.0
##DATA TYPE= NMR FID
##DATA CLASS= NTUPLES
##ORIGIN= UXNMR, Bruker Analytische Messtechnik GmbH
##OWNER= pz
$$ XWIN-NMR		Version 3.5
$$ Thu Jul 30 13:31:10 2026 Russian Standard Time (UT+4h)  she@DPX200
##.OBSERVE FREQUENCY= 200.1313
##.OBSERVE NUCLEUS= ^1H
##.DELAY= (6, 6)
##.ACQUISITION MODE= SIMULTANEOUS
##.ACQUISITION SCHEME= undefined
##.AVERAGES= 8
##.DIGITISER RES= 18
##SPECTROMETER/DATA SYSTEM= spect
##.PULSE SEQUENCE= zg30
##.SOLVENT NAME= D2O
##.SHIFT REFERENCE= (INTERNAL, D2O, 0, 14.3821)
##AUDIT TRAIL= $$ (NUMBER, WHEN, WHO, WHERE, WHAT)
$$ ##TITLE= Audit trail, XWIN-NMR		Version 3.5
$$ ##JCAMPDX= 5.01
$$ ##ORIGIN= Bruker BioSpin GmbH
$$ ##OWNER= she
$$ F:/spectra/data/she/nmr/H-C/1/audita.txt
$$ ##AUDIT TRAIL=  $$ (NUMBER, WHEN, WHO, WHERE, WHAT)
(   1,<2026-07-30 13:29:47.10 +0400>,<she>,<DPX200>,
      <created by zg, POWCHK disabled, PULCHK disabled
       configuration hash MD5:
       00 E9 B6 7A A2 85 ED C7 34 08 36 98 17 FE 4E 26
       data hash MD5: 16K
       17 E5 F5 DF DF 2E 0D 02 18 14 9F 0E 1F 3F 52 A0>)
$$ ##END=
$$ 
$$ hash MD5
$$ AD F3 FC 55 5D 5B 5F 5F 53 56 40 8D 64 C5 7F 2A
##$RELAX= 
##$RELAX= 
##$RELAX= 
##$RELAX= 
##$RELAX= 
##$RELAX= 
$$ Bruker specific parameters
$$ --------------------------
##$DU= <F:/spectra>
##$EXPNO= 1
##$NAME= <H-C>
##$PROCNO= 1
##$TYPE= <nmr>
##$USER= <she>
##$AMP= (0..31)
100 100 100 100 100 100 100 100 100 100 100 100 100 100 100 100 100 100 
100 100 100 100 100 100 100 100 100 100 100 100 100 100 
##$AQSEQ= 0
##$AQ_mod= 1
##$AUNM= <au_zg>
##$AUTOPOS= <>
##$BF1= 200.13
##$BF2= 200.13
##$BF3= 200.13
##$BF4= 200.13
##$BF5= 200.13
##$BF6= 200.13
##$BF7= 200.13
##$BF8= 200.13
##$BYTORDA= 1
##$CFDGTYP= 0
##$CFRGTYP= 5
##$CHEMSTR= <none>
##$CNST= (0..31)
1 1 145 1 1 1 1 1 1 1 1 1 1 1 1 1 1 1 1 1 1 1 1 1 1 1 1 1 1 1 1 1 
##$CPDPRG= <>
##$CPDPRG1= <>
##$CPDPRG2= <>
##$CPDPRG3= <>
##$CPDPRG4= <mlev>
##$CPDPRG5= <mlev>
##$CPDPRG6= <mlev>
##$CPDPRG7= <mlev>
##$CPDPRG8= <mlev>
##$CPDPRGB= <>
##$CPDPRGT= <>
##$D= (0..31)
0 0.7 0 0 0 0 0 0 0 0 0 0.03 0 0 0 0 0 0 0 0 0 0 0 0 0 0 0 0 0 0 0 0 
##$DATE= 1785403786
##$DBL= (0..7)
120 120 120 120 120 120 120 120 
##$DBP= (0..7)
150 150 150 150 150 150 150 150 
##$DBP07= 0
##$DBPNAM0= <>
##$DBPNAM1= <>
##$DBPNAM2= <>
##$DBPNAM3= <>
##$DBPNAM4= <>
##$DBPNAM5= <>
##$DBPNAM6= <>
##$DBPNAM7= <>
##$DBPOAL= (0..7)
0.5 0.5 0.5 0.5 0.5 0.5 0.5 0.5 
##$DBPOFFS= (0..7)
0 0 0 0 0 0 0 0 
##$DE= 6
##$DECBNUC= <off>
##$DECIM= 32
##$DECNUC= <off>
##$DECSTAT= 4
##$DIGMOD= 1
##$DIGTYP= 9
##$DL= (0..7)
0 120 120 120 120 120 120 120 
##$DP= (0..7)
150 150 150 150 150 150 150 150 
##$DP07= 0
##$DPNAME0= <>
##$DPNAME1= <>
##$DPNAME2= <>
##$DPNAME3= <>
##$DPNAME4= <>
##$DPNAME5= <>
##$DPNAME6= <>
##$DPNAME7= <>
##$DPOAL= (0..7)
0.5 0.5 0.5 0.5 0.5 0.5 0.5 0.5 
##$DPOFFS= (0..7)
0 0 0 0 0 0 0 0 
##$DQDMODE= 0
##$DR= 18
##$DS= 0
##$DSLIST= <SSSSSSSSSSSSSSS>
##$DSPFIRM= 0
$$ [...]
##$SUBNAM0= <"">
##$SUBNAM1= <"">
##$SUBNAM2= <"">
##$SUBNAM3= <"">
##$SUBNAM4= <"">
##$SUBNAM5= <"">
##$SUBNAM6= <"">
##$SUBNAM7= <"">
##$SUBNAM8= <"">
##$SUBNAM9= <"">
##$SW= 18.0517328524113
##$SWIBOX= (0..15)
0 0 2 0 0 0 0 0 0 0 0 0 0 0 0 0 
##$SW_h= 3612.71676300578
##$TD= 16384
##$TD0= 1
##$TE= 0
##$TE2= 300
##$TE3= 300
##$TEG= 300
##$TL= (0..7)
0 120 120 120 120 120 120 120 
##$TP= (0..7)
150 150 150 150 150 150 150 150 
##$TP07= 0
##$TPNAME0= <>
##$TPNAME1= <>
##$TPNAME2= <>
##$TPNAME3= <>
##$TPNAME4= <>
##$TPNAME5= <>
##$TPNAME6= <>
##$TPNAME7= <>
##$TPOAL= (0..7)
0.5 0.5 0.5 0.5 0.5 0.5 0.5 0.5 
##$TPOFFS= (0..7)
0 0 0 0 0 0 0 0 
##$TUNHIN= 0
##$TUNHOUT= 0
##$TUNXOUT= 0
##$USERA1= <user>
##$USERA2= <user>
##$USERA3= <user>
##$USERA4= <user>
##$USERA5= <user>
##$V9= 5
##$VALIST= <valist>
##$VCLIST= <CCCCCCCCCCCCCCC>
##$VD= 0
##$VDLIST= <DDDDDDDDDDDDDDD>
##$VPLIST= <PPPPPPPPPPPPPPP>
##$VTLIST= <TTTTTTTTTTTTTTT>
##$WBST= 1024
##$WBSW= 4
##$XGAIN= (0..3)
0 0 0 0 
##$XL= 0
##$YL= 0
##$YMAX_a= 971708
##$YMIN_a= -857266
##$ZGOPTNS= <>
##$ZL1= 120
##$ZL2= 120
##$ZL3= 120
##$ZL4= 120
##$ABSF1= 10
##$ABSF2= 0
##$ABSG= 5
##$ABSL= 3
##$ALPHA= 0
##$AQORDER= 0
##$ASSFAC= 0
##$ASSFACI= 0
##$ASSFACX= 0
##$ASSWID= 0
##$AUNMP= <proc_1d>
##$AZFE= 0.1
##$AZFW= 0.1
##$BCFW= 1
##$BC_mod= 2
##$BYTORDP= 1
##$COROFFS= 0
##$CY= -3
##$DATMOD= 1
##$DC= 2
##$DFILT= <>
##$DTYPP= 0
##$F1P= 0
##$F2P= 0
##$FCOR= 0.5
##$FTSIZE= 0
##$FT_mod= 4
##$GAMMA= 1
##$GB= 0.15
##$INTBC= 1
##$INTSCL= 1
##$ISEN= 128
##$LB= 0.25
##$LEV0= 0
##$LPBIN= 0
##$MAXI= 10000
##$MC2= 0
##$MEAN= 0
##$ME_mod= 0
##$MI= 1.114404
##$NCOEF= 0
##$NC_proc= 0
##$NLEV= 6
##$NOISF1= 3.799351
##$NOISF2= 2.8
##$NSP= 1
##$NTH_PI= 0
##$NZP= 0
##$OFFSET= 14.38212
##$PC= 1
##$PHC0= -4234.899
##$PHC1= 23.5923
##$PH_mod= 1
##$PKNL= yes
##$PPARMOD= 0
##$PSCAL= 0
##$PSIGN= 0
##$REVERSE= no
##$SF= 200.129724274929
##$SI= 16384
##$SIGF1= 3
##$SIGF2= 2
##$SINO= 400
##$SIOLD= 16384
##$SREGLST= <1H.CDCl3>
##$SSB= 0
##$STSI= 0
##$STSR= 0
##$SW_p= 3205.1282051282
##$SYMM= 0
##$S_DEV= 0
##$TDeff= 0
##$TDoff= 0
##$TI= <>
##$TILT= no
##$TM1= 0
##$TM2= 0
##$TOPLEV= 0
##$USERP1= <user>
##$USERP2= <user>
##$USERP3= <user>
##$USERP4= <user>
##$USERP5= <user>
##$WDW= 1
##$XDIM= 8192
##$YMAX_p= 0
##$YMIN_p= 0
$$ End of Bruker specific parameters
$$ ---------------------------------
##NTUPLES= NMR FID
##VAR_NAME=  TIME,          FID/REAL,        FID/IMAG
##SYMBOL=    X,             R,               I
##VAR_TYPE=  INDEPENDENT,   DEPENDENT,       DEPENDENT
##VAR_FORM=  AFFN,          ASDF,            ASDF
##VAR_DIM=   8192,          8192,            8192
##UNITS=     SECONDS,       ARBITRARY UNITS, ARBITRARY UNITS
##FACTOR=    0.0002768,     1,               1
##FIRST=     0,             0,               0
##LAST=      2.2672688,     0,               0
##MIN=       0,             -857266,         0
##MAX=       2.2672688,     971708,          0
$$ Real data points
##PAGE= N=1
##DATA TABLE= (X++(R..R)), XYDATA
0@%%%%%%%%%%%%Qj2J2j6J6k4L2m0N2o0P2q4R8j19J41j66J89k18K55k89L30l76
34a99M26m83N44o12O86p70Q61r57J065j184J313j454J606j772J954k154K375k614
52a369K879l174L499l862M268m728N252n853O556p386Q383r609J1152j3150J5820
67H678j9459K3862k3532P27079J04747l20772J44982l72665p33338k89236N2084
78f97570J61368N53993M80093P5242j5750j18263m56144m16930j71427K8056L22747
89b54585M38592J98910J04624P532l19321l74508j52497j22883N7510L74710K48893
100B06977N4056J75833m1613m23092k19913J5964j50409K2831M16271K62516n6621
111B62800l0378k5399j79337k45002j47856J01809K43946Q1795L6126J79471J2436
$$ plain form
0 0 0 0 0 0 0 0 0 0 0 0 0 0 8 -4 8 -8 8 -16 16 -24 28 -32 40 -44 54 -65 76 -90 99 -119 136 -153 177 -199
34 -199 227 -256 288 -324 362 -408 453 -504 561 -623 690 -764 842 -930 1024 -1130 1245 -1369
52 -1369 1510 -1664 1835 -2027 2241 -2487 2765 -3088 3468 -3918 4465 -5144 6008 -7142 8678
67 8678 -10781 13081 -10451 716628 821375 500603 645585 272920 -460418 -749654 -697570
78 -697570 -536202 17791 497884 573126 557376 439113 -17031 -433961 -605388 -577332 -254585
89 -254585 184007 382917 487541 495073 175752 -198756 -351253 -474136 -416626 -41916 206977
100 206977 261033 436866 395253 -27839 -247752 -231788 -382197 -359366 56905 319421 262800
111 262800 232422 207023 27686 -217316 -365172 -263363 -19417 62378 98504 277975 290411
122B90411k35539j42828r1401j14094J30075K06176j3009Q3326J99940j45278
132A67779k67128J3614j3999j19128J08507J53922R25J01513Q9072j76471j45684
143h7078K8742n3015o0437J01427J16967P3175L2835q5831o5299K1801j04925
154h1638j11783J30375J10212n1711O2574R4108r1731p0901k098j01400j5258
165a29251J37357J2063l3850J10754K5132j20256l0441K616n3856K0369M6739
176a2624K87O4007M5497p1651j9629J4055q8831j8429Q8413j3829k903J05105
188H9468k5989r5002N9014J436j26781L4090J00150m9912p59Q5813l3125m2700
200d297L1834n8438n2551Q6018K1138n9338M9174N2970m6882j8794o691l8907
$$ plain form
122 290411 54872 -87956 -179357 -293451 -163376 42800 29791 113117 313057 167779
132 167779 -99349 -85735 -99734 -218862 -110355 43567 44492 146005 235077 58606 -87078
143 -87078 -58336 -111351 -171788 -70361 46606 119781 152616 66785 1486 23287 -81638
154 -81638 -193421 -63046 47166 -4545 58029 152137 60406 -10495 -12593 -113993 -129251
165 -129251 8106 20169 -13681 97073 122205 1949 -28492 -25876 -79732 -59363 -12624
176 -12624 -12337 51670 97167 25516 5887 19942 -68889 -87318 1095 -12734 -15637 89468
188 89468 63479 -31523 27491 28927 -97854 -63764 36386 -13526 -14285 71528 38403 -4297
200 -4297 27537 -30901 -83452 2566 23704 -35634 13540 66510 19628 834 -5857 -44764
212d4764L1890K7180n7199L0333Q6450m9670n0131N4053k4581o2010N2303K0346
224A4200m8488M5105M5131n8968r842L8196l8242k3670L6127n344l725L7048j1331
237A6197k1514K3335j6112l3251K4602P716j8185K8921J0249k8454K0386N622
249A9512n0844J4468M1866m3870j1718O4516r438m4321K7680P462l6199J2997
261g889J3203k2309J7721K1815k4771L90J7279k2442m781J8040j7274J07L1088
274B0177j5748j7044K9959p223l2101K1516R047k7567J9835K0652l2709M470L1976
287B5240k8285k0783L2189j448k3065J7892J0018j4770O030J448j3089R632K739
300C748j6997J2266J4009j7581K159J5185j7012n202J8869j2539j1232K3742o68
$$ plain form
212 -44764 -12874 14306 -42893 -12560 73890 24220 -25911 28142 3561 -58449 -6146 14200
224 14200 -34288 10817 55948 -3020 -12862 25334 -12908 -36578 -451 -5795 -9520 27528 16197
237 16197 -5317 18018 1906 -31345 -6743 973 -17212 11709 21958 -6496 13890 19512
249 19512 -31332 -16864 25002 -18868 -30586 33930 24492 -19829 7851 15313 -20886 -7889
261 -7889 5314 -16995 726 22541 -2230 -1840 15439 -7003 -11784 6256 -11018 -10911 20177
274 20177 4429 -12615 17344 10121 -21980 -464 8583 -18984 851 21503 -11206 -6736 25240
287 25240 -3045 -23828 8361 6913 -16152 1740 11758 -3012 3018 4466 -8623 1009 3748
300 3748 -13249 -983 13026 -4555 -2396 12789 -4223 -9425 9444 -3095 -14327 9415 8747
313H747j9717J5563O437k1640O785J3794j7557k53J8729r978p776J4409l247j2118
327g822P292K457n914N544r59m737J0561o69j4583P604Q859j3658L87J3109p518
342d7n067J1566m697q677J0066l8j0900P094P629r458j95P040l954k719L872k623
358a108j817M247j55j814K066j347q72K888l350k406N631J00n327L583L782n539
374a438j193M775j644k691K376M10j213J311M44k180M34J051n27n69P94J90q24
391d94L04J457l6l253O54K956n35k465R61J352l58j99r18l46R86J60l84O18q80
410d20M75J763j899k569L579J340m622Q48L871k544q54K868k667j110M835k149
426G45m438M497J791m083J617J256l496J971L179m988j26M222k558n19L431l752
$$ plain form
313 8747 -10970 4593 11030 -10610 -3825 9969 -7588 -7841 10888 910 -6866 7543 4296 -7822
327 -7822 -530 1927 -3987 1557 598 -4139 6422 5753 -8830 -1226 7633 -6025 -5638 7471 -47
342 -47 -5114 6452 1755 -6922 3144 3106 -7794 -700 6929 -2529 -2724 4316 362 -2357 1515 -1108
358 -1108 -2925 1322 1167 -647 1419 72 -800 2088 -1262 -3668 1963 2063 -3264 319 4101 -1438
374 -1438 -2631 2144 500 -2191 185 595 -618 693 1137 -1043 -609 442 -85 -654 140 330 -494
391 -494 -190 1267 1231 -2022 -1368 1588 1053 -1412 -451 901 543 344 -574 -920 66 226 -158 460 -420
410 -420 55 1818 -81 -2650 929 2269 -2353 -1505 2366 -178 -1032 1836 -831 -1941 2894 745
426 745 -3693 804 2595 -1488 129 1385 -2111 -140 3039 -1949 -2075 2147 -411 -930 2501 -1251
442a251j663O536k454n615N487K191n855K625K956n737J966N020o355r73P438
457D316l998m334O596j028n071N402L90o763M892L903p336J402N176n077K0N137
473C627n504j161P103l714m461O598o55o251O247J501p828M122M957o947K69N346
489C249m879p43O621n180k866P387k385n746O735L45o668M803K589o966L534M543
505D373p460J330O361n843k130P331l995m007P310j708o265O665R42p521M993
520C76L885p931J836O344o373l77O463o056j825Q502m268o027Q262q4p066N482
536A143K002p452M915M012q885K322O840o772j383P437m885l298P950k822o067
551d943P419O36p848N505L094p644L138N299p761J52P967n809k948P670l642m473
$$ plain form
442 -1251 -2914 3622 1168 -4447 1040 3231 -2624 1 2957 -2780 -814 4206 -2149 -3122 4316
457 4316 318 -4016 2580 1552 -3519 1883 2273 -4490 402 4305 -3031 -1629 3547 -1530 -1510 3627
473 3627 -1877 -3038 4065 351 -4110 2488 1833 -4418 1829 3330 -4498 -376 4581 -2366 -2097 3249
489 3249 -1630 -2373 4248 -932 -3798 3589 1204 -4542 2193 2538 -4130 673 3262 -3704 -170 4373
505 4373 -3087 -1757 4604 -1239 -3369 3962 -33 -4040 3270 1562 -4703 1962 2904 -4617 376
520 376 4261 -3670 -1834 4510 -1863 -2240 4223 -1833 -3658 4844 576 -5451 2811 2727 -4339 1143
536 1143 3145 -4307 608 4620 -4265 -1943 4897 -1875 -3258 4179 -706 -4004 3946 1124 -4943
551 -4943 2476 3112 -4736 769 3863 -3781 -643 4656 -3105 -2953 5014 -795 -3743 3927 285 -4188
567d188P858j548p811P458K815q880L194N128o494J340N566p367p06Q955m598
582G22n089P325j375n910O473M57p228N384L599q235K310O157o126q70O605n115
598i16k800P356k762n270P081l59o476M788K127o280L424M250p154P67O018m354
614e60k020N759l861k368N929j618n112N102J275n940L738K340n448K597M016
629C829o214j6N936m038k402N837k383l774N489n16n102M857J219n945K875L493
645C145n529J212M589n020m45N359l578k377N079j667m085M902N15n036L908J752
661B724n735K203L902m904O96M518m468j745N303j969l149M722q10m614L992J582
677B248m926K945K204m617P99M510m560l57M641l384k241M504j337l150M620l12
$$ plain form
567 -4188 3670 2122 -5689 1769 4584 -4296 -1102 4026 -2468 -1128 4438 -2929 -3635 5320 722
582 722 -4367 2958 1583 -4327 2146 2603 -4625 759 4358 -3877 -1567 4590 -1536 -2406 4199 -916
598 -916 -3716 3640 878 -4392 2689 2330 -4146 642 2769 -3511 -87 4163 -2991 -2224 3794 -560
614 -560 -2580 3179 -682 -3050 2879 1261 -3851 1251 2526 -3414 324 2664 -2784 -187 3829
629 3829 -2385 -2401 3535 -503 -2905 2932 549 -3225 2264 1748 -3354 1503 2722 -3223 -348 3145
645 3145 -2384 -1172 3417 -1603 -2048 3311 -267 -2644 2435 768 -3317 1585 2100 -2936 972 2724
661 2724 -3011 -808 3094 -1810 -1114 3404 -1064 -2809 2494 525 -2624 2098 1288 -3326 666 2248
677 2248 -2678 267 2471 -2146 -1347 3163 -1397 -1754 2887 -497 -2738 1766 429 -2721 1899 1587
693A587m670L455K226m846J566L465m518j7M299k846j736M357j737l167M253l27
709A344l817L399Q90m411K409K553l831O04L172l216r54L499j685j961L745p98
725I42l047L040M13l095K183J245l126R56K252k538j90K909k574o20K802j377
741A75j903K753l84k372K298P78k785J328J736k762K86K172k069k25K745j805
757c4j692K812n48j644K213l03j985J463J296k798Q36J994k329k8K309j774q38
774a050K293j245j238K097k24k326K269N66k275Q33J502k098L69J888j973l85
790i97J671p03q01J685o24j511J996J48j789J031Q93j576O57J077j507l01J806
807A155j334n87J745j049j165J997j22j696J629L21j961R34J097j447O0J524j439
$$ plain form
693 1587 -3083 372 2598 -2248 -682 2783 -1735 -1752 2547 -299 -2035 2322 585 -2582 1671 1344
709 1344 -2473 926 1816 -2595 -186 2367 -1464 -860 2312 -904 -1858 1641 -44 -2005 1740 942
725 942 -2105 935 1348 -1747 436 1681 -1445 -489 1763 -775 -965 1944 -630 -1250 1552 175
741 175 -1728 1025 641 -1731 567 1345 -1440 -112 1624 -1138 -852 1320 -749 -974 1771 -34
757 -34 -1726 1086 538 -1106 1107 804 -1181 282 1578 -1220 -384 1610 -719 -747 1562 -212 -1050
774 -1050 1243 -2 -1240 857 633 -1693 576 1142 -1133 -300 1202 -896 -527 1361 -612 -997
790 -997 674 -29 -830 855 231 -1280 716 864 -925 106 999 -577 80 1157 -350 -651 1155
807 1155 -179 -766 979 -70 -1235 762 640 -1056 573 894 -1067 -133 964 -483 -423 1101 -338
824c38m62J503p07p86J466l42j218J036K70j020P21N02j403O57J011j226k1J035
842F78p47p15J011K15r81P61K83j161Q99L26j175K00J213j029N5O68q74k41J048
861D34l15o08Q23k82m74Q70q0p64O06K40p02mO12m92k14P96n66k16O79j98n20
882c75P60m03l17M57M31o55j71N65q33L88P57q29J51M22l18l74M02K9l40K99K72
903C18n95KL59m11J96L10k59j1L24k07m59P72l56k67P10k23n92K86M38o56M53
924A32%k09j40K87l81K00L47l03K39k62r6QL50k03p4L31j33k30J84J14k03n0J27
947C5m8j10K90j56k19L93k05J65M3r5l07J74K22j17J69k85K02l03J59N5K48q8
969B22j13Q7j51R9k87K49K7j75q8N60o61K71r0o4L03q4J21k98M16k68Q6j86K11
$$ plain form
824 -338 -800 703 -4 -790 676 334 -884 152 422 -598 123 625 -778 -121 890 -336 -357 678
842 678 -69 -784 227 442 -539 222 505 -656 243 569 -606 -406 807 -222 -167 501 -373 -614 434
861 434 119 -489 334 52 -422 448 368 -396 210 450 -252 -256 356 -136 -350 446 -120 -336 343 145 -375
882 -375 385 -18 -335 122 553 -102 -273 292 -541 -153 604 -225 -74 348 30 -344 58 87 -253 46 318
903 318 -277 -275 84 -327 -131 179 -80 -91 233 26 -433 339 -17 -284 426 203 -389 -103 335 -321 132
924 132 132 -77 -217 70 -311 -111 236 -67 172 -90 -186 -178 172 -31 -105 226 93 -137 47 161 -42 -92 35
947 35 -13 -123 167 11 -208 185 -20 145 188 93 -214 -40 182 65 234 -51 151 -152 7 62 310 222
969 222 109 196 45 144 -143 106 133 -42 -130 430 -231 40 -50 -114 189 105 226 -72 344 76 162 -24 187
992A87j82o1j18K92j45K9N1J13j01j66k15M44k56J00J19m4k26R9R8j32J61OJ28
1015A81O7n56J82M46m39J04J44j03K5K05k46j57J96N9j77L6L27k97p3L02n7k23
1037e4J8k49K06J9j17J72M2pk63K83J79j10m79M20k55J05L07k94N7K69l92j17
1059b60M22k51N5QKk01K72K7l64K18J51j20l4L84l66r6N07m40j3M44k44l00K68
1082F9o4N8J96j37l00J54K08l44lK35J19j76K10J5j81RJ87l59K39K2j04j03K6
1105b4n2L4K70j82j41q7K53k81K56k34J23m1J22k15j8N47m37k3L13l13K16j35
1127d9j67j47N41j8k40M23j01n57M10r0k81L81J54k99j35L10l32J48K15R9n19
1148b54K59L03o87N61j75k13J18N05k31p5Q1j14m23N68j76l02M78o1m07L58K07
$$ plain form
992 187 5 -56 -174 118 -27 2 53 166 65 -101 -316 128 -128 -28 91 47 -179 -80 18 -114 47 53 181
1015 181 248 -308 -126 320 -119 -15 129 26 51 256 10 -147 49 108 -69 -33 294 -3 -76 226 169 -54
1037 -54 -36 -285 -79 -60 -177 -5 37 30 -233 50 229 119 -360 60 -195 -90 217 -77 -20 249 -143 -260
1059 -260 162 -89 -34 -26 -24 -225 47 74 -290 -72 79 -41 -75 309 -57 -153 354 -86 -99 345 101 -199 69
1082 69 5 63 259 122 -178 -24 184 -160 -163 72 191 15 225 240 59 68 255 -104 135 157 53 -50 -24
1105 -24 -76 -42 228 46 -95 -182 71 -210 46 -188 -65 -106 16 -199 -217 330 -107 -130 183 -130 86 -49
1127 -49 -216 -363 178 160 -80 343 242 -315 95 5 -276 105 259 -40 -175 135 -197 -49 166 265 -254
1148 -254 5 308 -379 182 7 -206 -88 417 186 111 192 78 -345 223 47 -255 223 162 -245 113 320
1169C20p21N36K65m99q9M74m66L63p7o1j11N21k3p13O58j06o76K27L70m04K38
1190B6M18n34j45L46k28J60l6L4j80M9J13l94O19j30k90J43K35n59J32L98l63
1211a86J10J98j49m26N49K97m54Q1L00o67M54K84n44L46r4l27K62K10l39k43N77
1232B39j63l75R49o85L8O6l04O2L33J67o02LN01l90%J58K11k36L58p3o38O06k3
1255B02n09L88J11n49L60K45k82J38J89j51l78L20l8k69N07j97l10M42n5j86j33
1276a55L66l14J70K8j21l68Q01m67l20N50J00m22J92K47l43L23j77j5l38L96k86
1297a53Q5L43k61l98M64j29O4J84p9k20J12J10k24j21L45j68M1K14q0m78N67j98
1319B0l96L13J84j27K15j54k27L31j78J5l21N70k50j49K14j30J32J49q1l85M42
$$ plain form
1169 320 -401 135 400 -99 -188 286 -180 183 106 45 -66 455 432 -281 377 271 -405 -178 192 -212 26
1190 26 444 -90 -235 111 -117 43 7 41 -139 -90 23 -371 248 118 -172 -29 206 -353 -221 177 -186
1211 -186 -76 122 -27 -453 96 393 -61 20 320 -347 107 391 -153 193 99 -228 34 244 -95 -338 239
1232 239 76 -299 650 -35 3 69 -235 -173 160 327 -275 -272 229 -161 -161 -3 208 -28 330 257 -381 225 202
1255 202 -307 81 192 -357 3 248 -34 104 293 142 -236 84 46 -223 284 87 -223 219 164 -22 -155
1276 -155 211 -103 67 95 -26 -394 407 -60 -380 170 270 -152 40 287 -56 267 90 75 -263 133 -153
1297 -153 -68 275 14 -384 80 -49 15 199 120 -100 12 122 -102 -223 122 -46 -5 209 129 -349 218 20
1319 20 -376 -63 121 -6 209 55 -172 159 -19 -4 -325 245 -5 -154 60 -70 62 211 130 -255 187
1340A87r7l37K33J59j39o7M44m61n0M78j01k36K48l08j56J51J60j53J36m0j63
1361a12L37l9j30k94J05J26Q8k1k08J10N0j6j69M71l27q1q5K47r3J00p3o2j7L59
1385B66m46m7L39j4k75L38j19l02O01j98l29L11l4qj6k9j18k14J52J28O1R5l50
1408b08j43N24l5k63M3K43k48J37K2j81L3M94p60J48L84l86j06M58M0k18L13l82
1430i1J08L4J41j72L12p8l05j03J50j2k66J51L52kk04m3M5k18L22k05j26K30k90
1453b70K81K41n9l57M79m16K05j0R7k56JK51j83J42J6k06j00P5n9P2K14n8l21
1476b21J83J4j13j06L30k74J53J36j84pK31j04J3kJ53l25J82J08n94K73K52O9
1498A67k45J55k59j18M14lj48P4O0k20L04J46j96k64L13j08J6j78k4Ol6J66k74
$$ plain form
1340 187 90 -247 -14 145 6 -61 383 -78 -128 350 249 13 261 -47 -203 -52 108 -45 91 51 -112
1361 -112 225 186 56 -238 -133 -7 81 60 -148 -38 12 -4 -173 298 -29 -110 -195 52 -41 59 -14 -76 -93 266
1385 266 -180 -227 112 98 -177 161 42 -260 341 143 -186 125 91 83 67 38 -80 -294 -142 -14 47 142 -208
1408 -208 -351 173 138 -125 -82 161 -87 50 72 -109 -76 418 -342 -194 190 -196 -302 156 196 -22 291 -91
1430 -91 17 51 192 20 332 254 -51 -154 -4 -16 -282 -131 221 219 15 -28 17 -201 121 -84 -210 20 -270
1453 -270 11 252 193 -164 315 -101 104 94 191 -65 -64 187 4 146 162 -44 -144 -69 -128 -56 158 100 -221
1476 -221 -38 -24 -137 -243 87 -187 -34 102 -82 -89 142 38 51 49 202 -123 59 167 -427 -154 98 167
1498 167 -78 77 -182 -300 114 111 -37 37 97 -123 181 327 131 -133 180 72 88 -90 -114 -108 -144 22 -252
1521b52K89k12j5L21j51O0j16L86l38l6L47j81k13J99k6K7%k41K83k21n1K20J79
1544B58k35K77m58L33l57K55J24J0k82J25r3J19M4o6K75l20k51L22J68k82Q6q8
1566c6K5j50L59j01j51J55n0j64L4l7J44k16J83J40l58K26j90M7L10p8k73K89
1588A08J98k54j70R8Q3j10K60j46K9k57M35m0l27L1N8J89Ql03k4J2J58L63n19
1611a20K73k52n6J52K1p7K18k65R1l54L31P2m96M32K1m1J1p2J39K7l57K73J47
1634A18j57j54K61r0j43M7l6l5J02J02j85J52k92K19q2J65L04k69j62L31k70j9
1656i3j9M4p6M22l43J58j69J2K09l4j33j16K28j7j92K19K45m60L15j45Oj46J99
1679A14k6p2Q7n1L20k38o0q8j4L59m20R4J99l23M77p4k21J64R1n54n0L12m9J13
$$ plain form
1521 -252 37 -175 -190 131 -20 40 -76 310 -28 -64 283 102 -111 88 62 89 89 -152 131 -90 -141 79 258
1544 258 23 300 -158 175 -182 73 197 207 -75 50 -43 76 120 54 329 9 -242 80 248 -34 52 -36
1566 -36 -11 -161 198 97 -54 101 51 -113 -79 -116 28 -188 -5 135 -223 3 -187 -140 170 92 -181 108
1588 108 306 52 -118 -20 63 -47 213 67 96 -161 274 234 -93 -62 -4 185 193 -110 -134 -122 36 399 -120
1611 -120 153 -99 -155 -3 18 -59 159 -106 -15 -369 -38 34 -462 -30 -9 -50 -39 -111 28 55 -302 -29 118
1634 118 -39 -193 68 -22 -165 -118 -154 -189 -87 15 -170 -18 -310 -91 -173 -8 296 27 -135 196 -74 -93
1656 -93 -112 -68 -144 278 -65 93 -76 -64 145 111 -22 -138 90 73 -119 100 345 -115 200 55 61 -85 114
1679 114 88 16 103 52 372 134 74 -14 -28 331 -89 5 204 -119 358 284 63 227 318 -236 -286 26 -23 90
1703I0n27O82k82L37l19N6k5m2J14j3p1K35k86O8l4L5J7n8n7j7K89p7k67L42q6
1728A04l59o0K88J0J01J06j20J85j97p6l4R5Q7j83J89j63l50N67k64K32R0n48
1750c00J00M61j90j46Q3j92J0M41l10k99L88J92k84K7O3j22LK9j0k6L84j76l61
1773b35M47K08o12L25O6j08Q7J11k88NK74j80k19L52l78K63J36j20l42K43R0l4
1795I1j71M39l09N0j24j21L04j49L99m68K30m0m09M78j60r1P1L92j77l15J25m0
1817Ek1K20j73k67J89R5j4J56k42n9M9L84l82r4L3kK41K43j32l25j77M79k45n0
1841h9J97o2K04m4j61j9L3j22o8K75J9k86L27Q2m17J50j75K60M2M4j29j53K66
1864A74k64K18k10M01p05N50k25J39l4q4J15lj68J61j22K77j2k79J64n4J06j21
$$ plain form
1703 90 -437 245 -37 300 -19 37 12 -30 84 71 0 235 -51 17 -17 18 35 -23 -80 -97 192 115 -152 190 104
1728 104 -255 -315 -27 -17 84 190 70 255 58 -18 -52 43 130 -53 136 -27 -377 190 -74 158 248 -300
1750 -300 -200 261 71 -75 8 -184 -174 267 -43 -342 46 238 -46 -19 44 -78 -75 -46 -56 -82 302 126 -235
1773 -235 212 420 -192 133 199 91 178 289 1 6 280 100 -119 233 -145 118 254 134 -208 35 125 91
1795 91 -80 359 50 100 -24 -145 159 10 409 -59 171 131 -278 200 40 -51 20 412 235 -80 45 5
1817 5 -16 204 31 -236 -47 48 34 190 -52 -111 -62 322 -60 -154 -121 -123 118 361 229 -96 -273 206 -39 -89
1841 -89 108 46 250 206 45 26 59 -63 -131 144 163 -123 204 286 -131 19 -156 104 146 190 61 -92 174
1864 174 -90 128 -82 319 -386 164 -61 78 44 -40 75 72 -96 65 -57 220 208 -71 93 39 145 24
1886B4k07R2j7J12j69J5J21Q0j19O5J39m14K77k90L93m5k88M21k18J62j73J68
1908A29j96j05mM02k91j19K11O9R5j85j08k2J4K29q7k50K22r5K42m4J02l30L0
1931i1L4L86l72J05M5p5J34k22k5j03J68q3J49k96K36%J37o4p9n6l3j0J51l1K45
1956B50l63N4L6R8l69M11k07J29J25O6l12K56k97N2M6N8j0j20K26j3k64M0K68
1979A60q8l37M06k83O3K33m70L97p5P2J6Q6q7m8o0M6r7J51M1j07l6M6J04p2k28
2004a67J89J62l69N24l73K33m60J43K18j50J26M7J4l19M47m50K54j2l7J30l35
2025a85K14J50m29J9N4K23M27o15K28O4O3k54M7K7M4j13L2M6Pk72L49l20J92J26
2049A24j05p3j11K25j79L35l45M65n97K20l8J60P4j35j46L18j94m3K05k54R3J4
$$ plain form
1886 24 -183 -91 -108 4 -165 -150 -29 51 -68 -3 136 -278 -1 -291 102 57 -231 190 -28 134 -39 129
1908 129 -67 -172 -176 226 -65 -184 27 96 191 6 -102 -124 -110 119 32 -218 4 -91 151 107 209 -121 -91
1931 -91 -57 329 -43 62 107 32 166 -56 -81 -184 -16 -99 50 -246 -10 -10 127 63 -16 -72 -105 -115 36 5 250
1956 250 -113 -59 -23 75 -294 117 -90 39 164 230 -82 174 -123 -71 -25 33 23 -97 129 116 -148 -108 160
1979 160 72 -265 141 -142 -79 154 -316 81 6 78 94 180 93 45 -15 31 -66 85 126 19 -17 29 133 61 -167
2004 -167 22 184 -185 339 -34 199 -261 -118 100 -50 76 123 137 -182 265 -185 69 57 20 150 -185
2025 -185 29 179 -250 -231 -177 46 473 -142 86 150 213 -41 6 33 77 -36 -4 42 49 -223 126 -194 -2 124
2049 124 19 -54 -165 60 -119 216 -129 336 -261 -41 -79 81 155 20 -126 192 -2 -45 160 -94 -1 13
2071A3j56L65j8m9k13R3l0J5o3k35L23q6J85J6k44l3k5K87j60J80k74P0Q1j35
2095i3N1j20l3K69N1k08N55m96o9P4L5lR7K04l90n7J24N4j32J85j33p0K17K6l67
2120b29J51J38j75M7L2K1k87K57k65M20j6j77j64L91m3k74P6J49j59j65L11L0
2142F9j1O4j21J87l09L06l5j08M1k87L03J03M0l13Q6l53N14j05J30k83Pj35L61
2165A51j98j71M8J71J5J6N1Q9k96K28J5m3K01k93J04r5n0K14m06L95k98J83j78
2188a47M5n8j06L82O0q8l7j47N1J43k55K02ok85N1M7J57l8Q1j16J66J1n40O90
2212B63k27k26L02l05K19K3K30l41J84k51L4mL9M5OJ8j58P9L4K33j22j50o5o6
2236b06N17m00Q2K83r3j39n5J5J62l8k38Q5R7k62L62r7J23l15J47n7J44n1j93
$$ plain form
2071 13 -143 222 204 155 -58 35 5 20 -43 -278 45 -41 144 160 -84 -117 -142 145 -15 165 -109 -39 42 -93
2095 -93 -42 -162 -195 74 125 -83 472 -24 -93 -19 16 13 110 314 -76 -133 -9 45 -87 98 -35 -105 112 138 -229
2120 -229 -78 60 -115 -68 -36 -15 -302 -45 -310 110 94 -83 -247 144 101 -173 -97 52 -107 -272 39 69
2142 69 58 122 1 188 -121 185 150 42 83 -204 99 202 242 -71 15 -338 176 71 201 -82 -75 -210 151
2165 151 -47 -218 -170 1 16 32 83 172 -124 104 119 76 277 -16 88 -7 -57 157 -249 146 -152 31 -147
2188 -147 -102 -160 -266 116 176 88 51 -96 -45 98 -157 45 39 -246 -195 -148 9 -29 52 -64 102 113 -427 263
2212 263 36 -190 112 -193 26 49 279 -62 122 -129 -95 -99 -60 -15 -9 9 -149 -70 -36 197 75 -75 -140 -206
2236 -206 311 -89 -7 276 183 44 -11 4 166 128 -110 -25 72 -190 172 75 198 -117 30 -27 117 66 -127
2259a27k6J99K35o0j45j01J05l81K72LK02k80J63j89O0j61P6K08o6j71N0J84M3
2282I3j63J08k61J69j77J36O0J12k37P8n5Q9jJ05K24l79K15j20p6Q1Q7K36k13
2305A11j58J58j28J29m93M26M0j18P5j52q4Q1K31k04L0LJ74N0j0j69k50K89K65
2328B96m01p4J09N1L6J38l35R1J12m7RQ4j65K17k78K61J39m63O6n3J79M7k6J19
2352A12m1j98j8J51j00L32j47k28J40q3KR0l32L32j40j94P5O5J71R8j99k51M98
2375A35r9J48p1k74K3J21J19j54J41l36L5M54k04L2m4R6k79K27l75N00j31j28
2397f4r5J75J40m40J57J1j18K13J41o4O0o7l09M89l17K09q8j32J97m8Oj41M5N1
2421A1K7J66m55N34l83M94n34K15q3l65K81J33r8j38Q8R8K14m77K39q9Q2L70l99
$$ plain form
2259 -127 -153 46 281 221 76 -25 80 -301 -29 -26 176 -104 59 -130 -70 -231 -155 53 -13 -184 -134 50 93
2282 93 -70 38 -223 -54 -231 -95 -35 77 -160 -82 -137 -48 -49 56 280 -99 116 -4 -80 1 88 324 111
2305 111 -47 111 -17 112 -381 45 85 -33 42 -110 -194 -113 118 -86 -56 -53 121 171 161 -8 -258 31 296
2328 296 -105 -179 -70 -19 17 155 -180 -89 23 -24 -15 69 -96 121 -157 104 243 -220 -154 -207 -28 19 -7 112
2352 112 71 -127 -145 6 -94 238 91 -137 3 -80 -78 12 -320 12 -128 -322 -247 -182 -11 87 -112 -363 135
2375 135 36 184 113 -161 -138 -17 102 -52 89 -247 -212 242 38 70 26 122 -157 70 -305 195 64 -64
2397 -64 -159 16 156 -284 -127 -116 -234 -21 120 56 116 49 -260 229 -88 121 33 -99 98 50 56 -85 -40 11
2421 11 38 204 -251 283 -100 394 -140 75 -8 -373 -92 41 -57 -195 -107 -9 205 -272 -33 -122 -40 330 -69
2444f9K42q2k06K61o4n6k22k71M50R9k10l2L86j71q8J76K6j33N2j63J48k70J69
2467b8J79n8J05l54M6J30O2R8o9j52J10N4mJ5l40K24K9o5L3q0J5J48j93j92M07
2492A20J8jJ7M2k27m4m1%O6L53k99J80L7k10L0J14j70q9L8j54K95J28k45J19j55
2517g8p9O1R0K07k74p2J29j44%O0K4K41o1j71N4n2K32q9J35k44j55J16n9J68k42
2542b03J84L29n1j43n6j57J22j4J71l45P7K4J58k91N6K67n9j80J90P0m52M67k27
2565f3j38Q4j4K88j15K40J30l32j18j64o4J61m5K01l11N96n51L07j89K1K09j83
2587e0K76l58J76J33r2k00N4J1N9o7O4j07O9J28n7p7J10p4O4j25O1j08J95N1N2
2612A88k28o2K34k21K67k26N4P2k94K27P5k65K17l8rK34k68L9K1j89P1N9O9R8
$$ plain form
2444 -69 173 91 -115 146 82 26 -196 -467 -17 82 -128 -160 226 55 -33 143 169 36 88 -75 73 -197 -28
2467 -28 151 93 198 -156 -110 20 82 180 111 -41 69 123 119 134 -206 18 47 -18 15 -65 -50 98 -95 -287 120
2492 120 138 137 154 196 -31 -75 -116 -116 -50 303 4 184 221 11 41 155 -15 -104 -66 -220 75 203 -42 77 -78
2517 -78 -157 -96 -6 201 -73 -145 -16 -160 -160 -100 -76 165 104 -67 -13 -65 167 78 213 -31 -186 -70 -129 39 -203
2542 -203 -19 310 259 116 60 -97 25 11 182 -163 -86 -62 96 -195 -139 128 69 -111 79 149 -303 164 -63
2565 -63 -201 -117 -131 157 42 282 412 80 -38 -202 -266 -105 -150 51 -260 336 -215 92 -97 -76 133 -50
2587 -50 226 -132 44 177 85 -115 -61 -50 9 -58 6 -101 -32 96 39 -38 72 -2 62 -63 -2 -110 85 136 188
2612 188 -40 -102 132 -89 178 -48 6 78 -216 11 86 -179 38 0 -9 225 -43 -4 17 -172 -101 -42 27 125
2636A25j61J7L12l87L16Km70N36n20L19K23l21L56k55p6J82m62J3M2K07k47J10
2658a39K73k22J14P3j54M7J86l58K2K04l68K46K51k30J19k95P8K53P0j10k51K61
2680G0k76K72k05K39j79M7L3jR6j08Q2p5m47N46k26K16n1r8R7j26J74j31j06J63
2704FO7j4P4j76j71K8J31k4j5J03l85M93j65J08K43k22R6j37J59j80J56j83j11
2727a19K44q2r4J80J35j69r2J8m1R6j42J5R9k51J39K12l5lj32J37l23O6L3j23
2751b32J23%N1K99j62j66L7K5J54K56j76j15j3k93J7j4J19m7K12j17Q6R1r6J27
2775A66r7k80K74J94l65K4J32j43O0J21R5j87j32R4P8L4L5k45J9J99j07J5K8M
2799A6J04j38J25j20K2P2j41J14j63K96k56J18J61q9j5m5L25j39l97L04O9qk22
$$ plain form
2636 125 -36 -19 293 -94 222 224 -246 290 -230 89 312 -9 347 92 16 198 -264 -251 -209 -2 -249 -139
2658 -139 134 -88 26 99 -55 -8 178 -180 -158 46 -322 -76 175 -55 64 -231 -153 100 170 60 -191 70
2680 70 -206 66 -139 100 -79 -32 1 0 96 -12 70 -5 -452 94 -132 84 33 -65 32 -94 80 -51 -157 6
2704 6 73 59 133 -43 -214 -186 -55 -79 -94 9 -376 117 -48 60 303 81 177 40 199 19 175 -8 -119
2727 -119 125 43 -51 129 264 95 3 21 -20 76 -66 -51 48 -203 -64 148 113 110 -22 115 -208 -142 -109 -232
2751 -232 -109 -109 -58 241 79 -87 -50 -25 129 385 209 94 81 -212 -195 -209 -90 -137 75 -42 44 135 39 166
2775 166 69 -211 63 257 -108 -84 48 -95 -35 86 181 -6 -138 -44 34 68 103 -142 -123 76 -31 -16 12 16
2799 16 120 -18 107 -13 9 81 -60 54 -109 187 -69 49 210 121 106 61 386 247 -150 154 223 215 -7
2822gK01m10j66M75j96K4L18l18m1R8M3p6J7j09J88K3j18mN1J2j46J86r9J87j64
2847c1j46k6P0K58j49R4q7K88m28O7Q0O0l5k90L60j86q8J95K14m62M15j75R1J76
2871B65j21k21J41j54j4k58L19oj20K82N7M5m19R9J82P2j82M4J03l28J69J88m04
2894b61M87l00K28j44n8JL8r1q1l7L30k1l05N03p3k97L3j5j20P9J17q5M4J6M9
2919C7j98K59l47J59R5N8o8r8j24K42L5l08L04L0j1k08L4P4K09j08l5j07k9p7
2943a82R3q9K52p8J27m91L87l20L41j08K12k7j74J34o9n1K06q5J87k29L0r1K6
2966Aj03k5k2J3K34j6k34O4Q5N0J5j18K07M5k36k61L27r9J00p7K3J74k36L83l26
2991c2o3l2q0L36k47M0No3O0j0K27k07J09j09J95j38K88k75K06j33j33R2j51J15
$$ plain form
2822 -7 194 -216 -382 93 -103 -79 239 -79 -120 -22 21 -55 -38 -147 41 64 -54 -58 -7 5 -141 45 -54 133 -31
2847 -31 -177 -203 -133 125 -24 70 -17 271 -157 -90 -10 50 15 -275 85 -101 -189 6 220 -242 173 -2 89 265
2871 265 144 -77 64 -90 -104 -362 -43 -49 -169 113 170 215 -204 -105 77 149 -33 11 114 -214 -45 143 -261
2894 -261 226 -74 154 10 -48 -47 -9 -100 -181 -218 112 91 -214 289 216 -81 -48 -63 -183 -104 13 -72 -28 -12 37
2919 37 -161 98 -249 -90 5 63 -5 -103 -227 15 50 -258 46 76 65 -143 -109 -35 174 66 31 -76 -105 -182
2943 -182 -89 -178 74 -4 123 -368 19 -301 40 -68 144 117 -57 77 8 -43 163 78 265 36 66 -25 1
2966 1 -102 -127 -149 -136 98 82 -152 -88 -3 47 62 -56 151 196 -40 -301 26 -73 27 -50 -27 147 -89 294 -32
2991 -32 -95 -127 -207 129 -118 -78 -73 -136 -76 -86 141 -66 43 -66 129 -9 279 4 210 77 -56 36 -115 0
3015@k04K13k5j65L16N6R0o4k79q4K97j08j40L34k81Q4q5j4%K60n47N67l8l50
3039a67K30m7L8K12l2m68K85K14l75J19p3q2L11q7j80M65m18q9J51R1l59K48l1
3062d4J84j43L7j96L47nk76K09rq4P6k01J43k88K56J35j11R4r5J32p1P6q7j83
3086a04J34l5%L6Q4j9o7l49M8K90l53K22O7L9l5J75k38J98O5Q9l51J93Q9l26J55
3111GJ72m9j90K2K1r2K47j05q0J9j33J99m5K20r4m54L21J04K0l05J51N8Q8k49
3135a47J09m0o3QL66j18l36J29lO5j1m6K66m44O84l22k11J08O0J03l35k2P6K32
3159A08n7l8q4k10L09M5j24J87k48l4K50p9j89J12K75m10L63j37m6j88j60N28
3181A73p0k72J69J14l29J40Q4l0j36K52J5l43J20K09N8j91K9l21L24j39J92m5
$$ plain form
3015 0 -204 9 -16 -181 135 191 281 217 -62 -146 151 43 -97 237 -44 40 -45 -59 -59 201 -346 221 183 -167
3039 -167 63 16 54 266 234 -234 51 265 -110 9 -64 -146 165 78 -102 363 -55 -144 7 98 -261 -13 -44
3062 -44 140 -3 34 -162 185 180 -96 113 104 20 96 -105 38 -250 6 141 30 124 29 161 90 166 79 -104
3086 -104 30 -5 -5 31 115 96 29 -320 -272 18 -335 -113 -46 -7 -42 133 -105 93 158 247 -104 89 178 -148 7
3111 7 179 130 -60 -38 -17 -109 138 33 -47 -28 -161 38 -7 213 119 -335 -14 90 110 -195 -44 14 102 -147
3135 -147 -38 -78 -141 -133 233 115 -221 -92 -95 -30 -41 -87 179 -265 419 97 -114 -6 54 157 -178 -200 -124 108
3159 108 51 13 -71 -281 28 73 -51 136 -112 -146 104 25 -164 -52 223 -187 176 39 -7 -195 -355 173
3181 173 103 -169 0 114 -215 -75 9 -21 -157 95 110 -233 -113 96 154 -37 -8 -329 -5 -144 48 3
3203CJ02n3j08R1o3lm1p0O5k4K98q4n5j7l3O9O9n2l04O01l59k71M59k34L96n33
3229a51J61l11L76p7j49K89l36J28K43M4l11%J33Jr7J91p6j65J6lK86m20K95J21
3253A88j76l5L6J01l65K61RJ57n5r4j27K69j63K94k43K61k35n6K70l07N2l2K47
3276B57p2k48M33n63L4J82k02L26j72J39k2j48P9n8K70m00M06k62J32O3j22p5
3298b3O4k7K09k17N2L8J1k27L29o7j71J8n5K8N1j21J62p9j24L96m20J07J34Q2
3322A50j2n9r6J73r9p9Q3j70L2J86l1m4P6l17K92k94L91K7j07L7j24j51J92Jl22
3347b65M09l8K8j31P0j99L53r9j54M9J65j74J16n1o5j34o0J98Pk00M07l52L04
3370A84l48qK09k87P04n50q8J9J54N8M1j83J18q1j5N2K5P3l65m2L06J45j67o7
$$ plain form
3203 3 105 52 -56 35 -28 -31 -72 -142 -77 -101 197 113 58 41 8 77 146 94 -210 391 32 -239 220 -14 382 -151
3229 -151 10 -301 75 -2 -151 138 -198 -70 173 217 -94 -94 39 40 -57 134 58 -107 -91 -94 192 -228 67 188
3253 188 12 -23 13 114 -251 10 19 176 121 27 -100 169 6 300 57 318 83 27 297 -10 42 10 257
3276 257 185 -63 370 -193 -159 23 -179 147 -25 114 92 -56 23 -35 235 -165 241 -21 111 174 52 -23
3298 -23 41 14 223 6 58 96 107 -120 209 142 -29 -11 -66 -38 13 -108 54 -25 -149 247 -173 -66 68 150
3322 150 138 79 -17 156 57 -22 61 -109 -77 109 78 34 110 -207 85 -209 182 209 102 139 15 -136 56 57 -265
3347 -265 144 106 134 3 73 -126 227 128 -26 23 188 14 130 79 14 -120 -180 18 25 -175 232 -120 184
3370 184 -164 -172 37 -250 454 -96 -184 -165 -11 47 88 -95 23 -58 -73 -21 4 77 -288 -330 -24 121 -46 -113
3394a13j42K82K05k80J18K9j91J87J0k98J38j8P9Jl4J66k01O5Q0L62k30j35K10
3417B90k33j36K69j63m9J02r9N1J24k62L12p2j16J37j84q7L27n2q0o01O56k13
3439g9M48k63j4J53l32l4LK19m20K40J23J17j7k15k3L14r3j44O0k36K97m5l64
3462c05J37Q9j17J66p6J06k02J39O7K65k22n4j10JM02j99m2j24QO1o8J72J35j28
3486A01l3k60K27q6J60l5l27J97N3J43j75K5J39r1j2j26J42N6p7n2J01k57p3K21
3510c9k87K45k50L06j86K48k24J28j6k48M71j61J4RK27p1K7l3k17J12k94K40l3
3533c2O7k13K19J50k03L20j34j33o8k24M19j04ql05K34m2N6k38J26O7j22J09j47
3556b06L20k85K73p1R6j08j20J87J77m30M4K0J29O0k77K72J42k58n4N7n0q5J62
$$ plain form
3394 -113 -255 27 232 -48 70 99 -92 95 105 -193 -55 -73 6 7 -27 139 -62 3 83 445 215 80 290
3417 290 57 -79 190 27 -22 80 -19 32 156 -106 206 134 18 155 -29 -116 211 159 79 -522 134 -79
3439 -79 369 106 92 245 -87 -121 -118 101 -319 -79 44 161 144 -71 -94 220 127 -17 43 -193 104 59 -305
3462 -305 -168 -79 -196 -30 -106 0 -202 -63 4 269 47 -7 -117 -116 286 87 45 -79 -71 -10 -78 94 229 101
3486 101 68 -192 35 -51 109 74 -253 -56 -3 140 -35 -10 129 38 26 -100 42 98 21 -31 70 -187 -260 -39
3510 -39 -326 -81 -331 -25 -211 37 -187 -59 -75 -323 148 -13 1 10 237 166 193 160 -57 55 -239 1 -32
3533 -32 35 -178 41 191 -12 308 174 41 -27 -251 168 64 56 -249 -15 -57 -1 -239 -113 -46 -168 -59 -206
3556 -206 114 -171 102 31 127 19 -101 86 263 -167 -123 -103 26 86 -191 81 223 -35 -89 -32 -82 -167 -5
3579ek4m4K43l02K95l30J33j85K05k46L47j31K38l50P5K44j82RN7j40q5J65J87
3602A74k19J5m0j5K78j09j14m2J14J16j55j05R3mo4o6m9J90M16m51R6j05J1k7
3626f2M9j30K34k60K10Q1K4q4l0O6j84M6k83K50n3NP0n3J78j93J75k83L45J07
3650B25j71O5p6j9N3l8K70k05j65J75k22M4Q0n3J38k29j5J03j78J87K08m55J73
3673a05K4MK36l90J27J30M5k36K15k2r9J01K5j56O4J04k89J66J96l85J80P5j38
3696a28L7L00K90n04J08j29k10K45J16k98J50j42L12k15M0N9j05M3J06r0j56J88
3718A7k59K42J38l39L75R2j25j21L8L3l65L42k1j24M4J22K39m11L02m35K92j86
3740a10K35k22Q3k2MK85l04J03k53K26k66L07j33M6L54m34O3K84l66l2O1J6n5
$$ plain form
3579 -5 -29 -73 170 -132 163 -167 -34 -219 -14 -260 87 -44 194 -156 -81 163 -19 -10 47 -93 -178 -13 174
3602 174 -45 -30 -70 -85 193 84 -30 -72 42 158 3 -102 -9 -13 -77 -143 -192 -2 414 -37 59 -46 -35 -62
3626 -62 -13 -143 91 -169 41 122 146 62 32 98 -86 -40 -323 -73 -126 -121 -51 -104 74 -119 56 -227 118 225
3650 225 54 119 43 24 77 39 309 104 -61 114 -108 -64 16 -37 101 -128 -143 -40 -218 -31 177 -278 -105
3673 -105 -81 -77 159 -231 -104 26 71 -165 50 28 -71 30 55 -101 -37 67 -222 -56 140 -245 -65 10 -128
3696 -128 -91 209 499 -5 103 -26 -236 9 125 -173 -23 -165 147 -68 -28 31 -74 -31 75 -15 -171 17
3718 17 -242 0 138 -201 174 266 141 20 58 91 -274 68 47 -77 -33 89 328 -83 219 -216 76 -110
3740 -110 125 -97 -14 -36 -32 253 -51 52 -201 25 -241 66 -67 -21 333 -101 -38 246 -120 -152 -91 -75 -130
3763a30K17j93K76O6k38j9l0K69j84P0j31k0K43l29J16r6K15Jj46J71k25K57j61
3786aj6p6J43o8J58K3q1n6Q0j20j34J1J32r5L48k21K2r5K42k73N3j35K61k02k0
3811a20K01qJ11k84J42O2R2k57k16KJ28L74k53j3J32J45j23k54J27m1j10J09J22
3834F8P0j43N9k91K75l12K97K06l62j0m2j6J00J33M1j18J00M0K5L0P9k53Q2K1
3858G9j41p8J09l5K6L09k60j68L02k44J63j01Q5k5J43k20j38K06Jj31J03L4n3
3881c4j2j33O8j9j48P5K21j01k24O06k73j78pJ05o0K2L8MJ57m18M88k03l20K07
3905a39J99k63J9P4j3j4j7j15M45K8q1j91p2M4J31j48J51o9O0J28j21j37L6L28
3929B63k86j88K0O0j44L18k9J26L9l71J6M6K03J09m00K15j59O1M3R8k36L13K98
$$ plain form
3763 -130 87 -106 170 236 -2 -21 -51 218 34 104 -27 -47 196 -133 -17 -113 102 103 -43 128 -97 160 -1
3786 -1 -17 -93 50 -18 140 163 82 26 106 -14 -148 -137 -5 -100 248 27 49 -46 196 -77 -24 -159 102 -100 -120
3811 -120 81 73 184 -100 42 104 196 -61 -277 -275 -147 227 -26 -39 93 238 115 -139 -12 -53 -163 -54 68
3834 68 138 -5 54 -237 38 -274 23 229 -133 -143 -185 -201 -101 32 73 -45 55 95 120 150 229 -24 58 79
3858 79 -62 -140 -31 -66 -40 269 9 -159 143 -101 62 -39 46 21 164 -56 -194 12 13 -118 -15 19 -34
3881 -34 -46 -179 -111 -130 -278 -203 18 -83 -307 299 26 -152 -159 -54 -114 -92 -54 -50 107 -311 177 -26 -346 -139
3905 -139 60 -203 -184 -110 -123 -137 -154 -269 176 204 123 -68 -140 -96 35 -113 38 -31 29 157 36 -101 -65 263
3929 263 -23 -211 -191 -131 -275 43 14 140 179 -192 -176 -130 73 182 -218 -3 -162 -101 -58 40 -196 117 415
3952D15n24Q4J58k11J53k20R0J5KK8L0J36n4r5J15k91Q9k1RK52j15j57P8n1M1
3977d4j48J45K70j43j87J14j82K01p1J1N0n7k00L09j48kj09K47m41M97j31j8J04
4000F7O0j02K42J4k21k85J67L24j83l90M22k1j96j2p3K28O3m67M53lko1j71R4
4024e3Q8l22M65j50l76K06M88k04j15O2j9k51J99j37M08m88J94J50K02l16kJ8
4046D7L19n68M0L8J37L19l17N3j18P3l5k16K40j22J15n3nl8K21o9k03K16q6K33
4070B21l50J41M1Mk4k21J72L3l7r1Q5N6J82j90N2k05J10J21j3j33J55j53K34j28
4094F2m10M97l73L29m77n9M08N2j58j2K23J21m09K43j73J6k9L1K87l09K16K7j84
4117h1J70k75J26R1J27O2k06L6q2J87k23J3K06l22K9k3R1J56M0l03J11j53k6K23
$$ plain form
3952 415 -109 -25 133 -78 75 -145 -55 -40 -38 -10 20 156 102 7 122 -169 -80 -101 -92 160 45 -112 -34 -85 -44
3977 -44 -192 -47 223 80 -107 7 -175 26 -45 -34 16 -41 -241 68 -80 -82 -191 56 -385 112 -19 -37 67
4000 67 127 25 267 281 60 -225 -58 266 83 -307 115 94 -102 -114 -187 41 104 -363 90 87 85 24 -147 -53
4024 -53 35 -287 178 28 -348 -142 346 142 27 89 70 -181 18 -119 289 -199 -5 145 347 31 29 47
4046 47 366 -202 -162 -124 13 332 15 68 -50 23 -12 -228 12 -110 5 -48 -53 -91 130 61 -142 74 -12 221
4070 221 -129 12 53 57 33 -188 -16 17 -20 -111 -26 30 212 22 74 -131 -21 100 87 -46 109 -44 190 62
4094 62 -348 149 -224 105 -372 -431 -23 29 -129 -141 82 203 -206 37 -136 -120 -149 -118 169 -140 76 103 -81
4117 -81 89 -186 -60 31 158 220 14 50 -32 155 -68 -55 151 -171 -142 -165 -74 82 122 -181 -70 -223 -249 -26
4141b6k8N9J72k78K02m54K78J71q8L49j55j79Ok15J42m2p9O7L5%O8r6J76m4l29
4166b88M24j6M8k74PJ93k28J35r6J9q7j23M52J29l18J06L82o47L31j29K02j08
4188A14k53Q5L01p3k96J91p9l7QN1J09l8j7r1j03j3K21M1J3k08k33J30K53K5j38
4213c7K5j11R1k5J43k3K04j80o0n9J03j4n9J48k40L92J2j90q7K36j78k07O2j44
4237a98J47L3K23m04K50Q0Nk0K3l10K70j50l2K35lk62K53r1N1k70j1K07N4m9j76
4262a45K4M8J35r4J21j41n6L90m03L9l9jJ0j27J73L4l40L91Q6o2j78J37q9R2K79
4287B84r8m52J10J42R7k15k14J29L42k47L1J40j72L59j14k57J44O1k60J19q9L17
4309A57k41j9J88j3J75l70L31j23m8j72L13j5j34R7k70K71J63l09j11K36k29k0
$$ plain form
4141 -26 -54 5 177 -101 101 -353 -75 96 8 357 202 23 29 -186 -44 -86 -165 -98 -63 -63 5 -91 85 41 -288
4166 -288 136 120 168 -106 -99 94 -134 1 -95 -76 -163 -286 166 295 -23 83 465 -182 149 20 222 114
4188 114 -139 -54 247 174 -122 69 -10 -47 -39 12 121 83 66 -25 -128 -141 80 121 134 -74 -307 -177 76 101 -37
4213 -37 -12 -123 -32 -57 86 63 267 87 27 -32 71 57 -2 146 -94 298 310 120 33 269 91 -116 -54 -198
4237 -198 -51 -18 205 -199 51 131 136 116 139 -171 99 -51 -83 152 149 -113 140 49 100 -170 -181 26 80 31 -145
4262 -145 -121 -73 62 -32 89 -52 -108 282 -121 -82 -121 -122 -112 -239 -66 -32 -372 19 105 43 -135 2 -87 5 284
4287 284 186 -266 -156 -14 83 -132 -346 -217 125 -122 -91 49 -123 236 122 -135 9 70 -190 -71 -160 157
4309 157 -84 -103 85 72 247 -123 208 85 37 -135 178 163 29 126 -144 127 290 -19 -130 106 -123 -143
4331a43J81J6m6Rn2K3p4J01R4L3J9k61J6Q9R9J1j04R4j91J94j04K50k77J01l0
4356D8j04L27j26o6J52k87L6pr9m9K11j88J30K01j08o7p6L63k37p9L5R5k58J55
4380BJ80q8J21k26J43l74K92k75J28K73j55rk2K26K05m07j4p7j12K44k0J06j07
4403C4n3lk5k03J79J55k32K37l2pL58j62n21K84k21L75o0k29Mq0K44J23k9R7k68
4428c5J50N0k1J30k30j89N3L23j88j67j70P02k30j68oN3j78O9j99K59J94k43q7
4451a28K56k90K66J40l06J19l4N9l49K49J22r7O6j54L1n6p1K91r0j7j84L28k58
4474a07j54K38q4n8J63o1Q7j42Jq0K62j6j28J4l7K53j99M2j9k41K92p8jr0J77
4499C4j02J07k73R5K68N4k42M2N4J50l1j08q4J78J31k22M8n9K76k61L6k8r4K32
$$ plain form
4331 -143 38 54 8 17 -35 -12 -86 15 109 142 161 -100 -84 5 104 115 11 105 -86 108 4 254 -23 78 48
4356 48 -56 271 145 79 231 -56 -20 -27 -126 -175 36 -152 -22 179 71 4 -72 291 54 -25 10 105 -153 2
4380 2 182 94 215 -11 132 -242 50 -225 -97 176 21 12 -10 216 421 14 0 -77 -189 55 35 141 34
4403 34 -19 -22 -47 -250 -71 84 -148 89 57 50 408 246 -275 9 -212 163 103 -126 -122 -202 42 165 136 233 -35
4428 -35 115 165 144 274 44 -145 -92 231 43 -124 -294 408 178 10 4 57 -121 -52 -251 8 202 -41 -128
4451 -128 128 -162 104 244 -62 57 23 82 -267 -18 104 7 73 -81 -50 -106 -177 114 24 7 -177 151 -107
4474 -107 -261 -23 -107 -165 -2 -63 24 -118 -117 -197 65 49 -79 -65 -102 151 -48 -6 -25 -266 26 -52 -53 -143 34
4499 34 -68 39 -234 -139 129 183 -59 -17 37 187 156 48 -36 142 273 51 99 40 316 55 91 63 -31 201
4523B01k07N4j30RJ69j02K68k70k75K68RN3l27K79K87l22j00J36J93l57L14P4
4545B24j11l79K21K47m34K41q9K08l8j14J09j23K39l66N6J31j84L20k1k11J81
4566A07j09k30L20j9k88L22k40J77j60J16P2J02o0j74P3r2L5K60lM0k21R4j66
4589d4q2J4J45K76l61K4J33O0l01K45j66L39k46o3K41j68O4j27j9k11K47l4K79
4612B45j13k49J05j80K19Ro0O5j95L0m6K31J8j72J57j8m78M29K96k55j1k00L39
4635A66k07k3J41R6j44K49k23j33O8m5K08j7k72J40R5J29l60R0q9J32L8k39m5
4658b45J34K63k8O3k80J50o2q1K81Q0k62K50k40j72K34k50L55k49k4L70j6k33
4680C8j48J89L8o2M8p8p1K33j01K32k54j76J92l7Q4j57K0J54q9L5k61N3J67j14
$$ plain form
4523 201 -6 48 -82 -73 96 -6 262 -8 -283 -15 -6 47 -280 -1 286 -36 -136 0 193 -164 150 224
4545 224 113 -266 -45 202 -232 9 -80 128 90 -24 85 -38 201 -165 -109 22 -162 158 137 -74 107
4566 107 -2 -232 88 69 -219 103 -137 40 -120 -4 68 170 110 -64 9 -83 -48 212 209 249 28 122 -44
4589 -44 -126 -112 33 309 -52 -28 105 165 -136 109 -57 282 36 -27 214 46 110 -17 -36 -247 0 -34 245
4612 245 132 -117 -12 -192 27 36 -24 41 -154 -124 -170 61 79 -93 64 46 -432 -3 293 38 27 -173 166
4635 166 -41 -64 77 173 29 278 55 -78 -10 -55 153 136 -136 4 99 228 -132 -42 -131 1 39 -200 -245
4658 -245 -111 152 124 187 -93 57 -5 -86 195 275 13 263 23 -149 85 -165 190 -59 -83 287 271 38
4680 38 -110 79 117 55 103 25 -46 187 86 318 64 -112 80 43 127 -30 -10 144 55 90 -171 -118 49 -65
4704f5LK54p2j23L4n1j00N6K73l04j7J42j30O0J22l46J29R1M8j0j92Q5m1L1M00
4729B77j82L03o43M44Q3j98j58J20J87m31K67k8j17l8L87l89O2oM9L6L5R4j33
4752B1K7N6j38J97j45Q3k4k01J45L5l0J27k66m3M40j82L5N5j12j08J39k18NK42
4776A40j10M6k11J46O5pj89J4L17k03oq7K57k15K65k00R4q9q5Q4M3K64J2k46l67
4801b68K40J07Q6j26j45K78j97k91M64j40p1K75l86J93o8P1J32p3k2L1k75L39
4823A54j85J09j17rk12M66j99R9k13J06Q9Oj38j53J78k12L11P3J7j96Q6J26m7
4846A39k93K66k94K89n3k25K07J58j47k3l12J32J13K10k02j60J74kp5N5qL0K56
4869B35l31j88K80mp0j20L47k37lk4K05Qj82M6K59j27J33k74j25J86k70m5K71
$$ plain form
4704 -65 -62 192 120 -3 31 -20 -120 -64 209 -95 -112 30 -100 -40 82 -264 -135 -44 4 -6 -198 -113 -154 -123 277
4729 277 95 398 -245 199 282 84 -74 46 233 -198 69 41 -76 -114 273 -116 -54 -60 -11 25 60 154 21
4752 21 48 104 -34 163 18 101 77 -124 21 56 26 153 -113 -156 284 102 137 192 80 -28 111 -107 -102 140
4776 140 30 76 -135 11 76 69 -120 -106 211 8 2 -85 172 -43 222 22 116 27 -58 26 69 333 345 99 -268
4801 -268 -28 79 165 39 -106 172 -25 -316 148 8 -63 212 -174 19 -49 22 154 81 59 90 -185 154
4823 154 -31 78 -39 -48 -260 206 7 106 -107 -1 88 94 -44 -197 -19 -231 80 153 170 -26 60 186 139
4846 139 -154 112 -182 107 54 -171 36 194 47 24 -288 -156 -43 167 -35 -195 -21 -23 -98 -43 -51 -21 235
4869 235 -96 -284 -4 -8 -78 -198 149 -88 -91 -115 90 98 -84 -38 221 94 227 -47 -172 14 -256 -301 -30
4892c0N2J69k01j43N8L49m28K39j68J47k84J63L63k83o6k22M36l39J36K0Q9p2
4914a5J66k57M6j5m2j04N08k36l8N2j50K18k02J41k30R2K12j90k08J78J12k10
4936a72P6m8K1J72j42N2K83j71j42o8L89k38m5J64j52J45j34j8n4J08nJ3m0N5
4960D9J58k47J26K3l06K81r7j66J13jj8M3j84K49K0R0j86mj53K57q3j88p5M3K20
4985c6J52k13k9L58k32k75J10K04q0m0L26l64K33j07R4j02J28k2l03J14M28m62
5007a18J31J54l28R1J22J77k51J2J05k9k89P2K60j62k18M29K8k95J23R8J54l47
5029h1K98l16K68j25L10k29r7K55m36J74J6J73k06Kk53R3J44j10K01or5K21j93
5052HQj8k00M0J55j8J64L4j46L0j74j34J53R7O8j86J96j25J88K8k1j98J62L7K8
$$ plain form
4892 -30 22 191 -10 -153 -95 254 -174 65 -103 44 -240 -77 286 3 -63 -285 151 -188 -52 -32 57 -15
4914 -15 151 -106 -60 -75 -117 -221 287 51 13 65 -85 133 -69 72 -158 -66 146 -44 -252 -74 38 -172
4936 -172 -96 -144 -123 49 -93 -41 242 71 -71 -139 250 12 -33 131 -21 124 -10 -28 -82 26 21 34 -6 49
4960 49 207 -40 86 109 -197 84 -13 -179 -66 -67 -85 -42 -226 23 43 133 -53 -57 -210 47 -36 -224 -299 -256 -36
4985 -36 116 -97 -126 232 0 -275 -165 39 -41 -81 245 -119 114 7 101 -1 127 105 -198 -84 344 -118
5007 -118 13 167 -161 -70 52 229 -22 -10 95 66 -223 -151 109 -53 -271 158 186 -109 14 112 266 -81
5029 -81 217 -99 169 44 354 125 28 283 -153 21 37 210 4 6 -247 -154 -10 -120 81 75 -20 201 8
5052 8 16 -2 -202 -162 -7 -25 139 173 27 57 -117 -251 -98 -1 67 -119 77 -48 140 168 147 -51 111 148 176
5077A76o8N9l49K12r9j85K68K87j80k54K42Ll21L55k00J47k62K52k50l2K21Mj5
5100A1J97m65J00L11m8j37n5J50j00Q8j39J57r7J88j50J15K8m02O14n14K22K1
5122I5p9j16k52M48m2k51J89J91k58P5N3k67K63l8M0P5q5j43J09k2r0Rj63J28
5146a31J81j16J6J93j38k0k3j87J20L3pK05j60J29k78K85m7k27J87K9J01L5j65
5169A5k78K72J41m70L28J33m52J98J94j39KK62j72J46l99L8L34j16j76M2OM8j05
5192a48K39n5q4J58k34L45j33j25k56L01pJ53j47j22J8L4J02J56k68j01L85k88
5214g7K7j51K53k05K60k07K5M23l62J09k24J3J73q9j29K84J5j91oN0j6m0K06j53
5238a2j49q3K39J0k0P9J72j58Q4j12Lk13j16L38J01l7j31K16k56j01M53k03N6
$$ plain form
5077 176 108 167 -182 30 -69 -254 14 301 121 -133 109 112 -209 146 -54 93 -169 83 -167 -199 22 26 11
5100 11 208 -257 -157 154 106 -31 -86 64 -36 52 -87 70 -27 161 11 126 154 -248 366 -148 74 95
5122 95 16 -100 -352 96 54 -197 -8 183 -75 0 53 -214 49 11 51 126 41 -102 7 -15 -105 -96 -259 -131
5146 -131 50 -66 -50 143 5 -15 -38 -225 -105 -72 -79 126 -34 95 -183 102 55 -172 15 44 145 180 15
5169 15 -263 9 150 -320 8 141 -311 -113 81 -58 -56 206 34 180 -219 -181 153 37 -139 -97 -91 -43 -148
5192 -148 91 36 -48 110 -124 221 88 -37 -293 8 1 154 7 -115 -97 -63 39 195 -73 -174 211 -77
5214 -77 -50 -201 52 -153 107 -100 -75 348 -14 95 -129 -116 57 -32 -161 123 138 -53 -59 -9 -25 -65 141 -12
5238 -12 -161 -244 -5 5 -15 64 236 78 162 50 53 -160 -276 62 163 126 -5 211 -45 -146 307 104 160
5261A60j34j35K51m28J90J03L9O4K0L8m7j46rq6j47m5J88p3p7O05m61j82M93j18
5285F3Q3m81K68k2J01j52J39R5p6n1j7k7K4J23j33j69L64Kj84L1j30O1j36K85
5309F1m3j92J9L35k04j3J62j47Q2j12n7K05kpj06j61L59k07L28m60O4K69j01q2
5333a0J40l83K15m8R1J41j77J16l3N6K3j36k5M0r4p3K29O0j06j06N6l9p5K35k9
5358F8k0J3L9j43l4j00J18k8R2K6J59P6m98J35m4K11J3k1j26N2J70j60j71J91
5382A8J86j91K26j72k11J04J89k66J2Q0NJ03J07j11k07j36J69m4J68N6R8k80p3
5405a70m0k6K86k58K69n3Q2N0k4j44J57K8K23k13j10L1n0j50J03O3r3K48k54J50
5429A05k35K78j04k85K57j51o2J83j31K20j72O3K21k87O6J80j51J23N3j38j82
$$ plain form
5261 160 26 -109 142 -286 -96 7 46 110 130 168 121 -25 -34 -120 -267 -312 -124 -197 -274 331 -130 -312 181 63
5285 63 146 -335 -67 -89 12 -140 -1 94 18 -33 -50 -77 -53 70 -63 -232 132 134 -50 -19 -149 -88 -224 61
5309 61 18 -174 -155 180 -24 -37 125 -22 60 -52 -109 96 94 87 -19 -180 179 -28 300 -160 -96 173 72 -10
5333 -10 130 -253 -38 -86 5 146 -31 85 52 108 131 -5 -30 10 -84 -157 72 132 26 -80 -24 -63 -138 97 68
5358 68 48 61 100 -43 -77 -177 -59 -87 5 31 190 266 -232 -97 -141 70 83 62 -64 -12 158 -2 -173 18
5382 18 204 13 239 67 -144 -40 149 -117 -105 -25 -20 83 190 79 -128 -264 -95 -139 29 85 183 -97 -170
5405 -170 -210 -236 50 -208 61 8 90 140 116 -28 129 157 380 167 57 88 38 -112 -9 54 -39 209 -45 105
5429 105 -130 148 44 -241 16 -135 -197 -14 -145 75 -97 -34 187 -100 -34 146 -5 118 171 33 -149
5450a49L11j05j6l9J82j27M6j35K63j83j00L30k24j37J30j07O7j37K47p2Rj42
5472h8J02K35k17k92R4O2R7M8k83J95J52j05N9l39K59j00Q1P8l9K04K2k35J80
5495A70j59J3K69l67M21l42M6J69k18Q2J98k01k4Nl92O81m13K3O8j88J46j78M01
5518B10l14k25N85k66N3O1l7J34k95l6n4J67J04j49K92l36J89l6j05JJ09Mj35
5541g9O5k12J52Q2l0j6j8Q5J24j69n9Q8P2J5m08J97K68N2j46l71M62j64k65M08
5565A33pl7Qk8j3l10L68k80J13K14l20J39k67L87L8r8R6k82L65l02j42J63N2K31
5589B21k77K33n9j68Q8j14r1K58O8L7n8k99L38j47k78K72J02j89N3o7N8M8j4J76
5613A91j86k59O06m80m6L16J38k55j88L04m72L90j19p7K09k7k16JL01m7P5J02
$$ plain form
5450 -149 162 57 41 2 184 57 103 -32 231 48 -52 278 54 -83 47 -60 7 -130 117 45 54 -88
5472 -88 14 249 32 -260 -166 -104 -7 41 -242 -47 105 0 59 -280 -21 -121 -40 38 -1 203 225 -10 170
5495 170 11 24 293 -74 347 5 51 220 2 84 282 81 57 62 -330 351 -62 -39 29 -159 -13 -191 210
5518 210 -104 -329 256 -10 43 104 67 201 -94 -130 -184 -17 87 -62 230 -106 83 47 -58 -57 52 56 -79
5541 -79 -14 -226 -74 8 -22 -38 -56 29 153 -16 -75 13 85 100 -308 -111 157 209 63 -308 154 -10 -275 133
5565 133 126 89 97 69 56 -254 114 -166 -53 161 -159 -20 -287 100 138 40 136 -146 219 -83 -225 -62 -10 221
5589 221 -56 177 118 -50 38 -76 -167 91 159 196 138 -161 177 30 -248 24 126 -63 -10 -77 -19 29 15 191
5613 191 5 -254 352 -128 -174 142 280 25 -163 141 -331 59 -60 -137 72 45 -171 -170 131 84 159 261
5635B61m14K82j62p9J59K43k03K5j23J92k33KJ64k00P4m5J30k15J97k0k43J35
5657g3J37l2J40k54K0r7J28l5N9r2l2J95P6l5j22L7p8j88K14J47K0j73K63j63
5681F2R4j41J26k86K52q3P6r2j01L22k29M7q9K84k92q9K55k22K14J93m21L56j58
5704G8l44n0M82k28M4J19k61L9Q4k94M32j89j2J61j76K05p9j37K86ln6j26R4j38
5728f9k1M8J33r6R2q6R9k88j28K88J07k04L33j41j27j19J29J1J55j24J26k4P5
5751A69j75J62k25PQ0k86M58m21J63l4J88j0Jk09K97j21j8K58l36l55M13k95J46
5774a43J02j54K50o0M6P9k1k37J0K52k4L0K15n00J54k23L37k27J14R6J8k50j10
5797b46K41R8L09l70j09j31K20K91k51l5R0j8n6j1O4J01q0pm09K80P5nr9P5j62
$$ plain form
5635 261 -153 129 -33 -112 47 290 87 112 -11 181 -52 -50 114 -86 -12 -57 73 -142 55 35 -208 -73
5657 -73 64 32 172 -82 -62 -159 -31 -66 -7 -99 -131 64 140 105 -17 20 -58 -246 -32 115 135 -38 225 62
5681 62 156 15 141 -145 107 24 100 8 -93 229 0 47 -42 242 -50 -139 116 -106 108 301 -120 236 78
5704 78 -266 -316 166 -62 -18 101 -160 -121 -37 -331 101 -88 -100 61 -115 90 11 -126 160 157 101 -25 69 -69
5728 -69 -90 -42 91 -5 87 1 100 -188 -316 -28 79 -125 208 67 -60 -179 -50 -39 116 -8 118 94 169
5751 169 -6 156 -69 -62 18 -268 190 -231 -68 -102 86 76 77 -132 165 44 26 284 -52 -407 6 -289 -143
5774 -143 -41 -195 55 -5 41 120 99 -138 -128 124 100 130 345 -155 -1 -224 113 -114 0 96 114 -136 -246
5797 -246 -5 93 402 32 -77 -208 12 303 52 17 107 89 33 22 86 187 107 100 -309 -29 46 41 -58 17 -145
5822a45n9P5J89j39mJ19p8k98K94J5L8L31k13j27Mj57j5k7P2J27j29J05lJ54r7
5847C2j09M15k33j96J05o6m3J37j04J73k16K98j90R7l30K62J56L3l37L18j58n4
5869a0J7QOK63k51k29L28k67K53J62j20k16j12J95J60l0N9k86K51j97q9k24M78
5892A49j50j44j1n9K43k32K25k79L77q5j87J60K52j28k52K25K75m72J64k88J26
5913i1m2N6J29j19r5k8L13k77J03L6k21J19L5K73l27J81l34M53k7Oj64M9p9L33
5937B82l69P5N3j11ok4K18j96j03k2J88R6k59P4K3Q7M8k74L19q3l63N54p5k30
5961i8oQ5P9J61m3lj28q5l2M5n4M1N2m09M17J61O5n33J01K94j88M2O0%j48N03
5987C79l97j63J80j1Q2ol1J1J70j15k22k4Q3j0K51l83L37j98J75p2j28n7K77j65
$$ plain form
5822 -145 -204 -129 60 -79 -83 36 -42 -340 -46 -31 7 338 125 -2 2 -155 -170 -197 -125 2 -127 -22 -25 129 32
5847 32 -77 338 105 -91 14 -52 -95 42 -62 111 -105 193 3 100 -230 32 188 221 -116 202 44 -10
5869 -10 7 15 21 284 33 -196 132 -135 118 280 160 -56 -168 27 187 157 216 -70 181 -16 -105 -329 149
5892 149 -1 -145 -156 -215 28 -204 21 -258 119 34 -153 7 259 131 -121 104 379 -93 71 -217 -91
5913 -91 -133 -77 52 -67 -162 -190 123 -154 -51 -15 -236 -117 -82 191 -136 45 -289 164 137 143 -21 28 -51 282
5937 282 -87 -12 41 -70 -76 -100 118 -78 -181 -203 -15 81 -178 -104 -81 6 54 -220 99 16 -347 207 132 -98
5961 -98 -104 -19 60 221 178 175 47 -38 -70 -25 -79 -38 14 -395 22 183 248 -285 -184 110 -78 -36 24 24 -124 379
5987 379 -18 -181 -1 -12 70 64 33 44 214 99 -123 -147 -64 -74 177 -206 131 -67 108 36 -92 -149 128 -37
6011c7J92l79J60m9L02j87J49l57J68J01j77J51J42m8Onj45J34q9j10M6J10P9
6034A57n4j1p4l9o4K51j06m9j18J32P8P7j46l2J64k28P4L9P1j33P6j7K06k99j1
6059e6j4J17j21o1L93m7j37j42j65L59r0j11o2ML45Q7J0l29J36m9J33m15O3r2
6083b44j49O39l07Rp0J84k09O6K36j01j34j60J67j01L67l59J26l00L89j3j19J93
6105A10k28J3Q5m9kJ59nJ46m08J54j70N23o1m34kL5J70l16J29K80l09J60L06j83
6129A03j07o2K22n8j16j41J4J96j44o6J77M8r0Lk0J92k62L08j34k27Q5K78l07
6152a08K50j97J0N0N3J7l44N71l47l0n8K00j06k2r6J42K70k79L03k52j83l3L70
6175A81k45L2m7R3J23j86j38M6K36k65J03j5J14K7K3j92K91r5j06n4k3Q3K01j59
$$ plain form
6011 -37 155 -224 -64 -113 189 2 151 -206 -38 63 -114 37 179 131 137 132 -13 121 32 -78 -32 78 157
6034 157 103 92 18 -21 -85 166 60 11 -107 25 103 180 34 2 166 -62 12 51 122 -11 65 48 254 -45 -56
6059 -56 -70 47 -74 -135 258 211 74 -68 -233 126 36 -75 -137 -133 212 299 309 -20 116 67 200 -215 -152 -244
6083 -244 -393 246 -61 -52 -122 62 -147 -81 155 54 -80 -240 -73 -174 193 -166 -40 -340 49 36 -83 110
6105 110 -118 -105 -20 -69 -71 88 83 229 -179 -25 -195 328 267 -167 -169 -134 36 -280 -151 129 -180 -20 286 103
6129 103 -4 -66 156 98 -18 -159 -145 51 -93 -159 18 66 -24 -21 -41 151 -111 197 63 -164 -79 199 -108
6152 -108 142 -55 -45 5 58 75 -269 302 -45 -75 -133 67 -39 -61 -157 -15 255 -24 279 27 -156 -189 181
6175 181 -64 -32 -79 14 137 -49 -187 -141 95 -170 -67 -82 32 59 82 -110 181 86 -20 -74 -97 -14 187 28
6199B8k03L79j87j34j07J99J55k93j7K99m2lJ13k59L1M3l1K16m44N64k18j1k2
6222E6r3m5K69m5j32m33K11K32q5R9j10N6k81K20K38k53Qk1L9J27Km7Nj22J33
6247B8j39K08k75Q1K20k20J36r7M65k71m1j71M2k4Q0J94l41J03N0O0j00j51J46
6270a7R3P9r0N2K7j96M2jJ69K34j34k53P8Kj91R7K5q5l7M9K4J54j63J6J56j46
6296a6L1j13P5J56Q7p5k51K83m39L27k19j42L10p3p8J88k83N32m08R9K53l14J92
6319A22k37K68k37J77j49j31L53j95Q1k31M26k64R2p8m0J36k49J98j89N0j74K04
6341f7K20R2k03j10j33R9L04J27l80J02n1j57KJ31P4Q4k49k9R9M7J17j61j22J64
6365@L7j40J88k79K99J20j80k3m7L08j33m50Q1K50R4k43N6L01n6j03k29K24J0
$$ plain form
6199 28 -175 204 17 -117 -224 -25 130 -163 -180 119 77 74 187 -72 -41 2 -29 187 -257 307 89 78 56
6222 56 -37 -82 187 142 10 -423 -212 20 -65 34 -76 -20 -301 -81 157 -96 -88 -109 -70 57 59 12 17 -105 28
6247 28 -111 97 -178 -97 123 -97 39 -58 407 136 95 -76 -34 -58 22 216 -125 -22 28 88 -12 -163 -17
6270 -17 76 155 65 117 144 -52 -10 -11 158 392 258 5 83 85 -106 -9 16 -69 -106 -57 -33 121 -42 -26 130 -16
6296 -16 15 -98 -23 133 220 145 -106 177 -262 65 -154 -296 14 -59 -137 51 -232 300 -108 -9 244 -70 122
6319 122 -115 153 -84 93 -56 -187 166 -29 52 -179 247 -17 75 -3 -43 93 -156 42 -147 -97 -271 -67
6341 -67 153 245 42 -68 -201 -102 202 329 -51 51 0 -157 -155 -24 50 134 -115 -144 -45 2 119 -42 -164 0
6365 0 37 -103 85 -194 105 225 45 22 -25 283 150 -300 -219 31 125 -118 -62 239 183 80 -149 75 85
6388H5j80L29l97K15l5q8o0K15rk77J42j34L65k4J25j27l78K65j12k2J69q3J77
6411A61j24n8j77K17j40K42K5k05N44k26l94r1J99N5l2J38J6n4J14k2j32M6P8
6434A80m62M09j27J61J8o7P6j79k08J21K07p7K66m51o4K97j51r6Q9R2j16J15k75
6457b42J84l0J67o5j33L21k27L01l67K13j79K11j48J09l02L78j30J4J07j53J28
6478A57j63K02j66O1K5r7j9J79r2j57J15M7q6J74l90J97M6p7J29K27k67M1J17
6501B03j87J64m80J41P1K44j71m7q1J90J55m71K62k20P3J32j13J61J60l15L7K26
6523A34j95J45j76n2l9J66J45j59k03K61kj16k1O7O9N3q4R4j50J41k90K12o4K01
6547A37k8l56L34j42J92K07r7k4k93R2j7j69K07J84pk60K80k75J42k22NJ35qK10
$$ plain form
6388 85 -95 234 -163 52 17 -71 -131 84 75 -202 -60 -194 171 147 272 145 -233 32 -80 -102 67 -16 161
6411 161 37 -21 -198 19 -121 121 146 -59 485 259 -135 -226 -27 28 -4 134 150 96 210 188 56 102 180
6434 180 -282 127 0 161 179 112 188 9 -199 -78 129 52 318 -133 -197 100 -51 -147 -58 34 -82 33 -242
6457 -242 -58 -88 79 14 -119 202 -25 276 -91 122 -57 154 6 115 -187 191 61 75 182 29 157
6478 157 -6 196 30 91 116 19 0 179 87 -70 45 92 6 180 -210 -13 33 -44 85 312 45 86 203
6501 203 16 180 -300 -159 -88 156 -15 -62 -143 47 202 -269 -7 -227 -154 -22 -135 26 186 -129 -92 134
6523 134 -61 84 -92 -144 -183 -17 128 -31 -234 27 25 -91 -112 -45 24 77 -7 87 -63 78 -212 0 -64 137
6547 137 109 -247 87 -55 137 344 247 223 -70 22 5 -164 43 227 220 -40 240 -35 107 -115 -110 25 17 227
6571B27n89L86r4j94L90j73m6j37K72R8L9l03n8N4L23k76k2J4j41M31l44R4M53
6594D04l40k6j59l8K59k17L98n0l26L86l49QR1j16q9M6o2K85j44j82K99j6j75
6617a13J27p0l7%r4n7J21pL45l61m6L52j65l8J52k66J25n2L17r7K6j20k14j5J50
6642c7j6Q9M60n56M5Oj29J38N2N5K9k78L38k72O8K76Q9l94J71r0%Nj31J42J30
6667A90k55k8K84r2j33J01r1r3l6O5p2m8J90j23K37o6R7Nj53%k24L56nN9q9k74
6693a98J64j6L3J21j18N6r8J19k3J50j41m4P7j39J11k9m6L1j36MJ13P5k13M29
6717B82j2j63k53J32l7K05m72M2L61j53Q3q4K28R6k95O5j96L79P9m76M1K37m7
6740D2l14J96M4J99m0N5k60L30k18Q0K6m5k38M10k53j25J25R4j55J38j54j76J28
$$ plain form
6571 227 -362 24 -70 -264 126 -47 -93 -230 42 140 179 -124 -182 -128 195 -81 -103 -89 -230 201 -143 -49 404
6594 404 64 38 -121 -159 100 -117 281 231 -95 291 -58 -50 41 -75 -164 -118 -180 105 -39 -221 78 62 -113
6617 -113 14 -56 -93 -93 -187 -244 -123 -130 215 -146 -192 160 -5 -43 109 -157 -32 -84 233 136 162 42 -172 -187 -37
6642 -37 -53 36 496 -60 -15 -9 -138 0 52 107 136 -142 196 -76 -8 268 357 -37 134 44 44 49 -82 60 190
6667 190 -65 -93 191 99 -34 67 -24 -117 -153 -88 -160 -208 -18 -141 96 30 127 132 -21 -21 -245 111 106 165 76 -198
6693 -198 -34 -50 -17 104 -14 42 -56 63 40 190 49 5 82 -57 54 25 -21 10 -126 -122 -9 66 -147 282
6717 282 270 107 -146 -14 -51 154 -318 -276 85 -68 15 -69 159 255 -40 25 -171 208 287 -189 -148 89 42
6740 42 -272 -76 -32 167 127 182 -78 252 34 114 140 95 -143 267 14 -111 14 108 -47 91 -63 -239 -111
6763a11q7J40K0l5J87K12j57k23Np0K47M6k01J8j36j27K75l32M13J21k2Qj27L4
6787I8j52n1J50P5l12K24j41L8m9L20k40j0Q6j89K64M7j17o3K49k66K60l52j82
6810c13K04M8j62R4r4M43l92K75J2M7n0j51J84k71J24j38K48K6n0l4J14l79K48
6833C3k81K57Q0l28L20M9Nk42K8J36J31l12Q3J53l9k03K66j95J66j64L87l74J83
6856A39k1q8k13N8oJ71n6kL1j15J58J30j39k33N3J13J29j98J47r1J70j71j13J54
6880GQ7K2k70L86j12l15J85K22Qj77J31K9k6l10J88k2o3l8J97k48j92N15j82K17
6904B39k99J23P4l31L68j21K07j13l83L88J49l75R4K75r0l31J50J44l36J03j55
6925b20K51J1J2J64k40k0N8K27j21j25K17l71P2J04M0j60M6L5m6k2P2O4J59%j66
$$ plain form
6763 -111 -198 -58 -38 -73 114 326 169 -54 -49 -119 128 174 -27 -9 -145 -272 3 -329 84 205 183 191 64 98
6787 98 -54 -105 45 120 -192 32 -109 -71 -120 200 -40 -50 36 -153 111 158 41 -22 227 -39 221 -131 -313
6810 -313 -109 -61 -223 -129 -223 220 -172 103 115 162 112 -39 145 -126 -2 -140 108 134 84 50 164 -215 33
6833 33 -248 9 89 -239 81 130 135 -107 -79 57 188 -124 -41 112 73 -130 136 -59 107 -57 330 -44 139
6856 139 118 30 -183 -125 -131 40 -16 -18 13 -102 56 186 47 -186 -133 -20 109 -89 58 -33 137 -34 -147 7
6880 7 94 116 -154 232 120 -195 -10 212 220 43 174 203 177 -133 55 33 -30 -68 129 -119 -311 204 22 239
6904 239 -60 63 137 -194 174 53 260 147 -236 152 301 -74 20 295 205 -126 24 168 -168 -65 -220
6925 -220 31 42 54 218 -22 -42 16 243 122 -3 214 -157 -85 19 59 -101 -55 -20 -66 -88 -16 48 207 207 41
6950D1Q2k50K25p0NJ04j51K8j3j58j15n4K54NK56n67J62Q6o4J25J67k90K18j27
6974a01j17K2N9k1O1q2K27J27j20Q2k34J00K55k95j65J34R1j15j62J82L58k52
6996C4J88k12k1P1K69l18K0j01J88k9K49k55l09L87j80m9M9l48K77J72r8k48k
7019b66M68k36J55l82K35mR3P5j84k8K03j23N0QL6M9J2J15l26M1k1K41k93r7P8
7044a01J00L18m17J74K3m2j62j04K08l9N9M6k12j1j19K66p9J84O7j36j0J7p8J46
7068I8l36M4l1J23K7K0k24L04Q2k02L36n77M62r0q0K22l33J99q6l9j29L31L0l49
7092a98pM14l30O6j93M99k47M9J62PJ07l14K2P1q4R8p7K21k81J23k33k7K85j23
7116A0k30J42K21p4l0M9j22J09Q6r3k57k93N60j01j7J05j54K64n03M07N1l6L1
$$ plain form
6950 41 123 -127 98 28 33 137 -14 14 1 -157 -272 -326 -72 -67 189 -378 -216 -130 -194 -69 98 -192 26 -101
6974 -101 -218 -196 -137 -158 -97 -179 48 175 55 137 -97 3 258 -37 -202 -68 23 -92 -254 -72 286 34
6996 34 222 10 -11 60 329 11 31 -70 118 89 338 83 -226 161 -19 -68 -19 -367 -90 82 -16 -264 -266
7019 -266 202 -34 121 -261 -26 -30 63 138 -46 -74 129 6 56 64 100 149 161 276 -50 -9 -30 211 -82 -179 -101
7044 -101 -1 317 -100 74 97 55 -107 -211 -3 -42 17 63 -149 -160 -279 -13 -92 92 159 23 13 30 -48 98
7068 98 -238 -194 -225 -102 -75 -55 -279 25 107 -95 241 -336 126 36 -44 178 -155 44 -42 -81 -210 121 151 -198
7092 -198 -205 209 -121 -55 -248 251 4 53 215 222 329 15 37 108 24 122 45 266 -15 108 -125 -152 133 10
7116 10 -220 -78 143 69 39 88 -34 75 161 68 -189 -482 78 -23 -40 65 -89 175 -328 79 130 94 125
7139A25Jm65K85q2K02j59j10L77j18J5kJ9k08K7K86q8r1J30l79M32k63M52m67
7162h1l0R8mr4K15j85K45Q6j15k02L04q0k55K90l51K40k36J96n7J04o9P9j16l8
7186e6P3j03l9j02L6K40l9l5q9J35j4K3R4l0j66j0J14j45K13N2j2j51j94K44K83
7211C22k04K87l66q5j16RJ30L51k48J25l56J58l54N87k84J06o0l6J06r6M5O0j26
7234d5J06J57l49L74k50n7p1Q7r4k84L79J8P5k61L2K65l76K14J98Mk86K07l5J91
7258A99j26q9o9K11k39J31p4J30k21K49r7j2M6RP0k1j49K0Q1j65J30j62j4p2L19
7283H5k4q8R0K10j05l78K05Q1p5M5j43L19m7J15l07k40K23k8J35K8j82L8lR6J39
7308A89l97N0O5M0K20k36j3J3K91l67J93k23K26j77J23M8Q4j80M6j63J35L37m14
$$ plain form
7139 125 126 -339 -54 -136 66 -93 -203 174 56 71 69 88 -120 -93 193 105 14 144 -235 197 -66 386 -81
7162 -81 -111 -13 -17 -111 104 -81 164 250 135 -67 237 157 -98 192 -159 81 -155 41 -16 88 19 98 -18 -56
7186 -56 17 -86 -125 -227 -191 49 10 -25 -114 21 7 30 124 94 -72 -82 32 -113 100 152 140 -11 -205 39 322
7211 322 118 405 39 -46 -162 -153 -23 328 80 205 -151 7 -347 240 -44 62 2 -34 72 -24 21 81 -45
7234 -45 61 218 -131 243 -7 -64 -135 -48 -142 -426 -47 -29 46 -215 -183 82 -294 -80 118 122 -164 43 8 199
7258 199 73 -16 -85 126 -113 18 -56 74 -147 102 5 -7 39 48 118 97 -52 -32 49 -116 14 -148 -162 -234 85
7283 85 61 -27 63 273 168 -210 -5 76 1 46 -97 222 175 290 -17 -257 -34 -62 73 101 -81 -43 -46 50 189
7308 189 -208 -158 -93 -53 167 -69 -82 -69 222 -145 48 -175 51 -126 -3 45 129 -51 -5 -168 -33 304 -110
7331a10L20j28j90%J84j5k91M09o4j36j84K97r3k1L5r0P9R2N8j59J09l9k1j32
7355i0J67j17j11n6P3L10n8J83l03L19l40L0j1k48L1K56L09n91K75l7k0k47L78
7378A02o5K75k71j38K85J0j57k36P1j03J09K5j58K79n3l22M76j93K03j70j54K01
7400A6j31m3j53nL26j85L14k03j9L16k10J80n71L87l8j20L57k41L2j65L99k08
7422C5j58K38n1r3P8J08m04M05k59J7j25L50O7l28K27K10j69j8p7r0K35j93kQ
7446A1k74K90K11j99j4j99Q3L28l58j5K60p3j00m9M16l56L0L2l4M1p9L09m55O2
7470a32K51Mr9j18N0j29M0M00l6k22k21p2L18J74j26m36MJ13L06j62K28P9j68
7493D6j76l8M47j61k29q2K37j66P3P8j76K01j7j16K27J1m1J54j13l18J93j83K23
$$ plain form
7331 -110 210 82 -108 -108 76 61 -230 179 115 -21 -205 92 -1 -22 13 -77 2 94 152 -7 102 63 42 -90
7355 -90 77 -40 -151 -207 -134 176 118 301 -2 317 -23 7 -4 -252 -221 35 344 -247 28 -9 -29 -276 102
7378 102 37 312 41 -97 188 198 41 -195 -124 -227 -118 -93 -251 28 -25 -347 129 -64 139 -31 -185 16
7400 16 -115 -158 -311 -316 10 -175 139 -64 -83 233 23 203 -368 19 -19 -139 218 -23 9 -156 243 35
7422 35 -123 115 64 -29 49 157 -247 158 -101 -84 -209 141 208 -120 107 317 148 130 53 -37 198 5 3 11
7446 11 -263 27 238 39 25 -174 -91 237 -121 -136 124 51 -49 -98 318 -38 -8 24 -10 31 -48 261 -194 -132
7470 -132 119 123 24 -94 -44 -173 -133 267 231 9 -212 -284 34 208 82 -354 -350 -237 69 -93 135 214 46
7493 46 -130 -168 279 118 -111 -193 44 -122 -49 29 -147 54 37 -79 148 159 118 272 159 -159 34 -149 74
7516G4K50m48j7O0l5L4K33j95O0J7J94k3q2nr5R2k11%J02j90M26l08J03l8J24
7541A22mK49l34j42K11k37N00l91o0K0J51R1k35K9j00L08k79J97p4j1Q4R1k67
7564h1rO1R4m20RL40k74M24k26J4j38K56m2M3K4j62J38k01L89n3k35J19J65j67
7588F8L6l2j87K26l72k9Q2N7R2P0N9o0M8q6j5k1J75k3k52P6J92r9l36K46J67M3
7614A25j04R1l07K58K11k79L6K3j01j73M05j35j97J56j92pJ34K70j9j46j62O9
7636d4M5L6K42m6r4p1Q5Pp6k32Q2L31k68Jj45N15l98J74m31K7K73k9J53o0l2k66
7662b21M41r3q7N5j35o5N7m1J76j43LJ71j92k72K89j54K78P5k78R7N2j18J51K27
7686B73j7q0j04m55O11k79j7M4J66j5l50J47J72N6k71K97l27J46J07J07k16O2
$$ plain form
7516 74 324 -124 -141 -81 -116 -82 151 -44 16 33 227 204 122 117 22 114 -97 -97 5 -185 241 -67 36 -2 122
7541 122 118 367 33 -109 102 -135 365 -26 -86 -66 85 176 -59 -30 -130 178 -101 96 22 11 95 186 -81
7564 -81 -90 -29 65 -355 -346 -6 -280 144 -82 -68 -206 50 8 51 75 -87 51 -150 239 186 -49 70 235 68
7588 68 104 72 -115 111 -261 -290 -208 -151 -59 11 70 10 58 -28 -43 -64 111 88 -164 -88 104 5 -331 -85 82 125
7614 125 21 112 -195 63 274 -5 31 54 -47 -220 185 50 -147 9 -183 -190 -56 214 195 49 -113 -44
7636 -44 1 37 279 233 139 68 153 160 84 -148 -66 265 -3 -2 -147 368 -30 144 -287 -260 13 -16 137 77 45 -221
7662 -221 220 127 40 95 -40 -105 -48 -89 87 -56 -53 118 -74 -346 -57 -211 67 142 -136 -39 13 -105 46 273
7686 273 256 176 72 -383 228 -51 -68 -24 142 127 -223 -76 96 152 -119 178 -149 -3 104 211 -5 57
7708E7j80K01q3j18M0j68L73l74K65p2R8r4P0n7k02l1K69oK3K3p4k46K68K01m30
7733b47K58J90j90R0j8Jl30K28o5pL44j98j07Kp8o4L45J2j70j30N7J99j53rP8
7758C8J87k35M30l51J42j89P7j77j44K68k5R1k62P8K01k60J28q5j74M27j94M1
7780A2Pj9L58l75o9J03j42P7r7j29L70k34Q7J93n4k77M2K01m00L22N3j8P0J80
7804B61j19m6R2K3k03J07j63q1J33J24O6l48K17O4j23K6J00k34M1K77k13n5J5
7827c9J25p1k18N0J64L08o91M59nkn5j59j89L20M2Pp9R9J76k82P4K4o9K98j14
7852A73o0L1j57K35l49J35j48L88k00q0L8k49K31O9LJ52l79L31j00j8j03R6J83
7875B22l34L35j28R4j02J14k20l83K26K31l47L37L0K73j30m57K60P5q9J46j17
$$ plain form
7708 57 -123 78 -5 -123 -83 -251 122 -252 13 -59 39 -55 15 -42 -244 -275 -6 -12 11 34 -40 -286 -18 183 -247
7733 -247 11 201 11 101 83 84 -246 -18 -83 -90 254 56 -51 -49 -127 -191 154 166 -4 -134 -77 122 -31 -40 38
7758 38 225 -10 420 69 211 22 99 -78 -222 46 21 112 -150 -72 129 -131 -3 -88 -262 165 -29 12
7780 12 19 0 358 -17 -86 17 -125 -48 -145 -274 96 -138 -51 142 88 -189 -147 54 -346 -24 29 11 81 261
7804 261 142 96 188 211 8 115 -48 -129 4 128 194 -154 63 127 4 30 130 -104 -63 214 1 -54 -39
7827 -39 86 15 -203 -153 11 319 -372 87 82 80 25 -134 -323 -3 39 46 -33 66 242 -40 34 58 -11 287 173
7852 173 113 144 -13 222 -127 8 -140 248 48 -32 6 -243 -12 57 60 212 -167 164 64 46 -57 39 222
7875 222 -112 223 95 189 87 201 -19 -402 -176 55 -292 45 75 348 218 -239 21 96 7 153 36
7896C6M8j63K74j94J4K6qK78J5l18j35J44k09N87k45k08M9K29k86o8p0M8L42J04
7920B90j39j37j16L12k72j2J02l3po2K05J48l20P6r6J9l8J77P7r6n9K57l16J72
7944A32l94L88k15M4P1j10J42k19J18R7j93m4K25O3k95K15j34j37K07MM3k16K87
7967G9P5N5k41j0j44K64o9j06J52j13K11k67J05R5j70J52j96k49M88l05J46j04
7989a52Q9Q4K63q6k58K53k95K23j67k16K09J16K39l77J35J61j59j15L7j07Q3J87
8011A47j68M4J21Q3k08j40J27M9N8j79L33j65qj80k0J0j01J28P5kR8J32n53K86
8035c3k13L09j32J74r0l56J52L9L56j31k60L14m3j48J50k14J62Q5k85p3K31k9
8057c5L5J29k69K40Qk71J7K66j56o5J6J93j00l61K29K34k16J30J92p5pj53J09
$$ plain form
7896 36 84 -79 195 1 15 41 33 311 326 8 -127 17 -192 395 150 -58 -9 220 -66 -134 -204 -156 186 290
7920 290 151 14 -102 210 -62 -74 28 -5 -12 -74 131 279 -41 35 -61 -42 -80 97 174 78 19 276 -40 132
7944 132 -262 126 -89 -45 26 -84 58 -161 -43 54 -139 -183 42 105 -190 25 -109 -246 -39 -35 8 -208 79
7967 79 154 209 -32 -42 -186 78 9 -97 55 -58 153 -114 -9 86 -84 68 -128 -377 111 -194 -48 -152
7989 -152 -63 21 284 198 -60 193 -102 121 -46 -262 -53 63 302 -75 60 221 62 -53 -16 -123 -40 147
8011 147 -21 23 144 227 19 -121 6 55 113 -66 267 102 94 -86 -106 -96 -197 -69 6 4 102 234 -319 -33
8035 -33 -246 63 -69 105 15 -341 -189 -150 206 75 -185 129 86 -62 88 -126 36 121 -164 -237 -6 -35
8057 -35 0 129 -140 100 108 -163 -146 120 -36 -101 -85 108 8 -353 -124 110 -106 24 216 141 134 -19 90
8080I0l25K29k01K05k95J86k36K72J82n1M3l63L38j43L0j1j32k6J74R8J4J40k09
8103IK5k97J74L2l80L66J72R1m51J96j59L66l50M8R4l0J08j78K07j30J14q6J49
8126I0o5j39Q9r1P4m0o7K50k24J24n6j12K05pl3N0m2K19j54j12R6L5j7k13K59
8151A19J93qj97j22K0OR3l1k43K06q2k14L75J04k94L9N4O7O9k35L15l31l8N8J16
8176C9PN3l4q0M0L8J85k28K70l29j0r3Q7J19j51
$$ plain form
8080 90 -235 -6 -207 -2 -297 -111 -347 -75 107 56 99 -264 74 -69 -39 -50 -182 -208 -34 64 78 218 9
8103 9 34 -263 -89 -57 -437 -71 101 192 -259 -63 -222 144 -206 -158 -64 -94 14 -164 43 -87 27 -59 90
8126 90 25 -114 -25 -116 -42 -82 -149 101 -123 1 -55 -167 38 31 -2 48 6 225 71 -41 55 90 73 -140 119
8151 119 312 304 107 -15 5 11 104 73 -170 36 -46 -260 115 219 -75 -36 18 85 154 -81 234 -97 -135 -77 39
8176 39 46 99 65 -15 25 63 248 20 290 -39 -49 -142 -55 64 -87
8191h7
$$ Imaginary data points
##PAGE= N=2
##DATA TABLE= (X++(I..I)), XYDATA
0@%%%%%%qQqJ6j6K4l2M0n6O4q0J04j20J44j76K16k56K96l52M10m76N56o38P34
30C94q40R57j088J230j392J567j759J973k207K466k746L051l386L749m149M585
46B405n060N581o149O774p460Q220r063R995j1043J2221j3558J5094j6870J8961
60A0048k1463K4520k8353L3317m0037M9689o4815R2033j56042N84301M88510r58838
72A2870r3880k83314m92942N4548N71585L71103M45140K14492k86407m03778k40684
83a31267l76202j83752K01580L61759L88501L32579n3018k37037k18649l38337
93b53843k87732R3008J96462K13296L62387J67897j83086j04383j44583m01188
103c41765j41822K48778J01323R4519L71146J50832k73863k10613o6887j44621
$$ plain form
0 0 0 0 0 0 0 0 -8 0 -8 8 -8 16 -16 24 -32 32 -48 56 -64 80 -96 120 -136 160 -192 218 -258 298 -340 394
30 394 -446 511 -577 653 -739 828 -931 1042 -1165 1301 -1445 1606 -1780 1969 -2180 2405
46 2405 -2655 2926 -3223 3551 -3909 4311 -4752 5243 -5800 6421 -7137 7957 -8913 10048
60 10048 -11415 13105 -15248 18069 -21968 27721 -37094 54939 -101103 483198 971708 12870
72 12870 -81010 -364324 -857266 -802718 -231133 139970 585110 799602 513195 109417 -131267
83 -131267 -507469 -691221 -489641 -127882 260619 593198 540180 303143 84494 -253843
93 -253843 -541575 -448567 -252105 -38809 323578 491475 308389 204006 59423 -341765
103 -341765 -483587 -234809 -133486 -38967 332179 483011 209148 -1465 -68352 -212973
113b12973j23616N2611K33285K72182M4975j02173J5975o5995k77958j20492P7999
124b06180M6471J65507K24030m5410p5149P6462j66413k88143O4825J43348l8997
135i9649J08408J80897m6226m0409J7796j84977j53762J01084O1049j6166J19196
146D7241J14278j6834n6658j08448q5925L8241j5196n4052J46884J41609q1850
157F9290k7842O0235j06567j08497L9565j0811Q311J48451L3084q5081M5035J3803
169G8976j40716m0669O1680p606K5532P1599j805R054J7913q5667n0368L7417
181b4660l5900r824J08002J5664m3465O1306j9885j17846L4126M6915r5196K5954
193e4809J29367l6871m9046O9522k7023p7690K9117j0005m1699Q3968M6760p1280
$$ plain form
113 -212973 -336589 -283978 -50693 221489 266464 164291 180266 114271 -163687 -284179 -206180
124 -206180 -159709 5798 229828 184418 109269 185731 19318 -268825 -204000 -60652 -99649
135 -99649 8759 189656 143430 103021 120817 -64160 -217922 -116838 -55789 -71955 47241
146 47241 161519 144685 88027 -20421 -106346 -68105 -83301 -137353 9531 151140 69290
157 69290 41448 101683 -4884 -113381 -73816 -84627 -76316 72135 105219 20138 65173 78976
169 78976 -61740 -102409 -40729 -48335 -22803 48796 46991 56045 73958 -11709 -62077 -24660
181 -24660 -60560 -70384 37618 53282 9817 71123 51238 -66608 -32482 14433 -80763 -54809
193 -54809 74558 37687 -11359 58163 31140 -46550 -17433 -27438 -69137 14831 61591 -9689
205i689J6775N3893n9602m2276J8825j2831K3912M3440m1382L227P5403m5837
217B3858p7377M9945J0551n9807M6026M7856n0059J5328M7145n9957l2432M9123
229A0200j7877k9459M3868J1679j8768K4258o952l4663J5707R32l0748K4996K4837
242A8010k1513J3874J5298l4480K958J7300l9203M932N1791k8809k6403N8204
254C1959q60n9184J8541K5037l5037N513K8112j8531M653K3931k4980j2349K1556
267H361j4184j1659K4178n811q865K7372q648k7409K3358M415l4221J6469K3503
280A6859k6508P543K6250k9069r574L3745j8472k8305L3038J0651k8644J2144
292c42J6969j9398k002Q917j2260M780R777j4105N534J7494j6345p487J7681j0399
$$ plain form
205 -9689 7086 60979 1377 -40899 -22074 -34905 -10993 32447 -8935 -5708 69695 23858
217 23858 -53519 -3574 6977 -52830 -6804 41052 -9007 6321 53466 -6491 -38923 10200
229 10200 -7677 -37136 6732 18411 -357 23901 16949 -17714 -2007 -1075 -31823 -6827 18010
242 18010 -3503 10371 25669 -8811 -5853 11447 -27756 -22824 28967 158 -26245 31959
254 31959 31099 -28085 -9544 15493 -19544 -14031 14081 -4450 203 24134 -846 -13195 8361
267 8361 -5823 -17482 6696 885 -7980 19392 10744 -16665 6693 11108 -23113 -6644 16859
280 16859 -9649 -2106 24144 -4925 -14499 19246 774 -27531 5507 16158 -12486 -342
292 -342 16627 -2771 -4773 4144 -8116 -3336 6441 -7664 -2130 15364 -981 -8468 9213 -1186
306a186j1739J9835l706j5869K0073O129k4006Q537J3570k0559K10J9170j2464
319b005p136J9458n221j4364J3024J865j4512O114P997p549K636L284o378N607
333B820K690j3676M149J2725j1072m555J4564m366r793J0257q8j1238P613N208
347E238j0835L946R753q789m251Q467k151n410M734J65l411M242P14l381J017
362D8K95j531J979q51k976M394J973n721J775M214m874k404N629l48l972K470
378A00J610j711K32O42j822n6J507j17q67O73L46p71p4J258l32k666O59L248q07
397A052k537J056J521p38o46n31J78J018K35n67J45k57l22J744j085k789K816
414B93K520m637j77M783k106k924L244j009k146M153k20n443L713L372m437k99
$$ plain form
306 -1186 -12925 6910 3204 -12665 7408 13537 -10469 -1932 11638 -8921 -8711 10459 -2005
319 -2005 -9141 10317 5096 -9268 3756 5621 -8891 -2777 5220 -2329 307 3591 -2787 2820
333 2820 5510 -8166 -4017 8708 -2364 -6919 7645 3279 -6514 3743 3655 -7583 30 5238
347 5238 -5597 -1651 8102 -687 -4938 3529 1378 -4032 702 867 -2544 1698 2412 -969 48
362 48 343 -1188 791 -60 -3036 1358 3331 -2390 -615 3599 -1275 -3679 1950 1602 -2370 100
378 100 1710 -1 231 873 -949 -1005 502 385 -482 191 537 -234 -308 950 618 -2048 -1389 1859 1052
397 1052 -1485 -429 1092 354 -292 -823 -645 373 608 41 186 -71 -393 1351 266 -2523 293
414 293 2813 -1824 -2001 2782 676 -2248 996 -13 -2159 1994 1774 -3669 44 3416 -1021 -1320
430a320K990k703J70L818l933j719M920j242k774L250j518k854N376k43o607M015
446c74M440n796o3M967m594n04N706m699k879P092j211o469N655J754o464L484
462D5K951o372K329N674o735p27O418l374k956N496k699l894P029j198o490N355
478H52K207o651L720L923p072J077O862n838k630O798k880l387N988j934n470
493d435O598L07o876N114L231p136K326N073o524K01O188n532j760P100l594m508
509d227P085q89o282O398R14p497N025L537p452J963O051o778q07P410m503l565
525c617O901k783m718P401j117p210O275L363q228K706M899o539J289N879o700
540b199j572Q419m445m414P358j991n784P085N59p686N274L866q092K380O039
$$ plain form
430 -1320 1670 -1033 -863 2955 -978 -2697 2223 981 -1793 1457 -61 -2915 2461 2218 -4389 -374
446 -374 4066 -1730 -1793 3174 -1420 -1924 3782 -917 -3796 3296 2085 -4384 1271 3025 -3439 45
462 45 2996 -3376 -1047 4627 -2108 -2835 3583 209 -2747 2749 50 -3844 3185 1987 -4503 852
478 852 3059 -3592 128 4051 -3021 -1944 4918 -920 -3550 3248 368 -3019 2969 1035 -4435
493 -4435 2163 2470 -4406 708 3939 -3197 -871 4202 -2322 -2121 4067 -1465 -3225 3875 281 -4227
509 -4227 2858 1969 -4313 2085 2999 -4498 527 4064 -3388 -1425 4626 -2152 -2959 4451 -52 -3617
525 -3617 3284 501 -4217 3184 2067 -5143 1132 4495 -3733 -1027 3872 -2667 -1378 4501 -2199
540 -2199 -3771 4648 203 -4211 3147 1156 -4628 2457 3016 -4670 604 4470 -3622 -1242 4797
555D797p107m5O868n546l078Q570l251n936P283m94o600O413J494q168M578N777
571E555q663N7P688n475j859O530m623l727Q569j826p581O746J852p198M137L511
587C693p246K545N775p519n29P798m677l321O690k624m937O913N1o957N563K415
603C633p453K886M731n836L74N896n954j487P023k858m330N561j255m489N289
618A731J072o430L853L003n804J534M538n093K6M926m638k231O810k144m665N479
634A967j33n237M402J649n373K857L050n893J179N151m595j224M999l303k419
649b923N512j700m087M671P05n607M010K136n518K247L834n175n1N128l834j439
665b091M983k574l646N356j49m688L628J504n069K638L053m976R41L852l819q25
$$ plain form
555 4797 -2310 -2355 4513 -1033 -4111 4459 1208 -4728 2555 2061 -4539 1874 3368 -4800 -222 5555
571 5555 -3108 -3051 4637 -838 -2697 3833 -790 -4517 4052 2226 -5355 1391 3243 -3955 182 3693
587 3693 -3553 -1008 4767 -2752 -3281 4517 -160 -3481 3209 585 -4352 2561 2612 -4345 1218 3633
603 3633 -3820 -934 3797 -2039 -1665 4231 -1723 -3210 3813 955 -3375 2186 931 -3558 1731
618 1731 2803 -3627 226 3229 -2575 -1041 3497 -1596 -1570 3356 -1282 -3513 3297 1153 -3512 1967
634 1967 1834 -3403 999 2648 -2725 132 3182 -2711 -1532 3619 -976 -2200 2799 -504 -2923
649 -2923 2589 889 -3198 1473 2178 -3429 581 2717 -2801 -554 3280 -1895 -1946 3182 -652 -2091
665 -2091 2892 318 -3328 2028 1879 -2809 819 2323 -2746 -108 2945 -2031 -1090 2762 -1057 -1882
681a882M749k913k416M468j336l731M477J90m291L322J761m664J588L551m134
696a261rM017l458j653M576j569l186M148k19m118L319J462m084J612K608m115
712a930P40L617l120j113L935k178j985L824q45l071L072O45l750J975K108l234
728a310P69K288k810l46L362k044j257L020j260k158K562J68k786K434O62k852
744a558J175J892k729N27K676k702n37K865j575j297K542p84k251K342O23k683
760a474J643J349k886Q09K077k233k84K551k117l45K133j106j194J914j09k307
776a579K008N67k361J525J145k102K46J689j662n54K339j395j312K510o61j377
792i74J414Q0j618J210J205k259N89J258j384Q3J615j292o08J736q96j181J562
$$ plain form
681 -1882 2867 -46 -2462 2006 670 -3061 1416 1606 -2685 637 2398 -2266 -678 2873 -1261
696 -1261 -1270 2747 -711 -2364 2212 643 -2543 1605 1386 -2732 587 2049 -2035 -423 2185 -1930
712 -1930 -1190 2427 -693 -1806 2129 -49 -2034 1790 945 -2126 946 1591 -2159 -184 1924 -1310
728 -1310 -541 1747 -1063 -1409 1953 -91 -1348 1672 412 -1746 816 984 -1802 632 1294 -1558
744 -1558 -383 1509 -1220 -693 1983 -719 -1256 1609 34 -1263 1279 495 -1756 586 1209 -1474
760 -1474 169 1518 -1368 -559 1518 -715 -999 1552 -565 -910 1223 117 -1077 837 728 -1579
776 -1579 429 996 -1365 160 1305 -797 -551 1138 -524 -1078 1261 -134 -1446 1064 403 -974
792 -974 440 520 -1098 112 1317 -942 -353 905 -479 -396 1219 -73 -681 1055 159 -1022 540
809E40K39j895J429P30k148P74J440j739LJ881j521o48J554o81n36J285l98j364
827a055J346N19j586P14R16j305K54R91j306k4J406r62o57J353j70r70N62L22
845C48j036Q65N21j255M84Q00r68q5R94o94l90J110o52n10Q65j00j279J060Q1
864A59r32R73L66j003K38R20q45k33O89o35j9R07l08p93P49k08k29K14K80m41
884a51p4Q11n88k81M15k55k04O64k24n20O61K8m48J51L25o88L43K05q64P11L61
905C78n07j3M50k77l90N09m7l38M45m4n05K37L77m01J74M47m70l57O21m10K32
926A11n2k28K34k58L02k42J31K93l65j22M17j12m03N2K45j49L14Lj13j36L90m54
948a42K07J1J24k00J18O4l00J60Jp3J57Qj67K36k78q8k1J55M6k41L63j49O7n7
$$ plain form
809 540 779 -1116 313 1043 -1105 -331 1109 -630 -627 1254 -267 -915 639 -42 -578 707 309 -1055
827 -1055 291 810 -776 -62 854 -451 -197 794 -512 -536 870 -92 -749 604 434 -536 26 348
845 348 -688 177 698 -557 -73 727 -241 -326 668 -26 -416 694 42 -468 397 297 -982 78 159
864 159 -773 200 566 -437 -199 721 -124 -357 332 -303 -322 585 277 -516 233 25 -204 10 290 -151
884 -151 -225 586 -2 -283 132 -123 -327 337 113 -407 254 282 -166 -15 310 -378 -35 170 -694 17 378
905 378 -129 -142 308 31 -359 150 103 -235 210 166 -339 -102 275 -126 48 495 25 -332 289 -121 111
926 111 59 -169 65 -193 109 -133 -2 291 -74 -196 221 109 -294 -242 3 -146 168 171 58 -78 312 -142
948 -142 65 76 200 0 118 182 -118 42 43 -30 127 135 -32 204 -74 -162 -183 -28 18 -223 140 -9 58 1
972Ak15J98j50M2j44K56j34P6L4K32k48J68j73Q9j32L17k44J5j24O0q6k71L44
995h9K7J2K80q3k09R1n0R1j62Q4k4K9m7K22k12K8K07j15J94m44m7J70K54k42r1
1020a26L00j64l55M54r1l51M34q9J08O0j93lo2O6J95j09K5k60J60J86J98m60P2
1043eJ63o43L87J92j60J79J5m5k40K73j40q8P1L9j69L51K8l13r1L42o7k94N53
1066C38n31L0N72n27J47J08j23k87J81K44l70L76j99j03K11n0j80J52J74m60L43
1087D6K18l99K38l8O1q8Q6j20l26M10J2p3p2N43p94K28M49k03n44J41L42l88K29
1110d2J43J8J15q6j90L6K12m25Q7N80o51K24R6M7k68J80K0n41N89N8o7j09J00
1133A26l03J52L83l26l20N19o8l46K88j75k74L52P0m45O11k87l1j46M35j36l46
$$ plain form
972 1 -214 -16 -166 -124 -268 -12 -146 -70 -36 196 -52 116 -57 32 -100 217 -27 -12 -136 -76 -162 -433 -89
995 -89 -62 -50 230 147 -62 29 -21 70 -92 -8 -32 -3 -50 172 -40 -12 195 80 274 -170 -217 -47 207 -35 -126
1020 -126 174 10 -345 109 18 -333 101 12 120 180 -13 -16 -78 -12 183 74 99 -161 -1 185 383 -77 -5
1043 -5 158 -485 -98 94 -66 113 128 83 -157 116 -24 -112 -41 -2 -171 180 208 -105 -196 146 79 -215 338
1066 338 -193 -163 409 -118 29 137 14 -273 -92 152 -218 158 -41 -144 67 17 -163 -11 163 -297 46
1087 46 264 -135 103 65 126 38 124 4 -322 88 100 27 -45 498 -296 -68 381 178 -366 -225 117 -271 -42
1110 -42 101 119 234 148 -42 -6 206 -219 -132 448 -203 21 117 164 -104 76 96 -445 144 202 135 26 126
1133 126 -177 -25 358 32 -288 231 163 -183 105 -70 -344 8 78 -367 244 -43 -74 -220 215 79 -267
1154b67N19l96J10K6j54j59L62J02m35N01k06k52M91m7k36j9L46l37j22K26K1
1175G4o2K02m49m1K42K05m04M06r7m00J67N08l03oK20m23p3M29k30j89L22J72
1197B70m60Q2J35m96N25L20m96k3M70n02l96O73p9k11J64m1k16L10J71m46J99
1218d7J09k80K82K29m29m3M23k50j21K65J92q88O56J95m65J91J94n33L20M5k68
1239b23n1N13k10k59M48k89j04K46J07k96L23l16J1n3K56m22L40P9j06l56O08
1260B46m14j14N61j42m28L60N4m85L98o9J03K9n8L0k90L16N0j81K22l5r5K21j12
1283A67j71L5J80n53M56Jk91l0M04j09l69L12J1J3Q3J26l28L6K99m91L78j3m2
1306A04k45K82j00p7K01j54k30J22M2l13N67j1l76Q2K42n00K50K99j84j07M39
$$ plain form
1154 -267 252 -144 -34 -8 -162 -321 41 143 -292 209 3 -249 242 195 -41 -60 286 -51 -173 53 74
1175 74 12 214 -235 -276 -34 171 -233 173 76 -324 -157 351 48 42 262 -161 -234 195 -35 -224 98 270
1197 270 -190 -108 27 -469 56 376 -120 -143 327 -175 -571 102 23 -188 -24 -65 -281 29 200 -246 -47
1218 -47 62 -218 64 293 -136 -179 244 -6 -127 138 330 -558 98 293 -172 19 213 -320 0 45 -223
1239 -223 -274 239 29 -230 218 -71 -175 71 178 -118 205 -111 -100 -153 103 -319 21 100 -6 -362 246
1260 246 -168 -282 279 137 -291 69 123 -362 36 -33 70 99 41 71 -219 97 147 -34 188 153 58 279 167
1283 167 -4 31 211 -342 114 115 -176 -206 198 89 -280 32 43 56 139 265 -63 -27 272 -219 159 146 104
1306 104 -141 141 41 -36 165 11 -219 -97 -55 -368 199 188 -188 -106 136 -364 -114 185 1 -106 333
1327C33l29k6N6k50M1j9N50n85J88M24r93P98j77m6k5K17l66O6J43m20K93J94
1349F7j83j66O18k74l11N37J91m74rJ32k72j15K87q2N8K02j96j04j17j1K24q8
1371h6J41k24J34J95m67L27J09k91kJ80K03l52J5M2j55L21J71n62L19j0k20K60
1393D8j4q9K3J58K6j35O3L2j27J9j8k10L77k61R8m5j19l6K88L17o33Q8P7m77L47
1418b03M27j26n0j7k0j23Q2J06j94L27j88J22Q3j63k11L2J15Pl75L23l1M9M8L5
1442E5N9l03K61k20K60n2J1j73J05J09j62K88k81k33M33M6m40K91m8J19j93K54
1464A86l90K14j18R5j26J91n6K31k27j14L9l4L02k97o4J27k31J56K42j60j2Jj51
1487a96J14J57j00L0O5p6j8J50j87J28k73K84L05k52o5j69j0kM9Mj69M8L03k06
$$ plain form
1327 333 4 -22 34 -216 -175 -194 356 -229 -41 383 -610 188 11 -35 -60 157 -209 -143 0 -420 -127 67
1349 67 -116 -282 336 62 -249 288 479 5 -4 128 -144 -259 28 -54 4 206 10 -94 -211 -222 2 -86
1371 -86 55 -169 -35 160 -307 20 129 -162 -164 16 219 -133 -118 -76 -231 90 261 -301 18 8 -212 48
1393 48 34 -55 -32 126 152 17 80 112 -15 4 -14 -224 153 -108 -10 -55 -174 -210 78 395 -238 -150 -73 -550 -203
1418 -203 224 98 48 31 11 -112 -30 76 -118 209 21 143 226 63 -148 -116 -1 6 -369 -46 -77 -28 20 55
1442 55 114 -189 72 -148 112 60 71 -102 3 112 -50 238 -43 -276 157 203 -237 54 6 125 -68 186
1464 186 -204 10 -108 -13 -139 52 -4 227 0 -114 -75 -109 193 -104 -168 -41 -272 -116 126 -34 -46 -45 -196
1487 -196 -82 75 -25 5 70 -6 -24 126 -61 67 -206 78 383 131 66 -103 -113 -115 -66 -62 -231 -183 120 -86
1511h6J44r7NK06k31J51j29o5L4j84K52%ppK61j67j43j11K98k49J93L6J90j62
1535A32Q9n6j10k94K07J60l83N36l05j60J11J70r2jq6J44o7Lk44J15J46l8P2J12
1559A61j37j44K4J44o9L5l33N35l52K65L3N7k78j60K05J84J28k18j06K34m33L05
1581H0k50K57r1J1Q7j07J21p5m3j27J63k39J42L59k78L5j14J29j89Q7J18k56q8
1604b68L21j6k39M08k20l01J46K72j70nL39l19K23o1j22k51L81J22k66L4J2l38
1626c18K86Qq2M3p2J74K5k40n2K58q9K33j06j04J73j59Q5R8m48L72J09n36L88
1649D6j3k51J28J24n5M16j49j65j82L9k4J21p5P1J60j5j63j55K43j97J07O2j26
1672e3J40k20L15l68R5j22K26N6k44K11j26q3J40k18L74l7k4j57J45K6k13Q9Q5
$$ plain form
1511 -86 58 -39 -34 172 -59 92 -37 -102 -68 -252 0 0 -7 -14 247 80 -63 -174 124 -125 68 104 294 132
1535 132 221 165 55 -239 -32 128 -255 281 -24 -184 -73 97 5 4 -82 62 -5 -2 -246 -131 15 -23 49 161
1559 161 24 -120 -96 48 -21 14 -319 216 -136 129 162 219 -59 -219 -14 170 298 80 -26 208 -225 80
1581 80 -170 87 -4 7 94 -13 108 33 -10 -137 26 -213 -71 288 10 45 -69 60 -129 -42 76 -180 -268
1604 -268 53 37 -202 206 -14 -315 -169 103 -67 -72 267 -52 171 110 -12 -263 118 240 -26 8 20 -318
1626 -318 -32 -24 -106 -63 -135 39 64 -176 -228 30 -59 174 68 -36 137 -22 63 161 -287 85 194 -342 46
1649 46 33 -218 -90 34 -21 395 246 81 -101 -62 -86 35 -40 31 191 176 13 -142 101 -96 11 73 -53
1672 -53 87 -133 182 -186 -91 -213 13 69 -175 36 -90 -173 -33 -251 123 86 62 -95 50 76 -137 -48 37
1695C7k82K27J31k52J56J88k89J70j24lR9j90K64o6L24l25j90L99j91j24J22m90
1717d09K44K42o4r9J6qN1l34O34k61j8K84k29k86N53m9k52j0j42O9Q8J0r8J91
1741A23p8J78m22K90j87M5m8J75k30K18k13j34M07N3K19o09O8K50Pj42Jj29K93
1764A35j66j0L7M9R8M3r2r4K3L3j80k36L12k6K2j6J56j47P2n7n4L5m7J82pn7j01
1791i3N8J67mn38M24K63j96j9k81K56M6l3J32j98J76j15j91J22r7J31k3L34m95
1814a74J35K94j46J65l81K6L60n7k71K81p9j34O0k13j99L90O2j08qlJ00k68J28
1837d0R1j45R6o8J09k09K76L1L2j25j79m8L00p7R4j79J59j01j25J06P0j82J07
1860gl36K19n4J6J10q8m7J62Q7m0J63j08J20l46J42o6n5J28J12oq3j7Q8j61K18
$$ plain form
1695 37 -245 -18 113 -139 17 205 -84 86 -38 -41 58 -132 132 66 390 65 -125 274 83 -41 81 -409
1717 -409 -165 77 13 -86 -70 -78 -27 -361 273 12 -6 278 49 -237 316 267 15 5 -137 -68 20 30 -68 123
1741 123 45 223 -199 91 -96 -51 -99 76 -154 64 -149 -283 124 177 396 -213 -145 105 112 -30 -29 -158 135
1764 135 -31 -41 -4 45 143 186 94 0 23 56 -124 -360 -48 -74 -52 -68 88 -59 13 -44 -98 -63 -110 72 65 8 -93
1791 -93 -35 132 128 -410 14 277 81 62 -219 37 83 50 182 -16 160 45 -146 -24 -121 10 -13 321 -174
1814 -174 -39 255 109 274 -107 -81 279 222 -49 232 153 19 79 -134 -333 57 119 11 3 0 100 -168 -40
1837 -40 51 -94 2 -66 43 -166 110 141 173 48 -131 -179 121 44 138 -41 118 17 -108 -2 68 -114 -7
1860 -7 -343 -124 -178 -162 -52 -140 -187 -25 62 22 185 77 197 -149 -7 -73 -128 0 112 106 23 6 94 -67 151
1885A51k22J29J64m09K36K06l12k47K78J2j84K33M9k17J59kO2j3k45K70k54J03
1907e3J34j91J34J6l7k7P1k39P2JP8k90K22j28RJ23n0J41J39j6p2K4%L7j70J93
1933A21k70M67k08N3l08J19j60J88R0kj52J5K90m18J46J58m91L11J31j31J40j13
1955b4N8P3K28k71J6j77n1J25n1N38o07J96J82p0r2L0n4r2K85j18J1k14J67k65
1979a77L96k22k17J46J17P9l16O8P1J83j52J17l22K98Q5j72L13l38J6o1O3J50
2001A25pk0nPo9j49R5j3M07n73K07n5j53L46k74J24P5Jo1Q5J14m41j9J09N96l41
2027A11K1R2q4j65k12N07k97P9ml8j63L15l46N1n0M38n34M04k03O0Lk06qL02k5
2052D8k28L59k29n7J00L32n97M51l09j02N36j86j33N5j14%L4J65k78K03q0j7J15
$$ plain form
1885 151 -71 58 222 -187 49 255 -57 -304 -26 -14 -198 35 84 -133 26 24 86 73 -172 98 -156 -53
1907 -53 81 -110 24 40 3 -24 47 -192 -120 -119 -41 -331 -109 -237 -228 -105 -155 -14 125 109 37 61 61 98 -72 121
1933 121 -149 318 110 163 -145 -26 -186 2 92 90 -62 -47 243 -175 -29 129 -362 -51 80 -51 89 -24
1955 -24 34 107 335 64 80 -97 -148 -23 -74 464 -143 53 235 165 73 103 49 -43 242 124 135 -79 88 -177
1979 -177 219 -3 -220 -74 43 122 -194 -126 -55 128 -24 93 -229 69 154 -18 295 -43 -27 -88 -25 125
2001 125 118 98 93 100 31 -118 -23 -36 371 -202 5 -50 -203 143 -131 -7 68 69 8 93 207 -234 -253 -144 452 111
2027 111 132 224 140 -25 -237 270 -27 52 48 10 -153 162 -184 -133 -183 255 -279 125 -78 -18 -15 -221 -229 73 48
2052 48 -180 179 -50 -107 -7 325 -272 179 -130 -232 304 118 -15 40 -74 -74 -40 125 -153 50 -30 -47 68
2075F8j20k1j05K82r9L6j51J96p4O1m9k80K14r3L44j79n9P5j26k53L69J01k42
2098a05K79j70J02J51j30l12k24M53K3j47J52l98M14k02J27J10Pp2j6m1R9j47
2120d7O4q0L62k89j6J41n1J75j19j96j05K48Q4k33J85k07J25R6J24j15M9j75k15
2143a95P7k3N4K85M8Lk86m1k9pP8L63N4n21L30j90O8l3Nj97M30Pk64K15m76L02
2169E7o7pN6k23J84L93m02K58l48J05j91J82L3p8n6J55Lj1k30P8Q0J33o0J5l1
2194B8j05k61L60k0j83L34j92j26J17K3K77m15K21KQ2p8j46J61k04k1J96l6k56
2217b42J59J98m06M36l57M49m05P0K78l04L23j56J83k41Pjm1J13Q6k07p1K36j32
2240b5K4k8L5k87J72P4M0k30O7L28l96J83M4J89l64J32Q0K2j73K6MJ64j2l2q9
$$ plain form
2075 68 -52 -73 -178 104 5 41 -110 86 12 73 24 -256 -42 -135 209 30 -29 46 -80 -333 36 137 -105
2098 -105 174 4 106 257 127 -185 -409 44 67 -80 72 -326 88 -114 13 123 130 58 42 1 100 -47
2120 -47 17 -63 299 10 -6 135 84 259 140 -56 -161 87 171 -62 123 -84 41 137 261 146 195 20 -195
2143 -195 -118 -141 -87 198 246 249 -37 -78 -107 -114 -36 327 381 -140 190 0 68 35 40 -157 273 280 16 231 -245 57
2169 57 -10 -17 39 -184 0 393 -9 249 -99 6 -185 -3 30 -48 -104 51 54 43 -187 -109 -29 104 44 59 28
2194 28 -77 -338 22 2 -181 153 -39 -165 -48 -25 252 -163 58 60 142 64 -82 79 -125 -146 50 14 -242
2217 -242 -83 115 -291 145 -212 237 -168 -98 180 -124 199 43 226 -15 -8 -9 -50 63 149 -58 -129 107 -25
2240 -25 -1 -29 6 -281 -109 -35 5 -225 -158 170 -226 -43 1 190 -174 -42 38 60 -113 -87 -83 81 69 37 -52
2265e2m1m7J27r0Nj3Q2J93l6k43K11k4r5J29k15J82P3l6k46J86J1K8l98K15L3
2290f1O4n2j21K45o7m6J38k35J89rl81L42k46M40m27K16j76m3K50K8K1j56q5M62
2314B90k73jNJ0Q8k9L5k27N9J06n6J51j31j71J4L84k86O6J53j01J83l88J67q5
2338c7j3K41k69J9R5j21m12K06L51L67n84J5K40j14K99J1l73J66j23n2K12J2n9
2361G7J98l26j70J39Q3R2j52NnJ11K6l10Q9n6Q6J91J74k10l08M70j53o3l78M18
2385B8j89K83M2J5j99J1J91m2k65K5J68j08l02M18j03k5L37j82L3j62K2j52P7
2408g9J15k04J54N3R5j61m1j2j27L78k20M6M4j39J34j72J68j97K28l05L67Q5j56
2431E4j01M4j22j46J78m8K52q7j62J99k55K01j92K32K2k79L91j48q1Q5j30K2J02
$$ plain form
2265 -52 -93 -140 -13 -103 -98 -111 -29 164 128 -115 96 72 -23 106 -109 73 146 110 -136 50 61 89 -309 -94 -61
2290 -61 3 -49 -170 75 8 -38 100 -135 54 45 -336 6 -240 200 -227 -11 -187 -230 20 48 69 -87 -172 290
2314 290 17 16 21 31 119 90 125 -102 -43 63 7 158 27 -144 -130 254 -32 34 187 86 269 -119 48 -37
2338 -37 -50 191 -78 -59 36 -85 -497 -291 60 427 -157 -142 98 -16 283 294 -79 87 -36 -88 124 136 77
2361 77 275 -51 -221 -82 1 93 -59 -54 -59 52 78 -232 -143 -199 -113 78 252 42 -266 204 51 -12 -390 28
2385 28 -161 122 164 179 -20 -9 182 140 -125 -100 68 -40 -342 76 -27 -52 285 103 136 -26 -4 -156 -79
2408 -79 36 -168 -14 39 134 -27 -68 -80 -207 171 -49 -3 41 -98 36 -136 32 -165 63 -242 125 210 54
2431 54 -47 -3 -125 -271 -93 -141 111 24 -138 61 -194 7 -185 47 69 -210 181 33 -48 37 -93 -71 31
2454C1pQk0k75K60k45K49J89k50J64j09N0o4M7j4K2q3Rj53J18p7m0L14kj67p5
2480a20K85k20J51k08K26l32J34K2J59R4n2j01j35L08k30k44L6K01oj1J66N9k51
2503f9J9l2K96L1j12j09N0m80K40K28r9Q9j18p6L83j50J6j39K26j59j18K97n35
2526c21M35j17R2rP5l46o2%J80N4l7K62m7l64J60n0J52J24r9J05m16J85J09p9
2550a4j8j0p3J18J38qj30qP1J13l10J17j21K47J02j58o9K0m9J1l3j6J81q9Q9k78
2576a77N33l30j40L19l25J43O4k73J74p8K91k63l8K41j44J4j4j66L09k06%Mq1
2599a43N2o2N2J51r2K78j84j61J24l2J31j78N7R5O0j86k53L96k37J63j60rJ48
2622A0M6k81K48m36M45J49j74J40l14J85n3M9j69J3J27j26L75l4m23L51k33K30
$$ plain form
2454 31 24 32 12 -263 -3 -248 1 190 -60 104 -5 45 -19 28 14 36 -47 -38 -191 -73 -150 -190 124 122 -45 -120
2480 -120 165 -55 96 -112 114 -218 -84 -62 97 191 139 38 -97 211 -19 -263 -227 -26 -32 -43 123 182 -69
2503 -69 -50 -82 214 245 133 24 74 -406 -166 62 -37 52 -66 -142 241 91 107 -32 194 35 -83 214 -321
2526 -321 114 -3 89 80 155 -191 -253 -253 -73 -19 -56 206 159 -205 -45 -95 57 181 82 187 -229 -44 65 -14
2550 -14 -32 -42 -115 3 141 133 3 -5 66 179 -131 -14 -135 112 214 56 -13 7 -42 -31 -64 -80 101 12 101 -177
2576 -177 356 26 -114 205 -120 23 87 -186 -12 -90 201 -62 -100 141 -3 11 -3 -169 140 -66 -66 -62 -143
2599 -143 -91 -153 -101 50 -42 236 52 -109 15 -17 114 -64 -7 88 148 -38 -291 105 -132 31 -129 -138 10
2622 10 56 -225 23 -413 32 181 7 147 -167 18 -35 14 -155 -142 -15 -141 234 200 -223 128 -105 125
2644A25j21J14j0l28L56k23J83m6Q0j17L4l49K91l2M1l54K45J13o6j99M23j7k42
2667i9k17L00K35n4j51r1M6J99Q7k6k5j34k13J34QJ5k25K85o5J81q2j17p7J41
2691E5p7J36l84L10j92J24N2l03O8k4M8k4M24l53m0K57j26J87j34J16m42K54P2
2714DK53k30Jq3j26J84j26Pn2K68qo3J57j53JM7j57J15k39K5K30R9k58R6K8QK2
2741E0K0j5r3J4j06K35KJ53j89O5k04Q8K02o43J49K15J93k62K56k94O2N2K8k5
2765d7M8K2k1J17l79K58J86m00K31k2J04k63l7J60j16J59mj95J87k22L09j50o8
2788a43J17J82k73L8L5jj29L11j17j26K41j79j76L83j74J04r5N5k48L45o5N6j10
2811C1o2K21j74N6j26K46l04o1K0K06l8J08k91j8J44J90k57K80j76j66J05O1K8
$$ plain form
2644 125 4 118 108 -220 136 -87 96 50 130 13 47 -302 -11 -43 -2 -356 -111 2 -64 -263 160 143 -99
2667 -99 -316 -16 219 165 14 -77 -31 168 255 229 204 70 -143 -9 -1 14 -211 74 9 190 108 -9 -86 55
2691 55 -22 114 -270 40 -152 -28 24 -279 -211 -235 -187 -211 213 -140 -180 77 -49 138 4 120 -322 -68 4
2714 4 257 27 28 -55 -181 3 -123 -116 -168 100 92 29 186 33 34 81 -76 39 -200 -175 55 154 -104 -8 20 28 50
2741 50 70 55 -38 -24 -130 105 107 260 71 136 -68 20 222 -421 -272 -57 136 -126 130 -164 -102 -50 -22 -47
2765 -47 1 23 2 119 -260 -2 184 -216 15 -7 97 -166 -203 -43 -159 0 -4 -199 -12 -234 75 -75 -143
2788 -143 -26 156 -117 -79 -44 -45 -174 137 20 -106 135 -44 -220 163 -11 93 -2 53 -195 150 85 141 31
2811 31 -31 190 16 72 -54 192 -112 -173 -153 53 15 123 -168 -186 -42 148 -109 171 -5 -171 -66 -5 23
2834B3j60N9J45r6rJ97l6j42k04K7K66L2k18J80j10%K27j7j00k69J80O3P0q2l1
2859ek12J31N2Jlj77M12j69p0J13n2o7J55j8j67J81m04J60M7K95p8l91L81Lj43
2884b5R3J1j21K45m15J38L32k30j14J89m2N9K2j58j52n9K57j47O3J95p7M9J01
2907B14k23K1J4J49o0P6o3j89K54l45K58L7l31O2k4K56N9p0m3m5J03j96J87J88
2931B89k96J63j18j96J59J02J21k37K75Ql83K65l1o4Q1P8k43K70m89K94l00K2
2953b30M8k6J97j57lJ64r2J71k71J53J81j44K65j58j5K4Lj86J51k97K72r3O0n3
2977c6K89k60j46K48k42R1j11J62o8K07O8%k06K06q5j62J59l85K34mj65M95k47
3000D2j78J08j42J25p9M74j78m00M21j07P7j58J11k23K58J29m89L49j65j57J40
$$ plain form
2834 23 -137 -78 67 -29 -38 159 123 -19 -223 -196 70 102 -116 64 -46 -46 181 164 64 -205 -25 38 108 26 -5
2859 -5 -217 -86 -34 -33 -36 -213 199 30 -40 73 21 -46 109 91 -76 105 -299 -139 -92 203 125 -266 115 118 -25
2884 -25 68 79 -42 203 -212 -74 258 28 -86 103 61 120 142 -16 -168 -227 30 -117 -54 141 64 113 214
2907 214 -9 12 26 175 115 191 128 -61 193 -152 106 143 -188 -126 -150 106 165 95 52 7 110 -86 101 289
2931 289 -7 156 38 -158 1 103 224 -13 262 270 -113 152 121 57 138 216 -27 243 -246 48 -252 -230
2953 -230 -182 -208 -11 -168 -171 -7 -99 72 -199 -46 135 -9 256 98 83 107 110 -76 75 -222 50 -43 17 -36
2977 -36 253 -7 -153 95 -147 -56 -167 -5 -73 134 202 202 -4 202 117 -45 114 -271 -37 -41 -206 289 42
3000 42 -136 -28 -170 -45 -124 350 172 -228 193 86 163 5 116 -107 151 280 -209 140 -25 -182 -42
3021d2j13M22j5l64J63O4j91K4o4N7J3k0J54k0j73M19l25Pp7O5M2J60n01N38j64
3046E9j17rj64J50N2P7k57Q2r9M60j77m5K05j42k92J84L1j83K88j93J49k22o5
3069b28J19K10k85K01j1nN3o0qJ15l01j29J8K24K49m31M67k94N5J06j81L53m83
3092b46J54j02R8O5J30j89K22k55M02N0l22J32k70K75k70L45k22OQ8K67k77L25
3114D06m62J31O6k27K22l32K05j55J92J63l23R8m6o7Q2J42n7k27K20m4k3J41n
3137A00K04j49k13J68j34J94o3q4O1p5l72N13r6J17k08o5M8J09j20MJ39o6j40
3160a28K78n5l60J26J73J41l09J83K6j14N9k16R7q3J59j7k57L22j43J90l09L63
3182A26k61J62j98J63J00q1k42O9K91k95R9J23k12J32n8J93J50m51M56l93L03
$$ plain form
3021 -42 -155 267 252 -112 51 115 -76 -52 -116 -59 -46 -66 88 68 -105 314 -11 -4 -81 -16 26 186 -315 223 59
3046 59 -58 -67 -231 -81 -29 48 -209 -127 -226 234 57 12 217 75 -217 -33 -2 -185 103 -90 59 -163 -228
3069 -228 -109 101 -184 17 6 1 54 -6 -14 101 -200 -329 -311 -87 162 -269 198 -96 -41 65 -116 237 -246
3092 -246 -92 -194 -96 -31 99 -90 132 -123 279 329 7 139 -131 144 -126 219 -3 3 91 358 81 406
3114 406 -56 75 141 -86 136 -196 9 -146 46 209 -114 -16 -62 -129 -47 95 38 -189 31 -13 -36 105 100
3137 100 304 155 -58 110 -24 170 107 23 84 9 -363 150 54 171 -37 -102 -54 55 -65 -61 78 12 -128
3160 -128 150 95 -265 -139 34 175 -134 49 75 -39 20 -196 -99 -182 -23 -40 -297 25 -118 72 -237 126
3182 126 -135 27 -171 -8 92 11 -231 -162 129 -166 -67 56 -156 -24 -82 111 261 -190 266 -127 176
3203A76j03k05R4K15l14J30j39j57L03J47k03Oj07M2J19j06J62l15L13K84j48
3224A94k61j51M37k09K15k25j4L2kJ55m06L65j41k1j95J74l2j3Q4K12l03k4J61
3247C2k49J42K18j78k39M13j98L4k4N2j00J89J0j49K39k78j22L13P6l14J32J33
3269A32j32J17p8k9j85Q7R7L3L4j83M0J94j42j24J95k72L28k86L24r8k05L02l31
3292a82N61l49m1P9l1J3J30N1k27j70J92k3L6j33K19kk12L6j18L78j74r0J54M5
3316A42j70M5J23l50M13J61l23k07j34K89j1k55K27L25l56l27M40K00l38L49m22
3337a79J36RK1L04l64J13J86j64L28n67N9M02l56O1l9m3K09j74nJ46r5J17q2m
3361A9p8j9N1J42k4L1M8m51M45k25J56m1L6r7J99m22J57J12k39j12K70K22k24
$$ plain form
3203 176 73 -132 -38 177 -137 -7 -146 -303 0 147 -56 -50 -157 -115 4 -102 60 -255 58 342 194
3224 194 -67 -218 219 10 225 0 -14 18 16 171 -235 130 -11 -32 -227 -53 -85 -98 -14 198 -105 -129 32
3247 32 -217 -75 143 -35 -274 139 -59 -25 -49 3 -97 92 102 -47 192 -86 -208 105 181 -133 -1 132
3269 132 0 117 39 10 -175 -88 9 42 76 -107 -67 127 -15 -139 56 -216 112 -174 150 52 -153 149 -182
3292 -182 379 30 -11 68 37 50 180 231 4 -166 26 3 39 -94 125 123 -89 -53 -171 207 33 -57 97 142
3316 142 -28 17 140 -210 203 364 41 -166 -300 -11 -22 -277 -50 275 -81 -408 32 232 -106 243 -179
3337 -179 -43 -34 -13 291 -73 40 226 62 390 -177 -118 284 -72 -11 -50 -93 116 -58 -63 83 -12 105 23 19
3361 19 -59 -78 -27 115 91 122 170 -281 164 -61 95 54 90 -7 192 -230 -73 39 -200 -312 -42 180 -44
3384d4N4lj04J80j83r4K67j09n8J65k75P3K60J5j09J5k98L64j83kK10o7j81J59
3408E2Q2k21l00L11m4J83k14Q4J8J7J84k58J19P5Q5j97P2R2m9j51K05j65q9L20
3432B11k06o4J54m2j2L9P1j13k50M47k59M3o1L22j75j80L13k39J18k63J13j98
3454b31J8R5K94j61J72k88L15rj99k80J55q8j51L06J51k61M6J14K31m24RK18j44
3477a12J38L46l61J6m4L32l15j86J12J80j62j58J25J83K54j92P0m23K12Q6N8K3
3499A82j0k03q6%J73m6j25M19k41k09J87k90J31R7p4j75M05k47K79o9l06M06k46
3522d8j2J75k1q8J28j48j02j14L98j88mk15L28j22L9l56M35j52R9J21k71o0NM5
3546a28K03J96k08k07R6J04K4j09L2Oj47J36O7J14m10L15J89l60J7L03j77J16
$$ plain form
3384 -44 10 7 -97 83 -100 -194 73 -36 -94 71 -204 -131 129 144 35 50 -248 116 -67 -69 141 74 -107 52
3408 52 134 -87 -387 -76 -120 63 -151 -67 -49 -32 152 -106 13 88 173 -24 48 140 91 -60 145 -20 -109 211
3432 211 5 -59 95 53 41 80 151 38 -212 235 -24 19 -42 280 105 -75 238 -1 117 -146 -33 -231
3454 -231 -213 -118 176 15 187 -101 214 205 6 -274 -119 -207 -358 -52 99 -162 -116 -2 229 -195 -186 32 -112
3477 -112 26 372 11 27 -17 315 0 -186 -74 106 -56 -214 -89 94 348 156 226 -197 15 101 159 182
3499 182 172 -31 -117 -117 56 10 -115 304 63 -146 41 -249 -118 -21 -95 -270 135 -112 167 98 -208 198 -48
3522 -48 -60 115 94 6 134 -14 -116 -230 168 -20 -24 -239 89 -33 6 -350 85 -67 32 153 -118 -178 -173 -128
3546 -128 75 271 63 -144 -48 56 80 -29 3 9 -138 -2 65 179 -231 84 273 -87 -70 233 56 172
3568A72r9k59K39p3J01k94L4K12r3p6K22mj44J8J74k92M0M63p36K14J63j32o1
3591b11J24J5L1nK2j08K68m52J57K22O8o1l07J60P6K8L7j25K9J66j3j17l0j86
3615b12Q3k68L82J1K66o9p9j09m53O03j29J44j15R8p4j65M9K18k29J60j86J40
3637F6j36J34j87J96K7nj55j03M13l76K40m3j67J63k7k8M1M9o2j90k6K54k75L66
3661A69n78M26o4M4K06j21l13M25k81j18K26n7J32m65K35L06k21j42K89rk4n2
3683A3k6M3Q4n8R6q7q6p6J03o8J38L2j37k19K21k8L4o8K88L8k86J26L5J36k49
3708aK26j55L6O5q4l6p0P5p1J28m35K46K34j47j13o3R2m7RK36l04L33r2n0J4j00
3734g4k1J33j54j51J53Q9j30Q7j68L39j62K0j0k1K84j71r2P2j61L70l62P4K9J56
$$ plain form
3568 172 73 -186 53 -20 81 -213 -179 33 -60 -136 86 82 -62 -44 130 -162 -122 341 -395 -181 -18 -150 -211
3591 -211 -87 -72 -41 -46 -24 -132 136 -316 -159 63 131 70 -237 -77 -1 27 64 -61 -32 134 121 4 -26 -212
3615 -212 -129 -397 -15 -4 262 193 114 5 -448 155 26 170 55 153 79 -86 -37 181 -48 112 -74 66
3637 66 -70 64 -123 73 100 95 -60 -163 250 -126 114 71 -96 67 40 12 53 102 40 -150 -176 78 -197 169
3661 169 -409 17 -47 -3 203 82 -231 194 -87 -205 21 -36 96 -369 -134 172 -49 -191 98 89 65 13
3683 13 -13 30 114 56 152 65 -21 -97 6 -62 76 108 -29 -248 -27 -55 -21 -89 199 237 -49 77 112 248 -1
3708 -1 225 70 106 171 87 51 -19 56 -15 113 -322 -76 158 11 -102 -165 -73 -120 -111 125 -179 154 62 12 26 -74
3734 -74 -95 38 -116 -267 -114 -25 -155 -68 -236 103 -59 -39 -49 -70 214 43 -49 23 -138 232 -130 -56 -27 129
3758A29n3j68J32L5j65J75K43l79J27k65J33J41l0n6M1Po7j55K84k72J35j39L13
3781A46k56K53j06m6Rk71J13J61jk04J0K99l38L39j14o0J4N1J30J7j57l7L67k47
3805G2J23n9O2n49J06K75J2l1o8Nn0M59l15j20K96k10Q6k29K02j97J62J65qj20
3829F9J4j28k0J29j64K91k99j43jK41J56j88j02L95r4j25o0L1k94L03j47N5Q8
3852Gl0J48o6J43m2k74jL48k54J98m49K98j92J73n5l80J67J96K3k4R9L6j07J20
3876H2j96j8m8K41k02n4L4Q2j61L84j92k02M11k35j59M91j51K04l77K10k06K58
3898A96k24J00O8k94Q6l41M83J41M0l13L0l4m8J49K31J57n35K09J49k70LL6k29
3921b10K03J17k50K76j2j12l2L7P8q7p7n6j07N1K2J60J49j25r7L9n4J85l23L70
$$ plain form
3758 129 76 -92 40 75 -90 85 328 -51 76 -189 -56 85 55 -1 40 47 -20 -175 109 -163 -28 -167 146
3781 146 -110 143 37 -9 0 -271 -158 3 2 -202 -192 107 -231 108 -6 -66 -52 -1 129 146 -11 -48 319 72
3805 72 195 136 198 -351 -245 30 42 11 -57 -52 -102 357 42 -78 218 8 94 -135 67 -130 32 197 189 69
3829 69 83 -45 -65 64 -100 191 -108 -251 -252 -11 145 -43 -145 250 156 31 -29 2 -292 11 -136 -81 7
3852 7 -23 125 59 202 160 -114 -115 233 -21 177 -272 26 -166 7 -48 -428 -261 -65 -42 -66 33 69 -38 82
3876 82 -114 -132 -180 61 -141 -195 -161 -79 -240 144 -48 -250 161 -74 -233 258 107 311 -66 144 -62 196
3898 196 -28 72 140 -154 -68 -409 74 215 255 -58 -28 -62 -110 39 270 427 -108 101 250 -20 -17 19 -210
3921 -210 -7 110 -140 136 124 12 -20 17 95 8 -69 -125 -232 -181 -159 1 150 25 -72 -33 -87 98 -225 145
$$ [...]
8191a65
##END NTUPLES=NMR FID
##END=
