##TITLE=1H_Pr 2A-2OMe
 200.13MHz,CDCl3,
 8 sc
 
 25.6.2025
##JCAMPDX= 6.0         $$ Bruker NMR JCAMP-DX V2.0
##DATA TYPE= NMR FID
##DATA CLASS= NTUPLES
##ORIGIN= UXNMR, Bruker Analytische Messtechnik GmbH
##OWNER= pz
$$ XWIN-NMR		Version 3.5
$$ Wed Jun 25 16:11:00 2025 Russian Standard Time (UT+4h)  she@DPX200
##.OBSERVE FREQUENCY= 200.1313
##.OBSERVE NUCLEUS= ^1H
##.DELAY= (6, 6)
##.ACQUISITION MODE= SIMULTANEOUS
##.ACQUISITION SCHEME= undefined
##.AVERAGES= 8
##.DIGITISER RES= 18
##SPECTROMETER/DATA SYSTEM= spect
##.PULSE SEQUENCE= zg30
##.SOLVENT NAME= CDCl3
##.SHIFT REFERENCE= (INTERNAL, CDCl3, 0, 14.3821)
##AUDIT TRAIL= $$ (NUMBER, WHEN, WHO, WHERE, WHAT)
$$ ##TITLE= Audit trail, XWIN-NMR		Version 3.5
$$ ##JCAMPDX= 5.01
$$ ##ORIGIN= Bruker BioSpin GmbH
$$ ##OWNER= she
$$ F:/spectra/data/she/nmr/H-C/1/audita.txt
$$ ##AUDIT TRAIL=  $$ (NUMBER, WHEN, WHO, WHERE, WHAT)
(   1,<2025-06-25 16:09:24.59 +0400>,<she>,<DPX200>,
      <created by zg, POWCHK disabled, PULCHK disabled
       configuration hash MD5:
       00 E9 B6 7A A2 85 ED C7 34 08 36 98 17 FE 4E 26
       data hash MD5: 16K
       18 10 AC 7C 10 99 81 0F 65 B9 4B 09 0F 4C 6E 70>)
$$ ##END=
$$ 
$$ hash MD5
$$ 3B FD 25 21 C1 BA 4E 89 EB 90 72 74 0D 19 FD 84
##$RELAX= 
##$RELAX= 
##$RELAX= 
##$RELAX= 
##$RELAX= 
##$RELAX= 
$$ Bruker specific parameters
$$ --------------------------
##$DU= <F:/spectra>
##$EXPNO= 1
##$NAME= <H-C>
##$PROCNO= 1
##$TYPE= <nmr>
##$USER= <she>
##$AMP= (0..31)
100 100 100 100 100 100 100 100 100 100 100 100 100 100 100 100 100 100 
100 100 100 100 100 100 100 100 100 100 100 100 100 100 
##$AQSEQ= 0
##$AQ_mod= 1
##$AUNM= <au_zg>
##$AUTOPOS= <>
##$BF1= 200.13
##$BF2= 200.13
##$BF3= 200.13
##$BF4= 200.13
##$BF5= 200.13
##$BF6= 200.13
##$BF7= 200.13
##$BF8= 200.13
##$BYTORDA= 1
##$CFDGTYP= 0
##$CFRGTYP= 5
##$CHEMSTR= <none>
##$CNST= (0..31)
1 1 145 1 1 1 1 1 1 1 1 1 1 1 1 1 1 1 1 1 1 1 1 1 1 1 1 1 1 1 1 1 
##$CPDPRG= <>
##$CPDPRG1= <>
##$CPDPRG2= <>
##$CPDPRG3= <>
##$CPDPRG4= <mlev>
##$CPDPRG5= <mlev>
##$CPDPRG6= <mlev>
##$CPDPRG7= <mlev>
##$CPDPRG8= <mlev>
##$CPDPRGB= <>
##$CPDPRGT= <>
##$D= (0..31)
0 0.7 0 0 0 0 0 0 0 0 0 0.03 0 0 0 0 0 0 0 0 0 0 0 0 0 0 0 0 0 0 0 0 
##$DATE= 1750853364
##$DBL= (0..7)
120 120 120 120 120 120 120 120 
##$DBP= (0..7)
150 150 150 150 150 150 150 150 
##$DBP07= 0
##$DBPNAM0= <>
##$DBPNAM1= <>
##$DBPNAM2= <>
##$DBPNAM3= <>
##$DBPNAM4= <>
##$DBPNAM5= <>
##$DBPNAM6= <>
##$DBPNAM7= <>
##$DBPOAL= (0..7)
0.5 0.5 0.5 0.5 0.5 0.5 0.5 0.5 
##$DBPOFFS= (0..7)
0 0 0 0 0 0 0 0 
##$DE= 6
##$DECBNUC= <off>
##$DECIM= 32
##$DECNUC= <off>
##$DECSTAT= 4
##$DIGMOD= 1
##$DIGTYP= 9
##$DL= (0..7)
0 120 120 120 120 120 120 120 
##$DP= (0..7)
150 150 150 150 150 150 150 150 
##$DP07= 0
##$DPNAME0= <>
##$DPNAME1= <>
##$DPNAME2= <>
##$DPNAME3= <>
##$DPNAME4= <>
##$DPNAME5= <>
##$DPNAME6= <>
##$DPNAME7= <>
##$DPOAL= (0..7)
0.5 0.5 0.5 0.5 0.5 0.5 0.5 0.5 
##$DPOFFS= (0..7)
0 0 0 0 0 0 0 0 
##$DQDMODE= 0
##$DR= 18
##$DS= 0
##$DSLIST= <SSSSSSSSSSSSSSS>
$$ [...]
##$SUBNAM0= <"">
##$SUBNAM1= <"">
##$SUBNAM2= <"">
##$SUBNAM3= <"">
##$SUBNAM4= <"">
##$SUBNAM5= <"">
##$SUBNAM6= <"">
##$SUBNAM7= <"">
##$SUBNAM8= <"">
##$SUBNAM9= <"">
##$SW= 18.0517328524113
##$SWIBOX= (0..15)
0 0 2 0 0 0 0 0 0 0 0 0 0 0 0 0 
##$SW_h= 3612.71676300578
##$TD= 16384
##$TD0= 1
##$TE= 0
##$TE2= 300
##$TE3= 300
##$TEG= 300
##$TL= (0..7)
0 120 120 120 120 120 120 120 
##$TP= (0..7)
150 150 150 150 150 150 150 150 
##$TP07= 0
##$TPNAME0= <>
##$TPNAME1= <>
##$TPNAME2= <>
##$TPNAME3= <>
##$TPNAME4= <>
##$TPNAME5= <>
##$TPNAME6= <>
##$TPNAME7= <>
##$TPOAL= (0..7)
0.5 0.5 0.5 0.5 0.5 0.5 0.5 0.5 
##$TPOFFS= (0..7)
0 0 0 0 0 0 0 0 
##$TUNHIN= 0
##$TUNHOUT= 0
##$TUNXOUT= 0
##$USERA1= <user>
##$USERA2= <user>
##$USERA3= <user>
##$USERA4= <user>
##$USERA5= <user>
##$V9= 5
##$VALIST= <valist>
##$VCLIST= <CCCCCCCCCCCCCCC>
##$VD= 0
##$VDLIST= <DDDDDDDDDDDDDDD>
##$VPLIST= <PPPPPPPPPPPPPPP>
##$VTLIST= <TTTTTTTTTTTTTTT>
##$WBST= 1024
##$WBSW= 4
##$XGAIN= (0..3)
0 0 0 0 
##$XL= 0
##$YL= 0
##$YMAX_a= 98874
##$YMIN_a= -136178
##$ZGOPTNS= <>
##$ZL1= 120
##$ZL2= 120
##$ZL3= 120
##$ZL4= 120
##$ABSF1= 10
##$ABSF2= 0
##$ABSG= 5
##$ABSL= 3
##$ALPHA= 0
##$AQORDER= 0
##$ASSFAC= 0
##$ASSFACI= 0
##$ASSFACX= 0
##$ASSWID= 0
##$AUNMP= <proc_1d>
##$AZFE= 0.1
##$AZFW= 0.1
##$BCFW= 1
##$BC_mod= 2
##$BYTORDP= 1
##$COROFFS= 0
##$CY= -3
##$DATMOD= 1
##$DC= 2
##$DFILT= <>
##$DTYPP= 0
##$F1P= 0
##$F2P= 0
##$FCOR= 0.5
##$FTSIZE= 0
##$FT_mod= 4
##$GAMMA= 1
##$GB= 0.15
##$INTBC= 1
##$INTSCL= 1
##$ISEN= 128
##$LB= 0.25
##$LEV0= 0
##$LPBIN= 0
##$MAXI= 10000
##$MC2= 0
##$MEAN= 0
##$ME_mod= 0
##$MI= 1.114404
##$NCOEF= 0
##$NC_proc= 0
##$NLEV= 6
##$NOISF1= 3.799351
##$NOISF2= 2.8
##$NSP= 1
##$NTH_PI= 0
##$NZP= 0
##$OFFSET= 14.38212
##$PC= 1
##$PHC0= -1192.455
##$PHC1= 5.992197
##$PH_mod= 1
##$PKNL= yes
##$PPARMOD= 0
##$PSCAL= 0
##$PSIGN= 0
##$REVERSE= no
##$SF= 200.129724274929
##$SI= 16384
##$SIGF1= 3
##$SIGF2= 2
##$SINO= 400
##$SIOLD= 16384
##$SREGLST= <1H.CDCl3>
##$SSB= 0
##$STSI= 0
##$STSR= 0
##$SW_p= 3205.1282051282
##$SYMM= 0
##$S_DEV= 0
##$TDeff= 0
##$TDoff= 0
##$TI= <>
##$TILT= no
##$TM1= 0
##$TM2= 0
##$TOPLEV= 0
##$USERP1= <user>
##$USERP2= <user>
##$USERP3= <user>
##$USERP4= <user>
##$USERP5= <user>
##$WDW= 1
##$XDIM= 8192
##$YMAX_p= 0
##$YMIN_p= 0
$$ End of Bruker specific parameters
$$ ---------------------------------
##NTUPLES= NMR FID
##VAR_NAME=  TIME,          FID/REAL,        FID/IMAG
##SYMBOL=    X,             R,               I
##VAR_TYPE=  INDEPENDENT,   DEPENDENT,       DEPENDENT
##VAR_FORM=  AFFN,          ASDF,            ASDF
##VAR_DIM=   8192,          8192,            8192
##UNITS=     SECONDS,       ARBITRARY UNITS, ARBITRARY UNITS
##FACTOR=    0.0002768,     1,               1
##FIRST=     0,             0,               0
##LAST=      2.2672688,     0,               0
##MIN=       0,             -136178,         0
##MAX=       2.2672688,     98874,           0
$$ Real data points
##PAGE= N=1
##DATA TABLE= (X++(R..R)), XYDATA
0@%%%%%%%%%%%%%%%%%qJ6j6J6j6J6k2L0l2L4m2M8n5O3p1Q1r0J03j17J32j48J64
$$ 0 0 0 0 0 0 0 0 0 0 0 0 0 0 0 0 0 0 -8 8 -8 8 -8 8 -14 16 -16 18 -24 24 -31 32 -39 42 -48 55 -62 70 -78 86
39H6j83K05k27K51k77L06l39L75m13M54n00N52o10O71p40Q18r05J006j122J257
$$ 86 -97 108 -119 132 -145 161 -178 197 -216 238 -262 290 -320 351 -389 429 -476 530 -592 665
59F65j415J604j839K136k525L060l842N103p456J3315n6228q8756J19960J15092
$$ 665 -750 854 -985 1151 -1374 1686 -2156 2947 -4509 8806 -47422 -136178 -16218 98874
73I8874j1639p6556q691L6393M462l3778o568J1998J1654K144j5973l0467j3709
$$ 98874 87235 10679 1988 38381 42843 9065 2497 14495 26149 28293 12320 -18147 -31856
86c1856J5242L2403O5l1478j0290J6088L980j321J2837K1012m083k8120q478J3678
$$ -31856 -16614 15789 15854 -15624 -25914 -9826 -5846 -7167 5670 26682 22599 -5521 -13999 -321
100c21k887m949J3101J0061j1228j9306l637J0609N750O607M851j5985j3932J4534
$$ -321 -3208 -8157 4944 15005 3777 -15529 -19166 -8557 -2807 3800 8651 -7334 -21266 -6732
114f732J9686K0j1776J095J4259n532k2340l98J9173Q876j0789j2035J397m60
$$ -6732 12954 12974 1198 2293 16552 11020 -11320 -11718 7455 16331 5542 -6493 -5096 -5556
128e556o230Q229R271j3215j1345J0128J2053n964r209J2582J4972j3641j4391
$$ -5556 -11786 -3557 5714 -7501 -18846 -8718 3335 -2629 -11838 744 15716 2075 -12316
141a2316J1075J4855k832j0834M88R547k799q451N429Q486j325q018p389L35L717
$$ -12316 -1241 13614 10782 -52 436 9983 7184 -1267 4162 12648 11323 3305 -4084 -3749 -32
156c2K942M784k727j0897n33N919l373o365L778J2175J83j5265l673J1911N097
$$ -32 2910 7694 4967 -5930 -6463 -544 -3917 -10282 -6504 5671 5854 -9411 -13084 -1173 3924
171C924l868l169R97L897j795m062K064N040L461p35p351k724O009M031k599o482
$$ 3924 56 -3113 -2116 1781 -14 -4076 -2012 3028 6489 5754 -1597 -4321 1688 5719 3120 -3362
187c362P49R599p58j1108k33J1040L813j1094j0322P756J0281m877o982J641M424
$$ -3362 -2613 6986 6228 -4880 -5113 5927 9740 -1354 -11676 -3920 6361 1484 -5498 -3857 567
202E67Q32m767l719L440M805K567j905n777J254P580K597l509m440J232N078k792
$$ 567 1399 -3368 -7087 -3647 1158 3725 1820 -3957 -2703 4877 7474 3965 -475 757 5835 3043
218C043o820K124O960J551n158n380J302K900o23K29p86j704R79K28k765j291
$$ 3043 -3777 -1653 5307 6858 1700 -3680 -2378 522 -101 128 -658 -2362 -1383 -1155 -3920 -5211
234e211L783N294n48p559k270M774K376p07j11J944L214l400n379J176L989J993
$$ -5211 -1428 3866 3318 -4241 -6511 -1737 639 -68 -179 1765 4979 1579 -3800 -2624 1365 3358
250C358o77j961J71P64j363K62K26Q78K427j754n465l86L796K492k506l658J935
$$ 3358 2681 720 891 1655 292 554 780 1658 4085 2331 -3134 -3520 276 2768 262 -3396 -1461
267a461L031k193k473L83K832K708k406l655J149K697K145l12l327q22K360J390
$$ -1461 1570 -623 -3096 -2713 119 2827 421 -3234 -2085 612 2757 2445 -882 -1704 656 2046
283B046j354j707O38M215r28n832j028M086L180j780l503M55K427q23j348J95
$$ 2046 692 -1015 -377 3838 2910 -2922 -3950 136 3316 1536 -1967 -1512 915 92 -1256 -1061
299a061J594K044j799m026M66L195J781j403k936Q83K288j355k110Q53L795K664
$$ -1061 533 2577 778 -3248 -2782 413 2194 791 -2145 -1262 1026 -329 -2439 -1586 2209 4873
315D873m036m475J707M212N23k030q61J811N38k713j537J069K118J659k216l155
$$ 4873 837 -3638 -1931 2281 2804 774 -87 1724 2262 -451 -1988 -919 1199 2858 642 -2513
331b513J73J328O80n44q12J339J314j766j622M92J964K103j367j737J299J590
$$ -2513 -2340 -1012 -332 -876 -1688 -349 965 -801 -2423 -1931 33 2136 769 -968 331 1921
347A921m75j044j167R86J434r00j644m82J691K094j928l373R54K576R85j658j970
$$ 1921 1446 402 -765 221 1655 755 -889 -1371 320 2414 486 -2887 -1933 643 1628 -30 -2000
364b000J404K301j516j830o9K113K082j977k850O61J843Q39m27j038O02J302j322
$$ -2000 -596 1705 189 -1641 -1710 403 2485 508 -2342 -1681 162 1001 574 -464 138 1440 118
381A18j353k34K115K272j564k573Q03J127l36k81k37J107L7j901j817M35K556
$$ 118 -1235 -1469 646 2918 1354 -1219 -416 711 375 94 -143 964 1001 -900 -2717 -2282 274
398B74K133j938k379M70J118L15r91k09K106J982k142k788q6K706K612j705k816
$$ 274 2407 469 -1910 -1440 -322 -7 -998 -1207 899 2881 739 -2049 -2135 571 3183 1478 -1338
415a338Q36J074Q7j163n02K065J636j770k605L35J839J527j368j803J012M52l61
$$ -1338 -502 572 659 -504 -1006 1059 2695 925 -1680 -1345 494 2021 653 -1150 -138 314 -47
432d7j40K34R78o42k269o99J290J566Q82j323q63N36k42j08J046J133P31p61k115
$$ -47 -187 47 1025 383 -1886 -2585 -1295 271 1153 -170 -1033 -497 -739 -847 199 1332 2063 1302 -813
451h13j063J180K099J097j241j886o0k88l97M96J077J479k61k527j453J455K546
$$ -813 -1876 -696 1403 2500 1259 -627 -687 -975 -1372 -876 201 1680 1419 -1108 -2561 -1106 1440
468A440J246j680j838M07K90n60o1R17J831q0k866j666P28K531J558j823j691
$$ 1440 2686 1006 -832 -425 -135 -695 -756 161 1992 1912 -954 -2620 -1892 639 2197 374 -1317
485a317Q85Q70k11r9K66J789m9k410j800J376J930N03j788j351O99k02l92L17
$$ -1317 -432 438 227 128 394 2183 2134 -276 -2076 -700 1230 1733 -55 -1406 -707 -909 -1301 -984
503i84R52R72r12k406K76K528J523j89j959l33O80l52n60R53R66J001j338k654
$$ -984 -32 940 28 -2378 -2102 426 1949 1760 -199 -532 148 -204 -764 189 1155 2156 818 -1836
521a836m81J360K427R27k012k070P12J008K17m70Q4J949K7k654j544J453K094
$$ -1836 -2317 -957 1470 2397 385 -1685 -973 35 252 -218 -134 1815 1842 -812 -2356 -903 1191
538A191R85j865j276P05N5k38OR84O85r98j513L80J482N47k85r33l02l8m76nP89
$$ 1191 2176 311 -965 -260 -205 -443 -437 547 1232 234 -1279 -899 583 1130 845 -88 -390 -428 -904 -909 -120
559a20P69P34j052j560j24J471R49j5j250q90P96O66%n22L2Q97j42j576p88J262
$$ -120 649 1383 331 -1229 -1353 118 1067 1052 -198 -1088 -292 374 374 -148 -116 781 639 -937 -1725 -463
579d63J317L47j126r90L82L11L42M93o7K8p04n78M47P20K12L47k17m97p74o65
$$ -463 854 1201 75 -915 -533 -222 120 613 546 574 -130 -708 -261 459 671 1018 801 304 -470 -1135
599a135O47M43M32N13j038j018L49J125L48n71o06N39Q62p28r72L49J129O81j265
$$ -1135 -488 -45 387 900 -138 -1156 -807 318 666 95 -511 28 890 162 -810 -461 668 1349 84
618H4j196J93R73L38k67r41K48P55l63k64N1M87L42n73n94M04O13L63j05m23q7
$$ 84 -1112 -919 54 392 125 -816 -568 187 -176 -440 -389 98 440 -133 -727 -323 290 653 548 125 38
639C8J59j66j76K38J31M04m21q80N6Q98L69n09o61O53L95k64r10L90R74M63r99
$$ 38 197 31 -145 93 224 628 207 -673 -617 281 650 141 -520 133 528 264 -646 -256 718 1181 182
660A82j289O18O06N2j77m95L68M31o69l15J77P49O51o98o51J09N36m4J85n4o9
$$ 182 -1107 -489 117 169 -8 -503 -135 296 -373 -688 -511 238 889 191 -460 -351 185 141 326 272 203
681B03J77o34k36oL69M38j7o46r3J31q7J95j8J96J88l7m47q9M53L85j63n40P4
$$ 203 380 -254 -490 -496 -127 311 294 -352 -445 -314 -401 -206 -224 -28 160 123 -324 -413 40 425 262 -278 -204
704b04M60j04K89o62K48P4Q6l22k49M65O43l33q01K53N04j13J36m85L21M0k92
$$ -204 256 152 441 -221 27 101 187 -135 -384 81 724 391 -410 -157 347 234 370 -115 206 246 -46
725d6l22l7P81K23o77p71N21K47Qj03j40M33R7k55m98J62N69M29l13m25O2M1k5
$$ -46 -368 -405 376 599 -78 -849 -328 -81 -73 -176 -316 117 214 -41 -539 -377 192 621 308 -117 -55 -14 -39
748c9J06o5L96K5n97k6j52K76M49j75j50j97j1J11j58K18J27K95l01n85L4M91
$$ -39 67 2 398 423 -174 -200 -352 -76 373 198 48 -149 -160 -49 -207 11 138 433 132 -453 -419 72
770G2L22m02k77J88K10J41l18%K38L14n23k34J01L23L91n38p3r9J60m0J39j58
$$ 72 394 -8 -285 -97 113 254 -64 -64 174 488 -35 -269 -168 155 546 8 -65 -164 -4 -44 95 -63
792f3L47j60k92o6j96M30J90j61j25Nk01Q9R7j17L47K1j30j38rK55K63j61l79
$$ -63 284 124 -168 -234 -430 0 190 29 -96 -91 -292 -203 -106 -223 124 145 15 -123 -132 123 386 225 -154
815a54K94M1j30o1q6J26M06k46n87j21M52K15j39j38K23r6j28j55M6M10J98l13
$$ -154 140 181 51 -10 -96 30 436 190 -397 -518 -66 149 10 -128 95 -1 -129 -284 -238 172 370 57
837E7l73Q8K06K0j4J92l9Q7k92K7k8J40K18j68j18J52r8j97QK34J30j83k95L39
$$ 57 -316 -228 -22 -2 -16 176 137 224 -68 -41 -69 71 289 121 3 155 57 -140 -132 102 232 49 -246 93
861I3j71K27J09k97K2k47L1L14n7k45K73L8l74J4L15j0L70m47Mk81lO19p8j61
$$ 93 -78 149 258 -39 -17 -264 -233 81 24 -221 52 90 -284 -270 45 35 405 -42 -38 -319 -322 297 219 58
885E8J14l8m53K79k13M25k8j05Ok93L84k6l01K67K44j80l48k90K97N30j24j70
$$ 58 172 134 -319 -40 -253 172 144 39 45 -248 136 110 -191 76 320 140 -208 -498 -201 329 205 35
907C5n51K83J16j6N1N8L90l53q7m1J39J73K75k64k11J36j35L9l5J73j00L3k67
$$ 35 -516 -233 -117 -133 -82 -24 366 13 -74 -115 24 197 472 208 -3 133 -2 37 2 175 75 108 -159
930a59j19L23J10Q3k84j87L9j02K41L9J45l0q1j90r8K77K00J99m04k26R9J47j05
$$ -159 -278 45 155 238 -46 -233 -194 -296 -55 -16 129 99 18 -172 -270 7 207 406 2 -224 -125 22 -83
953h3k0K29pj26j42k25K10M33j01j04k37J08Q8m7n3M0J79j26k86K10J50qJ32k43
$$ -83 -103 126 119 -7 -149 -374 -164 269 168 64 -173 -65 23 -24 -77 -37 142 16 -270 -60 90 82 214 -29
977b9r0J45p2P8p7M7L8r7P6J4j69K08K65k54j73K9m1p6L21k51M10j29l41q8j21
$$ -29 -119 26 -46 32 -45 2 40 -57 19 33 -136 72 337 83 -90 -61 -102 -178 143 -108 302 173 -168 -256 -377
1002c77M08P9j72Q1K5J1O6q0J71j15j52J53j25J3Q8l7p7n8j00J43K32l98L77%
$$ -377 31 110 -62 19 44 55 121 41 212 97 -55 98 -27 -14 74 37 -40 -98 -198 -55 177 -221 156 156
1026A56j39l82K18j36M16Qp1j05j41K14J84k20L0P3K2k45R4j99J06K60r2m12L59
$$ 156 17 -365 -147 -283 133 141 70 -35 -176 38 222 2 32 105 127 -118 -24 -223 -117 143 51 -361 -2
1049bj18n1m0P4L28q1j73j11J40J32l7m5M3j05N0j24J51l41L84j96j22L6Q8K74
$$ -2 -120 -171 -211 -137 191 110 -63 -174 -34 98 61 16 59 -46 4 -120 31 -310 74 -122 -244 -208 -120 154
1073A54q1j29lLl2m5J97j36n7L76l93R4%J79q4k45K34j41L55j18m1q5o4k1J12
$$ 154 73 -56 -59 -56 -88 -133 64 -72 -129 247 -146 -52 -52 127 43 -202 32 -109 246 128 87 2 -62 -83 29
1098B9n7o2J30P7l8RJ24k15N1k10K18j79L03k35Jp3Q5K05k1k40k1Q0lJ02Lr0q
$$ 29 -28 -90 40 117 79 88 212 -3 48 -162 56 -123 180 -55 -54 -127 -42 163 142 -98 -119 -39 -42 60 63 -27 -35
1125c5O6o8K4j15N1J11pR7m0j76K51k23K16j38r5O1K6j58K23Rj04j57m5L16j42
$$ -35 31 -37 -13 -128 -77 34 27 124 84 -92 159 -64 152 14 -81 -20 6 -152 71 80 -24 -181 -226 90 -52
1150e2Q0q7N5j76Ol1L25j05j8N3o4p0j2O4J86k12K23k50J43j09l7N2o6k1O5P6
$$ -52 28 -59 -4 -180 -174 -205 120 15 -3 50 -14 -84 -96 -32 154 -58 165 -85 58 -51 -88 -36 -102 -123 -58 18
1176A8j51L5M0K34j50J05j84l9J44R3l00J85J3j91QK48r0K1J2j57K07k6J27j09
$$ 18 -133 -98 -58 176 26 131 -53 -92 52 145 -155 30 43 -148 -140 108 18 39 51 -106 101 75 202 93
1200I3j74J77n6j22j35L39r1j73K55l2k11J10J57n5J3j95qJ01j68L59j43K47l70
$$ 93 -81 96 40 -82 -217 122 31 -142 113 81 -130 -20 137 82 95 -100 -108 -7 -175 184 41 288 -82
1223h2j09M66j96j21R2o2m9O1J27M8k14L6O5M6r6O5m3m5K5N8j37K33K0l01L59
$$ -82 -191 275 79 -42 50 -12 -61 0 127 175 -39 -3 62 108 12 77 34 -11 14 72 -65 168 188 -113 246
1248B46l29K80qj97J2j91K53O3j92L17k31K0n7o2J51j95J48p7J48k11ok06L84
$$ 246 -83 197 189 -8 4 -187 66 129 -63 254 23 43 -14 -76 75 -120 28 -49 99 -112 -118 -324 60
1271F0j6p1j23L15m3P0l12j0J33J70q4L1j33R2oM0N5j86j25N7j27J24J29j53L06
$$ 60 44 -27 -150 165 122 192 -120 -130 3 173 89 120 -13 79 73 113 168 -18 -143 -86 -213 -89 40 -113 193
1296A93j56j55Q2J24n5J3j56K93j73o6J13r0j5r3K61Q6k01Mj0j22O1n1j8L42j40
$$ 193 37 -118 -36 88 33 46 -110 183 10 -56 57 -33 -48 -141 120 206 5 9 -1 -123 -62 -113 -131 211 71
1321G1j54l6Q2J60Ol16J61j30K4J64k06J58J50m8P0k15P6j39L02j36J90j12K11
$$ 71 -83 -119 -37 123 129 -187 -26 -156 -132 32 -174 -16 134 86 156 -59 17 -122 180 44 234 122 333
1344C33l62k8o3J32J88k28K77j48J5j40m6J22l4j49Q8N1j3l6j94K88L3Mk17J24
$$ 333 -29 -57 -120 12 200 -28 249 101 116 -24 -70 52 18 -131 -43 8 -5 -41 -235 53 86 90 -127 -3
1368cl1Qk79K24J43l1K4j96N7o3K10P1L1j62Q3l5R7j01oO5r6j96K84j45N3j52
$$ -3 -34 -26 -305 -81 62 31 55 -141 -84 -147 63 134 165 3 86 51 148 47 41 106 10 -186 98 -47 6 -146
1394a46Q3jj31P7L20P4l04J27j60L7P7P8j13Q6K4L1l08K8j6J32r6J15n0P9K20
$$ -146 -63 -64 -195 -118 202 276 -28 99 -61 -24 53 131 18 104 128 159 -149 -121 -137 -5 -101 14 -36 43 263
1419B63l37jLR3R4j3k11K68k90J95r1K2j58oN0R2L8J8Qp2Q9p0N2L1k4qP9k11L19
$$ 263 -74 -75 -72 21 115 102 -109 159 -131 64 -27 -5 -163 -169 -119 -27 11 29 37 -35 54 -16 36 67 43 35 114 -97 222
1448B22l75J34R1k6k19J78R4o2l8k22J98O2p9M2l2Q3k6LR7j78K2j7J09j13jj0
$$ 222 -153 -19 72 46 -173 5 99 37 -1 -223 -25 37 -42 0 -32 51 25 28 125 -53 -31 -48 61 -52 -53 -63
1474f3J25j31J39j9k32J98K5k48K53J62l88J72N2p0R2l1J64k1k99J76o2J55j67
$$ -63 62 -69 70 51 -181 17 42 -206 47 209 -179 -7 45 -25 67 36 200 179 -120 56 -6 149 -18
1497a8J33j20K38l45K1K10l33L42k54L09j12J06k99J92m9n6m6o7m9J32J27p9o9
$$ -18 115 -5 233 -112 -91 119 -214 128 -126 183 71 177 -122 70 21 -35 -81 -148 -197 -65 62 -17 -86
1520h6P9mJ00k15J44l7J48r5j35L84k07j73K14j13Pr8j23J07L6O6n0J65k06J20
$$ -86 -7 -11 89 -126 18 -19 129 34 -101 283 76 -97 117 4 11 -87 -210 -103 -67 -1 -51 114 -92 28
1544B8K54r1l52J61j47M0M13k86J3J01K4k52J19r1J42m2LJ1N1K6j64P4q3O0l04
$$ 28 282 191 -161 0 -147 -107 306 20 33 134 158 -94 25 -66 76 34 37 48 99 125 -39 35 -48 12 -292
1569b92M14k54N8J5k02K41K3j33K75l31K33L8j31p1J10K3j81L31m71J53N7R9O1
$$ -292 122 -132 -74 -59 -261 -20 3 -130 145 -186 47 85 -46 -117 -7 16 -165 166 -305 -152 -95 4 65
1592F5Nq0j26J01j5j8J7J43o9J35J12n76K78PK1j6r4J2R8k24K26O0J23l01k9J06
$$ 65 70 -10 -136 -35 -50 -68 -51 92 23 158 270 -306 -28 -21 0 -16 -110 -98 0 -224 2 62 185 -116 -145 -39
1618c9PM1j97R5q2K41l8L5r1p3K64j60M0q8K47n3j95n8QL10k28j6J11j89K00q6
$$ -39 -32 9 -188 -93 -175 66 28 63 -28 -101 163 3 43 -45 202 149 -46 -104 -96 214 -14 -30 81 -108 92 6
1644Fk05K55K15k46r3J71j52k7j98K93j65jJ66k42J40K7J83j69j18K43l05K96
$$ 6 -199 56 271 25 -68 103 -49 -76 -274 19 -146 -147 19 -223 -83 -56 127 -42 -160 83 -222 74
1666G4k28J45lK17k65j07Q3j83J87qL6m0mQ0K12l9k98n4L49k31K27j60J4j48K47
$$ 74 -154 -9 -12 205 -60 -167 -84 -267 -80 -88 -52 -92 -96 -16 196 157 -141 -195 154 -77 150 -10 4 -144 103
1691A03j17m6O9p6J47k1l7j26J54j8j45n5J45J5K04k23k8r5r3K44j29J36r8K63
$$ 103 -14 -60 9 -67 80 59 22 -104 50 32 -113 -168 -23 -8 196 -27 -55 -150 -243 1 -128 8 -90 173
1715A73k94K13KPP2j27J53k05j31J40m3J24L1r6j4J99k50K11j21Q0j43r1J61j92
$$ 173 -121 92 94 101 173 46 199 -6 -137 3 -40 84 115 19 5 204 -46 165 44 124 -19 -110 51 -141
1739a41J59k11J52m7K43k97P7M0Q2j00K70k05j67K02l6J57k09j24J41M7M7j22
$$ -141 18 -193 -41 -88 155 -142 -65 -25 57 -43 227 22 -145 57 21 178 -31 -155 -14 33 80 -42
1761d2N8K6J4j25K08k22J30J2O1k3j11P8N6n7p7O2J4Q8n2j71K25l6k11k4L10l58
$$ -42 16 42 56 -69 139 -83 47 59 120 97 -14 64 120 63 -14 48 62 150 98 -73 152 116 -95 -119 191 -167
1787a67J43j38R9K10J3l92L10j56R9M3k1m5nj09J14l0QJ11j86K08j58N5J74j01
$$ -167 -24 -162 -63 147 160 -232 78 -78 21 64 43 -2 -7 -116 -2 -32 -24 87 -99 109 -49 6 180 79
1811G9J33o3j24r0O6M5q3J98j80j6j02J92o6P9j25J17N0j63L6q9Q8R1l18J71L23
$$ 79 212 149 25 -65 1 46 -37 161 -19 -35 -137 55 -11 68 -57 60 110 -53 -17 -106 -18 73 -245 -74 249
1836B49k09p9J28R3j73j02O9N1jm1J0K26k52q6L25k68P1j41J67J7q4K7Q3p1j17
$$ 249 40 -39 89 182 9 -93 -24 27 26 -15 -5 221 -31 -117 208 -60 11 -130 37 54 -30 -3 80 9 -108
1861a08M2p2J0K37Jj76n3J04J63m34J49K19j21N7J41j15k76K98L0J38k76J79k94
$$ -108 -66 -138 -128 109 110 -66 -119 -15 148 -286 -137 82 -39 18 159 44 -232 66 96 234 -42 137 -157
1884a57J76j44J70j30K9l12L92k5j3O0n1k44J75J16J34k98J16m8J37j07J31P0
$$ -157 19 -125 45 -85 -56 -368 24 -1 -14 46 -5 -249 -74 42 176 -122 -6 -54 83 -24 107 177
1906A77j55m2J39r1r4Q5q2K8m8r7J24j39J10K48p6oq6Q5j94O8k50L20M8k52J22
$$ 177 22 -20 119 28 -66 19 -63 -35 -83 -180 -56 -195 -85 163 87 81 -5 80 -114 -46 -296 24 72 -180 -58
1931e8J5Qm5R2Q5k7p4J6M5m6q2K93l46K52j47r7L10j28l2M6k64J11L96l32o4J03
$$ -58 -43 -35 -80 12 97 70 -4 12 57 11 -71 222 -124 128 -19 -116 194 66 34 80 -184 -73 323 -9 -73 30
1957C0j10K35ok37m2p5K52j6j09J13j3p0J69j85J59j53j21K40j74M6K07j39P4
$$ 30 -80 155 149 -88 -130 -205 47 31 -78 35 22 -48 121 -64 95 -58 -179 61 -113 -67 140 1 75
1980G5J25n2j80J66j54Q7j60q7J50K28j48M1k33K01j16K4j53K45r5J28j8n7K67
$$ 75 200 148 -32 134 -20 67 -93 -180 -30 198 50 91 -142 59 -57 -33 -186 59 -36 92 74 17 284
2003B84l40J9L2J17m8m2j50J02J6J48m0J22k43K53l38J16j3J8j61K43l5m3r5N1
$$ 284 -56 -37 -5 112 64 22 -128 -26 -10 138 98 220 -23 230 -108 8 -5 13 -148 95 60 17 -78 -27
2027b7j01K70%M6nk49Q3J05j17j70K56k64K80q8R6O0l84K23j38K8J45Qp7K8J46
$$ -27 -128 142 142 188 183 -66 17 122 5 -165 91 -173 107 19 115 175 -209 14 -124 -96 49 57 -20 8 154
2052A54k71J02O2k27L53j66j72k4L15J5r9P7j2k02J84q7K1k07j8J81P8j17J35
$$ 154 -117 -15 47 -180 173 7 -165 -189 126 141 42 119 107 -95 89 2 23 -184 -202 -21 57 -60 75
2075G5p9k52L31Q1j76l0K72j96o9M3j96J23L19k88K45q5k79J69o4J40j46O4N7
$$ 75 -4 -256 75 156 -20 -50 222 26 -43 0 -196 -73 246 -42 203 118 -161 8 -56 84 -62 2 59
2098E9j38J91KN9k22nK7M0M2O9k64J1L32j69mK8J8J40k98L12j55l6j54K47j53
$$ 59 -79 112 114 173 -49 -54 -27 13 55 124 -140 -129 203 34 30 58 76 216 -82 230 75 39 -115 132 -21
2123b1OJJ38m9o7j83L05j9j70O6RQ8p0j92K60k99M29p2j40R2j01o1J27p1l0Q7
$$ -21 -15 -14 124 75 8 -175 130 111 -59 7 16 104 34 -158 102 -197 232 160 20 112 11 -50 77 6 -24 63
2149F3k00N0J7J41j10K74l67K03j53OJ22j30J15j81J74K1j86NJ30L5m9Lk8q7K62
$$ 63 -137 -87 -70 71 -39 235 -132 71 -82 -76 46 -84 31 -150 24 45 -141 -136 -6 29 -20 -17 -45 -132 130
2174A30j04R9j76nO7l2mr0P2K10l13J92j57J95J44k98J22p8n9J15J9R7k07K61
$$ 130 26 125 -51 -56 11 -21 -25 -115 -43 167 -146 46 -111 84 228 -70 52 -26 -85 30 49 146 -61 200
2198B00j40q4R4q4N8k06K24j75J50J26j18P9l7n5M5Pj14l6q3K29j65n5J56J13
$$ 200 60 -24 70 -14 44 -162 62 -113 37 163 45 124 87 32 77 84 -30 -66 -149 80 -85 -140 16 129
2222A29k81K94o9k0N7R0j60jQ1j13Q1O4o9n3j13j3M1J22j09J6l0K21j46o5P6l9
$$ 129 -152 142 73 53 110 200 40 39 120 7 88 152 83 30 -83 -96 -55 67 -42 -26 -56 165 19 -46 30 -9
2248ij60K8R6LK24j65L4m4Jk50L20j09J58j59NJ08k37L06l04J40N0o0K7j0l2q6
$$ -9 -169 -141 -45 -42 182 17 51 7 8 -242 78 -31 127 -32 -27 81 -156 150 -154 -14 36 -24 3 -7 -39 -125
2274a25M67n15K55j09O3M7q7L32m56M7Q2j6J94k75J60r6J38o9j04K26k15R9K3
$$ -125 342 -173 82 -27 36 83 -4 328 -128 -81 1 -15 179 -96 64 -32 106 37 -67 159 -56 43 66
2297F6Rl14K80N4j22j11Q2N0j95J76J30l23L99m8j18J30j03O3k06J36j15J31j82
$$ 66 75 -239 41 95 -27 -138 -56 -6 -201 -25 105 -218 181 133 15 145 42 105 -101 35 -80 51 -131
2320a31J59j93J88j2p2O7O1j64K8p0P4K41j20jj79J88q6q6J76J5r1j71O0J20J03
$$ -131 28 -165 23 11 -61 6 67 -97 -69 -139 -65 176 56 55 -124 64 -22 -108 68 83 -8 -179 -119 1 104
2345A04m5J7j06J42L3l37L87j51L3k21Q8J65n0J27j98L5j29L23o0j06J76k17K7
$$ 104 59 76 -30 112 145 -192 195 44 77 -144 -56 109 59 186 -12 23 -106 217 157 51 227 10 37
2368C7j19J82n8l7J30k01K2R0K3j48l3J8k3j36K15n4R0J5j87j1K83p1O7j69J9
$$ 37 -82 100 42 5 135 -66 -44 46 69 -79 -112 -94 -117 -253 -38 -92 -2 13 -174 -185 98 27 94 -75 -56
2393e6J22J4Qj99J60j8N3J5j74j75K71p3j69K03R9j56L5j26J89M9N5j00J4O0o9
$$ -56 66 80 88 -111 49 31 84 99 -75 -250 21 -52 -221 -18 81 -75 -40 -166 23 72 127 27 41 101 32
2418C2r0N7r1l9k0J06KPQ4k2j40J12Qo5PJ68M3J4k80Q8j02O1R6j75L59r0j27l6
$$ 32 -58 -1 -92 -131 -151 -45 -43 -36 48 26 -114 -2 6 -59 -52 116 159 173 -107 -19 -121 -60 36 -139 220 130 3 -33
2446c3O4m7O8n0j07K1j39K44rj5o9J3L9n0K08l54L44l16J45N6O2J15l19L03j00
$$ -33 31 -16 52 2 -105 -84 -223 21 12 -3 -72 -59 -20 -70 138 -216 128 -188 -43 13 75 190 -129 174 74
2471G4K0l9j09J28k6lj85J55r4R8K6o7K9m8r1J82j47J58k57K65J70j29J40l06
$$ 74 94 55 -54 74 48 45 -140 15 -79 19 45 -22 7 -41 -132 50 -97 61 -196 69 239 110 250 -56
2495e6o4m2K11R8j18j10j88M17O4l31K79j64j3o5J58j9k10J25p6J42O3m2q3J93
$$ -56 -120 -162 49 147 29 -81 -269 148 212 -119 160 -4 -17 -82 76 57 -153 -28 -104 38 101 59 -24 169
2519A69j71J2K5j47J73N2N1j28O2k15K46l46K15J32k12p1L35k36J33Qp3l1Q3k7
$$ 169 -2 10 35 -112 61 113 164 36 98 -117 129 -217 -2 130 -82 -153 182 -54 79 87 14 -17 66 39
2543C9o4J28j56MM3N8j77N0J1l7J70p9J02J0n3L0k58K09M6m3j9J29k60J08l9N7
$$ 39 -25 103 -53 -49 -6 52 -125 -75 -64 -101 69 -10 92 102 49 79 -179 30 76 33 14 143 -117 -9 -48 9
2569Ir5J01l36L70k2M1P4j92M5J32j41P4o9k4J08j75L72j67k9r0q2jJ51j40j72
$$ 9 -86 15 -321 49 27 68 142 -50 -5 127 -14 60 -9 -33 75 -100 272 105 76 -14 -96 -97 54 -86 -258
2594b58K17p0J09r4L3q4J74K9k6j5N4l13K94j49L0M5j90jJ48R3j90L50j20J37
$$ -258 -41 -111 -2 -96 -63 -147 27 56 30 15 69 -244 50 -99 -69 -24 -214 -215 -67 26 -164 186 66 203
2618B03j69O6m2j75j8K88l57J33J17j54P2jL2k14K1L42p8o2J5j18P0Q7P0l58J01
$$ 203 34 100 58 -117 -135 153 -204 -71 46 -108 -36 -37 -5 -219 -198 144 66 4 19 -99 -29 58 128 -230 -129
2643a29J02j20K78j70K12j50J98k96O7j35J46j50M8N5j4L0J88j93R8j95K99j65
$$ -129 -27 -147 131 -39 173 23 221 -75 -8 -143 3 -147 -99 -44 -58 -28 160 -33 65 -130 169 4
2665DQQ2j65J6K6m1KM7J69k40J15P2j43M6lj04Q7oM7o0J30j59J75Jm6PK28l67
$$ 4 12 94 -71 -55 -29 -70 -68 -21 148 -92 23 95 -48 -2 -5 -109 -22 -28 19 -41 89 -70 105 106 60 67 295 -72
2693g2P6o3J54j10J63l42L57j78j1L4Q0R2j83p3P3o6j10J48J61j29q1L02l78J83
$$ -72 4 -59 95 -15 148 -194 163 -15 -26 8 88 180 -3 -76 -3 -69 -179 -31 130 1 -80 222 -156 27
2717B7K8J13k35mM5n2N0O0K3lJ7m8K10j42k6M1j20MKJ15o6r8K34m08L07R0l87
$$ 27 55 168 -67 -71 -26 -78 -28 32 55 52 69 21 231 89 63 104 -16 -12 -10 105 39 -59 175 -233 74 164 -223
2744b23L38j86J61j0l8q4R1j51J20RO8j45J92p5j26J02k0M2J3Q7n3r0k49L87j94
$$ -223 115 -71 90 80 42 -42 49 -102 18 27 95 -50 142 67 -59 43 23 65 78 165 112 22 -227 160 -34
2769c4P0k9n3j83K57j2J86j43k7l04M07j31j9k34N84k69L5N1k18j1J62k04O0M3
$$ -34 36 7 -46 -229 28 16 202 59 32 -272 135 4 -15 -249 335 66 101 152 -66 -77 85 -119 -59 -16
2793a6j13J65n9N4J9j23J7K48l67K55j06p7K87k49l7J89k17j48R5J67L8k15K08
$$ -16 -129 36 -23 31 50 -73 -56 192 -175 80 -26 -103 184 -65 -102 87 -130 -278 -183 -16 22 -193 15
2816A5r5J92K6k1p4k29J34K15m2q3lj4Q3k42J79k1j66J42r8R0o3K62j66k8J06
$$ 15 -80 112 138 117 43 -186 -52 163 121 38 35 21 104 -138 41 20 -146 -4 -102 -12 -75 187 21 -7 99
2841I9k06K70j99J7k16N3K39P5k34J49k15L21j45J0j68J64Q4j85OJ07q4K09k07
$$ 99 -107 163 -36 -19 -235 -182 57 132 -102 47 -168 153 8 18 -150 14 98 -87 -81 26 -58 151 -56
2864e6R3%p8J31j12k81M63j91j9k9L9J31m0j27j00L1K11K10m47J97j09M8L0J91
$$ -56 37 37 -41 90 -22 -303 160 -31 -50 -79 -40 91 51 -76 -176 -145 66 276 -171 26 -83 -35 -5 186
2888A86l32J84k45M4P7P5j05J11J1p5O3R8p7j8p7K73j54nklj43O9K02m9L2j06
$$ 186 -146 38 -207 -163 -86 -11 -116 -5 6 -69 -6 92 15 -3 -80 193 39 34 32 29 -114 -45 157 108 140 34
2914C4k30J84P0r6m3L6r3R5k87L98L2L6k4p0Q5k43R9L3j15R7L6n3LM4m2p1J97
$$ 34 -196 -12 58 -38 -81 -45 -138 -43 -330 68 100 136 112 42 127 -116 -17 16 -99 -2 34 -19 -16 28 -14 -85 112
2941A12M5Nk53M3J92o1l08J05K91P0k30J81j99J1J06j12k89J29J18Qj04J07J28
$$ 112 157 162 -91 -48 144 83 -225 -120 171 241 11 192 -7 4 110 -2 -291 -162 -44 -36 -140 -33 95
2964I5o0j22p7K57j75O1P6K1J8N4o9k52N9J20k65J16K85J12k68J4J00qQ1j56M6
$$ 95 35 -87 -164 93 -82 -21 55 76 94 148 79 -173 -114 6 -259 -143 142 254 -14 0 100 92 173 17 63
2989F3J0j6q2J2n0J62j68J80K7j3j08n7O8Q6o8k4K39j90j04p9K62j78r3J04l1
$$ 63 73 57 -25 -13 -63 99 -69 111 138 125 17 -40 28 114 46 22 261 71 -33 -112 150 -28 -121 -17 -48
3014d8O7l10K74k5Q9j45Q4o8L2j5J23k2J3j11N4J04j19K82k33rP5ok21m6J71j17
$$ -48 19 -291 -17 -42 47 -98 -14 -82 -50 -65 58 36 49 -62 -8 96 -23 259 26 17 92 86 -135 -181 -10 -127
3040a27R5Mj77J51q8J83L8j31J07j0k46J08oJ1J16k5k8J77q6j79R0L2R3j41J89
$$ -127 -32 -28 -205 -54 -142 41 79 -52 55 45 -201 -93 -99 -88 28 3 -25 152 66 -113 -23 9 102 -39 150
3065A50j37o3J40o7J49j47j81m5J11J88j1J24l59L1K31r5J1Q4k6k60K67K07l06
$$ 150 13 -50 90 23 172 25 -156 -201 -90 98 87 211 -148 -117 114 19 30 114 88 -172 95 302 -4
3088dj36J39J39j29o0P8M2p7K22k92J00j0j50K94j08k03K72J7k63jN4l32M67k51
$$ -4 -140 -1 138 9 -51 27 69 -8 214 -78 22 12 -138 156 48 -155 117 134 -129 -130 -76 -408 59 -192
3112a92K70j27J9MJ29L6r1l4K28k67j69K49k70K42J31j09j1m2p5R7j67L02l73
$$ -192 78 -49 -30 -26 103 139 48 14 242 -25 -194 55 -215 27 158 49 38 -4 -79 18 -149 153 -220
3135b20J40J43k9J7on0J01m42L42j90J90k60J45J57k88L17L0p1K85m45Q2J21j57
$$ -220 -80 63 34 51 45 -5 96 -346 -4 -194 -4 -264 -119 38 -250 67 97 26 311 -134 -52 69 -88
3158h8J50p2n8J27J10k9l05K21J6k19K78j12j1J19j87J00j00j88J42P3L00l81
$$ -88 62 -10 -68 59 169 140 -165 56 72 -147 131 19 8 127 -60 40 -60 -248 -106 -33 267 -114
3180a14J66J7n9K5k02R8J4oJ75j2jp3k22L36j36j1O0j99J78l6qJ26j37p8P3j8
$$ -114 52 69 10 35 -167 -69 -55 -61 114 102 101 28 -194 142 6 -5 55 -144 34 -2 -10 116 -21 -99 -26 -44
3206d4J20k13J33M2QN2l02K88j78K10l19L21Jk70J73j3k51K97l2j22J02o1P7l6
$$ -44 76 -137 -4 38 46 98 -204 84 -94 116 -203 118 119 -151 22 9 -242 55 23 -99 3 -58 19 -17
3230a7N7k0l5k29O9J10K16k47P9l6jJ46p7J00n2p5n9J2J96k27l9K34n3n4LL2k14
$$ -17 40 20 -15 -244 -175 -65 151 -96 -17 -53 -54 92 15 115 63 -12 -71 -59 137 -90 -129 105 52 -2 1 33 -181
3257a81K35Kk98L05m6q6n4K14j97K01J0k40J44R6J41j38q3n5Q0l9m7J01J80k43
$$ -181 54 56 -242 63 17 -69 -123 91 -106 95 105 -135 9 105 246 108 25 -30 50 11 -36 65 245 2
3281Bqj47N2K04j93M4n5J13n6J09r8J87p3k03J08J11j49j0L33k50k28L35l14L90
$$ 2 -6 -153 -101 103 -90 -46 -101 12 -44 65 -33 154 81 -122 -14 97 -52 -62 271 21 -207 128 -186 204
3305B04k46k6J09j13K04l09K39o5j08K75j84K7l9o3J20J3J22k09o9k5L24k25J84
$$ 204 -42 -68 41 -72 132 -177 62 -3 -111 164 -20 7 -32 -95 25 38 160 -49 -118 -143 181 -44 140
3328A40j22O5m2N3k80P4K49P3m93L76p5J38k79L7L09o4j56l4j0nK29k03m9K31
$$ 140 18 83 41 94 -186 -112 137 210 -283 93 18 156 -123 -86 223 159 3 -31 -41 -46 183 -20 -69 162
3352A62j80L0r8K0j24J85j91L46J00k92Q2P9k67K78j03j05m8L39k13Ll6R2P3l85
$$ 162 -18 12 -86 -66 -190 -5 -196 150 250 -42 40 119 -148 130 27 -78 -126 213 0 3 -33 59 132 -253
3376b53L24rj87R0kK24j25nj06K45j39j33j13J21p9O7L8m5J50P8K5j58K0o5q7
$$ -253 71 62 -125 -35 -37 187 62 57 -49 196 57 -76 -189 -68 -147 -80 -42 -87 63 141 166 8 28 -37 -124
3401a24J75l5o8m5J11K04j67K8k5n8Q3l3J04o7o8j41M7J12j18Q8Q6p8r9J69qj1
$$ -124 51 16 -52 -97 14 218 51 79 54 -4 79 46 150 83 15 -126 -79 33 -85 3 89 11 -88 81 73 62
3427F2n8Q1l6n7j64K08K2j6r2N8M0J08l12J93n0k7K25l18K35j63J5l3K48l34N0
$$ 62 4 85 49 -8 -172 36 58 42 -50 8 48 156 -156 37 -13 -40 185 -133 102 -61 -46 -79 169 -165 -115
3452a15K62m4o3J32j06j57J78r1O6l1j74J50J81KJ1j5Q4j94k87K58k66N7O9J36
$$ -115 147 103 40 172 66 -91 87 -4 62 31 -143 7 188 190 201 186 270 76 -211 47 -219 -162 -93 43
3476D3k2l3J12j42L2No2J47j10n8J04J03l8j03L6J58J44l2l05M0oj43L0J16n9
$$ 43 21 -12 100 -42 -10 -5 -67 80 -30 -88 16 119 81 -22 14 172 316 284 -21 19 13 -130 -100 16 -43
3501d3R6l09M63j56J0J48k53J74j77J36r2K5nj60J02P5j64K20L6k4k68O2PK88
$$ -43 53 -256 207 51 61 209 -44 130 -47 89 -3 22 17 -143 -41 34 -130 90 126 102 -166 -104 -97 191
3525A91m73L53r0R4o4k1j40J85K67m46L45k08M8j83J55o4R7K02j18j17j58K35
$$ 191 -282 71 -19 75 11 -10 -150 35 302 -144 201 -7 41 -142 13 -51 46 248 130 13 -145 90
3547I0j93J83l5o8j30P6J50j42r9K11L7j07R6p0j13p4m0L1J88n1P4j64L53k11
$$ 90 -103 80 45 -23 -153 -77 73 -69 -168 43 80 -27 69 -1 -114 -188 -228 -197 -9 -60 14 -150 203 -8
3571hj19L23j40k03J96K3j06K34O4k05j59K3J94k52K22o3r5m4o3K74j31j17L80
$$ -8 -127 196 56 -147 49 72 -34 200 264 59 -100 -77 117 -135 87 24 -71 -115 -178 96 -35 -152 228
3594B28k76l3j22J59m6Q2m7K97l01O4R7p3K6pk10J70Q3N1K6j41j4k56L24k51L38
$$ 228 -48 -81 -203 -44 -90 -8 -55 242 -59 5 102 29 55 48 -162 8 91 142 168 27 13 -243 81 -170 168
3619A68j09j5J15j72K5N8j15j94J66K44l36L11M4k16j92J65L36m15O5K0P1R5q8
$$ 168 59 44 159 -13 12 70 -45 -239 -73 171 -165 146 190 -26 -218 -53 283 -132 -67 -47 24 119 31
3642C1j34o4Q5N2J31j34K78k24J10k06J51L1o2o1J21j09J36j15m0J27j17QK9O9
$$ 31 -103 -167 -82 -30 101 -33 245 21 131 -75 76 107 45 -16 105 -4 132 17 -23 104 -13 -5 24 93
3666I3j4k1On2j20K91k52J08L4j74J56Q2l87L74j27j99J0K66l18L56k80P2M7q0
$$ 93 79 58 64 12 -108 183 -69 39 73 -101 55 137 -250 124 -3 -202 -192 74 -244 112 -168 -96 -49 -129
3690a29N7J16j64J34K32n07M09j55k5J29j44J77l22K88k09J18l2J64k28K37j27
$$ -129 -72 44 -120 14 246 -261 148 -7 -32 97 -47 130 -192 96 -113 5 -27 137 -91 146 19
3711A9j34J49j90K3J54q4L5N3MN9j72P1%j19k3J68L3J8n5J31k1O4k52K76k99J24
$$ 19 -115 34 -156 -133 21 -63 -28 25 29 88 -84 -13 -13 -132 -155 13 46 64 9 140 119 183 -69 207 -92 32
3737C2K7j94J65j31J79R7j2j16J73o0j99J24j34Mj43L22j11L1Q8j5j74r4M56j44
$$ 32 59 -135 30 -101 78 175 163 47 220 160 -39 85 -49 -45 -188 134 23 54 142 127 -47 -141 315 171
3761A71k99Q6R0m5m2R1n7j32J23N6P5j15N7m3M4rL4j96J85Q2mj50K7j71J83q3
$$ 171 -128 -42 48 3 -39 52 -5 -137 -14 42 117 2 59 16 60 51 85 -111 74 156 152 2 29 -142 41 -42
3787d2N0Q2l02J55J05j67K38j71J11j14j1J09N8l54M90l84J46j44K45j33k1lN4
$$ -42 8 90 -212 -57 48 -119 119 -52 59 -55 -66 43 101 -253 237 -147 -1 -145 100 -33 -54 -57 -3
3810cj5k05R4q4K95k37L39n7j97K01j32J93k73K14j42j12J80r5k2N2n7j40L6M2
$$ -3 -18 -223 -129 -213 82 -155 184 127 -70 131 -1 192 -81 133 -9 -121 59 -36 -58 -6 -63 -203 -167 -125
3834a25Q5K03j74r1m2m0J98q5M5k49K19L8j05K9J81j86J96O4k92Q5pR3j77O4J74
$$ -125 -40 163 -11 -102 -144 -184 14 -71 -26 -275 -56 -18 -123 -94 87 -99 97 161 -131 -46 -53 40 -137 -73 101
3859A01o6k00J01K08l00M3J96k7Q9Mnj14Nm2j38M4N2J21j0m6q5J36n0O4j23J91
$$ 101 35 -165 -64 144 -156 -113 83 56 145 149 144 30 35 -7 -145 -101 -49 72 62 16 -69 67 17 81 -42 149
3885A49j74o4K95k48K13j99k23K82n7K9j06rj5K00j06JR9n3L3k47K10j68J39J11
$$ 149 -25 -89 206 -42 171 -28 -251 31 -26 3 -103 -112 -127 73 -33 -32 67 14 47 -200 10 -158 -19 92
3909I2m8r6r8L73l11J74k79j18J90LM4J65K1j25j61J79p3K1Q4J35j23PJ47k74
$$ 92 44 -52 -150 223 -88 86 -193 -311 -121 -118 -74 91 112 -13 -174 5 -68 -47 37 172 49 56 203 -71
3933g1m6J34j2q8L28k69J05q6J93N0k14l9J05j02M2J06k07K1O8j79M0k6K18O1
$$ -71 -117 17 5 -83 245 -24 81 -5 188 238 24 -15 90 -12 30 136 -71 -50 18 -161 -121 -147 71 132
3957A32k40J85K11l42m0Q6K6NNL8Q4j52J10j86J63n6k04J40j01O4J07r4j10M6
$$ 132 -108 77 288 -54 -94 -8 18 23 28 66 150 -2 108 -78 85 29 -175 -35 -136 -72 35 -59 -169 -123
3981a23k0J32r8K30j60l4k1o7J10J79l00K54j43r2K30p3J12j45K18k12K5J64j43
$$ -123 -143 -11 -109 121 -39 -73 -94 -161 -51 128 -172 82 -61 -153 77 4 116 -29 189 -23 2 166 23
4004B3k62K75P6J6p8L6K4L9k98K16R4o3O4j19m1R7k22N0J72r0j53L4R4K40k88
$$ 23 -239 36 112 128 50 86 110 149 -149 67 161 98 162 43 2 99 -123 -73 99 9 -144 -110 -16 224 -64
4029f4j1M3j02K61k30J87j9j54j7K53j33K10j69N9j96K9M5Q4mp5R7%l46J84K5
$$ -64 -75 -32 -134 127 -103 84 65 -89 -106 147 14 224 55 114 -82 -53 -8 76 72 -3 94 94 -252 -68 -43
4054d3O3O0j17J01p4p8q3J62NJ33j12O0k0j56J35M5j14L5J70j75P8k93J87J91
$$ -43 20 80 -37 64 -10 -88 -171 -9 -4 129 17 77 57 -99 36 81 -33 2 172 -3 75 -218 -31 160
4078A60j61Q1l3Q4j11J05j80K88j10l06J7P3J55j7o3K5J6l11M25k86k6J95Q7j4
$$ 160 -1 80 47 131 20 125 -55 233 123 -183 -166 -93 62 45 -18 7 23 -288 137 -149 -175 20 107 93
4102I3M0k82J06L2P7N2j54l8P1K1K4q6J9o8J68j61K08l5k52J72l1j18J16lJ74
$$ 93 133 -149 -43 -11 66 118 -36 -74 -3 18 42 -44 -25 -93 75 -86 122 87 -165 7 -24 -142 -26 -29 145
4127A45j54j71J36J2M3R4j79J40M7ll46L35l8p3K6o5P7k55J77j45L9L6K38j82
$$ 145 -9 -180 -44 -32 11 105 -74 66 113 110 -236 99 61 -12 14 -51 26 -229 -52 -197 -158 -122 116 -66
4151f6M5K43j49r9J0R4k5j82J54pOJ42k04m8O9M1R0j26K32j57L8j01N9O2l4J19
$$ -66 -21 222 73 -26 -16 78 53 -129 25 18 24 166 -38 -86 -17 24 114 -12 220 63 101 0 59 121 87 206
4177B06k70J28J35j62J3n7m1R4j40K27j01l0J5p9M8j9L6j2Q6j64k68M02m2L9q8
$$ 206 -64 64 199 37 50 -7 -48 46 -94 133 32 2 17 -62 -14 -33 3 -9 77 -87 -355 47 5 44 -44
4202d4l6OJ75k4m0p1r4J44n4l4k6Q7m6k8p9K66q1J50k49O6J16m1j49K26k09J80
$$ -44 -80 -74 101 77 37 -34 -128 16 -38 -72 -98 -11 -57 -85 -164 102 21 171 -78 -12 104 63 -86 140 -69 111
4228A11k50J45n0J3o4l7K5j3L02k24J85l02L12j62p2J52p0J07j21J25q0P4q0L8
$$ 111 -139 6 -44 -31 -95 -132 -107 -120 182 -42 143 -159 153 -9 -81 71 1 108 -13 112 32 106 26 64
4252F4p4QJ89j15j57J19J59j50j28K61j27r1Q0jq3P6J62k76qq4P0M5L0K56n6o
$$ 64 -10 -2 187 72 -85 34 193 43 -85 176 49 -42 38 37 -46 30 192 -84 -92 -176 -106 -61 -31 225 169 163
4278A63l9N6k32K27k85N5J64j12J97m02K09n7O1j52L25m51K32J68q6j92J71k26
$$ 163 124 180 -52 175 -110 -55 109 -3 194 -208 1 -56 5 -147 178 -273 -41 127 41 -151 20 -206
4300b06J99j7M0O6l09K54j10J55o5r2J19Lnq0J28j41J00j48J50r0j11J60O4p5
$$ -206 -7 -24 16 82 -227 27 -83 72 7 -85 34 37 32 -48 80 -61 39 -109 41 -49 -160 0 64 -11
4324a1k7p5n4J15J01J8J85k52N2j84K22k26J85p5K83j77j5O1l69K13j08M4n2J76
$$ -11 -38 -113 -167 -52 49 67 252 0 52 -132 90 -136 49 -26 257 80 65 126 -243 -30 -138 -94 -146 30
4348C0j37m7k1K13O7k42R6J27O2q5k35J28J94m6j26j73K29j70J91l0j04J72k08
$$ 30 -107 -154 -175 38 105 -137 -41 86 148 63 -172 -44 150 104 -22 -195 34 -136 55 25 -79 93 -115
4371a15J55J04j97K12j08n3J15l2l2J16k93J64Om2M1l8M9j11j3J37k19J81n1k52
$$ -115 40 144 -53 159 51 -2 113 81 49 165 -128 36 42 0 41 3 52 -59 -72 65 -154 27 -24 -276
4395b76K05K04M6k87l8l6J46K4l6j93K52j62K27j30J23p1L5j40j12J96M2J35n6
$$ -276 -71 133 179 -108 -146 -182 -36 -12 -48 -241 11 -151 76 -54 69 -2 33 -107 -219 -23 19 154 98
4418I8L1k02Q3J14k50K69j12N4l69J91o6K60j98J98n9l5j05J33O6j51q7J68k1
$$ 98 129 -73 10 124 -126 143 31 85 -284 -93 -159 101 -97 101 42 7 -98 35 101 -50 -137 31 10
4441A0k64P9J62J16l5n5Pn2k57L08j24J06mj46q9J34L00j33l14L22j80J17L1q5
$$ 10 -254 -175 -13 103 68 13 20 -32 -289 19 -105 1 -3 -149 -238 -104 196 63 -251 71 -109 8 39 -46
4465d6k0K10j81m7p4oK80r1k7L3j11J68q1P0j10J01j39L2%K4Qn1J40k43K6N1K57
$$ -46 -66 144 -37 -84 -158 -164 116 25 -2 31 -80 88 7 77 -33 68 -71 -39 -39 -15 -7 -58 82 -161 -135 -84 173
4492A73q7j35K1J12M7N6j70q4J77O9j84Q9o2N1j68QJ71J48m02L38k77pP1J08l5
$$ 173 86 -49 -28 84 131 187 17 -67 110 179 -5 84 22 73 -95 -87 84 232 -170 168 -109 -116 -45 63 28
4517B8J6o7J76j29L8K4j08J06MK17l11K8lJ16j89K2n0K14l9r6K1MK8l3R3pj11
$$ 28 44 -23 153 24 62 86 -22 84 88 305 -6 22 19 135 -54 -32 -82 132 93 -3 18 22 50 17 110 103 -8
4544hJ43j15J21j57J14k22K41k85L6J79n4P0l3m6p6J84nj29l4o3R8R6j2r4J91
$$ -8 135 20 141 -16 98 -124 117 -168 -132 47 -7 63 30 -16 -92 92 87 -42 -76 -139 -41 55 43 -51 140
4569A40k6j20j40M7k7J61j4q7J22Rj54J13J16j89J38Nj9jj62J21N4n3J41m3j64
$$ 140 114 -6 -146 -99 -126 35 21 -66 56 65 -89 24 140 -49 89 94 75 74 -88 33 87 34 175 132 -32
4594c2L4J76k12J39j89m6J50O3j0k2j24j36L01q5m1L0J39j8p0k1l8l9K19n6j69
$$ -32 2 178 -34 105 -84 -130 20 83 73 51 -73 -209 92 7 -34 -4 135 117 47 26 -12 -51 168 112 -57
4619e7R2M7j27o0J2K3K34j92j83K92p1rq7j4R1J9L8l9oJ5M7P2k80K13r9J21j58
$$ -57 35 82 -45 -105 -93 -70 164 -28 -211 81 10 1 -86 -100 -9 10 48 9 3 18 65 137 -143 70 -29 92 -66
4646f6Q7j8j28O7o5J08k40K65J59l00J74j4j4n8LJ63J49k43j5l0nj8K9kj08L5
$$ -66 21 3 -125 -58 -123 -15 -255 10 169 -131 43 29 15 -43 -40 123 272 29 14 -16 -21 -39 -10 -12 -120 -85
4672h5K69j25o8l2o4K28P0j92J80n4j70Q1k29J86J95k97L2P8R1J78k95J05j9k30
$$ -85 184 59 -9 -41 -105 123 193 1 181 127 -43 38 -191 -5 190 -107 -75 3 94 272 -23 82 63 -167
4696a67K03Rr8Ll9J6rJ82j64M0J7JJ0O9j99K24q4l2J01N4n4m6L9o9O5l28L11p1
$$ -167 36 45 -53 -50 -89 -73 -82 100 -64 -24 -7 -6 4 73 -126 98 14 -18 83 137 83 37 76 7 72 -256 55 -16
4724a6m3K3j02M2R6j20j71J93K2K06k1j34j85p0K71m6P1O6j84m4K64P2k88K64
$$ -16 -59 -36 -138 -96 0 -120 -291 -98 -76 130 109 -25 -210 -280 -9 -55 16 82 -102 -146 118 190 -98 166
4748A66n5j11q7oJ04Q7n1Q1j52n1J43m7M1p4O0k56J63m8J60l0J29j18o8N8j10
$$ 166 111 0 -87 -93 11 98 47 128 -24 -75 68 21 62 -12 48 -208 -45 -93 67 37 166 48 -20 38 -72
4773g2K3j65L7J2J1QQ5P4J26p6j60J56j71k30L46m1KJ72o1l6j77K6J80j96Q3J30
$$ -72 -49 -214 -177 -165 -154 -146 -61 13 139 63 -97 59 -112 -342 4 -37 -35 137 76 40 -137 -111 69 -127 -44 86
4799H6k68K98Ok41J95k10J31j2J31j25N3n1o9K18j05J53k75N6%k16L43l4m8j4
$$ 86 -182 116 122 -119 76 -134 -3 -15 116 -9 44 -7 -76 142 37 190 -85 -29 -29 -245 98 64 16 2
4823BM0j85K7J68p5m3o3J72m02K38R0K47l9r3j14L6J47j23M0Ro8m7N2j9j49J17
$$ 2 42 -143 -116 52 -23 -66 -129 43 -359 -121 -31 216 177 84 -30 6 153 30 70 79 11 -36 16 -3 -152 -35
4849c5P5J72j96P0o1rq7j07K90j50K18n14L12l6J28o4m2lJ80l3k60K18n7J25J5
$$ -35 40 212 16 86 25 16 -71 -178 112 -38 180 -334 -22 -58 70 6 -36 -39 141 108 -152 66 9 134 149
4874A49k27K99l36K43j27L6K73l08J86j19m7J81k18K2n5K11j30k45K20m8J31m5
$$ 149 -78 221 -115 128 1 37 310 2 188 69 22 203 -15 7 -48 163 33 -212 8 -40 91 46
4896D6J45k24j9J58k00n9J09R3l6m8j74J59m0N3J09j69R6M4K6j33m3LJ35j37k3
$$ 46 191 -33 -52 106 -94 -153 -44 49 13 -35 -209 -50 -90 -37 72 -97 -1 43 69 -64 -107 -104 31 -106 -129
4921a29O3Q0J47j46K73m51K74k13N5J75j31O0l5Q7q4M8o7j22L05j94Q4k32J25
$$ -129 -66 14 161 15 288 -163 111 -102 -47 128 -3 57 22 109 25 73 6 -116 189 -5 79 -153 -28
4944b8j99K05K5r6mJ24LJ59k02M8J98r9m7k07R8J35l5k26O4j5Q8r9K16l4k1j85
$$ -28 -227 -22 3 -93 -97 27 30 189 -13 35 233 134 87 -120 -22 113 78 -148 -84 -99 -11 -110 106 72 51 -134
4970a34k6L2L20j97j38J35j29K62m2J3j64o7M7M7k2P2o5p6M4J17L9j13r7O7j96
$$ -134 -160 -128 192 -5 -143 -8 -137 125 83 96 -68 -135 -88 -41 -63 9 -56 -132 -88 29 68 -45 -142 -75 -271
4995b71J96K53k29lm5O0L9N7n0J02l33J55L3j18K06p1J73k41l3j8R8P6n8m5k4
$$ -271 -75 178 -51 -54 -99 -39 0 57 7 109 -224 -69 -36 -154 52 -19 154 -87 -120 -138 -40 36 -22 -67 -91
5020i1J60mK4j47J25j69q8J06J92l37K64j4j28P8l37K53P7J0j97K65M6k09J74
$$ -91 69 65 89 -58 67 -102 -190 -84 108 -229 35 21 -107 -29 -366 -113 -36 -26 -223 42 88 -121 53
5043E3j6q3J09q0K00j27k6j1j09M7l2Q9J8j48j41K18J50J4j90k55L68P5l10L01
$$ 53 37 -46 63 -17 183 56 30 19 -90 -43 -75 14 32 -116 -257 -39 111 125 -65 -320 48 123 -187 114
5067A14q4j80K67J77m94K58j15J1J60j86R8k19P0K82l89L97l34L06j76l4J16j10
$$ 114 30 -150 117 294 -200 58 -57 -46 114 -72 26 -193 -123 159 -230 167 -167 139 -37 -71 45 -65
5089f5j6Nk7K67k91J24K3J1Q9K9j15Q7q0Mj39R2Q7Ok88L98m2k64M20l29L3p2K93
$$ -65 -81 -76 -103 164 -127 -3 20 31 120 149 34 121 41 45 -94 -2 85 91 -197 201 159 -105 315 -14 19 -53 240
5116B40k72k9kJ91j22j27n0J98K6J42j86K27k24j65K91k59K25k67r1N78l45l1
$$ 240 -32 -61 -63 128 6 -121 -171 27 53 195 9 236 12 -153 138 -121 104 -163 -254 324 -21 -52
5138e2R7j09J70j51R5k3p6J36j19J89j46Q0p8j8l1j5j97K94j30M4j99K47Q2j24
$$ -52 45 -64 106 -45 50 27 -49 87 -32 157 11 91 13 -5 -36 -51 -248 46 -84 -40 -239 8 90 -34
5162c4K5M9q9j52J3J94N5n4J2J04j8J51j76j4j31R4J2k95M46j29j97RR3O4o3K1
$$ -34 -9 40 -49 -201 -188 6 61 7 19 123 105 256 80 66 -65 29 41 -254 192 63 -134 -125 -32 32 -31 -10
5188a0j27O4q7J16M7J23mJ2j01P7R1j21j36K02k42J64k4n4j61L10j51k30J0J59
$$ -10 -137 -73 -160 -44 3 126 122 134 33 110 201 80 -56 146 -96 68 44 -10 -171 139 -12 -242 -232 -73
5212g3k28J44K2K33k64K63k15J78J33l34rQ3K30l8k7k89L30j23Lj6O8q9L2j56
$$ -73 -301 -157 -135 98 -166 97 -118 60 193 -141 -150 -67 163 125 98 -191 139 16 19 3 71 -18 14 -142
5236a42K13j21o4K52p9j86K06j49J96j72J65j51K07j94L1n2K6p4P9K0p1m6J78
$$ -142 71 -50 -114 138 59 -127 79 -70 126 -46 119 -32 175 -19 12 -40 -14 -88 -9 11 -60 -106 72
5259G2j41J15jn2Q7j24O6j17J86r7k79J77K24Q5q9k2j79j0J90j78J14K0K2j70
$$ 72 -69 46 45 -7 80 -44 22 -95 91 -6 -285 -108 116 201 112 90 -89 -99 91 -87 27 47 69 -101
5283a01J32R1j81j86J67j39J97J07r5r0m1J11K40k84j28N38m28J8R0O3J14j99
$$ -101 31 122 -59 -245 -78 -217 -20 87 -8 -98 -139 -28 212 -72 -200 338 -90 -72 18 81 195 -4
5305dn9K74j40k05J19N2O4r0J17k42K62j2k03J27r8K8O9q9p5J92j9J3j38J2j3
$$ -4 -63 211 71 -134 -15 37 101 11 128 -114 148 136 -67 60 -38 -10 59 -30 -105 87 68 81 -57 -45 -58
5330e8n6M3M5L0q9q8J20J50j97M4J03k5J13j4K5q3j52P7J08P0k50R2j61L19p1
$$ -58 -114 -71 -26 4 -85 -173 -53 97 -100 -56 47 22 135 121 146 63 -89 -12 96 166 -84 8 -153 166 95
5355I5j63pR6k15k1L57l25K86k86K07m1P9r4k03M31l12qJ2K2L08l74j43L71j93
$$ 95 -68 -75 21 -194 -215 142 -183 103 -183 24 -17 62 -32 -235 196 -116 -124 -112 -90 218 -156 -299 72 -121
5379a21K8J50n2ON7m5j37M3J40n6l3q5J79n4l0m5Kj6l3k4J07j90L42m0o8R9l38
$$ -121 -93 57 5 11 68 23 -114 -71 69 13 -20 -105 74 20 -10 -55 -53 -69 -102 -126 -19 -209 133 93 25 124 -214
5406b14J30J60m9m1m8j04J29o2J20l8j9j54J40L8j02%J36j16J17R7p1L7O2J17
$$ -214 -84 76 27 -14 -62 -166 -37 -99 21 -17 -36 -190 -50 -12 -114 -114 22 -94 23 120 49 86 148 265
5430B65l60K48k06KJ52j36q0q3N38k89p1n1J61O0j42j44K96j22j11J31o7oR1m20
$$ 265 -95 153 -53 -51 101 -35 -115 -198 340 51 -20 -71 90 150 8 -136 160 38 -73 58 -9 -15 76 -344
5454c44L62j34K50l56J21J64k48N30m54P5J01j12r5m7k8K34K3P4j27K25q1O4r3
$$ -344 18 -116 134 -222 -101 63 -185 345 -109 -34 67 -45 -140 -187 -215 19 42 116 -11 214 133 197 104
5477A04r8KmJ4q4P5P1k9r5J24j7J7j41J29o2o9J38j99Q7J23RJ86k97J3k9O5n9
$$ 104 6 8 4 18 -66 9 80 51 -44 80 63 80 -61 68 6 -63 75 -124 -37 86 95 281 -16 -3 -32 33 -26
5504b6j49m6J40j58J03N2P0K1Q5q9Rj75J58k3l4l8nJ34j8J63p1L3k79J49o9J40
$$ -26 -175 -221 -81 -239 -136 -84 -14 7 92 3 12 -163 -5 -28 -62 -100 -105 29 11 174 103 136 -143 6 -63 77
5530G7j70J05J76j15j53m6K74j92k2K1Nj16J94k15N2J02n6L81k29o9J59j50l0
$$ 77 -93 12 188 73 -80 -126 148 -44 -66 -45 -40 -156 38 -177 -125 -23 -79 302 73 4 163 13 -17
5553a7r9J54j20OR6j1n9R9Rl9k12Q7O8p8o3J56o8O8O5j63n2O3K29o4j69K38L2
$$ -17 -116 38 -82 -76 20 9 -50 49 58 19 -193 -106 -38 -116 -179 -23 -91 -23 42 -121 -173 -110 119 55 -114 124 156
5580A56j98R0m6M8k08Q7K7R5q6o0M4J46j14l8j38L1K52j04l6J17n8KOj04P0J80
$$ 156 -42 48 2 50 -158 -71 -44 51 -35 -95 -51 95 -19 -57 -195 -164 88 -16 -52 65 7 9 15 -89 -19 161
5606A61kk14J49j18L5q4q4Q3R8p3J23nl8r7J82L2J7q7J0J61m39R1K50J1j65K6
$$ 161 159 -55 94 -24 11 -73 -157 -74 24 -49 74 69 31 -66 116 148 165 78 88 249 -190 -99 151 162 -3 23
5632B3J09k06M4J12O9k06K5J38O2j45m4p3J66j07k48L94k30J73r2Q2O8P2k53Q3
$$ 23 132 -74 -30 82 151 -55 -30 108 170 25 -19 -92 74 -33 -281 113 -117 56 -36 46 114 186 -67 16
5656A6J55l26N7J61j39J31o3l0j78J48R4nl31J08K39n6J91j61j2q2O2j17L56l92
$$ 16 171 -155 -98 63 -76 55 -8 -38 -216 -68 26 21 -310 -202 37 -19 172 11 -1 -83 -21 -138 218 -174
5680a74K59k64J30J7m8Q1j80K47j78J03p1J99m9q3o7L0L1m7Q4j29M3O2l2m2K2
$$ -174 85 -179 -49 -32 -80 1 -179 68 -110 -7 -78 121 72 -11 -78 -48 -17 -64 20 -109 -66 -4 -36 -78 -56
5705e6J5j65q5K64oL3Q4N0j75l7j24J68Lo9J79o6j99pK41J6j94m4O2l4K39nn8
$$ -56 -41 -206 -291 -27 -33 0 84 134 -41 -78 -202 -34 -31 -100 79 13 -186 -193 48 64 -130 -174 -112 -146 93 88 30
5732C0L4M3j30L8p1rR8k26J98Q2j06r6K41k38J97J9l6m3j61K74k37P9q0K25k79
$$ 30 64 107 -23 15 -56 -65 33 -193 5 87 -19 -115 126 -112 85 104 68 25 -136 138 -99 -20 -100 125 -154
5757a54J20L8p0k03L10p2K88k14N9N0j0jk02RK6J03Q8M9k55K24j6k08q9N2J12
$$ -154 -34 4 -66 -269 41 -31 257 43 102 152 142 141 -61 -52 -26 77 165 214 -41 183 167 -41 -130 -78 34
5782C4rK12m01K07m3k3q3K14j28R2j02lJ70j41k14K02Q1l2m6P2k03Q0m7J91j90
$$ 34 25 237 -164 43 0 -23 -106 108 -20 72 -30 -33 137 -4 -218 -16 65 33 -13 59 -144 -64 -111 80 -110
5807a10K25k0o5j32N6J54j57O8L4m2K16j68J09j86l2K8m0Q5k79K68m5J5l9J94
$$ -110 115 95 30 -102 -46 108 -49 19 53 11 227 59 168 -18 -50 -22 -62 23 -256 12 -33 -18 -57 137
5831A37j44j84J93R3k50J26j89J17J15l67K95K3Q3K2k5n4l6J9j3J1L7p6J45n3
$$ 137 -7 -191 2 95 -155 -29 -218 -101 14 -353 -58 -35 48 70 45 -9 -45 -26 -39 -28 9 -67 78 25
5855B5mr5J25nN0l5j52J03n0J07j14J94j64O5OJ39k00j54P0J55m1r0n6J59J7J43
$$ 25 21 -74 51 46 96 61 -91 12 -38 69 -45 149 -15 50 56 195 -5 -159 -89 66 25 -65 -121 38 55 198
5881A98l12J12P9k3j8J8j24K8n9J02J26q3J05k30J5J03p1k49M18j37L38m08Pr1
$$ 198 -114 -2 77 54 36 54 -70 -42 -101 1 127 44 149 -81 -66 37 -34 -283 135 -2 336 -72 -65 -156
5905a56J37K88l2k00Nqj3r0j7J96nj29j22J80m7J10k49K00j10q4K16o7m4l1J21
$$ -156 -19 269 237 37 42 34 21 -69 -86 110 105 -24 -146 34 -13 97 -152 48 -62 -146 70 3 -41 -72 49
5930D9K5N3j12j95J67K9l7K89k93P9M9j09L5J6p8k26K37K3m6N5n2N9j00J33p4
$$ 49 74 127 15 -180 -13 16 -21 268 -25 54 103 -6 29 45 -33 -259 -22 1 -45 10 -42 17 -83 50 -24
5955b4m4K24q4j45J38P7k82L51o6K2k54R3O9k18j8K9J06K23k02J17m7k04J18J76
$$ -24 -68 156 72 -73 65 142 -140 211 145 167 -87 6 75 -143 -161 -132 -26 197 -5 112 65 -139 -21 155
5979A55j93JQ8m4J34j43M2j38J82n6J85k11j18M2K09K4k65J4QK6jj3Q9K1j68K36
$$ 155 -38 -37 51 7 141 -2 40 -98 84 28 213 2 -116 -74 135 159 -106 -92 -84 -58 -59 -72 17 38 -130 106
6005A06k03M8J49O3j40J51k12n1K44k48N6J1O6n0j60L43j12k2N3Jm5j28J88j40
$$ 106 -97 -49 100 163 23 174 -38 -89 155 -93 -37 -26 40 -10 -170 173 61 39 92 93 48 -80 108 -32
6029c2j07J40k9M5L1M0j41K18k74L5o3K88j88J0M9M4l42L21J4j41K14k00j96M36
$$ -32 -139 1 -28 17 48 88 -53 165 -109 -74 -137 151 -37 -27 22 66 -276 45 59 -82 132 -68 -264 172
6053A72j00P5j60M9jj01m5J23K76k30K2j93R1m5J92r4J75k93J79Q3k3N6p3l5o6
$$ 172 72 147 -13 36 35 -66 -111 12 288 58 80 -113 -22 -67 125 31 206 -87 92 175 152 208 135 100 34
6078C4l5j66M8L27j77m8J43k08J1J84j90J76k82J55J29o6j08J54k1K9L4j36J51
$$ 34 -1 -167 -119 208 31 -17 126 -82 -71 113 -77 99 -183 -28 101 35 -73 81 60 89 123 -13 138
6101A38J07j86J0l2K29l44J01J0%oj50K18n1Q0m2j38pJ84R9l05O3K9N3n3J1L3
$$ 138 245 59 69 37 266 -78 23 33 33 27 -123 95 44 124 82 -56 -63 121 220 -85 -22 7 60 7 18 51
6127E1n8l2k3N9j12J95j97K42p7R8j86J03l37K14L16k10q1j14N2J68k6M8j67L17
$$ 51 -7 -39 -62 -3 -115 80 -117 125 48 146 -40 63 -274 -60 256 46 -35 -149 -97 71 45 93 -74 243
6151B43m17J59r1P3k6m8J78K2j48l5J62j76k43K53J18J72j47k4m0q3J51k13J50
$$ 243 -174 -15 -106 -33 -59 -107 71 93 -55 -90 72 -104 -347 -94 24 196 49 25 -15 -98 53 -160 -10
6174a0J31j91m4J11K2n7l7K6o8J98J2J77k31n1J04K79k63l6j31K90j79J58k08
$$ -10 121 -70 -114 -3 19 -38 -75 -49 -117 81 93 270 39 -12 92 371 108 72 -59 231 52 210 2
6197Bl7J55k1j36m6K2K03k37J01J16L8Ok71J05m4j02j8O1K24l28K77j78J01j51
$$ 2 -35 120 99 -37 -83 -61 142 -95 6 122 160 166 -105 0 -44 -146 -164 -103 121 -207 70 -108 -7 -158
6221a58L8J42On8K44P3j48o2k31L10Q4k46K05q5j36P2q2J67k37L9J35j68M9k4
$$ -158 -120 22 28 -30 214 287 139 77 -154 156 240 -6 199 114 -22 50 -32 135 -102 -63 72 -96 -47 -71
6245g1n1J42k43K91j11J38j01K1Nj45K61p9j71K39j12Pj42J20N0j69K39lk63N7
$$ -71 -122 20 -223 68 -43 95 -6 15 20 -125 136 57 -114 125 13 20 -122 -2 48 -121 118 115 -148 -91
6269i1K29l71K27J24j63L6L3j02J98j69R7o6J04n4k68J69o3J71j28J11j15K99
$$ -91 138 -233 -6 118 -45 -9 24 -78 120 -49 48 -18 86 32 -236 -67 -130 41 -87 24 -91 208
6291B08o4k47K13K8k29J68j81J80j32M3%K4l9J7M2j16k03J98J7J41j79J89p8J16
$$ 208 144 -103 110 138 -91 77 -104 76 -56 -13 -13 11 -28 -11 31 -85 -288 -90 -73 68 -111 78 0 116
6315A16L2l5M5k50O6K3k8m6p9R6L3QK1l6J14l17J11r2J30O1P5p9J01M2k12J86
$$ 116 148 113 158 -92 -26 -3 -31 -77 -156 -60 -27 -19 2 -34 80 -237 -126 -218 -88 -27 48 -31 70 112 -100 86
6341H6K9j94J57k69J62M3k35K00N4O0j53J66k22J59m9l4q2J26l9K55k40J39m5
$$ 86 115 -79 78 -191 -29 14 -221 -21 33 93 -60 106 -116 43 -6 -40 -122 4 -35 220 -20 119 74
6364G4K52k56j49O6J1J22j71K0O5Q3k9K7k15M0j55J43j6j28K31o1K20o2k42L25
$$ 74 326 70 -79 -13 -2 120 -51 -31 34 117 88 115 -100 -60 -215 -72 -88 -216 15 -46 174 112 -130 195
6388A95j54n9R6m3n5j34K43k31L19j64r7K35j61n1j73L35j26J2j69M4J07J67k67
$$ 195 41 -18 78 35 -20 -154 89 -142 177 13 -84 151 -10 -61 -234 101 -25 -13 -182 -138 -31 136 -131
6411a31J17R3l05L82M7j34L6j33p0kJ15j56J7J86k0L1L0k09K11j21j08K78j95
$$ -131 -14 79 -226 156 203 69 105 -28 -98 -100 15 -141 -124 62 42 73 103 -106 105 -16 -124 154 -41
6434d1O1r9P9Rl66M92j19j33M6K22j69R2j72Pj1J81M8k08Mq2K12j82J09M4j0k7
$$ -41 20 -79 0 9 -357 135 16 -117 -71 151 -18 74 -98 -91 -102 79 127 -81 -77 -159 53 -129 -20 24 14 -13
6460a3O1K5j30J46Lq4r4K21l98J65R6n2J7K11k28P2N0n2o3j05K06n2P4L8j46m
$$ -13 48 73 -57 89 92 8 -86 135 -263 -98 -2 -54 -37 174 -54 18 68 16 -47 -152 54 2 76 114 -32 -36
6486c6J82k28L38k80j64K53j61Q4j13J0L49l10J46J15m3J27k70j8Q7o7P7Q2j99
$$ -36 146 -82 256 -24 -188 65 -96 -12 -125 -115 234 -76 70 185 142 269 -1 -19 68 1 78 160 -39
6509c9J25j06K28k08J63k95J99n1J36j34J12k25J36K3L7l68O8M05k28N3J45j08
$$ -39 86 -20 208 0 163 -132 67 16 152 18 130 -95 41 64 101 -267 -199 206 -22 31 176 68
6531F8J15q5j08K80k23l1P8k3J41k75P0m0q4k6P2r6N8J30jj62M0O3J07N3r9p5
$$ 68 183 98 -10 270 47 16 94 71 212 -63 7 -33 -117 -143 -71 -167 -109 21 20 -142 -102 -39 68 121 22 -53
6557e3J1m9J12P5j37J95j11m8p9K56j36K4j91Q9J17LL7n6Q1k87n0Q5J7K58j11
$$ -53 -42 -91 21 96 -41 154 43 -5 -84 172 36 60 -131 -42 75 78 115 59 140 -147 -197 -112 -95 163 52
6582E2k30J54J00k00J94P2j2j56j9M7K2j44L04l41J00J54q5j05J09K08k10Q7o0
$$ 52 -178 -24 76 -124 70 142 130 -26 -45 2 24 -120 184 -157 -57 97 12 -93 16 224 14 101 41
6605D1j95J73M5r0j4M3p2N6J26j39o6J62M8j38kJ14J7k62J68PL9J23j89jl6J31
$$ 41 -154 19 64 -26 -40 3 -69 -13 113 -26 -92 70 118 -20 -22 92 109 -153 15 22 61 184 -5 -6 -42 89
6631H9k10J34q3J6O2j74L80j86j53J03k19J83j32K42j92J92n5J01j89N2K4L1j05
$$ 89 -121 13 -70 -54 8 -166 214 28 -125 -22 -241 -58 -190 52 -140 52 -3 98 -91 -39 -15 16 -89
6654h9L6m9J95K8J9Jj35N4pm1n3K0r1J16r9N4KJ93l33J03J46m4K4j16jJ29N6j49
$$ -89 -53 -102 93 121 140 141 6 60 53 12 -41 -21 -112 4 -95 -41 -39 154 -179 -76 70 26 50 -66 -67 62 118 -31
6682c1j20O3M2j46K14j02L3l4J70j60J97p5k3N4O0Oj68J0k8k41K97O5k22k4J48
$$ -31 -151 -88 -46 -192 22 -80 -47 -81 89 -71 126 51 28 82 142 148 -20 -10 -38 -279 18 83 -139 -163 -15
6707a5j8J63k35N3J78l21J21o8N2J38k44J05J40r7O8KL3O3j86j0J51k79J86m5
$$ -15 -33 130 -105 -52 126 -195 -74 -142 -90 48 -196 -91 49 -48 20 22 55 118 -68 -78 73 -206 -20 -65
6731f5J20j01RK2j98J04L2R9R7R5l39K28k15p8J79j3n6J32r2n0n6J88o5K10j73
$$ -65 55 -46 -37 -15 -213 -109 -77 22 119 214 -125 103 -112 -190 -11 -24 -80 52 -40 -90 -146 42 -23 187 14
6756A4Q8mr1QN2L2j88J8N0j86J27J02K4J4k54K93j09j8L3l1n7N0Lj6j9k8K61k90
$$ 14 102 98 7 15 67 99 -89 -71 -21 -207 -80 22 46 60 -194 99 -10 -28 5 -26 -83 -33 -30 -46 -65 -93 168 -122
6784a22L33k96J8K72k78J5J14r0J02k6j2l22M1LK94p5PJ04j18K9l9K07j75J53
$$ -122 211 -85 -67 205 -73 -58 56 -34 68 42 30 -292 -251 -248 46 -29 -22 82 -36 -7 -46 161 -14 139
6808A39l28J57K56k44J84k26N4K8K2J30j6k27jMp4N29l61K02q0j03j31J69n5o7
$$ 139 -189 -32 224 -20 164 -62 -8 20 42 172 156 -71 -72 -68 -142 387 26 228 148 45 -86 83 28 -39
6832c9R7Q6k58J01N3%l0m3k5K69j40j65k36N48k96k18L27J97M8l82K30j14P6J1
$$ -39 58 144 -114 -13 40 40 10 -33 -58 211 71 -94 -330 218 -78 -296 31 228 276 -106 124 10 86 97
6856I7p8j31K46j25K9q6O5r1O2L4J3j1o1O2N2j99P2K6J15k74j4K33n0j6J9k35
$$ 97 19 -112 134 9 38 -48 17 -74 -12 22 35 24 -37 25 77 -122 -50 -24 91 -183 -197 36 -14 -30 -11 -246
6882b46L91r5j94J14O6j22J07oL9K1j14Q4j04Q5L0K9j78J17M8N1m3j94K64k74
$$ -246 145 50 -144 -30 36 -86 21 15 54 75 -39 45 -59 26 56 85 -93 24 72 123 80 -114 150 -124
6906a24J43J69k07q7lK16l19J37J15K2j93J87J63l69J96j65K36K03l27j10Q4L2
$$ -124 19 188 -19 -106 -109 107 -212 -75 40 62 -131 56 219 -150 46 -119 117 320 -7 -117 -33 -1
6928al1M3j79K20J41j93J32j00j08L3J18j70J21q9j2J37Nprk05K0J97k3O4k48
$$ -1 -32 11 -168 52 193 0 132 32 -76 -43 75 -95 26 -63 -75 62 67 60 51 -154 -134 63 40 104 -144
6953a44K08L5J23k46M8o1P8M0M1N8j59J9l8j08J44l8J17j33j64J11J45N9p1p9
$$ -144 64 99 222 -24 24 -37 41 81 122 180 21 40 2 -106 38 0 117 -16 -180 -69 76 135 64 -15
6977a5N4n1J01j58L32l17r4L14M7l06K9j0KrJ51J5p5J8k72L11j14J30j38K41J04
$$ -15 39 -12 89 -69 263 -54 -148 166 213 -93 -64 -74 -72 -81 70 85 10 28 -244 67 -47 83 -55 186 290
7002B90n30M32j45J14j22j00J10P6j17j1N7J63l57L5L42r9j66lj94P4J54Q0k63
$$ 290 -240 192 47 161 39 -61 49 125 8 -3 54 217 -140 -105 237 138 -28 -31 -225 -151 3 83 -180
7025a80J94r4J79r0k9kjO6j6r2J21K1q7L9J1k3O5J4q7J38p9k55J92J73l82J61
$$ -180 14 -80 99 9 -20 -22 -23 43 27 -65 56 77 -10 29 40 17 82 96 9 147 68 -187 5 178 -204 -43
7051d3J4j2J65j9p9j23K9J39j63K49K8j35J20l42mj7K50k36J49J02p4J4J76K4
$$ -43 -29 -41 124 105 26 -97 -68 71 -92 157 185 50 170 -172 -176 -193 57 -179 -30 72 -2 12 188 212
7075B12L5j84n6N6P4m1m0J3r0O0j4%n6q3J09PK1K7O4Q9k55j41M9J25q3R8L5J92
$$ 212 247 63 7 63 137 96 56 69 -21 39 25 25 -31 -114 -5 2 23 50 114 203 -52 -193 -144 -19 -102 -4 31 223
7103B23k40O5K3K8k30J23m2lJ00K9k05K68j20L2j58P0P1m7O4k22K51m5K6q6l9
$$ 223 -17 48 71 99 -131 -8 -50 -53 47 76 -129 139 19 51 -107 -37 34 -13 51 -171 80 35 61 -25 -64
7128f4o8M2J87r9L8J32r0j65K5J37r9k7L5R4m5j96K48j43k8K8l7N4O1l3L3k5o0
$$ -64 -132 -90 97 -2 36 168 78 -87 -62 75 -24 -51 -16 78 33 -163 85 -58 -86 -58 -95 -41 20 -13 20 -5 -65
7155f5K3P3jk23M3Q4J22j14j36K38M3J4j98J9J63k11J21J02j08j66J03J88j3j96
$$ -65 -42 31 30 -193 -150 -66 56 -58 -194 44 87 101 -97 -78 85 -126 -5 97 -11 -177 -74 114 101 -95
7179i5O2k9K25j99p9J0J35k6j04J08K5omm9l7Q4l7k8K26k55q1J4J91J33j18M7
$$ -95 -33 -62 163 -36 -115 -105 30 4 -100 8 33 27 23 -26 -63 21 -16 -44 182 -73 -154 -140 51 184 66 113
7205A13j64j39M4L30n2k58J65l8mj40J71j24K41j70L6k35L33k64L6R2J28O2l19
$$ 113 -51 -190 -146 184 132 -126 39 1 -3 -143 28 -96 145 -25 11 -224 109 -155 -119 -27 101 163 -156
7228a56N1K31k31Q2L7n5l5L7J2k91N28k99r1K32J4RO0L6m08L68r4J7k23K13j72
$$ -156 -105 126 -105 -23 14 -41 -76 -39 -27 -318 210 -89 -180 52 66 75 135 171 -237 131 37 54 -169 44 -128
7253a28J23k4L50j91j73J61j29J35l10J54J01k05J26r3J70j30R8lj71Q2Q1K33
$$ -128 -5 -29 321 130 -43 118 -11 124 -186 -32 69 -136 -10 -103 67 -63 35 32 -139 -57 24 257
7275B57l46Q4k0J25l4J8J46k46j86K25j81J30K01k26J98Q8j87q3J00n2l5J44j73
$$ 257 -89 -5 -25 100 66 84 230 -16 -202 23 -158 -28 173 -53 145 233 46 -37 63 11 -24 120 -53
7298e3kn1r8K51j0o7J04L9j45M4r3J03LN4lJL0p6P4j06j73L06j82J85p7j48J84
$$ -53 -55 -106 -204 47 37 -30 74 113 -32 12 -81 22 25 79 76 77 107 31 105 -1 -174 132 -50 135 58 -90 94
7325I4j43P4l8O5l3Pk6p5N0M2j29J22nJ12j70Rr3J59lq5j7N4J52j61N7r9K98k07
$$ 94 -49 25 -13 52 19 26 0 -75 -25 17 -112 10 5 117 -53 -44 -137 22 19 -66 -83 -29 123 -38 19 -80 218 11
7353A1k43Q0J81pj02m3M18m28o6L10j21Q0j04O6J37j29q8J78m4n0J55j61j06L19
$$ 11 -232 -152 29 22 -80 -123 295 -133 -199 111 -10 70 -34 32 169 40 -48 130 86 36 191 30 -76 243
7377B43k44j16J17j17n6R0R9q8O1n1J57r4M1q4j19K20Q9k40J23m2J1m0J17j48
$$ 243 -1 -117 0 -117 -173 -83 16 -72 -11 -62 95 1 42 -42 -161 59 148 -92 31 -11 0 -40 77 -71
7401g1n2J02o1j87L31J3j28J74J9l19Q4j41K3J46MO1P0k59l1K02j12Q0J09K3n5
$$ -71 -123 -21 -82 -269 62 75 -53 121 140 -179 -95 -236 -213 -67 -63 -2 68 -191 -222 -20 -132 -52 57 80 25
7426B5j78K27j37N6J52p9m3j42K97Q5k78J47k17J5J53k00R3K9qM5j11O0L5J84
$$ 25 -153 74 -63 -7 145 66 23 -119 178 263 -15 132 -85 -70 83 -117 -24 5 -3 42 -69 -9 26 210
7450B10N3l70pJ35j37k6j46J41J95M3o6j04q0J27J76m2l2M4o5o2j46M52k29j57
$$ 210 263 -107 -114 21 -116 -142 -288 -147 48 91 25 -79 -159 -32 144 102 70 114 49 -13 -159 293 64 -93
7474i3K80j88n7L6j11K33r6k57P9p2K03L0n1j2K06l80J03M33l68m2J92k26J35
$$ -93 187 -1 -58 -22 -133 100 4 -253 -174 -246 -43 -13 -64 -76 130 -250 -147 286 -82 -124 68 -158 -23
7497b3J96j86j32J29R3l5j15n4J69O3l8k37K31J42k89Q4J55l08J4J58R3j72M5
$$ -23 173 -13 -145 -16 77 42 -73 -127 42 105 67 -170 61 203 -86 -2 153 -155 -141 17 110 -62 -17
7520a7njJ03j15Jn2Q8jLn2l5j9J80k88J46p7J20N1J12j71q3J83j43M9j52K90k27
$$ -17 -22 -23 80 -35 -34 -86 2 1 4 -48 -83 -102 78 -210 -64 -141 -21 30 142 -29 -112 71 -72 -23 -175 115 -112
7547a12o1Q6N9j2J57j09m9N5j33J00J8kJ34j20k7q3o0M4L4M2P7L9O9k21O2o3M20
$$ -112 -173 -87 -28 -40 117 8 -41 14 -119 -19 -1 -3 131 11 -16 -99 -159 -115 -81 -39 38 77 146 -75 -13 -76 344
7574C44l47n1N6j82Q8K42j70Q8P4k33J79j13o5R6Q4L3n7k02J20MJ25j64k6O6J3
$$ 344 -3 -54 2 -180 -92 150 -20 68 142 -91 88 -25 -90 6 90 123 66 -136 -16 -12 113 -51 -77 -11 2
7599BNK2l2j4Lq0J60j65J23k6P6p8P8J3j60J04j46R6K71j87k31J20Qq2J22J15
$$ 2 7 29 -3 -17 -14 -94 66 -99 24 -2 74 -4 74 87 -73 31 -115 -19 252 65 -166 -46 -38 -120 2 117
7625A17j17J20q0MLR7j05l3O9j58M6P3J8J46k95J40K5j25l0p6L22l26L49k84J72
$$ 117 0 120 40 44 47 144 39 6 75 -83 -37 36 54 200 -95 45 70 -55 -85 -161 161 -165 184 -100 72
7650G2O8j35k3J40q2R8j60P4rj19K77m54L94k51J32J06k08k27L18J30q4p2m2o8
$$ 72 140 5 -18 122 40 138 -22 52 43 -76 201 -253 141 -110 22 128 -80 -307 11 141 57 -15 -57 -125
7674a25L6K03j09j49K87k23J86j15N7j21K2r6L1K54k22K06l8J2j20J31j33K7K3
$$ -125 -89 114 5 -144 143 -80 106 -9 48 -73 -51 -147 -116 138 -84 122 84 96 -24 107 -26 1 24
7697B4Q8j81m6R3K12j34rl0l5L8P4j16j51J50J2m6J2K66l1j19k97K93q6O8J6j94
$$ 24 112 -69 -115 -22 190 56 47 17 -18 20 94 -22 -173 -23 -11 -57 -45 221 190 71 -226 67 -19 49 65 -129
7723a29N5K07k51J01KK6J08k3j05r2R0P6K7j15n9j08K23j15J92l22Q8J33o1R6
$$ -129 -74 133 -118 -17 -15 11 119 96 -9 -101 -11 65 92 -23 -82 -190 33 -82 110 -212 -124 9 -52 44
7747D4J5N1j72j08L19M8j05l60L95j76L1J2n2J91j94J57k16Q4J43j24J15q1M2
$$ 44 59 110 -62 -170 149 197 92 -268 127 -49 -18 -6 -58 133 -61 96 -120 -36 107 -17 98 17 59
7770E9j69QJ22j07J15j52N4k6RJ52k34J71o2J64k50K50n9n5J0M1M3p9j33j9o6
$$ 59 -110 -102 20 -87 28 -124 -70 -96 -87 65 -169 2 -60 104 -146 104 45 -10 0 41 84 5 -128 -147 -213
7795b13J87J79k55O1J12L9J9k50N5J13L7M0r3K10l51J82k1j97K43O2k62J53l06
$$ -213 -26 153 -102 -41 71 110 129 -121 -66 47 84 124 31 241 -110 72 51 -146 97 159 -103 50 -256
7818b56L44j65J63Q0k22K14k00K24m3l57L62q2n3K71j77k23qR9jJ01%P0N8l0n2
$$ -256 88 -77 86 166 -56 158 -42 182 139 -218 144 62 9 280 103 -120 -128 -29 -30 71 71 141 199 169 117
7843A17L8j93j39J97J75k98K85j55J4j08J22k12K81k56j16L66k36M0k01K11j97
$$ 117 155 -38 -177 20 195 -103 182 27 41 -67 55 -157 124 -132 -248 118 -118 -78 -279 -68 -265
7864b65M41J7j14l04M4M24k23m7l1J11J43j68l6RM2n1Q2l5j75J89p2p6J46j56
$$ -265 176 193 79 -225 -181 243 20 -27 -58 53 196 28 -8 1 43 -8 74 39 -136 53 -19 -95 51 -105
7888a05K74k25k3O9Q6p0k2N5n6J03j81P9K20j04n6n7Jj73J84j04R6J14k22P0k
$$ -105 169 -56 -79 -10 76 6 -16 39 -17 86 -95 -16 204 100 44 -13 -12 -185 -1 -105 -9 105 -117 -47 -49
7913d9K0P2N7k10K6J04q8J98j02n7J90m36K43nk5k8L62j58j75j64K45p1P6l1o5
$$ -49 -29 43 100 -110 -84 20 -68 130 28 -29 161 -275 -32 -37 -62 -90 272 114 -61 -225 20 -51 25 -6 -71
7938g1K47k12rPML3P8j82K55k75O3J13k6l5L0k24K63o4N5o7J8n5J73k48J26J24
$$ -71 176 -36 -45 -38 -34 -1 77 -105 150 -125 -62 51 25 -10 20 -204 59 -5 50 -17 1 -54 119 -129 -3 121
7964A21j04j35M8J39k6J58l71J50K55k31k4J8K3o9k9J35N2k09O8j09mJ88k02J
$$ 121 17 -118 -70 69 43 201 -170 -20 235 4 -20 -2 21 -48 -77 58 110 -99 -31 -140 -144 44 -158 -157
7988a57j10L27L2M4R7l26L3L7M0J78p8m06K58l6N6q5M7N2L4J49j75J87j20k43
$$ -157 -267 60 92 136 233 -93 -60 -23 17 195 117 -289 -31 -67 -11 -96 -49 3 37 186 11 198 78 -165
8012a65J3J13j17P7k1LK44j43JM5Q2j31j01P7J04k18L37k18p2J91l02J38M6m6
$$ -165 -152 -39 -156 -79 -100 -97 147 4 5 50 132 1 -100 -23 81 -137 200 -18 -90 101 -201 -63 -17 -63
8036f3R4m1j3L4ql9O9q1P0j64J50K38m23K27j63J05j36K45r2P8l31K46NK2n0K62
$$ -63 31 -10 -23 11 3 -36 33 -48 22 -142 8 246 -177 50 -113 -8 -144 101 9 87 -244 2 7 29 -21 241
8062B41r7j58r4K25j56j5J15r6K1m0O7n9j05K07q8r3J98p9P9j02K44k11k4Q9N3
$$ 241 144 -14 -108 117 -39 -54 61 -35 -14 -54 13 -46 -151 56 -32 -125 73 -6 73 -29 215 4 -20 69 122
8087A22j76j32L21j70J57j42L0j25K11k25J88r8P6p7k8J10K0l5K8J72k65k37J48
$$ 122 -54 -186 135 -35 122 -20 10 -115 96 -129 59 -39 37 -40 -68 42 62 27 55 227 -38 -275 -127
8110a27K11j64J76K4k46L1L89l20Q1l72M20q7q8K00j32R1m0j67J29O2M1j18r9
$$ -127 84 -80 96 120 -126 -95 294 -26 55 -317 103 16 -72 128 -4 87 47 -120 9 71 112 -6 -105
8133a05R0L5J46k04P3K5ko7K6J1m1l6k8N8J34p5l8j72J29P7n8J1K8J10n9J43p3
$$ -105 -15 20 166 -38 35 60 58 -9 17 28 -13 -49 -77 -19 115 40 2 -170 -41 36 -22 -11 17 127 68 211 138
8160A38k08J24pj79M3K63k95J06Q2j83K39n2j88J97k0oJ08k92M5J6J36r6J18j98
$$ 138 -70 54 47 -132 -89 174 -121 -15 67 -116 123 71 -117 80 60 54 162 -130 -85 -69 67 -29 89 -109
8184a09L28k33J81n0q1N6j20
$$ -109 219 -14 167 117 36 92 -28
8191b8
$$ Imaginary data points
##PAGE= N=2
##DATA TABLE= (X++(I..I)), XYDATA
0@%%%%%%%%%%%%%qJ6j6J6j6K4l2L2m0M8n6P2q2R1j06J24j45J66j90K16k44K76
$$ 0 0 0 0 0 0 0 0 0 0 0 0 0 0 -8 8 -8 8 -8 16 -16 16 -24 24 -32 40 -42 49 -57 67 -78 88 -102 114 -130 146
35A46l11L51l94M40m94N50o09O79p55Q35r24J020j123J237j361J501j656J825
$$ 146 -165 186 -208 232 -262 288 -321 358 -397 438 -486 534 -589 648 -713 788 -868 957
53I57k011K219k455K721l026L379l792M282m879N623o574P851r662J2445j7334
$$ 957 -1054 1165 -1290 1431 -1595 1784 -2008 2274 -2605 3018 -3556 4295 -5367 7078 -10256
68a0256K8432j03372O197J46135o0979o7333M87O9830O324k4513m341L4267J0940
$$ -10256 18176 -85196 -78999 67136 6157 -61176 -60689 9141 15465 -9048 -13389 20878 31818
81C1818R04j9309j7662l025K4663K0783q403l9792j0703J7001M317j0518O497
$$ 31818 32722 13413 -4249 -7274 17389 38172 29769 -10023 -20726 -3725 592 -9926 -3429
94c429J2907k722k0818Q81K2443K527j1388P476N658j1951j3184N324J5566M015
$$ -3429 9478 6756 -14062 -13181 9262 11789 401 7877 13535 1584 -11600 -6276 9290 13305
108A3305o029m969j5938j1298J5825J7876o458j4619J505J5818K29j5309N300
$$ 13305 7276 2307 -13631 -24929 -9104 8772 2314 -12305 -10800 5018 5247 -10062 -4762
121d762K1693K686j6994j1725O790R261j577M615M834j6529j4750R438J0997o906
$$ -4762 16931 19617 2623 -9102 -2312 6949 5372 9987 14821 -1708 -16458 -7020 3977 -2929
135b929r565Q349J0956j5151j5746J4173J6874m366j1536J134R312k209q567P122
$$ -2929 -12494 -4145 6811 -8340 -24086 -9913 6961 2595 -8941 -7807 1505 -704 -9271 -2149
149b149J2030m08o913l938J590M270P09J504n92o125J882Q189l616q845J650Q011
$$ -2149 9881 9473 2560 -1378 212 4482 5191 6695 6103 -22 1860 10049 6433 -2412 -762 7249
165G249j955j3202j198J3542L324r961n322J608M429K62l032K509L497p70k904
$$ 7249 5294 -7908 -9106 4436 7760 -2201 -7523 -5915 -1486 -1224 -4256 -1747 1750 980 -1924
180a924m807P83Q978M217n082o390m67P231L21q691K525J2672J793j2013q052
$$ -1924 -6731 -5948 3030 7247 2165 -4225 -4692 2539 2860 -5831 -3306 9366 11159 -854 -8906
195h906Q644J0886n980q694K574M597j442n120k447M809M263j187m629n798J152
$$ -8906 -262 10624 4644 -4050 -1476 3121 1679 -3441 -5888 -1079 3184 1997 -2632 -8430 -7278
210g278P507J775l547k079K773M467k322o480L162Q178N26n397l564K732L976
$$ -7278 229 2004 -1543 -3622 -849 3618 1296 -5184 -2022 6156 6682 1285 -2279 453 4429
225D429j247j141M81j093M84k4l897j495L073L885p87n794j181N741O65l771k273
$$ 4429 3182 2041 2522 1429 1913 1889 -2008 -3503 -430 3455 2668 -3126 -4307 1434 2099 -1672 -3945
242c945J444K587j137l355K470M164l53l061j874J030K563K44N6P44p33O83n33
$$ -3945 -2501 86 -1051 -4406 -1936 2228 1875 -1186 -3060 -2030 533 777 833 1577 844 1527 994
259I94l271J590N540P52m214m694J610L895r82k373J216K304o65l692l457J978
$$ 994 -2277 -687 4853 5605 1391 -3303 -1693 2202 1220 -1153 63 2367 1702 -1990 -5447 -3469
275c469M418J379j398k974o79K762J307j151j056J172K852j361n734J68N691K419
$$ -3469 949 2328 930 -2044 -2723 39 1346 195 -861 311 3163 1802 -3932 -3764 1927 4346
291D346k433l830N15K906j170j569J044J720J622k208l994P85L673O04j850k045
$$ 4346 1913 -1917 -1402 1504 334 -1235 -191 1529 3151 943 -3051 -2266 1407 2011 161 -1884
307a884Q53K401j483k855J262L087J517l582m104L020M030j163k756j68K426J812
$$ -1884 -1031 1370 -113 -2968 -1706 1381 2898 -684 -4788 -1768 2262 1099 -1657 -1825 601 2413
323B413j935j131J419J287N33j868k275J596K835n76j903j816K77J091n79j203
$$ 2413 478 -653 766 2053 2586 718 -1557 39 2874 2298 395 -1421 -1144 -53 -632 -1835
339a835J153J457P1k236k376J955K673K28q42o87K22J078j039r92J060K137J208
$$ -1835 -682 775 846 -1390 -3766 -1811 862 1090 248 -439 -217 861 -178 -1170 -110 2027 3235
356C235k252l630J021K765L67j406j136J012K070k301k229Q03K711J432j701l231
$$ 3235 983 -2647 -1626 1139 1506 100 -1036 -24 2046 -255 -2484 -1681 1030 2462 761 -2470
372b470J080K008r5j019o35Q43J061j103j573P44J880J454j555k166Q81J835o52
$$ -2470 -1390 618 523 -496 -1131 -288 773 -330 -1903 -1159 721 2175 620 -1546 -665 1170 518
389E18n95K71J131Q67k002j724J448J497P47k089k342J672K009p27j336q08J266
$$ 518 -77 194 1325 2192 190 -1534 -86 1411 2158 69 -2273 -601 1408 681 -655 -1463 -197
406a97J324k206j869J197K956J522k703k846J423K804j06j056o82O25P28k021
$$ -197 1127 -1079 -2948 -1751 1205 2727 24 -2822 -1399 1405 1299 243 -439 186 914 -1107
422a107j654K278K663J057k428k442Q00O71P9O49R29N64o85k582q12J835J668
$$ -1107 -2761 -483 2180 3237 809 -1633 -833 -162 -83 566 1495 2059 1374 -1208 -2020 -185 1483
439A483m2j466j362M66L9l81J095Q31L20p88j798l53J897J305K60j281j092P47
$$ 1483 1441 -25 -1387 -921 -882 -1263 -168 663 983 195 -1603 -1956 -59 1246 1506 225 -867 -120
457a20Q23l73J54J31M46q92k159o01K440K094j51k088j580J389J068n64J92M63
$$ -120 703 330 484 615 1061 169 -1990 -2591 -151 1943 1792 -296 -1876 -487 581 17 209 672
475F72Q17o31k419m99K094K158k3k983k076J410J619R3nK94O18n35k206m79K780
$$ 672 1489 858 -1561 -2060 34 2192 2169 -814 -2890 -1480 139 232 227 521 1139 604 -1602 -2081 699
494F99K247k65k402j695J148N15l54P58R67m08j520k562P21K366J149q36j362
$$ 699 2946 2681 279 -1416 -268 247 -107 651 1618 1210 -310 -2872 -2151 215 1364 528 -834
511h34k26Q74k13o81J169J150J99r43j969J37K159J092m47k147j487J330J484
$$ -834 -1060 -186 -399 -1080 89 1239 1438 495 -1474 -1337 822 1914 1467 -680 -2167 -837 647
528F47k01p84n0J104K00k073o88K189J991o43k438r09J407P91l82L11M33k93j271
$$ 647 446 -338 -388 716 916 -1157 -1845 344 2335 1692 -746 -1655 -248 543 161 472 905 612 -659
547f59r52P12J878L43q92q25k76L47k07L11J124M5l86r12j347P32J822O47n94
$$ -659 -1611 -899 979 1322 430 -395 -671 -324 -531 -220 904 949 563 -349 -1696 -964 858 1505 911
566I11j652q76R75Q38r0N6j44Q12P1j896k93J690J167n36j486q98Q07K56j0K30
$$ 911 -741 -1617 -642 196 106 162 18 830 901 -995 -1288 402 1569 1033 -453 -1351 -544 -288 -298 -68
586f8J51j2l91l90O26J42j80L18N5k39M8r9K89N75m76k60n03n39N01J411p4j013
$$ -68 83 71 -320 -710 -84 58 -122 196 251 12 60 -39 250 825 349 89 -414 -953 -452 959 885 -128
608a28r28L89J129l71r24P39Q28J58j082j050J053J590j38p98p27j09M47m06k01
$$ -128 -1056 -667 462 91 -833 -94 734 892 -190 -1240 -187 1403 1265 467 -260 -369 78 -328 -529
627e29M47L81j09m87p34M22O31L24q3n54qK24O9N6Q4J81K55m08j050M05R75K0
$$ -529 -82 299 190 -297 -1031 -609 22 346 263 -291 -299 -75 -6 50 134 315 570 162 -888 -483 492 512
649E12m00n09N11M19m81q74M33J027K06p09r41O23J160l78n92k86P22Nn68n61
$$ 512 112 -397 114 533 52 -822 -389 638 844 135 -806 -183 977 599 7 -279 443 448 -120 -681
669f81N97L90J91o25n69K79O13P7m34j8l1N33j82r2L71r9J16k75q91L77N48L35
$$ -681 -84 306 497 -128 -697 -418 195 272 -162 -180 -211 322 140 48 419 320 436 161 -730 -353 195 530
691E30k68m19J88j87k16k6K21L76K82m68o82J73L87L47J07j56j17J14m46l74M05
$$ 530 262 -157 31 -156 -372 -398 -177 199 481 13 -669 -496 -109 238 345 189 72 186 -260 -634 -229
712b29N98K65m32p78m1Q76j95MRJ27K71m62m14L67N40J58o60l67j0M61K8n31J82
$$ -229 369 634 202 -576 -617 259 64 68 77 204 475 13 -401 -34 506 664 4 -363 -373 88 116 -415 -233
735b33O40r4o27m43L80P33k4l62l29M9N02o4j40q3K30J94k45m95L28K54J65k27
$$ -233 407 313 -314 -757 -377 356 332 -30 -359 -310 192 128 -12 -95 135 329 84 -411 -83 171 336 109
757A09l91J69L57m39K49K9L3p5m2k75K42M95m5n69l19K85L29j92J7o8L63lm26
$$ 109 -282 -113 244 -195 54 83 116 41 -1 -276 -34 461 416 -153 -472 -187 142 -50 -33 -101 262 259 -167
780a67l29J82N74Q1k09m64K75M3o4K1K59k7J37k14m62N36mJ45j97k2q4p8j29j4
$$ -167 -496 -314 260 341 132 -332 -57 -14 -78 -57 202 175 312 98 -364 172 168 313 116 94 10 -68 -197 -211
804b11k7Q9L37m60k42L80J44M60p70j15L20K24k86J80k33N15M8l50l22J29N62
$$ -211 -238 -149 188 -272 -514 -134 10 470 -300 -415 -95 129 -157 23 -210 305 353 3 -319 -190 372
825C72J28n17l62N19R1p8k10K2J68j35k06l9J06L56o5k06r3L90j95j18k8J23K32
$$ 372 500 -17 -379 140 231 153 -57 -35 133 -2 -208 -247 -141 215 150 -56 -149 241 46 -72 -100 23 255
848B55k60j59k07K94J01J4NL1P1k61l52K62O39k6L0m23k00J37m0M7J58k42P3K27
$$ 255 -5 -164 -371 -77 24 38 43 74 145 -116 -468 -206 433 407 437 14 -186 -49 -89 -42 116 -126 -53 174
872A74n81N1J4N99J12n10O8k11J13J64p8n5O3J13j65m0J40L13q6l72L29l27L08
$$ 174 -407 -356 -342 257 369 -141 -73 -284 -171 -7 -85 -140 -77 36 -129 -169 -29 284 198 -174 155 -172 136
895A36J05k97R1K56m67J07J1N3M89k15o73J82J80K43k70q2Q8J16k25n0q4L07J90
$$ 136 241 -56 35 291 -176 -69 -58 -5 484 269 -404 -222 -42 201 -69 -151 -63 53 -172 -222 -306 1 191
918A91j12l99q3K98K97L7J13l3j69l20J73m6L27K76k27m05j01J05k04J13K39j45
$$ 191 79 -320 -403 -105 192 229 342 309 140 -180 -7 -53 274 550 323 -82 -183 -78 -282 -169 70 -75
940g5M40k43l23N9R7L29J8l78k66K07K43K41k38k42L10k12k10j4M55rNk14l67
$$ -75 365 122 -201 -142 -45 284 302 -76 -342 -135 108 349 111 -131 179 -33 -243 -257 198 189 194 -20 -387
963c87K89j09L79p5m3rk65O7O8J58J10j82n0N5j64J73J82k3l54P0l3n6J10n1M50
$$ -387 -98 -207 172 97 54 45 -220 -153 -85 73 183 1 -49 6 -158 15 197 174 -180 -110 -143 -199 -89 -140 310
988C10k38k68m3P1M40l85J92k2j1J26k42j05K93M3J88m35l1P0O2j52J01m4J49
$$ 310 72 -196 -239 -168 272 -113 79 57 46 172 -70 -175 118 161 349 -86 -117 -47 15 -137 -36 -80 69
1011F9j09j1m1QJ52Km1j01J17j65K53k13K24o7J83l09j84J5K04k82K95q0J96J9
$$ 69 -40 -51 -92 -84 68 70 29 -72 45 -120 133 -80 144 77 260 -49 -233 -218 -14 -296 -1 -81 115 134
1035A34j85J30j89K44j35j01K32k17J91p3N0k15K16k01oK43j21n6j32R7Q7m3O1
$$ 134 -51 79 -110 134 -1 -102 130 -87 104 31 81 -134 82 -119 -125 118 -3 -59 -191 -94 -7 -50 11
1058A1K4J04j25P8k22n9K05p3l1J22n9j71p1J76RP2Q7k46J85J73j88J50j62OP7
$$ 11 35 139 14 92 -130 -189 16 -57 -88 34 -25 -196 -267 -91 -82 -10 77 -169 16 189 1 151 -11 -5 72
1083G2j30M1R8J02j93o9J55o6M5RJ43j57P6k59J34LP8m7r1J39p2K5k76L45O2J60
$$ 72 -58 -17 81 183 -10 -79 76 10 55 64 207 50 126 -133 1 4 82 35 -56 83 11 36 -240 105 167 327
1109C27m71N3Q3O8m8J12j63K6j16J08O0Lj6p3J14J19j87n8Q9r3M3j01N4m0J2L97
$$ 327 -144 -91 -8 60 12 124 -39 -13 -129 -21 39 42 26 -47 67 186 -1 -59 30 -63 -20 -121 -67 -107 -95 302
1135C02l71J85k34K23k00J24J01j80J49r3n7K3K08j17j28j6j00K86k11K32r5j5
$$ 302 -69 116 -118 105 -95 29 130 -50 99 6 -51 -28 180 63 -65 -81 -181 105 -106 126 31 16
1157A6j05n6K00j20kP9l10K84Q2j9j11K01j64k4R9J50k0k34J03j4L19l15k47J23
$$ 16 -89 -145 55 -65 -67 12 -298 -14 68 49 -62 139 -25 -49 50 200 180 -54 49 35 354 39 -208 -85
1181h5J46l9R1j76Lj4J19j89pP5PJ57p3r2K6l4O6j21J14j15K79jl89K59j21J53
$$ -85 61 22 113 -63 -60 -74 45 -144 -151 -76 -69 88 15 -77 -51 -85 -19 -140 -26 -141 138 137 -252 7 -114 39
1207C9Q2l14K57j84N1J49j48j81J19J21J8n3N9K21k94j40K17k27O2J33K7k7K8
$$ 39 121 -193 64 -120 -69 80 -68 -249 -130 -9 9 -44 15 236 -58 -198 19 -208 -146 -13 14 -13 15
1230A5k0Q5p0j19O2j9Or5J28q4L4pJ01J21k11J7p1K07q7J23n0J9k37k0K91N0k91
$$ 15 -5 80 10 -109 -47 -66 -60 -155 -27 -111 -77 -84 17 138 -73 -56 -127 80 -7 116 66 85 -152 -172 119 169 -122
1257a22J58p0O2j51J61j2p2P1J1p7j26J64K1j00J91l92K47m0J80o0n0j33J64o5
$$ -122 36 -34 28 -123 38 26 -46 25 36 -41 -167 -3 18 -82 109 -283 -36 -76 104 44 -6 -139 25 -40
1281d0J51l55M47r1m4N5m6N8l12J34N1l6j24R4m3L1Q7J13j97J64l00J16J3J64
$$ -40 111 -244 203 112 68 123 77 135 -177 -43 8 -28 -152 -58 -101 -70 17 130 -67 97 -203 -87 -74 90
1305I0j42J66L2K7k49O7r8Q7q3J18n5K42l03P6k6jl1R5J2K3q5j5J84l32L56pj71
$$ 90 -52 114 146 173 -76 -9 -107 -20 -103 15 -40 202 -101 -25 -51 -52 -83 12 24 47 -38 -53 131 -201 155 148 -23
1332b3K09k85J99r6l9J18J62kj84p3j68K90r8j13J98j25K37j47k24J35k7pJ78
$$ -23 186 -99 100 4 -35 83 245 243 59 -14 -182 108 10 -103 95 -30 207 60 -164 -29 -56 -63 115
1355A15k35L02k22j47J21J42n3j64L56j03k05K28m27K83K9N7j45J00J15j56N2
$$ 115 -120 182 -40 -187 -66 76 23 -141 215 112 -93 135 -292 -9 20 77 -68 32 147 -9 43
1376D3J03k72J89r4l8P0J56j57q9L37k76J22j00m4J38j1MJ3l32K58P4l71J63K81
$$ 43 146 -126 63 -31 -69 1 157 0 -89 248 -28 94 -6 -50 88 77 81 94 -238 20 94 -277 -114 167
1400A67l52J54K8p3M5k0o3J00K6J4j39J72Qj30JPJ08j06O5J06j21j08j1j26J95
$$ 167 -185 -31 -3 -76 -31 -51 -114 -14 12 26 -113 59 67 -63 -62 -55 53 -53 12 118 -3 -111 -122 -248 -53
1425e3j60J54J14k24K35J73l35JJ16K16k64J42m13J22L80k24P2k7j28m6J36K6
$$ -53 -213 -59 55 -169 66 239 -96 -95 21 237 -27 115 -298 -176 204 -20 52 25 -103 -149 -13 13
1447A3M2j55J35N0j1p2q2J39J30j43J68k21l8O5Q5r3k18J58n2K50l0J29k31K1
$$ 13 55 -100 35 85 74 2 -80 59 189 46 214 -7 -45 20 105 12 -206 -48 -100 150 120 249 18 39
1471C9j80K69k00J32n9l1K38l23j62M47o8rn9K5q7q9Jq4J0K39m1P8j37N1L2L9
$$ 39 -141 128 -72 60 1 -30 208 -115 -277 170 102 93 34 59 -28 -117 -116 -200 -190 49 8 86 -51 0 32 71
1497G1l00l4J77J56p3M8m3J07j38J01p7O4q7J17p4J20j99K40k32R3K6j15J63j61
$$ 71 -229 -263 -86 70 -3 45 2 109 -29 72 -5 59 -28 89 15 135 -64 176 -56 37 63 -52 111 -50
1521e0P1Q0k67K08j06j07L43k70N7j88k4K13l6p3J84O9j11M3j48J75j80J91p5
$$ -50 21 101 -166 42 -64 -171 172 -98 -41 -229 -253 -40 -76 -149 35 104 -7 36 -112 63 -117 74 -1
1544aN9j12J52L2k8N3q4L9j41P7j97J68j35n7K52p4M2Q6k36P8P3Q1P6k13k7L07
$$ -1 58 -54 98 130 102 155 71 110 -31 46 -151 17 -118 -175 77 3 45 131 -105 -27 46 127 203 -10 -37 270
1570B70m61L48k50J51K6M9j98J46j4o5j51k0K04l9J09k22J95k31K18j88K23j87
$$ 270 -191 157 -93 58 84 133 -65 81 67 2 -149 -169 35 -4 105 -117 78 -153 65 -123 100 -87
1592h7J16M7m2j3j45N7K6o0J35L9j09l2j9N5O3P8J09m25J41J82k48J1L01L8l31
$$ -87 29 76 34 21 -124 -67 -41 -101 34 73 -36 -68 -87 -32 31 109 218 -207 -66 116 -132 -121 180 218 -113
1617a13j08K2J84K6N9n5J44Kj38r3j9O5m5M6o6J06J93k68J00k9J27k0k01Q6K18
$$ -113 -221 -199 -15 11 70 15 159 161 23 -70 -89 -24 -69 -23 -89 17 210 -58 42 13 140 120 -81 5 223
1642B23l40K06k66J66j52J33j44K7L02j76M1j64K05Oj65m8K11k65K35N0j16J39
$$ 223 -117 89 -177 -11 -163 -30 -174 -147 155 -21 20 -144 61 67 -98 -146 65 -200 35 85 -31 108
1664A08j61N9l9J68j17l3P9J26Nk95J53k38J82l3R0l97L01J35Ml10M30k78J87
$$ 108 -53 6 -33 135 18 -15 64 190 195 -100 53 -185 -3 -36 54 -343 -42 93 97 -213 217 -61 126
1687A26o8k09j20L48o7l5J5kP7j31K2P9J2J28J4l3Q5m08J42N4j05J57j84j1K47
$$ 126 58 -151 -271 77 10 -25 -10 -12 65 -66 -44 35 47 175 189 156 241 -167 -25 29 -76 81 -103 -114 133
1712A33j33k5j21K00L2j17R1j01m6k4n4J06L6P1J35k27R9J18k67r4P2p3J25L2
$$ 133 0 -25 -146 54 86 -31 60 -41 -87 -111 -165 -59 -23 48 183 -44 55 173 -94 -188 -116 -189 -64 -32
1736c2N9P2l6j19K01k83L8J85J39l60J63RL0k7j71K46m21K36n1K7L13K0k75N9
$$ -32 27 99 63 -56 145 -138 -100 85 224 -136 27 36 66 39 -132 114 -307 -71 -122 -95 218 238 -37 22
1760B2J7KK3j09k2J79J72l47J89m3l21K03j20J93P8j45l3K22j8k54j3K43k11Q1
$$ 22 39 41 64 -45 -67 112 284 -63 126 83 -238 -35 -155 38 116 -29 -62 160 142 -112 -125 118 -93 -12
1784a2j5q5l3J8L2O8Q5J0k93L85j82K0j57PJ58p8J55Jj6r8MQ4K12m67J08n0J46
$$ -12 -27 -112 -145 -127 -95 -27 58 68 -225 160 -22 -2 -159 -152 6 -72 83 84 68 -30 -26 58 270 -197 -89 -139 7
1811Gj5ro5M4m4P2p6N9r2J29k90L96mn7P7o0O7k00r4L21j13j21M6Q8q6R9j03l4
$$ 7 -8 -17 -82 -38 -82 -10 -86 -27 -119 10 -280 116 112 55 132 72 139 -61 -155 166 53 -68 -22 66 -20 79 -24 -58
1839e8Q9k20J77J29j37J61q2q9j13R9J41j94N2nJ11j42J79jN5k0j26p1MP5l9R2
$$ -58 31 -189 -12 117 -20 141 59 -30 -143 -44 97 -97 -45 -50 61 -81 98 97 152 132 6 -65 -61 14 -25 67
1865F7j24M0jj53M5J84l06K10p2J13Rk22J52L45k48R5k4l7k9K2j86j15M09p7J1
$$ 67 -57 -17 -18 -171 -126 58 -248 -38 -110 3 12 -210 -58 287 39 134 110 73 44 66 -120 -235 174 97 108
1890A08j49R5j95K76j55j41L04j61M7Q5j81K2J42j87q6K08J11k13N0o2J06l3j45
$$ 108 -41 54 -141 135 -20 -161 143 -18 29 114 -67 -45 97 -90 -176 32 143 -70 -20 -82 24 -9 -154
1913a54J96j94R0NM4J68l37K94K4l21R4J30m1K8m9L3R6j48J77m9j75N3k39l9M57
$$ -154 42 -152 -62 -57 -13 155 -182 112 136 -185 -91 39 -2 26 -23 10 106 -42 135 86 -89 -36 -275 -314 143
1938A43k98J31K42k17o7j3KL02j28k77J26L00m08J62J38k19J03l8O2o5M3M1q7
$$ 143 -155 -24 218 1 -66 -79 -77 225 97 -180 -54 246 -162 0 138 -81 22 -16 46 -19 24 65 -22
1961b2K0n6j84J78j32M7L04j38o0l0j68M08N8r6J2k65J99n0J58k37J08k05L35
$$ -22 -2 -58 -242 -64 -196 -149 155 17 -43 -73 -241 167 225 129 141 -124 75 25 183 -54 54 -151 184
1984A84j60j48J27J66j16n8M8Q0l0J06k01j32M4Q3k02j3L23l33J31J3J62p1m5
$$ 184 24 -124 3 169 53 -5 43 123 93 199 -2 -134 -90 -7 -209 -222 101 -232 -101 -88 74 3 -42
2007d2J29jj86K34j71Q7N7j22L62k41o2m1M6j16MJ2J14k07k27L36p8q0M02j06
$$ -42 87 86 -100 134 -37 50 107 -15 347 106 44 3 49 -67 -63 -51 63 -144 -371 -35 -113 -193 209 103
2031A03j98J66l8j17R7J12Qk57J29P7q8j0R4o8O9l3p0Q3j52K29j17q3K70k61K06
$$ 103 -95 71 33 -84 13 125 133 -124 5 82 -6 -16 78 10 79 46 -24 59 -93 136 19 -64 206 -55 151
2056A51j42j17n5J30j70J23P9p3J15k1N7q3j23N9p6K78o9QK6j04J39j35M9J2p7
$$ 151 9 -108 -163 -33 -203 -80 -1 -74 41 20 77 -6 -129 -70 -146 132 63 71 97 -7 132 -3 46 58 -19
2081a9M7p5qK30k43m9jJ69m1j17M0P6K4n4q6K01m12K09K1J80k55Q5j5K1K6n4P
$$ -19 28 -47 -55 175 -68 -117 -118 51 10 -107 -67 9 33 -21 -107 94 -318 -109 -88 92 -163 -78 -93 -72 -46 -100 -93
2108i3J63O5k23J9M8k15L06r4l4Rj0q3J00nQ5N8m9m5j46P3N7j55j7J58j89J9L21
$$ -93 70 135 -88 -69 -21 -236 70 -24 -58 -49 -59 -142 -42 -47 38 96 47 2 -144 -71 -14 -169 -186 -28 -217 -198 123
2135A23k84J50m4J01j57J26j2l3L3P7j23q2k8J77k2J01l18R5j2rJ57J4l2J63j98
$$ 123 -161 -11 -55 46 -111 15 3 -30 3 80 -43 -125 -153 24 2 103 -215 -120 -132 -141 16 30 -2 161 -37
2160c7J98m9o9K5j18p3J19n9R7P9l8j11Q1K8j82K4J12Ok6K39j46j27O8l3k00J35
$$ -37 161 112 43 68 -50 -123 -4 -63 34 113 75 -36 45 73 -109 -85 27 33 7 246 100 -27 41 8 -192 -57
2186e7m4n5K11NN0J4l9J3o5q9J62j18K9l6P9j8r5Q4l1p5M4k18J00K38j28Q9j31
$$ -57 -101 -156 55 60 110 124 85 98 33 -56 106 -12 17 -19 60 42 -53 31 0 -75 -31 -249 -149 89 -39 50 -81
2213h1J39j57J45r0P4m2M0ML3j42J23j32P7l2m1L53j69nj78J90j31J06j97J47
$$ -81 58 -99 46 -44 30 -12 28 32 65 -77 46 -86 -9 -41 -82 271 102 97 -81 109 -22 84 -113 34
2237C4l3j1J93k41J42j67J68M5j44M2J3j30L9N9M0p4L9r3J09L7m3J93k28l0m4
$$ 34 1 -10 183 -58 84 -83 85 130 -14 28 41 -89 -50 9 49 -25 14 -79 30 67 24 217 -11 -41 -85
2262h5J71J38l71N0P7J09k1O6j67p3J79j7L8p2m9L2p3n9J78m2P0j50J50j12J47
$$ -85 86 224 -147 -97 -20 89 68 134 -33 -106 73 56 94 22 -27 5 -68 -127 51 9 79 -71 79 -33 114
2287A14k89q8K53J24j19J27j71o9M05r0j29j71Q5k0N7j76K1J19r4J8N3K35j27
$$ 114 -175 -263 -10 114 -5 122 -49 -118 287 197 68 -103 -18 -38 19 -157 -136 -17 -111 -93 -40 195 68
2310F8j75J9K55r1j44o9n5J11J4j75K32M7M3nqj26K25k80r1L0K95k68J64k11L41
$$ 68 -107 -88 167 76 -68 -137 -192 -81 -67 -242 -10 37 80 75 67 -59 166 -114 -205 -175 120 -148 16 -195 146
2335A46l01Q8J16p1J14k24K21p0j89N4R6J37l0q9L3O4Q8k02n4J91k00p9j11J91
$$ 146 -155 -67 49 -22 92 -132 89 19 -170 -116 -20 117 87 -2 31 95 183 -19 -73 118 -82 -161 -272 -81
2359h1j7K57j57J23O1j31o9K2l8l49K61O1m1M12m80J83l6L7J1q4o5J84j58J75
$$ -81 -98 159 2 125 186 55 -14 8 -30 -379 -118 -57 -98 314 -166 17 -19 18 29 -55 -120 64 -94 81
2383H1l20M22j47j2j68Q4P4J8q5J87l43J27J19Q1k39K08j43K16N8l33J75N0j08
$$ 81 -239 183 36 24 -144 -60 14 32 -53 134 -209 -82 37 118 -121 87 -56 160 218 -115 60 110 2
2406BM5oj03k3J32j06k30J99M7P5P5j4j06J52j08o1K77k67r7J61J18j64j9j02
$$ 2 47 41 -62 -85 47 -59 -289 -90 -43 32 107 93 -13 139 31 -30 247 -20 -117 44 162 -2 -21 -123
2430a23J59K6j48J29k9Q2r2J2Oj7L9j7K10l50K16L0k2J56m12jj12M35j50j14J91
$$ -123 36 62 -86 43 14 96 4 16 22 5 44 27 237 -113 103 133 111 267 -145 -146 -258 177 27 -87 104
2455A04k88K64J30k03J95j78r7Q4R7j86J88j24J20j98k9J35q7J09N5j73J09N6
$$ 104 -184 80 210 7 202 24 -73 11 108 -78 110 -14 106 -92 -121 14 -73 36 91 -82 27 83
2477H3K8j37J0n8R4J57q7P1Rr8J7Q1j88J4j55P3j5J80j68J34K7kkq2J94k01J85
$$ 83 111 -26 -16 -74 20 177 90 161 170 72 89 170 -18 -4 -159 -86 -101 79 -89 45 72 70 68 -14 180 -21 164
2504A64m38K65n5J02k09J59k0q7kK27j18O4J11j77q1J41P8k77R2oJ34q3K8K0N
$$ 164 -274 -9 -64 38 -171 -12 -32 -119 -121 106 -12 52 163 -14 -95 46 124 -153 -61 -67 67 -16 12 32 37
2529C7k36K37q1j9n9J01Q8p2J31p7no5j4K26rp2J3k23o8J89n6J33k89P6J16M6
$$ 37 -199 38 -43 -62 -121 -20 68 -4 127 50 45 -20 -34 192 183 111 124 -99 -167 22 -34 99 -190 -114 2 48
2555D8r5j39m3J17J42k5j00K13J58l83K76l67P7J12N9o5K6M3j30K49k34n9m1O3
$$ 48 -47 -186 -229 -112 30 5 -95 118 276 -107 169 -198 -121 -9 50 -15 11 54 -76 173 -61 -120 -161 -98
2579i8O2k63K27M6K31m17K27o1rO5Ko7J57j54n0L4L49j17l7r8j32J25j4m0J00
$$ -98 -36 -299 -72 -26 205 -212 15 -46 -55 10 12 -55 102 -52 -102 -68 281 164 127 29 -103 22 8 -32 68
2604F8n3k5J62j71J93N4l84J50j32O9K16j51J57k48J87k1j73J53m8j76K02M4M3
$$ 68 15 -10 152 -19 174 228 -156 -6 -138 -69 147 -4 153 -95 92 71 -102 51 3 -173 29 73 116
2627A16J15k44J97k50J63j20J5Om6j59K51j4jM8P1p3k53K64j30J3j9lO4j00R5
$$ 116 231 -13 184 -66 97 -23 -8 -2 -48 -207 44 30 29 77 148 75 -178 86 -44 -31 -50 -53 11 -89 6
2652Fj65K98j97J30k62L11j71L7J6j27k1K29j13J07r1j22K13r0N0j69R5o2l6K10
$$ 6 -159 139 -58 72 -190 121 -50 -13 3 -124 -145 84 -29 78 -13 -135 78 -12 38 -131 -36 -98 -134 76
2676G6Q2j91Q0R0r1j19J46j71K48j49J50j12j4j14J15j12Q6P1M0K7k41J79L7n7
$$ 76 158 -33 47 137 46 -73 73 -98 150 1 151 39 25 -89 26 -86 0 71 111 138 -103 76 113 56
2700E6j80MK56j73qJ6mpK02r9O7Q8j23r5K0l8p4J37j71n9j9J77J36j58j31J09
$$ 56 -124 -120 136 -37 -45 -29 -33 -40 162 63 130 218 95 0 20 -18 -92 45 -126 -185 -204 -27 109 -49 -180 -71
2726g1r1K47j87K78k58K07rj56n1K16j11kl1Rk0q4K3Q0J16m8j09J49k39J44j29
$$ -71 -162 85 -102 176 -82 125 116 -40 -91 125 14 12 -19 -10 -30 -114 -91 -11 105 57 -52 97 -142 2 -127
2751a27J58Q3J2k49J21j51J72j1N4O9M4j79J44l61L20j32N6K4k96J99j25K37N4
$$ -127 31 114 126 -123 -2 -153 19 8 62 131 175 -4 140 -221 99 -33 23 47 -249 -50 -175 62 116
2774A16k30K6L34k87P6J50M3l5k18j52L26k42L2J13O5k22Q5R6j84J32n7R4M2r9
$$ 116 -114 -88 246 -41 35 185 228 193 -25 -177 149 -93 -61 52 117 -105 -20 76 -108 24 -33 61 103 4
2798Dp3J01L2K4j39J09J17p5K3k8J8p1N3l2k6j57J16L7J95j08m74L23R0J6n9j69
$$ 4 -69 32 64 88 -51 58 175 100 123 95 113 42 95 63 37 -120 -4 33 228 120 -354 -31 59 75 16 -153
2824a53P7K47k54J18l8j22J77N1j07K11j38j34N8l4J06j09J67j03j46k2J14k64
$$ -153 -76 171 -83 35 -3 -125 52 103 -4 207 69 -65 -7 -41 65 -44 123 20 -126 -148 -34 -298
2846b98M2L47k2j73J58R0k65J58J0J0j48m4j8K26M6m9l4M9q6j00O7J64j54J83
$$ -298 -256 91 69 -104 54 144 -121 37 47 57 -91 -135 -153 73 119 70 36 85 -1 -101 -34 130 -24 159
2870A59j37l8PoJ95j25j37J97j68j30L62p5k04J88J28j90L0k43K79j88O9Q2j32
$$ 159 22 -16 -9 -15 180 55 -82 115 -53 -183 179 104 -100 88 216 26 56 -187 92 -96 -27 55 -77
2893g7J24m8q3J73Ok0q0k0O7o0j13J47Q3j28k6J95j05j88J79J04j15L7j2J6p0
$$ -77 47 -1 -84 89 95 75 -5 -25 42 -18 -131 16 99 -29 -55 140 35 -153 26 130 15 52 40 56 -14
2918a4o6J28p2L0k55K41p9R6k7j75K03J9r2K3K9J99k99Q9j3j40K88j94p3L1Q3
$$ -14 -80 48 -24 6 -249 -8 -87 9 -18 -193 10 29 -63 -40 -11 188 -111 -22 -35 -175 113 -81 -154 -123 -40
2943d0J35k37K20L2k28k6K92N4P2j03J7k27J86j03l02J22K77m8p9JQ9l75K61R
$$ -40 95 -142 78 110 -118 -144 148 202 274 171 188 -39 147 44 -258 -136 141 93 14 15 104 -271 -10 -1
2967aP7m7r4J98M8j87j28J3K01j54J19j67L33k20M8M8k34J11J29Nm3L8p6M3j41
$$ -1 76 29 -65 133 181 -6 -134 -121 80 -74 45 -122 211 -9 39 87 -147 -36 93 98 55 93 17 60 -81
2992h1J74rj66K5n5J19j25o8K25n3m3R3Jr5J03N2J03j00Kk16K02O2k03O8n4l2
$$ -81 93 84 -82 -57 -112 7 -118 -186 39 -14 -57 36 37 -58 45 97 200 100 102 -114 88 150 -53 15 -39 -71
3018g1J23J17k73M5j11J18J57l03P5M21m37mM1J49J58k62Q5k38L36j26k14K46
$$ -71 52 169 -104 -59 -170 -52 105 -198 -123 298 -139 -143 -102 47 205 -57 28 -210 126 0 -214 32
3040C2n3J07p0J36j88M7R8j05J39j57l1J42nl8k11J32K0J76m4j99J92j73O0Q1
$$ 32 -21 86 16 152 -36 11 109 4 143 -14 -45 97 92 54 -157 -25 -5 171 127 -72 120 -53 7 88
3064H8k0j54K55k67%K14p6j08q4K14k8k9J74j51P9j28q0r6J83J20k45Q1J07Q9
$$ 88 68 -86 169 -98 -98 116 40 -68 -152 62 34 5 179 28 107 -21 -101 -197 -14 106 -139 -58 49 138
3088A38k59K22k05J38o2p0J59r4J43q0K7r2NL2J29j02j70rO0o4J19K7Oj60K05
$$ 138 -121 101 -104 34 -28 -98 61 -33 110 30 57 -35 -30 2 131 29 -141 -150 -90 -154 -35 -8 -2 -162 43
3113D3k39O8l0ln1K23L3k2Q3Q0k66K5O2Q4oj32L9j63J55L93k37j66L5K05j82j
$$ 43 -196 -128 -158 -161 -212 11 44 22 105 185 -81 -56 6 90 84 -48 -9 -172 -17 376 139 -27 8 213 31 30
3139C0j51Q2K62k93J95j74O6P0k46O0N1J01lk00l2K73R7j08j59k76L72J10k31
$$ 30 -121 -39 223 -70 125 -49 17 87 -159 -99 -48 53 50 -150 -182 91 188 80 -79 -355 17 127 -104
3162a04K14j80o9J23j99QL56j28P8M5j96K8m3P0j17k3L03k39P1J12q2k55L00j66
$$ -104 110 -70 -139 -16 -215 -207 149 21 99 144 -52 -24 -67 3 -114 -137 166 -73 -2 110 28 -227 73 -93
3186i3L07k73O6l2O0p2J72q7p4J01j50O5o7q5J99L8j48J52j29Q5J11j83P2K2p8
$$ -93 214 -59 7 -25 35 -37 135 48 -26 75 -75 -10 -77 -162 37 75 -73 79 -50 35 146 -37 35 57 -21
3211b1J10k27M0J87k03O9mQ3k41J15K4M4nK15j94J83k87Q7Q1mo9J17o4J45j81
$$ -21 89 -138 -98 89 -114 -45 -49 34 -207 -92 -68 -24 -29 186 -8 175 -112 -25 56 52 -17 100 36 181 0
3236@O6p0q9Q3J30k04L7j2J65j5Q2k42R5p0Mmp6K39l32K38Lnj23K63l08J99k57
$$ 0 66 -4 -93 -10 120 -84 -47 -59 106 91 173 -69 26 -44 -40 -44 -120 119 -213 25 28 23 -100 163 -145 54 -203
3263b03OL76j58k07L3N9n6R7rJ07j16K67k73R0j56N8J31j28K81l41J96j63J40
$$ -203 -197 179 21 -186 -153 -94 -150 -53 -62 45 -71 196 -77 13 -143 -85 46 -82 199 -142 54 -109 31
3286C1o0j18J40j40K69j01j20j03J62N7P3J41j31j75J54j81L7N6j73J17j20K13
$$ 31 -29 -147 -7 -147 122 21 -99 -202 -40 17 90 231 100 -75 79 -102 -65 -9 -182 -65 -185 28
3308B8mk4J63pk09P6j86J26m6K5J48k02J44l3lK56j23j9q6q5J8O6O5O8o9k0nr9
$$ 28 24 0 163 156 -53 23 -163 -37 -83 -58 90 -112 32 -1 -4 252 129 110 24 -61 -43 23 88 156 87 67 62 -37
3336c7J69mk04K54p4n0n5k9J05j03J71nLj94oN0KJ61P3l28j45J24q4L40J6j26
$$ -37 132 128 -76 178 104 54 -1 -30 75 -28 143 138 141 -53 -59 -9 -7 154 227 -101 -246 -122 -206 134 150 24
3362B4K15o2j68k4o3L6J9J50j00j15J60k8%j22Q0k9J45o5j51J40o5P1P8o5j59
$$ 24 239 177 9 -15 -78 -42 -23 127 27 -88 72 44 44 -78 2 -27 118 53 -98 42 -23 48 126 61 -98
3387i8j03M34j2k58J47L8j26L2N4j98J05Q9j11o4J43k2l2j73J63R9K8k8m5q4J01
$$ -98 -201 233 221 -37 110 148 22 54 108 -90 15 104 -7 -71 72 50 18 -155 8 107 135 107 62 -22 79
3412G9LM3l54J17P9o7J44j48K46j29j10Q0n5K0p0K30j62L8N1J29j22j47J91L1
$$ 79 82 125 -229 -112 -33 -100 44 -104 142 13 -97 -17 -72 -52 -122 108 -54 -16 35 164 42 -105 86 117
3436A17j94J14J44k62J03k84L13o2p8j36K02P7j58J86j16l1J00J20k19J85k15
$$ 117 -77 37 181 -81 22 -262 51 -11 -89 -225 -23 54 -104 82 -34 -65 35 155 -64 121 -94
3457i4l6N6R9k18L39o3pJ04k39J5K0m9J34Q6k05OJ41R0j62n4O5kK2L9k05M7K41
$$ -94 -130 -74 25 -193 146 83 76 180 -59 -44 -24 -73 61 147 -58 -52 89 179 17 -37 28 26 48 87 -118 -71 170
3484A70k73oj15K78l5m1nr9J82j8o7o8Q2J6k1Q0j67L8l4R3j94L18k33n9L22j52
$$ 170 -103 -109 -224 54 19 -22 -27 -126 56 38 -29 -97 -15 1 -20 60 -107 -69 -103 -10 -204 114 -119 -178 144 -8
3510hN2k38K04j70J21Q8j54J05P1j86L22r8j38L7j26J12Rq7mM3J21j28j89J72
$$ -8 44 -194 10 -160 -39 49 -105 0 71 -115 207 109 -29 8 -118 -6 3 -84 -88 -45 76 -52 -241 -69
3534f9J01N9k7L8R8j78M6j7k7J15k3p5j19J64j61K49m25K51Lk22M03n8J2k49L8
$$ -69 32 91 64 102 200 22 68 51 24 139 116 41 -78 86 -75 174 -251 0 3 -219 184 126 138 -111 -73
3559g3J7K8J52N7r1J75j71k54J44k3J03j07P0k30K89N2J4%k07j60L43k16k8J7
$$ -73 -56 -28 124 181 90 265 94 -160 -16 -39 64 -43 27 -203 86 138 152 152 -55 -215 128 -88 -116 -99
3583i9K94j63O0L3p0p1J04P0p3j57j49J8N5J3O9j2j62L30r1L6m0q5j19K69k28
$$ -99 195 32 92 125 55 -16 88 158 85 -72 -221 -203 -148 -135 -66 -78 -240 90 -1 35 -5 -90 -209 60 -168
3608a68J54q4Q2J3M5j24J85k06m4J50M8m6j09J55J93j97J4Oj92J40k20L39l22
$$ -168 -14 -98 -16 -3 42 -82 103 -103 -147 3 51 5 -104 51 244 47 61 67 -125 15 -205 134 -188
3631a88J65J43j66L6O5q8q2l7J21j5L3K24k55L8j03K81k86%K00P9k54J26J2k59
$$ -188 -23 120 -46 -10 55 -33 -115 -152 -31 -46 -13 211 -44 -6 -109 172 -114 -114 86 165 -89 37 49 -210
3655b10K54k03K80M4l54K82j2o2r3R0l6Lr5P0K8K31l60M27j18j68k22J28K19j93
$$ -210 44 -159 121 165 -189 93 81 19 -74 16 -20 -17 -112 -42 -14 217 -143 284 166 -2 -224 -96 123 -70
3679g0L07l00J34j97J44m4r2K1J12r9K12p0K1m7L8K6o5j53J65p7o0J63k21L73
$$ -70 237 -63 71 -126 18 -26 -118 -97 15 -84 128 58 79 32 70 96 31 -122 43 -34 -94 69 -152 221
3703B21k78%K3k4l5R9K10l48Q9Q8Qj17K15l54J60K9N0n1MO2K64j86j99l4K1K02
$$ 221 -57 -57 -34 -58 -93 6 216 -132 -43 45 53 -64 151 -203 -43 -14 36 -15 -11 51 315 129 -70 -104 -83 119
3729A19l8j52J27l1j50J36r4N3o6L54k34l0O4Q8p7j29R0R0j84P3j00L7j8q8K05
$$ 119 81 -71 56 25 -125 11 -83 -30 -96 258 24 -6 58 146 69 -60 30 120 -64 9 -91 -54 -72 -160 45
3754D5q3m8N2J15k2k1n0k0qm9l4L10j89J19J6j43J9m9Q7l9R1j09r5K1K75j27r7
$$ 45 -38 -86 -34 81 59 38 -12 -32 -40 -89 -123 187 -2 117 133 -10 9 -40 47 8 99 -10 -105 -84 191 64 -33
3781c3J15l6j95J89j3j49Q9J66j66j3J3M9j08J64j78K5J09o7J10j8J1q8P3j99
$$ -33 82 46 -149 40 27 -122 -33 133 -33 -46 -33 16 -92 72 -106 -81 28 -39 71 53 64 -24 49 -150
3805a50K88j35R3k00J89j33j22K37j90K71m00P1K54p3l39L44P0k2r4j18L67J1
$$ -150 138 3 96 -104 85 -48 -170 67 -123 148 -252 -181 73 0 -339 5 75 53 -41 -159 208 219
3827B19j20k62r8M92k94RK8Q6j37J25qj70K30L8j38N6j97K87o1j31P8j00n8P0
$$ 219 99 -163 -261 231 -63 -54 -26 60 -77 48 40 -130 100 138 0 56 -141 146 85 -46 32 -68 -126 -56
3851e6L0N9J4k8J23j64k43L47m6J5L3mn4j05L9J99j11P8j11r1J52Kmk36K16j29
$$ -56 -26 33 47 19 142 -22 -265 82 36 51 84 80 26 -79 -40 159 48 126 15 -76 76 78 74 -162 54 -75
3877g5R3j38L03j11p8lm9rQ7J12k05J17L09l86j03J38k23R0N35n63J90j12N9j58
$$ -75 18 -120 183 72 -6 -9 -58 -67 20 132 -73 44 353 -33 -136 2 -221 -131 404 -159 31 -81 -22 -180
3901a80O1O1L0n4J81r4J77r5q7m0J71K5k19J04j37O9o5J48J15k43N6K02l43K62
$$ -180 -119 -58 -28 -82 99 5 182 87 0 -40 131 156 -63 41 -96 -27 -92 56 171 -72 -16 186 -157 105
3925A05J48k20J83j74k0LP6k89K45j28n2N5o5J58o0J4m0K37l09O7LP6p9o4K14
$$ 105 253 33 216 42 22 25 101 -188 57 -71 -123 -68 -133 25 -35 -21 -61 176 -133 -66 -63 13 -66 -130 84
3950H4j79K39p3M9m09L09m1k2O2J61k97j7J2n9J29OJ26k62K3J44J01K3j85LJ6
$$ 84 -95 144 71 120 -289 20 -21 -43 19 180 -117 -134 -122 -181 -52 -46 80 -182 -159 -15 86 109 -76 -73 -57
3975e7Q1n8K04j68P8j36J07p5NJ9m8N0k1R6m2mj76K51j1j45Q3K1q3P1o7lR1p8
$$ -57 24 -34 170 2 80 -56 51 -24 -19 0 -48 2 -19 77 35 31 -145 106 95 -50 33 54 -29 42 -25 -28 63 -15
4003a5r8L2m2J71j96K37L3q3k5l0N1L2k3QQ4j48Q3l5k8K7Q5j77J04j11J53k2j16
$$ -15 -113 -81 -123 48 -148 89 122 39 14 -16 35 67 44 52 136 -12 71 36 8 35 120 -57 47 -64 89 67 -49
4030d9J1k0j64J39rQ5j5R7j95O8J04m6n2p8K11j66j76J82J89j65J36n4n6j7M6
$$ -49 -38 -58 -222 -83 -92 -7 -22 75 -120 -52 52 6 -46 -124 87 -79 -255 -73 116 -49 87 33 -23 -40 6
4055FQ9o0R4j52K5r6K16k68P9L7n0k5p8J18l4R6J25o8O4j02n6J06J58k03J67j49
$$ 6 95 35 129 -23 2 -94 122 -146 -67 -30 -80 -105 -183 -65 -99 -3 122 54 118 16 -40 66 224 21 188 39
4081C9j57J54q0m0Q0p1K56j32j62j35L01n3J74q8K2k07l9J40P6Q9k89J35j90j
$$ 39 -118 36 -44 -84 -4 -75 181 49 -113 -248 53 0 174 86 108 -99 -138 2 78 167 -122 13 -177 -178
4105a78K22K28l44M5O2m6Nj74J75K4l4q9o3J57j27J3J97k4J70k81J18r4q1j12
$$ -178 44 272 -72 -27 35 -11 -6 -180 -5 19 -15 -104 -167 -10 -137 -124 73 49 219 -62 56 -38 -119 -231
4129b31J8K60q8M2n5J35j0n9Mj11J74N0l25L06j93J9J8R4j13j7J8K07j20k63J89
$$ -231 -213 47 -41 1 -54 81 71 12 16 -95 79 129 -196 110 -83 -64 -46 48 -65 -82 -64 143 23 -240 -51
4154e1J37m3j38PR8k64J46l7Q2J11q3n6k2J59J90l31K2L6J21j54O9K4j05k9J11
$$ -51 86 43 -95 -88 10 -254 -108 -145 -63 48 -35 -91 -113 46 236 -95 -73 -37 84 -70 -1 23 -82 -111 0
4179@R5k77K28l6o3Q5k40M5K51q1J34oj93l3J98o3Q2r1k02O7q9K63n6m2n2P9j21
$$ 0 95 -182 46 10 -53 32 -208 -163 88 7 141 135 -58 -91 107 44 126 35 -167 -100 -189 74 18 -24 -76 3 -118
4206a18J36Q2k43J76l2n8J93j7J3q7j9j23M8J64l09K2K91M3j27k37J95Q7qK9k75
$$ -118 18 100 -143 33 1 -57 136 119 132 45 26 -97 -49 115 -194 -172 119 162 35 -202 -7 80 72 101 -174
4231a74L3J55J75k38m9R8K35m02J84r2M1j82J93n0k3K98m39L69L9j14j17l7j7
$$ -174 -141 14 189 -49 -98 0 235 -167 17 -75 -34 -216 -23 -73 -96 202 -237 132 171 57 -60 -97 -114
4254a14K05r6P0j4J4p2Q6J24k70l7k3K2J46j11J81j73On9J78L1L2j76J85k02N
$$ -114 91 -5 65 51 65 -7 79 203 -67 -104 -127 -105 41 -70 111 -62 -56 -115 63 94 126 -50 135 -67 -62
4279f2K3j57N77m40o6QJ49Qk49J17jN5o3Q2R3l8j17J18J4J41r7k67L9K12om7J16
$$ -62 -39 -196 381 -59 -125 -117 32 40 -209 -92 -93 -38 -101 -19 74 36 -81 37 51 192 95 -172 -133 79 73 26 142
4306A42k22J27k04L28q3l37J73P1K4k60K31K7p3p5p3Q4K03j29n8Q6qj34J07Q0
$$ 142 -80 47 -157 171 88 -249 -76 -5 19 -241 -10 17 -56 -131 -204 -120 83 -46 -104 -18 -26 -160 -53 27
4330B7j35J25J23Rj51r5J25k09K92l37R1J73r1l5J92R6k05J51k18J93j11r1K39
$$ 27 -108 17 140 149 -2 -97 28 -181 111 -226 -135 38 -53 -88 104 200 -5 146 -72 121 10 -81 158
4353A58p7j01K04o5j25m0J34p2K6KJ34k86J34j28J00J25M8k30K03j81n3p0L33
$$ 158 81 -20 184 119 -6 -46 88 16 42 44 178 -108 26 -102 -2 123 171 -59 144 -37 -90 -160 173
4376A73m04K21J79r9j39J22k91K28J13j11J2P5k0j72J42m7k3K27k57J52j57J32
$$ 173 -231 -10 169 70 -69 53 -238 -10 103 -8 4 79 59 -113 29 -18 -41 186 -71 81 -76 56
4398E6p0j14J88m9N7oO4j72J77k00J16k55K57j76M68k84Qq8J50k20J68l3j42J11
$$ 56 -14 -128 60 11 68 62 126 -46 131 -69 47 -208 49 -127 341 57 65 -23 127 -93 75 42 -100 11
4422A1l2J46l29J69J14j61J04j9j43K66m6n9m3J31j94J82j26L1k7Q6m01N11j81
$$ 11 -21 125 -204 -35 79 -82 22 3 -140 126 80 21 -22 109 -85 97 -29 2 -25 61 -340 171 -10
4445a0r1Q7rp2K52j81K45k02Q3j07LJ90m2j7l59K68o8J58j13o1R9k06J8L11k50
$$ -10 -101 -14 -23 -95 157 -24 221 19 102 -5 -2 188 146 129 -230 38 -30 128 15 -46 53 -153 -135 176 -74
4470g4K6J2K46j13k07j12J26J62J9j12j06J20J37j90J03k09L81p7j60jO7J08k85
$$ -74 -48 -36 210 97 -110 -222 -96 66 85 -27 -133 -13 124 -66 37 -172 209 132 -28 -29 38 146 -139
4493a39K21j97O5J41j26P6J58l36K17k83J90M3n4J52k3N4k20J91k18J81k02K61
$$ -139 82 -115 -50 91 -35 41 199 -137 80 -203 -13 30 -24 128 105 159 -61 130 -88 93 -109 152
4515A52K4k13K48l02J15j21N6J77k21J06l7K1m2L19l18n4K2JL9j60K54j29l4K02
$$ 152 176 -37 211 -91 24 -97 -41 136 -85 21 -16 5 -37 282 -36 -90 -68 -67 -28 -188 66 -63 -97 105
4539A05j23K51l23j0R7R5K1o6k16J35K24q1j28K4R3r2j2r4m4K11o3M2K5l57K76
$$ 105 -18 233 -90 -100 -3 92 113 47 -169 -34 190 109 -19 5 98 6 -6 -100 -144 67 4 46 71 -286 -10
4564a0J0R4J6p0L3j0m0j7q5m4J27k1R2j16j39J79J2n5L21k84j80M5J97k9J5j06
$$ -10 0 94 110 40 73 63 23 6 -79 -123 4 -17 75 -41 -180 -1 11 -44 277 -7 -187 -142 55 26 41 -65
4590f5K01N7k30J35m7j43n0K05m0k34J00K63j29J59k35Q3l2O4j9N3k19K71k23
$$ -65 136 193 -37 98 51 -92 -142 63 23 -211 -111 152 23 182 -53 30 -2 62 43 96 -123 148 -75
4613g5J9J77j50Nk23K07Q1O6j74RJ0m9K27j50LK19j63p1M4qo9R9j10j6R3k29M23
$$ -75 -56 121 -29 -24 -247 -40 41 107 -67 -58 -48 -97 130 -20 -17 202 39 -32 12 4 -65 34 -76 -92 1 -228 195
4640A95n2J30l15pN6Jk5K1j37J40rn2m2O2q4J20k6q5K85o8p6pj4o8k41K10J64
$$ 195 143 273 -42 -49 7 8 -17 4 -133 7 -2 -54 -96 -34 -118 2 -24 -109 176 108 32 25 11 -57 -298 -88 76
4667G6j89K27l3j01Mm5o6J52mn8Q1M3k57L57j37q5L38l55l9J33k09K08j06J27
$$ 76 -113 114 81 -20 -16 -61 -127 25 21 -37 44 87 -170 187 50 -35 303 -52 -91 42 -167 41 -65 62
4691F2q0n5J9J5P8K4Mj22O9J91O2l12J06o1J20k30M2J86r3m7N6j58n1N7K06j49
$$ 62 -18 -73 -54 -39 39 63 67 -55 14 205 267 -45 61 0 120 -110 -68 118 25 -22 34 -124 -175 -118 88 -61
4717f1m00M72P7J18k13q8K69q1j97J57p4k3o2J23J57k67J38J13l9k46J44j12R
$$ -61 -461 11 88 206 -7 -95 174 93 -104 53 -21 -44 -106 17 174 -93 45 158 119 -127 17 -95 -86
4740h6K82r9j9l02L39j63J62jJ6j47K92k49k36J52j17K04q4J20j1j30N5o1O4L5
$$ -86 196 97 78 -224 115 -48 114 113 129 -18 274 25 -211 -59 -176 28 -56 64 53 -77 -22 -83 -19 16
4764A6p7pQ8n7J89p3lM0j99j8Mn4J2k6K97k02j4J45jk0j77J97j31K6K19j42j1
$$ 16 -61 -68 20 -37 152 79 76 116 -83 -101 -97 -151 -139 -165 132 -70 -84 61 60 40 -137 60 -71 -45 174 32 21
4791B1J14m59K57J62l51J93O9P1m7j51R2l5o4K22k11o9N6R0N3q6J11j27j11N5
$$ 21 135 -324 -67 95 -256 -63 6 77 30 -121 -29 -64 -128 94 -117 -186 -130 -40 13 -73 38 -89 -200 -145
4815a45J67n8k4Q7q8oO5m6O3j54M7J11r4K20k09pJ11k72K31K3n8j27K13K7M7j04
$$ -145 22 -36 -60 27 -61 -67 -2 -48 15 -139 -92 19 -75 145 -64 -71 40 -232 -1 22 -36 -163 50 77 124 20
4841B0J19j41J55k8j34o0Q8k67K27j21J39m7j80K70j78K04r3j80J23N0J52k05
$$ 20 139 -2 153 125 -9 -69 19 -248 -21 -142 -3 -50 -230 40 -138 66 -27 -207 -84 -34 118 -87
$$ [...]
8191b11
##END NTUPLES=NMR FID
##END=
