##TITLE=1H_Pr 2953
 CDCl3
 8 sc, 
 9.2.2023
##JCAMPDX= 6.0         $$ Bruker NMR JCAMP-DX V2.0
##DATA TYPE= NMR FID
##DATA CLASS= NTUPLES
##ORIGIN= UXNMR, Bruker Analytische Messtechnik GmbH
##OWNER= root
$$ XWIN-NMR		Version 3.5
$$ Thu Feb  9 17:17:58 2023 Russian Standard Time (UT+4h)  she@DPX200
##.OBSERVE FREQUENCY= 200.13135
##.OBSERVE NUCLEUS= ^1H
##.DELAY= (6, 6)
##.ACQUISITION MODE= SIMULTANEOUS
##.ACQUISITION SCHEME= undefined
##.AVERAGES= 8
##.DIGITISER RES= 18
##SPECTROMETER/DATA SYSTEM= spect
##.PULSE SEQUENCE= zg30
##.SOLVENT NAME= DMSO
##.SHIFT REFERENCE= (INTERNAL, DMSO, 0, 15.7039)
##AUDIT TRAIL= $$ (NUMBER, WHEN, WHO, WHERE, WHAT)
$$ ##TITLE= Audit trail, XWIN-NMR		Version 3.5
$$ ##JCAMPDX= 5.01
$$ ##ORIGIN= Bruker BioSpin GmbH
$$ ##OWNER= she
$$ F:/spectra/data/she/nmr/H-F/1/audita.txt
$$ ##AUDIT TRAIL=  $$ (NUMBER, WHEN, WHO, WHERE, WHAT)
(   1,<2023-02-09 17:17:06.10 +0400>,<she>,<DPX200>,
      <created by zg, POWCHK disabled, PULCHK disabled
       configuration hash MD5:
       00 E9 B6 7A A2 85 ED C7 34 08 36 98 17 FE 4E 26
       data hash MD5: 16K
       9C 7C 22 52 7A 37 73 B6 2B 41 C2 9B E5 47 2E 10>)
$$ ##END=
$$ 
$$ hash MD5
$$ C3 73 70 1C B6 5D F2 DF 8C 1F 02 F1 29 BC 48 7D
##$RELAX= 
##$RELAX= 
##$RELAX= 
##$RELAX= 
##$RELAX= 
##$RELAX= 
$$ Bruker specific parameters
$$ --------------------------
##$DU= <F:/spectra>
##$EXPNO= 1
##$NAME= <H-F>
##$PROCNO= 1
##$TYPE= <nmr>
##$USER= <she>
##$AMP= (0..31)
100 100 100 100 100 100 100 100 100 100 100 100 100 100 100 100 100 100 
100 100 100 100 100 100 100 100 100 100 100 100 100 100 
##$AQSEQ= 0
##$AQ_mod= 1
##$AUNM= <au_zg>
##$AUTOPOS= <>
##$BF1= 200.13
##$BF2= 200.13
##$BF3= 200.13
##$BF4= 200.13
##$BF5= 200.13
##$BF6= 200.13
##$BF7= 200.13
##$BF8= 200.13
##$BYTORDA= 1
##$CFDGTYP= 0
##$CFRGTYP= 5
##$CHEMSTR= <none>
##$CNST= (0..31)
1 1 145 1 1 1 1 1 1 1 1 1 1 1 1 1 1 1 1 1 1 1 1 1 1 1 1 1 1 1 1 1 
##$CPDPRG= <>
##$CPDPRG1= <>
##$CPDPRG2= <>
##$CPDPRG3= <>
##$CPDPRG4= <mlev>
##$CPDPRG5= <mlev>
##$CPDPRG6= <mlev>
##$CPDPRG7= <mlev>
##$CPDPRG8= <mlev>
##$CPDPRGB= <>
##$CPDPRGT= <>
##$D= (0..31)
0 1.2 0 0 0 0 0 0 0 0.06 0 0.03 0 0 0 0 0.0002 0 0 0 0 0 0 0 0 0 0 0 0 
0 0 0 
##$DATE= 1675948625
##$DBL= (0..7)
120 120 120 120 120 120 120 120 
##$DBP= (0..7)
150 150 150 150 150 150 150 150 
##$DBP07= 0
##$DBPNAM0= <>
##$DBPNAM1= <>
##$DBPNAM2= <>
##$DBPNAM3= <>
##$DBPNAM4= <>
##$DBPNAM5= <>
##$DBPNAM6= <>
##$DBPNAM7= <>
##$DBPOAL= (0..7)
0.5 0.5 0.5 0.5 0.5 0.5 0.5 0.5 
##$DBPOFFS= (0..7)
0 0 0 0 0 0 0 0 
##$DE= 6
##$DECBNUC= <off>
##$DECIM= 32
##$DECNUC= <off>
##$DECSTAT= 4
##$DIGMOD= 1
##$DIGTYP= 9
##$DL= (0..7)
0 120 120 120 120 120 120 120 
##$DP= (0..7)
150 150 150 150 150 150 150 150 
##$DP07= 0
##$DPNAME0= <>
##$DPNAME1= <>
##$DPNAME2= <>
##$DPNAME3= <>
##$DPNAME4= <>
##$DPNAME5= <>
##$DPNAME6= <>
##$DPNAME7= <>
##$DPOAL= (0..7)
0.5 0.5 0.5 0.5 0.5 0.5 0.5 0.5 
##$DPOFFS= (0..7)
0 0 0 0 0 0 0 0 
##$DQDMODE= 0
##$DR= 18
##$DS= 0
##$DSLIST= <SSSSSSSSSSSSSSS>
$$ [...]
##$SUBNAM2= <"">
##$SUBNAM3= <"">
##$SUBNAM4= <"">
##$SUBNAM5= <"">
##$SUBNAM6= <"">
##$SUBNAM7= <"">
##$SUBNAM8= <"">
##$SUBNAM9= <"">
##$SW= 18.05172834244
##$SWIBOX= (0..15)
0 0 2 0 0 0 0 0 0 0 0 0 0 0 0 0 
##$SW_h= 3612.71676300578
##$TD= 16384
##$TD0= 1
##$TE= 0
##$TE2= 300
##$TE3= 300
##$TEG= 300
##$TL= (0..7)
0 120 120 120 120 120 120 120 
##$TP= (0..7)
150 150 150 150 150 150 150 150 
##$TP07= 0
##$TPNAME0= <>
##$TPNAME1= <>
##$TPNAME2= <>
##$TPNAME3= <>
##$TPNAME4= <>
##$TPNAME5= <>
##$TPNAME6= <>
##$TPNAME7= <>
##$TPOAL= (0..7)
0.5 0.5 0.5 0.5 0.5 0.5 0.5 0.5 
##$TPOFFS= (0..7)
0 0 0 0 0 0 0 0 
##$TUNHIN= 0
##$TUNHOUT= 0
##$TUNXOUT= 0
##$USERA1= <user>
##$USERA2= <user>
##$USERA3= <user>
##$USERA4= <user>
##$USERA5= <user>
##$V9= 5
##$VALIST= <valist>
##$VCLIST= <CCCCCCCCCCCCCCC>
##$VD= 0
##$VDLIST= <DDDDDDDDDDDDDDD>
##$VPLIST= <PPPPPPPPPPPPPPP>
##$VTLIST= <TTTTTTTTTTTTTTT>
##$WBST= 1024
##$WBSW= 4
##$XGAIN= (0..3)
0 0 0 0 
##$XL= 0
##$YL= 0
##$YMAX_a= 87497
##$YMIN_a= -80611
##$ZGOPTNS= <>
##$ZL1= 120
##$ZL2= 120
##$ZL3= 120
##$ZL4= 120
##$ABSF1= 10
##$ABSF2= 0
##$ABSG= 5
##$ABSL= 3
##$ALPHA= 0
##$AQORDER= 0
##$ASSFAC= 0
##$ASSFACI= 0
##$ASSFACX= 0
##$ASSWID= 0
##$AUNMP= <proc_1d>
##$AZFE= 0.1
##$AZFW= 0.1
##$BCFW= 1
##$BC_mod= 2
##$BYTORDP= 1
##$COROFFS= 0
##$CY= 11.3945322036743
##$DATMOD= 1
##$DC= 2
##$DFILT= <>
##$DTYPP= 0
##$F1P= 2.36226072786647
##$F2P= -0.459571619588291
##$FCOR= 0.5
##$FTSIZE= 0
##$FT_mod= 4
##$GAMMA= 1
##$GB= 0.15
##$INTBC= 1
##$INTSCL= 1
##$ISEN= 128
##$LB= 0.24
##$LEV0= 0
##$LPBIN= 0
##$MAXI= 10000
##$MC2= 0
##$MEAN= 0
##$ME_mod= 0
##$MI= 1.114404
##$NCOEF= 0
##$NC_proc= 0
##$NLEV= 6
##$NOISF1= 3.799351
##$NOISF2= 2.8
##$NSP= 1
##$NTH_PI= 0
##$NZP= 0
##$OFFSET= 15.70392
##$PC= 1
##$PHC0= -19112.36
##$PHC1= 12.80078
##$PH_mod= 1
##$PKNL= yes
##$PPARMOD= 0
##$PSCAL= 0
##$PSIGN= 0
##$REVERSE= no
##$SF= 200.130013532006
##$SI= 16384
##$SIGF1= 3
##$SIGF2= 2
##$SINO= 400
##$SIOLD= 16384
##$SREGLST= <1H.CDCl3>
##$SSB= 0
##$STSI= 0
##$STSR= 0
##$SW_p= 3612.71676300578
##$SYMM= 0
##$S_DEV= 0
##$TDeff= 0
##$TDoff= 0
##$TI= <>
##$TILT= no
##$TM1= 0
##$TM2= 0
##$TOPLEV= 0
##$USERP1= <user>
##$USERP2= <user>
##$USERP3= <user>
##$USERP4= <user>
##$USERP5= <user>
##$WDW= 1
##$XDIM= 8192
##$YMAX_p= 0
##$YMIN_p= 0
$$ End of Bruker specific parameters
$$ ---------------------------------
##NTUPLES= NMR FID
##VAR_NAME=  TIME,          FID/REAL,        FID/IMAG
##SYMBOL=    X,             R,               I
##VAR_TYPE=  INDEPENDENT,   DEPENDENT,       DEPENDENT
##VAR_FORM=  AFFN,          ASDF,            ASDF
##VAR_DIM=   8192,          8192,            8192
##UNITS=     SECONDS,       ARBITRARY UNITS, ARBITRARY UNITS
##FACTOR=    0.0002768,     1,               1
##FIRST=     0,             0,               0
##LAST=      2.2672688,     0,               0
##MIN=       0,             -80611,          0
##MAX=       2.2672688,     87497,           0
$$ Real data points
##PAGE= N=1
##DATA TABLE= (X++(R..R)), XYDATA
0@%%%%%%%%%%%%%%jRj6J6j6J7k5L2l3M1m9N7o6P5q9J03j18J35j53J72j95K21k48
$$ 0 0 0 0 0 0 0 0 0 0 0 0 0 0 0 -1 8 -8 8 -8 9 -16 16 -17 24 -25 32 -34 41 -48 55 -63 72 -81 91 -104 117 -131
37a31K78l11L46l86M30m78N29n84O46p15P89q68R57j055J162j281J412j559J725
$$ -131 147 -164 182 -204 226 -252 277 -307 339 -376 413 -455 502 -553 609 -672 740 -819 906
56I06j912K126k373K662l006L424l943M609n500O764q708J2122j9920P4055K2091
$$ 906 -1006 1120 -1253 1409 -1597 1827 -2116 2493 -3007 3757 -4951 7171 -12749 61306 83397
71H3397m4195L6261k7874k7689j4247K8445o949l6810R945K6771l5281k8741j0077
$$ 83397 39202 75463 47589 19900 5653 34098 27149 -9661 284 27055 -8226 -36967 -47044
84d7044K103j4824k0846K8714L5231j5262J1704L2639J3457o310r415J8560N179
$$ -47044 -44941 -59765 -80611 -51897 -16666 -31928 -20224 12415 25872 19562 10147 28707 33886
97C3886k9909J1797K7892l457p736p13Q157j0777l4906K343M444l0642j5465Q955
$$ 33886 3977 15774 43666 40209 32473 31760 39917 29140 -5766 -3423 1021 -29621 -45086 -36131
111c6131J2888l086j2725K4447J0590k8975O714K6807j194q609N804K6234K238
$$ -36131 -23243 -26329 -39054 -14607 -4017 -32992 -26278 529 -665 -9274 -3470 22764 25002
124B5002j6129K1149J1073k5309j0982M269L987j1163j4290J4955l55k3669K353
$$ 25002 8873 30022 41095 15786 4804 9073 13060 1897 -12393 2562 2207 -21462 -19109
137a9109P409q336j2891o929J4731K948p467K1788J5696l512K117N068R914l695
$$ -19109 -11700 -20036 -32927 -39856 -25125 -22177 -29644 -7856 7840 4328 6445 11513 21427 17732
151A7732j1730J1294K448r543N759P629M129q896j5344M029p307k0918J167J566
$$ 17732 6002 17296 19744 10201 15960 23589 27718 18822 3478 7507 200 -20718 -19551 -17985
165a7985o098m229M141J7510M46q192J1972m94j0387L580N993P259j325M35J7646
$$ -17985 -24083 -28312 -24171 -6661 -6215 -14407 -2435 -2929 -13316 -9736 -3743 3516 2191 2626 20272
180B0272L163l634P386l656r549r068q313L342o411o671P426k772m49M910j821
$$ 20272 23435 19801 27187 23531 13982 4914 -3399 -57 -6468 -13139 -5713 -8485 -8934 -4024 -5845
195e845J656m951o640L687k188L746Q174n86P554N358r82P748l86l841j995q097
$$ -5845 -4189 -9140 -15780 -12093 -14281 -10535 -2361 -2947 4607 9965 8983 16731 16345 12504 10509 2412
211B412K78K01n105M752k738m509K620m410Q78r54q706P09j523m31P665R88N687
$$ 2412 2690 2891 -2214 2538 -200 -4709 -2089 -6499 -5621 -6575 -15281 -14572 -16095 -16526 -8861 -7873 -2186
228b186N301l827O993M798l037J898l057M31K56n560P923K119j0032N06j40k915
$$ -2186 3115 -712 6281 11079 8042 9940 6883 7314 7570 2010 9933 12052 2020 2526 2386 -529
244e29l177n696M771m048j1937Q708N534n000P03J601N183k541k976J4763K977
$$ -529 -3706 -9402 -4631 -8679 -20616 -11908 -6374 -11374 -10671 -9070 -3887 -6428 -9404 5359 8336
259H336q768O074N048O49l268k346P537p340j1337Q647L327n097k033o57M680
$$ 8336 -432 5642 10690 11339 8071 5725 13262 5922 -5415 3232 6559 1462 -571 -1228 3452
274C452p626q321R631j940j0698J456N598P360j649o6J4489k917j1176O918M590
$$ 3452 -4174 -12495 -2864 -4804 -15502 -14046 -8448 -1088 -2737 -2803 11686 8769 -2407 4511 9101
289I101l424p049R41J2344m593n889J4751R03j2838o320J252J575j2812m733J5317
$$ 9101 5677 -1372 -431 11913 7320 1431 16182 17085 4247 -2073 -821 754 -12058 -16791 -1474
304a474l021q054J1549J0072j389r883L7Q990j1527p899J5199L499n360J335R749
$$ -1474 -4495 -12549 -1000 9072 7683 -2200 -2163 6827 -4700 -12599 2600 6099 739 2074 11823
319A1823Q509j1083n675R329j0403j3239L165O311J182q608K789J3861p424q055
$$ 11823 20332 9249 3574 12903 2500 -10739 -7574 -1263 -81 -8689 -5900 7961 537 -7518
333g518Q955k13r030p117P140J1974p768q40J5636j323r270J320O284l88j4672
$$ -7518 1437 1224 -7806 -14923 -7783 4191 -3577 -4417 11219 9896 626 1946 8230 7842 -6830
348f830n60J3268o927o390J0069M584p154r795N712Q636j3689m137J2930r40o543
$$ -6830 -7390 5878 -1049 -7439 2630 7214 60 -9735 -4023 4613 -9076 -13213 -283 -1223 -7766
363g766K706J0146K817j3423J714J1908p324m515P808M818k977q576N988P919
$$ -7766 -5060 5086 7903 -5520 -3806 8102 778 -3737 4071 8889 5912 -2664 3324 11243
377A1243j2748n840O621k344n535q74R568N800j1637O16R883n712n989K228M658
$$ 11243 -1505 -7345 -724 -3068 -8603 -9477 91 5891 -5746 -5130 4753 -959 -6948 -4720 -62
392f2o62p432Q837J2561o071k542N923n16o623o642O033K968j2397J549J0553
$$ -62 -724 -8156 681 13242 7171 4629 10552 10036 3413 -3229 2804 5772 -6625 -5076 5477
407E477j973l767O10L804m600j2469M668P027p890J53P452M664k05j208Q253J656
$$ 5477 3504 -263 347 4151 -449 -12918 -8250 -1223 -9113 -8960 -1508 3156 2951 1743 9996 11652
423A1652j1758j45M222k419j134M81O038Q49p264N160M035p763m642k260N81k455
$$ 11652 -106 -251 3971 1552 418 899 6937 7786 522 5682 9717 1954 -2688 -4948 -4367 -6822
439f822m664P331L671n773K141M177J401r89k951M527P7n718N520N308j356n46
$$ -6822 -11486 -4155 -484 -6257 -4116 61 1462 473 -2478 2049 2126 -3592 1928 7236 5880 5334
455E334r96L548j271n563M230n16p379o1P62Q68j423l019L070j627m222M757N75
$$ 5334 4338 7886 6615 1052 5282 4766 -2613 -2674 -1912 -1044 -2467 -5486 -2416 -4043 -8265 -3508 -2933
472b933j076P90j427L070J037j093M837n37j223K370r96K755J112l415J547k879
$$ -2933 -4009 -3219 -4646 -1576 -539 -1632 3205 2668 1445 3815 2819 5574 6686 3271 4818 1939
488A939k924K629l018l36N05m271K029J148j41K414l006M04R77l347L383J962
$$ 1939 -985 1644 -1374 -1710 -1205 -5476 -3447 -2299 -2440 -26 -3032 -2628 -1651 -4998 -1615 347
504C47k504K098o42J884L981k016J351K91m011K46j345L01J101n854J217L161
$$ 347 -2157 -59 -701 1183 5164 3148 4499 4790 779 1025 -320 -19 1082 -4772 -3555 -394
520c94l222K042J989n71j066l592L701K268n034L447K866j407J346J380M105O02
$$ -394 -3616 -1574 415 -156 -1222 -4814 -1113 1155 -3879 -432 2434 1027 2373 3753 7858 8460
536H460o686J627J133n511l63J157Q75k212m158O511K316o768J506N75l423k221
$$ 8460 1774 3401 4534 -977 -1340 -183 692 -1520 -5678 833 3149 -3619 -2113 -1538 -4961 -7182
552g182n26O235R6m722O527M454j848J803J271J516l936o309O083J976o399J411
$$ -7182 -7708 -1473 -1377 -6099 428 4882 3034 4837 6108 7624 3688 -2621 3462 5438 -961 450
568D50L163l63l069k112N998l413r607K996K662l399q42K833N690k553m931Q613
$$ 450 3613 3250 181 -1931 4067 654 -8953 -5957 -3295 -6694 -7536 -4703 987 -1566 -6497 2116
584B116K788n939k99L219J598l796j181R946j036q494L452K861l481m241L34M145
$$ 2116 4904 -1035 -1334 1885 3483 -313 -1494 8452 7416 -1078 2374 5235 1754 -2487 -2153 1992
600A992n740o141Q320K030n375lJ780K639m063j459R397q82o646L977M827K06
$$ 1992 -3748 -9889 -1569 461 -4914 -4917 -3137 -498 -4561 -6020 3377 2495 -4151 -174 4653 4859
616D859m086L04O387n277n531P624K427m816k319J873K531o703l788P043k110
$$ 4859 773 1077 7464 2187 -3344 4280 6707 1891 -428 1445 3976 -2727 -6515 528 -1582
631a582p431J962N557K043l895J010Q191m895o513O139L090l626k905L834O100
$$ -1582 -9013 -7051 -1494 549 -3346 -2336 5855 960 -5553 586 3676 50 -2855 979 7079
646G079m799j272Q247k091p502j207K328P04o162J50P065l763l576N452K778k848
$$ 7079 2280 1008 9255 7164 -338 -1545 783 1487 -4675 -4525 2540 -1223 -4799 653 3431 583
662E83n580Q24M794n514j091P962L36k583J135M468K537o591q24M372m809l986
$$ 583 -4997 -4173 621 -4893 -5984 1978 2314 -269 866 5334 7871 1280 456 4828 19 -3967
678c967L244L021l53m687K302N230o173k249M438q78m146j990M505L831n256J289
$$ -3967 -723 2298 1945 -2742 -440 4790 -1383 -3632 806 -72 -4218 -6208 -1703 2128 -3128 -1839
694a839N493k762k568K089L055o43n468K117M658m028l46L137m13k734k972L015
$$ -1839 3654 892 -1676 413 3468 2825 -2643 -526 4132 104 -242 2895 2482 -252 -3224 -209
710b09K609n307L49L134k281o99N79K358L13m629K076L714k525P39J423K28o61
$$ -209 2400 -2907 -2558 576 -1705 -2404 -1825 533 846 -3783 -1707 2007 -518 221 1644 1872 1211
727A211l228K762K046m419K52J770j048L04n39K618L35m957Q37J600k116M10J47
$$ 1211 -2017 745 2791 -1628 -1376 394 -654 -350 -889 1729 2064 -2893 -2056 -456 -2572 -2162 -2015
744b015J219M15j562L864K527k457O26m45j099M23j819K107M99l092K001O85r06
$$ -2015 -796 -381 -1943 1921 4448 1991 2617 2172 1073 1496 -323 1784 2283 -809 1192 1877 971
761I71R55k354m70n48k670J755M56q66J533r22O06K605j131J318K3k003J855p07
$$ 971 1926 -428 -898 -1446 -4116 -2361 -1905 -2771 -1238 -2160 -1554 1051 -80 1238 1261 -742 1113 406
779D06O54K636j657P23J012j397J998j168j346O46l938k77J855j915R23q45m60
$$ 406 1060 3696 2039 2762 3774 2377 4375 3207 1861 2507 -1431 -1708 147 -1768 -845 -1690 -2150
796b150J727k160J477K243k863o69L71j91K349j383J425K373k871J338K727n18
$$ -2150 -423 -2583 -1106 1137 -1726 -2395 -2024 -2215 134 -1249 176 2549 -322 1016 3743 3225
812C225k58k038L31J272m229J760K417k806m95j09J040R71l689J684J659m637
$$ 3225 2967 929 1260 2532 -1697 63 2480 -326 -821 -930 110 1081 -2608 -924 735 -3902
828c902O40K707K69K64j940K262K072l946J891L000k613j280l40K491R59m059
$$ -3902 -3262 -555 -286 -22 -1962 300 2372 -1574 317 3317 704 -576 -916 1575 2534 -1525
844a525K444K070m049k01K225O19j469l856L010J563m450J776K724j249j851m62
$$ -1525 919 2989 -1060 -1261 964 1583 114 -3742 -732 831 -3619 -1843 881 -368 -2219 -2681
860b681M019J103m358K815K273l692q17J758K500k087l844M128J887m160J658
$$ -2681 1338 2441 -1917 898 3171 -521 -1338 420 2920 833 -3011 1117 3004 -1156 502
875E02K601j311k793j606L693rm983K652K343k850l66J618L726k390m406M167
$$ 502 3103 1792 -1001 -2607 1086 1077 -3906 -1254 1089 -1761 -2127 -509 3217 827 -3579 588
891E88J048m151Q46K671N41k459j306N638k34m414J679J409k579k262J560L810
$$ 588 1636 -2515 -1669 1002 1543 -916 -2222 3416 3182 -1232 447 1856 -723 -2985 -1425 2385
907B385j902l986M774J924l269k09J336Q20m058j845N190R9l750K251K106k48
$$ 2385 483 -3503 1271 3195 -74 -283 1053 1873 -2185 -4030 1160 1259 -2491 -240 1866 1618
923A618k486N76L962l564m356L575J436k092m66J790K336l714j743N530q36m031
$$ 1618 -868 -292 3670 106 -4250 -675 761 -1331 -1797 -7 2329 -1385 -3128 2402 1566 -2465
939b465R01J646M91k286O48M787k830l237L089J226j196j554R23K584l533j384
$$ -2465 -1564 82 573 -1713 -1065 3722 892 -2345 744 1970 774 -780 143 2727 -806 -2190
955b190M560m13k940l94J207Q27k861L9M340k515k972J999J289j92j849N76L005
$$ -2190 2370 1957 -983 -1377 -170 657 -2204 -2165 2175 -340 -3312 -1313 -24 -216 -2065 -1489 1516
972A516k929p86M321K0j463r86J155J417l189L13L506k297j836K056J186J07k242
$$ 1516 -1413 -2199 2122 2142 679 -307 848 2265 -924 -611 2895 598 -1238 818 2004 2111 -131
989a31L65J869l981p30K604o36r53o96J614K153k283N53K406j964j536M24J032
$$ -131 234 2103 -1878 -2608 -4 -640 -1593 -2289 -675 1478 -805 -252 2154 190 -1346 -922 110
1006A10J625k500Q29K596k375L34J581m60n85k080L56J586k343Q25J346j131j91
$$ 110 1735 -765 64 2660 285 619 2200 1740 1155 -925 -569 1017 -1326 -501 845 -286 -477
1023d77l92O63J187k557L51J527k235R78J010N25O47j598Q49J639j697J208K50
$$ -477 -869 -206 981 -1576 -1225 302 -1933 -955 55 580 1227 -371 478 2117 420 1628 1878
1040A878k111R01j345R67J377k336N28K00j418J587p90j55M62j828M75Q94j046
$$ 1878 -233 668 -677 290 1667 -669 -141 59 -1359 228 -562 -717 -255 -2083 -1608 -714 -1760
1057a760J646n11q20J734n12P16J212j264R15r06p89K387j491k95J091j188RJ21
$$ -1760 -114 -625 -1445 289 -223 493 1705 441 1356 450 -339 2048 557 262 1353 165 174 295
1075B95m14J501k109q79J147j310N47K69j94O46j362L11K370j143n10J238r46
$$ 295 -119 1382 -727 -1606 -459 -1769 -1222 -953 -1147 -501 -1863 -1552 818 -325 -835 403 -543
1092e43N13n33P38K062k197l68K083q53L7l46N7N33k553J8K570j404n33K21J03
$$ -543 -30 -563 175 2237 40 -328 1755 902 939 593 650 1183 -1370 -1352 1218 -186 -719 -498 -395
1111c95M06j388J254K187k979o13J954n04j74n81J127J106l292J415K816j885
$$ -395 11 -1377 -123 2064 -915 -1528 426 -78 -252 -833 294 1400 -1892 -477 2339 454
1127D54n34j7N74j54k175J463K372l058l46J772N76j71j490J624Q71l773J034
$$ 454 -80 -97 477 323 -1852 -389 1983 -1075 -1421 351 927 756 -734 890 1761 -2012 -978
1144i78K760j018r37p4J565J71k422J467K133l419r54R80P80l17k115K260J370
$$ -978 1782 764 -173 -247 1318 1489 -933 534 2667 -752 -1706 -726 54 -263 -2378 -118 1252
1161A252l210R64K560r56j429q81K179J29k656K584J938k159m99J030J655p31
$$ 1252 -1958 -994 1566 610 -819 -1700 479 608 -2048 536 2474 315 -184 846 2501 1770
1177A770k523K127L78k945J78K026m4j561j272K402l70k723K014J431j920j062
$$ 1770 -753 1374 1752 -1193 -1015 1011 967 -594 -1866 536 166 -2557 -543 888 -1032 -2094
1193b094R55K286q18k189K901O19k544J016J557M48j590j751L176O8l007J293
$$ -2094 -1139 1147 329 -1860 1041 1660 -884 132 1689 2137 547 -1204 1972 2040 -967 326
1209C26J465j441j830K16K730j445k672K790K8k062j26J503J072j511j047L087
$$ 326 1791 350 -1480 -1264 1466 21 -2651 139 167 -1895 -2021 -518 554 -957 -2004 1083
1225A083N67k411J607J005k59j855o7K868j351k236J945N18j473j72P77J450k453
$$ 1083 1650 -761 846 1851 1592 -263 -330 2538 1187 -1049 896 1414 -59 -231 546 1996 -457
1242d57k090K475l44j786P98Q38J41q27k70K963q28k047J755M29q75l39Q34K102
$$ -457 -2547 -72 -416 -2202 -1404 -566 -425 -1252 -1522 1441 613 -1434 321 750 -125 -464 370 2472
1260B472j754j410K812n36j125Q5m2j49j732l0K675j320j141Q65q7K53j190M70
$$ 2472 718 -692 2120 1584 459 544 502 353 -1379 -1409 1266 -54 -1195 -330 -417 -164 -1354 -884
1278h84J757k197p78K008k3k79L37J96J139j984M11K062j433o28L08q7M04o11
$$ -884 873 -1324 -2102 -94 -117 -396 -59 137 1276 -708 -297 1765 332 -296 12 -75 329 -282
1296b82k7J891k250m60J466n78O65o21J49O00j685M62J882j044k64j40p4J402
$$ -282 -309 1582 -668 -1128 338 -240 425 -196 -47 553 -1132 -670 1212 168 -96 -236 -310 1092
1314A092j233n4J444j576j84L92m57J228j061n48J163j322O33R19j005O49o75
$$ 1092 -141 -195 1249 -327 -511 -119 -576 652 -409 -957 206 -1116 -483 436 -569 80 -595
1331e95m05J457p14L33R59j010O55K9n16J516q28n70L27q58N24m5m24P31r75m93
$$ -595 -1000 457 -257 76 1035 25 680 709 193 1709 881 311 638 -220 304 259 -165 566 -409 -902
1351i02R32n78L21r5j298J065m06k90J517o63J18J76j18J427n40q72J504r59m56
$$ -902 30 -548 -227 -322 -1620 -555 -961 -1251 266 -397 -279 -103 -221 1206 666 -206 1298 339 -117
1370a17R98j52M62j110o26J322r44o15J369r25k35n82k3J561j144l78J670r65
$$ -117 881 729 1191 81 -545 777 -167 -782 587 -338 -573 -1155 -1178 383 -761 -1139 531 -434
1388d34k98R49K93O06j535k06J823p38o35J415k89n2j289L65J629j945m69R89
$$ -434 -732 217 510 1116 -419 -625 1198 460 -175 1240 951 899 -390 -25 1604 -341 -810 179
1406A79q53o39J43L28P95j554J17K003r26q3P86M20j41j227Q84J858j429k53J336
$$ 179 -674 -1313 -1170 -842 -47 -1601 -1484 519 -407 -490 296 716 575 -652 232 2090 661 408 1744
1425A744l52o32n00O97Q26k406k16J632j096o81L48N92n60j712Q86J998j845l79
$$ 1744 1392 760 260 957 1783 -623 -839 793 -303 -984 -636 -44 -604 -2316 -1430 568 -1277 -1656
1443a656J369L08n39n00J503J083k197J74J980o38l31k13J278j49k543J573J294
$$ -1656 -287 21 -518 -1018 485 1568 -629 -455 1525 887 556 343 1621 1472 -1071 502 1796
1460A796k053l37L48L91l36j278J669P71k435K05J423j16n73n49J505K23k101
$$ 1796 -257 -594 -246 145 -191 -1469 200 971 -1464 -1259 164 48 -525 -1074 431 654 -1447
1477a447J397J791j623m25L35Q51o47j581J791O64k176J00J414Q1q54n69J758
$$ -1447 -50 1741 118 -307 28 879 232 -1349 442 1106 -1070 -970 444 525 -329 -898 860
1494H60n34j919J228J377r16m98K24J437l14j462J457N69k144l6R51Q55j417m82
$$ 860 326 -1593 -365 1012 96 -402 -178 1259 945 -517 940 1509 -635 -671 280 1135 -282 -764
1512g64J654m44j894J174P64p50p34l57J502j37j445K035M03j203k29O86J223
$$ -764 890 446 -1448 -274 490 -260 -994 -1351 151 14 -1431 604 1007 -196 -425 261 1484
1529A484q02j543K036j93j444Q18L41J72r16o86J322n66j473J440n8o38m58J93
$$ 1484 682 -861 1175 982 -462 356 697 869 -47 -733 589 23 -1450 -10 -68 -706 -1164 -971
1547i71J361o81j190J504J50o63M75O20N32o91n53J566o83o98R74k78k37o03n25
$$ -971 390 -291 -1481 23 173 -490 -15 605 1137 446 -107 1459 776 78 1052 774 537 -66 -591
1566e91J330n58j489J392n93p58N17j06Q19j023m04J792m36m05R51l65J59K22
$$ -591 739 181 -1308 84 -509 -1267 -750 -856 -37 -1060 -1464 328 -108 -513 438 73 232 454
1584D54k74J461o79q44J144n21j53L43n64O45j044o84R33o67p2m4o68R45o90n4
$$ 454 180 1641 962 118 1262 741 588 931 367 1012 -32 -716 217 -450 -522 -566 -1234 -289 -979 -1033
1604a033J240p53m14O42l61N95K25k3R63n16l46J031n72K89j30q40N66l73n0M45
$$ -1033 207 -546 -960 -318 -679 -84 141 118 1081 565 219 1250 678 967 837 -3 563 190 140 585
1624E85m35j94L8j011Q48om02L27o35L67J07l6O48k85n81R62k8L4J23j26K73k70
$$ 585 150 -44 -6 -1017 -169 -175 -577 -250 -885 -518 -411 -447 201 -84 -665 297 269 303 426 300 573 303
1646C03o78J103k58o67N48o22K52L2p25J017k72r74N80r5Q5J50k5O01m52n28J338
$$ 303 -375 728 470 -197 351 -271 -19 13 -712 305 33 -941 -361 -456 -371 -221 -246 355 -97 -625 713
1667G13m1o23M40o62N11m62j23J112q99n63K93K81J31l22p64J228p20n47J156
$$ 713 672 49 489 -173 338 -124 -247 865 -34 -597 -304 -23 108 -214 -978 250 -470 -1017 139
1686A39Q9n75k10K28Q89p38m47J576p18m73J23L25Q09j168j0Q34r50m04R37j52
$$ 139 228 -347 -557 -329 560 -178 -625 951 233 -240 -117 208 1017 -151 -161 673 -277 -681 256 104
1706A04k02q82K60J249j299j75J413l73q61K54N04J058j261k53J297n28n61P71
$$ 104 -98 -980 -720 529 -770 -945 468 95 -766 -512 -8 1050 -211 -464 833 305 -256 515
1724E15J03M47j211l30J667j349p3O30j98o97p62Q88J211j716J61R76o31J4K52
$$ 515 618 1065 -146 -476 1191 -158 -231 399 201 -496 -1258 -370 841 -875 -714 262 -369 -355 -103
1743a03O74o5j382N05J318r43O8Q60Q9m10p88P33P40j738J40Q63n39o69J48K78
$$ -103 571 506 -876 -371 947 4 72 932 1021 611 -177 556 1296 -442 -302 561 22 -647 -499 -221
1763b21L20j197L90P46o40j52N81RL40j178J224Q54j212qR61k50m30l3O97L24
$$ -221 99 -1098 -708 38 -602 -754 -173 -164 176 -1002 222 1076 -136 -144 817 567 137 104 801 1125
1783A125j655M87Q66l98n51Q1K95l10r93P65R66j677M32M49N6l61k84J017K47
$$ 1125 -530 -43 823 425 -126 -45 250 -60 -1053 -288 678 -999 -567 -118 -62 -423 -707 310 557
1802E57j595O24J062k10k13k54P58k62j230J315L66j101J20L02J01m55m05Q18
$$ 557 -1038 -414 648 438 225 -29 729 467 -763 552 918 -183 -63 239 340 -115 -520 298
1820B98J29j364N95L65J69j96o04N77L52j186R15L60n86j23K74K51J2q11J164
$$ 298 427 -937 -342 23 192 -4 -608 -31 321 -865 50 410 -176 -299 -25 226 238 -573 591
1839E91j39q57N02N4L41m39m78O11r1o16P74K3m52J45l5L83O9r40Q71q5p95N00
$$ 591 452 -405 97 151 492 53 -425 186 95 -521 253 276 -176 -31 -66 317 386 -554 317 232 -563 -63
1861f3N5M42m21l14M86k23n12O47R7j90n36NP80q9j96K35J15k84j12L5O56k32
$$ -63 -8 434 13 -301 185 -38 -550 97 194 4 -532 -527 253 164 -32 203 318 34 -78 -43 613 381
1883C81o77P20n04j59P25k10o9j00o46M35J84l95L85o40O6J52j03O32l15k08L94
$$ 381 -296 424 -80 -239 486 276 207 107 -539 -104 80 -315 70 -570 -504 -352 -455 177 -138 -346 48
1904D8k21L56J4j81L42J28l86M15l78k8N44p04L44r6m10P70k91m02o7n03M75M55
$$ 48 -173 183 197 16 358 486 100 515 137 109 653 -51 293 197 -213 557 266 -136 -203 -706 -231 224
1926B24p21M38j10n21O76k18L19K13p32N95N3k26N02l74L29j15l65Q22p9r13N79
$$ 224 -497 -59 -169 -690 -14 -232 87 300 -432 163 216 -10 492 118 447 332 -33 789 710 -203 376
1947C76K88p47J40n25Q46l19p68K83K79l54L12r8L16l57k49P09J40o62N42%Q3
$$ 376 664 -83 57 -468 378 59 -709 -426 -147 -501 -189 -287 29 -328 -577 132 272 -390 152 152 235
1968B35J98r7N66l58q24R15k22l26K68j65K12m56n45J002q2q34K66J2J5J23m74
$$ 235 433 336 902 544 -280 635 413 87 355 190 402 -54 -599 403 321 -513 -247 -235 -220 -97 -571
1989e71R85j31q63M81K96q1j73k88N82m87k24J002j81n59j3K40M26l06l56R80
$$ -571 414 283 -580 -99 197 116 -57 -345 237 -250 -474 528 347 -212 -225 15 441 135 -221 759
2009G59q01n30O10M2J77n87L17L48m14m61J166k49m68l95L65P72j206K09P95r1
$$ 759 -42 -572 38 80 257 -330 -13 335 -79 -540 626 377 -91 -486 -121 651 -555 -346 449 358
2029C58p28J98K41K38q66K59J060j221l18R03m5L1n16L23M55n28l8P49m78l47
$$ 358 -370 -172 69 307 -559 -300 760 -461 -779 124 79 110 -406 -83 372 -156 -194 555 77 -270
2049b70J51O45J70r14J64N21p25j96P44j12l43l28N0R05r48J74M12j50o9j40M62
$$ -270 -119 526 696 -218 -54 467 -258 -454 290 178 -165 -493 -443 462 -486 -312 100 -50 -119 -259 203
2070B03K19o91J05Q01q63L09J82L15j66p03L44O48p95q8L52l5m85j89K57M97o60
$$ 203 422 -269 -164 637 -226 83 265 580 414 -289 55 703 -92 -180 172 137 -348 -537 -280 217 -443
2091d43L06L73n70J62K08K63J18p84J56P33n90J61M12k88l1m18O88J01p95K73
$$ -443 -137 236 -334 -172 36 299 417 -367 -211 522 -68 93 505 217 186 -232 456 557 -238 35
2111C5K46o81L04J5L01J77r98L01M73o91L08L3P4L26m92N97J32q93O14J39j71
$$ 35 281 -400 -96 -81 220 397 -601 -300 173 -518 -210 -177 -103 223 -269 328 460 -433 181 320 149
2132A49J31k18L12L2n47M58o2m6K09n25N6L44p99P08J44o06o1P4k52M90l33K69
$$ 149 280 62 374 406 -141 317 255 209 418 -107 -51 293 -506 202 346 -260 -321 -247 -499 -9 -342 -73
2154g3J74n75M55M2J94k43k75M39J74p11J017l04l10K86j95J97q5k66J72k1k92
$$ -73 101 -474 -19 23 217 -26 -301 138 312 -399 618 314 4 290 95 292 207 -59 113 92 -200
2175b00M03j35LJ68m67K58J18n39L96j0k61N67o05K96l20K84k81M31o42N24k39
$$ -200 203 68 71 239 -228 30 148 -391 5 -5 -266 301 -304 -8 -328 -44 -325 106 -536 -12 -251
2196b51oM71n05K64K39J8J99j63m7r0m11M17K02m12M58o08L70j22j96L44P0n48
$$ -251 -257 214 -291 -27 212 230 429 266 219 129 -282 135 337 -75 383 -225 145 23 -173 171 241 -307
2218c07M6J45n9M07o72L00K44m34M8M13P0N5n79M78K03l98L21L8k12n3J79J41
$$ -307 -261 -116 -175 232 -440 -140 104 -330 -282 131 201 256 -323 155 358 -40 281 319 107 54 233 374
2240C74k48n58P89j87o20K89j5LJ21l69J66L99m96M64l4J52k60p4O19l02l37K99
$$ 374 126 -432 357 170 -450 -161 -176 -173 -52 -421 -255 144 -352 112 78 230 -30 -104 515 213 -124 175
2262A75J31n10L52L5L02k02n90P33j78m14N01k53k26m2j58O95l61m73L10J49j48
$$ 175 306 -204 148 183 485 283 -307 426 248 -166 335 82 -144 -186 -344 351 -10 -483 -173 -24 -172
2283a72K11k21P14o07k89N55j7l08N75l42J65L3p78R05k38m13N86k82l6J92n65
$$ -172 39 -182 532 -75 -364 191 174 -134 441 99 264 297 -481 424 186 -227 359 77 41 233 -332
2304c32N99o4o63N35m6j27n9J41J5l42l44J135k57n63L81J50j72k99K32L86j99
$$ -332 267 203 -460 75 29 -98 -157 -16 -1 -343 -687 448 191 -372 9 159 -13 -312 -80 306 107
2325A07o03P82j82J67j06J72k66m22n8Q68l59m29K34lN36n00k58Q64o74k73L05
$$ 107 -496 286 104 271 165 337 71 -351 -409 459 100 -329 -95 -98 438 -62 -320 544 -130 -403 -98
2346i8J20J42l15n3M91k37l44O54m65r9J40M7K28k84K57K16n33lJ29J50J16j79
$$ -98 22 164 -151 -204 287 50 -294 360 -105 -204 -64 -17 211 -73 184 400 -133 -136 -7 143 259 80
2368H0m31P57o39R0K54j70j46O6L8L32o91OM95l57N4K37q2mk10J82O17n05j68
$$ 80 -351 406 -233 -143 111 -59 -205 -139 -101 231 -460 -454 41 -316 -262 -25 -107 -111 -321 -139 478 -27 -195
2391a95L10j96l9L6J09K66l82j05M10r0P2j66L8O8m33K52P0k43P6J77k9j19k57
$$ -195 115 -81 -120 -84 25 291 -91 -196 214 124 196 30 68 136 -297 -45 25 -218 -142 35 6 -113 -370
2414c70M94k22j8J98J66n3j19j78J34L91o50K31L73p0L5J06l00O8k89J10M62o65
$$ -370 124 -98 -116 82 248 195 76 -102 32 423 -227 4 377 307 342 448 148 216 -73 37 499 -166
2436a66J01J56k34L4j78K02L66l74j05J03l34N29j53Jm3j54J90K09o0J59k82q6
$$ -166 -65 91 -143 -109 -287 -85 281 -93 -198 -95 -429 100 -53 -52 -95 -249 -59 150 90 249 -33 -119
2458a19M24m66K6M78j96k3P3m00N32l15j62K81o98L86J35j69L13l45M7L61l13
$$ -119 305 -161 -135 343 147 124 197 -203 329 14 -148 133 -565 -179 -44 -213 100 -245 -198 163 -150
2479a50K25M6k63j1J95q6N27n94L23k12L5O7M0J27N2o18K71J12J81j24j06JJ72
$$ -150 75 121 -142 -153 42 -44 483 -111 212 0 35 102 142 269 321 -297 -26 86 267 143 37 38 210
2502B10j53L7K34q14M63p2n1o5J63L00j93m01K23K66l74M45j47j37O8j99K99L12
$$ 210 57 94 328 -486 -23 -95 -146 -211 -48 252 59 -342 -119 147 -227 218 71 -66 2 -197 102 414
2524D14n42J11j09JL33m43N82j57n70L58J84l21K58m44J23L00n64K96K87j83j4
$$ 414 -128 -17 -126 -125 208 -235 347 190 -380 -22 162 -159 99 -345 -222 78 -486 -190 97 -86 -100
2545a00l10J49L82o18N31L01o65J62J33M04p8o69O11j88j60J28K58m25M56m19
$$ -100 -410 -261 121 -497 34 335 -330 -168 -35 369 291 -378 233 45 -115 13 271 -154 302 -117
2565a17L70p0o09O31q9l38J08K70k9j57q6K76k3l28m9L98k3k80j58N95qk81K31
$$ -117 253 183 -426 205 116 -222 -114 156 127 -30 -116 160 137 -191 -240 158 135 -145 -303 292 284 3 234
2588B34j30r5m4J0L96k80m40O63j60k98rM81j7k94k17L60j76n48M72K47o56N67
$$ 234 104 9 -35 -25 371 91 -349 314 154 -144 -153 328 311 17 -200 160 -16 -564 -92 155 -501 66
2610F6j0J00n0l80P23k54l31J39P4L93l57m63N55j01j60Q4oJ8k14j22L38J20l52
$$ 66 56 156 106 -274 449 195 -136 3 77 470 113 -350 205 104 -56 28 22 40 -174 -296 42 162 -190
2633a90J92J0k62n2N8L89k11k77M46j71J28J98k60l9L8k06P84m24l23M26k48K39
$$ -190 2 12 -250 -302 -244 145 -66 -343 103 -68 60 258 -2 -41 -3 -209 575 151 -172 254 6 245
2655B45K9j97J64l47k38M91k22J86j84n2J79q6j56K16j28L8L7k2O1l9p0L23j18
$$ 245 274 77 241 -106 -344 147 -75 111 -73 -125 54 -32 -188 28 -100 -62 -25 -47 14 -25 -95 228 110
2678A10l75O08k77m6J37n6K95m29j27O93o53L09j3k95L03l09J54J59j92j06J89
$$ 110 -265 343 66 20 157 101 396 -33 -160 533 -120 189 176 -119 184 -125 29 188 -4 -110 79
2699G9j35K46k24o4J92k22R5K53j08k9k42q2N70j54k34K61k21j73O2l2M13j20
$$ 79 -56 190 -34 -98 94 -128 -33 220 112 83 -159 -241 329 175 -59 202 -19 -192 -130 -162 251 131
2721A31m43N11k03Kj08j46L76k66J22J12R2j95K53m68o5L14J8o8k71K90J98j53
$$ 131 -312 199 -4 -2 -110 -256 120 -146 -24 88 180 -15 238 -230 -295 19 37 -31 -302 -12 186 33
2743C3J52k68L0K51l77J30K63j13n1o2K4j04J42m5K10m97J22J60OJ69j38k59K72
$$ 33 185 -83 -53 198 -179 -49 214 101 50 -12 12 -92 50 5 215 -282 -160 0 6 175 37 -222 50
2766E0l4k53K35j91N51n04K08J65k45J37J9j90nR5K09n1j52k2k72J78J8J8p8R8
$$ 50 16 -237 -2 -193 358 -146 62 227 -18 119 138 -52 -57 38 247 196 44 22 -250 -72 -54 -36 -114 -16
2790a6l0nP4l2r5M23j95j63k32J53K93l78P5P7m0J89%j8K16n22Q5L39q4P9j84
$$ -16 -46 -51 23 -9 -104 319 124 -39 -271 -118 175 -203 -128 -51 -91 98 98 80 296 -226 -141 198 114 193 9
2815IK16n2k21J2K04j61p6l3j10J76R8j82n3q8k6M04p5J8j88O8r6l8r5L83n2j66
$$ 9 225 173 -48 -36 168 7 -69 -102 -212 -36 62 -120 -173 -261 -287 117 42 60 -128 -60 -156 -194 -289 94 42 -124
2841a24L54j11K99o28L99J9k42j01M49l97L93p9k83N47r72M72J04k10q1J66J71
$$ -124 230 119 418 -210 189 208 -34 -135 314 -83 310 231 -52 495 -477 -5 99 -111 -192 -26 145
2862A45j95k77K74lk96K55R7p3K13m37L18J36m82K24M56r2k72P9r9K55p3M0R1
$$ 145 -50 -327 -53 -56 -352 -97 0 -73 140 -297 21 157 -325 -101 355 263 -9 70 -29 226 153 193 284
2885B84l83K77j41PK85m39K92j22j67J7P9j66K64k73K82Rk45K53J9l57J12J29
$$ 284 -99 178 37 44 329 -110 182 60 -107 -90 -11 -177 87 -186 96 105 -140 113 132 -225 -113 16
2907A6K97j76n22N27N4k61J83J91m00J20p9K02K18m39k34L73j37j50L01K04j87
$$ 16 313 137 -385 142 196 -65 118 309 -91 29 -50 152 370 -69 -303 70 -67 -217 84 288 101
2928A01n35J12L31j70L47l56o6M43n80O40r8j17J42m33K66j79P5L52r6l34R3J55
$$ 101 -434 -322 9 -161 186 -170 -236 207 -373 267 169 52 194 -239 27 -152 -77 275 179 -155 -62 93
2950I3j79J0K4M3k5l20L51j95j77J85J45L4k34o7L54j65J38j34J01J74J5l12M27
$$ 93 -86 -76 -52 -9 -34 -354 -3 -198 -375 -190 -45 -11 -245 -312 42 -123 15 -119 -18 156 171 -141 286
2973B86j21l23K39M1j82K35k18K06m9n35O47l71L0R0p4K61j39k73M75j16k33p9
$$ 286 165 -158 81 122 -60 175 -43 163 114 -421 226 -145 -115 -25 -99 162 23 -250 225 109 -124 -203
2995b03J78K62k47j00%N39m25R1J64k66K77l75rJ53j02L15l29o1M00j89j42K05
$$ -203 -25 237 -10 -110 -110 429 4 95 259 -7 270 -105 -114 39 -63 252 -77 -138 262 73 -69 136
3017A36m89N70k25j46J73o2q5m4J20L39j38m62J83l1MK73Lj88M1n1K45p1k66K82
$$ 136 -353 217 -8 -154 19 -43 -128 -172 -52 287 149 -313 -130 -161 -157 116 119 -69 -28 -79 166 95 -171 111
3041A11k5K1j64K16j1K9p7K5q5j43j65Q0N52m36j9K73j04j22J03o3k05J00O6J7
$$ 111 86 107 -57 159 148 177 100 125 40 -103 -268 -188 364 -72 -91 182 78 -44 59 -4 -209 -109 -43 -26
3065b6J7m5Q6l00O90m07j19N18k51k00j22J72R4J39k53K05l67n6J72K14l15J01
$$ -26 -9 -54 32 -268 422 15 -104 414 163 -37 -159 13 107 246 -7 198 -169 -225 -53 161 -154 -53
3087e3j57J20j37J19M13o67N21J13k13NO8m06J57L33j83J86q0PK6l06K43j17r1
$$ -53 -210 -90 -227 -108 305 -362 159 272 59 64 132 -274 -117 216 33 219 139 146 172 -134 109 -8 -99
3110i9J31k7K0R6l54M52k36q0K60l17J26J04m30K00J37m3M20n30J20M1K4j34K36
$$ -99 32 5 25 121 -233 219 -17 -97 163 -154 -28 76 -354 -154 -17 -60 360 -170 -50 -9 15 -119 117
3133A17r6K91n46M91K2m94K75O7l9J85l60o1M94l99Lqo6m3k05L86J79k28j68J93
$$ 117 21 312 -234 257 279 -215 60 127 88 273 -87 -148 346 -53 -50 -58 -124 -167 -372 14 193 -35 -203 -10
3157a0m5K8R7k6K64m48n4M27l78QK69j15P4j90J16M14m35L0J03o3j03j34L48j07
$$ -10 -55 -27 70 44 308 -140 -194 233 -145 -137 132 17 91 -99 17 431 -4 26 129 66 -37 -171 177 70
3181G0l01J07J83j3j67Q2L1j80K64l28O20l89J5J70k79J55mO7J57l68lK13j50
$$ 70 -231 -124 59 46 -121 -39 -8 -188 76 -252 368 -21 -6 164 -115 40 36 103 260 -108 -111 102 -48
3204d8l2J86q6m9J21j17r8j0l9K83k78m2N1J2J45k12K34j18M2J27k77J53J74r2
$$ -48 -80 106 20 -29 92 -25 -123 -133 -172 111 -167 -209 -158 -146 -1 -213 21 -97 -55 72 -205 -52 122 30
3228C0j21K10k48L59m45J15K29n0N4K3j83J4kK5j04N6J64k06j03K56p0o3n1j12
$$ 30 -91 119 -129 230 -215 -100 129 79 133 156 -27 -13 -15 10 -94 -38 126 -80 -183 73 3 -60 -111 -223
3252b23J55J44j67n4J67p4N68n41L43n3k99J62j07j54J48P1M4O8m18O22l57j86
$$ -223 -68 76 -91 -145 22 -52 516 -25 318 265 -34 128 21 -133 15 86 130 198 -220 402 45 -141
3274a41K31k04K23L2k88K41k37nJ92j34J93j02j53K8K20k59L78p0k57J53j63K35
$$ -141 90 -114 109 141 -147 94 -143 -148 44 -90 103 1 -152 -124 96 -163 215 145 -112 41 -122 113
3296A13p6k42K92Ko6J84k18M1J16k85K60k54k3J47j4J60p0l52K43Nk09N29l21
$$ 113 37 -205 87 89 23 207 -11 30 146 -139 121 -133 -156 -9 -23 137 67 -285 -42 -37 -246 283 -38
3319c8l11K27j60J18K38K9Qk68RK68k06J39j66j56N18l70J50J43j43o3o1Ql7J77
$$ -38 -349 -122 -282 -164 74 103 111 -157 -148 120 -86 53 -113 -269 249 -121 29 172 29 -34 -95 -87 -124 53
3343E3j21M5L3n8K1R4MJ34m83M10J8k91L34j31P3K9l01K08p1QP4r0J66j82J01
$$ 53 -68 -23 10 -48 -27 67 71 205 -278 132 150 -141 193 62 135 164 -137 71 0 8 82 -8 158 -24 77
3368G7K77l62j42M62m44K4L04m38L51k83J14m2k85L36J33k48K95k70K58R4l06
$$ 77 354 -8 -150 312 -132 -108 196 -242 109 -174 -60 -102 -387 -51 82 -166 129 -141 117 211 -95
3389i5j00L85l03J63l7l55L14K11o7J97l91j72L86k03k7K75k07R6k40J32J22m34
$$ -95 -195 190 -113 50 13 -342 -28 183 116 313 -78 -250 136 -67 -94 181 -26 70 -170 -38 84 -350
3411c50M26j71j07L04l6j83K26j78n3K49J27K18o71J86m0Q9J11l35L78n1m2j12
$$ -350 76 -95 -202 102 66 -117 109 -69 -122 127 254 472 -199 -13 -53 36 147 -188 190 139 97 -15
3433a5K72j46k01K24m35K09J35l60K60j2k8J07j01j53M41l25M2j81J52O7k26J03
$$ -15 257 111 -90 134 -301 -92 43 -317 -57 -69 -97 10 -91 -244 197 -128 -86 -267 -115 -48 -274 -171
3455a71K52k3j25k9K4L67n74N02k44O3j13j68K2K76k05j15M06m40K88o7q5K54
$$ -171 81 58 -67 -96 -72 295 -279 223 -21 42 -71 -239 -217 59 -146 -261 145 -295 -7 -74 -159 95
3477I5o17M17K73n2l9j23J48J13j76j1J72l51L55q7k53N71n31J72j06j04j52M20
$$ 95 -522 -105 168 116 77 -46 102 215 39 28 200 -151 204 117 -136 435 -96 76 -30 -134 -286 134
3499A34q1j42M23m90R7k45J65K43q2n2J20l30K69O6j68J96k59j06N71l00J16j33
$$ 134 53 -89 334 -156 -59 -304 -139 104 22 -30 90 -240 29 95 -73 123 -136 -242 329 29 145 12
3521A2J60P2k11p5N19n15L8N6j11N9j31O8L32m87K73Rk74L40l79L68k44j57J2
$$ 12 172 244 33 -42 477 -38 0 56 -55 4 -127 -59 273 -214 59 68 -206 134 -245 123 -121 -278 -266
3544b66L89mn0k42J64q6K46k27k0j0J67q0O8L91m48j61L27m8m4K00l19K47k19
$$ -266 123 119 69 -173 -9 -95 151 -76 -96 -106 61 -19 49 440 -8 -169 158 110 66 266 -53 194 -25
3567b5p7L54m35K26j76k33J31K89k1j49j04m4K74j20L08l78J69k60K99J37J44
$$ -25 -102 252 -183 43 -133 -366 -235 54 33 -116 -220 -264 10 -110 198 -180 -11 -271 28 165 309
3588C09l10P8pN3j42M1NO7p1l29L37j76J7J72j9n1k6J7K6m4llJ26K6k07K6K63
$$ 309 -1 77 70 123 -19 22 27 94 23 -306 31 -145 -128 44 25 -26 -52 -35 -9 -53 -56 -59 67 93 -114 -88 175
3615A75l2j82k74J70J38l4J6L53l09K34l20K4Pk67K18J32r4Q0J90k14mM0q0J71
$$ 175 143 -39 -313 -143 -5 -39 -23 330 21 255 -65 -41 -34 -301 -83 49 -45 35 225 11 7 47 -33 138
3639A38k09J52r6k29N10j20Q8j44j00J87p1j78K2j7kj14L09j2k54L4P5j4j59K40
$$ 138 -71 81 -15 -244 266 146 234 90 -10 177 106 -72 -50 -67 -69 -183 126 114 -140 -106 -31 -45 -204 36
3663C6r7J00J36k46J94j98m31N90p3j00K03l84O79j77j76J22l99K82J22j10l24
$$ 36 -61 39 175 -71 123 -75 -506 84 11 -89 114 -270 409 232 56 178 -221 61 183 73 -251
3684b51O36k94n0r6q3K26j10j36J91l11L68j61L0L90n96LK45q9K69m96J46N9J61
$$ -251 385 91 41 -55 -138 88 -22 -158 33 -278 90 -71 -41 349 -247 -244 1 -88 181 -315 -169 -110 51
3707E1j20J94k67L08l40J04M17l17l27K46j3J14k06L13j32p6j99L42j33K20j72
$$ 51 -69 125 -142 166 -174 -70 347 30 -297 -51 -64 50 -156 157 25 -51 -250 92 -41 179 7
3728GN7qk59Q6L2Rj06K31k64L58j14j73Q1J03q4J39k32J89o3n8J04J17l92L15
$$ 7 64 56 -203 -117 -85 -76 -182 49 -215 143 29 -144 -63 40 -44 95 -137 52 -11 -69 35 152 -240 75
3752G5j37j06J45j29M74j78l73P19l81j78%R3k43K45j66K73j48j42J63M3Oj46
$$ 75 -62 -168 -23 -152 322 144 -229 490 109 -69 -69 24 -219 26 -140 133 -15 -157 6 49 55 -91
3774i1L58k58k32j5L14j78p8O6K73n6M6k72L85l83P1J29p8J06k37n0N36k51M4
$$ -91 267 9 -223 -238 76 -102 -180 -114 159 103 149 -123 262 -121 -50 79 1 107 -130 -180 356 105 149
3797A49k0k45L7j78L72k00K86l12J55j74J28J07j25N02l64n2j83J73K46j28k01
$$ 149 129 -116 -79 -257 115 -85 201 -111 44 -130 -2 105 -20 482 118 66 -117 56 302 174 -27
3818b7J02pJ60j39k13K56k2k32L2K86o9j96O3L7k6r2J23o5j02K33K31k70O6j35
$$ -27 75 68 228 89 -124 132 110 -122 -90 196 127 -69 -6 31 5 -87 36 -29 -131 102 333 63 129 -6
3842fK92k00k09K33K7j48J62m0O3j86O6k46K26r9K2Q7j08K54j92K02j02l96J40
$$ -6 286 86 -123 110 137 -11 151 111 174 -12 54 -192 34 -65 -43 44 -64 190 -2 200 98 -298 -158
3865a58R7J89J0kOK2rk40j17J04K31m07M25j43k95K64j37J97K73l51j04L30j99
$$ -158 -61 128 138 136 142 164 155 -85 -202 -98 133 -274 151 8 -287 -23 -160 37 310 -41 -145 185 -14
3888a4j15J15j63N2o6J68k8j37m8K88m65L08M7p0L56j20j56n4Q7n2M91l69j05
$$ -14 -129 -14 -177 -125 -191 -23 -51 -188 -236 52 -413 -105 -58 -128 228 108 -48 -102 -15 -67 424 55 -50
3911e0Q9r0O3N0J26K1n56L80j35O9K26j13j10J70k93J81J01l16K18j73PJ92j01
$$ -50 39 -51 12 62 188 209 -347 33 -102 -33 193 80 -30 140 -153 28 129 -187 31 -142 -135 57 -44
3934d4kJ95l41K45j26Q6O1m3k1j0j56N14j53k53P8j18J07k0j12ol17N65j99J31
$$ -44 -46 149 -192 53 -73 13 74 31 10 0 -156 358 205 -48 30 -88 19 -1 -113 -119 -436 129 -70 61
3958F1l52L19r9J40l54M15j01k20L66j32j50j7K33k48K71k50J78L4j38n7K07m63
$$ 61 -291 28 -71 69 -285 130 29 -191 175 43 -107 -124 109 -139 132 -118 60 94 -44 -101 106 -357
3980c57L55o7L71p0k98J82k5k39o4K49j43Rm1Q1K56l75L69k42M5J22j61K55r1
$$ -357 -2 -69 302 232 -66 116 91 -148 -212 37 -106 -97 -138 -57 199 -176 193 -49 -4 118 -43 212 121
4003A21l16L29l78K26N9l8K81k97R0q4j1K01l9j46pJ28k07J54j12o1M13l07R0
$$ 121 -195 134 -244 -18 41 3 284 -13 77 -7 -18 183 144 -2 -9 119 -88 66 -46 -107 306 -1 89
4026H9J0o7J77m10P2K13j20K97m4j74J28o0n41M81j84L2K64k02K86n7m92M31l32
$$ 89 99 32 209 -201 -129 84 -36 261 217 43 171 111 -430 51 -133 -101 163 -39 247 190 -302 129 -203
4049b03J33n7R8Lj6J6K33l36K3L40l09m3M6n9K20k1Q7j38J45k97L98l91K41l19
$$ -203 -70 -127 -29 -26 -42 -26 207 -129 -106 234 -75 -118 -72 -131 89 68 155 17 162 -135 263 -128 113 -206
4073b06K5L88k7l87mK12Q1J40k11mj19O4K87k21j63K3k82N64j1j60n0q2J65ml8
$$ -206 -181 207 180 -207 -211 1 82 222 11 7 -112 -48 239 18 -145 -122 -404 160 149 -11 -61 -143 22 18 -20
4098b0LJ13j48j07J84Nq2N0L81k46l24M97k86l56L66j91p9K40k34L69j09j50J75
$$ -20 -17 96 -52 -159 25 30 -52 -2 379 133 -191 306 20 -336 30 -161 -240 0 -234 135 26 -124 51
4121E1j13j27J2M11O6k17l41N30l12j15L76j82j20k25M04k8J62k40j15J59J39
$$ 51 -62 -189 -177 234 300 83 -258 272 -40 -155 221 39 -81 -306 98 70 232 -8 -123 36 175
4142A75ok56l9N2K17l14J09Q2j81R0K45j65J06p8k59K26L67m83j59J65J6m4j21
$$ 175 169 -87 -126 -74 143 -171 -62 20 -161 -71 174 9 115 37 -222 4 371 -112 -271 -106 -90 -134 -255
4165b55J91J93j41K34m8k59J92j80RJ51j79MM0M3r0j83J92o0j29M83j16l11Q2
$$ -255 -64 129 -12 222 174 -85 107 -73 -64 87 -92 -88 -48 -5 -95 -278 -86 -146 -275 208 92 -219 -137
4188a37J63Q1j15j04R5L18k00o8j67k4K02Q0K9o6l07J62K33k44P1J3Q1j92J13
$$ -137 26 107 -8 -112 -17 301 101 33 -134 -158 44 124 153 87 -220 -58 175 -69 2 15 96 -96 17
4211A7j36J25j04J5J0M40m61L1k02K24k70M6O01l41Q3r1k8K81j33j56K17K4l7
$$ 17 -119 6 -98 -83 -73 367 -94 -63 -265 -41 -311 -265 336 -5 78 -13 -41 240 107 -49 168 192 155
4234A55k48K92j06o9O5k45Q1N7k34K50J52l02O1j55M17k16o0j90K12Q1j46R1K1
$$ 155 -93 199 93 24 89 -156 -75 -18 -252 -2 150 -152 -91 -246 171 -45 -105 -295 -83 -2 -148 -57 -36
4257c6K2J03k7q0J11J32j90n6nR2j10M3k8J66j38j79J47nk2J69j18r0j89L54l00
$$ -36 -14 89 62 -18 93 225 35 -21 -26 66 -44 -1 -29 137 -1 -180 -33 -38 -60 109 -9 -99 -288 66 -234
4282b34J11k9OJ26J0Qj61K00k75L38m1K4M3Kj09j1K08k38K44k35j59L57J09l12
$$ -234 -123 -152 -146 -20 -10 -2 -163 37 -238 100 59 83 126 128 19 8 216 -22 222 -13 -172 185 294 -18
4306a8j82L28j38J8l0K13M4ol36M3L5o5o7K06k2r1K25l61J99J32k89P0J9Q3L01
$$ -18 -200 128 -10 8 -22 191 235 229 -107 -64 -29 -94 -161 45 23 -68 157 -204 -5 127 -162 -92 -73 10 311
4331C11j53j57J94n3J17l16L08j98j64O7J95l85K71J08m44M52N5O7k80O9Km3l12
$$ 311 158 1 195 142 259 -57 251 53 -111 -44 151 -234 37 145 -299 153 208 275 -5 64 66 23 -289
4354b89M31j39J50k06r5L24k3J1k1K8l62M69j59n9K8j53k4O3m81M16P5oq8j06
$$ -289 142 3 153 -53 -148 176 153 164 143 171 -191 278 119 60 88 -65 -89 -26 -507 -91 -16 -22 -110 -216
4378b16J81K01l24K44j45Q8k04k5J13K19j0J8n9l9j0Kk34P3J4J91rj93K80k56
$$ -216 -35 166 -158 86 -59 29 -175 -200 -87 132 122 140 81 42 32 34 -200 -127 -113 78 69 -124 156 -100
4402a00R0N2L2l7J81k56J19j71L3J86j76p9N6j80M70m3j10Lj47J00J33k92L34
$$ -100 -10 42 74 37 218 -38 81 -90 -57 129 -47 -126 -70 -250 220 177 67 70 -77 23 156 -136 198
4425A98j05l7j31J63k38M73l93J71P6k04J23j15J22j34o4Q9l8q9K56j52P2l9j8
$$ 198 93 56 -75 88 -150 323 -70 101 177 -27 96 -19 103 -31 -95 -6 -44 -133 123 -29 43 4 -14
4448a4l5J71n6n6O2k17J77J86O6q1j80j24j66K51p8L50k71L28k21n0J12l40K18
$$ -14 -49 122 66 10 72 -145 32 218 284 203 23 -101 -267 -16 -94 256 -15 313 92 42 154 -186 32
4471C2j87J78o1k5r4J70l34M69k57M7K75l04L40k21j11M09k59K7q9L42l03j17
$$ 32 -155 23 -38 -63 -157 13 -321 148 -109 -62 213 -91 249 28 -83 326 67 94 5 347 44 -73
4493g3L8k25M14l38N37l30K92m77J53K5j6j56k8J04K18o9j37o8J81l57L71j24
$$ -73 -35 -260 154 -184 353 23 315 -162 -9 16 0 -156 -184 -80 138 69 -68 -136 45 -312 59 -65
4515f5L01l9m8k41K0J93J87n4k27K90l42J42K22k44J1q4k84J34N9L1kp8M07l90
$$ -65 236 197 149 -92 -72 121 308 254 27 317 -25 117 339 95 106 22 -262 -128 -69 -38 -40 -118 289 -101
4539a01k8J36K91l14J51q4j31L73l23oj9n3K79l83K76m9j80K74j13L7J57j9k3
$$ -101 -129 7 298 -16 135 51 -80 293 -30 -36 -55 -108 171 -212 64 15 -165 109 -4 33 190 171 148
4562A48j66p1J82n2r7k6lJ26r3o9L93m10k9K78l4q8R5k03J76N0j05P7J23m31L36
$$ 148 -18 -89 93 41 -56 -82 -85 41 -52 -121 272 -138 -167 111 77 -11 84 -119 57 107 2 79 202 -229 107
4587A07j07mj38K76j24M9j07K8j31K10M7l71J57L06l07J17k4O3J29j11J02l43
$$ 107 0 -4 -142 134 10 59 -48 -20 -151 59 106 -265 -108 198 -109 8 -16 47 176 65 167 -176
4609a76K18m2O0k08J38J83j45J0L7K8k3l14M97k95j1J34r2J3L62n73J80N1j71
$$ -176 42 0 60 -148 -10 173 28 38 75 103 80 -234 263 -32 -43 91 -1 12 374 -199 -19 32 -139
4632a39j27K13r7K33j96O3L19m09L90l56r6J35J41q1J8Q9o8j17K07J07l26J17
$$ -139 -266 -53 -150 83 -113 -50 269 -140 250 -106 -202 -67 74 -7 11 100 32 -85 122 229 -97 20
4654B0p0j99L72o3j21Jl5J05n3K30j41k21L82l28pJ15p6j0K62k35j48J78L9j68
$$ 20 -50 -249 123 60 -61 -60 -95 10 -43 187 46 -175 207 -121 -128 -13 -89 -99 163 -72 -220 -42 -3 -171
4678a71M95m85K29j72n2M46m19N1L46l9j91Jl17L41k28J76J9l43K77R2m01K42
$$ -171 324 -161 68 -104 -156 290 -129 -78 268 229 38 39 -278 63 -165 11 30 -313 -36 56 -345 -103
4700a03R2NJ03l84L02m5J16j02n7P0J79l40J99K51m96K36K21l10J94Q9j16k59
$$ -103 -11 -6 97 -287 15 -30 86 -16 -73 -3 176 -164 35 286 -210 26 247 -63 131 220 104 -155
4722a55O1K70l20lP3j14K29o0M6j89R0N3K4p3j68L47Kj89R3Q4j39K16K5k15j04
$$ -155 -94 176 -144 -147 -74 -188 41 -19 27 -162 -72 -19 5 -68 -236 111 113 -76 17 101 -38 178 203 -12 -116
4747a16K77k05L6J24o8j16K4k67L13Q6l0m6j3j5J69l11J20n5O2K80k34M9j29j67
$$ -116 161 -44 -8 116 48 -68 -44 -311 2 88 58 12 -1 -16 153 -158 -38 -93 -31 249 15 64 -65 -232
4771b32o7L94j71J98o0j88K28o8k63M00k40J13l1l7J52k21J13lJ27k1j20m2k8
$$ -232 -299 95 -76 122 62 -126 102 34 -229 171 -69 44 13 -24 128 -93 20 17 144 123 3 -39 -67
4794f7j3K56k94l77N95k22O8J44n0j48K07j56O9l5n2n1J70l7n1JP8O0j68R5L01
$$ -67 -80 176 -118 -495 100 -122 -54 90 40 -108 99 -57 12 -23 -75 -126 44 7 -44 -43 35 95 -73 22 323
4819C23l68L8j99K49N1j31o0j6K50l22K56O4k33J58J8J5j55Q4j31J76k24K21J40
$$ 323 -45 -7 -206 43 94 -37 -97 -113 137 -185 71 135 -98 60 78 93 -62 22 -109 67 -157 64 204
4842B04k13M6j04O6J19k20J22O0j09o0J43m0Jl01J94o5J49j93n6L49NK84n08J37
$$ 204 -9 37 -67 -1 118 -102 20 80 -29 -89 54 14 15 -286 -92 -157 -8 -201 -257 92 97 381 -127 10
4866A0K4k12L11j00P2k13R6J93k60J8K21j58J80j51J16l42K94k23O0O9j97M38
$$ 10 34 -178 133 33 105 -108 -12 181 -79 -61 160 2 182 31 147 -195 99 -124 -64 5 -192 246
4888B46k58m0J17j51J30KNj1K2Mlk62MK42J62k72m0k36O60n07J73K04l61K20j4
$$ 246 -12 -52 65 -86 44 46 51 40 62 66 63 -199 -195 47 209 -63 -103 -339 321 -186 -13 191 -170 50 36
4913C6J07j61p9J22j83O4k84R5J43J48J3j01R7j23j01K41k12K67l32L2N08j47
$$ 36 143 -18 -97 25 -158 -94 -378 -283 -140 8 21 -80 17 -106 -207 34 -178 89 -243 -211 297 150
4935A50j83J22M1k13L07O2j28k24P4M6O2k28K39j89R8J5j35J82l4P5L2n14K18
$$ 150 -33 89 130 -83 224 286 158 -66 8 54 116 -112 127 -62 36 51 -84 98 64 139 171 -343 -125
4958a25J43k08N4J60j14J61n8q3J34j65o3J63J02l00N28l91K70k25k5k05L11P5
$$ -125 18 -190 -136 24 -90 71 13 -70 64 -101 -164 -1 101 -199 329 -62 208 -17 -42 -247 64 139
4980A39l15J49Q6j85J83O5k09k42K48j21Q0J21k48J52J36j68L1J54j21K51j38
$$ 139 -176 -27 59 -126 57 122 -87 -329 -81 -202 -122 -1 -249 -97 39 -129 -98 56 -65 186 48
5001D8p2N2L1j01n8j2N9J0J06O4j88J75p2j00K3r2j9Q9Q0O7j76r6J11j4N8R2k82
$$ 48 -24 28 59 -42 -100 -112 -53 -43 63 127 -61 114 42 -58 -35 -127 -146 -57 23 90 -86 -182 -71 -85 -27 65 -217
5028b17J84k01L98j0j51R9j81K11M3l3l10K42J18k90K21j83L04j98j5N5p9j46
$$ -217 -33 -234 164 154 3 102 -79 132 175 142 -168 74 192 -98 123 -60 244 46 31 86 7 -139
5050a39J11k22O0J83j25L65k88M4J07m34K95o7k2K47k86K43q5J88j82O3k03M1
$$ -139 -28 -250 -190 -7 -132 233 -55 -11 96 -338 -43 -110 -132 115 -171 72 -13 175 -7 56 -147 -106
5072a06J34QJ58l14J74q0j00L96m85K55l98K71j61L37l36m4K08j82J98k3J13K4
$$ -106 28 36 194 -120 54 -26 -126 270 -215 40 -358 -87 -248 89 -247 -291 -83 -265 -67 -90 23 47
5094D7m5K44k07J81k22j52K37l17K21J80k2J07J2j15J7k15O4k35K91j42J35k23
$$ 47 2 246 39 220 -2 -154 83 -234 -13 167 145 252 264 149 166 -49 15 -220 71 -71 64 -159
5116a59K53l02R4J03k04K83q5M1K2j87L65k84J95j81l3j34K94q2O1M2m8j29L56
$$ -159 94 -208 -114 -11 -215 68 -17 24 46 -141 224 -60 135 -46 -79 -213 81 -1 60 102 54 -75 281
5139B81o9l77L10j42lj30J69o6J8p%kj94J30J58J50j55k8J38l5k05J12j75o2K43
$$ 281 212 -165 145 3 0 -130 39 -27 -9 -16 -16 -18 -212 -82 76 226 71 43 181 146 -59 53 -122 -184 59
5164E9l4R2j69P7J56l54J15J32r3j07J82p5J07j82O3J20j80R3Q7q9k3p0j00K57
$$ 59 25 117 -52 25 181 -173 -58 74 -19 -126 56 -19 88 -94 -31 89 -91 2 89 0 -23 -93 -193 64
5188F4L0j18k20L3J06K91l9j3j08J43j65O5rm0m5J6r9M56l29o4L18m38M2K94n
$$ 64 94 -24 -244 -211 -105 186 147 134 26 169 4 69 60 20 -25 -9 -108 348 19 -45 273 -165 -123 171 166
5213A66j73M6k70K62K23k3j32j8k20J38%K40p4l5L5k68O1J10o3j94J38K04j21
$$ 166 -7 39 -231 31 254 231 99 81 -139 -1 -1 239 165 130 165 -103 -42 68 5 -189 -51 153 32
5236C2j16Q0P8j87J42J4k18L43q5J19k39L16k41m10O54m60O3o5K59k3r9J67k07
$$ 32 -84 -4 74 -113 29 43 -175 168 83 202 -37 279 38 -372 282 -178 -115 -180 79 56 -43 124 -83
5259h3J36K09k91L66n08K03j23K15q0J0j98Q0pj80M69m34K96l3r7n7J62m6J8R
$$ -83 53 262 -29 337 -171 32 -91 124 44 54 -144 -64 -71 -251 218 -216 80 47 -50 -107 55 9 27 36
5283C6M8k04K4J95p1J29j35j55J55j6j87J83M04n52K81m8j57N9J43j47R3l72J37
$$ 36 84 -120 -96 99 28 157 22 -133 22 6 -181 2 406 -146 135 87 -70 -11 132 -15 78 -294 -157
5306a57K27J05j54j57M3j70oK20j02K26j08k03J20K76j76K24k10J4L9q2K00l5
$$ -157 70 175 21 -136 -93 -263 -269 -49 -151 75 -33 -236 -116 160 -16 208 -2 12 51 -31 169 134
5328A34j87K04o5j09J76k50L24j20K45l59k8j79K09q1K63m43L12J08m74K11n1
$$ 134 -53 151 86 -23 153 -97 227 107 352 -7 -35 -214 -5 -86 177 -266 46 154 -320 -109 -160
5349a60n1K7K12k71L29j24R9m1k2M35l49r2j75K99k88J92P5k2j36K22J68l24k05
$$ -160 -211 -184 28 -243 86 -38 61 20 -2 433 84 -8 -183 116 -172 20 95 73 -63 159 327 3 -202
5372b02K74J99l81j5J9J01M1Qr7j15lL28k70K0m3K61o4l4j45N20m58J45p6Np1
$$ -202 72 271 -110 -125 -106 -5 36 44 -53 -168 -171 157 -113 -93 -136 125 61 27 -118 402 -56 89 13 18 -53
5397e3J52j25m4N8m0K49l83J53J46j24J57j55j15L2R0j61K05J55j26q3q2qp0K35
$$ -53 99 -26 -70 -12 -52 197 -186 -33 113 -11 146 -9 -124 -92 -2 -163 42 197 71 -12 -94 -102 -172 63
5421F3r4L21l00j49O4J72j29J2J47l7l1n2j40J05R2j55j9J71J82k90o4qj75L24
$$ 63 -31 290 -10 -159 -95 77 -52 -40 107 70 39 -13 -153 -48 44 -111 -130 41 223 -67 -131 -139 -314 10
5445A0O9k48j43K12l7J58K12j03k0l0j37J25N7k4m5k39K95r9j4J00P1l80J30n1
$$ 10 79 -169 -312 -100 -137 21 233 130 110 80 -57 68 125 101 56 -183 112 13 -1 99 170 -210 -80 -131
5469a31J98j06J5K48l10K44j08k89K91n4j1J67Q7j35k60J87LK6l3m2O9j29M4k64
$$ -131 67 -39 -24 224 -86 158 50 -239 52 -2 -13 154 241 106 -154 33 36 62 29 -13 56 -73 -29 -293
5493b93K41R4j61P6J73m16J26Q8R7r8LJ16l4P7M2j66K11j2k69K7J95J21r7l10
$$ -293 -52 42 -119 -43 130 -286 -160 -72 25 -73 -70 46 12 89 131 -35 176 164 -105 -78 117 238 141 -169
5517a69pL79j20k34K7L02j54j24M6K23j10J4K41l58o5n2J32K21M5l26J72k53J63
$$ -169 -176 203 83 -151 -124 178 24 -100 -54 169 59 73 314 -44 -109 -161 -29 192 237 -89 83 -170 -7
5540gp2J63L4Jjk13M61n08J59J32%r4k23J02R3K07k60k04K03r3L21Q3l14m8J90
$$ -7 -79 84 118 119 118 -95 366 -142 17 149 149 55 -168 -66 27 234 -26 -230 -27 -120 201 284 -30 -78 112
5565A12m51O31l86J07l6m28K35K14Q7R7k17k33M38j54J03n9o5j93M2J03L83l05
$$ 112 -339 292 -94 13 -23 -451 -216 -2 85 182 -35 -268 170 16 119 60 -5 -198 -156 -53 330 25
5587B5J6kO6p3J30k96J45k00L90p2m14N10l94P9K45j61lJ60j52j23o2K42n4j0
$$ 25 41 39 105 32 162 -134 11 -189 201 129 -285 225 -169 -90 155 -6 -9 151 -1 -124 -186 56 2 -8
5611hK16k95J92KN3n7n4J1j14k8J72J02j76J65k58j40J84j67M20m93L59n3O2k16
$$ -8 208 -87 105 107 160 103 49 60 -54 -82 90 192 16 181 -77 -217 -33 -200 220 -273 86 33 95 -121
5635a21J81k06M53k77j41K16k64J82o7J66j70n2J19N1k25L11k00O4M36n48L10
$$ -121 60 -146 307 30 -111 105 -159 23 -44 122 -48 -100 19 70 -155 156 -44 20 456 -92 218
5656B18P0l46K5j03J42o4p7J38l6J01j62Q5P7j02O9J9m3L9O4j58J90k1j48k47
$$ 218 288 -58 -33 -136 6 -58 -135 3 -33 68 -94 -9 68 -34 35 54 11 50 114 -44 146 125 -23 -270
5680b70L04J0P1L1r2k4N4J17k33J71r8k8R7l77J56K14J28k52q4N0L1q4P2k31O5
$$ -270 34 44 115 146 54 30 84 201 -32 139 41 13 110 -267 -111 103 231 -21 -105 -55 -24 -108 -36 -267 -202
5705b02K6J92M8j25k80M21j43j76J55L29k07k7J49r5K1P9j63o1J27K8n9n9J63
$$ -202 -176 16 64 -61 -341 80 -63 -239 -84 245 38 11 160 65 86 165 2 -59 68 96 37 -22 141
5728A41j23j77%M3j54L71k50K24j81j30L60j16K94k46j06l1N9Q2r9K58j71j4N3
$$ 141 18 -159 -159 -116 -270 101 -149 75 -106 -236 124 8 302 56 -50 -81 -22 60 -39 219 48 34 87
5751H7r7J49j86J49N7k01JO4J7k85O4J90J09r6j8q8J73j4J06r9p5J23j48N8Oo9
$$ 87 -10 139 -47 102 159 -42 -41 23 40 -245 -181 9 118 22 4 -84 89 75 181 82 7 130 -18 40 46 -23
5777b3M1m5L88o63L55J59l22K10k3r3m3Q4j38l9J02J33o8j86J70K90l89Nj29K68
$$ -23 18 -27 361 -302 53 212 -110 100 77 -16 -59 25 -113 -152 -50 83 15 -171 -1 289 -100 -95 -224 44
5801D4M8k56L79k65rK10j41K22Q9k75O1j55J27j86J45p5J32J4r9n0r7pN5K06n
$$ 44 92 -164 215 -50 -59 151 10 232 321 46 107 -48 79 -107 38 -37 95 109 10 -40 -137 -144 -89 117 112
5826A12k63Q8P2L6k37n3J73J32l12K42N5j4J56j55L5Q4l0j56m5J0L9J18J9j09
$$ 112 -151 -63 9 45 -192 -245 -72 60 -252 -10 45 31 187 32 67 151 121 -35 -80 -70 -31 87 106 -3
5850cJ8j39L03k03J62j27m7J30l36J92K34l05j45K09k9O5J55l17O6r4L69k18R9
$$ -3 15 -124 179 -24 138 11 -36 94 -242 -50 184 -121 -266 -57 -86 -21 134 -183 -117 -211 158 -60 39
5873C9k3O5O3n8On0M0m2R2O6k1Q6l07l45L93j11J02k2n7K50k34oP7k60L04j84
$$ 39 16 81 144 86 92 42 82 40 132 198 177 263 -44 -389 4 -107 -5 -27 -84 166 -68 -74 3 -257 47 -137
5899a37J06J20p4j06O3J81j18j19J19k8M7j78J27J70k85J25J17l29K35j27R5k09
$$ -137 -31 89 15 -91 -28 153 35 -84 35 7 54 -124 3 173 -112 13 130 -199 36 -91 4 -205
5921b05J90k46J00K70J50j91k19J16M2qj7Mk21J01j39K57l92M57K0j80J8q3m9
$$ -205 -15 -261 -161 109 259 68 -151 -35 7 -1 -18 -14 -235 -134 -273 -16 -408 49 69 -111 -93 -176 -225
5944b25M60m40L35j69J83j61l3J71J2j95M01k58j18l7p0J75j13J42Jj16q4K39
$$ -225 235 -205 130 -39 144 -17 -50 121 133 -62 339 81 -37 -74 -144 31 -82 60 61 -55 -139 100
5966A00J02O3j08m3j45P4r7L36k00j21K6M2P6P7j52j19R4J30p6j37n1J58j41J34
$$ 100 202 265 157 114 -31 43 -54 282 82 -39 -13 29 105 182 30 -89 5 135 59 -78 -129 29 -112 22
5990B2k06P9L38l80K89Q0j73m3J1J95j52k59O8K44J7j53K34k89PK83j08k49J29
$$ 22 -184 -105 233 -147 142 222 49 6 17 212 60 -199 -131 113 130 -23 211 -78 -71 212 104 -145 -16
6013a6k1j37R1J13j06j08R1J22J6K22l50L2K7K81k90j03n8K07q3M0J26k70L34
$$ -16 -37 -174 -83 30 -76 -184 -93 29 45 267 -83 -51 -24 257 -33 -136 -194 13 -70 -30 96 -174 160
6036A60J24k03J19m94M35J06r8l71J59k35N76j90P9j90N2K50m30kK9k7J35J3J14
$$ 160 284 81 200 -294 141 247 149 -222 -63 -298 278 88 167 -23 29 279 -151 -153 -124 -151 -16 -3 111
6059A11k73R5j03l2K15N9Q1j83L9q2J78l30J30m2K48k3K79k78k31k08K95K74j36
$$ 111 -162 -67 -170 -202 13 72 153 -30 9 -73 105 -225 -95 -137 111 88 367 89 -142 -350 -55 219 83
6082H3K1j79O0k13J99J34j37L1L3k12j6J24OJ30L58k27j39J84j11j94q3J88L9
$$ 83 104 -75 -15 -228 -29 105 -32 -1 32 -180 -196 -72 -66 64 422 195 56 240 129 -65 -148 40 79
6105G9nJ01k71J66Nj87K05l2o5k6j18L1J50j56O4J39J02j75m1J30j81k30M99j28
$$ 79 74 175 -96 70 75 -112 93 61 -4 -30 -148 -117 33 -123 -59 80 182 7 -34 96 -85 -315 184 56
6129E6M0j9m4o1J16l2L7J82k86M2k02K67Rj23o5K70p8p5Q6J09k99JN1j04O6L88
$$ 56 96 77 33 -28 88 56 93 275 -11 31 -171 96 105 -18 -83 187 109 34 120 229 -70 -69 -18 -122 -56 332
6155C32l51Mp6P6J24l43L05j90K97lj54P4N7j2q9L8k79J86Q8j51K89j72j46J71
$$ 332 -19 -15 -91 -15 109 -234 71 -119 178 175 21 95 152 140 51 89 -190 -4 84 -67 222 50 -96 75
6179G5j15J05MK0j61jr7K19k96K92q7k6k13J33M4L44j60j43J70k83L10j64K4n4
$$ 75 -40 65 69 89 -72 -73 -170 49 -247 45 -42 -68 -281 -148 -104 240 80 -63 107 -176 134 -30 -6 -60
6203f0k21K21J60j61l1L3J44M0k80L12N3n46L95j35K13l40J74L9p6K63j51K08
$$ -60 -281 -60 100 -61 -92 -59 85 125 -155 157 210 -336 59 -76 137 -203 -29 10 -66 197 46 254
6225B54j03k17j03j7J54K16L2o6l78K73K40l04J50k51Q8J23j58K92l68L8N2j81
$$ 254 151 -66 -169 -186 -32 184 216 150 -228 45 285 -19 131 -120 -32 91 -67 225 -143 -105 -53 -234
6247b34K78k27K36qj23J24P2k22K83n8j57j13J35J78k59J33l8J17j75J23k50K21
$$ -234 44 -183 53 45 -78 46 118 -104 179 121 -36 -149 -14 164 -95 38 0 117 -58 65 -185 36
6269C6K5J14j96J20j45o3R5j64M37j58l06J99j07K67j14jN0k48M52n31J89J61
$$ 36 61 175 -21 99 -46 -109 -14 -178 259 101 -205 -6 -113 154 40 39 89 -159 293 -238 -49 112
6291A12l78K63Lk57L19l8J16j50j00K95l50J46J89q2K4J21l16oj8q7M97k59K3
$$ 112 -266 -3 0 -257 62 24 140 -10 -110 185 -165 -19 170 88 112 233 -83 -89 -107 -194 303 44 67
6314F7K2J01l45J75l9n7QJ06J5j08p9K39P0Lj23m9P1j22L07m46L03J30k67K66
$$ 67 89 190 -155 20 -19 -76 -68 38 53 -55 -134 105 175 178 55 6 77 -45 262 -184 119 249 -18 248
6338B48l65J26L6o4L9m0j66J92KN2r8K9N1j94K19K67k47j73K90l39J73l8M2n8
$$ 248 -117 9 45 -19 20 -20 -186 6 8 60 -38 -9 42 -152 67 334 87 -86 204 -135 38 0 42 -16
6362a6lj35J36R6j03N2p3L8J77n53M62j83J98M3j12M2k01J96O4k00K9M7j25J89
$$ -16 -19 -154 -18 78 -25 27 -46 -8 169 -384 78 -105 93 136 24 66 -135 61 125 -75 -46 1 -124 65
6386F5r5m2n2J07K19j48k42K43j87J15R3j87J40j64r1J07j6J33p7J38j03m8j7
$$ 65 -30 -72 -124 -17 202 54 -188 55 -132 -17 76 -111 29 -135 -226 -119 -135 -2 -79 59 -44 -92 -109
6409a09L29l33n3R8j6l2Q4Q4R1j69O4p2n1j31J24o8R1J48l02L21k6j93J43o0P3
$$ -109 220 -113 -166 -68 -84 -116 -32 52 143 -26 38 -34 -85 -216 -92 -160 -69 79 -223 98 72 -121 22 -38 35
6434C5r4J22R6j93J1K88k84q7J86o0p0Q9k34M2M48k10l39J71j38L10l12M90q8
$$ 35 -59 63 159 -34 -23 265 -19 -106 80 20 -50 39 -195 -153 295 85 -254 -83 -221 89 -223 267 179
6457A79k36J26o3r2J66j66Q8Pj70M88m46Q8m3J10L2Q6k34N1k37K58j75L25l58
$$ 179 -57 69 6 -86 80 -86 2 9 -161 327 -119 -31 -74 36 68 154 -80 -29 -266 -8 -183 142 -216
6480b16L95j81k02J75j42M24k38M9O4j84K05P5k54j2K1J98k03l5J23O0k66M18
$$ -216 179 -2 -204 -29 -171 253 15 64 128 -56 149 224 -30 -42 -21 177 -26 -61 62 122 -144 274
6502B74n15K23K41l82J6K37jl7j09l49M84p2j42Q6k3J71k77M10k25j7j8N7J18
$$ 274 -241 -18 223 -159 -143 94 93 56 -53 -402 82 10 -132 -46 -69 102 -175 235 10 -7 -25 32 150
6525A50O1Ql80p5K98%k14Q9r7K3J90j8P7j14J75j05k29Q3j58J65K8L58j61l79
$$ 150 211 219 -161 -236 62 62 -152 -63 -160 -137 53 35 112 -2 173 68 -161 -78 -236 -71 -43 315 154 -225
6549b25M00n3k40K50j62k9K71j09j88J25j4m7j13k4O9K24Q1j24j33k12M41l18
$$ -225 175 122 -118 132 -30 -59 212 103 -85 40 26 -21 -134 -158 -89 135 216 92 -41 -253 188 -130
6571a30j33J42K80j63j0j42K08l09M54j97k9lR9K7j30O7R8j17l22L23j00N4L1
$$ -130 -263 -121 159 -4 -14 -156 52 -257 197 0 -29 -32 67 94 -36 31 129 12 -310 13 -87 -33 -2
6594bQ2k10rJ89J48l24J81k36K74J8k07J16J89k00kj17J22j20J41k6K25k32JK26
$$ -2 80 -130 -139 50 198 -126 55 -181 93 111 -96 20 209 9 7 -110 12 -108 33 7 232 0 1 227
6618B27k09J14n7K4k35PL5J35j61L28k52K5N7n3R2j28K8J16o7j98L06k05K2J02
$$ 227 18 132 75 99 -136 -129 -94 41 -120 208 -44 -19 38 -15 77 -51 -23 93 26 -172 134 -71 -49 53
6642E3q3Q9Mk19L71j62k36K88P4O2k93m8j25N50q4k94J63k23J22j36N9J01K2j23
$$ 53 -30 59 63 -156 215 53 -183 105 179 241 -52 -100 -225 325 241 -53 110 -113 9 -127 -68 33 55 -68
6666f8k5J57j23k20L80l41L35j52O0n7K32m1l84L02j23R3j12L08j50J04l65J07
$$ -68 -93 64 -59 -279 101 -240 95 -57 3 -54 178 137 -247 55 -68 25 -87 221 71 175 -190 -83
6688h3N1J47j26M1R9nj98K97j34O3l62J89o6j15J46k94K66J75l68k0J10K87k34
$$ -83 -32 115 -11 30 129 124 -74 223 89 152 -210 -21 -87 -202 -56 -350 -84 91 -277 -297 -187 100 -134
6711a34L99k49j86K29k4J73j79pm1J07j2q7m5k61O8L41N1J25l06R9k13J76k0J45
$$ -134 265 16 -170 59 35 208 29 22 -19 88 76 -11 -56 -317 -249 92 143 268 -38 61 -152 24 4 149
6735A49p6j37j35Q3K22k19J99k75L23o9r6J48l25J59Q8j43M4j0R2j40R0k61N37
$$ 149 73 -64 -199 -116 106 -113 86 -189 134 65 -31 117 -208 -49 39 -104 -60 -70 22 -118 -28 -289 248
6758B48l27j41M94l57R1J30k30j13K81O6j48J2pJ82m35L65j05Pl4o6J70k27J80
$$ 248 -79 -220 274 -83 8 138 -92 -205 76 142 -6 6 -1 181 -254 111 6 13 -21 -87 83 -144 36
6781C6k50K38j57J86j56M3R7L3mj30P5J06N5k64L0J09l7j97J38j5j29J4K11R1
$$ 36 -214 24 -133 53 -103 -60 37 70 66 -64 11 117 172 -92 -62 47 10 -187 -49 -64 -193 -179 32 123
6805A23j3j40Q5j2k87J18M04l02K47j88J7p1m9N7K14k14j33K36k08m2J60Ql3J
$$ 123 110 -30 55 43 -244 -126 278 -24 223 35 52 -19 -68 -11 203 -11 -144 92 -116 -158 2 10 -23 -22
6829b2l44M08l16R1K31q2M3n7j80J31K7Q5J14j41j21K53k29p3R2QK1l1J61K72
$$ -22 -366 42 -274 -183 48 -34 9 -48 -228 -97 -70 15 129 -12 -133 120 -109 -182 -90 -82 -61 -92 69 341
6853C41j90k26J44M3j50oj00J51j08K29j78J16k69L07J81j35q4R9O5l00K15m14
$$ 341 151 -75 69 112 -38 -44 -144 7 -101 128 -50 66 -203 104 285 150 66 165 230 -70 145 -269
6875b69L39k0N3J74r1r6Q3j58j18j05M03k60J11R0l51J50l5J15k74K84j36M2R0
$$ -269 70 50 103 277 186 90 173 15 -103 -208 195 -65 46 136 -215 -65 -100 15 -259 25 -111 -69 21
6898B1j56n9J17J15l5j17K24k26O9j10N9K15m58M09j19Q2n4n6J33j72k8K26j48
$$ 21 -135 -194 -77 38 3 -114 110 -116 -47 -157 -98 117 -341 68 -51 31 -23 -79 54 -118 -146 80 -68
6921f8K00j79M9J8K79l5j08k05J1k4j11L49k33p6K00p7O3j69J76J32j67J9Kj12
$$ -68 132 -47 2 20 299 264 156 -49 -38 -62 -173 176 -57 -133 67 -10 53 -116 60 192 25 44 46 -66
6945f6L6N3J38q5k46J71J53l04K89j17J25l2k16jP7p4K59j49p8J18P3k50K5j9
$$ -66 -30 23 161 76 -170 1 154 -150 139 22 147 115 -101 -102 -25 -99 160 11 -67 51 124 -126 -101 -120
6969a20L38Mk79J81k2j19k3j1J31m9j90J83j36q4P1K71l31nJ89k6l7l7p4M61k77
$$ -120 218 222 -57 124 102 -17 -40 -51 80 31 -159 24 -112 -196 -125 146 -185 -190 -1 -27 -64 -101 -175 286 9
6994IL9k21L26m6j1j76K16j75J74J82m05m9J43J43m46K70j17j79L04o8j34K30
$$ 9 48 -173 153 107 96 -80 136 -39 135 317 -88 -137 6 149 -297 -27 -144 -323 -19 -87 -221 9
7016IJ79k10J26k62J32K27l23K18k17o4K05j97L2o2L39j5j23j43n7M23l17M86
$$ 9 188 -22 104 -158 -26 201 -122 96 -121 -185 20 -177 -145 -207 132 117 -6 -149 -206 217 -100 386
7038C86n16k7k4j15K74n5r6O6J04R0p3o8Q0n5j46K37j94J03J29O6J51k43k10J00
$$ 386 -130 -157 -181 -296 -22 -77 -173 -107 -3 87 14 -54 26 -29 -175 62 -132 -29 100 166 317 74 -136 -36
7062c6J53j53N4l3J92O6k33l9k3ro9P5j1q2K48J05n0Ll18P2J50j36J00o2M2Q5
$$ -36 117 -36 18 -15 177 243 10 -29 -52 -61 -130 -55 -66 -148 100 205 155 158 -160 -88 62 -74 26 -36 6 91
7088I1j26j04j0L95j82J37n2n4N1j39J26m6j60L1n7M6j74J96j89K02K08k95J86
$$ 91 -35 -139 -149 246 64 201 149 95 146 7 133 87 -73 -42 -99 -53 -227 -31 -220 -18 190 -105 81
7111H1O3j98L1J89k05j56N5q9O7J76j59R7j8l1l7K51k58J35LJ76j27k34L98l87
$$ 81 144 -54 -23 166 -39 -195 -140 -229 -162 14 -145 -48 -66 -97 -134 117 -141 -6 -3 173 46 -188 210 -177
7135a77J87J37J02l48K24P4M5j14j64k43M00j62J46j42O4j0k4n7N9m3j8J67k33
$$ -177 10 147 249 -99 125 199 244 130 -34 -277 123 -39 107 -35 29 19 -5 -62 -3 -46 -64 103 -130
7158a30R1q0J17j07K24Kl06L05j82J20l5L4K9j74J76L06l09J55j66L1l0L1m49
$$ -130 -39 -119 -2 -109 115 117 -189 116 -66 54 19 53 82 -92 84 390 81 236 70 101 71 102 -347
7181c47J62K77j02j18O2L5kq3J30o1K95l27K11l05O7K09k74N6K02j8K45j10k28
$$ -347 -185 92 -10 -128 -66 -31 -33 -116 14 -47 248 -79 132 -173 -106 103 -171 -115 87 69 314 204 -24
7204b4jJ92k37R0n4pQ2l24O48n38J75j27J16J54J19l92K98k02J84l44j57J47K62
$$ -24 -25 167 -70 20 -34 -41 41 -283 365 -173 2 -125 -9 145 264 -128 170 -32 152 -192 -349 -202 60
7227F0J3k96M76l01Q3n3J88l09K17k07k26M12p3j05J09J4m1K8r9J62k85MJ86R6
$$ 60 73 -223 253 -48 35 -18 170 -139 78 -129 -355 57 -16 -121 -12 2 -39 -11 -110 52 -233 -229 -43 53
7251E3P0l86J52j3J99k5Q0k07o0J01j31J04K3k7N8j13K25j81M0J52Qj35q7J85
$$ 53 123 -263 -111 -124 75 50 130 -77 -137 -36 -167 -63 -40 -67 -9 -122 103 -78 -38 114 122 -13 -100 85
7275H5k37J3Q0m0O0j6J35n1j52j2K64k7l14K21M8p2L29j07k75N2JJ59M5j48j90
$$ 85 -152 -139 -59 -99 -39 -55 80 29 -123 -135 129 102 -212 9 57 -15 314 207 -68 -16 -15 144 189 41 -149
7300a49O5j68M81p8j7Q3k50J74j14R1r3Q8l70K81K2K34l02p1JN8o8j41J92m7j58
$$ -149 -84 -252 229 151 134 217 -33 141 27 118 25 113 -257 24 46 280 -22 -93 -92 -34 -102 -243 -51 -98 -256
7325b56M34P1l64K15J3j89m1Q3J04k52J40r3R3K03j97J32j44M0p5q6J08K8L03
$$ -256 178 249 -115 100 113 -76 -117 -34 70 -182 -42 -135 -42 161 -36 96 -48 -8 -83 -169 -61 -33 270
7348B70l6j48j27Q8oj18j47Q3L50J2k26l9J14j14p7J62N4j43K4J69k92J91J36
$$ 270 234 86 -41 47 41 -77 -224 -141 209 221 -5 -44 70 -44 -121 41 95 -48 -24 145 -147 44 180
7371A80j79J5J14J07p8j88N6k12Q7K61j56j56J25Q2p1q9P1Q4k1J26j84j16J80
$$ 180 1 16 130 237 159 -29 27 -185 -98 163 7 -149 -24 58 -13 -102 -31 53 32 158 -26 -142 38
7394C8l60J67n8q0N02m73J43K62l4q0P5P1K8l58j96M20j32K78k88K78l64J46L8
$$ 38 -322 -155 -213 -293 209 -264 -121 141 107 27 102 173 201 -157 -353 67 -65 213 -75 203 -161 -15 23
7417B3K8N4p9L4j0k39K01K8K2n1K52k70J08p2N7K7j82L5L6m9k48L73Lq9K51m98
$$ 23 51 105 26 60 50 -189 12 40 62 11 263 -7 101 29 86 113 -69 -34 2 -47 -295 78 81 -8 243 -255
7443b55L56J1lj7j28j72K01r9J95l2q8r5K03j57P7R1nP4j83K28l03K41j28Q0k2
$$ -255 101 112 109 92 -36 -208 -7 -106 89 57 -31 -126 77 -80 -3 88 83 157 -26 202 -101 140 12 92 70
7468G0l06L61j15l9J02l87M60r0k1j16k98M01P2N6j37j98Q7J13K55k19l51J98
$$ 70 -236 125 10 -29 73 -314 146 56 35 -81 -379 22 94 150 13 -185 -98 15 270 51 -300 -102
7490a02k23J32M12j29m0N3j48J28k97K53l0k44J28K73j12p5Q1l06K25j4J3k46
$$ -102 -325 -193 219 90 50 103 -45 83 -214 39 9 -235 -107 166 54 -21 60 -246 -21 -35 -22 -268
7512b68L89L8J73o53L39j85K05k80K23J59j87K60Pl71m3J47J82k55J43p0J86k08
$$ -268 121 159 332 -321 18 -167 38 -242 -19 140 -47 213 220 -151 -194 -47 135 -120 23 -47 139 -69
7534f9P2R1m5J1l15K09k1J53k11K59k53N1J92l03J30Mm86M73N8j25m2K74m7m6
$$ -69 3 94 49 60 -255 -46 -67 86 -125 134 -119 -68 124 -179 -49 -45 -531 -58 0 -125 -167 107 60 14
7558A4K11j23Q2j13q9m9J5J21k07J72J06J03R4n12J74j08J21k39Q6nK07J96k63
$$ 14 225 102 184 71 -18 -67 -52 69 -138 34 140 243 337 -175 -1 -109 12 -227 -141 -146 61 257 -6
7581fK9J0Q7j23j65K34j32O6J58p1K54l46r9L82l75l6K90m51J48j07L43J18j97
$$ -6 23 33 120 -3 -168 66 -66 0 158 87 341 -5 -104 278 -97 -133 157 -294 -146 -253 90 208 11
7604A1j42K15O7j91o8L60m94K52k28K13J11M1l45L09j61J18k2k33J68M3J8m8l8
$$ 11 -131 84 151 -40 -108 252 -242 10 -218 -5 106 147 -198 111 -50 68 46 -187 -19 24 42 -6 -44
7627d4J06m7J45l35J76L04l42q8J2k41L56j80J85j23k5K52j53K28m04J70J4j14
$$ -44 62 15 160 -175 1 305 -37 -125 -113 -354 2 -178 7 -116 -141 111 -42 186 -218 -48 -34 -148
7649a48Q1J45j41J68J38j62k72L66k14j22QJ52J38j72k33J01O0kK75k62K14k78
$$ -148 -67 78 -63 105 243 81 -191 175 -39 -161 -153 -1 137 -35 -268 -167 -107 -109 166 -96 118 -160
7671a60L20j29kN8Q7j63k4j75q7K73J85l26o2L73l04K31R9l00J86j86J84J80l54
$$ -160 160 31 29 87 174 11 -13 -188 -275 -2 183 -143 -205 168 -136 95 194 -106 80 -106 78 258 -96
7694i6L02k20J2K1k32j4J63O0NN2J93k65q7J03n6Q7k0J43j88K3m2PK0M3J41l22
$$ -96 206 -14 -2 19 -213 -227 -64 -4 1 53 246 -19 -106 -3 -59 28 8 151 -37 -14 -56 -49 -29 14 155 -167
7720a67K36m7J06q2k31R3J40k4L1L2j15Q0n4pp9P6k9K76k72O2k1NP5k51L5M0J45
$$ -167 69 22 128 46 -185 -92 48 24 55 87 -28 52 -2 -9 -88 -12 -41 235 -37 25 4 9 84 -167 -132 -92 53
7747E3k5k0k11L55j39J28j54o0L14j66j54J15O6L9k55L54k62J44j18j5k69K01
$$ 53 28 8 -203 152 13 141 -13 -73 241 75 -79 36 102 141 -114 240 -22 122 4 -11 -280 -79
7769g9L4M2k75J71M46ql59J58k48mK23r4o5K16J17l51nO3j12L90m97J48M02n65
$$ -79 -45 -3 -278 -107 339 331 -28 130 -118 -122 101 7 -58 158 275 -76 -81 -18 -130 260 -237 -89 313 -252
7793b52L61l32R2N6N5J59o5j54J55l14Q0O8J96j90K32j67k90J94K87Lk65J97j90
$$ -252 109 -223 -131 -75 -20 139 74 -80 75 -239 -159 -91 105 -85 147 -20 -310 -116 171 174 -91 106 -84
7816h4J31k17LJ99j3J69q1M8o6p9J01l62M41q9j31k9Q3J8Q7qj04K03k74K7n9L09
$$ -84 47 -170 -167 32 19 188 107 155 89 10 111 -251 190 101 -30 -59 24 42 129 121 17 220 -54 -27 -86 223
7842B23k05j14O9k1P9Q3j12M9r0j60K84N9j37p1J28j86K9J21J4k3n6L12j17j16
$$ 223 18 -96 -27 -48 31 114 2 51 -39 -199 85 144 7 -64 64 -122 -93 28 42 19 -37 275 158 42
7866D2o1L0N3l58J64r8O0L03m56L44j04L8J23l9m3Q8k12P6N3K01k75Pj5K2j13
$$ 42 -19 11 64 -294 -130 -228 -168 135 -321 23 -81 -43 80 41 -2 86 -126 -50 3 204 -71 -64 -79 -57 -170
7891a70K28O5N8l96J81K7j9K04k31N5j83J29k41L28NP0k15J12k69J43K46l9k08
$$ -170 58 123 181 -215 -34 -7 -26 178 -53 2 -181 -52 -293 35 40 110 -105 7 -262 -119 127 88 -120
7914a20L17Q8m42K99r3J14k27o6%K09M0k01L95k71oK6L7n6q0m8r0K61L8q1j09
$$ -120 197 285 -157 142 49 163 -64 -130 -130 79 119 -82 313 42 36 62 99 43 -37 -85 -175 86 124 43 -66
7939f6J57l80M91o3j53Kj66K09m3j28Q3P5j84J16L75jl44j2n8J69r3j94J59M0
$$ -66 91 -289 202 139 -14 -12 -178 31 -12 -140 -57 18 -166 -50 325 324 -20 -32 -90 79 -14 -208 -49 -9
7963iJ74M4j24mk56J19K55J4j98K4J36J36j53j02o1l3M8j01QJ43j41O4K0j27J47
$$ -9 165 209 85 81 -175 -56 199 213 15 39 175 311 158 56 -5 -38 10 -91 -83 60 -81 -17 3 -124 23
7988B3k6J61n5P2l70J93J2K69m37J63J83k09j57J5L8J04Q2j00j69P6K09k38L65
$$ 23 -3 158 103 175 -195 -2 10 279 -158 5 188 -21 -178 -163 -125 -21 61 -39 -208 -132 77 -161 204
8011B04k8j90M7j39J30nJ13k62J19J41o6m22K07J37Jj59K5J89J07r5l3J08j21
$$ 204 176 -14 33 -106 24 19 132 -130 -11 130 64 -358 -151 -14 -13 -172 -147 42 149 54 21 129 8
8034HJ87k87K44j6j50K02k33J86r9O9j65J40K9J70l97J63K61n16J67J05J3j89
$$ 8 195 -92 152 136 -14 188 -45 141 42 111 -54 86 115 285 -112 51 312 -204 -37 68 81 -108
8056a08j14J55J64j29pk2j11J81j46j18J80o7j05L42p6N8J62m58K24k25L11j38
$$ -108 -222 -67 97 -32 -39 -61 -172 9 -137 -255 -75 -142 -247 95 19 77 239 -219 5 -220 91 -47
8078d7K8Nk81K36K05k49n5R9J18M2r4j18N1k6j7n1p0K32j92K25J24Pl71J99j08
$$ -47 -19 -14 -295 -59 146 -103 -158 -59 59 101 7 -111 -60 -86 -103 -154 -224 8 -184 41 165 172 -199 0 -108
8103a08J67J93p1m71K94J50k98J53QJ59k39m2K29Nj26j5L3n2j28N23n94L6K34
$$ -108 59 252 181 -290 4 154 -144 9 17 176 -63 -105 124 129 3 -12 21 -31 -159 364 -230 -194 40
8126D0p8j0j84Q6J47j7J06l8r2q2J70rj75J78j24j16J08q6J94Q0j26K11n46L21
$$ 40 -38 -48 -232 -146 1 -16 90 52 -40 -122 48 39 -136 42 -82 -198 -90 -176 18 98 -28 183 -363 -42
8150d2L73k87L9K7k83L24k18J05j34K37l1j35K3R1J0J24l64J71m5K1j98K25j52
$$ -42 331 44 83 110 -173 151 -67 38 -96 141 110 -25 -2 89 99 223 -141 30 -15 6 -192 33 -119
8173a19R3J53l86J58Q5J62m80L16RP4j56K76k91J16j31Lj14L05
$$ -119 -26 127 -259 -101 -16 146 -334 -18 -9 65 -91 185 -106 10 -121 -118 -232 73
8191G3
$$ Imaginary data points
##PAGE= N=2
##DATA TABLE= (X++(I..I)), XYDATA
0@%%%%%%%%%%%%%%%%%%Pj5J6j6J6j6J9k7L2l2M0m8N2o0O8p6Q6r8J09j22J37j52
$$ 0 0 0 0 0 0 0 0 0 0 0 0 0 0 0 0 0 0 0 7 -8 8 -8 8 -8 11 -16 16 -16 24 -24 28 -32 36 -40 46 -52 57 -65 72 -80
40h0J70j90K09k30K54k82L12l42L77m18M62n08N61o18O82p55Q37r34J046j176
$$ -80 90 -100 109 -121 133 -149 163 -179 198 -220 242 -266 295 -323 359 -396 441 -493 553 -623
60f23J332j523J765k081K509l131M111n900J0197l7835m3901O7423J2639m392
$$ -623 709 -814 951 -1130 1379 -1752 2359 -3541 6656 -31179 -75080 -7657 4982 590
74E90K2446M4586J3799k6794M455K8415l8870m0230k666m15j2067j9543J2733
$$ 590 23036 67622 81421 54627 59082 87497 48627 8397 5731 5316 -6751 -26294 -13561
87a3561K3851l1953j8257J7313p500k2938j2968J2081J5878j5501J6923M4437
$$ -13561 10290 -21663 -39920 -22607 -30107 -53045 -66013 -53932 -38054 -53555 -36632 7805
99G805M197n277J0823J2332R77k0945O778K0859k0459j1898J6604P072j0539k2892
$$ 7805 12002 6725 17548 29880 30857 9912 16690 37549 17090 5192 21796 28868 18329 -4563
113d563K554L412l6854p829K5077p048j5267O259K0765N120j7063J5436J9864
$$ -4563 -2009 1403 -35451 -43280 -18203 -25251 -40518 -34259 -13494 -8374 -25437 -10001 9863
126I863j9813l305K1081J2965L02o499J5205Q589k3715j489J0340j4213j5023
$$ 9863 -9950 -13255 7826 20791 21093 14594 29799 38388 14673 13184 23524 9311 -5712
139e712o729P677K300j6676O526Q696j7614p950L266M115J72o978J4788J5920
$$ -5712 -12441 -4764 -2464 -19140 -12614 -3918 -21532 -29482 -26216 -22101 -21929 -28907 -14119 1801
153A801l389J1365J4609K738m423j0712N618M243j5093M338J0244o564l787P98
$$ 1801 -1588 9777 24386 27124 22701 11989 17607 21850 6757 11095 21339 14775 10988 11786
167A1786O415p023k1356o91k076j6593J685P898L561J367o49J5100O771r125O517
$$ 11786 18201 11178 -10178 -10869 -12945 -29538 -27853 -19955 -16394 -15027 -15676 -576 6195 -2930 3587
182C587K061p436J251K308R485L924m404Q455N82p021J682o720p384n855j0353
$$ 3587 5648 -1788 -537 1771 11256 15180 10776 19231 19813 12792 14474 7754 370 -5485 -15838
197a5838K491J073j810P162k035Q3N193m398K816J391n428K732j00M952R609m03
$$ -15838 -13347 -12274 -14084 -6922 -8957 -8874 -3681 -8079 -5263 -3872 -9300 -6568 -6668 -1716 7893 7490
213G490N756L316n514K833k347m362j029r730l170K028m031M258q17k956K301
$$ 7490 13246 16562 11048 13881 11534 7172 6143 -3587 -6757 -4729 -8760 -4502 -5319 -8275 -5974
228e974o259Q76O104n383R23J833J426O680k38P039P974q292J040O254k350k89
$$ -5974 -12233 -11357 -5253 -10636 -9713 -7880 -6454 226 -12 7027 15001 6709 7749 14003 11653 11364
244A1364k879K486L01j1192M618O567j0757m302k67r58k479o462Q900L930j2179
$$ 11364 8485 10971 11272 80 4698 11265 508 -3794 -4061 -5019 -7498 -13960 -5060 -1130 -13309
259a3309L691Q798j118q78j00P682Q18q118J1117R199o717j585P01J702l627r811
$$ -13309 -9618 -820 -1938 -2816 -2916 4766 5584 -2534 8583 17782 11065 9480 10181 11883 8256 -1555
275a555O963J593j2686J373O701K091m011o263O497k940j5346N387Q392m151j967
$$ -1555 5408 7001 -5685 -4312 2389 4480 469 -5794 703 -2237 -17583 -12196 -3804 -7955 -9922
290i922M571J3268J106p318J1785K984j5552l445M748L470o276m926J5105R55
$$ -9922 -5351 7917 9023 1705 13490 16474 922 -2523 2225 5695 -581 -5507 9598 10553
304A0553j3285P345O042r606j1992l417Q883n684q345J6454P445q725K046P496
$$ 10553 -2732 4613 10655 1049 -10943 -14360 -5477 -11161 -19506 -3052 4393 -4332 -2286 5210
318E210M420r292q980J0927k212j0246R532J0569R45n778q37J0240p785j4469
$$ 5210 9630 338 -8642 2285 73 -10173 -641 9928 10873 5095 4258 14498 6713 -7756
332g756O450K12j0393l085P505J1223n917o363J3163q08j2829K602O726L99r821
$$ -7756 -1306 -1094 -11487 -14572 -7067 4156 -1761 -8124 5039 4231 -8598 -5996 730 1129 -8692
347h692N95J7071j812r383R995M071r063p878M476R509j0842p712J3954k10j0240
$$ -8692 -8097 8974 7162 -2221 7774 11845 2782 -5096 -620 8889 -1953 -9665 4289 4079 -6161
362f161K340O619q26j2552j220J4063l817o634R803N614l871n451M525R238r885
$$ -6161 -3821 2798 1972 -10580 -11800 2263 -1554 -8188 1615 7229 3358 -2093 2432 11670 1785
377A785o951J0712P95n250J093O165L143j2503m731R932n710q815M094M274l71
$$ 1785 -5166 5546 6341 1091 2184 8349 11492 -1011 -5742 4190 -1520 -10335 -6241 -1967 -2338
392b338n188N621J1747p917p902O523j64m875j755P557P541p885R84J3255j884
$$ -2338 -7526 -1905 9842 1925 -5977 546 382 -4493 -6248 1309 8850 965 1949 15204 13320
407A3320p595k89M48m311j0386L124R886p598l224Q171J330l541l770K767J245
$$ 13320 5725 5436 5884 1573 -8813 -5689 4197 -3401 -6625 1546 2876 -665 -4435 -1668 -423
422d23j1113n17R503L9O7L247N118K463o526K581N916p797m451K290J335P21k940
$$ -423 -11536 -12053 -2550 -2511 -2444 803 5921 8384 1858 4439 10355 2558 -1893 397 1732 2453 -487
439d87M033L805q908k033L544k987l390l724J660K743m647M002P541k568j030
$$ -487 3546 7351 -1557 -3590 -46 -3033 -6423 -10147 -8487 -5744 -10391 -6389 1152 -1416 -2446
454b446J177K662J744m423L745L552o072J080M827r2l51l126J376J77n930K402
$$ -2446 -1269 1393 3137 -1286 2459 6011 -61 1019 5846 5754 5403 2277 3653 3830 -2100 302
470C02J370m930o02j764K41J513k658K290R11k926L225J250J652K475k496J418
$$ 302 1672 -3258 -3860 -5624 -5383 -3870 -6528 -4238 -3327 -6253 -3028 -1778 -126 2349 -147 1271
486A271J587k464L870j89j373K112k846P48K356k322J61k689l110K144k928N94
$$ 1271 2858 394 4264 4075 2702 4814 1968 2716 5072 2750 2911 222 -2888 -744 -3672 -3078
502c078K836l526P66J151J32L659j546j214K091l032J218J945j0K294k466J35
$$ -3078 -242 -3768 -3002 -1851 -1719 1940 394 -820 1271 -1761 -543 1402 1392 3686 1220 1355
518A355M928l249j219J708l883k106k734R06L353n034Q11N067k260L52K124J724
$$ 1355 6283 3034 1815 3523 -360 -2466 -5200 -4294 -941 -5975 -5164 -97 -2357 -2005 119 1843
534A843P15o250J089N408l633J045L859J004l74k723L910L630q599j735K639m920
$$ 1843 2558 -3692 -2603 2805 -828 217 4076 5080 4706 1983 5893 9523 924 -811 1828 -3092
550c092k396R70L210O53o235K887M857m643q23J181j32j112l399O889O771n492
$$ -3092 -5488 -4518 -1308 -655 -6890 -4003 854 -3789 -4612 -3431 -3563 -4675 -8074 -1185 5586 94
566I4J385N651n41k494j951M148j026r807K849N561l624j639J989K001k721p255
$$ 94 1479 7130 6589 4095 2144 6292 5266 -4541 -1692 3869 245 -1394 595 2596 -125 -7380
582g380M846L221q136r23M297J591j575k81Q341J562q900L500O249l177k371J414
$$ -7380 -2534 687 -7449 -8372 -4075 -2484 -4059 -4340 4001 5563 -3337 163 6412 3235 864 2278
598B278M101k790o144P025L472q757j487J932L79l086k968O327L93q637K926N928
$$ 2278 6379 3589 -2555 4470 7942 -815 -2302 -370 9 -3077 -6045 282 675 -7962 -5036 892
614H92j887l244j82O108j266n593Q197N527o297j032K928K288l730m542P387j79
$$ 892 -995 -4239 -4421 1687 421 -5172 3025 8552 2255 1223 4151 6439 2709 -1833 5554 5375
630E375q179K351N186n90n346k125N272m440q051O010M807m297j447M427N810
$$ 5375 -2804 -453 4733 4143 -1203 -3328 1944 -2496 -10547 -4537 270 -4027 -5474 -1047 4763
645D763l503l491P385r23q240J312M980J380l150l40P181j698o023M314J901n791
$$ 4763 1260 -2231 5154 4231 -4009 -2697 2283 3663 513 173 7354 5656 -367 3947 5848 57
661E7n195L15M778l685k981P708O54m937R53L329J332n561j997O306j530l331
$$ 57 -5138 -4823 -45 -3730 -6711 997 1651 -3286 -2333 996 2328 -3233 -5230 1076 -454 -3785
677c785N264L778r09l911R35M457m269m891M946n34m339l99L972L173n038j921
$$ -3785 1479 5257 4348 437 1372 5829 1560 -3331 1615 1081 -3258 -3657 315 3488 -1550 -3471
693c471N642k812m399K740K214r65l609J799O364k773k174M878n20k681r17K426
$$ -3471 2171 -641 -5040 -2300 -86 -1051 -4660 -2861 3503 730 -1444 3434 2914 233 -684 1742
709A742L438n135j623M485k138k151J032J314m25l700O00M753k561q50K322m49
$$ 1742 5180 45 -1578 2907 769 -1382 -350 964 539 -3161 -2561 2192 -369 -1219 1103 654
725F54j227j705J809L616l821p38M185r52j20N08Q22K73m681k19L392k578o55
$$ 654 -573 -2278 -469 3147 -674 -1412 2773 1821 1701 2209 3031 3304 -1377 -1596 1796 -782 -1437
742a437R20k89J008k010J616K457m139p50J370j082J536M04J479K385k527J255
$$ -1437 -517 -806 202 -1808 -192 2265 -1874 -2624 -1254 -2336 -800 -396 1083 3468 941 2196
758B196K476j892J53j023j672O52j528J000J941k359P94m57j128J463j704j566
$$ 2196 4672 2780 2933 1910 238 890 -638 362 2303 -56 738 281 -847 616 -1088 -2654
774b654M25k526J126R46k54L003r85l59K506o64R98O35j597J589j350r56L552
$$ -2654 -2229 -4755 -3629 -2683 -2937 66 -919 -1278 1228 564 1562 2197 600 2189 839 -117 3435
791C435q28p30O33j695J064r36j443J867k979j857J604n98R66k04q09K110k060
$$ 3435 2607 1877 2510 815 1879 943 -500 1367 -1612 -3469 -1865 -2463 -1497 -1701 -2510 -400 -2460
808b460m61L693j198j132j59j32L005j683N34M130k242j681J564L53L68l023m48
$$ -2460 -2921 772 -426 -1558 -1717 -1849 1156 -527 7 4137 1895 214 1778 2131 2499 -524 -972
825i72K690l898n95L877n35j412j264J048K324l753J30L699k780j783J778K151
$$ -972 1718 -2180 -2775 1102 567 -845 -2109 -1061 1263 -2490 -2360 1339 -1441 -3224 -1446 705
841G05J084k883J049L581l784p78L639m51j135k675J514L144m481L12L262k418
$$ 705 1789 -1094 -45 3536 -248 -1026 2613 2162 1027 -1648 -134 3010 -1471 -1159 2103 -315
857c15j999j0K834J508m931J130L654l715j418L414J245j246l003K799L649m452
$$ -315 -2314 -2324 510 2018 -2913 -1783 1871 -1844 -3262 152 1397 151 -2852 -53 3596 -856
873h56O70L361k065j886j198L863R32m983J782L881l224j018J654J723k499m485
$$ -856 -186 3175 1110 -776 -1974 1889 2821 -2162 -380 3501 277 -741 913 2636 137 -4348
889d348K774K966m427Q53L244j65j667j014M279O40n899Q34L051k561q35J467
$$ -4348 -1574 1392 -3035 -2182 1062 897 -770 -1784 2495 3135 -2764 -1930 1121 -1440 -2275 -808
905h08L417j004m266L924K649m582r68K039j6k183j981N627J329n076J446K957
$$ -808 2609 1605 -2661 1263 3912 -670 -1638 401 385 -1798 -3779 1848 3177 -1899 -453 2504
921B504j610k081O7L080j656m644L980L145k742n18J477J381k841k695M554L76
$$ 2504 894 -1187 -1120 1960 304 -4340 -360 2785 43 -475 1002 2383 -458 -3153 1401 1777
937A777m942J097K290q3j447J37L533j771m125L268J838k043p33R98K413k330
$$ 1777 -3165 -2068 222 139 -1308 -1171 2362 591 -3534 -266 1572 -471 -1204 -206 2207 -123
953a23j783M289R25l982K10J732R86j740j111L970j321m500K317J527j566j350
$$ -123 -1906 2383 3308 -674 -464 1268 2254 514 -597 3373 2052 -2448 -131 1396 -170 -1520
969a520o9K633k119k117M554R0l017m30Q66J674k007k71L663q26k775K928J446
$$ -1520 -1589 1044 -1075 -3192 1362 1452 -1565 -1995 -1129 545 -1462 -1733 1930 1104 -1671 1257 2703
986B703l50k085n33K651k545j464L707l80j579k22M51J538j951j627K425j900
$$ 2703 2353 268 -265 2386 -159 -1623 2084 1704 125 -97 354 1892 -59 -1686 739 -1161
1002a161j880J452J150O87j381k77L076j521j068K373q27j090p20N10K402j424
$$ -1161 -3041 -1589 -439 248 -1133 -1410 1666 145 -923 1450 623 -467 -1187 -677 1725 301
1018C01m70K916j900n73K43k74J128k255j049J978j523j32J601m43J77j405n2
$$ 301 -169 2747 847 274 517 243 1371 -884 -1933 45 -1478 -1610 -9 -452 -275 -1680 -1732
1035a732K593j537k10J396j298N17P82j58J966j608n49J421j326O30N88j383N96
$$ -1732 861 -676 -886 510 -788 -271 511 353 2319 711 162 1583 257 887 1475 92 688
1052F88j367l52J788j399P1K59j450Q01r1k92J103j240J18N30j026K406l3j087
$$ 688 -679 -1031 757 -642 -571 -312 -1762 -961 -1052 -1344 -241 -1481 -1363 -833 -1859 547 514 -573
1070e73J999o34l81J530q34P46j111j506K244q59o10J193j067L1l56j243K575
$$ -573 1426 792 411 1941 1107 1853 742 -764 1480 621 11 1204 137 168 -188 -1431 1144
1087A144j145j983J271p30K33J85J34J721j529j202K897l77p17O81n65J051j344
$$ 1144 -1 -1984 -713 -1443 -1210 -1025 -891 830 -699 -1901 996 619 -98 583 18 1069 -275
1104b75j80K782j215j323J272l40J67j021n0J920k056j853K962l89o50J06L12
$$ -275 -455 2327 1112 -211 1061 721 888 -133 -183 1737 -319 -2172 790 401 -249 -143 169
1121A69R22j931j98L314j872j632R13l3N87j151M85K594k443j406K714N3r35j174
$$ 169 1091 -840 -1038 2276 404 -1228 -315 -348 239 -912 -427 2167 -276 -1682 1032 1085 150 -1024
1139a024N00J260l171N42L662j117j593R08Q96Q88k180N86K300k785j423K214
$$ -1024 -524 736 -2435 -1893 1769 652 -941 -33 863 1751 -429 157 2457 -328 -1751 463
1155D63R60m13j670R26J935l078n14K946j327k274J18J488Q97k720J429K518k391
$$ 463 1423 1010 -660 266 2201 -877 -1391 1555 228 -2046 -1928 -440 457 -2263 -834 1684 -707
1172g07j015J654P58P8k427J330K451k860M65K811n46j524p36J681P78l450R17
$$ -707 -1722 -68 690 768 -1659 -329 2122 -738 -273 2538 1992 468 -268 1413 2191 -1259 -342
1189c42K345k861j020R33J622m48k830J930J368k731L63K243J57j165j397K832
$$ -342 2003 -858 -1878 -945 677 229 -2601 -671 697 -2034 -1671 572 729 -436 -1833 999
1205I99J123l369J428K181j397j478J023K028o30l256J591J616k899l79J686j97
$$ 999 2122 -1247 181 2362 965 -513 510 2538 1908 -1348 243 1859 -1040 -1419 267 70
1221G0q56k101K745R28k946J051J231r12p57N5K287L30k610K221J372j693j63
$$ 70 -786 -2887 -142 786 -2160 -1109 122 -790 -1547 -1492 795 1125 -1485 736 2108 415 252
1238B52J187O38j623k182K806J028k830J027O09n38j022q73K254p39l076J576
$$ 252 1439 2077 454 -1728 1078 2106 -724 303 912 374 -648 -1521 733 -6 -3082 -1506
1254a506J003j134K47Q53J570j490j246K733J47j570M27O42M1p45l64K707m35
$$ -1506 -503 -1637 -1390 -537 1033 -457 -1703 1030 1177 -393 34 676 717 -28 -392 2315 1880
1271A880k542J311K42p02l86n39J483j136j696J873N82j255M18l52R40p91p88
$$ 1880 -662 649 891 189 -197 -736 747 -389 -2085 -212 370 -885 -467 -819 121 -670 -1458
1288a458K354p45j338R59L81K93j30k72J662j647j228K116l06p85J16m58P40n61
$$ -1458 896 151 -1187 -228 153 446 316 44 1706 59 -1169 947 641 -144 -28 -486 254 -307
1306c07o80J993q42r23P37j35Q06k12n39J011j119o10J297j90J39J01j045J186
$$ -307 -987 1006 164 -759 -22 -157 649 437 -102 909 -210 -820 477 287 426 527 -518 668
1324F68l52o71J301j186o54K50q39J388k52p29J190q18M33N89n82Q69l60q65J114
$$ 668 316 -355 946 -240 -894 -644 -1483 -95 -347 -1076 114 -704 -271 318 -264 605 245 -620 494
1343D94l09K72J028j440Q90K48j567J837o41n62j60o79M55K33r88J188m80q27
$$ 494 185 457 1485 45 935 1183 -384 1453 812 250 90 -589 -134 99 -889 299 -181 -1008
1361a008L69j87N35L07j309J127n5q74J607M18n31J95q70J335J9j269J542n29
$$ -1008 -639 -826 -291 16 -1293 -166 -221 -1095 512 930 399 594 -276 1059 1078 -191 1351 822
1379H22j164J91n0J047o55j246J416m85j212J105n9J1q40n04J885j81j214J946
$$ 822 -342 -151 -201 846 191 -1055 361 -124 -1336 -231 -290 -279 -1119 -1623 262 81 -1133 813
1397H13r1m88j11n2J603j141j436K061l47j108P19K33M21j566o48J878r08j388
$$ 813 722 234 123 71 1674 533 -903 1158 811 -297 422 655 1076 -490 -1138 740 -168 -1556
1415a556R38J43m03q20M55K012j123j178K237k80q09N10P06Q41j683l92K473m61
$$ -1556 -618 -475 -878 -1698 -1243 769 -354 -1532 705 425 -384 126 832 1673 -10 -402 2071 1610
1433A610j012M35J20m16j235K13J841j997j348J535j08o87l06Q90Q07j936k34
$$ 1610 598 1033 1153 737 -498 -285 1556 -441 -1789 -254 -362 -1049 -1355 -465 342 -1594 -1828
1450a828K213j26j009L98P81k4j240M62K597j457j152J427K7l63j048J072R56
$$ -1828 385 259 -750 -352 429 405 -835 -373 2224 767 -385 1042 1069 706 -342 730 1686
1467A686k394m65K383j035o03k39Q12N63k037N02K391j537r90N61R64l14r85J010
$$ 1686 -708 -1173 1210 175 -428 -667 145 708 -1329 -827 1564 27 -963 -402 562 248 -737 273
1485B73J488k370K4J655m04n57j232J145N63j957M81K131j446p26N67P74K70j735
$$ 273 1761 -609 -585 1070 666 109 -1123 22 585 -1372 -891 1240 -206 -932 -365 409 679 -1056
1503a056J046J190j936j24J743K64n00j067J393L43j926Q11J078j058p95o2R38
$$ -1056 -10 1180 -756 -880 863 1127 627 -440 953 1296 -630 181 1259 201 -594 -656 282
1520B82k89j342J054Q25j754O8O80Q74o99j197J542N98j493J098R26n78n54m40
$$ 282 -7 -1349 -295 530 -1224 -1156 -476 398 -301 -1498 44 642 -851 247 1173 595 41 -399
1538c99J528M6j615J119L05j284L46l1P49o86j280Q70L12j535O94P21J59o68o09
$$ -399 1129 1175 -440 679 984 -300 46 15 764 78 -1202 -332 -20 -1555 -861 -140 19 -649 -1258
1557a258J629L7j337J519J30n28J58J36R99m60j360R10K61r34P14l92J0m27j297
$$ -1258 371 408 -929 590 720 192 350 486 1485 1025 -335 575 836 -98 616 224 234 -193 -1490
1576a490J690N5j664P92k04l73K13n7J101k43j042J309J43q8O21m44L54J50q07
$$ -1490 200 255 -1409 -617 -821 -1194 -981 -1038 63 -180 -1222 87 230 142 763 319 673 823 16
1595A6J166o9o28N56m93j25q1q11J091r82r67N75o8j01O47p39L30N8n66J053k32
$$ 16 1182 1113 485 1041 548 423 342 -469 622 -360 -1327 -752 -820 -921 -274 -1013 -683 -625 -1191 -138 -370
1616c70K6N83o33O86K94m04J039n20l44K63j95N5O09j291L52l46l63N88m84L90
$$ -370 -344 239 -394 292 586 182 1221 701 357 620 425 480 1089 -202 150 -196 -559 29 -455 -65
1636f5P2j298R39M02o17O29k49K75j43n41Q02M33m61J51l26K07K93n21M08K07
$$ -65 7 -1291 -352 50 -567 62 -187 88 -55 -596 206 639 178 329 3 210 503 -18 390 597
1656E97j144L80M11k34R2o85M49L8j064J153N79j008L0N59k45L06k17R03k47j177
$$ 597 -547 -167 244 10 102 -583 -134 -96 -1160 -7 572 -436 -406 153 -92 214 -3 900 653 -524
1676e24L93O41r8j69p60R31nj300Q57M16p71p8J0N59k27q97J340j50j068O05O16
$$ -524 -131 510 412 243 -517 414 409 -891 -34 382 -389 -467 -457 102 -125 -1022 318 168 -900 -295 321
1697C21O2j50n29Q53M1j116J085M04o84n01qR63p21q29J235l00q76M5M86Q93r96
$$ 321 383 233 -296 557 598 -518 567 971 287 -214 -222 741 20 -809 426 126 -750 -705 -219 674 -322
1718c22o44J101k53q24J229M95o29n99K07J258n62q15J144k02m82j20K71R88j311
$$ -322 -966 135 -118 -942 287 782 153 -446 -239 1019 457 -358 786 584 102 -18 253 1241 -70
1737g0m80R04l72n77K62N12k54j133K50J403q75l64R30J80m80p2N63R98j136q52
$$ -70 -550 354 -18 -595 -333 179 -75 -1208 -958 445 -430 -794 136 316 -164 -236 327 1325 189 -663
1757f63J523k03o22O54J91P2j381L2J197r28m37L57K20m93l41J69J155j164o40
$$ -663 860 657 35 689 880 952 -429 -397 800 -128 -565 -208 12 -481 -822 -653 502 -662 -1302
1776a302J544q9n90j00N02P25j497L37J456n29l72K29K68j48o08N30O67r29n59
$$ -1302 242 153 -437 -537 -35 690 -807 -470 986 457 85 314 582 434 -174 356 1023 94 -465
1795d65O40K10m17p87P76O44j678L46J128m63m60K16K05J77q18N33J310j501J
$$ -465 175 385 -32 -819 -43 601 -1077 -731 397 -66 -526 -310 -105 72 -746 -213 1097 -404 -403
1814d03N64J00K3k21L41M31j460L26R89p19M44n71L52K8q95N65P29j029r8L46
$$ -403 161 261 284 63 404 835 -625 -299 690 -29 415 -156 196 224 -671 -106 623 -406 -504 -158
1834a58J63K80q57Q37K49j054J67Q21m08N9n42K77O92j122Q73L80o87k58k0L21
$$ -158 5 285 -572 265 514 -540 -373 448 40 99 -443 -166 526 -596 277 657 -30 -288 -308 13
1854A3M86p50L46N43j346P07K35J15k27o14M87N14j061Q95J54p45K72n74M55M94
$$ 13 499 -251 95 638 -708 -1 234 349 122 -492 -5 509 -552 343 497 -248 24 -550 -95 399
1874C99r34J40M71m34L38o5K29k98m64O37M22o10O17l03Q9J72n46N36O8p62P02
$$ 399 -535 -395 76 -358 -20 -85 144 -154 -618 19 441 -169 448 145 234 406 -140 396 464 -298 404
1895D04j61m40L30l08N57k19o67K63K27l16K70l18L9M45p70P96r4R3J72n96N57
$$ 404 243 -197 133 -175 382 163 -504 -241 -14 -330 -60 -378 -339 106 -664 132 38 131 303 -293 264
1916B64L63n91O00r5o36K05P2QL87o08m9J95n11M91j93j96J99n72J38M03m43M68
$$ 264 627 36 636 541 -95 110 182 190 577 -31 -80 115 -396 95 -98 -294 -95 -667 -529 -126 -569 -101
1938a01L28m94J00j82N62K94o63L06L97m55N58r2j04P4o70M31K97m13m8K21l51
$$ -101 227 -267 -167 -349 213 507 -156 150 547 92 650 558 454 528 -142 289 586 173 125 346 -5
1959ej64o75N55M54q82J54K32l42M27k19O03j73n95Q37K99l95l8J08J82r0o46
$$ -5 -169 -844 -289 165 -717 -563 -331 -673 -246 -465 138 -35 -630 207 506 111 73 181 363 273 -373
1980c73J066p2j016K89N12k04l46l86Q27k48p73N28L23m33L62m17M03k77m62P44
$$ -373 693 621 -395 -106 406 202 -144 -530 297 49 -724 -196 127 -306 56 -361 42 -235 -697 47
2000D7K44n88J53J03K46j93m58R11p1j047Q01J76m14n8j79Q17m48q61J155J31
$$ 47 291 -297 -144 -41 205 12 -446 465 394 -653 148 324 -90 -148 -327 490 42 -819 336 467
2020D67r51L15J51L98m00m01Q13j41o55N32K23m2l89m62P19l78o12R28M3o45p7
$$ 467 -484 -169 -18 380 -20 -421 392 251 -404 128 351 309 -80 -542 177 -201 -813 115 158 -487 -564
2041e64K36O75p83MP95o26l78O32%N91q85j43J041o27l85R30j47k16m95K00Q33
$$ -564 -328 347 -436 -432 363 -263 -641 -9 -9 582 -303 -446 595 -32 -417 513 366 150 -345 -145 688
2062F88q28n76Q88j18m38R0L96j1k22o03R72m10m44P76L6r5m79K86P32p68j67
$$ 688 -140 -716 172 54 -384 -294 102 91 -131 -734 238 -172 -616 160 196 101 -378 -92 640 -128 -295
2083b95Q51l85m15J99J28M74o69k53N89k89m59M10j63M63q51O1J143r32j6O22
$$ -295 556 171 -244 -45 83 557 -112 -365 224 -65 -524 -114 -277 186 -665 -604 539 -393 -409 213
2103B13k51K5j28K58P65r47j88Q19n09R5J19Nj10j60j49K47k54J1j27J07K78n93
$$ 213 -38 -13 -141 117 882 -65 -253 566 57 152 271 276 166 6 -143 104 -150 -139 -266 -159 119 -474
2125d74K15O85p32j6L56k67lJ56r0J57k78P6P17n56K33J44k78N16m89J9M75q17
$$ -474 -259 426 -306 -322 34 -233 -236 -80 -170 -13 -291 -215 502 -54 179 323 45 561 72 91 566 -251
2147b51K30ML8O4k75K75J36o91L22K48n46L81n8j85M00o74N23Q6l12N8J97l6O57
$$ -251 -21 -17 21 85 -190 85 221 -470 -148 100 -446 -65 -123 -308 92 -582 -59 27 -285 -227 -30 -66 591
2170E91p59K14K42m96M12p6n5J02m70J28K89j31J88J16l25M51q47K57N79o18J5
$$ 591 -168 46 288 -208 204 128 73 175 -295 -167 122 -9 179 295 -30 421 -426 -169 410 -208 -193
2191a93K28j41K8m3j48M43n26oN33n22K60R0l34N48m28J9O89m39J28j33R4L48
$$ -193 35 -106 -78 -121 -269 174 -352 -358 175 -347 -87 3 -331 217 -211 -192 497 58 186 53 147 495
2213D95k51k11L07m68j7K64j44J93n79L40K12n42LQ48l28r7m71M96K89o34M2O91
$$ 495 244 33 340 -128 -145 119 -25 168 -411 -71 141 -401 -398 450 122 25 -446 50 339 -295 -253 438
2235D38n52Q5J1J87L91p39K26J34j61j6M28m26J11k51J56M43q69K70L50p07K77
$$ 438 -114 -29 -18 169 560 -179 47 181 20 4 432 6 117 -134 22 465 -404 -134 216 -491 -214
2256b14j70L31n8n89J21P06l38K84k29o6N30n13M65N10q61J60M67l65O4m53N36
$$ -214 -384 -53 -111 -700 -579 127 -211 73 -156 -222 308 -205 260 770 -91 69 536 171 235 -218 318
2277C18J42q27K71L53l73R9j90L30j44k50K54K80q03N98O2j48l36K38J47L38n03
$$ 318 460 -367 -96 257 -116 -17 -207 123 -21 -271 -17 263 -540 58 120 -28 -364 -126 21 359 -144
2298a44L67J4n04L88K7L60j04q91O44K74p94M17j22J97j54m17P28j30m77J0N07
$$ -144 223 237 -267 121 148 508 404 -487 157 431 -363 54 -68 129 -25 -442 286 156 -321 -311 196
2319A96m34j45L07J96J9p33O22M82n30K84l26J26n0l53R26j87o74L84k31L39n00
$$ 196 -238 -383 -76 120 139 -594 28 510 -20 264 -62 64 14 -339 587 400 -274 110 -121 218 -282
2340b82Q1M49k26n20Q25k31K2l2l58L35j02l60O64j14k89J18k85M52k98j40O06
$$ -282 -201 248 22 -498 327 96 118 86 -272 63 -39 -399 265 151 -138 -20 -305 147 -151 -291 315
2361C15k62m90M51R1J08n42J06N57m64l17M16M88n49J13K16l8l04O8M46j55n99
$$ 315 53 -437 14 105 213 -329 -223 334 -130 -447 -31 457 -92 21 237 199 -105 -37 409 254 -345
2382c45L47n%K3m37M27m1n24P66m70J10m0q5N31k98k63N14k77l5K19j1J72m23
$$ -345 2 -3 -3 20 -417 10 -31 -555 211 -259 -149 -189 -274 257 -41 -304 210 -67 -102 117 106 278 -145
2405a45O4M01p4l36M65m30M1Pj6K40j04n05N99k97k97L95k79N26m23j38O60m29
$$ -145 -81 320 246 -90 375 -55 -14 -7 -23 217 113 -392 207 -90 -387 8 -271 255 -168 -306 354 -75
2427g5n4J86j24l5p2O0M74l24j61L49k59J93j6j36K71l90m2K44l83K21J51j27
$$ -75 -129 57 -67 -102 -174 -114 360 36 -125 224 -35 158 142 6 277 -113 -155 89 -294 -73 78 -49
2449d9L53o44k98P06j92k56N61l05K08rM0J36l00l2L58j72K1n2k6K47n14K20O34
$$ -49 304 -340 -638 68 -124 -380 181 -124 84 75 115 251 -49 -81 277 105 126 74 48 295 -219 1 635
2472F35o22J00l0j62K53j61j0P7m05L60k48J0M91k31j65K5J3j69M70j51k1Rn02
$$ 635 13 113 83 -79 174 13 3 80 -325 35 -213 -203 288 57 -108 -83 -70 -239 231 80 59 68 -434
2495d34O93k42P3j56KL11m19K15J32l06k54M68l26K30J52j53L50m56J03m1l16
$$ -434 259 17 90 -66 -64 247 -172 43 175 -131 -385 83 -243 -13 139 -14 336 -120 -17 -58 -374
2516c74L27j94M5J92k39N2L40k38J45l34O3N55l85q3N28m04P2jm7K50k70Q7O6
$$ -374 -47 -241 -196 -4 -243 -191 149 -89 56 -278 -215 340 -45 -128 400 -4 68 67 20 270 0 87 153
2539A53k97J98K23m70O4k25L70K3q5L8J21k58j67L04Jj46l70L77K4k11L02L04
$$ 153 -144 54 277 -193 -129 -354 16 39 -46 -8 113 -145 -312 -8 -7 -153 -523 -146 -122 -333 -31 273
2561B73k30j06J71K52j81j82k82O33l00l88M47k58M79m71p1M21m12N8N36m64r3
$$ 273 43 -63 108 360 179 -3 -285 348 48 -340 107 -151 328 -143 -214 207 -205 -147 389 -75 -168
2582a68j35K08K55p11M97L31k80q5J90jL38m68K12L51n95j7L98k79J00n69N20
$$ -168 -303 -95 160 -551 -54 277 -3 -88 102 101 439 -29 183 534 -61 -78 320 41 141 -428 92
2603I2J50o52M60J23m19K37m9K1J37o04Q0O22m82K29J95n2j59J69L4L02n12L45
$$ 92 242 -410 50 173 -246 -9 -58 -37 100 -504 -424 198 -284 -55 140 88 -71 98 132 434 -78 267
2625B67n0k22L2j18M02m9q78M96L02k59K57l04K69k67m24O13M2k25m5K8j35K96
$$ 267 217 -5 27 -91 311 262 -616 -120 182 -77 180 -124 145 -122 -546 67 109 -116 -161 -133 -268 28
2647B8j73L26j3o27O79o0M1p8J24o2k33k05L67L11n66M05l09Q8J60l71L96j98
$$ 28 -145 181 168 -459 220 160 201 123 247 185 -48 -253 114 425 -141 264 -45 43 203 -168 228 30
2669C0k14J38j73m6L26j42K95l10l40O70o0l24K56l09jK18j41N07j69k83R0q3
$$ 30 -184 -46 -219 -265 61 -81 214 -96 -436 234 174 -150 106 -203 -204 14 -127 380 211 -72 18 -65
2691f5J05O1J26l6j12k20K96j15J56j94l3Q9j66k9M08o01J77J77l6Pm0k97K79
$$ -65 40 101 227 191 79 -141 155 40 196 2 -31 58 -108 -137 271 -330 -153 24 -12 -5 -45 -342 -63
2714f3o8j28J64J5K1j66J34K49l80K36l6n0Q3R2l58L03j43j49M70k31Ok9NJ84
$$ -63 -131 -259 -95 -80 -59 -225 -91 158 -222 14 -22 -72 11 103 -255 48 -95 -244 226 -5 1 -28 -23 161
2738A61k01Q3qj47Q4k22J61N8j09P0L02j70o5J56r8j83L62p4m5j86pJ98J0j96
$$ 161 -40 43 35 -112 -28 -250 -89 -31 -140 -70 232 62 -3 153 55 -128 234 160 115 -71 -78 120 130 -66
2762f6J45j44K14k47R3K34l80r0L4k9L30j73j70K08L9P4j88J85j97J97j13k7p
$$ -66 79 -65 149 -98 -5 229 -151 -241 -207 -236 94 -79 -249 -41 -2 72 -116 69 -128 69 -44 -71 -78
2785g8K03K60k13Q6p0k68L01l19J29j63J39m9J98l00J86p1k20L38l51K54L9j86
$$ -78 125 385 172 258 188 -80 221 -98 31 -132 7 -42 156 -144 42 -29 -249 89 -262 -8 31 -155
2807a55J74m2k82M46j17Rj59L0RJ78l3M32o69N3K22J62o5q0n1Q9k82q9M98l21
$$ -155 19 -23 -305 141 24 33 -126 -96 -87 91 58 490 -179 -126 96 258 193 113 62 151 -131 -220 278 -43
2831d3j74k7K1J95q9j99K68j68lL40k84K54n5l4J5k10K46L62m77J75k29j8J30
$$ -43 -217 -244 -223 -28 -117 -316 -48 -216 -219 121 -163 91 36 2 17 -193 53 415 -62 113 -116 -134 -4
2854dj11N4O66n97j65K07k27N59n27K30J7m51K55J64j67J29lk82J50Om5M04l33
$$ -4 -115 -61 605 8 -157 50 -177 382 -145 85 102 -349 -94 70 -97 32 29 -253 -103 -97 -142 262 -71
2877g1l12L15j34M83j52l56N76m74m3M88L8l73J77oQ9o07J93L90j36k53K23q8
$$ -71 -383 -68 -202 281 129 -227 349 -125 -168 320 358 -15 162 156 245 -362 -169 221 85 -168 55 -33
2899c3L61l33Q2J81l63O5k4r1P4j9L0L48o06J62J18M3J15k49J28K86m13K76J23
$$ -33 328 -5 77 258 -105 -40 -64 -155 -81 -100 -70 278 -328 -166 -48 -5 110 -139 -11 275 -138 138 261
2922B61l26J75j04J82P6k65L5l2m54L76L99m25J47j78J10m1k59L67J34l31J14
$$ 261 -65 110 6 188 264 -1 34 2 -452 -76 323 -102 45 -133 -23 -64 -323 44 178 -153 -39
2943c9O2q8R7m07M28P5m2J45j3l2k32j02K94k2q9J10q0N2j23j23K36N0n46K74
$$ -39 23 -65 32 -375 53 128 86 231 218 186 -46 -148 146 124 35 145 65 117 -6 -129 107 157 -389 -115
2967a15J97j40p7l07N12j61j16J90K09m34L59q0o9K8J02p8K40m98J81j33J25L00
$$ -115 82 -58 -135 -442 70 -91 -207 -17 192 -242 117 37 -32 -4 98 20 260 -238 -57 -190 -65 235
2989B35l81J76k08k11M57o0n8J36m27L13j70J65K13r1m17L87j29J60N7QpR3q7
$$ 235 -146 30 -178 -389 68 8 -50 86 -341 -28 -198 -33 180 89 -328 59 -70 90 147 155 148 241 154
3012A54J60j72j74O5r9oR4NQ4q0j66K58o3j0l14L18r1K17m58L87j53n3J48k02
$$ 154 314 142 -32 33 -66 -72 22 27 111 31 -135 123 60 50 -264 54 -37 180 -278 109 -44 -97 51 -151
3036a51J54n5k6J83nl82L71j00J70P3l54L88m50j5L86r7j77N9j97N25j78Q1R2
$$ -151 3 -52 -78 105 100 -282 89 -11 159 232 -122 266 -184 -199 187 90 -87 -28 -225 300 122 203 295
3059B95l57k7l6m1K70O2l56K51n6n8k0k11M44l32J9K28q5j1J37p3K60k66r9L77
$$ 295 -62 -89 -125 -166 104 166 -190 61 5 -53 -73 -284 160 -172 -153 75 -10 -21 116 43 303 37 -62 315
3083C15j69l73L2K1K86O1k88J41j18Q8j0j26J56j8k69L12j86j50N9M56j8m16J28
$$ 315 146 -227 -195 -174 112 173 -115 26 -92 -4 -14 -140 16 -2 -271 41 -145 -295 -236 220 202 -214 -86
3106h6oR9r5J10K5j94L19j20J86q9k62J21m5k09M53k56O8N5m17M33j19n18L02
$$ -86 -92 7 -88 22 47 -147 172 52 238 149 -113 8 -37 -246 207 -49 19 74 -343 90 -29 -547 -245
3129b45Kj69j2N17J0Pj66LJ17k0O8j79J79q0j14N26m30k53L65o2J3k03O4L14l98
$$ -245 -243 -412 -424 93 103 110 -56 -53 64 44 112 -67 112 32 -82 444 14 -239 126 64 77 -126 -62 252 -146
3154a46o7L70l68j9k7K22o8J12j87L23j39L4J06P2j78m3k20M82jl73J80m1K43
$$ -146 -213 157 -211 -230 -257 -35 -103 9 -178 145 6 40 146 218 40 -3 -223 259 258 -115 65 24 267
3177B67o0j50J19j87J68J62j77l58L33l36M3K8rL38k35J54k0j24R0j61j5O6l1
$$ 267 207 57 176 -11 157 319 142 -216 117 -219 -176 -148 -157 181 -54 100 80 -44 46 -115 -130 -64 -95
3200i5N5L22m75K16P4k10L62j86Q0M8j45j55L16n4k05j85K10M6k63J41K98p5l88
$$ -95 -40 282 -193 23 97 -113 249 63 143 191 46 -109 207 153 -52 -237 -27 19 -244 -103 195 120 -268
3223b68J05j40L49m0Pj01J24O3k49L47k11J7j8L88n35j6N52l50j76K90j89M17
$$ -268 -163 -303 46 6 13 -88 36 99 -150 197 -14 3 -15 373 -162 -178 374 24 -152 138 -51 366
3245C66m55J99Q9k18mj57K79K60m43j10L03l53K53r3J07O8k95J89J56l1K06k10
$$ 366 -89 110 199 -19 -23 -180 99 359 -84 -194 109 -244 9 -84 23 91 -204 -15 141 110 316 106
3267A06j69L54m46K31j78k4M78k23n2Rk11K7K59k43L81l28k45N92l05j43p9L07
$$ 106 -63 291 -155 76 -102 -126 352 129 77 86 -125 -98 161 -82 299 -29 -274 318 13 -130 -209 98
3289I8k71K12k50M01k59k22K63l38N53m5j62N6J30jn4K3m1L3o8P9m0J33j43j78
$$ 98 -173 39 -211 190 -69 -291 -28 -366 187 142 -20 36 166 165 111 134 93 126 58 137 97 230 87 -91
3313i1J95L9m12K79pk85J53K91m03J41J1M2L88k95J1K56M0k39j23J02l8k10O36
$$ -91 104 143 -269 10 3 -282 -129 162 -241 -100 -89 -47 341 46 57 313 353 114 -9 93 55 -155 481
3336D81o76k7L25o9R1P4m74L8K98j68J48k13R6K25m31J60K86k09K47k38j79L97
$$ 481 -195 -222 103 34 125 199 -275 -237 61 -107 41 -172 -76 149 -282 -122 164 -45 202 -36 -215 182
3358A82j32p2K08k60K2L3PJ15l47J56L34k74K08K5j85J23j42J56j64P4j32Q8k04
$$ 182 50 -22 186 -74 -52 -19 -12 103 -244 -88 246 -28 180 205 20 143 1 157 -7 67 -65 23 -181
3381a81J60R2j98j9M0J64J7l33L71j1k05R5k8j25K89j43L87n80J28j24K94J0p8
$$ -181 -21 71 -127 -146 -106 58 75 -258 113 102 -103 -8 -36 -161 128 -15 372 -208 -80 -204 90 100 22
3404B2k1J02N6k54O3K16o8M5l55J67J37l90O28l49j76K17j16K38k89j99K73P0
$$ 22 1 103 159 -95 -32 184 116 161 -194 -27 110 -280 348 -1 -177 40 -76 162 -127 -326 -53 17
3426A7j88L70l8J12o0k44L35m8o32N08N7j18J39m13K67J53n05K20J85l27K40p6
$$ 17 -171 199 161 273 213 -31 304 256 -376 132 189 71 210 -203 64 217 -288 -68 117 -210 30 -46
$$ [...]
8191A57
##END NTUPLES=NMR FID
##END=
