##TITLE=1H_Pr 2948
 CDCl3
 8 sc, 
 9.2.2023
##JCAMPDX= 6.0         $$ Bruker NMR JCAMP-DX V2.0
##DATA TYPE= NMR FID
##DATA CLASS= NTUPLES
##ORIGIN= UXNMR, Bruker Analytische Messtechnik GmbH
##OWNER= root
$$ XWIN-NMR		Version 3.5
$$ Thu Feb  9 16:43:35 2023 Russian Standard Time (UT+4h)  she@DPX200
##.OBSERVE FREQUENCY= 200.13135
##.OBSERVE NUCLEUS= ^1H
##.DELAY= (6, 6)
##.ACQUISITION MODE= SIMULTANEOUS
##.ACQUISITION SCHEME= undefined
##.AVERAGES= 8
##.DIGITISER RES= 18
##SPECTROMETER/DATA SYSTEM= spect
##.PULSE SEQUENCE= zg30
##.SOLVENT NAME= DMSO
##.SHIFT REFERENCE= (INTERNAL, DMSO, 0, 15.7039)
##AUDIT TRAIL= $$ (NUMBER, WHEN, WHO, WHERE, WHAT)
$$ ##TITLE= Audit trail, XWIN-NMR		Version 3.5
$$ ##JCAMPDX= 5.01
$$ ##ORIGIN= Bruker BioSpin GmbH
$$ ##OWNER= she
$$ F:/spectra/data/she/nmr/H-F/1/audita.txt
$$ ##AUDIT TRAIL=  $$ (NUMBER, WHEN, WHO, WHERE, WHAT)
(   1,<2023-02-09 16:42:28.40 +0400>,<she>,<DPX200>,
      <created by zg, POWCHK disabled, PULCHK disabled
       configuration hash MD5:
       00 E9 B6 7A A2 85 ED C7 34 08 36 98 17 FE 4E 26
       data hash MD5: 16K
       A5 10 6D 39 DD E2 E6 FE 16 36 D6 1C A1 52 0B 0B>)
$$ ##END=
$$ 
$$ hash MD5
$$ CE 0A C8 26 F4 53 56 65 4F 09 FD 5C 0E E4 A5 93
##$RELAX= 
##$RELAX= 
##$RELAX= 
##$RELAX= 
##$RELAX= 
##$RELAX= 
$$ Bruker specific parameters
$$ --------------------------
##$DU= <F:/spectra>
##$EXPNO= 1
##$NAME= <H-F>
##$PROCNO= 1
##$TYPE= <nmr>
##$USER= <she>
##$AMP= (0..31)
100 100 100 100 100 100 100 100 100 100 100 100 100 100 100 100 100 100 
100 100 100 100 100 100 100 100 100 100 100 100 100 100 
##$AQSEQ= 0
##$AQ_mod= 1
##$AUNM= <au_zg>
##$AUTOPOS= <>
##$BF1= 200.13
##$BF2= 200.13
##$BF3= 200.13
##$BF4= 200.13
##$BF5= 200.13
##$BF6= 200.13
##$BF7= 200.13
##$BF8= 200.13
##$BYTORDA= 1
##$CFDGTYP= 0
##$CFRGTYP= 5
##$CHEMSTR= <none>
##$CNST= (0..31)
1 1 145 1 1 1 1 1 1 1 1 1 1 1 1 1 1 1 1 1 1 1 1 1 1 1 1 1 1 1 1 1 
##$CPDPRG= <>
##$CPDPRG1= <>
##$CPDPRG2= <>
##$CPDPRG3= <>
##$CPDPRG4= <mlev>
##$CPDPRG5= <mlev>
##$CPDPRG6= <mlev>
##$CPDPRG7= <mlev>
##$CPDPRG8= <mlev>
##$CPDPRGB= <>
##$CPDPRGT= <>
##$D= (0..31)
0 1.2 0 0 0 0 0 0 0 0.06 0 0.03 0 0 0 0 0.0002 0 0 0 0 0 0 0 0 0 0 0 0 
0 0 0 
##$DATE= 1675946547
##$DBL= (0..7)
120 120 120 120 120 120 120 120 
##$DBP= (0..7)
150 150 150 150 150 150 150 150 
##$DBP07= 0
##$DBPNAM0= <>
##$DBPNAM1= <>
##$DBPNAM2= <>
##$DBPNAM3= <>
##$DBPNAM4= <>
##$DBPNAM5= <>
##$DBPNAM6= <>
##$DBPNAM7= <>
##$DBPOAL= (0..7)
0.5 0.5 0.5 0.5 0.5 0.5 0.5 0.5 
##$DBPOFFS= (0..7)
0 0 0 0 0 0 0 0 
##$DE= 6
##$DECBNUC= <off>
##$DECIM= 32
##$DECNUC= <off>
##$DECSTAT= 4
##$DIGMOD= 1
##$DIGTYP= 9
##$DL= (0..7)
0 120 120 120 120 120 120 120 
##$DP= (0..7)
150 150 150 150 150 150 150 150 
##$DP07= 0
##$DPNAME0= <>
##$DPNAME1= <>
##$DPNAME2= <>
##$DPNAME3= <>
##$DPNAME4= <>
##$DPNAME5= <>
##$DPNAME6= <>
##$DPNAME7= <>
##$DPOAL= (0..7)
0.5 0.5 0.5 0.5 0.5 0.5 0.5 0.5 
##$DPOFFS= (0..7)
0 0 0 0 0 0 0 0 
##$DQDMODE= 0
##$DR= 18
##$DS= 0
##$DSLIST= <SSSSSSSSSSSSSSS>
$$ [...]
##$SUBNAM2= <"">
##$SUBNAM3= <"">
##$SUBNAM4= <"">
##$SUBNAM5= <"">
##$SUBNAM6= <"">
##$SUBNAM7= <"">
##$SUBNAM8= <"">
##$SUBNAM9= <"">
##$SW= 18.05172834244
##$SWIBOX= (0..15)
0 0 2 0 0 0 0 0 0 0 0 0 0 0 0 0 
##$SW_h= 3612.71676300578
##$TD= 16384
##$TD0= 1
##$TE= 0
##$TE2= 300
##$TE3= 300
##$TEG= 300
##$TL= (0..7)
0 120 120 120 120 120 120 120 
##$TP= (0..7)
150 150 150 150 150 150 150 150 
##$TP07= 0
##$TPNAME0= <>
##$TPNAME1= <>
##$TPNAME2= <>
##$TPNAME3= <>
##$TPNAME4= <>
##$TPNAME5= <>
##$TPNAME6= <>
##$TPNAME7= <>
##$TPOAL= (0..7)
0.5 0.5 0.5 0.5 0.5 0.5 0.5 0.5 
##$TPOFFS= (0..7)
0 0 0 0 0 0 0 0 
##$TUNHIN= 0
##$TUNHOUT= 0
##$TUNXOUT= 0
##$USERA1= <user>
##$USERA2= <user>
##$USERA3= <user>
##$USERA4= <user>
##$USERA5= <user>
##$V9= 5
##$VALIST= <valist>
##$VCLIST= <CCCCCCCCCCCCCCC>
##$VD= 0
##$VDLIST= <DDDDDDDDDDDDDDD>
##$VPLIST= <PPPPPPPPPPPPPPP>
##$VTLIST= <TTTTTTTTTTTTTTT>
##$WBST= 1024
##$WBSW= 4
##$XGAIN= (0..3)
0 0 0 0 
##$XL= 0
##$YL= 0
##$YMAX_a= 139078
##$YMIN_a= -137239
##$ZGOPTNS= <>
##$ZL1= 120
##$ZL2= 120
##$ZL3= 120
##$ZL4= 120
##$ABSF1= 10
##$ABSF2= 0
##$ABSG= 5
##$ABSL= 3
##$ALPHA= 0
##$AQORDER= 0
##$ASSFAC= 0
##$ASSFACI= 0
##$ASSFACX= 0
##$ASSWID= 0
##$AUNMP= <proc_1d>
##$AZFE= 0.1
##$AZFW= 0.1
##$BCFW= 1
##$BC_mod= 2
##$BYTORDP= 1
##$COROFFS= 0
##$CY= 11.3945322036743
##$DATMOD= 1
##$DC= 2
##$DFILT= <>
##$DTYPP= 0
##$F1P= 2.36226072786647
##$F2P= -0.459571619588291
##$FCOR= 0.5
##$FTSIZE= 0
##$FT_mod= 4
##$GAMMA= 1
##$GB= 0.15
##$INTBC= 1
##$INTSCL= 1
##$ISEN= 128
##$LB= 0.24
##$LEV0= 0
##$LPBIN= 0
##$MAXI= 10000
##$MC2= 0
##$MEAN= 0
##$ME_mod= 0
##$MI= 1.114404
##$NCOEF= 0
##$NC_proc= 0
##$NLEV= 6
##$NOISF1= 3.799351
##$NOISF2= 2.8
##$NSP= 1
##$NTH_PI= 0
##$NZP= 0
##$OFFSET= 15.70392
##$PC= 1
##$PHC0= -19108.92
##$PHC1= 2.800783
##$PH_mod= 1
##$PKNL= yes
##$PPARMOD= 0
##$PSCAL= 0
##$PSIGN= 0
##$REVERSE= no
##$SF= 200.130013532006
##$SI= 16384
##$SIGF1= 3
##$SIGF2= 2
##$SINO= 400
##$SIOLD= 16384
##$SREGLST= <1H.CDCl3>
##$SSB= 0
##$STSI= 0
##$STSR= 0
##$SW_p= 3612.71676300578
##$SYMM= 0
##$S_DEV= 0
##$TDeff= 0
##$TDoff= 0
##$TI= <>
##$TILT= no
##$TM1= 0
##$TM2= 0
##$TOPLEV= 0
##$USERP1= <user>
##$USERP2= <user>
##$USERP3= <user>
##$USERP4= <user>
##$USERP5= <user>
##$WDW= 1
##$XDIM= 8192
##$YMAX_p= 0
##$YMIN_p= 0
$$ End of Bruker specific parameters
$$ ---------------------------------
##NTUPLES= NMR FID
##VAR_NAME=  TIME,          FID/REAL,        FID/IMAG
##SYMBOL=    X,             R,               I
##VAR_TYPE=  INDEPENDENT,   DEPENDENT,       DEPENDENT
##VAR_FORM=  AFFN,          ASDF,            ASDF
##VAR_DIM=   8192,          8192,            8192
##UNITS=     SECONDS,       ARBITRARY UNITS, ARBITRARY UNITS
##FACTOR=    0.0002768,     1,               1
##FIRST=     0,             0,               0
##LAST=      2.2672688,     0,               0
##MIN=       0,             -137239,         0
##MAX=       2.2672688,     139078,          0
$$ Real data points
##PAGE= N=1
##DATA TABLE= (X++(R..R)), XYDATA
$$ [...]
$$ plain form
1908 -302 235 1391 529 -411 218 413 118 -750 -237 540 -708 -1068 47 100 -790 -956 -39 501 -724
1927 -724 -350 874 195 -234 340 933 666 -191 292 1346 95 -294 512 494 13 -617 -95 588 -616
1946 -616 -758 192 -252 -717 -618 -404 99 -968 -622 613 -202 -404 -2 369 400 -501 75 771 -220 -29
1966 -29 539 16 -7 -168 5 372 -661 -581 353 -314 -448 -248 -88 247 -535 261 546 -462 -169 376
1986 376 424 389 85 371 589 -316 171 353 371 -137 -224 157 284 -737 -258 206 -711 -350 -136 123 321
2007 321 -724 282 632 -50 -197 666 201 349 -48 242 734 -423 -123 187 -376 -434 -446 -176 32 -865
2027 -865 -655 -54 -460 -292 76 121 196 -169 269 337 -271 322 531 188 550 -165 262 760 -74 44 335
2048 335 107 30 -135 112 -58 -837 -398 -394 -653 -648 -359 -198 39 -514 -147 357 122 145 394 160 439 108
$$ packed form
1908c02N37J156q62r40O29J95k95q68N13P77j248l60J115N3q90j66R17N40j225
1927g24L74J224o79m29N74N93k67q57M83J054j251l89Q06j8m81o30N22O83j204
1946f16j42R50m44m65R9K14N03j067L46J235q15k02M02L71L1r01N76O96r91J91
1966b9N68n23k3j61J73L67j033Q0R34o67j34K00J60L35p82P96K85j008K93N45
1986C76M8l5l04K86K18r05M87J82J8n08q7L81J27j021M79M64r17L61K14K59J98
2007C21j045J006L50o82j47Q63m65J48l97K90M92j157L00L10n63n8j2K70K08q97
2027h65K10O01m06J68L68M5P5l65M38O8o08N93K09l43L62p15M27M98q34J18K91
2048C35k28p7j65K47j70p79M39Mk59NK89J61K37n53L67N04k35K3K49k34K79l31
$$ plain form
2070 108 502 605 -153 465 502 367 9 -107 187 -58 -538 -181 -164 -670 -116 -446 -211 264 -865 -471
2090 -471 250 -351 65 -231 88 445 -184 183 442 107 278 233 82 188 -147 366 204 -715 -168 91
2110 91 -219 16 -334 -101 -39 -467 3 219 -163 -268 -2 384 182 -151 301 417 23 124 316 41 346
2131 346 -164 387 263 -576 293 91 -366 -286 -497 101 69 -709 -88 263 -288 -237 -145 176 78 -456 182 112
2153 112 -291 40 66 63 -150 -150 611 83 -640 158 267 -68 -162 80 238 153 -213 377 230 -424 205 126 380
2176 380 100 -451 361 285 -395 231 263 -126 -218 -2 170 -196 -729 -3 280 -593 -513 -159 233 -325 -617
2197 -617 311 269 -281 59 577 422 -210 -134 687 45 -287 -22 242 -175 -141 9 322 -305 -778 136 198
2218 198 -239 -221 -53 83 -112 -268 533 136 -283 184 358 339 -165 -164 846 73 -319 805 395 29 -341
$$ packed form
2070A08L94J03p58O18L7j35l58j16K94k45m80L57J7n06N54l30K35M75j129L94
2090d71P21o01M16k96L19L57o29L67K59l35J71m5j51J06l35N13j62r19N47K59
2110I1l10K35l50K33O2m28M70K16l82j05K66L86k02l33M52J16l94J01J92k75L05
2131C46n10N51j24q39Q69k02m57Q0k11N98l2p78O21L51n51N1R2L21r8n34O38p0
2153A12m03L31K6lk13%P61n28p23P98J09l35r4K42J58q5l66N90j47o54O29p9K54
2176C80k80n51Q12p6o80O26L2l89r2K16J72l66n33P26K83q73Q0L54L92n58k92
2197f17R28m2n50L40N18j55o32P6Q21o42l32K65K64m17L4J50L13o27m73R14O2
2218A98m37J8J68J36j95j56Q01l97m19M67J74j9n04JJ010p73l92J124m10l66l70
$$ plain form
2239 -341 122 368 -515 -800 397 -104 -1004 -81 147 -207 -511 -416 352 -403 -485 233 321 -169 -98 101 431
2260 431 -356 -288 585 385 -274 2 255 457 -604 -379 474 -55 -430 -113 313 -195 -309 -17 721 -433
2280 -433 -564 511 224 -212 -235 -40 482 -441 -272 763 -129 -432 129 347 317 -229 -506 624 -134 -771
2300 -771 191 230 124 -502 -73 487 -532 -453 674 295 -179 -198 142 165 -485 -137 855 102 -46 248 294
2321 294 30 -624 147 542 -279 -288 104 281 -100 -324 308 621 -411 -179 498 -117 -19 -346 319 290 -393
2342 -393 -161 326 -288 -333 92 229 -373 -501 247 473 -792 -109 555 49 -192 -329 266 134 -518 34
2362 34 827 -36 -345 433 417 402 -242 230 352 -323 -270 289 157 -170 -693 236 27 -800 -308 741 -43
2383 -43 -297 -17 119 -86 -540 188 566 -453 -116 490 369 26 -137 216 365 -147 138 407 -94 -254
$$ packed form
2239c41M63K46q83k85J197n01r00R23K28l54l04R5P68p55q2P18Q8m90P1J99L30
2260D31p87O8Q73k00o59K76K53K02j061K25Q53n29l75L17M26n08j14K92P38j154
2280d33j31J075k87m36k3J95N22r23J69J035q92l03N61K18l0n46k77J130p58o37
2300g71R62L9j06o26M29N60j019P9J127l79m74j9L40K3o50L48R92p53j48K94M6
2321B94k64o54P71L95q21rL92J77l81k24O32L13j032K32O77o15R8l27O65k9o83
2342c93K32M87o14m5M25J37o02j28P48K26j265O83O64n06k41j37N95j32o52N52
2362C4P93q63l09P78j6j5o44M72J22o75N3N59j32l27n23R29k09q27M92J049p84
2383d3k54K80J36k05m54P28L78j019L37O06j21l43j63L53J49n12K85K69n01j60
$$ plain form
2403 -254 -460 32 134 -545 -125 187 -438 -225 95 179 -3 -427 68 309 -296 257 196 334 13 56 429
2424 429 511 -185 477 371 123 -50 203 229 195 -456 44 290 -279 -229 41 233 -277 -265 87 -86 -642 -51
2446 -51 250 -102 -134 -105 359 -100 -489 -34 405 -192 -55 -19 285 -295 -87 426 118 -110 8 -67 -26 -346
2468 -346 -489 418 164 -328 54 85 111 168 292 164 178 -390 102 454 -169 70 397 103 -13 -24 343 287
2490 287 -211 312 348 -65 -160 -56 143 -88 -281 240 75 177 -37 -173 157 -143 -192 174 -135 -189 -129 -108
2512 -108 -23 -72 -120 354 -311 -478 195 56 0 214 -354 337 -68 -321 427 33 126 100 406 367 5 -77 456
2535 456 -126 -51 -14 -17 -24 -603 -254 80 -337 -335 229 125 147 281 80 347 36 -117 399 214 -182 69 110
2558 110 89 51 -101 248 -38 -30 -191 -162 175 -184 -221 65 -258 -169 213 -21 24 -102 30 246 -102 187 357
$$ packed form
2403b54k06M92J02o79M20L12o25K13L20Q4j82m24M95K41o05N53o1J38l21M3L73
2424D29Q2o96O62j06k48j73K53K6l4o51N00K46n69N0K70J92n10J2L52j73n56N91
2446e1L01l52l2K9M64m59l89M55M39n97J37L6L04n80K08N13l08k28J18p5M1l20
2468c46j43R07k54m92L82L1K6N7J24j28J4n68M92L52o23K39L27k94j16j1L67n6
2490B87m98N23L6m13r5J04J99k31j93N21j65J02k14j36L30l00m9L66l09n4O0K1
2512a08Q5m9m8M74o65j67O73j39n6K14n68O91m05k53P48l94R3k6L06l9l62q2N33
2535D56n82P5L7lpn79L49L34m17KN64j04K2J34k01K67l11j53N16j85l96K51M1
2558A10k1l8j52L49k86Qj61K9L37l59l7K86l23Q9L82k34M5j26J32K16l48K89J70
$$ plain form
2581 357 -86 156 -117 180 254 -19 219 308 133 75 129 -43 162 -156 -87 304 -334 -156 -213 8 -216 -171
2603 -171 2 143 -303 -156 159 -12 14 -16 124 332 16 80 213 -70 -34 88 -33 -72 72 16 460 -185
2625 -185 110 -70 -300 -89 55 243 112 -49 20 240 -249 -125 -61 -155 115 -66 -90 310 -275 265 -79
2646 -79 328 178 5 -13 138 -46 -163 205 -180 187 -3 45 174 -151 -104 142 -42 -12 55 158 123 45 -164
2669 -164 81 -394 235 -16 -166 172 -226 59 230 -75 -46 140 120 128 -39 15 122 125 56 144 -151 -100 34
2692 34 -103 140 -216 -113 306 99 -160 14 42 -160 -340 -232 147 -343 -109 281 70 -107 26 146 132
2713 132 -301 -91 119 116 -27 71 87 395 -132 122 134 -179 114 152 -41 27 -146 -35 -79 -303 -261 -73 -164
2736 -164 -176 -200 112 290 -441 237 268 100 240 96 99 293 -52 103 147 -407 45 131 77 188 -63 -28 281
$$ packed form
2581C57m43K42k73K97P4k73K38Q9j75n8N4j72K05l18O9L91o38J78n7K21k24M5
2603a71J73J41m46J47L15j71K6l0J40K08l16O4J33k83L6J22j21l9J44n6M44o45
2625a85K95j80k30K11J44J88j31j61O9K20m89J24O4r4K70j81k4M00n85N40l44
2646g9M07j50j73j8J51j84j17L68l85L67j90M8J29l25M7K46j84L0O7J03l5p8k09
2669a64K45m75O29k51j50L38l98K85J71l05K9J86k0Qj67N4J07Lo9Q8k95N1J34
2692C4j37K43l56J03M19k07k59J74K8k02j80J08L79m90K34L90k11j77J33J20j4
2713A32m33K10K10lj43R8J6L08n27K54J2l13K93L8j93O8j73J11m4k24M2J88r1
2736a64j2k4L12J78p31O78L1j68J40j44LJ94l45J55M4n54M52Q6n4J11k51L5L09
$$ plain form
2759 281 -324 51 137 -52 -173 -179 -117 71 -221 73 124 -210 -195 -20 16 17 -54 29 165 84 117 191 14 1 34
2784 34 -85 241 -46 404 145 -19 -139 -195 -75 72 -145 153 119 -451 -80 -191 142 98 -249 134 -52
2805 -52 -292 157 235 88 130 174 169 97 -311 198 220 -59 -282 -37 199 -177 -450 214 41 -400 -34 -142 -8
2828 -8 16 -155 136 -172 -32 280 50 -201 -1 55 310 181 -209 259 326 -256 455 119 141 15 -39 440
2850 440 137 -232 -68 -150 -103 -103 -208 217 68 -3 135 -48 -116 -238 227 -44 -371 46 254 305 -329 -156
2872 -156 131 -5 212 -118 206 -107 -160 116 10 -134 87 151 100 35 -173 168 249 -32 -12 124 -115 -446
2894 -446 -67 114 -98 -69 205 9 253 -182 -256 203 -119 -4 185 -65 -176 -210 -4 335 52 107 220
2915 220 -214 20 94 334 112 -62 -79 -48 -142 -388 -238 -74 142 -278 -10 178 -81 -43 21 -171 -1 107
$$ packed form
2759B81o05L75Q6j89j21oO2J88k92K94N1l34J5J75L6Jp1Q3J36q1L3P4j77j3L3
2784C4j19L26k87M50k59j64j20n6J20J47k17K98l4n70L71j11L33m4l47L83j86
2805e2k40M49P8j47M2M4np2m08N09K2k79k23K45K36l76k73O64j73m41L66j08J34
2828hK4j71K91l08J40L12k30k51K00N6K55j29l90M68O7n82P11l36K2j26n4M79
2850D40l03l69J64q2M7%j05M25j49p1J38j83o8j22M65k71l27M17K08N1o34J73
2872a56K87j36K17l30L24l13n3K76j06j44K21O4n1o5k08L41Q1k81K0J36k39l31
2894d46L79J81k12K9K74j96K44m35p4M59l22J15J89k50j11l4K06L39k83N5J13
2915B20m34K34P4K40k22j74j7L1r4k46J50J64K16m20K68J88k59L8O4j92J70J08
$$ plain form
2937 107 107 -113 -173 -196 239 -20 -162 24 173 103 -109 154 261 -185 -212 161 -198 -251 -145 129 115 -154 47
2960 47 18 -33 -233 -279 -37 40 -316 13 204 1 -57 264 39 236 241 379 51 -138 -84 182 94 -39 -166
2983 -166 -114 195 -241 -35 -274 -195 -222 -49 -202 -113 -340 -169 90 -309 -161 278 -14 42 -31 -37 122 -143 13
3006 13 138 -75 -144 -79 -13 -41 -363 -104 85 -184 -95 213 197 74 -163 242 167 -255 -195 30 -228 -211 160
3029 160 53 187 -55 64 54 -164 47 -146 138 -11 -152 186 211 -208 -130 -28 156 211 -121 44 -104
3050 -104 -217 163 153 -74 97 89 -136 111 -2 72 -22 -189 13 -215 105 35 -197 284 -195 -200 -57 9 79
3073 79 -72 -78 60 117 -75 242 154 -172 -39 -149 41 9 -55 -51 -277 -218 36 -32 57 -193 -20 337 60 -160
3097 -160 138 -110 93 -96 124 297 187 -67 49 153 -139 -128 13 -72 64 -382 -2 10 -300 119 -142
$$ packed form
2937A07%k20o0k3M35k59j42J86J49p0k12K63J07m46k7L73l59n3J06K74j4k69K01
2960D7k9n1k00m6K42P7l56L29J91k03n8L21k25J97NJ38l28j89N4K66q8j33j27
2983a66N2L09m36K06k39P9k7J73j53Q9k27J71K59l99J48M39k92N6p3oJ59k65J56
3006A3J25k13o9O5O6k8l22K59J89k69Q9L08j6j23k37M05p5m22O0K25k58J7L71
3029A60j07J34k42J19j0k18K11j93K84j49j41L38K5m19P8J02J84N5l32J65j48
3050a04j13L80j0k27J71qk25K47j13P4r4j67K02k28L20p0k32M81m79nJ43O6P0
3073G9j51oJ38N7j92L17q8l26J33j10J90l2o4Mk26N9K54o8Q9k50J73L57k77k20
3097a60K98k48K03j89K20J73j10k54J16J04k92J1J41q5J36m46L80J2l10M19k61
$$ plain form
3118 -142 -53 0 -198 20 -93 -282 93 -237 -144 16 -60 86 -200 127 458 39 227 -78 -68 157 72 24
3140 24 303 65 -12 67 162 -112 -187 -76 -108 110 -359 -48 37 -22 -158 -11 -208 185 -175 -2 39 -53 113
3163 113 -99 110 -266 -4 521 -164 -159 85 -105 83 39 -34 34 -282 -98 142 -41 -16 -52 -27 253 -234 -137
3186 -137 178 60 -82 -228 -96 198 12 -188 55 90 -17 183 139 -87 49 45 145 54 -111 8 -171 -169
3208 -169 68 -96 -100 -148 -150 53 -46 38 49 -72 -72 -282 21 -45 193 -99 25 112 67 -16 30 124 -125 192 45
3233 45 13 129 229 -48 223 110 239 -72 -91 14 -102 -5 -10 209 -167 3 -244 36 75 19 80 -274 170
3256 170 99 119 94 1 -346 78 63 -326 49 76 172 -98 -137 -380 147 157 46 100 180 86 -37 -219 16 -105
3280 -105 109 -250 -210 31 -12 142 -8 27 -106 -169 -75 92 85 -43 331 -117 70 251 164 154 124 60 47 180
$$ packed form
3118a42Q9N3j98K18j13j89L75l30R3J60p6J46k86L27L31m19J88l05J0K25q5m8
3140B4K79k38p7P9R5k74p5J11l2K18m69L11Q5n9j36J47j97L93l60J73M1r2J66
3163A13k12K09l76K62N25o85NK44j90J88m4p3O8l16J84K40j83K5l6K5K80m87R7
3186a37L15j18j42j46J32K94j86k00K43L5j07K00m4k26J36mJ00r1j65J19j79K
3208a69K37j64mm8kK03r9Q4J1j21%k10L03o6K38k92J24Q7m5q3M6R4k49L17j47
3233D5l2J16J00k77K71j13J29l11j9J05j16R7nK19l76J70k47K80L9n6O1l54M44
3256A70p1K0k5r3l47M24j5l89L75K7R6k70l9k43N27J0j11N4Q0r4j23j82K35j21
3280a05K14l59M0K41m3J54j50L5j33o3R4J67pj28L74m48J87J81q7j0l0o4j3J33
$$ plain form
3304 180 153 209 20 122 42 -21 -113 -137 -62 133 248 -121 41 22 -62 -84 -92 273 1 -1 -168 100 -52 -175 119
3329 119 -115 82 190 135 67 -39 255 220 124 -68 -189 53 -306 25 -18 201 -63 -2 49 -59 -65 -243 -42
3352 -42 -114 -30 76 -51 -92 -46 231 -150 -19 72 -50 -29 132 -198 135 184 -263 -54 -87 -71 -77 -374 76 180
3376 180 -234 141 -19 -254 35 -86 -120 160 40 100 420 110 -78 -93 321 84 -201 -42 229 -159 -205
3397 -205 96 121 88 -157 164 -205 -138 325 -51 193 168 -257 -145 -163 -113 -179 -95 -222 31 40 -2 -294 -375 90
3421 90 -157 -160 -21 -137 143 193 22 36 156 -25 85 -26 -1 -78 -88 -25 -192 -236 -111 -13 -12 32 -71 105 -90
3446 -90 40 387 -1 -150 192 281 -89 -13 -31 121 157 -201 -116 85 176 -4 -194 441 -102 62 -107 101
3468 101 -262 -90 77 36 -233 -284 358 67 -40 244 -66 106 -177 52 -82 -241 -151 651 -9 -165 161
$$ packed form
3304A80k7N6j89J02q0o3r2k4P5J95J15l69J62j9q4k2qL65k72kj67K68j52j23K94
3329A19k34J97J08n5o8j06K94l5r6j92j21K42l59L31m3K19k64O1N1j08oj78K01
3352d2p2Q4J06j27m1M6K77l81J31R1j22K1J61l30L33M9m47K09l3J6ok97M50J04
3376A80m14L75j60k35K89j21l4K80j20O0L20l10j88j5M14k37k85J59K71l88m6
3397b05L01K5l3k45L21l69O7M63l76K44k5m25J12j8N0o6Q4j27K53Rm2k92q1M65
3421I0k47lJ39j16K80N0j71J4J20j81J10j11K5p7j0O3j67m4J25R8JM4j03J76j95
3446i0J30L47l88j49L42Q9l70P6j8J52L6l58Q5K01R1j80j90O35n43J64j69K08
3468A01l63J72J67m1k69n1O42k91j07K84l10J72k83K29j34j59R0Q02o60j56L26
$$ plain form
3489 161 -45 98 64 -16 31 66 -125 39 -255 152 -145 -94 98 -198 -99 273 123 -56 68 33 -16 391 -103
3512 -103 91 -97 -198 97 57 311 -118 -134 20 -122 193 80 9 -9 7 -53 286 -131 -24 153 5 -168
3534 -168 -112 -97 20 -16 -93 -60 12 -3 44 268 -80 10 60 10 -151 -54 28 -82 93 -2 188 29 75 -83 13
3559 13 -159 92 69 12 -108 12 -60 -70 -97 188 -180 -203 72 -124 101 124 -223 83 325 -65 21 11 164
3582 164 14 14 276 -134 -59 288 178 -359 100 -14 -70 170 -27 222 44 -167 3 187 258 24 16 -137
3604 -137 -21 -246 -11 62 -181 197 -45 181 137 80 114 122 254 179 103 -251 -77 24 -160 -71 130 123 -111 162
3628 162 32 109 124 -185 59 -55 65 -118 144 13 50 -96 -54 159 -43 -84 112 81 -158 33 -341 20
3650 20 185 122 -49 24 -80 109 135 -12 107 188 161 -35 60 160 -349 149 -187 -194 48 -27 -228 -122 17
$$ packed form
3489A61k06J43l4q0M7L5j91J64k94M07k97N1J92k96R9L72j50j79J24l5m9M07m94
3512a03J94j88j01K95m0K54m29j6J54j42L15j13p1j8J6o0L39m17J07J77j48j73
3534a68N6J5J17l6p7L3P2j5M7K24l48R0N0n0j61R7Q2j10J75r5J90j59M6j58R6
3559A3j72K51k3n7j20J20p2j0k7K85l68k3K75j96K25K3l47L06K42l90Q6j0J53
3582A64j50%K62m10P5L47j10n37M59j14n6K40j97K49j78k11J70J84P1k34qj53
3604a37J16k25K35P3k43L78k42K26m4n7L4QJ32p5p6l54J74J01j84Q9K01pk34K73
3628A62j30P7J5l09K44j14J20j83K62j31L7j46M2K13k02m1J96l1k39J91l74L61
3650B0J65o3j71P3j04J89K6j47J19Q1k7j96R5J00n09M98l36pK42p5k01J06J39
$$ plain form
3673 17 231 -87 -244 59 97 -134 102 -139 -149 162 -57 -193 127 -21 -29 -93 -137 -47 -144 317 -122 34 95
3696 95 -238 -209 -134 16 102 114 -215 66 9 -24 -21 11 61 -123 -89 94 25 1 -90 -42 -51 73 8 184 29 4 127
3723 127 -79 -178 -146 -173 -147 -38 171 73 28 -56 -37 -28 21 58 126 -12 -32 92 69 99 -275 270 -386 -199 122
3748 122 -40 42 24 173 56 -155 60 69 -105 79 13 -154 -176 60 273 63 -68 -126 186 93 139 -353 -130
3771 -130 -43 -55 31 -23 -39 135 138 246 -168 -99 344 -130 -105 267 158 177 -155 101 237 -198 61 150 -261 -197
3795 -197 -215 -133 -67 -147 35 70 -98 46 -61 -113 130 -223 -226 -360 -23 -95 48 0 -41 10 8 -54 -87 31 244
3820 244 75 -69 102 -16 83 -8 -64 -19 -11 18 -129 210 -14 -125 116 -107 -216 292 34 -211 -22 -118 -163
3843 -163 -132 -17 162 -76 86 -18 -57 -17 108 22 -57 477 -205 35 43 -130 104 81 -156 -56 -144 -106 116
$$ packed form
3673A7K14l18j57L03L8k31K36k41j0L11k19j36L20j48qo4m4R0r7M61m39J56O1
3696I5l33K9P5J50Q6J2l29K81n7l3LL2N0j84L4J83o9k4r1M8rJ24o5J76j55k5J23
3723A27k06r9L2k7K6J09K09r8m5q4J9RM9L7O8j38k0J24k3L0l74N45o56J87L21
3748A22j62Q2j8J49j17k11K15Rj74J84o6j67k2K36K13k10j31n8L12r3M6m92K23
3771a30Q7j2Q6n4j6J74LJ08m14O9M43m74K5L72j09J9l32K56J36m35K59Q9m11O4
3795a97j8Q2O6q0J82L5j68J44j07n2K43l53lj34L37p2J43m8m1N1ko2l3J18K13
3820B44j69j44J71j18R9r1n6M5QK9j47L39k24j11K41k23j09N08k58k45J89r6m5
3843a63L1J15J79k38J62j04l9M0J25q6p9N34o82K40Qj73K34k3k37J00q8L8K22
$$ plain form
3866 116 49 33 32 166 62 -96 20 122 -97 -81 248 73 193 -77 75 254 49 184 -44 -66 64 -300
3888 -300 -104 274 -206 -116 59 -111 -123 72 -75 60 196 -31 -7 -42 120 214 -81 -15 -213 -124 165 -85
3910 -85 -43 87 60 21 129 279 87 -132 -220 102 -40 -116 25 115 370 -133 -117 189 28 -58 3 1 53 -33 186
3935 186 -80 -186 37 -109 283 -133 -45 -132 99 -254 35 19 227 146 177 46 -119 -22 93 38 -267 32
3957 32 -190 116 51 -310 -5 -167 -224 26 -57 -162 30 -41 4 -102 -152 156 48 -40 -46 -27 -259 -10 -164 269
3981 269 179 -214 114 156 67 74 77 -187 -18 -47 -317 206 -97 163 -21 49 2 -36 96 15 -256 205 -48 -92
4005 -92 -28 45 74 -158 95 -1 6 178 237 -1 -166 33 215 87 159 49 208 -124 122 -71 23 -4 139 214
4029 214 -254 -102 4 135 72 142 155 -68 -209 -5 199 232 39 -95 -38 -121 -48 110 -60 -290 -24 -26 -43
$$ packed form
3866A16o7j6jJ34j04j58J16J02k19J6L29j75J20k70J52J79k05J35k28k2J30l64
3888c00J96L78m80R0J75j70j2J95j47J35J36k27K4l5J62R4k95O6j98Q9K89k50
3910h5M2J30k7l9J08J50j92k19q8L22j42p6J41R0K55n03J6L06j61q6O1kN2q6K19
3935A86k66j06K23j46L92m16Q8q7K31l53K89j6K08q1L1j31j65R7J15n5l05K99
3957C2k22L06o5l61L05j62n7K50q3j05J92p1M5j06n0L08j08q8oJ9k32K49j54M33
3981B69r0l93L28M2q9PLk64J69k9k70N23l03K60j84P0m7l8J32q1k71M61k53m4
4005i2O4P3K9k32K53r6PJ72N9k38j65J99J82j28P2j10J59l32K46j93R4k7J43P5
4029B14m68J52J06J31o3P0J3k23j41K04K04L3j93j34N7q3P3J58j70k30K66kj7
$$ plain form
4052 -43 0 37 195 37 -237 -58 -128 -200 -172 184 115 -173 194 -243 -48 100 -200 214 143 -37 51 -173 -157
4075 -157 -101 104 -19 -44 66 -323 92 53 -34 4 109 93 145 -117 -41 -139 61 -28 -59 -169 -117 65 -17 48 -162
4100 -162 -129 -173 198 61 -27 251 -4 266 -194 103 12 200 46 63 25 110 87 -99 46 154 -52 152 319
4123 319 -229 6 125 154 12 -12 7 -96 -214 70 -63 -8 102 -47 32 147 -18 91 -8 78 -211 -154 -260
4146 -260 22 -223 -158 -220 150 131 161 204 51 105 -4 50 -4 -50 8 260 123 169 262 -191 128 41 40 78 175 -16
4172 -16 129 86 -290 182 -107 90 106 -147 197 22 -1 -26 -135 -127 34 255 183 29 -114 158 -282 31 14
4195 14 312 -202 -65 0 73 23 -226 195 -117 204 13 -42 35 42 -200 -166 -256 142 -127 58 168 -22 -24 -231
4219 -231 -152 106 49 -168 29 -210 -4 204 12 -457 210 -143 -152 -168 251 34 -192 112 129 -200 11 -55
$$ packed form
4052d3M3L7J58j58k74J79p0p2K8L56o9k88L67m37J95J48l00M14p1j80Q8k24J6
4075a57N6K05j23k5J10l89M15l9q7L8J05j6N2k62P6r8K00q9l1j10N2J82q2O5k10
4100a62L3m4L71j37q8K78k55K70m60K97r1J88j54J7l8Q5k3j86J45J08k06K04J67
4123C19n48K35J19K9j42k4J9j03j18K84j33N5J10j49P9J15j65J09r9Q6k89N7j06
4146b60K82k45O5o2L70j9L0M3j53N4j09N4n4m6N8K52j37M6R3m53L19q7jL8R7j91
4172a6J45m3l76M72k89J97J6k53L44j75k3k5j09QJ61K21p2j54j43K72m40L13j7
4195A4K98n14J37O5P3n0k49M21l12L21j91n5P7Pk42L4r0L98k69J85J10j90kk07
4219b31P9K58n7k17J97k39K06K08j92m69O67l53rj6M19k17k26L04J7l29K11o6
$$ plain form
4241 -55 -5 68 -224 -67 39 123 -90 55 71 29 -277 -173 67 -17 -125 19 33 9 7 -156 129 133 7 29 -256
4266 -256 209 -4 16 -23 254 30 -31 149 114 97 55 7 84 60 -85 -45 -194 -86 68 52 202 -170 51 57
4290 57 -165 14 -41 161 60 332 27 -138 76 213 -14 163 60 59 51 -132 -53 41 -60 77 96 -149 55
4313 55 -16 -197 205 48 -11 -29 -162 -27 -81 -67 -77 2 108 6 172 -99 -223 -211 -66 270 126 -3 93
4336 93 251 90 -143 -188 -166 136 -27 268 -113 -248 68 142 44 -58 -23 64 212 -220 -131 90 -346 254 -160
4359 -160 -26 130 -53 -79 186 75 -82 4 122 127 -110 -81 210 130 -42 73 -93 -18 181 108 195 -128 182
4382 182 141 -141 -92 -4 57 -267 122 -7 40 102 37 111 292 149 -41 -59 52 -57 34 -112 108 53 73 77 -32
4407 -32 14 -239 105 -200 130 76 149 -50 49 -351 -226 155 96 333 14 149 242 -64 230 -131 -35 -81 -126
$$ packed form
4241e5N0P3k92J57J06Q4k13J45J6m2l06J04K40q4j08J44J4k4kj63K85Mj26K2k85
4266b56M65k13K0l9K77k24o1J80l5j7m2m8P7k4j45M0j49J08J54j6J50l72K21O
4290E7k22J79n5K02j01K72l05j65K14J37k27J77j03jqj83P9R4j01J37J9k45K04
4313E5p1j81M02j57n9j8j33J35n4J4j0P9J06j02J66k71j24J2J45L36j44j29R6
4336I3J58j61k33m5K2L02j63K95l81j35L16P4r8j02L5Q7J48m32Q9K21m36O00m14
4359a60J34J56j83k6K65j11j57Q6J18Nk37K9K91q0j72J15j66P5J99p3Q7l23L10
4382A82m1k82M9Q8O1l24L89j29M7O2o5P4J81j43j90j8J11j09R1j46K20n5K0Mj09
4407c2M6k53L44l05L30n4P3j99R9m00J25L81n9K37l19J35R3l06K94l61R6m6m5
$$ plain form
4430 -126 -143 109 -205 -160 -96 -238 -68 -162 -136 48 20 234 59 -51 118 -47 196 158 -150 -174 -112 -8 172
4453 172 101 -158 85 279 176 132 -148 16 -85 -101 31 -62 179 -62 -195 57 101 -202 90 41 -218 -48
4475 -48 50 286 -22 -56 -79 79 142 -82 -157 -133 75 86 113 -178 -39 2 -18 15 -23 3 -25 59 -217 4 72 32
4501 32 -35 -79 -62 -114 61 160 87 -241 -62 -64 -164 -23 -335 62 -106 -52 97 -44 100 171 64 -25 -57 -225
4525 -225 -1 78 171 211 -94 215 26 -52 -214 -62 -125 -245 2 52 189 78 -3 27 -121 59 -177 152 148
4548 148 -26 -40 -37 69 -3 54 -69 79 74 404 -82 50 -4 -108 -251 57 37 25 58 -267 -69 136 -155 -73
4572 -73 -415 23 235 43 4 105 -126 -14 -91 173 -131 -40 -18 -29 156 290 95 -51 332 39 131 51 80
4595 80 21 -21 -56 60 54 43 24 1 -279 -219 99 76 -188 159 -148 -63 -56 120 134 171 -124 189 184 362 -79 -69
$$ packed form
4430a26j7K52l14M5O4j42J70r4K6J84k8K14j75j10J69j65K43l8l08k4O2J04J80
4453A72p1k59K43J94j03m4k80J64j01j6J32r3K41k41j33K52M4l03K92m9k59J70
4475d8R8K36l08l4k3J58O3k24p5K4K08J1K7k91J39M1k0L3l8K6k8Q4k76K21O8m0
4501C2o7m4J7n2J75R9p3l28J79kj00J41l12L97j68N4J49j41J44P1j07q9l2j68
4525b25K24P9R3M0l05L09j89p8j62J52o3j20K47N0J37j11q1L0j48J80k36L29m
4548A48j74j4LJ06p2N7j23J48nL30m86J32n4j04j43L08k0j2L3l25J98K05k91Q2
4572g3l42M38K12j92l9J01k31J12p7K64l04R1K2j1J85J34j95j46L83k93R2q0K9
4595H0n9m2l5J16oj1j9k3k80O0L18k3k64L47l07Q5PJ76J4L7k95L13nJ78m41J0
$$ plain form
4621 -69 -64 31 34 389 240 210 187 -104 73 77 -75 -99 -6 173 79 84 17 72 111 28 42 -233 132 104 127 123 29 -104
4649 -104 100 -76 -56 183 111 -6 256 87 269 -94 55 28 24 -113 -272 -102 -211 -29 -138 173 -114 6
4671 6 -3 -221 67 -51 -73 -85 29 -312 -90 -173 179 -140 -131 62 275 -138 -18 93 232 -3 -44 -92 111 98
4695 98 -86 -49 -237 -142 -35 120 173 150 0 -175 39 -127 -64 157 -35 -22 108 176 170 4 98 10 63 -44
4719 -44 -27 203 -19 13 -67 215 0 -224 -193 -21 105 -167 -48 163 61 54 -217 192 231 -120 82 -192 -152
4742 -152 -220 78 13 16 101 -83 41 -23 -4 -86 -42 104 -127 65 -156 8 -1 230 -48 162 -190 -108 231 -94
4766 -94 109 94 204 25 -147 -75 -155 17 -196 26 -7 -129 -208 77 -38 -130 -238 297 -7 71 29 -52 24 33
4790 33 -147 -159 -19 -191 219 -17 55 28 -134 -197 -45 -168 -58 -62 -129 223 305 101 -144 -138 -12 -58 23 184
$$ packed form
4621f9NR5LL55j49l0k3k91J77Mj52k4R3J79r4No7N5L9q3J4k75L65k8K3mr4j33
4649a04K04j76K0K39p2j17K62j69J82l63J49k7mj37j59J70j09J82j09L11k87J20
4671Frk18K88j18k2j2J14l41K22q3L52l19RJ93K13m13J20J11J39k35m1m8K03j3
4695I8j84L7j88R5J07J55N3k3j50j75K14j66O3K21j92J3J30O8oj66R4q8N3j07
4719d4J7K30k22L2q0K82k15k24L1J72J26k72J19K11j02pk71M09L9l51K02k74M0
4742a52o8K98o5LQ5j84J24o4J9q2M4J46k31J92k21J64rK31k78K10l52Q2L39l25
4766i4K03j5J10j79j72P2q0J72k13K22l3j22p9K85j15r2j08N35l04P8m2q1P6R
4790C3j80j2J40j72M10k36P2k7j62o3J52j23J10mo7L52Q2k04k45OJ26m6Q1J61
$$ plain form
4814 184 171 6 -84 -272 32 -19 149 262 -68 -251 83 56 -311 -239 -147 -159 -189 -82 -39 92 -269 67 -78
4837 -78 162 121 -115 -15 -41 30 98 -62 -32 161 144 -192 -74 60 125 -225 54 256 -90 -74 -12 -35 86 245
4861 245 144 122 -103 36 -4 246 88 -347 -9 -26 218 -335 15 -88 192 -62 -112 401 5 -54 225 -38
4883 -38 -59 179 236 173 -162 177 -243 -106 178 92 -37 -88 -35 -29 15 210 -105 -32 -167 -193 66 4 243 34
4907 34 -25 -54 -11 -220 -123 -48 179 19 -58 -24 -112 -109 -138 -115 -31 26 38 165 88 264 -160 -17 49 10 -151 155
4933 155 0 152 -3 228 209 -58 -58 86 51 -132 -180 -104 220 -17 93 10 -47 67 -24 -28 246 195 58 -96
4957 -96 109 -44 -94 -48 43 158 33 4 99 -10 119 15 -98 91 39 141 -66 48 36 110 91 -18 -101 190
4981 190 139 -82 -17 -309 -187 -163 -101 73 12 45 -38 -86 -71 136 -110 -71 -150 -99 -52 37 -4 -95 -93 67 -130 -155
$$ packed form
4814A84j3j65r0j88L04n1J68J13l30j83L34k7l67P2R2j2l0J07M3J31l61L36j45
4837g8K40m1k36J00k6P1O8j60L0J93j7l36J18J34O5l50K79K02l46J6O2k3J21J59
4861B45j01k2k25J39m0K50j58m35L38j7K44n53L50j03K80k54n0N13l96n9K79k63
4883c8k1K38N7o3l35L39m20J37K84q6j29n1N3OM4J95l15P3j35k6K59o2K39k09
4907C4n9k9M3k09R7P5K27j60p7L4q8Lk9K3Q4N7J2J27p7J76m24J43O6l9j61L06
4933A55j55J52j55K31j9k67%J44l5j83m8P6L24k37J10q3n7J14r1mK74n1j37j54
4957i6K05j53n0M6R1J15j25k9R5j09J29j04j13J89n2J02k07J14j2P4j9j09q3K91
4981A90n1k21O5k92J22K4O2J74o1L3q3m8J5K07k46L9p9N1M7Q9m1r1KJ60j97k5
$$ plain form
5007 -155 -24 46 81 157 218 69 -109 -122 119 -84 71 -117 -17 -97 66 -96 272 -47 44 38 -279 16 -168
5030 -168 -204 114 -78 -16 83 -218 -90 -155 -296 49 -163 -75 -30 16 90 -54 122 132 -36 -326 28 -110 12
5053 12 107 195 138 -75 -261 20 -70 -46 243 263 -228 304 155 105 -322 -321 209 26 -96 29 -69 -95 -87 166 280
5078 280 20 -152 304 -33 -213 76 -163 29 -171 259 -169 -207 -233 -51 58 -279 34 78 281 -235 -117
5099 -117 154 -174 -126 -95 -30 56 1 -14 -156 66 62 64 -34 -64 -249 -76 34 -28 -86 -113 59 -137 125 -108 37
5124 37 -97 85 69 145 -59 12 -69 91 -317 21 198 -88 19 30 142 169 159 -189 338 60 -416 179 52
5147 52 -45 -195 -158 -78 42 246 3 20 -78 -154 -152 32 84 -60 15 -277 -41 16 -80 38 -16 -134 -73 -79 -15 -3
5173 -3 60 -7 2 269 -47 36 -158 134 -171 -8 -460 -9 -26 -151 -130 -44 -32 -194 -5 75 -24 -47 57 1 -175
$$ packed form
5007a55J31P0L5P6O1j49j78j3K41k03J55j88J00q0J63j62L68l19R1ol17K95j84
5030a68l6L18j92O2R9l01J28o5j41L45k12Q8M5M6P4j44J76J0j68k90L54j38J22
5053A2R5Q8n7k13j86K81r0K4K89K0m91N32j49n0m27JN30j83j22J25r8k6QK53J14
5078B80k60j72M56l37j80K89k39J92k00M30m28l8k6J82J09l37L13M4K03n16J18
5099a17K71l28M8L1O5Q6n5j5j42K22mKr8l0j85J73J10o2n8k7J72j96K62k33J45
5124C7j34J82j6P6k04P1q1J60m08L38J77k86J07J1J12K7j0l48N27k78m76N95j27
5147E2r7j50L7Q0J20K04k43J7r8p6KJ84N2j44P5k92K36N7r6J18n4j18O1oO4J2
5173cO3o7RK67l16Q3j94K92l05J63m52M51j7j25K1Q6J2j62J89Q0r9k3J04n6j76
$$ plain form
5198 -175 148 20 -31 72 -84 155 -218 -111 19 -20 132 29 30 -95 -12 -53 -47 51 -16 -13 -144 23 135 -221
5222 -221 77 20 248 -136 151 -83 -76 280 70 40 -25 120 148 -50 141 7 15 122 238 -225 36 -213 24
5245 24 -109 -102 44 -155 28 -141 96 120 -87 -175 42 46 -38 -50 47 337 258 -107 -123 -78 -187 -193 -6 -105 112
5270 112 -50 82 69 24 -103 -56 68 -11 -215 30 -90 -9 163 -197 -250 265 -62 -128 236 96 -42 -137 0
5293 0 -140 -48 231 41 27 223 -2 -17 19 125 116 165 -132 182 -217 163 32 -86 176 30 -98 64 81
5316 81 72 -49 139 174 -132 -89 -214 100 16 97 -140 -64 -66 46 220 -44 102 97 -29 22 155 149 157 -73 -139 -101
5342 -101 -34 -160 1 -94 -297 -164 -91 -3 -207 -151 131 -134 168 -98 98 -44 51 -98 -369 33 -156 50
5364 50 -216 -18 84 -182 51 -68 -209 39 117 75 129 -274 -272 -293 -12 -73 -182 128 -17 -247 12 -34 165
$$ packed form
5198a75L23j28n1J03j56K39l73J07J30l9J52j03Jj25Q3m1OR8o7Lj31J67J12l56
5222b21K98n7K28l84K87k34PL56k10l0o5J45K8j98J91j34QJ07J16m63K61k49K37
5245B4j33PJ46j99J83j69K37K4k07q8K17Mq4j2R7K90p9l65j6M5j09oJ87r9K17
5270A12j62J32j3m5j27M7J24p9k04K45j20Q1J72l60n3N15l27o6L64j40j38r5J37
5293@j40R2K79j90j4J96k25j5L6J06rM9k97L14l99L80j31j18K62j46j28J62J7
5316H1rj21J88L5l06M3j25L14q4Q1k37P6kJ12J74k64J46nj26N1J33oQk30o6L8
5342a01O7j26J61r5k03J33P3Q8k04N6K82k65L02k66J96j42R5j49k71M02j89K06
5364E0k66J98J02k66K33j19j41K48P8m2N4m03Kk1K81o1j09L10j45k30K59m6J99
$$ plain form
5387 165 181 181 2 40 -9 81 -107 66 -175 -135 239 271 44 200 -88 74 54 -8 181 187 -169 -47 40 85 35
5412 35 -10 -168 -36 -51 91 -264 -161 -176 -24 38 101 19 127 -98 -92 -65 26 101 75 475 -141 45 -321 33
5436 33 64 127 256 22 89 166 -69 -42 -9 -2 -186 -38 -147 307 -126 -100 -346 -12 -10 149 139 -22 10 19 -199
5461 -199 -2 26 68 45 -109 131 -243 154 -158 63 -48 -113 96 14 27 -13 -199 -48 -159 -46 254 -110
5483 -110 -226 69 64 -264 -76 36 136 5 -88 -52 -130 27 -136 -141 -104 15 18 -9 -83 -61 130 -9 -321 -80
5507 -80 40 25 -62 24 -153 -112 166 120 10 -77 -116 -142 135 -24 -61 205 -41 228 -152 56 90 -114 45 146
5531 146 224 -106 177 -96 253 -39 -234 -70 141 -150 -62 -250 -53 -20 110 174 -268 -30 -122 -196 114 8
5553 8 -117 175 66 72 212 -63 174 56 144 -184 16 -85 -82 19 -33 103 -64 31 83 -128 121 94 -165 67
$$ packed form
5387A65J6%j79L8m9R0j88J73k41M0L74L2k27J56k88J62k0o2J89Ol56J22Q7M5n0
5412C5m5j58J32j5J42l55J03j5J52O2O3q2J08k25OK7R1P5k6M00o16J86l66L54
5436C3L1O3J29k34O7P7k35K7L3Pj84J48j09M54m33K6k46L34KJ59j0j61L2Rk18
5461a99J97K8M2k3j54K40l74L97l12K21j11o5K09q2J3m0j86J51j11J13L00l64
5483a10j16K95nl28J88J12J00j31r3L6p8J57j63nL7J19Lk7p4K2J91j39l12K41
5507h0J20j5q7Q6j77M1K78m6j10q7l9k6K77j59l7K66k46K69l80K08L4k04J59J01
5531A46P8l30K83k73L49k92j95J64K11k91Q8j88J97L3J30O4m42K38r2p4L10j06
5553Hj25K92j09OJ40k75K37j18Q8l28K00j01LJ01n2J36j67R5N2k11K49k7k59K32
$$ plain form
5577 67 -300 99 -11 -202 -44 -213 19 -60 87 153 -233 126 -74 -66 -113 -57 -240 -18 81 243 -76 -109 183
5600 183 216 -187 -176 -148 -3 -64 -64 2 -31 -155 507 -172 126 113 184 -102 35 -118 226 161 52 196 -118 -127
5624 -127 114 110 69 -4 146 -41 281 75 -18 19 38 52 -86 275 2 -36 6 -85 61 -139 118 -48 -49 -16 -159
5649 -159 -264 -55 170 -107 53 -95 24 164 39 76 122 183 83 54 -183 -205 -173 36 -200 2 176 75
5671 75 118 -356 11 -120 -27 -53 -25 -38 76 -122 111 -128 -53 -24 202 180 -30 44 133 -11 257 -26 92 70
5695 70 -52 -51 33 -315 -119 -59 -107 -18 47 30 -71 180 86 -89 -142 186 36 -195 -101 -21 -85 116 -66 49 4
5720 4 -106 -36 120 61 -30 293 138 -113 -59 -96 -8 18 25 -97 195 147 199 -25 -42 134 -37 23 22 -79 194 -5
5746 -5 67 98 130 -94 -3 160 55 110 46 76 -199 88 -141 216 -122 -249 -86 320 35 138 197 56 -12 104
$$ packed form
5577F7l67L99j10j91J58j69K32p9J47O6l86L59k00Qm7N6j83K22R9J62l19l3K92
5600A83L3m03J1K8J45o1%O6l3j24O62o79K98j3P1k86J37j53L44o5j09J44l14r
5624a27K41mm1p3J50j87L22k06r3L7J9J4j38L61k73l8M2r1J46k00K57j66jL3j43
5649a59j05K09K25k77J60j48J19J40j25L7M6O1j00k9k37k2L2K09k36K02J74j01
5671G5M3m74L67j31R3k6K8j3J14j98K33k39P5K9K26k2k10P4Q9j44K68k83J18k2
5695G0j22JQ4l48J96O0m8Q9O5j7j01K51r4j75n3L28j50k31R4Q0o4K01j82J15m5
5720Dj10P0J56n9r1L23j55k51N4l7Q8K6Pj22K92m8N2k24j7J76j71O0jj01K73j99
5746eP2L1L2k24R1J63j05N5o4L0k75K87k29L57l38j27J63M06k85J03N9j41o8J16
$$ plain form
5770 104 -1 -46 -12 18 -7 -2 55 -165 109 70 104 -70 -310 -52 162 -258 -74 -26 18 -356 226 -106 96 479
5794 479 149 -156 -16 -76 49 37 38 -198 -70 -55 -112 -44 -188 29 -161 59 -41 4 -179 73 23 50 -147
5817 -147 47 -186 -168 198 25 -224 68 20 127 -94 -35 -248 -187 160 -91 66 -166 32 18 -62 -215 -71
5839 -71 61 39 -207 -294 109 164 324 96 -43 -32 41 250 57 -102 -28 -54 -6 52 -2 -53 190 142 -108 131
5863 131 234 -73 -86 -23 -106 -37 243 40 -18 216 -61 -50 -90 28 226 -106 138 -5 136 356 153 -187
5885 -187 -264 19 210 -62 -90 -45 303 -125 75 83 -289 -44 -13 -157 -71 -108 71 109 140 115 147 137 62 109 144
5910 144 -83 -110 206 -99 -265 25 43 -80 66 93 250 -205 -101 92 63 -121 -188 -61 120 -62 -191 161
5932 161 81 -208 61 28 24 -148 -150 -234 20 -44 150 66 9 214 11 50 94 -222 -68 -78 30 61 -109 130 -61
$$ packed form
5770A04j05m5L4L0k5NN7k20K74l9L4j74k40K58K14m20J84M8M4l74N82l32K02L83
5794D79l30l05J40o0J25j2Jk36J28J5n7O8j44K17j90K20j00M5j83K52n0K7j97
5817a47J94k33J8L66j73k49K92m8J07k21N9k13O1L47k51J57k32J98j4q0j53J44
5839g1J32k2k46q7M03N5J60k28j39J1P3K09j93j59P4k6M8N8n4n1K43m8k50K39
5863A31J03l07j3O3q3O9K80k03n8K34k77J1m0J18J98l32K44j43J41K20k03l40
5885a87p7K83J91k72k8M5L48m28K00Ql72K45L1j44Q6l7J79L8L1k5L2j0p5M7L5
5910A44k27k7L16l05j66K90J8j23J46K7J57m55J04J93k9j84o7J27J81j82j29L52
5932A61q0k89K69l3mj72kq4K54o4J94q4n7K05k03L9M4l16J54j0J08L1j70K39j91
$$ plain form
5957 -61 -53 9 -154 22 -91 89 22 -163 215 -73 178 -238 121 -156 -219 -177 -383 215 173 -148 51 17 -14
5980 -14 -164 123 236 -150 -250 -37 128 72 -28 56 -140 209 74 -53 -91 23 163 -192 -246 -55 -139 -17
6002 -17 110 115 -170 104 43 132 -148 -64 94 121 -76 24 164 162 141 110 67 -65 -35 255 -184 -9 29 -8 -44
6027 -44 -44 357 -283 -74 41 -201 -223 54 217 -12 112 60 99 186 262 33 254 215 2 -16 27 75 -124 -21
6051 -21 -29 93 42 254 184 136 -26 -230 -123 -342 -72 -157 -10 -310 -207 241 -357 -65 229 148 170 40 129
6074 129 65 -152 -6 130 44 140 121 -170 289 34 -14 -31 69 -95 23 5 -189 -51 -233 -53 -89 72 -45
6097 -45 -324 421 -93 150 88 170 39 127 -48 -30 13 24 119 133 202 -70 232 4 13 -86 22 -21 28 104 152 170
6123 170 -148 78 263 89 118 -75 -73 -111 -175 -268 -65 -68 195 66 248 -158 68 53 -186 -104 -73 -54 -141 -63 -27
$$ packed form
5957f1QO2j63J76j13J80o7j85L78k88K51m16L59k77o3M2k06N98m2l21J99l4l1
5980a4j50K87J13l86j00K13J65n6j00Q4j96L49j35j27l8J14J40l55n4J91q4J22
6002a7J27Nk85K74o1Q9k80Q4J58K7j97J00J40kk1l1m3j32L0K90m39J75L8l7l6
6027d4%M01o40K09J15k42k2K77J63k29J24n2L9Q7P6k29K21l9k13j8M3M8j99J03
6051b1qJ22n1K12p0m8j62k04J07k19K70q5J47l00J03M48n98K92K94q1K2j30Q9
6074A29o4k17J46J36q6R6j9k91M59k55m8j7J00j64J18j8j94J38j82J80l6J61j17
6097d5k79P45n14K43o2Q2j31Q8j75J8M3J1R5J4O9k72L02k28Rr9J08m3M9P6M8J8
6123A70l18K26J85j74K9j93Kl8o4r3K03lK63j29J82m06K26j5k39Q2L1J9q7P8L6
$$ plain form
6148 -27 -74 64 -46 17 -203 86 225 -146 -233 30 -112 -66 108 91 102 -146 81 28 -218 261 57 119 106
6171 106 -108 134 -80 -144 -175 15 82 -196 -50 163 5 252 -18 -105 -131 -93 208 -136 -22 22 -72 -34 -89
6194 -89 -138 51 167 -94 -199 64 40 2 85 173 88 -133 -21 -61 -61 24 -3 128 -175 148 3 -179 -25 115
6218 115 11 66 35 209 -182 -88 -100 -47 -153 76 186 221 -92 81 -3 62 284 -176 -147 -17 -66 -151 190 54
6242 54 3 85 81 153 84 -327 30 -21 -101 -148 7 -49 -149 67 -186 35 132 58 237 -53 -8 150 181 53 -242
6267 -242 52 23 79 122 22 0 62 141 -25 199 -157 -185 -119 137 58 43 -67 -161 173 -73 109 -66 63 103
6291 103 73 14 -98 -10 66 -40 -75 131 16 -300 95 -4 31 123 151 13 -27 -185 65 -134 -74 -237 74 210
6315 210 -38 -5 -76 -154 -71 -88 -43 79 -100 -95 217 -24 -51 -278 170 158 -18 308 -16 -135 101 -77 -140 21
$$ packed form
6148b7m7J38j10O3k20K89J39l71q7K63j42M6J74j7J1k48K27n3k46M79k04O2j3
6171A06k14K42k14o4l1J90O7k78J46K13j58K47k70q7k6L8L01l44J14M4r4L8n5
6194h9m9J89J16k61j05K63k4l8Q3Q8q5k21J12m0%Q5k7J31l03L23j45j82J54J40
6218A15j04N5l1J74l91R4j2N3j06K29J10L5l13J73q4O5K22m60K9J30m9q5L41j36
6242E4n1Q2mP2o9m11L57n1q0m7J55n6j00K16k53K21R7p4J79k90M5J58L1j28k95
6267b42K94k9N6M3j00k2O2P9j66K24l56k8O6K56p9j5j10r4L34k46J82j75J29M0
6291A03l0n9j12Q8P6j06l5K06j15l16L95r9L5R2K8j38m0j58K50j99O0j63L11J36
6315B10k48L3p1p8Q3j7M5J22j79NL12k41k7k27M48j2j76L26l24j19K36j78o3J61
$$ plain form
6339 21 -210 -29 109 52 -42 -46 -151 42 -185 323 196 29 55 -305 -97 14 182 79 168 137 -111 132 -121
6362 -121 -130 1 -238 60 -64 25 -174 67 -70 136 -39 -153 17 -207 -66 195 58 100 26 167 61 143
6384 143 65 -26 -85 49 -111 92 39 -37 145 77 169 131 -78 -88 7 121 321 -61 -123 73 164 74 22 -96 214
6409 214 -88 -31 -14 68 -9 33 -63 -63 -121 -4 9 5 234 301 -1 23 119 22 -241 60 108 10 -46 93 -60 47
6435 47 185 -184 72 211 -25 -104 -36 -199 -99 -24 -124 14 -24 -16 -311 -28 -55 -45 69 -195 40 -127 -147
6458 -147 58 128 -67 234 110 200 -56 227 -198 259 177 -52 -13 -139 -41 -94 107 67 -351 -78 27 -96
6480 -96 -127 -32 -136 -55 -30 54 20 184 52 0 -6 106 49 -195 289 -150 -157 197 -180 -64 64 46 199 135 -36
6505 -36 59 -72 29 -135 114 160 139 107 -15 136 -125 -100 97 144 -156 42 157 314 11 63 -202 -209 -26
$$ packed form
6339B1k31J81J38n7r4mj05J93k27N08j27j67K6l60K08J11J68j03Q9l1k48K43k53
6362a21rJ31k39K98j24Q9j99K41j37K06j75j14J70k24J41K61j37M2p4J41j06Q2
6384A43p8r1n9J34j60K03n3p6J82o8R2l8k09j0R5J14K00l82o2J96R1r0n2j18L10
6409B14l02N7J7Q2p7M2r6%n8J17J3mK29O7l02K4R6r7k63L01M8r8n6J39j53J07
6435D7J38l69K56J39k36p9O8j63J00P5j00J38l8Qk95K83k7J0J14k64K35j67k0
6458a47K05P0j95L01j24R0k56K83m25M57q2k29L9j26R8n3K01m0m18K73J05j23
6480i6l1R5j04Q1K5Q4l4J64j32n2oJ12n7k44M84m39pL54l77J16J28j8J53o4j71
6505c6R5j31J01j64K49M6k1l2j22J51k61K5J97M7l00J98J15J57l03N2k65pJ83
$$ plain form
6528 -26 104 80 57 -207 -60 -71 370 -242 68 47 160 232 -25 -12 -14 -162 298 18 -113 -235 -6 -59 30 -26
6552 -26 -7 10 -379 -234 32 -38 -34 78 3 179 -133 -96 -22 45 110 57 239 -98 19 14 179 244 268 -54 -176
6577 -176 51 164 -123 -108 -130 68 -96 -40 -66 -13 -86 149 129 -15 -95 -78 -147 -116 -90 -138 86 -108 -263 87
6601 87 107 -176 -5 -134 111 66 -137 12 -225 39 -2 -174 -60 -29 236 28 140 61 2 81 30 10 98 -85
6625 -85 -32 1 -137 112 -33 -136 -37 80 143 -81 -249 -6 -158 92 260 143 34 -62 -3 -121 -41 -56 -106
6648 -106 -67 18 187 -20 192 301 62 -169 44 -203 -335 -130 115 -1 -91 4 241 -64 -47 -155 -30 189
6670 189 -20 108 -78 19 -157 154 -193 -18 17 -127 -234 191 133 -97 -112 49 13 182 -29 -167 108 274
6692 274 -94 -241 207 -75 -86 -99 -204 82 140 115 101 -180 -42 161 158 231 176 14 177 52 -55 -114 0
$$ packed form
6528b6J30k4k3k64J47j1M41o12L10k1J13P2k57J3kj48M60k80j31j22K29n3Q9n6
6552b6J9J7l89J45K66p0MJ12p5J76l12L7P4O7O5n3J82l37J17nJ65O5K4l22j22
6577a76K27J13k87J5k2J98j64N6k6N3p3K35k0j44q0J7o9L1K6m8K24j94j55L50
6601H7K0k83J71j29K45m5k03J49k37K64m1j72J14L1K65k08J12p9n9P9n1k0Q8j83
6625h5N3L3j38K49j45j03R9J17O3k24j68K43j52K50J68j17j09r6N9j18Q0j5n0
6648a06L9Q5J69k07K12J09k39k31K13k47j32K05K45j16r0R5K37l05J7j08J25K19
6670A89k09J28j86R7j76L11l47J75L5j44j07M25n8k30j5J61l6J69k11j38K75J66
6692B74l68j47M48k82j1j3j05K86N8k5j4k81J38K03lP3n5j62J63j25j07n9J14
$$ plain form
6715 0 57 -102 259 -236 -169 124 31 136 -25 -118 -141 116 -60 10 58 230 111 51 74 2 210 -19 176 -97
6739 -97 -191 -261 -232 -97 -93 47 -114 -306 -62 -154 77 313 88 166 67 -150 49 -256 -127 113 107 -56 -126 -171
6763 -171 111 147 104 90 179 -123 37 -150 230 -100 82 177 -471 52 -59 124 61 132 -34 155 -26 -164
6785 -164 -31 103 259 18 208 70 52 -201 -141 120 226 -37 -214 -26 21 -147 68 -108 -70 14 -69 288
6807 288 3 -93 -123 43 189 198 -62 -126 190 -161 -21 252 -48 156 -47 5 -193 -9 -12 -73 92 131 211 107
6831 107 34 -42 264 104 -128 365 186 -117 -64 -121 270 -158 -57 -2 -15 -78 174 -52 -84 290 -17 79 142
6854 142 -107 23 74 150 245 7 -34 267 97 70 -58 -190 -280 111 15 -50 136 -53 -7 27 287 -27 -86 63
6878 63 4 -95 176 -28 152 -76 151 -253 88 -105 -7 61 89 -393 135 62 -148 -182 -57 139 65 18 2 -93
$$ packed form
6715@N7j59L61m95O7K93r3J05j61r3k3K57j76P0M8J72j19o0K3p2K08k29J95k73
6739i7r4p0K9J35MJ40j61j92K44r2K31K36k25P8r9k17J99l05J29K40oj63p0m5
6763a71K82L6m3j4Q9l02J60j87L80l30J82R5o48N23j11J83o3P1j66J89j81j38
6785a64J33J34J56k41J90j38j8k53O0K61J06k63j77J88M7j68K15j76L8Q4q3L57
6807B88k85r6l0J66J46Rk60o4L16l51J40K73l00K04k03N2j98J84lo1J65L9Q0j04
6831A07p3p6L06j60k32M93j79l03N3n7L91m28J01N5j3o3K52k26l2L74l07R6O3
6854A42k49J30N1P6R5k38m1L01j70k7j28j32r0L91r6o5J86j89M6L4K60l14n9J49
6878F3n9r9K71k04J80k28K27m04L41j93R8O8K8m82N28p3k10l4J25J96p4m7j6r5
$$ plain form
6902 -93 -76 -33 -15 -245 -116 -191 -88 -6 -380 25 -44 213 10 50 46 -157 111 131 73 63 68 167 -175 90 -46
6927 -46 234 -72 -9 76 -76 70 -112 191 204 -79 -105 -201 96 -229 -99 266 61 -118 -127 128 50 -159 36
6950 36 -71 41 -153 -7 -89 130 1 -64 81 82 159 -41 -58 -136 164 19 195 -58 211 -84 -10 159 222
6973 222 300 -55 131 8 -19 16 244 -97 -7 106 -25 60 -39 -157 135 -13 -165 123 193 19 1 292 55
6996 55 48 74 86 -281 96 133 -80 -98 49 -152 104 138 207 -91 -81 27 -117 -40 25 221 -33 142 96 -71
7020 -71 -9 -33 -27 -83 -166 -1 -168 98 46 127 47 86 50 20 -30 -97 132 59 -64 86 -124 157 63 -107 -137 -79
7046 -79 -20 273 73 -4 -136 -165 -97 124 -87 -100 9 54 -255 -11 -57 -23 173 -48 -68 -163 -40 -47 -50 98 226
7071 226 326 -58 1 66 -115 -243 -6 -11 -93 89 84 -80 -259 -104 35 -71 79 258 34 2 145 -155 37
$$ packed form
6902i3J7M3J8k30J29p5J03Q2l74M05o9K57k03M0mk03K68K0n8j0NR9l42K65j36
6927d6K80l06O3Q5j52J46j82L03J3k83k6r6K97l25J30L65k05j79rK55p8k09J95
6950C6j07J12j94J46q2K19j29o5J45JP7k00j7p8L00j45J76k53K69k95P4J69O3
6973B22P8l55J86j23k7L5K28l41R0J13j31Q5r9j18K92j48j52K88P0j74j8K91k37
6996E5pK6J2l67L77L7k13j8J47k01K56L4O9k98J0J08j44P7O5J96k54J75m6j67
7020g1O2k4On6q3J65j67K66n2Q1q0L9l6l0n0o7K29p3j23J50k10K81r4j70l0N8
7046g9N9K93k00p7j32k9O8K21k11j3J09M5l09K44m6L4J96k21k0r5J23plJ48J28
7071B26J00l84N9O5j81j28K37nq2J82nj64j79J55J39j06J50J79k24l2J43l00J92
$$ plain form
7094 37 -130 -92 -206 -79 4 -37 116 -157 -79 -70 -104 161 131 37 128 34 -122 17 28 -33 145 48 -90 -121 141
7119 141 141 -9 -6 31 -64 -434 -68 90 79 -107 113 394 18 -141 155 -4 102 23 55 151 -24 225 -51
7142 -51 54 -26 103 154 311 -301 -35 155 75 -107 34 -169 133 62 -67 -44 239 -442 12 283 -14 25
7164 25 -9 -107 47 -70 100 85 -8 -79 -48 -42 -14 145 43 -178 62 18 -73 93 -126 158 52 -33 89 -26
7188 -26 -77 -99 5 64 -200 -49 36 -43 68 72 -147 35 100 -242 -110 93 -87 -179 -175 67 207 -25 -93 -80 39
7213 39 -36 -122 -94 -46 -31 -45 9 32 -260 47 29 168 302 -40 94 42 21 -56 -44 -81 129 -102 117 330 88
7238 88 121 20 -148 191 101 98 -16 -11 311 175 -181 71 18 36 -184 -66 252 32 -2 118 45 -95 233 -41
7262 -41 -123 86 97 119 84 343 -85 23 75 -169 -10 -54 6 37 -132 334 85 91 -124 146 -128 -29 9 -14 -264
$$ packed form
7094C7j67L8j14J27Q3m1J53k73P8Rl4K65l0r4R1r4j56J39J1o1J78r7j38l1K62
7119A41%j50LL7r5l70L66J58j1j86K20K81l76j59K96j59J06p9L2R6j75K49k76
7142e1J05q0J29N1J57o12K66J90q0j82J41k03L02p1j29K3K83o81M54K71k97L9
7164B5l4r8J54j17J70j5r3p1L1OK8J59j02k21K40m4r1J66k19K84j06q5J22j15
7188b6n1k2J04N9k64J51Q5p9J11Mk19J82O5l42J32K03j80r2MK42J40k32o8J3J19
7213C9p5q6K8M8J5j4N4K3k92L07j8J39J34l42J34n2k1p7J2l7K10k31K19K13k42
7238H8L3j01j68L39r0lj14NL22j36l56K52n3J8k20J18L18k20l4J20p3j40L28k74
7262d1q2K09J1K2l5K59m28J08N2k44J59m4O0L1j69M66k49Ok15K70k74R9L8k3k50
$$ plain form
7287 -264 -100 -24 -38 -90 -171 79 256 -78 17 45 161 -230 -65 90 175 11 -88 -278 36 253 105 170 -50
7310 -50 -225 -376 -55 -155 -13 -102 -182 4 -171 -53 19 -212 -144 221 -25 -201 -69 34 -64 143 100 28 -97
7333 -97 -79 153 185 -23 -297 240 280 256 -94 -59 31 -154 55 -68 -31 81 144 92 377 45 26 80 -291 36
7357 36 -39 -180 -108 14 112 -4 -244 118 59 114 -41 158 98 91 43 32 -21 60 34 102 69 -32 -64 -70 -56 68 -42
7384 -42 -57 32 -80 -146 131 147 362 191 -118 -317 121 150 -37 -212 -47 -136 -117 -157 -118 130 126 205 -194 -235 -79
7409 -79 133 22 -84 41 205 103 66 -80 -12 -183 -28 215 148 37 -47 18 -92 -54 -68 -129 35 121 -102
7432 -102 43 -48 257 32 40 247 -192 209 19 45 74 125 115 -215 97 198 -89 -119 121 -207 -41 33 -70
7455 -70 -142 27 8 159 114 157 48 -63 -24 15 10 -57 90 348 172 -72 197 8 -148 -76 219 39 188 -189
$$ packed form
7287b64J64P6j4n2q1K50J77l34R5K8J16l91J65J55Q5j64r9j90L14K17j48O5k20
7310e0j75j51L21j00J42q9q0J86j75J18P2k31O8L65k46j76J32J03r8K07m3p2j25
7333i7J8K32L2k08k74N37M0k4l50L5R0j85K09j23L7J12O3n2K85l32j9N4l71L27
7357C6p5j41P2J22R8j16k40L62n9N5j55J99o0pm8j1n3Q1k6O8l3j01l2oJ4J24j10
7384d2j5Q9j12o6K77J6K15j71l09j99M38K9j87j75J65q9J9m0L9K48mP9l99m1J56
7409g9K12j11j06J25J64j02l7j46O8j71J55K43o7j11q4O5j10L8j4o1J64Q6k23
7432a02J45r1L05k25QK07m39M01j90K6K9N1j0l30L12J01k87l0K40l28J66P4j03
7455g0p2J69j9J51m5M3j09j11L9L9no7J47K58j76k44K69j89j56P2K95j80J49l77
$$ plain form
7479 -189 60 105 -60 -149 181 -125 99 288 -3 169 -116 89 154 148 -9 -206 111 -59 -40 225 74 -57
7501 -57 -15 198 -26 228 246 10 205 -45 293 107 47 -46 -1 -25 18 82 -175 -1 -163 -138 89 96 -132 -110
7525 -110 214 295 63 22 43 -319 125 -218 14 100 193 192 -140 189 -87 328 137 38 -86 70 -114 -166 -47
7548 -47 -54 -55 79 -119 18 -61 316 235 -56 62 -117 19 -287 194 228 74 15 -165 -82 105 -130 -120 43 220
7572 220 -63 119 -43 5 33 2 -172 100 118 33 -102 -177 -98 -45 -59 310 121 167 -147 20 67 -103 202 -187
7596 -187 -17 133 -25 164 -53 118 18 -49 -29 -69 116 -70 -81 65 127 163 14 -39 40 168 -167 82 -80
7619 -80 -39 -13 -288 -23 -257 159 -79 3 140 -115 -268 -166 -73 -2 -147 -135 148 -143 -46 41 -134 -11 12
7642 12 -97 -251 60 19 160 -150 12 106 -10 -55 -58 34 309 220 -268 -13 -199 -158 60 -201 70 42 -113
$$ packed form
7479a89K49M5j65q9L30l06K24J89k91J72k85K05O5oj57j97L17j70J9K65j51j31
7501e7M2K13k24K54J8k36J95k50L38j86o0r3M5k4M3O4k57J74j62K5K27Pk28K2
7525a10L24Q1k32m1K1l62M44l43K32Q6R3jl32L29k76M15j91r9j24J56j84n2J19
7548d7pjJ34j98J37p9L77q1k91J18j79J36l06M81L4j54n9j80Q3J87k35J0J63J77
7572B20k83J82j62M8K8l1j74K72J8q5j35p5P9N3j4L69j89M6l14J67M7j70L05l89
7596a87J70J50j58J89k17J71j00o7K0m0J85j86j1J46O2L6j49n3P9J28l35K49j62
7619h0M1K6k75K65k34M16k38Q2J37k55j53J02R3P1j45J2K83k91R7Q7j75J23K3
7642A2j09j54L11m1J41l10J62R4j16m5lR2K75q9m88K55j86M1K18k61K71k8j55
$$ plain form
7665 -113 71 -77 41 61 -29 343 -82 -65 -145 212 -223 1 70 15 -188 -21 39 -48 109 15 287 319 -153
7688 -153 -227 -27 -116 -96 41 133 24 -152 94 6 -43 -204 72 35 6 -44 -113 238 58 50 -293 -61 -50 38 -136
7713 -136 257 155 -15 -6 60 5 -33 -357 -80 -104 37 0 132 -162 53 -157 33 33 54 487 133 -53 9 -275
7737 -275 -17 289 312 23 114 -110 -268 -143 -153 -92 291 18 81 -193 -17 -33 320 -1 67 155 -183 -34 -103
7760 -103 -167 224 262 340 -330 -97 42 -57 45 233 7 115 -26 -5 -159 94 -160 -51 122 59 7 -34 -46
7783 -46 -213 -140 72 -284 -53 88 26 -163 30 -45 -137 13 12 10 -169 23 -145 -235 -20 257 53 16 -63 -20
7807 -20 -125 -187 292 -37 -47 -12 73 62 77 -92 -49 -65 -67 -82 185 -23 -124 192 106 33 115 164 -86 -42 -142 41
7833 41 -60 35 10 295 59 -38 110 -98 50 19 89 -3 39 -200 72 124 -129 64 -108 -67 -33 -4 -65 -187
$$ packed form
7665a13J84j48J18K0r0L72m25J7q0L57m35K24O9n5k03J67O0q7J57r4K72L2m72
7688a53p4K00q9K0J37R2j09j76K46q8m9j61K76l7k9n0o9L51j80ql43K32J1Q8j74
7713a36L93j02j70RO6n5l8l24K77k4J41l7J32k94K15k10J90%K1M33l54j86O2k84
7737b75K58L06K3k89R1k24j58J25j0O1L83k73O3k74J76j6L53l21O8Q8l38J49o9
7760a03o4L91L8P8o70K33J39r9J02J88k26J08j41K1j54K53k54J09J73o3n2m1j2
7783d6j67P3K12l56K31J41o2j89J93p5r2J50jkj79J92j68r0K15K77k04l7p9M3
7807b0j05o2M79l29j0L5Q5j1J5j69M3j6kj5K67k08j01L16q6p3Q2M9k50M4j00J83
7833D1j01R5k5K85k36r7J48k08J48l1P0r2M2k39K72N2k53J93j72M1L4K9o1j22
$$ plain form
7857 -187 -134 291 -99 2 208 92 -182 208 -36 146 -62 127 36 4 -28 -64 90 21 15 128 -46 158 101
7880 101 141 24 49 -23 -82 -30 -181 166 204 43 85 -257 6 -176 65 168 19 -220 191 123 -58 -240 -45
7903 -45 129 -34 -203 105 195 22 175 -211 63 -100 -33 -35 -257 -28 -43 -140 -32 27 -34 253 45 -151 277
7926 277 -170 93 89 -13 -53 -114 -62 128 -39 -279 -90 -205 -72 -26 -15 97 -148 -43 -95 142 -62 -132 -48
7949 -48 172 361 15 -175 -217 -296 133 131 -76 -165 167 56 -239 -138 47 182 109 -280 -50 54 -36 94 -205
7972 -205 -131 -107 -6 294 26 -10 126 -40 109 -97 311 -67 -49 16 381 70 51 93 19 36 88 -96 -100 91
7996 91 -243 3 80 -313 126 118 206 -287 118 19 19 115 17 -87 -1 -92 -48 -97 187 68 -64 92 -54 71 -201
8021 -201 3 139 -32 46 232 -214 62 -64 107 -72 -257 6 -8 -157 -130 -50 -35 171 82 -93 82 -16
$$ packed form
7857a87N3M25l90J01K06j16k74L90k44J82k08J89r1l2l2l6J54o9oJ13j74K04n7
7880A01M0j17K5p2n9N2j51L47L8j61M2l42K63j82K41J03j49k39M11o8j81j82J95
7903d5J74j63j69L08R0j73J53l86K74j63O7kk22K29j5r7J08N9o1K87k08j96M28
7926B77m47K63mj02m0o1N2J90j67k40J89j15J33M6J1J12k45J05n2K37k04p0Q4
7949d8K20J89l46j90m2p9M29kk07q9L32j11k95J01J85J35p3l89K30J04r0J30k99
7972b05P4K4J01L00k68l6J36j66J49k06M08l78J8O5L65l11j9M2p4J7N2j84mJ91
7996I1l34K46P7l93M39qQ8m93M05r9%R6r8j04Q6r1M4m9K84j19j32J56j46J25k72
8021b01K04J36j71P8J86m46K76j26J71j79j85K63j4j49K7Q0J5K06q9j75J75r8
$$ plain form
8043 -16 -18 15 6 -21 -52 37 -80 64 -185 -183 230 -60 -36 -77 123 106 -165 -233 237 -4 208 -259 -109 21 44
8068 44 95 119 -112 143 -11 -1 16 70 78 57 73 -86 7 -13 -126 -191 95 35 88 -41 9 12 -98 -72 -293 -18
8094 -18 116 -49 -77 -73 -49 -86 97 8 -121 -61 27 252 -12 83 181 -3 68 -26 -16 -7 -155 -274 -76 1 117 -55
8120 -55 133 134 -200 -62 74 -97 2 125 -134 211 -27 150 164 181 2 -63 -75 -135 67 191 -15 -51 103
8143 103 -35 17 -2 -98 -122 324 -27 211 151 -237 -11 103 19 -168 269 39 32 45 215 -436 115 46 -32 -4
8167 -4 297 8 81 -199 -49 -50 -11 -27 -86 133 62 -160 60 -29 -7 -45 28 55 4 265 64 88 276 109
$$ packed form
8043a6kL3rk7l1Q9j17J44k49KM13k90K4m1K00j7k71o8M70k41K12m67J50J30K3
8068D4N1K4k31K55j54J0J7N4Qk1J6j59R3k0j13o5K86o0N3j29N0Lj10K6k21K75
8094a8J34j65k8MK4l7J83q9j29O0Q8K25k64R5R8j84P1r4J0Rj48j19J98P7J16j72
8120e5J88Jl34J38J36j71R9J23k59L45k38J77J4J7j79o5j2o0K02J24k06l6J54
8143A03j38N2j9r6k4M46l51K38o0l88K26J14q4j87M37k30pJ3J70o51N51o9p8K8
8167dL01k89P3k80J50jL9j6n9K19p1k22K20q9K2l8P3K7n1K61k01K4J88j67
8191A09
$$ Imaginary data points
##PAGE= N=2
##DATA TABLE= (X++(I..I)), XYDATA
$$ plain form
0 0 0 0 0 0 0 0 0 0 0 0 0 0 0 0 0 0 0 -8 8 -8 8 -8 14 -16 16 -18 24 -24 32 -32 40 -46 52 -56 64 -73 82 -93 102
39 102 -116 126 -142 157 -174 193 -212 234 -257 285 -313 346 -381 419 -464 511 -566 629 -704 789
59 789 -890 1012 -1162 1357 -1613 1967 -2499 3372 -5065 9553 -46477 -112559 -15783 7462
73 7462 -14846 15703 107552 132934 80936 87136 139078 81697 6379 12455 35672 2890 -40306
86 -40306 -2442 44854 -11390 -47204 -11732 -18166 -78402 -105927 -65379 -39672 -77190 -50136
98 -50136 33372 42563 18501 40386 76757 59815 5391 21841 62878 25988 211 40499
110 40499 63569 30740 -7936 12036 16263 -55836 -81616 -41662 -47619 -82504 -72221 -18534
122 -18534 -8063 -47854 -23470 26244 -694 -28735 3871 40456 29456 6843 50312 85145
$$ packed form
0@%%%%%%%%%%%%%%%%%qJ6j6J6j6K2l0L2l4M2m8N6o4P2q6R8j08J20j37J55j75J95
39A02k18K42k68K99l31L67m05M46m91N42n98O59p27Q00q83R75j077J195j333J493
59G89j679J902k174K519k970L580m466N871q437J4618n6030o6082R6776K3245
73G462k2308L0549R1849K5382n1998O200N1942n7381p5318O076K3217l2782m3196
86d0306L7864M7296n6244l5814L5472o434o0236k7525M0548K5707l7518K7054
98e0136Q3508R191k4062K1885L6371j6942n4424J6450M1037l6890k5777M0288
110D0499K3070l2829l8676J9972M227p2099k5780L9954n957l4885J0283N3687
122a8534J0471l9791K4384M9714k6938k8041L2606L6585j1000k2613M3469L4833
$$ plain form
134 85145 39941 22732 55973 49858 3618 -16003 15232 16206 -34716 -26524 12278 -12104 -47167
147 -47167 -36213 -9613 -25551 -56334 -20675 17608 -7069 -8907 30544 45923 21132 3782
159 3782 34387 41079 -845 4821 39792 30756 3522 4641 26272 5853 -42501 -34480 -18204
172 -18204 -50912 -65422 -37998 -12789 -22562 -34140 1605 16177 -19263 -20851 5678 6092 -10657
185 -10657 -3041 39056 47875 22209 39925 60234 32337 1529 -110 7971 -15621 -41800 -13153
198 -13153 5728 -17615 -17391 3313 2733 -25103 -41385 -19308 -19654 -44512 -23542 10901 16067
211 16067 12762 27056 50863 35780 4094 14853 19688 -6420 -12915 5110 19938 7528 -1496
224 -1496 21102 16378 -19105 -25079 -19104 -29523 -44851 -38887 -7579 -3371 -12902 11539 27450
$$ packed form
134H5145m5204j7209L3241o115m6240j9621L1235R74n0922Q192L8802k4382l5063
147d7167J0954K6600j5938l0783L5659L8283k4677j838L9451J5379k4791j7350
159C782L0605O692m1924N666L4971r036k7234J119K1631k0419m8354Q021J6276
172a8204l2708j4510K7424K5209r773j1578L5745J4572l5440j588K6529M14j6749
185a0657P616M2097Q819k5666J7716K0309k7897l0808j639Q081k3592k6179K8647
198a3153J8881k3343K24K0704n80k7836j6282K2077l46k4858K0970L4443N166
211A6067l305J4294K3807j5083l1686J0759M835k6108o495J8025J4828j2410r024
224a496K2598m724l5483n974N975j0419j5328N964L1308M208r531K4441J5911
$$ plain form
237 27450 14159 3614 8260 17452 2938 -7262 19568 30001 17245 23134 34167 30991 8693
250 8693 -5219 4239 -9289 -32064 -21725 -10531 -13416 -17470 -9822 4899 -6041 -20716 -6150
263 -6150 -2890 -14020 -10693 3142 16243 11108 10852 31092 27219 10094 12527 14299 7761 -3820
277 -3820 -4625 7638 -1703 -13827 -4217 -4563 -16297 -22281 -20936 -13675 -22289 -24657 -5796 -3791 -9087
292 -9087 -2522 3390 6459 -171 117 14619 10813 5537 16415 18106 14398 7903 3958 6833 -6164
307 -6164 -15085 -6723 -9155 -12549 -9941 -7037 -1782 -9380 -13333 -5457 -11847 -15901 -8665 -3509 4428
322 4428 7487 13025 24426 19503 14669 16985 8901 3865 79 -1444 4894 3341 4184 11444 6526
337 6526 2191 -2155 -10769 -12871 -19321 -20958 -12148 -9962 -2554 7364 9026 13812 11576 6159 6163 -877
$$ packed form
237B7450j3291j0545M646R192j4514j0200K6830J0433j2756N889J1033l176k2298
250H693j3912R458j3528k2775J0339J1194k885m054P648J4721j0940j4675J4566
263f150L260j1130L327J3835J3101n135k56K0240l873j7125K433J772o538j1581
277c820q05J2263r341j2124R610l46j1734n984J345P261q614k368J8861K005n296
292i087O565N912L069o630K88J4502l806n276J0878J691l708o495l945K875j2997
307f164q921Q362k432l394K608K904N255p598l953P876o390m054P236N156P937
322D428L059N538J1401m923m834K316q084n036l786j523O338j553Q43P260m918
337F526m335m346q614k102o450j637Q810K186P408R918J662M786k236n417Mp040
$$ plain form
353 -877 -2250 1026 455 8486 12391 12096 16924 11653 4296 -384 -11476 -13962 -17016 -20304 -11368 -7387
369 -7387 -4257 3569 3373 4631 1843 -6249 -2747 -5455 -8132 362 5274 10782 14957 14734 19990 13180
385 13180 2563 2796 -3218 -10328 -10827 -10144 -3196 -4432 -6556 1853 -1043 -9128 -9405 -10716 -10425 -13447
401 -13447 -12718 801 2359 1113 10777 13514 10675 6042 4904 9537 1018 -4572 5010 4895 -510
416 -510 294 2124 3063 -6659 -11959 -4025 -9665 -16738 -10961 -5603 -4324 -7571 -3877 7651 1760 -3162
432 -3162 7058 9782 5916 5485 11299 17825 8498 4973 14789 9364 -429 -115 3135 2138 -7957
447 -7957 -6964 3242 -6048 -14613 -7751 -5931 -11324 -16053 -8277 2945 -4478 -4286 11265 11852 3832
462 3832 4369 10984 11796 -712 1340 15319 8905 1854 8805 12899 6248 -7067 -5086 546 -14976
$$ packed form
353h77j373L276n71Q031L905k95M828n271p357m680j1092k486l054l288Q936L981
369g387L130P826j96J258k788q092L502k708k677Q494M912N508M175k23N256o810
385A3180j0617K33o014p110m99O83O948j236k124Q409k896q085k77j311K91l022
401a3447P29J3519J558j246R664K737k839m633j138M633q519n590R582j15n405
416e10Q04J830R39r722n300P934n640p073N777N358J279l247L694J1528n891m922
432c162J0220K724l866m31N814O526r327l525R816n425r793L14L250r97j0095
447g957R93J0206r290q565O862J820n393m729P776J1222p423J92J5551N87q020
462C832N37O615Q12j2508K052J3979o414p051O951M094o651j3315J981N632j5522
$$ plain form
477 -14976 -21576 -8921 -5761 -10990 -10382 1412 7304 -6370 -6638 6233 -232 -8778 -2748 8792
491 8792 10554 2734 11742 24562 11946 2447 7462 6041 -5278 -15040 -5922 924 -12261 -11138
505 -11138 3804 1084 -9798 -10793 -3007 -5408 -20239 -12724 3075 -2400 -4631 8504 18559 13172
519 13172 3282 11779 16806 -1584 -5725 6401 6219 -2958 -3696 9382 9141 -8961 -6874 2388 -9516
534 -9516 -20960 -15396 -4943 -8450 -16589 -1550 10569 -906 -3744 7886 10247 -83 -5578
547 -5578 8440 12883 -2022 3052 17232 12106 1039 1161 10473 2864 -14088 -5765 3507 -8361
561 -8361 -13747 -2839 4951 -3984 -11374 2922 8163 -7588 -5356 8743 8700 -602 757 16419
575 16419 13848 -2052 5896 16229 4623 -4906 1613 9188 -951 -12680 -52 4696 -11638
$$ packed form
477a4976o600J2655L160n229O08J1794N892j3674k68J2871o465q546O030J1540
491H792J762p820R008J2820j2616r499N015j421j1319r762R118O846j3185J123
505a1138J4942k720j0882r95P786k401j4831P515J5799n475k231J3135J0055n387
519A3172r890Q497N027j8390m141J2126j82r177p38J3078k41j8102K087R262j1904
534i516j1444N564J0453l507q139J5039J2119j1475k838J1630K361j0330n495
547e578J4018M443j4905N074J4180n126j1067J22R312p609j6952Q323R272j1868
561h361n386J0908P790q935p390J4296N241j5751K232J4099m3r302J359J5662
575A6419k571j5900P948J0333j1606r529O519P575j0139j1729J2628M748j6334
$$ plain form
588 -11638 -13999 -2526 -947 -12009 -13557 3274 3750 -10994 -3575 8913 2489 -7009 -1284 11518
602 11518 4210 -7436 6564 14052 625 -4365 3817 6306 -7508 -15202 -448 -514 -15328 -10471
616 -10471 2549 487 -9802 -6991 7069 -23 -13574 -1777 8458 138 -3509 8362 18482
629 18482 8490 1401 15322 15005 -2237 -3185 5996 4973 -7025 -6200 9629 4372 -9568 -2070
643 -2070 5169 -4858 -15354 -9460 930 -8383 -14331 2768 9372 -536 -739 9663 11785 -1657
657 -1657 -4646 9308 5657 -6208 1023 10982 7688 -2031 1551 11554 -636 -13143 -3103 488
671 488 -9943 -13444 -2454 5164 -5452 -7536 7617 5439 -7108 -4558 4724 3137 -6953 -2023
685 -2023 12965 6232 -2581 7234 12321 3126 -5242 515 6468 -5968 -10578 2738 3469 -6516 -5909
$$ packed form
588a1638k361J1473J579j1062j548J6831M76j4744P419J2488o424r498N725J2802
602A1518p308j1646J4000P488j3427m990Q182K489j3814p694J4754o6j4814M857
616a0471J3020k062j0289K811J4060p092j3551J1797J0235q320l647J1871J0120
629A8482r992p089J3921l17j7242r48R181j023j1998Q25J5829n257j3940P498
643b070P239j0027j0496N894J0390r313n948J7099O604r908k03J0402K122j3442
657a657k989J3954l651j1865P231R959l294r719L582J0003j2190j2507J0040L591
671D88j0431l501J0990P618j0616k084J5153k178j2547K550R282j587j0090M930
685b023J4988o733q813R815N087r195q368N757N953j2436m610J3316P31r985O07
$$ plain form
700 -5909 3006 3452 -9248 -8204 4251 -2010 -10896 -2953 5070 1287 -5951 1585 10526 109 -5828
715 -5828 5091 6139 -2731 -5152 3724 6814 -4984 -5324 6921 2199 -6890 -3157 3796 1366 -8201
730 -8201 -2743 7312 -1441 -6969 2611 6032 -614 -4626 3770 8636 -1945 -2662 8069 4823 -3060
745 -3060 -2113 4519 3379 -6558 -2586 7233 -133 -5333 1133 4961 -314 -7041 -951 4883 -5080
760 -5080 -6143 3776 4020 -1150 -1579 5751 6294 -4237 -2780 4839 -748 -5952 -1848 3996 1756 -4624
776 -4624 1412 6805 -2583 -5624 163 488 -4815 -6898 1027 4650 -3621 -557 7594 3521 -1811
791 -1811 -757 3446 1215 -6558 -582 6095 88 -1151 3550 5215 858 -4595 168 1395 -7454
806 -7454 -6389 54 -585 -3465 -2902 3647 3229 -4635 -1282 2715 -2505 -4719 -1825 2585 1262 -2210
$$ packed form
700e909Q915M46j2700J044J2455o261q886P943Q023l783p238P536Q941j0417n937
715e828J0919J048q870k421Q876L090j1798l40J2245m722r089L733O953k430r567
730h201N458J0055q753n528R580L421o646m012Q396M866j0581p17J0731l246p883
745c060R47O632j140r937L972R819p366n200O466L828n275o727O090N834r963
760e080j063R919K44n170m29P330N43j0531J457P619n587n204M104N844k240o380
776d624O036N393r388l041N787L25n303k083P925L623q271L064Q151m073n332
791a811J054M203k231p773N976O677o007j239M701J665m357n453M763J227q849
806g454J065O443o39k880N63O549m18p864L353L997n220k214K894M410j323l472
$$ plain form
822 -2210 3992 6868 372 24 3047 1957 -1737 -3994 1485 2266 -3348 164 3948 885 -1477 -1107
838 -1107 1615 -780 -5453 -754 1780 -2166 -951 2006 3719 1652 -1134 3701 3718 -1956 145 2780
854 2780 1876 413 134 3973 2709 -2016 1226 2054 -1263 -2064 -1563 444 -1489 -4317 241 508 -3400
871 -3400 -1770 -924 -773 -1761 -2856 1036 621 -2708 223 906 0 339 -431 2281 1439 -1013 2245
888 2245 2021 -50 861 -298 979 -651 -2240 601 64 -1723 407 -368 38 -314 -2349 58 -1112
905 -1112 -3128 -385 -727 -279 1130 398 2771 1931 265 2096 700 -598 614 -582 917 1219
921 1219 -23 1970 1047 -228 237 -1863 -1818 -1872 -4027 -1529 -1924 -2007 364 -503 569 1217 -1363 145
939 145 257 -1368 498 346 1715 3015 1359 3773 4029 1185 1736 1030 180 -402 -2183 119 801
$$ packed form
822b210O202K876o496l48L023j090l694k257N479P81n614L512L784l063k362L70
838a107K722k395m673M699K534l946J215K957J713k067k786M835J7n674K101K635
854B780r04j463k79L839j264m725L242Q28l317q01N01K007j933k828M558K67l908
871c400J630Q46J51r88j095L892m15l329K931O83r06L39p70K712q42k452L258
888B245k24k071R11j159J277j630j589K841n37j787K130p75M06l52k035K407j170
905a112k016K743l42M48J409p32K373q40j666J831j396j298J212j196J499L02
921A219j242J993r23j275M65k100M5n4k155K498l95q3K371q67J072O48k580J508
939A45J12j625J866j52J369J300j656K414K56k844N51p06q50n82j781K302O82
$$ plain form
956 801 -1600 665 1189 -67 -456 -1615 -381 -1108 -4061 -662 560 -974 529 1323 2788 1633
972 1633 -840 1850 1558 -2389 -112 181 345 -331 -1262 1764 749 -2953 -508 -342 -2545 -3014 -2663
989 -2663 -159 -1056 -3208 1214 1683 -1006 375 1445 1648 -165 -1169 2876 2221 -1159 1827 2716
1005 2716 1262 -284 -593 2541 -109 -3988 361 735 -2375 -2287 -453 1490 -1496 -3228 2171 1390
1021 1390 -2286 -26 2148 1779 -723 -522 4060 1378 -2207 1708 2754 -268 -1683 -283 2337
1036 2337 -1905 -4072 608 37 -3810 -2987 -301 543 -2997 -2332 3223 1250 -2371 1258 3115 1503
1052 1503 -796 1154 5659 1515 -688 4601 4090 158 -287 1738 2313 -2962 -3857 1440 -809 -4659
1068 -4659 -1939 661 -284 -4297 -2404 2306 -2000 -4551 631 2152 -159 -1047 2850 5511 272
$$ packed form
956H01k401K265N24j256l89j159J234p27k953L399J222j534J503P94J465j155
972A633k473K690k92l947K277K93J64o76r31L026j015l702K445J66k203m69L51
989b663K504q97k152M422M69k689J381J070K03j813j004M045o55l380K986Q89
1005B716j454j546l09L134k650l879M349L74l110Q8J834J943k986j732N399p81
1021A390l676K260K174l69k502K01M582k682l585L915J046l022j415J400K620
1036B337m242k167M680n71l847Q23K686Q44l540O65N555j973l621L629J857j612
1052A503k299J950M505m144k203N289n11l932m45K025N75n275q95N297k249l850
1068d659K720K600r45m013J893M710m306k551N182J521k311q88L897K661n239
$$ plain form
1083 272 -786 4914 2545 -1728 -991 1991 1537 -3420 -2021 3297 -1039 -4676 -1026 200 -3004 -5787
1099 -5787 -2362 1534 -3623 -3736 2620 2417 -663 -291 3320 4531 -1358 -55 5823 2056 -962 2122
1115 2122 4963 2765 -1700 943 3993 -2144 -4691 -263 -55 -3627 -5259 -529 1634 -4745 -3438
1130 -3438 2432 -55 -3294 -1610 2750 2019 -2783 1275 6284 1550 -793 3412 4968 1457 -2322
1145 -2322 1884 4069 -3170 -2789 2340 447 -3337 -3520 612 160 -5935 -2668 2277 -1778 -3898 -211
1161 -211 2989 800 -2727 2450 5682 -319 -642 4093 4247 292 -783 3676 3413 -3182 -1126 3340
1177 3340 -498 -3698 -2262 1299 -1034 -5730 -1504 1834 -3528 -3967 -100 1910 -1681 -2795 2584
1192 2584 3978 -2230 103 4651 2482 -1085 -593 4088 2263 -3607 497 3686 -1112 -3239 -399
$$ packed form
1083B72j058N700k369m273P37K982m54m957J399N318m336l637L650J226l204k783
1099e787L425L896n157j13O356k03l080L72L611J211n889J303N878l767l018L084
1115B122K841k198m465K643L050o137k547M428K08l572j632M730K163o379J307
1130c438N870k487l239J684M360p31m802M058N009m734k343M205J556l511l779
1145b322M206K185p239L81N129j893l784j83M132m52o095L267M945m055k120L687
1161b11L200k189l527N177L232o001l23M735J54l955j075M459k63o595K056M466
1177C340l838l200J436L561k333m696M226L338n362m39L867K010l591j114N379
1192B584J394o208K333M548k169l567M92M681j825n870M104L189m798k127K840
$$ plain form
1207 -399 1770 -2021 -5463 30 1469 -4212 -3011 1453 1393 -1584 -1800 3600 2747 -2746 790 4121
1223 4121 981 -1439 981 4302 1246 -2428 2003 2916 -2522 -2792 179 836 -3123 -4315 1344 905
1239 905 -4064 -1392 2434 369 -2564 -1227 3549 841 -2851 2461 4415 472 43 2666 3920
1254 3920 -344 -2414 2655 1810 -3472 -1844 727 -89 -3370 -3068 1835 -808 -4677 -1147 1292 -1768
1270 -1768 -2696 43 3378 94 -1641 3745 3815 -139 511 2967 2972 -729 -1374 2912 1465 -3020 -700
1287 -700 1287 -930 -3676 -2524 711 -2517 -5054 -527 346 -2324 -2400 657 2363 -944 -1219 3701
1303 3701 2483 -594 1649 3706 2803 109 775 4268 935 -2188 949 1563 -1281 -2879 -1087 1189
1319 1189 -2999 -4137 245 -573 -3257 -2066 327 869 -1958 -748 3457 1222 -1064 1873 3279
$$ packed form
1207c99K169l791l442N493J439n681J201M464o0k977k16N400q53n493L536L331
1223D121l140k420K420L321l056l674M431R13n438k70K971O57l959j192N659m39
1239I05m969K672L826k065k933J337M776k708l692N312J954l943m29K623J254
1254C920m264k070N069q45n282J628K571q16l281L02M903k643l869L530K439l060
1270a768r28K739L335l284j735N386P0l954O50K456Nl701o45M286j447m485K320
1287g00J987k217k746J152L235l228k537M527Q73k670p6L057J706l307k75M920
1303C701j218l077K243K057r03k694O66L493l333l123L137O14k844j598J792K276
1319A189m188j138M382q18k684J191K393N42k827J210M205k235k286K937J406
$$ plain form
1334 3279 1529 -184 1564 3905 205 -895 2120 1310 -1173 -1888 -113 469 -3046 -3126 600 -1209
1350 -1209 -3169 -1381 147 -107 -2150 -665 2729 -259 -971 1761 2314 1085 386 2187 3229 -88
1366 -88 -374 2164 658 -1573 -891 256 64 -2619 -1603 1052 -1738 -2632 -503 -467 -910 -2116 -155
1383 -155 1595 -801 -262 2133 1716 590 636 1926 2133 -452 279 2184 96 -585 135 516 13 -1976
1401 -1976 -806 505 -2079 -2283 -337 -594 -993 -1185 382 1343 -956 130 1961 574 355 309 1212
1418 1212 1114 -472 434 1527 -556 -856 83 -56 -592 -2153 -723 -98 -2097 -1199 -149 -529 -398 -661
1436 -661 413 890 -531 709 1692 694 782 1167 1617 1612 109 870 1487 -671 -460 121 -469 -922 -1800
1455 -1800 -928 -715 -2037 -1296 -599 -1056 -375 -524 350 1228 -248 1007 1843 1124 1531 1452 1883 1882 794
$$ packed form
1334C279j750j713J748K341l700j100L015q10k483p15J775N82l515q0L726j809
1350a209j960J788J528k54k043J485L394k988p12K732N53j229o99J801J042l317
1366h8k86K538j506k231O82J147j92k683J016K655k790q94K129L6m43j206J961
1383a55J750k396N39K395m17j126M6J290K07k585P31J905k088o81P20L81n03j989
1401a976J170J311k584k04J946k57l99j92J567R61k299J086J831j387k19m6R03
1418A212r8j586R06J093k083l00R39j39n36j561J430O25j999Q98J050l80J31k63
1436f61J074M77j421J240R83r98Q8L85M50nj503P61O17k158K11N81n90m53q78
1455a800Q72K13j322P41O97m57O81j49Q74Q78j476J255Q36p19M07p9M31jj088
$$ plain form
1474 794 1274 1200 12 196 -201 -578 -591 -1864 -1506 -1274 -2244 -1387 -1288 -1589 -877 -1185 -486 42 -618 580
1494 580 869 842 1680 1361 1856 2144 1063 1557 1806 529 857 427 -264 63 -1313 -911 -793 -1885 -1549
1513 -1549 -1549 -1742 -894 -2039 -1169 -229 -1314 -54 561 292 859 491 970 1994 688 945 1523 925 1104
1532 1104 250 369 818 -1254 -372 182 -918 -1275 -1535 -877 -790 -1698 -577 334 -868 -422 508 495 623
1551 623 8 1104 1848 167 1180 1610 1165 530 286 817 915 -990 -307 424 -923 -923 -713 -511 -478 -1666
1571 -1666 -400 329 -1309 -608 322 492 165 -204 1240 1380 -390 733 1632 324 51 -64 922 343
1589 343 -1117 237 379 -1563 -1179 -404 -236 -993 -1620 67 -19 -1318 -413 760 375 74 19 1238
1607 1238 921 -547 1140 1706 116 -187 432 1130 -283 -1360 339 179 -1536 -1168 -133 -281 -1307
$$ packed form
1474G94M80p4j188J84l97l77j3j273L58K32r70Q57R9l01P12l08O99N28o60J198
1494E80K89k7Q38l19M95K88j081M94K49j277L28m30o91L27j376M02J18j092L36
1513a549%j93Q48j145Q70R40j085J260O15k69N67l68M79J024j306K57N78n98J79
1532A104q54J19M49k072Q82N54j100l57k60O58Q7r08J121R11j202M46R30j3J28
1551F23o15J096P44j681J013M30m45o35k44N31R8j905O83P31j347%K10K02L3j188
1571a666J266P29j638P01R30J70l27l69J444J40j770J123Q99j308k73j15R86n79
1589C43j460J354J42j942L84P75J68p57o27J687q6j299R05J173l85l01n5J219
1607A238l17j468J687N66j590l03O19O98j413j077J699j60j715L68J035j48j026
$$ plain form
1624 -1307 -1514 412 354 -1624 -9 764 46 -556 251 1930 818 -548 1655 1812 -101 -54 719 1049
1642 1049 -594 -1137 901 -50 -1745 -666 -138 -840 -1832 -1442 638 -731 -1733 328 787 -141 -209
1659 -209 1024 1866 633 -130 2120 1480 -145 574 1149 1091 -788 -629 1307 -194 -1818 -415 -270
1676 -270 -977 -1954 -1161 440 -1349 -2162 483 658 -1069 -493 847 1413 -160 -72 2460 1379 -276
1693 -276 1131 1869 875 -454 -229 1352 -446 -1705 409 311 -1365 -1442 -451 237 -1967 -1934 626 1
1711 1 -1520 -698 676 721 -842 153 2164 282 -702 1326 1731 584 -273 753 1953 -906 -906 1128
1729 1128 136 -1261 -1178 31 -208 -2033 -1207 816 -842 -1616 -168 687 -62 -1065 126 1899 -311
1746 -311 -747 1449 1201 -160 -142 1119 1487 -944 -398 1558 -56 -1431 -380 491 -9 -1440 -629
$$ packed form
1624a307k07J926n8j978J615P73p18o02Q07J679j112j366K203J57j913M7P73L30
1642A049j643n43K038r51j695J079N28p02r92L90K080j369j002K061M59r28o8
1659b09J233Q42j233p63K250o40j625P19N75n8j879J59J936j501j624J403J45
1676b70p07r77P93J601j789q13K645J75j727N76J340N66j573Q8K532j081j655
1693b76J407P38r94j329K25J581j798j259K114r8j676p7R91O88k204L3K560o25
1711Aj521Q22J374M5j563R95K011j882r84K028M05j147q57J026J200k859%K034
1729A128r92j397Q3J209k39j825Q26K023j658p74J448Q55p49j003J191J773k210
1746c11m36K196k48j361J8J261L68k431N46J956j614j375J051Q71n00j431Q11
$$ plain form
1763 -629 1074 -887 -1325 433 661 -254 -913 572 1387 -1217 -687 1516 606 -552 -337 1133 839
1780 839 -1069 66 1379 -340 -991 36 940 -309 -1455 12 1228 -1276 -882 883 144 -691
1796 -691 -639 746 912 -1219 -64 1176 76 -877 12 1083 165 -1311 21 759 -934 -1000 165
1813 165 171 -954 -1392 269 546 -1498 -233 1106 280 -477 -239 1045 771 -1181 502 1724 -12
1830 -12 -307 807 924 250 -879 481 774 -967 -555 524 -25 -888 -1012 499 135 -1634 -79 972
1848 972 -334 -654 270 860 503 -545 999 1223 -201 -112 731 896 -52 -450 793 564 -1301 -290
1866 -290 539 -199 -1075 -604 173 -725 -1729 -107 432 -752 -993 -3 749 -384 -845 1007 948 -386
1884 -386 419 1004 721 -84 104 1263 507 -587 482 839 6 -574 -84 358 -580 -1496 217 -148 -1133
$$ packed form
1763f29J703j961m38J758K28r15o59J485Q15k604N30K203r10j158K15J470k94
1780H39j908J135J313j719o51J027R04j249j146J467J216k504L94J765p39q35
1796f91N2J385J66k131J155J240j100r53Q89J071r18j476J332P38j693o6J165
1813A65Oj125m38J661K77k044J265J339q26p57K38J284k74j952J683J222j736
1830a2k95J114J17o74j129J360K93j741M12J079n49q63j24J511l64j769J555J051
1848I72j306l20R24N90l57j048J544K24j424Q9Q43J65r48l98J243k29j865J011
1866b90Q29p38q76M71P77q98j004J622N39j184k41R90P52j133m61J852n9j334
1884c86Q05N85k83q05J88J159p56j094J069L57q33n80M90M42r38r16J713l65r85
$$ plain form
1903 -1133 -735 292 -12 -807 -424 984 382 -771 382 1017 320 -250 294 974 130 -630 566 556
1921 556 -403 -582 -240 121 -587 -1148 255 -144 -1162 -347 12 50 -466 -482 661 61 -605 715 684 362
1941 362 119 385 1245 393 -189 921 576 -261 97 419 176 -576 -303 667 17 -860 135 1 -142 -455
1961 -455 -143 528 -133 -363 419 541 93 111 176 731 -184 -174 456 -140 -536 47 -156 -70 -608 -294 616
1982 616 -632 -660 67 -161 -95 -335 -24 699 -175 -37 399 287 -3 131 152 563 -445 -59 528 -128
2002 -128 -141 -27 85 -17 -432 -211 374 -399 -139 449 89 -37 5 137 710 -42 -40 800 89 119 261 201
2024 201 443 -212 -77 239 -193 -327 -161 -464 -362 -506 -549 25 -577 -194 240 -328 68 21 269 226 -205
2045 -205 105 631 23 164 393 68 630 222 4 474 137 -415 -16 -139 145 -393 -297 173 -763 -610
$$ packed form
1903a133L98J027l04p95L83J408o02j153J153O35o97n70N44O80q44p60J196j0
1921E56r59j79L42L61p08n61J403l99j018Q15L59L8n16j6J143o00o66J320l1l22
1941C62k43K66Q60q52n82J110l45q37L58L22k43p52K73R70o50q77R95j34j43l13
1961d55L12O71o61k30P82J22m48J8O5N55r15J0O30n96l96N83k03Q6n38L14R10
1982F16j248k8P27k28O6k40L11P23q74J38M36j12k90J34K1M11j008L86N87o56
2002a28j3J14J12j02m15K21N85p73K60N88l60j26M2J32N73p52KQ40p11L0J42o0
2024B01K42o55J35L16m32j34J66l03J02j44m3N74o02L83M34n68L96m7K48m3m31
2045b05L10N26o08J41K29l25N62m08k18M70l37n52L99j23K84n38R6M70r36J53
$$ plain form
2065 -610 -156 -408 93 -419 -209 118 -351 -36 670 159 272 351 466 589 143 234 470 -12 171 223 54
2086 54 245 -296 -266 9 -290 -304 -112 -450 -81 -466 -216 298 -401 -419 317 197 142 -68 -90 510 0 171
2108 171 768 31 219 122 -282 266 -336 -135 88 -315 -319 -165 -474 62 -418 16 275 -268 -179 529 46
2129 46 -38 -45 55 751 -240 31 511 104 -4 35 340 86 -426 98 470 -301 -361 174 76 285 -554 -27
2151 -27 183 -478 -316 365 11 -91 -58 380 729 -624 34 209 -333 -121 70 311 130 -224 227 475
2171 475 -399 -325 425 255 145 -100 461 262 -219 -69 810 150 156 -154 447 261 -414 105 486 -281 -174
2192 -174 63 -147 -76 -729 59 116 -665 -244 160 -46 -313 -225 55 171 -662 172 592 82 -55 -11 447
2213 447 165 -326 121 254 -696 -201 16 -85 -317 -675 101 8 -896 -390 100 -239 -327 56 513 236 -367
$$ packed form
2065f10M54k52N01n12K10L27m69L15P06n11J13P9J15J23m46R1K36m82J83N2j69
2086E4J91n41L0K75k99j4J92l38L69l85K50N14o99j8P36j20n5k10k2O00n10J71
2108A71N97p37J88r7m04N48o02K01K23m03mJ54l09N36m80M34K59n43Q9P08m83
2129D6q4pJ00O96r91K71M80m07j08L9L05k54n12N24L72p71o0N35r8K09q39N27
2151b7K10o61J62O81l54j02L3M38L49j353O58J75n42K12J91K41j81l54M51K48
2171D75q74P4P50j70j10k45N61j99m81J50Q79o60Ol10O01j86o75N19L81p67J07
2192a74K37k10P1o53P88N7p81M21M04k06k67Q8K80J16q33Q34M20n10j37M4M58
2213D47k82m91M47J33r50M95K17j01k32l58P76r3r04N06M90l39q8L83M57k77o03
$$ plain form
2234 -367 374 733 -80 177 316 643 379 -35 559 581 -360 56 99 137 -418 -260 567 214 -686 -65 239
2255 239 -413 -289 -189 301 -271 -543 384 333 -187 1 66 45 -172 -285 746 117 -281 38 440 -149 -286
2276 -286 -243 416 -206 -867 222 68 -463 -361 -22 240 -295 -442 360 44 -401 156 424 120 -79 -108
2296 -108 494 212 -240 335 177 34 -147 -225 205 -265 -287 652 168 -322 -104 77 74 -286 -48 828 -403
2317 -403 -344 246 196 -260 -397 123 523 -262 -425 210 415 -355 -306 158 499 -88 -311 638 0 -250 145
2338 145 332 181 -250 133 467 -223 -281 520 546 112 -352 -89 543 -423 -562 250 -129 -426 -161 109 82
2359 82 -603 -158 737 -309 -381 23 273 -48 -159 175 781 -148 -118 769 170 -452 -254 216 432 -235 1
2380 1 748 -251 -546 -53 98 49 -622 -309 444 -318 -434 202 140 -33 -291 -19 605 -154 -135 651 -10 -115
$$ packed form
2234c67P41L59q13K57J39L27k64m14N94K2r41M16M3L8n55J58Q27l53r00O21L04
2255B39o52J24J00M90n72k72R27n1n20J88O5k1k17j13J031o29l98L19M02n89j37
2276b86M3O59o22o61J089j54n31J02L39K62n35j47Q02l16m45N57K68l04j99k9
2296a08O02k82m52N75j58j43j81p8M30m70k2R39m84m90K18J81ll60K38Q76j231
2317d03N9N90n0m56j37N20M00p85j63O35K05p70M9M64L41n87k23R49o38k50L95
2338A45J87j51m31L83L34o90n8Q01K6m34m64K63O32r66j39Q12l79k97K65K70k7
2359H2o85M45Q95j046p2M04K50l21j11L34O06r29L0Q87n99o22J98M70K16o67K36
2380AP47r99k95M93J51m9o71L13P53p62j16O36o2j73k58K72O24p59J9P86o61j05
$$ plain form
2402 -115 122 295 260 -312 197 306 -58 13 -137 -240 -169 -575 103 162 -561 -36 103 78 -108 -282 107 -31
2424 -31 -302 204 468 -66 -188 333 445 313 -177 240 389 178 -43 184 142 -93 4 97 166 -479 -74 124
2446 124 -27 -354 -625 96 -47 -284 -269 310 -297 -297 29 344 -273 -541 240 367 -158 196 233 -115 126
2467 126 3 141 38 -595 -177 281 -43 21 -126 238 96 -543 319 345 -356 -217 151 201 -32 -376 184
2488 184 131 -240 109 535 64 30 -83 312 240 -408 254 267 -396 -185 148 258 96 -86 123 367 -232
2509 -232 -73 192 -2 -41 -169 -120 -199 -231 21 -100 -265 -64 -103 -122 -270 -612 -44 201 -335 125 -93 199
2531 199 227 -34 408 244 -299 126 303 187 89 -50 67 67 -264 -169 -56 -200 -9 62 -30 -218 -606 -68
2553 -68 89 -405 312 54 242 -145 -90 210 36 70 230 101 31 337 -83 296 -37 -138 207 -196 -299
$$ packed form
2402a15K37J73l5n72N09J09l64P1j50j03P1m06O78N9p23N25J39k5j86j74L89j38
2424c1k71N06K64n34j22N21J12j32m90M17J49k11k21K27m2k35R7R3O9o45M05J98
2446A24j51l27k71P21j43k37J5N79o07%L26L15o17k68P81J27n25L54L7l48K41
2467A26j23J38j03o33M18M58l24O4j47L64j42o39Q62K6p01J39L68N0k33l44N60
2488A84n3l71L49M26m71l4j13L95p2o48O62J3o63K11L33J10j62j82K09K44n99
2509b32J59K65j94l9j28M9p9l2K52j21j65K01l9j9j48l42N68K45n36M60k18K92
2531A99K8k61M42j64n43M25J77j16r8j39J17%l31R5J13j44J91P1r2j88l88N38
2553f8J57m94P17k58J88l87N5L00j74L4J60j29p0L06m20L79l33j01L45m03j03
$$ plain form
2574 -299 -200 -197 -85 -176 -311 187 -311 -153 -166 -116 -103 -126 -74 322 167 -126 276 90 337 104 217 382 173
2597 173 15 1 186 60 87 -108 -5 -22 -210 -82 -321 -308 83 -365 85 55 -165 115 9 -95 166 -3
2619 -3 329 -111 48 186 43 -85 123 91 -99 223 -147 120 -56 -174 273 -162 -59 130 24 -11 77 -18
2641 -18 157 120 11 80 -7 -128 -229 -115 256 2 49 321 -119 -409 79 104 350 36 286 157 30 17
2663 17 60 -152 -133 -28 155 209 -77 -321 143 37 -9 -28 -279 40 -17 -59 39 -214 7 -18 13 225 -236 -206
2687 -206 358 -152 -231 127 147 140 -85 -168 307 50 -278 177 -65 161 -234 -256 160 -282 -448 -18 -215 -213 52
2710 52 -9 91 174 -154 -142 -168 -231 77 -154 249 15 -43 439 -101 -224 184 -40 -11 7 -175 303 -162 91
2733 91 153 -48 16 73 -32 56 -239 -338 49 -28 14 -1 18 10 -476 -117 89 -412 -116 65 -49 -176 84 -85
$$ packed form
2574b99R9LJ12r1j35M98m98J58j3N0J3k3N2L96j55k93M02j86K47k33J13J65k09
2597A73j58j4J85j26K7j95J03j7j88J28k39J3L91m48M50l0k20K80j06j04K61j69
2619cL32m40J59J38j43j28K08l2j90L22l70K67j76j18M47m35J03J89j06l5Q8r5
2641a8J75l7j09O9q7j21j01J14L71k54M7K72m40k90M88K5K46l14K50j29j27j3
2663A7M3k12J9J05J83N4k86k44M64j06m6j9k51L19n7m2R8k53K21k5L1K12m61L0
2687b06N64n10p9L58K0pk25q3M75k57l28M55k42K26l95k2M16m42j66M30j97KK65
2710E2o1J00Q3l28J2k6o3L08k31M03k34n8M82n40j23M08k24K9J8j82M78m65K53
2733I1O2k01O4N7j05Q8k95r9L87p7M2j5J9qm86L59K06n01K96J81j14j27K60j69
$$ plain form
2757 -85 54 -40 58 168 53 53 129 -256 75 -451 47 93 -226 -137 -90 -65 -183 18 -232 89 -189 132 76 -172
2781 -172 -90 17 -171 -33 -60 259 284 40 -119 98 -91 311 -92 82 -41 -259 -99 214 -53 -110 -5
2802 -5 52 -17 -321 77 285 -90 -23 -94 312 38 -471 -176 37 183 -151 356 259 139 -360 56 138 -211 218
2825 218 205 -74 8 -327 231 335 -200 -176 206 -57 -92 -38 -61 30 -333 116 307 -30 -133 10 -25 70 -67
2848 -67 109 90 -296 188 367 71 -107 -95 101 69 -49 -117 161 8 144 302 70 220 -27 -160 2 -153
2870 -153 -141 -23 62 79 -40 70 -26 -336 65 176 6 32 28 295 388 -368 27 243 -210 -200 -57 -4 102
2893 102 -92 -173 -75 -240 316 -2 -225 -51 -225 -64 -51 -471 468 129 -233 -89 104 238 1 -79 194
2914 194 225 -82 319 58 124 231 26 422 115 -66 391 53 -198 77 68 196 43 -371 65 -83 -276
$$ packed form
2757h5J39r4R8J10j15%P6l85L31n26M98M6l19Q9M7K5j18K01k50L21k78L21n6k48
2781a72Q2J07j88J38k7L19K5k44j59K17j89M02m03J74j23k18J60L13k67n7J05
2802eN7o9l04L98K08l75O7p1M06k74n09K95K13J46l34N07r7j20m99M16Q2l49M29
2825B18j3k79Q2l35N58J04n35K4L82k63l5N4k3R1l63M49J91l37j03J43l5R5j37
2848f7J76j9l86M84J79k96j78J2J96l2j18o8K78j53J36J58k32J50k47j33J62j55
2870a53J2J18Q5J7j19J10r6l10M01J11j70K6mK67R3p56L95K16m53J0J43N3J06
2893A02j94q1R8j65N56l18k23J74j74J61J3m20R39l39l62J44J93J34k37q0K73
2914A94L1l07M01k61O6J07k05L96l07j81M57l38k51K75rJ28j53m14M36j48j93
$$ plain form
2935 -276 -45 -147 40 -28 -507 213 -43 -213 39 25 -100 -144 111 319 255 -223 200 249 125 -50 54 84
2957 84 59 -284 349 110 -241 -99 -90 36 -72 -67 193 -33 -168 -181 167 104 108 41 -24 207 -112 209 -123 -194
2981 -194 85 100 52 -41 -66 279 -64 -217 57 39 123 -164 116 81 -319 -52 197 16 -101 -103 96 -83 -103
3004 -103 41 149 -101 -72 377 -180 119 14 143 46 -256 41 372 -75 -60 220 -34 165 -223 -142 19
3025 19 83 -45 -13 4 -240 -34 -26 301 -95 -161 129 175 58 -48 167 -147 -112 151 210 73 156 111 47 128 -10
3050 -10 154 -115 -130 104 16 -57 -176 -271 22 77 -319 -147 -13 -106 -44 -42 258 -21 -18 29 -16 -390 -49 -93 123
3075 123 33 -366 6 -72 74 -61 1 239 408 -69 -67 235 -155 63 272 -39 -18 -6 5 216 -115 -236 63
3098 63 -240 215 -155 -119 115 27 -237 78 126 -55 42 25 359 -174 65 -80 92 118 87 -4 -4 -114 -152 204
$$ packed form
2935b76K31j02J87o8m79P20k56j70K52j4j25m4K55K08o4m78M23M9j24j75J04L0
2957H4k5l43O33k39l51J42RJ26j08NK60k26j35j3L48o3Mo7o5K31l19L21l32p1
2981a94K79J5m8r3k5L45l43j53K74j8Q4k87K80l5m00K67K49j81j17kJ99j79k0
3004a03J44J08k50K9M49n57K99j05J29r7l02K97L31m47J5K80k54J99l88Q1J61
3025A9O4j28L2J7k44K06QL27l96o6K90M6j17j06K15l14L5K63N9j37Q3m5o4Q1j38
3050a0J64k69j5K34q8p3j19r5K93N5l96J72J34r3O2KL00k79LM7m5l74L41m4K16
3075A23r0l99L72p8J46j35O2K38J69m77KL02l90K18K09l11K1J2J1K11l31j21K99
3098F3l03M55l70L6K34q8k64L15M8j81R7j7L34n33K39j45J72K6l1r1%j10l8L56
$$ plain form
3122 204 -142 21 176 -289 -65 -61 233 -194 -200 71 241 -86 -34 -314 20 128 -99 -22 51 60 -25 185 -136
3145 -136 117 192 35 -175 -175 79 163 -94 32 149 -196 -187 -264 46 -21 -66 21 30 -286 -11 48 224 59 -148
3169 -148 166 271 -45 103 -179 139 105 -42 7 145 274 -155 214 286 152 -29 420 -297 -226 148 -57
3190 -57 -34 -98 -249 52 6 -296 150 177 58 191 18 -253 -141 45 289 25 -74 82 -119 19 -8 -95 209
3213 209 -251 -135 -102 165 -51 -151 -200 126 84 60 140 -172 -244 -117 55 55 -185 -102 -49 -245 -88 136 -130
3236 -130 198 -75 -55 20 42 -87 176 151 118 -49 46 14 -151 -23 -43 57 -29 -106 -81 157 270 -156 151 139
3260 139 -52 9 76 245 -340 -204 -71 219 -150 -52 30 -65 -33 -112 -6 -93 -24 117 -50 -6 111 -215 30
3283 30 -43 -201 129 93 -72 -84 -186 121 -300 -221 -297 62 -23 -61 -68 22 -110 9 -237 -21 122 117 -52 17 106
$$ packed form
3122B04l46J63J55m65K24MK94m27oK71J70l27N2k80L34J08k27P7P3Rq5K10l21
3145a36K53P5j57k10%K54Q4k57J26J17l45Rp7L10o7m5Q7Rl16K75N9J76j65k07
3169a48L14J05l16J48k82L18l4j47M9J38J29m29L69P2j34j81M49p17P1L74k05
3190e7K3o4j51L01m6l02M46K7j19J33j73k71J12J86K44k64r9J56k01J38k7q7L04
3213B09m60J16L3K67k16j00m9L26m2k4Q0l12p2J27J72%k40Q3N3j96J57K24k66
3236a30L28k73K0P5K2j29K63k5l3j67R5l2j65J28k0J00q6p7K5K38J13m26L07j2
3260A39j91O1O7J69n85J36J33K90l69R8Q2r5L2p9J06q7O9J41j67M4J17l26K45
3283C0p3j58L30l6j65j2j02L07m21P9p6L59q5l8pR0j32J19k46K16J43nj69O9Q9
$$ plain form
3308 106 127 266 -288 66 127 -141 7 -129 -143 -128 -143 1 228 -59 108 -37 -386 189 -179 -216 277 -313
3330 -313 95 200 -1 10 -7 -97 172 3 -25 117 119 -156 40 -33 42 -123 -14 -22 -290 32 90 -156 -116 84
3354 84 -201 172 -97 -347 66 -42 62 -94 230 -25 -123 -16 173 67 97 97 -2 108 -8 -109 333 42
3376 42 -98 108 -37 166 221 94 -165 -67 88 -181 -136 -35 -128 124 27 79 236 74 -71 -86 -17 -29 -113 8
3400 8 248 133 27 49 506 49 93 -75 -89 123 17 119 275 -123 -78 2 20 119 -262 -35 -11 -334 -295 -188
3424 -188 -99 0 64 149 127 -41 22 39 -227 -286 -177 -109 -7 -289 105 190 -290 33 -140 261 -43 -318 3
3447 3 125 -180 -175 126 -354 -95 -205 24 20 128 275 142 -206 76 -241 147 25 -109 80 239 -27 -70
3469 -70 -19 27 -148 20 -62 -33 -109 -101 20 -162 -158 93 -95 299 -25 115 -15 -64 44 127 139 -15 -208 -220 -173
$$ packed form
3308A06K1J39n54L54O1k68J48j36j4J5j5J44K27k87J67j45l49N75l68l7M93n90
3330c13M08J05k01J1j7r0K69j69k8J42Kk75J96p3P5j65J09qk68L22N8k46M0K00
3354H4k85L73k69k50M13j08J04j56L24k55r8J07J89j06L0%r9J10j16j01M42k91
3376D2j40K06j45K03N5j27k59R8J55k69M5J01r3K52r7N2J57j62j45j5O9j2q4J21
3400HK40j15j06K2M57m57M4j68j4K12j06J02J56l98M5Q0J8R9l81K27K4l23L9J07
3424a88Q9R9O4Q5k2j68O3J7k66n9J09O8J02k82L94Q5m80L23j73M01l04k75L21
3447CJ22l05NL01m80K59j10K29mJ08J47j33l48K82l17L88j22j34J89J59k66m3
3469g0N1M6j75J68q2K9p6QJ21j82MK51j88L94l24J40j30m9J08Q3J2j54j93j2M7
$$ plain form
3494 -173 105 -89 53 124 -132 331 149 -9 -25 259 318 -308 -37 208 -119 -43 -92 104 -167 -176 273 -80
3516 -80 -75 -158 -190 243 73 98 74 31 311 -123 -125 132 -159 125 46 60 -29 -211 -89 -5 -10 -74 54 60 18 -139 -161
3543 -161 -261 40 11 -67 106 -93 -55 -115 239 104 -133 -3 24 98 164 102 -165 228 -22 131 -185 24 120
3566 120 -55 116 219 -67 176 36 -60 -244 -238 -26 199 95 -83 -133 -18 49 -69 -110 231 286 -130 153
3588 153 77 52 217 81 -65 -105 -106 253 -21 70 7 69 62 -79 -130 -21 -57 -483 116 131 -17 -187 28 69 21
3613 21 -163 -150 -139 102 -142 -272 22 -109 137 -166 185 -65 173 -300 29 168 57 63 -50 -87 160 -272
3635 -272 -78 83 -25 514 -96 -73 -114 180 18 211 -39 129 -139 -33 32 46 -60 -84 -17 -180 222 -261
3657 -261 178 -25 -193 -72 44 237 -104 -91 141 265 -276 -360 153 221 21 86 85 60 -266 100 -278 226
$$ packed form
3494a73K78j94J42P1k56M63j82j58j6K84N9o26K71K45l27P6m9J96k71rM49l53
3516h0Nq3l2M33j70K5k4m3K80m34kK57k91K84p9J4q9j82J22Q4no4J28Om2j57k2
3543a61j00L01k9p8J73j99L8o0L54j35k37J30K7P4O6o2k67L93k50J53l16K09R6
3566A20j75J71J03k86K43j40r6j84OK12K25j04j78n0J15O7j18m1L41N5m16K83
3588A53p6k5J65j36j46m0jL59k74R1o3O2pj41n1J09l6m26N99J5j48j70K15M1m8
3613B1j84J3J1K41k44j30K94j31K46l03L51k50K38m73L29J39j11Oj13l7K47m32
3635b72J94J61j08N39o10K3m1K94j62J93k50J68k68J06O5J4j06k4O7j63M02m83
3657b61M39k03j68J21J16J93l41J3K32J24n41q4N13O8k00O5jk5l26L66l78N04
$$ plain form
3679 226 61 225 -39 -180 6 -110 -115 104 -62 -250 103 15 124 180 34 356 103 108 87 -86 6 154 -100
3702 -100 29 -124 35 8 -49 47 4 -171 -126 15 93 -133 -33 -179 -204 -141 -127 224 157 -5 182 -147 -87 -28
3726 -28 80 -67 -124 -247 91 17 154 -34 -3 -4 104 -8 -77 -43 106 182 -110 47 -84 -168 283 -162 -47
3749 -47 -247 -93 162 -50 106 -345 -195 87 -16 57 83 26 76 170 -55 248 -91 -217 -83 14 110 83 -318
3772 -318 17 287 -115 164 206 3 -16 -134 121 106 -72 27 17 -20 66 98 -31 205 31 -71 109 168 -131
3795 -131 -26 -2 -173 -70 162 8 -172 77 -6 -231 272 113 91 -87 9 -183 -7 -4 -58 -143 -47 290 133
3818 133 120 329 27 26 -133 -70 -66 -55 -133 -273 -52 -8 -15 -253 65 -106 101 30 15 -68 -213 -41 -289 2 -177
3843 -177 -145 -127 210 -120 45 68 18 81 33 -3 30 131 -20 -4 -239 62 91 -165 -45 71 1 -5 -3 -238 205
$$ packed form
3679B26j65J64k64j41J86j16nK19j66j88L53q8J09N6j46L22k53Nk1j73R2J48k54
3702a00J29j53J59k7n7R6m3j75M5J41P8k26J00j46k5O3J4L51o7j62J87l29O0N9
3726b8J08j47n7j23L38p4J37j88L1jJ08j12o9L4J49P6k92J57j31q4M51m45J15
3749d7k00J54K55k12J56m51J50K82j03P3K6n7N0R4k25L03l39j26J34R7R6k7m01
3772c18L35K70m02K79M2k03j9j18K55j5j78R9j0l7Q6L2j29K36j74j02J80N9k99
3795a31J05K4j71J03K32j54j80K49q3k25N03j59k2j78R6j92J76Ln4q5R6L37j57
3818A33j3K09l02jj59O3MJ1p8j40K21M4pk38L18j71K07p1j5q3j45J72k48K91j79
3843a77L2J8L37l30J65K3n0O3m8l6L3J01j51J6k35L01K9k56J20J16p0oKk35M43
$$ plain form
3868 205 136 -246 -96 -355 8 0 64 141 132 38 -47 161 96 136 11 214 -22 -112 -99 234 78 97 17 99 -56
3893 -56 82 161 -95 25 25 14 136 229 70 94 -77 40 119 161 97 -206 -274 54 -134 13 245 -8 37 -43
3917 -43 -16 156 267 41 280 -131 -133 -155 -154 166 35 321 204 -28 -203 188 -140 -130 94 58 99 165 166 26
3941 26 145 49 -164 -194 163 -128 -105 -36 257 52 -111 -99 -56 -198 -184 251 -128 -108 94 -48 19 -187 117
3964 117 -44 -191 -87 106 48 -67 -133 -47 -161 -176 -273 4 30 -19 73 56 -85 -11 -39 241 30 43 5 217
3988 217 -94 -176 223 59 -54 100 21 -105 42 218 -109 -94 -11 -10 -85 -158 25 50 194 -137 -320 97 209
4011 209 -292 71 -255 1 128 -28 101 437 -39 -100 142 -101 206 16 21 -8 23 -79 -167 -311 -156 -453
4033 -453 -32 23 -38 -249 229 6 -143 248 -39 80 -321 34 -149 3 155 19 74 216 -50 311 -37
$$ packed form
3868B05o9l82J50k59L63qO4P7rr4q5K08o5M0j25K03k36r0J3L33j56J9q0Q2j55
3893e6J38P9k56J20%j1J22R3j59K4j71J17P9M2o4l03o8L28j88J47K32k53M5q0
3917d3K7J72J11k26K39m11kk2JL20j31K86j17k32j75L91l28J0K24l6M1O6Jj40
3941B6J19r6k13l0L57k91K3O9K93k05j63J2M3j42J4M35l79K0K02j42O7k06L04
3964A17j61j47J04J93n8j15o6Q6j14j5r7K77K6m9R2j7j41P4k8K80k11J3l8K12
3988B17l11q2L99j64j13J54p9j26J47J76l27J5Q3Jp5p3J83K5J44l31j83M17J12
4011B09n01L63l26K56J27j56J29L36m76o1K42k43L07j90Nk9L1j02q8j44J55k97
4033d53M21N5o1k11M78k23j49L91k87J19m01L55j83J52J52j36N5J42k66L61l48
$$ plain form
4054 -37 81 33 -45 139 -158 -88 -106 54 83 103 -72 -118 -144 25 37 156 151 114 45 -25 -76 -42 324 214 56 -36
4080 -36 -6 -45 28 225 110 18 -184 -96 -3 299 -97 -128 -100 -164 -161 17 94 -84 15 -59 -232 92 127 -180 -40
4105 -40 64 16 55 63 45 185 27 43 -95 -49 235 -193 140 -125 -33 150 22 218 39 11 -70 -96 -238 118
4129 118 -84 -200 1 -44 194 -236 16 29 -91 251 -85 134 2 167 -132 115 -113 1 -11 54 40 -123
4151 -123 24 105 175 7 -5 194 65 -2 -141 -90 -47 -165 -328 -312 -91 16 132 -148 452 -67 205 106 -253
4174 -253 119 91 37 -10 -200 147 -173 -144 105 57 -32 48 72 -100 -19 -91 24 70 -171 5 166 -65 -51 -155
4198 -155 38 16 83 79 94 9 -14 76 121 -22 -184 -46 91 136 98 -254 -128 -428 187 -32 21 130 -10 55
4222 55 221 229 -220 -16 -40 -88 -27 -173 -66 106 -208 112 -108 -4 209 -240 -204 -5 24 119 -123 116 26
$$ packed form
4054c7J18m8p8J84k97P0j8J60K9K0j75m6k6J69J2J19nl7o9p0n1L4L66j10j58r2
4080c6L0l9P3J97j15r2k02Q8R3L02l96l1K8o4LJ78P7j78R9p4j73L24L5l07J40
4105d0J04m8L9Qj8J40j58J6j38M6K84m28L33k65R2J83j28J96j79k8q1k6j42L56
4129A18k02j16K01m5K38m30K52J3j20L42l36K19j32J65k99K47k28J14j2O5j4j63
4151a23J47Q1P0j68j2J99j29o7j39N1M3j18j63J6K21J07J16k80O00n19K72r9l59
4174b53L72k8n4m7j90L47l20K9K49m8q9Q0K4j72Q1p2J15M6k41J76J61k31J4j04
4198a55J93k2O7mJ5q5k3R0M5j43j62J38J37M5l8l52J26l00O15k19N3J09j40O5
4222E5J66Qm49K04k4m8O1j46J07J72l14L20k20J04K13m49L6J99K9R5k42K39r0
$$ plain form
4245 26 -86 73 -43 -88 78 44 228 -117 -173 -195 -5 145 -32 -2 -156 -31 -6 37 -110 -90 23 39 -108
4268 -108 -15 71 335 37 175 21 -138 89 -130 109 -103 -272 174 -142 60 -383 -222 -112 222 12 -51
4289 -51 -142 -145 -266 141 -87 -145 119 -88 119 -130 216 -103 213 58 179 -117 -101 -78 156 75 143 -122 -15
4312 -15 44 38 -53 -193 -226 244 106 68 37 60 -151 -219 300 58 -128 81 -232 246 -275 -60 148 101 -146 255
4336 255 155 109 -153 45 -59 -70 184 29 -92 -132 59 0 39 242 80 -54 -75 -107 153 -45 -183 -6
4358 -6 -124 -51 87 -63 -55 103 -398 101 235 -232 -133 -99 -115 130 147 -101 -28 -136 282 -236 -365 -304 -230 83
4382 83 -252 -82 219 -37 184 -37 254 124 87 111 -144 -105 8 -202 -113 261 -105 39 105 23 8 135 88
4405 88 201 -50 119 248 16 -124 49 -6 -36 -82 87 34 -104 113 -162 -277 -18 -242 14 277 -237 -93
$$ packed form
4245B6j12J59j16m5J66l4J84l45n6k2J90J50j77L0j54J25K5M3j47K0J13J6j47
4268a08R3Q6K64k98J38j54j59K27k19K39k12j69M46l16K02m43J61J10L34k10o3
4289e1r1lj21M07k28n8K64k07K07k49L46l19L16j55J21k96J6K3K34q1O8k65J07
4312a5N9or1j40l3M70j38l8l1K3k11o8N19k42j86K09l13M78n21K15K08m7k47M01
4336B55j00m6k62J98j04j1K54j55j21m0J91n9L9K03j62j34k1l2K60j98j38J77
4358fj18P3J38j50QJ58n01M99J34m67R9L4j6K45J7k48P3j08M18n18j29O1P4L13
4382H3l35J70L01k56K21k21K91j30l7K4k55L9J13k10Q9L74l66J44O6q2j5J27m7
4405H8J13k51J69J29k32j40J73n5l0m6J69n3j38K17k75j15K59k24K56K63n14J44
$$ plain form
4427 -93 -63 79 73 -83 -146 -94 -144 -27 56 150 95 302 -9 62 -144 -29 -100 -17 -152 -192 -91 -299 -192 -95 196
4452 196 73 136 -96 174 -143 -54 32 162 28 52 -8 -70 -141 307 -181 129 76 -166 151 -77 -37 20 -110
4475 -110 -244 -169 -275 18 74 -164 -118 107 -143 -92 -23 -383 148 -56 159 -231 2 -201 -120 297 -222 104
4497 104 43 48 -90 166 40 154 28 -190 56 -118 -9 102 -121 62 98 -320 -5 356 7 34 6 -66
4519 -66 -167 -23 -254 22 -91 90 145 -135 383 -152 -64 185 -107 101 -135 7 18 -180 39 155 -22
4540 -22 242 181 354 -22 -175 17 277 -206 -13 -6 -181 -11 -149 -36 50 113 -90 -176 -102 150 61 115 134 23
4564 23 -2 -124 83 -48 32 43 -117 -256 129 148 122 75 22 -225 60 -106 -107 349 117 -45 171 -281 -31
4587 -31 -191 -157 35 -44 -281 48 36 139 -65 -149 -223 243 -5 -92 156 -33 113 -70 -60 -13 -102 -88 -164 -184
$$ packed form
4427i3L0J42oj56o3N2n0J17Q3R4n5K07l11P1k06J15p1Q3j35m0J01k08J07R7K91
4452A96j23O3k32K70l17Q9Q6J30j34K4o0o2p1M48m88L10n3k42L17k28M0N7j30
4475a10j34P5j06K93N6k38M6K25k50N1O9l60N31k04K15l90K33k03Q1M17n19L26
4497A04o1Nj38K56j26J14j26k18K46j74J09J11k23J83L6m18L15L61l49K7k8p2
4519f6j01J44k31K76j13J81N5k80N18n35Q8K49k92K08k36J42J1j98K19J16j77
4540b2K64o1J73l76j53J92K60m83J93Pj75J70j38J13Q6O3k03q6P4K52q9N4J9j11
4564B3k5j22K07j31Q0J1j60j39L85J9k6m7n3k47K85j66jM56k32j62K16m52K50
4587c1j60L4J92p9k37L29j2J03k04q4p4M66k48q7K48j89J46j83J0M7q9J4p6k0
$$ plain form
4611 -184 -28 -168 -91 -97 -90 -160 12 71 25 3 157 -132 114 -92 -113 -115 226 187 -9 71 27 271 48 -188 -108
4636 -108 -210 -123 277 93 -16 -78 -9 -165 14 130 80 34 151 187 -30 -112 -343 79 57 200 -99 -38 82
4659 82 -7 162 -3 133 -73 -47 -99 -126 138 -184 89 -70 -28 127 -14 31 88 53 122 -155 6 81 182 -187
4683 -187 -145 6 -13 35 165 136 135 269 249 125 -160 140 33 108 -69 -26 -77 6 -80 -40 -137 200 -150 -153 42
4708 42 167 -316 -90 -293 -115 -54 52 -142 -100 115 -168 -96 -75 84 23 201 -244 193 142 138 66 22 100 377
4732 377 -61 80 -30 50 200 220 -114 -19 -170 -151 90 184 -104 -101 -122 -35 -53 -123 -87 65 -42 93 211 7
4756 7 60 6 -176 -177 -52 -74 -40 74 98 167 161 74 -300 187 -89 -70 358 -17 83 183 30 -74 -26 -8 87 -263
4782 -263 -271 -57 64 -130 12 151 72 388 89 225 105 29 -39 46 43 155 119 -173 31 -50 -101 146 -93 2
$$ packed form
4611a84J56j40P7oPp0J72N9m6k2J54k89K46k06k1kL41l9j96Q0m4K44k23k36Q0
4636a08j02Q7M00j84j09o2O9j56J79J16n0m6J17L6k17q2k31M22k2J43k99O1J20
4659H2q9J69j65J36k06K6n2k7K64l22K73j59M2J55j41M5N7l5O9k77J61P5J01l69
4683a87M2J51j9M8J30k9jJ34k0j24k85L00j07P5j77M3n1Q3q6M0r7L37l50lJ95
4708D2J25m83K26k03J78O1J06j94M2K15k83P2K1J59o1J78m45M37n1mp2m4P8K77
4732C77m38J41j10Q0J50K0l34R5j51J9K41R4k88Lk1Q7j8p0L6J52j07J35J18k04
4756GN3n4j82jJ25k2L4J14K4O9oq7l74M87k76J9M28l75J00J00j53j04M8J8R5l50
4782b63qK14J21j94J42J39p9L16k99J36j20p6o8Q5lJ12l6k92K04q1n1K47k39R5
$$ plain form
4806 2 -270 26 48 -23 178 -112 -132 -41 121 53 194 -41 28 97 58 -9 -1 14 -164 -130 -56 150 102 220 110 -217
4832 -217 -60 -134 134 68 32 134 -12 34 -291 -26 155 139 -97 -218 -228 -482 148 -12 -113 -5 -29 15 140
4855 140 -55 175 -20 -83 -110 95 10 108 13 -212 -77 10 -6 -59 290 -106 83 -218 -200 -42 177 -31 175
4878 175 42 197 -30 -108 -86 -173 90 70 43 219 8 -9 25 13 -157 132 -12 247 -299 37 -60 -191 -17
4901 -17 -127 77 -202 206 -223 61 -30 135 -123 90 160 -16 70 -106 103 -41 -128 99 77 -202 130 -297
4923 -297 -37 27 -179 -194 10 29 0 190 -199 41 -66 95 -268 194 -69 -103 145 169 87 -141 -222 -115 -115
4946 -115 -150 98 -219 -6 5 -72 -288 67 127 76 179 -55 88 -3 96 -117 29 135 -11 45 145 -69 -116
4969 -116 2 2 277 -228 -17 -58 -37 -30 26 -62 49 -173 -91 -40 -87 -21 -37 -4 260 -18 103 59 8 155 -95
$$ packed form
4806Bk72K96K2p1K01k90k0R1J62o8J41k35O9O9l9o7QJ5j78L4P4K06m8J18j10l27
4832b17J57p4K68o6l6J02j46M6l25K65J81j6k36j21j0k54O30j60j01J08k4M4J25
4855A40j95K30j95o3k7K05q5R8r5k25J35Q7j6n3L49l96J89l01J8J58K19k08K06
4878A75j33J55k27p8K2q7K63k0k7J76k11j7L4j2j70K89j44K59n46L36r7j31J74
4901a7j10K04k79M08m29K84r1J65k58K13P0j76Q6j76K09j44q7K27k2k79L32m27
4923b97K60O4k06j5K04J9k9J90l89K40j07J61l63M62k63l4K48K4q2k28q1J07%
4946a15l5K48l17K13J1p7k16L55O0n1J03k34J43r1R9k13J46J06j46N6J00k14m7
4969a16J18%K75n05K11m1K1PN6q8J11k22Q2N1m7O6j6L3K64k78J21m4n1J47k50
$$ plain form
4994 -95 -123 -81 220 -49 10 17 -66 18 -207 86 -59 -146 21 -214 -116 124 -84 -105 12 136 80 -42 -70 184
5018 184 208 202 63 194 2 -57 101 -198 0 86 162 -243 -210 -23 101 -144 161 74 31 134 -7 -115 -72
5041 -72 70 -64 25 223 108 174 -268 -103 175 -104 -45 284 -150 -64 61 137 60 15 -229 -49 165 1 -201
5064 -201 -274 53 108 -28 189 -68 -116 -62 39 -75 38 194 -167 -94 -11 67 117 18 -117 124 100 -13 -295
5087 -295 3 -103 79 -117 -41 158 244 -4 -122 -22 51 114 -35 -16 -162 -79 150 -15 -134 -29 154 113
5109 113 -3 130 1 -90 -48 -206 -160 -90 166 113 102 132 -159 -43 92 95 -94 149 -152 -20 -246 96 243
5132 243 66 88 -127 139 -70 85 23 67 -60 108 179 205 -65 115 55 63 -68 176 126 -142 22 -28 -45 83
5156 83 -120 63 45 -107 -126 -114 -260 -125 -93 159 -122 1 12 -108 66 8 -40 -148 -99 8 -79 -101 -66 172
$$ packed form
4994i5k8M2L01k69N9Pq3Q4k25K93j45q7J67k35R8K40k08k1J17J24n6j22k8K54
5018A84K4oj39J31j92n9J58k99J98Q6P6m05L3J87J24k45L05q7m3J03j41j08M3
5041g2J42j34Q9J98j15O6m42J65K78k79N9L29m34Q6J25P6p7m5k44J80K14j64k02
5064b01p3L27N5j36K17k57m8N4J01j14J13J56l61P3Q3P8N0r9j35K41k4j13k82
5087b95K98j06J82j96P6J99Q6k48j18J00P3O3j49J9j46Q3K29j65j19J05J83m1
5109A13j16J33j29r1M2j58M6P0K56n3j1L0k91J16J35Lj89K43l01J32k26L42J47
5132B43j77K2k15K66k09J55o2M4j27J68P1K6k70J80o0Qj31K44n0k68J64n0j7J28
5156H3k03J83j8j52j9J2j46J35L2K52k81J23J1j20J74n8m8j08M9J07q7k2L5K38
$$ plain form
5180 172 22 -6 -91 -63 389 -66 13 63 -107 -123 -211 -24 173 -139 -354 -12 -14 -216 46 -59 159 -168 1
5203 1 -67 -176 221 15 13 -63 80 73 251 -152 234 276 144 -88 -160 -139 7 -49 -11 -13 18 -70 224 163 -212 67
5229 67 331 -340 8 65 -110 110 224 38 -76 51 -89 132 -69 -223 -400 108 77 31 -61 36 -64 68
5251 68 -53 -17 -78 -84 -309 -19 -116 -83 149 68 -119 -156 6 -95 194 -44 -150 66 -99 -279 -28 -267 -79
5274 -79 14 -152 147 -156 83 -35 61 30 23 -128 217 81 34 93 31 216 -92 44 49 -320 10 -81 145 208
5298 208 4 -79 -121 -11 133 -105 30 -91 67 -33 22 162 82 -41 90 246 108 -33 219 -101 63
5319 63 -223 -95 -7 -151 91 41 19 -169 -98 -47 -24 -28 17 -29 -290 -37 -108 -2 192 315 -29 -43 -3 -121 92
5344 92 95 27 -86 -89 -43 -127 -68 7 -40 -149 51 3 -130 160 -41 21 -26 118 8 154 165 53 -69 94 -141
$$ packed form
5180A72j50k8q5K8M52m55P9N0j70j6q8J87J97l12k15L42kk02K62j05K18l27J69
5203Ao8j09L97k06kp6J43pJ78m03L86M2j32k32p2K1J46n6L8kL1q8K94o1l75K79
5229F7K64o71L48N7j75K20J14j86j14J27j40K21k01j54j77N08l1m6r2R7j00J32
5251F8j21L6o1ok25K90r7L3K32q1j87l7J62j01K89k38j06K16j65j80K51k39J88
5274g9R3j66K99l03K39j18R6l1pj51L45j36m7N9o2J85l08J36Nl69L30r1K26O3
5298B08k04q3m2J10J44k38J35j21J58j00N5J40q0j23J31J56j38j41K52l20J64
5319F3k86J28Q8j44K42n0k2j88P1N1K3mM5m6k61K53p1J06J94J23l44j4M0j18K13
5344I2Lo8j13lM6q4N9P5m7j09K00m8j33K90k01O2m7J44j10J46J1j12j22J63k35
$$ plain form
5369 -141 -35 -71 -71 313 94 -15 103 40 -132 71 -108 100 10 65 134 -129 -125 -30 -114 -78 -113 61 60 -39 -121 -110
5395 -110 52 -150 205 39 -92 21 76 142 151 -115 113 66 4 -303 -149 -187 -110 -107 -163 43 -212 193 -95 3
5419 3 -125 76 -17 32 78 196 18 100 113 108 35 -69 -30 226 -192 -242 197 39 99 -260 -203 -6 -191 131 31
5444 31 -173 -76 -185 -89 87 -14 62 -42 -91 -109 103 -163 30 46 317 117 -261 174 -145 46 216 26
5466 26 295 37 86 208 31 -175 -217 -117 -26 376 146 167 -15 -65 -158 -139 -16 267 47 129 53 66 -245 42
5490 42 27 -214 -104 -39 -158 167 32 -206 15 6 -32 142 36 182 153 105 368 -10 -223 -19 133 254 -91
5513 -91 35 96 -136 148 -77 156 -102 -84 -9 -148 23 12 -212 108 -45 59 -218 -109 -72 94 53 1 128
5536 128 -44 160 -52 123 -163 18 -65 126 176 -130 -98 -49 -180 -35 -102 -99 76 2 -315 -89 -114 -2 -328
$$ packed form
5369a41J06l6%L84k19j09J18o3j72K03j79K08r0N5O9k63MR5q4L6l5J74jr9q2J1
5395a10J62k02L55j66j31J13N5O6Rk66K28m7o2l07J54l8P7Ln6K06k55M05k88R8
5419Cj28K01r3M9M6J18j78Q2J3np3j04L9K56m18n0M39j58O0l59N7J97j85L22j00
5444C1k04R7j09R6J76j01P6j04m9j8K12k66J93J6K71k00l78M35l19J91J70j90
5466B6K69k58M9J22j77k06m2J00R1M02k30K1j82n0r3J9J23K83k20Q2p6J3l11K87
5490D2j5k41J10O5j19L25j35k38K21rl8J74j06J46k9m8K63l78k13K04J52J21l45
5513i1J26O1k32K84k25K33k58J8P5j39J71j1k24L20j53J04k77J09L7J66m1n2J27
5536A28j72K04k12J75k86J81q3J91N0l06L2M9j31J45o7LJ75p4l17K26k5J12l26
$$ plain form
5559 -328 48 -128 -28 -68 -95 18 138 -38 -27 -117 138 -69 -4 -20 -244 400 13 17 -106 -16 20 6 77 49
5583 49 7 -5 -212 -3 77 164 82 38 -210 -84 219 -2 239 131 140 -137 -119 -72 192 123 46 61 79 -51 137
5608 137 -13 14 211 -13 129 136 -73 248 -38 -169 32 -94 43 68 -218 -69 -188 -64 19 -27 72 132 -83
5631 -83 270 -105 11 30 -128 338 -8 -98 139 204 -37 211 -124 -109 95 -75 187 99 80 53 113 -41 101
5654 101 -253 -16 -140 -89 -31 -121 68 -115 -232 -90 166 145 -72 -2 0 42 -132 -87 112 75 265 44 102 62
5678 62 189 -16 113 90 -323 -66 -227 23 -36 -186 118 -58 29 -121 -262 225 80 -199 170 -5 51 -33
5700 -33 -228 109 71 158 6 42 -30 14 -71 -76 242 187 -97 41 -15 81 -35 -141 -41 -34 273 36 -176 181 108
5725 108 -141 157 -68 -102 224 123 -192 304 -81 223 -37 -42 113 -78 -141 117 108 -192 72 -59 204 -101
$$ packed form
5559c28L76j76J00m0k7J13J20j76J1r0K55k07O5j6k24O44l87Mj23R0L6j4P1k8
5583D9m2j2k07K09Q0Q7q2m4k48J26L03k21K41j08Rk77J8M7K64o9p7J5J8j30J88
5608A37j50K7J97k24J42Pk09L21k86j31K01j26J37K5k86J49j19J24Q3m6R9O0k15
5631h3L53l75J16J9j58M66l46r0K37O5k41K48l35J5K04j70K62q8j9k7O0j54J42
5654A01l54K37j24N1N8r0J89j83j17J42K56k1k17P0KM2j74M5J99l7J90k21N8m0
5678F2J27k05J29k3m13K57j61K50n9j50L04j76Q7j50j41M87j45k79L69j75N6q4
5700c3j95L37l8Q7j52L6p2M4q5nL18n5k84J38n6R6j16j06J00PL07k37k12L57p3
5725A08k49K98k25l4L26j01l15M96l85L04k60nJ55j91o3K58rl00K64j31K63l05
$$ plain form
5747 -101 13 -102 4 209 13 -137 -56 -97 -21 104 64 285 -106 -20 -98 -164 -16 -5 -13 -95 315 9 51 -102
5771 -102 6 -42 -85 126 -262 76 160 54 32 49 -41 42 131 -60 -24 -122 -116 -73 -85 -166 8 -220 162 138 108 193
5797 193 -198 -57 166 269 62 21 -12 -126 -68 70 111 110 -111 185 -47 71 -161 243 141 -69 -54 -47 -36
5820 -36 -66 47 -46 -96 -132 -15 115 -185 -48 -3 -194 -86 -4 59 27 -37 -147 230 -122 26 218 -112 134
$$ packed form
5747a01J14j15J06K05j96j50Q1m1P6J25m0K21l91Q6p8o6J48J1qq2M10l06M2j53
5771a02J08m8m3K11l88L38Q4j06k2J7r0Q3Q9j91L6r8OM3j2q1J74k28L82k4l0Q5
5797A93l91J41K23J03k07m1l3j14N8J38M1jk21K96k32J18k32M04j02k10J5PJ1
5820c6l0J13r3n0l6J17J30l00J37M5j91J08Q2O3l2o4j10L77l52J48J92l30K46
$$ [...]
8191c7
##END NTUPLES=NMR FID
##END=
