##TITLE=1H_Pr 2945
 CDCl3
 8 sc, 
 9.2.2023
##JCAMPDX= 6.0         $$ Bruker NMR JCAMP-DX V2.0
##DATA TYPE= NMR FID
##DATA CLASS= NTUPLES
##ORIGIN= UXNMR, Bruker Analytische Messtechnik GmbH
##OWNER= root
$$ XWIN-NMR		Version 3.5
$$ Thu Feb  9 17:10:38 2023 Russian Standard Time (UT+4h)  she@DPX200
##.OBSERVE FREQUENCY= 200.13135
##.OBSERVE NUCLEUS= ^1H
##.DELAY= (6, 6)
##.ACQUISITION MODE= SIMULTANEOUS
##.ACQUISITION SCHEME= undefined
##.AVERAGES= 8
##.DIGITISER RES= 18
##SPECTROMETER/DATA SYSTEM= spect
##.PULSE SEQUENCE= zg30
##.SOLVENT NAME= DMSO
##.SHIFT REFERENCE= (INTERNAL, DMSO, 0, 15.7039)
##AUDIT TRAIL= $$ (NUMBER, WHEN, WHO, WHERE, WHAT)
$$ ##TITLE= Audit trail, XWIN-NMR		Version 3.5
$$ ##JCAMPDX= 5.01
$$ ##ORIGIN= Bruker BioSpin GmbH
$$ ##OWNER= she
$$ F:/spectra/data/she/nmr/H-F/1/audita.txt
$$ ##AUDIT TRAIL=  $$ (NUMBER, WHEN, WHO, WHERE, WHAT)
(   1,<2023-02-09 17:09:41.03 +0400>,<she>,<DPX200>,
      <created by zg, POWCHK disabled, PULCHK disabled
       configuration hash MD5:
       00 E9 B6 7A A2 85 ED C7 34 08 36 98 17 FE 4E 26
       data hash MD5: 16K
       71 B9 CC E3 67 3D 62 15 46 F3 D1 0E F7 5D 01 FC>)
$$ ##END=
$$ 
$$ hash MD5
$$ 0C 8C 5F 15 DB A3 C9 23 DF 31 4C 5D 2C C8 D1 92
##$RELAX= 
##$RELAX= 
##$RELAX= 
##$RELAX= 
##$RELAX= 
##$RELAX= 
$$ Bruker specific parameters
$$ --------------------------
##$DU= <F:/spectra>
##$EXPNO= 1
##$NAME= <H-F>
##$PROCNO= 1
##$TYPE= <nmr>
##$USER= <she>
##$AMP= (0..31)
100 100 100 100 100 100 100 100 100 100 100 100 100 100 100 100 100 100 
100 100 100 100 100 100 100 100 100 100 100 100 100 100 
##$AQSEQ= 0
##$AQ_mod= 1
##$AUNM= <au_zg>
##$AUTOPOS= <>
##$BF1= 200.13
##$BF2= 200.13
##$BF3= 200.13
##$BF4= 200.13
##$BF5= 200.13
##$BF6= 200.13
##$BF7= 200.13
##$BF8= 200.13
##$BYTORDA= 1
##$CFDGTYP= 0
##$CFRGTYP= 5
##$CHEMSTR= <none>
##$CNST= (0..31)
1 1 145 1 1 1 1 1 1 1 1 1 1 1 1 1 1 1 1 1 1 1 1 1 1 1 1 1 1 1 1 1 
##$CPDPRG= <>
##$CPDPRG1= <>
##$CPDPRG2= <>
##$CPDPRG3= <>
##$CPDPRG4= <mlev>
##$CPDPRG5= <mlev>
##$CPDPRG6= <mlev>
##$CPDPRG7= <mlev>
##$CPDPRG8= <mlev>
##$CPDPRGB= <>
##$CPDPRGT= <>
##$D= (0..31)
0 1.2 0 0 0 0 0 0 0 0.06 0 0.03 0 0 0 0 0.0002 0 0 0 0 0 0 0 0 0 0 0 0 
0 0 0 
##$DATE= 1675948180
##$DBL= (0..7)
120 120 120 120 120 120 120 120 
##$DBP= (0..7)
150 150 150 150 150 150 150 150 
##$DBP07= 0
##$DBPNAM0= <>
##$DBPNAM1= <>
##$DBPNAM2= <>
##$DBPNAM3= <>
##$DBPNAM4= <>
##$DBPNAM5= <>
##$DBPNAM6= <>
##$DBPNAM7= <>
##$DBPOAL= (0..7)
0.5 0.5 0.5 0.5 0.5 0.5 0.5 0.5 
##$DBPOFFS= (0..7)
0 0 0 0 0 0 0 0 
##$DE= 6
##$DECBNUC= <off>
##$DECIM= 32
##$DECNUC= <off>
##$DECSTAT= 4
##$DIGMOD= 1
##$DIGTYP= 9
##$DL= (0..7)
0 120 120 120 120 120 120 120 
##$DP= (0..7)
150 150 150 150 150 150 150 150 
##$DP07= 0
##$DPNAME0= <>
##$DPNAME1= <>
##$DPNAME2= <>
##$DPNAME3= <>
##$DPNAME4= <>
##$DPNAME5= <>
##$DPNAME6= <>
##$DPNAME7= <>
##$DPOAL= (0..7)
0.5 0.5 0.5 0.5 0.5 0.5 0.5 0.5 
##$DPOFFS= (0..7)
0 0 0 0 0 0 0 0 
##$DQDMODE= 0
##$DR= 18
##$DS= 0
##$DSLIST= <SSSSSSSSSSSSSSS>
$$ [...]
##$SUBNAM2= <"">
##$SUBNAM3= <"">
##$SUBNAM4= <"">
##$SUBNAM5= <"">
##$SUBNAM6= <"">
##$SUBNAM7= <"">
##$SUBNAM8= <"">
##$SUBNAM9= <"">
##$SW= 18.05172834244
##$SWIBOX= (0..15)
0 0 2 0 0 0 0 0 0 0 0 0 0 0 0 0 
##$SW_h= 3612.71676300578
##$TD= 16384
##$TD0= 1
##$TE= 0
##$TE2= 300
##$TE3= 300
##$TEG= 300
##$TL= (0..7)
0 120 120 120 120 120 120 120 
##$TP= (0..7)
150 150 150 150 150 150 150 150 
##$TP07= 0
##$TPNAME0= <>
##$TPNAME1= <>
##$TPNAME2= <>
##$TPNAME3= <>
##$TPNAME4= <>
##$TPNAME5= <>
##$TPNAME6= <>
##$TPNAME7= <>
##$TPOAL= (0..7)
0.5 0.5 0.5 0.5 0.5 0.5 0.5 0.5 
##$TPOFFS= (0..7)
0 0 0 0 0 0 0 0 
##$TUNHIN= 0
##$TUNHOUT= 0
##$TUNXOUT= 0
##$USERA1= <user>
##$USERA2= <user>
##$USERA3= <user>
##$USERA4= <user>
##$USERA5= <user>
##$V9= 5
##$VALIST= <valist>
##$VCLIST= <CCCCCCCCCCCCCCC>
##$VD= 0
##$VDLIST= <DDDDDDDDDDDDDDD>
##$VPLIST= <PPPPPPPPPPPPPPP>
##$VTLIST= <TTTTTTTTTTTTTTT>
##$WBST= 1024
##$WBSW= 4
##$XGAIN= (0..3)
0 0 0 0 
##$XL= 0
##$YL= 0
##$YMAX_a= 74281
##$YMIN_a= -74006
##$ZGOPTNS= <>
##$ZL1= 120
##$ZL2= 120
##$ZL3= 120
##$ZL4= 120
##$ABSF1= 10
##$ABSF2= 0
##$ABSG= 5
##$ABSL= 3
##$ALPHA= 0
##$AQORDER= 0
##$ASSFAC= 0
##$ASSFACI= 0
##$ASSFACX= 0
##$ASSWID= 0
##$AUNMP= <proc_1d>
##$AZFE= 0.1
##$AZFW= 0.1
##$BCFW= 1
##$BC_mod= 2
##$BYTORDP= 1
##$COROFFS= 0
##$CY= 11.3945322036743
##$DATMOD= 1
##$DC= 2
##$DFILT= <>
##$DTYPP= 0
##$F1P= 2.36226072786647
##$F2P= -0.459571619588291
##$FCOR= 0.5
##$FTSIZE= 0
##$FT_mod= 4
##$GAMMA= 1
##$GB= 0.15
##$INTBC= 1
##$INTSCL= 1
##$ISEN= 128
##$LB= 0.24
##$LEV0= 0
##$LPBIN= 0
##$MAXI= 10000
##$MC2= 0
##$MEAN= 0
##$ME_mod= 0
##$MI= 1.114404
##$NCOEF= 0
##$NC_proc= 0
##$NLEV= 6
##$NOISF1= 3.799351
##$NOISF2= 2.8
##$NSP= 1
##$NTH_PI= 0
##$NZP= 0
##$OFFSET= 15.70392
##$PC= 1
##$PHC0= -19112.21
##$PHC1= 11.60078
##$PH_mod= 1
##$PKNL= yes
##$PPARMOD= 0
##$PSCAL= 0
##$PSIGN= 0
##$REVERSE= no
##$SF= 200.130013532006
##$SI= 16384
##$SIGF1= 3
##$SIGF2= 2
##$SINO= 400
##$SIOLD= 16384
##$SREGLST= <1H.CDCl3>
##$SSB= 0
##$STSI= 0
##$STSR= 0
##$SW_p= 3612.71676300578
##$SYMM= 0
##$S_DEV= 0
##$TDeff= 0
##$TDoff= 0
##$TI= <>
##$TILT= no
##$TM1= 0
##$TM2= 0
##$TOPLEV= 0
##$USERP1= <user>
##$USERP2= <user>
##$USERP3= <user>
##$USERP4= <user>
##$USERP5= <user>
##$WDW= 1
##$XDIM= 8192
##$YMAX_p= 0
##$YMIN_p= 0
$$ End of Bruker specific parameters
$$ ---------------------------------
##NTUPLES= NMR FID
##VAR_NAME=  TIME,          FID/REAL,        FID/IMAG
##SYMBOL=    X,             R,               I
##VAR_TYPE=  INDEPENDENT,   DEPENDENT,       DEPENDENT
##VAR_FORM=  AFFN,          ASDF,            ASDF
##VAR_DIM=   8192,          8192,            8192
##UNITS=     SECONDS,       ARBITRARY UNITS, ARBITRARY UNITS
##FACTOR=    0.0002768,     1,               1
##FIRST=     0,             0,               0
##LAST=      2.2672688,     0,               0
##MIN=       0,             -74006,          0
##MAX=       2.2672688,     74281,           0
$$ Real data points
##PAGE= N=1
##DATA TABLE= (X++(R..R)), XYDATA
0@%%%%%%%%%%%%%%%Oj4J6j6J6j6K4l2L2m0M8n6O4p2Q7r8J08j22J40j62J84k06
$$ 0 0 0 0 0 0 0 0 0 0 0 0 0 0 0 0 6 -8 8 -8 8 -8 16 -16 16 -24 24 -32 32 -40 47 -51 57 -65 75 -87 97 -109
37a09K30k58K89l21L56l95M39m86N38n94O54p21P95q76R66j063J171j296J434
$$ -109 121 -137 152 -169 187 -208 231 -255 283 -311 343 -378 417 -459 507 -556 615 -681 753
56G53j587J763j970K211k495K841l272L823m559N599p198R996j6361O1081J0879
$$ 753 -834 929 -1041 1170 -1325 1516 -1756 2067 -2492 3107 -4091 5905 -10456 50625 61504
71F1504l4528L6088k3292k7162j1428L3498k727l5869J2501K3496m0480k6958
$$ 61504 26976 63064 39772 12610 1182 34680 31953 -3916 8585 32081 -8399 -35357
83c5357j893L208j9299k0665L1325K9065j8294J5228L0792L386j3917r411J9669
$$ -35357 -37250 -34042 -53341 -74006 -42681 -13616 -31910 -16682 14110 17496 3579 -5832 13837
96A3837L055k8577J8123K8304o229m681O246J1422j6665l8609N617J913l3440
$$ 13837 16892 -11685 6438 34742 28513 23832 30078 41500 24835 -13774 -8157 -6244 -39684
109c9684o491J6494J0827p159p815K8005L941l3775P201J8091j0108o263J3945
$$ -39684 -46175 -29681 -18854 -26013 -33828 -5823 -1882 -35657 -28456 -10365 -20473 -26736 -12791
122a2791L1898K536j2458K9317J1597k7587o352M963l297j7179r461K4637N56
$$ -12791 19107 21643 9185 38502 50099 22512 16160 21123 17826 647 -8814 15823 16379
135A6379k0186J2906O993j4347j4048o195Q826j0255j2793K3183J1450n274R205
$$ 16379 -3807 9099 16092 1745 -12303 -18498 -9672 -19927 -32720 -9537 1913 -3361 5844
148E844Q543O302r803j1960J3267m442j4169R666P231K664l344l506J0308j1295
$$ 5844 14387 20689 10886 -1074 12193 7751 -6418 3248 10479 13143 9799 6293 16601 5306
162E306k0076N017l263r754p04M240J4180k681l435J7907k323j1294M430R03J887
$$ 5306 -14770 -9753 -13016 -22770 -23474 -19234 -5054 -7735 -11170 6737 4414 -6880 -2450 -1547 340
177C40k949K178J8031k883m068J2389m656p983n158o565J385r088m204J1155m666
$$ 340 -2609 -431 17600 14717 10649 23038 18382 10399 5241 -1324 61 -9027 -13231 -2076 -6742
192f742q84N608m573J085m547m781O273m451K625J0225l80Q396N036k905N569
$$ -6742 -7626 -2018 -6591 -5506 -10053 -14834 -8561 -13012 -10387 -162 -542 7854 12890 9985 15554
207A5554m156l474J731p334K981O65o276O740j592n738N55p577j554l143q061
$$ 15554 11398 7924 9655 2321 5302 5967 -309 6431 4839 -899 -344 -7921 -9475 -12618 -20679
222b0679O069M23k713Q557J392M105K842m300P685P54n602Q190K298J747L064
$$ -20679 -14610 -14187 -16900 -8343 -6951 -2846 -4 -4304 3381 4135 -1467 6723 9021 10768 13832
237A3832j980P413k496j0585N849k796q878j049j921L863m814p491J1183k432
$$ 13832 11852 19265 16769 6184 12033 9237 359 -690 -2611 1252 -3562 -11053 130 -2302
251b302j0651M546K149k87l756K75J4277k816o548J3922K534o096m87K812N945
$$ -2302 -12953 -8407 -6258 -6545 -10301 -10026 4251 1435 -5113 8809 11343 5247 4760 7572 13517
266A3517r233n036J4366m544j0834M750J598l291j0485j927J0539r405q758J2303
$$ 13517 4284 -752 13614 9070 -1764 2986 4584 1293 -9192 -11119 -580 -9985 -18743 -6440
280f440K045m953j792N035Q660j0662k777J6290k081p120O010Q108K640j0421
$$ -6440 -4395 -9348 -11140 -6105 2555 -8107 -10884 5406 3325 -3795 2215 10323 12963 2542
294B542Q05J3433j1759j0402R320J998o485o745O024R432j5132n526J4515m970
$$ 2542 3347 16780 5021 -5381 3939 5937 -548 -7293 -1269 8163 -6969 -12495 2020 -2950
308b950j0796J776R165L727j2049O403J7709j0106p079J0856L744o714p909Q999
$$ -2950 -13746 -11970 -2805 922 -11127 -4724 12985 2879 -4200 6656 10400 3686 -4223 4776
322D776R784j4662m72J4727m697r803j612O339j560j6647L898J3831j0045m695
$$ 4776 14560 -102 -574 14153 9456 -347 -1959 4380 2820 -13827 -9929 3902 -6143 -10838
336a0838R582O004m307r679Q886Q156j5613lJ4278l0n338Q15J1910K015j6739
$$ -10838 -1256 4748 441 -9238 -352 7804 -7809 -7812 6466 6436 1098 1913 13823 15838 -901
351i01L525J0464j2417p969N491O776l983j0269J1098P699j6058k837Q990k795
$$ -901 2624 13088 671 -7298 -1807 4969 986 -9283 1815 9514 -6544 -9381 -391 -3186
365c186q686k607J2929L667j2645Q970J2474q711n427L072N381n546j1202J1372
$$ -3186 -11872 -14479 -1550 2117 -10528 -1558 10916 2205 -3222 -150 5231 -315 -11517 -145
379a45P647j1202J849R009l38p537o232Q459j754j4749O739R197m155j530M251
$$ -145 7502 -3700 -1851 7158 6820 -717 -6949 1510 -244 -14993 -8254 943 -3212 -4742 -491
394d91Q865l783j0656R057L190j1053N57P375L741l413k326J1972j070j2561L187
$$ -491 8374 4591 -6065 2992 6182 -4871 -4314 3061 6802 3389 1063 13035 11965 -596 2591
409B591L081o882n200N88Q710k036p253J0805L148r090j140J972J040n817l737
$$ 2591 5672 -1210 -6410 -5822 2888 852 -6401 4404 7552 -1538 -2678 -706 334 -5483 -9220
424i220J1873J329o043P657L931k180m576k681M784o513p489Q090J377m140K191
$$ -9220 2653 3982 -2061 5596 9527 7347 2771 90 4874 -1639 -9128 -1038 339 -3801 -1610
439a610J847K364n755n887N730m269n803M914K762K606R52J892P927k811m505
$$ -1610 237 2601 -3154 -9041 -3311 -7580 -13383 -8469 -5707 -3101 -2149 -257 7670 4859 354
454C54M972k148k256M36Q60N816j776j022O290l519m638n21m378j409l915k244
$$ 354 5326 3178 922 1358 2218 8034 6258 5236 11526 8007 3369 2848 -1530 -2939 -6854 -9098
470i098N806j831l49N085j690K44q57l025L076k782J37N794P9L935L798j021K808
$$ -9098 -3292 -5123 -5472 -387 -2077 -1833 -2690 -5715 -2639 -5421 -5284 510 589 4524 8322 7301 10109
487A0109k092l478N49m807m82J458l706L572N53k895J982l922j697j627n465L158
$$ 10109 8017 4539 5088 281 -201 1257 -2449 1123 1676 -1219 763 -3159 -4856 -6483 -11948 -8790
503h790M63k354N713K814J353K870r27L609j308m506N146l5j707L782J299K834
$$ -8790 -8327 -10681 -4968 -2154 -801 2069 1142 4751 3443 -1063 4083 4048 2341 6123 7422 10256
519A0256q58l937L907l916p079J523j612j362j049n72O214k295m643N932j237
$$ 10256 9398 5461 9368 5452 -1627 -104 -1716 -3078 -4127 -4699 1515 -780 -5423 509 -728
534g28m423k60P32L532k374q71R357m9l967L849O38j423n084j668O246m759m542
$$ -728 -5151 -5411 -4679 -1147 -3521 -4392 4965 4916 949 4798 5436 4013 -1071 -2739 3507 -1252 -5794
551e794P595P13l444j165R78K988p719l755Q351k495m384M664M390J307m162J103
$$ -5794 1801 2514 -930 -2095 -1117 1871 -5848 -9603 -1252 -3747 -8131 -3467 923 2230 -1932 -829
567h29P483o204n151O229O55k658k092M612N822p401j853Q238m154o341J052L786
$$ -829 6654 450 -4701 1528 2183 -475 -2567 2045 7867 466 -1387 6851 2697 -3644 -2592 1194
583A194K38o467K736R611n734l447O072J184l428m433M162N074q223o60R003k028
$$ 1194 1432 -5035 -2299 7312 1578 -1869 4203 5387 1959 -2474 1688 6762 -1461 -2121 6882 4854
599D854n091M19L835n45r652J911P205p403l436N808K532k533m654N578M854r456
$$ 4854 -237 182 4017 3472 -6180 -4269 2936 -4467 -7903 -2095 437 -2096 -6750 -1172 3682 -5774
615e774j73Q066j580l923J245O803J500q556M042P184o854m128L667K607l486
$$ -5774 -5947 2119 539 -3384 -2139 4664 6164 -2392 1650 8834 1980 -2148 1519 4126 640
630F40o331O320M302r325l5O324k163m781j498O257M50p920M825P059n062j762
$$ 640 -5691 629 4931 -4394 -4429 1895 -268 -5049 -6547 -290 160 -7760 -2935 4124 -938 -2700
646b700L775M284k326n952O994M145q576P32N448n27m205k276O226n83r355L515
$$ -2700 1075 5359 3033 -2919 4075 8220 -356 376 5824 5297 1092 -1184 5042 4459 -4896 -1381
662a381M499n126k638Q86M305k793n656O778K835o836J199M160R56k930j795P184
$$ -1381 3118 -2008 -4646 -3760 545 -2248 -7904 -1126 1709 -5127 -3928 232 1188 -1742 -3537 3647
678C647J37o913M755L957l274j913P70M690l287n628N975J177o102M37K019J089
$$ 3647 3784 -3129 1626 5583 2309 396 1166 5856 2569 -3059 2916 4093 -2009 -1572 447 1536
694A536l069k610O086j221n632L254K458j896j389K70M484j630l991N695Q60l308
$$ 1536 -1533 -4143 1943 722 -4910 -1656 802 -1094 -2483 -2213 2271 641 -3350 2345 3205 -103
710a03J85Q69J820k694k360N443j223l779L110N08p35j801j308L619k763k796
$$ -103 82 951 2771 77 -2283 3160 1937 -1842 1268 1776 1041 -760 -2068 1551 -1212 -4008
726d008L998k16j722R95Q5K305k276j925M098k152j921K316l93J345l94p28M080
$$ -4008 -10 -226 -1948 -953 -868 1437 -839 -2764 1334 -818 -2739 -423 -816 529 135 -593 3487
743C487k690j556K244j496m21K15q12K760j576n97L077j820m75N22k020J568j339
$$ 3487 797 -759 1485 -11 -432 -217 -1029 1731 155 -442 2635 815 340 862 -1158 410 -929
760i29j215K761j441N79J789k002J410n61j808J534j622q4J845j429K281M07j730
$$ -929 -2144 617 -824 -245 1544 -458 952 391 -1417 117 -1505 -1589 256 -1173 1108 1515 -215
777b15K389j256j034Q48k250J477J78k000L255M5j620J691q04J37p97k609K859
$$ -215 2174 918 -116 732 -1518 -41 137 -1863 1392 1437 -183 1508 704 841 44 -2565 294
794B94q36k313L262M52j02J78j034K669k246l266L620m81k024J481L87K238j637
$$ 294 -542 -2855 407 859 757 935 -99 2570 324 -2942 678 197 -1827 -346 41 2279 642
811F42j577L959k061l751K242J72l47j156n6M543k511k163L914n27k433r23P32
$$ 642 -935 3024 963 -2788 -546 -374 -721 -1877 -1933 2610 99 -2064 1850 1323 -1110 -2033 -1301
828a301K169l375o01N875j755k541K485N67n00l441J93M466l771k131N275K49
$$ -1301 868 -2507 -3108 2767 1012 -1529 956 1523 1023 -2418 -2225 2241 -1530 -3661 1614 1863
844A863j401q57J601K385m893j495N349k378k689K494J956P40l418R84M643n080
$$ 1863 462 -395 1206 3591 -1302 -2797 2552 174 -2515 -21 1935 2675 -743 241 4884 -196
860a96k775M054j31j917j518K915L371m838j46N268l221k988N38K088L23m402
$$ -196 -2971 1083 952 -965 -2483 432 3803 -1035 -1181 4087 866 -2122 -1584 504 827 -3575
876c575K417N371m360j229L394J42k158l236K974K325n671O64N247j523k379L57
$$ -3575 -1158 4213 -147 -1376 2018 2160 2 -3234 -260 2065 -3606 -2942 2305 782 -1597 -1240
892a240K597O6n708K054L763m280j169L783J821j212k698M030K460o191M66M141
$$ -1240 1357 1423 -4285 -2231 1532 -2748 -3917 -134 1687 475 -2223 1807 4267 -1924 -1458 2683
908B683j765j515j43M007L77n272K930L596m882k188J896J377j854l713M920K028
$$ 2683 918 -597 -740 3267 3644 -1628 1302 4898 16 -2172 -276 1101 -753 -4466 454 2482
924B482n364J190L264j020k335j026M027k28m895L876L481k720o82J653K100j785
$$ 2482 -2882 -1692 1572 552 -1783 -2809 1218 990 -3905 -29 3452 732 50 1703 3803 2018
940B018l978L895P64m516Q90K440J13k249j327L578q66n365K668J666k661o38
$$ 2018 -1960 1935 2699 -1817 -927 1513 1626 -623 -1950 1628 762 -4603 -1935 -269 -2930 -3568
956c568J160L134j334k717M494R35l676J068J512P52j302j269M646p78l120K435
$$ -3568 -2408 726 -608 -3325 1169 2104 -1572 -504 1008 1760 458 -811 3835 3057 -63 2372
972B372J085k003j539m11K673k293l109L716J56k167K74O47R89k201j470L942
$$ 2372 3457 1454 -85 -496 2177 -116 -3225 491 647 -1520 -1246 -599 390 -1811 -3281 661
988F61j150k757K949Q90j37k93o2L045j749k318K825n42j479L77j74J565j702
$$ 661 -489 -3246 -297 593 456 163 101 3146 1397 -921 1904 1362 -117 260 86 1651 -51
1005e1j295L060j378k226J345o70K79r42m91K705j243r46K438p00m7J82m25J913
$$ -51 -1346 1714 336 -1890 -545 -1215 -936 -1878 -2369 336 -907 -1853 585 -115 -162 20 -405 1508
1023A508j414n42K479j125l46R99q07R30j159r83J691j634j36J239j584J222k51
$$ 1508 94 -448 2031 906 560 1559 752 1682 523 -460 1231 -403 -539 700 -884 338 87
1040H7o98J594j297j16J281j353R54or35J713n05r20J800j757P24n9j830J621
$$ 87 -611 983 -314 -430 851 -502 452 446 -489 1224 719 -201 1599 -158 566 507 -1323 298
1058B98p95r29J349p54R8K81j259J957n16j696J868k03l25Q26n86J793o86j328
$$ 298 -497 -1426 -77 -831 -733 -452 -1711 246 -270 -1966 -98 -301 -626 200 -386 1407 721 -607
1076f07K735n36j429J182r56J060j063j360K571j436k001J781m18k07q45l46J829
$$ -607 2128 1592 163 1345 389 1449 386 -974 1597 161 -1840 -59 -477 -684 -1529 -1875 -46
1093d6j498j282K830l14p85Q24N85J602j753n69L647j886j319J839m8k31j178
$$ -46 -1544 -2826 4 -310 -1095 -271 314 1916 163 -406 3241 1355 36 1875 1827 1596 418
1110D18o3K551k570j887K487p66j692l58M38J426k712k32L662k063r62J407R44
$$ 418 355 2906 336 -1551 936 170 -1522 -1880 -1442 -16 -2728 -2960 702 -1361 -2323 -916 28
1127B8R1j753O94L425k429r82L866m47j287o62J472J608l930j06L020j948j678
$$ 28 119 -1634 -940 2485 56 -926 2940 2493 1206 544 2016 3624 -306 -412 2608 660 -1018
1144a018N85Q79n6k799P40K698l669o74K519K36j026r56K276K227l404L83L244
$$ -1018 -433 446 390 -2409 -1669 1029 -2640 -3314 -795 -559 -1585 -2541 -265 1962 -1442 -1059 2185
1161B185r62j680N68J897J98k955J335L039l327r14J685J36j348k285K136J253
$$ 2185 1223 -457 111 2008 2206 -749 586 3625 298 -616 1069 1205 -143 -2428 -292 961
1177I61l858N81K835r60j235J84K146J54l079J870K681k629l50J801J138r10j748
$$ 961 -2897 -2316 519 -441 -1676 -1492 654 808 -2271 -401 2280 -349 -699 1102 2240 1330 -418
1194d18K439J008l862N87K084j313j198o30K360o5l566J999J845k611o30J168
$$ -418 2021 3029 -833 -246 1838 525 -673 -1303 1057 992 -2574 -575 1270 -1341 -1971 -803
1210h03J231o63k389L348J358l036R46J856q51j030p64K303k72l162K076J486
$$ -803 428 -235 -2624 724 2082 -954 -8 1848 997 -33 -797 1506 1234 -1928 148 1634
1226A634j996o79P65J229j454k464K797L26k755J241J235N32r61p12K988l83k790
$$ 1634 -362 -1041 -276 953 -501 -2965 -168 158 -2597 -1356 -121 411 -550 -1262 1726 1343 -1447
1243a447K205Q43j078k23L56J710r92j948K555l95k386O12O9N35j546q95K304
$$ -1447 758 1601 523 300 656 2366 1374 -574 1981 1586 -800 -188 -119 416 -1130 -2025 279
1260B79m82k178K019R2l42m38j14J933j058j267K722R9j235R83J28Q27j319j162
$$ 279 -203 -2381 -362 -270 -612 -1050 -1164 769 -289 -1556 1166 1265 30 1013 1141 1968 649 -513
1278e13K104j183j173J143m29J7q52o34J719j342r54J652j068P2M36j37J412n71
$$ -513 1591 408 -765 378 -51 -34 -886 -1520 199 -1143 -2097 -445 -1513 -1441 -1005 -1142 270 -301
1296c01m94K175o71l86Q54q55J076n43l13J493j082m97J151j245J63l10r45R11
$$ -301 -795 1380 709 323 1177 322 1398 855 542 2035 953 456 1607 362 525 215 -730 181
1314A81j166k71Q37n29L54L88p92J436q96k59R56k41J20P25r55J527l35p12P23
$$ 181 -985 -1256 -419 -948 -594 -206 -998 438 -458 -717 239 -2 118 843 -112 1415 1080 368 1091
1333A091o38k27J78j200P57k74r64J168n77n33O11p79J140m74j105J797m20o65
$$ 1091 453 226 404 -796 -39 -313 -1277 -109 -686 -1219 -608 -1387 -247 -721 -1826 -29 -449 -1114
1351a114J359k23O99K59p29J268k29j233J410n07m44J02o04J425j137r70J512
$$ -1114 245 22 721 980 251 1519 1290 57 1467 960 516 618 14 1439 302 -668 844
1368H44r32j203M12O7M82q93j64K235q21q95J226L8J14m76j07J740j294o73K028
$$ 844 -88 -1291 -879 -812 -330 -1223 -1387 848 27 -868 358 396 510 34 -73 1667 373 -300 1728
1387A728m34q48j36K48M67j550o99K047j394q33M73K32L0j197M94K144j909n50
$$ 1728 1294 446 310 558 1025 -525 -1224 823 -571 -1404 -931 -699 -669 -1866 -1372 772 -1137 -1687
1405a687J969j69o82K40Q26J154j807J94K301j537r24P26L80J45j917P67J516
$$ -1687 282 113 -569 -329 497 1651 -156 38 2339 802 -122 604 984 1129 -788 -21 1495
1422A495k101l73J314l75m39j078J242J058k448Q29J777p98o91P57Q48K45j877
$$ 1495 -606 -979 335 -40 -479 -1557 -315 743 -1705 -876 901 103 -588 169 1017 1262 -615
1439f15R02J801j807n83J222o3m03j140J144Q30k675L20J703r44o09p8R43M99
$$ -615 287 2088 281 -302 920 857 454 -686 458 1288 -1387 -1067 636 -308 -917 -995 -52 447
1457D47k194J400J367j685k31J484M62o10j327J728R50k345L95J552o24j078j68
$$ 447 -1747 -347 1020 -665 -896 588 1050 440 -887 841 1791 -554 -159 1393 769 -309 -477
1474d77J135l21k161J241J416j796k92O07P32n47r33J633O34j761O75J359l74
$$ -477 658 337 -1824 -583 833 -963 -1255 -648 84 -463 -1396 237 871 -890 -215 1144 770
1491G70l70l66J644q9j990J154P90j216m06l2P80j038j378J548K43j736N22Q01
$$ 770 400 34 1678 1589 -401 753 1543 327 -79 -111 669 -369 -1747 -199 44 -1692 -1170 -369
1509c69j99o14m87J519K93j705J523R65m65l68M42J404q61j354J813j21j384M01
$$ -369 -568 -1182 -1669 -150 143 -1562 -39 926 461 93 535 1939 1078 -276 1537 1416 32 433
1527D33L72K4q23p45J294o11j485J068O3o27K8k62J329p03q26J412M1m97P26M6
$$ 433 805 829 6 -739 555 -56 -1541 -473 -410 -1037 -1009 -1271 58 -645 -1471 -59 -18 -515 211 257
1547B57P39l33q26J766m71j028J129l73k07k29p21J514j331p91J218n73n73J75
$$ 257 996 663 -163 1603 1132 104 1233 860 653 424 -297 1217 -114 -905 313 -260 -833 -658
1565f58n36J026p79k21J086m11m01Q90k35O69k26k93J166p26k11O45m37K10p5
$$ -658 -1194 -168 -947 -1168 -82 -493 -894 -4 -239 430 204 -89 1077 351 140 785 348 558 483
1584D83k99O58n48n90Q65p04j65K55o99M74O4p44J094p09P7O28l66K19k08k17
$$ 483 184 842 294 -296 569 -135 -300 -45 -744 -270 -206 -950 144 -565 -488 140 -226 -7 -215 -432
1604d32P41k20m04Q94q52J59L95m34O05n62l36P54q46L69K24o90Q17l43l64M09
$$ -432 309 89 -315 579 -273 -114 281 -153 452 -110 -446 308 -538 -169 55 -635 182 -161 -525 -116
1624a16j55M71j32k88R64m58m10R38m65k08J35k08P20r50m12O49k77k89K29j38
$$ -116 -271 200 68 -220 744 286 -124 814 349 141 276 68 788 -162 -574 75 -202 -491 -262 -400
1644d00M98l04l68J233q43p88J259l62K68q8j51J353o62m71J101o47l97M58J79
$$ -400 98 -206 -574 659 -184 -972 287 -75 193 105 -46 1307 645 174 1275 628 231 689 868
1663H68j2r00o54J654j201n28M86n1O2p29r4J149q95m05J099j79k15K18L54Q89
$$ 868 856 -44 -698 956 -245 -773 -287 -338 -276 -1005 -1099 50 -845 -1250 -151 -330 -545 -327 27 916
1683I16j105q7J458l89q35N06K63J93r45K41J075j254n55J052l97o10k19L53P76
$$ 916 -189 -276 1182 793 -42 464 727 920 -25 216 1291 37 -518 534 137 -473 -692 -339 437
1702D37j514K59J343j043l97M30K57N25r47N69J264j384j75J053O3k0r92Q51N55
$$ 437 -1077 -818 525 -518 -915 -485 -228 297 -650 -81 1183 -201 -376 677 740 720 -272 579 1134
1721A134j533K93J184j066k40J4M31J43j451N28Q42j248J2J039l11j41p46R40
$$ 1134 -399 -106 1078 12 -228 -214 217 360 -1091 -563 279 -969 -957 82 -229 -370 -1116 -176
1739a76J190j872O09Q42m23l03o4P32R5j237Q82P43j074j23O95k30m8r66J174
$$ -176 1014 -858 -249 593 170 -133 -197 535 630 -607 275 1018 -56 -179 516 286 238 -728 446
1758D46L20j531N02N79l63q6m54R71M02j903Q38R92j124K32K60N03n85o32Q20
$$ 446 766 -765 -263 316 -47 -133 -587 384 786 -1117 -279 713 -411 -179 81 584 -1 -633 187
1777A87M74j370L90O09M8o31l91R50N6j195Q84M34q02J5OQ32j70j093J179K99
$$ 187 661 -709 -319 290 338 -293 -684 266 322 -873 11 445 -357 -342 -336 496 326 -767 412 711
1797G11j283L38L64Q8l88l67R60j34j006P89L07n00r5k41P04l9r61J237k25o37
$$ 711 -572 -234 130 218 -170 -537 423 289 -717 72 379 -121 -216 -457 247 208 -753 484 259 -378
1817c78M57M6K05k86k08P74Jj062O63Lm5j11k16P34j10q07P48l85m15J64N4J57
$$ -378 79 125 330 44 -164 610 611 -451 212 215 170 59 -157 577 467 -340 408 23 -392 -228 -174 -17
1839a7l28l50J208n70m34M00J45o8K9j09L83m48l25J011m91J99Q3o99Q74l01n56
$$ -17 -345 -695 513 -57 -491 -91 54 -14 15 -94 289 -159 -484 527 36 235 318 -381 493 192 -364
1860c64O66l15l22M21j78L48l62k01M26k28j70L62n19M31K33m83N80j28j00J43
$$ -364 302 -13 -335 86 -92 256 -106 -307 119 -109 -279 83 -436 -5 228 -255 325 197 97 240
1880B40l10M46p7j97M22j57l59M44n86O2J41l72L53n80p3O99l68P2K34n28N56
$$ 240 -70 376 299 102 524 367 8 452 -134 -72 69 -303 50 -530 -603 96 -272 -200 34 -494 62
1901F2j19l75P36n34J03M91k81M46m99k14O56j59l09L21m11K37j36m14P16l2r27
$$ 62 -57 -432 304 -230 -127 364 83 529 30 -184 472 313 4 325 -86 151 15 -399 317 285 -642
1922f42O95k00N1j99j35O13k11n21O40j1j86N19l40N90l71m34P48l41l94M32M3
$$ -642 53 -147 -96 -295 -430 183 -28 -549 91 80 -106 413 73 663 292 -142 606 265 -129 303 346
1943C46j9n59j83J098p54m78P36k64l80p9L10M11n15p0O16k42k88K13J22J81l06
$$ 346 327 -232 -415 683 -71 -549 187 -77 -457 -536 -226 185 -330 -400 216 -26 -314 -101 21 202 -104
1964a04J13O26n50n22R53j79o8j79Q5J79q21J53P28n32k26K93J34L0n36Q4O64
$$ -104 9 635 85 -437 516 337 269 90 175 354 -467 -314 414 -118 -344 -51 83 113 -423 -339 325
1985C25n82l17N96Q7l80j13L84O49j009J20Q20n82k0j14L83J22p79K44P99o78
$$ 325 -257 -574 22 109 -271 -384 0 649 -360 -240 580 -2 -22 -136 247 369 -410 -166 633 -45
2005d5l37O63m6l03k40M61L71p94J7Q60o01j13k41L19M57r93N04M56n41o00P53
$$ -45 -382 281 235 -68 -308 153 524 -270 -253 607 6 -107 -348 -29 428 -565 -61 395 -146 -746 7
2026GJ51k59o39O88O93r93K29L35n6J9k84K32M12q08O56K47p43L19K02j8k38l81
$$ 7 158 -101 -740 -52 641 -352 -123 212 156 175 -109 123 535 -273 383 630 -113 206 408 390 152 -229
2048b29N03M42j032O6K61q2No06O22K00r27M67N69m01J52j1J77p8m01O43M32p95
$$ -229 274 716 -316 -250 11 -71 -66 -672 -50 150 -777 -310 259 -142 10 -1 176 98 -303 340 772 -23
2070b3L84R0R3k74n42R25m65m40O54k92j01j83j90M36q4q93P29Q2k48P1j32L70
$$ -23 361 451 544 270 -272 653 188 -252 402 110 9 -174 -364 72 -12 -905 -176 -94 -342 -271 -403 -33
2092c3p6m54Q91k14l90N74p6k3O2l16O32k29m59N30j46l70K94l61L46l35l46O10
$$ -33 -109 -563 328 114 -276 298 222 199 261 -55 577 348 -111 419 273 -97 197 -164 182 -153 -499 111
2114A11j91k66L32N7m35J99k63O75l42m19P63k84K08K11k97M41l02k11K74p5k79
$$ 111 -80 -346 -14 43 -392 -193 -456 219 -123 -542 221 -63 145 356 59 500 198 -13 261 186 -93
2135i3N67n00L20l44q3N48l38l34L04l37J97J27j53J19l01j10M20l12R3L14m58
$$ -93 474 -26 294 -50 -133 415 77 -257 47 -290 -93 34 -119 0 -301 -411 9 -303 -210 104 -354
2156c54N13o5m52N10J7l01L79k66K16J99o33P73m38l13M04j07J19k04k32M78J21
$$ -354 159 94 -358 152 169 -132 247 -19 197 396 -237 536 98 -215 189 82 201 -3 -235 243 364
2177C64m41K03n9K33j81m74N01j43j85K35l67K77j99j72M78o5k65K67p1Q7J67
$$ 364 -77 126 67 300 119 -355 146 3 -182 53 -314 -37 -236 -408 70 5 -260 7 -64 23 190
2198A90l49K98j43k69M45j63q1L91k80K88l29j53M17l12l37M02k0j01jj04M34
$$ 190 -159 139 -4 -273 172 9 -72 319 39 327 -2 -155 262 -50 -387 15 -5 -106 -107 -211 223
2219B23m72k67P00j99m23K58J95J12P4n29N94j95n9M04l25p5o1J81J37p0m72N96
$$ 223 -249 -516 184 -15 -438 -180 15 127 201 -328 266 71 12 416 91 16 -45 136 273 203 -269 327
2241C27l43j10lr3M77k99k02M29m17l00N08P4p0n19M50N55n39j56N80n12L15m4
$$ 327 -16 -126 -129 -222 255 -44 -246 183 -234 -534 -26 48 -22 -541 -91 464 -75 -231 349 -163 152 108
2263A08j18K00k95J66M85l45k68L86j72J55m38M2N03l62m97O35j99j63j18j08
$$ 108 -10 190 -105 61 546 201 -67 319 147 302 -136 -94 409 47 -450 185 -14 -177 -295 -403
2283d03Q70p57n3Q23n37l66K59L50K17n18J90L06p78K48K67P0L8m95L71M47o51
$$ -403 467 -290 -343 480 -57 -423 -164 186 403 -115 75 381 -397 -149 118 188 226 -269 102 549 -102
2304a02o3N29m14k26P8J52L71o59K17L48l09K4N3L31j84n17L2P06n47p3M63n8
$$ -102 -165 364 -50 -276 -198 -46 325 -334 -117 231 -78 -54 -1 330 146 -371 -339 367 -180 -253 210 152
2326A52n7j72K32K11q05N07R4k33J12q1j31M71o95M50R3m06K39J83j26nl17L95
$$ 152 95 -77 155 366 -439 68 162 -71 41 -40 -171 300 -395 55 148 -258 -19 164 38 33 -284 111
2348A11M0p04N08n2j11L48l44L20r0j72J7N81o82K40J86n2j11k82L31j78K7J32
$$ 111 151 -553 -45 -97 -208 140 -204 116 26 -146 -129 452 -230 10 196 144 33 -249 82 -96 -69 63
2370F3K23m9l33j39K84J64o46N92J30k54j20l06K38m6j9O69l36k02M96l89j82
$$ 63 286 237 -96 -235 49 213 -433 159 289 35 -85 -391 -153 -199 -218 451 115 -87 409 20 -162
2391a62L75l63K86q1l65L42K05l08K21j11M0n8k78N89n48M8L8K18l1j54l9N4m1
$$ -162 213 -150 136 55 -310 32 237 -71 150 39 79 21 -257 332 -216 -168 -130 88 57 -97 -136 -82 -123
2414a23J58K15j86m0l0N5j10K59j18L30l57j50L36l98j5J41k29M37J3l77M16k64
$$ -123 35 250 64 24 -6 49 -61 198 80 410 53 -97 239 -159 -174 -33 -262 175 188 -189 227 -37
2436c7j7K07j42J41m12L92k3l70K87p1j40K17N6j68K29j86R5J20l00L26lk63K44
$$ -37 -54 153 11 152 -260 132 109 -261 26 -45 -185 32 88 -80 149 -37 58 178 -122 204 201 -62 182
2459A82J5k55K4k00K56J09m17K08m7l43O45l41R3lj44K56l0j30J45L2L08l60l67
$$ 182 197 -58 -34 -234 22 131 -286 -78 -125 -468 177 -164 -71 -74 -218 38 8 -122 23 55 363 3 -364
2482c64M74j22k52M59j98P5j46J47J58rm18M99l51n1o8j04L12N8j07K61m29k9
$$ -364 110 -12 -264 195 -3 72 -74 73 231 222 -196 303 -48 -99 -167 -271 41 99 -8 253 -176 -205
2504b05L45m6j37j48l6L38J01o34N90n3l18K52j18J39%l80M02kk91K55J79j92
$$ -205 140 94 -43 -191 -227 111 212 -422 168 115 -203 49 -69 70 70 -310 92 90 -201 54 233 41
2526D1k34K1L83o0l31L74j21l2k32Q7K94j55j33L56j74l87L67m8j26J54m35P01
$$ 41 -193 -172 211 151 -180 194 73 41 -191 -104 190 35 -98 258 84 -303 64 16 -110 44 -391 310
2548C10l90L7J39j00J99o8l39M89j05k70L08r4j46J46J2r7lkJ57j11k43J33r4
$$ 310 -80 -43 96 -4 195 127 -212 277 172 -98 210 116 -30 116 128 31 28 26 183 72 -171 -38 -132
2571a32J7o3lL07j16l44L19P0J53n5k47M10l86K38k40J64J6N6P1j49mj64M31l15
$$ -132 -115 -178 -181 126 10 -334 -15 55 208 153 -94 316 -70 168 -72 92 108 164 235 86 82 -82 349 34
2595C4l5J64j23k3p6o5K42j43l25L23n11L03M7Q4K8K7L2L03l83K91K20m11Q5j83
$$ 34 -1 163 40 17 -59 -124 118 -25 -350 -27 -538 -235 -188 -104 -76 -49 -17 286 -97 194 414 3 88 -95
2619i5J94K55j50j93J13l01K29k04K41l6m34J89J58j84OJ19k9R7O9n3o1j64K24
$$ -95 99 354 204 11 124 -177 52 -152 89 53 -381 -192 -34 -218 -212 -93 -122 -25 44 -9 -70 -234 -10
2642a0J21Q6j57j51K6K90m39L80J4l27J61j56j6M62n22L23k61J4J29j88M34p9
$$ -10 111 197 40 -111 -85 205 -234 146 160 -167 -6 -162 -178 284 -238 85 -176 -162 -33 -221 213 134
2664A34k90K77r8k54K03J24J15j78K52k77l50M00m2j7mJ02m9k38L30k65K83k22
$$ 134 -156 121 23 -231 -28 96 211 33 285 8 -342 58 16 -1 -5 97 48 -190 140 -125 158 -64
2686f4j45K62Q1j30j13n4L79k80N2J67l92J96j62J60j18r5j1J85J12K04k51k83
$$ -64 -209 53 134 4 -109 -163 216 -64 -12 155 -237 -41 -203 -43 -161 -256 -267 -82 30 234 -17 -300
2708c00L28n2J53j28K84k19j15K78k85K66k25J82j33q2K9J99J4k40l08J13J62
$$ -300 28 -24 129 1 285 66 -49 229 -56 210 -15 167 34 -48 -19 180 194 -46 -354 -241 -79
2729g9j24m4K95j12K35j68r5L67o9l85J86P3l6p1q3O0j80Q1J31L0lJ64j43J2k03
$$ -79 -203 -247 48 -64 171 3 -92 275 206 -179 7 80 44 -27 -110 -50 -230 -149 -18 12 9 173 30 42 -161
2754a61M12j20m30M23l39K01J11k93J88j48j77L26j15J99J21k01j42J20K7L41
$$ -161 251 131 -299 124 -215 -14 97 -196 -8 -156 -333 -7 -122 77 198 -3 -145 -25 2 343
2774C43l37j55J94N2j85n9K6J96R8k55L11l56L7J80j42K30m24N0L72k18l5K15
$$ 343 6 -149 45 97 -88 -147 -121 75 173 -82 229 -127 -90 90 -52 178 -246 -196 176 -42 -77 138
2796A38j15J12l50J04M29k76j26K04j34o6O6O4k54L35J52k79K17l31M4m4J23q
$$ 138 23 135 -215 -111 318 42 -84 120 -14 -80 -14 50 -204 131 283 4 221 -110 -66 -110 13 5
2818EJ42j08p3j84K61j0l7O3k78K48R0j26J63j87j10o7N6K03j1K3J00l62N8J44
$$ 5 147 39 -34 -218 43 33 -4 59 -219 29 119 -7 156 -31 -141 -208 -152 51 40 63 163 -199 -141 3
2842CJ2j55Q3J43O7l63L58N2k54l9Q2j62J92J07j83J1J0Qk36J89J71J8j47J41
$$ 3 15 -140 -57 86 153 -210 148 200 -54 -93 -11 -173 19 126 -57 -46 -36 -28 -264 -75 96 114 -33 108
2866A08j33j71L19k28R5r0J65j2j24J70P1k00M0J45k00j51q7K76p3M06m62K60
$$ 108 -25 -196 123 -105 -10 -100 65 53 -71 99 170 -30 10 155 -45 -196 -283 -7 -80 326 -136 124
2888A24ql01P4L07o3l60J89K62j00J4k17J62Q3q2l47O42l94J37K22l77n0r4L86
$$ 124 116 -185 -111 196 133 -227 -38 224 124 138 -79 83 166 84 -263 379 -15 122 344 -33 -83 -177 209
2911B09l54Q9J33L6l69M49k54R6j05k1J13o4L2k03L61q1l54J44J22o2k1J47P5
$$ 209 -145 -56 77 113 -256 193 -61 35 -70 -91 22 -42 -10 -213 148 67 -287 -143 -21 -83 -104 43 118
2934A18j97L50l93j8L68k70J62J03o8L9k60Q0N8o1j20K55k70Q5l8r0K21l78M35
$$ 118 -79 271 -122 -140 228 -42 120 223 155 194 -66 14 72 11 -109 146 -124 -39 -77 -167 54 -324 111
2957A11l03J75n2J07J66l16J25j21Q9M8K34J40k63m05M40j33J94j82o0K6j20K14
$$ 111 -192 -17 -69 38 204 -112 13 -108 -19 29 263 403 140 -265 175 42 236 54 -6 20 -100 114
2979A14Ll64N00k02j3p0m8L14l52J15Q0q5K33q6l73K27J09m4n8J07j11j11O9J26
$$ 114 117 -247 253 51 38 -32 -80 234 -118 -3 77 -8 225 139 -234 -7 102 58 0 107 -4 -115 -46 80
3003H0j34J95Q5p2J51l05L5J40j9l26N8J5m6K30k44K00l98K88m4N7l3R9K9J44
$$ 80 -54 141 226 154 305 0 35 175 156 -170 -112 -97 -143 87 -157 43 -355 -67 -111 -54 -87 12 41 185
3027A85nk91M03j63R3N0k29L1L8j12J68m12K20q8J03j50J3K1O6o4N6N9N6P4k61
$$ 185 180 -111 292 129 222 272 43 74 112 0 168 -244 -24 -112 -9 -159 -146 -125 -59 -123 -67 -8 48 122 -139
3052a39J48l3k44P2M00k73lO7j41L48o1k67K68j31K41j78R0l15K18J0M9J92l12
$$ -139 9 -24 -268 -196 204 -69 -72 -5 -146 202 141 -126 142 11 252 74 164 -151 67 77 126 318 6
3075FJ15n6j6j37n9L25l32j2K30j4j73L67m60M33k58l03N15o7j57O2m3j6N5J64
$$ 6 121 65 49 -88 -147 178 -154 -166 64 50 -123 244 -216 217 -41 -344 171 104 -53 9 -34 -50 5 169
3099A69j70L15k94R6J37k12n5K7J31kk93J09RP3L4%j55J82j29K82l90N6K43l41
$$ 169 -1 314 20 116 253 41 -14 13 144 142 -151 -42 -33 40 74 74 -81 101 -28 254 -136 -80 163 -178
3123a78K93J70l96M42k07q6J92j40j72Q5k47L04N4k78K41j08P5J15l7j19O8J2
$$ -178 115 285 -111 331 124 38 230 90 -82 3 -244 60 114 -164 77 -31 44 159 122 3 71 83
3145H3K62o97j08O40m25M88n04L41j03R7o9m4N3pN4j81N5m7K10P9q6r6K18l48
$$ 83 345 -352 -460 180 -245 243 -261 80 -23 74 5 -39 14 7 61 -120 -65 -112 98 177 91 -5 213 -135
3169a35K49j17j2J94n24L70M8k09J35Lk78L94k20m04M23Q0K93l81K9J27K40k41
$$ -135 114 -3 -15 179 -345 25 73 -136 -1 2 -276 118 -102 -506 -83 -3 290 -91 -62 65 305 64
3191F4j14%J97J9j89J21m3k10L04J5o3n1j62n0j04K52j09L3o3O4L5k50L49q5k52
$$ 64 -50 -50 147 166 -23 98 55 -155 149 164 101 50 -112 -162 -266 -14 -123 -90 -153 -89 -54 -304 45 -40 -292
3216b92O07l61J91j51K14j57j22O9L26o13K63l6j1K96l19J86j21L11k20J06k70
$$ -292 315 -46 145 -6 208 51 -71 -2 324 -289 -26 -62 -73 223 -96 90 -31 280 60 166 -104
3237a04m7J97n2K40m7m37L35n3Q7O4l74p7J05j3L15l3Q3k94j01L74j07P0m0j67
$$ -104 -151 46 -6 234 187 -250 85 32 119 183 -191 -268 -163 -176 139 106 189 -105 -206 168 61 131 91 -76
3261g6M45l73m0K56m0j5m29M40k68n3J25K59j41k7J60l42J77n8R2o4j41K96p9
$$ -76 369 -4 -44 212 172 157 -272 168 -100 -153 -28 231 90 63 223 -119 58 0 92 28 -113 183 104
3284A04l76L64J6k32%J44P9P6r7l26J40K11k69K65O7j25q9oP3k01L60q8j5K3k40
$$ 104 -272 92 108 -124 -124 20 99 175 78 -248 -108 103 -166 99 166 41 -48 -54 19 -182 178 90 75 98 -142
3309a42R4K57k57j50L83Q3j70k65M21j98l22L53k63K37J80l35Q3L3j74N7M2Q8
$$ -142 -48 209 -48 -198 185 268 98 -167 254 56 -266 87 -176 61 241 -94 -11 22 -152 -95 -53 35
3331C5P4j91J29j22K29j66n1K07p2l03L28k34J82n1J70k35O7M31l21k7j19J84
$$ 35 109 -82 47 -75 154 -12 -63 144 72 -231 97 -137 45 -6 164 -71 -4 427 106 79 -40 144
3353A44L2l14K89j78QJ21k8r4J26k45K91j64o2K33l69J25K2n6J51Kj16j02j05
$$ 144 176 -138 151 -27 -19 102 74 -20 106 -139 152 -12 -74 159 -210 -85 -63 -119 32 34 -82 -184 -289
3376b89K64K23m41O0M61j76J81k04j31J52J91j16n9L2m2J2k9j96K30k36J44J33
$$ -289 -25 198 -243 -183 278 102 283 79 -52 100 291 175 116 148 106 118 89 -107 123 -113 31 164
3398A64o8o6j99L11M7m50K70j48N5p8K09j79L89l09J44j26O3jk89L51j78J0J09
$$ 164 96 30 -169 142 189 -261 9 -139 -84 -162 47 -132 257 -52 92 -34 29 28 -261 90 -88 -78 31
3421C1Kj04J45r0j2M%K22j60j09q3K08n0o8j18K05P1j17L49m90O8J04K0Q4K8P4
$$ 31 33 -71 74 -16 -28 -24 -24 198 38 -71 -154 54 4 -64 -182 23 94 -23 326 -164 -96 8 28 112 140 214
3447B14k39K20Lk16Q1P4L3k03L40k55j26J90j72N8k00Q4K01k65J84qO9j59L55
$$ 214 -25 195 198 -18 63 137 170 -33 307 52 -74 116 -56 2 -198 -114 87 -178 6 -2 67 -92 263
3470B63k33j06O0j31J92j54m2p1L76O4j37J13k35q6P9KJ5J26r3m7L25l51j99N56
$$ 263 30 -76 -16 -147 45 -109 -151 -222 154 218 81 194 -41 -127 -48 -46 -31 95 2 -45 280 -71 -270 286
3494B86m68J25l2J8J27j07n0J64j91M5K4k8O6l6p7L09k00l3J24Q1M8o9k40J66
$$ 286 -182 -57 -89 -71 56 -51 -101 63 -128 -83 -59 -87 -21 -57 -134 175 -25 -58 66 147 195 126 -114 52
3518E2k32L43j05k4L7k04l0J04L53l17K34m16O7K67k06q2J14o1K1j24L6L55l53
$$ 52 -180 163 58 34 71 -133 -163 -59 294 -23 211 -205 -138 129 -77 -159 -45 -106 -85 -209 -173 182 -171
3541a71K53N3k56Q8n1J47o7LJ92r0p4n2p5l37K69J10J55J17j38J47l37l9J14M6
$$ -171 82 135 -121 -33 -84 63 -4 -1 191 101 27 -25 -100 -437 -168 -58 97 214 76 223 -114 -153 -39 7
3565GO8qr8J04n7j7L3N2k5o2r8n0J10k92O06l60j34J45J29j87rJ49J6M7J74J0
$$ 7 75 67 -31 73 16 -1 32 84 59 -3 -101 -151 -41 -333 273 -87 -221 -76 53 -134 -143 6 22 69 243 253
3591B53l38L23j45k26K43l44K29k1R4N0l6j59J14j1J25j01j00L6K27l35M15l94
$$ 253 -85 238 93 -133 110 -234 -5 -26 68 118 82 -77 37 26 151 50 -50 -14 213 -122 293 -101
3613a01q6L71J07k90j18J84k57K01q7j54J98K45j09N5J50m00q4J77k33K89p0r6
$$ -101 -187 184 291 1 -117 67 -190 11 -76 -230 -32 213 104 159 309 -91 -175 2 -231 58 -12 -108
3635a08M9O8j6J06o8r8K12k54L51m47M16l01J85o7k40P6J88J2o3l3M4J79m01L32
$$ -108 -59 9 -7 99 31 -67 145 -109 242 -205 211 -90 95 28 -212 -136 52 64 1 -32 12 191 -210 122
3659A22r1m4J49k84K05j23j5q2J73N2n1J18q3M9o4j2j62n1K82K3o9k04q6R3J27
$$ 122 31 -13 136 -148 57 -66 -81 -163 10 62 11 129 46 95 31 19 -143 -194 88 111 42 -162 -248 -155 -28
3684b8J14R4k25pP4n6K60j23J0j50j14Q1M37n78J17J81q0N3j23m7P9J02j11j30
$$ -28 86 180 -45 -52 22 -34 226 103 113 -37 -151 -70 367 -211 -94 87 7 60 -63 -110 -31 71 -40 -170
3708a70j9J45L5l9l8olL8O7k01j88J63L77j94%P6J23j63j00p6p3L58j97o6J07
$$ -170 -189 -44 -9 -48 -86 -92 -95 -57 10 -191 -379 -216 161 -33 -33 43 166 3 -97 -173 -246 112 -85 -151 -44
3733d4J7L27l70J80l0K0M8m7j42m8J84J27k04q0J67j84M2m5L6q9j99M63k30K36
$$ -44 -27 300 -70 110 80 100 148 101 -41 -89 95 222 18 -62 105 -79 -37 -82 -46 -135 -334 129 -101 135
3757A35j28k21J84r4J05o7j7K27O3j70L0n2M4q5K17o1p3k91K53O0j6j7l2K6k07
$$ 135 7 -214 -30 -124 -19 -86 -103 124 187 17 47 -5 39 -46 171 110 37 -254 -1 59 43 26 -6 20 -187
3782a87J58l8j28M78l03m1n9J98j35k2m1kK4J85m22N75j75M8oj82J80p4n9J54
$$ -187 -29 -67 -195 283 -20 -61 -120 78 -57 -79 -120 -122 -98 87 -335 240 65 113 107 -75 105 31 -28 126
3806A26k04J57M1l35K34L91k98j32J42q1j27L51j86pk3k69J87O1k14K96m57J21
$$ 126 -78 79 120 -215 19 410 112 -20 122 41 -86 265 79 72 49 -220 -33 28 -186 110 -347 -226
3828b26N14j89j23k18M52k33Q2Q8k02L1%PJ54k96N3N3J86P0m0j45NP1M4j42q3
$$ -226 288 99 -24 -242 210 -23 59 147 -55 -24 -24 -17 137 -159 -106 -53 133 203 163 18 23 94 138 -4 -87
3853h7m05K95K57N5k74M0L42k06r5R7k68K77J7O8k23J44l43J27m4J04L98k16j48
$$ -87 -492 -197 60 115 -159 -119 223 17 -78 19 -249 28 45 113 -110 34 -309 -182 -226 -122 276 60 -88
3876h8J9k59J36K43j33Q7m7J52J6m11M30j29j53RJ26L2q5K7O6J17k17k17r0L22
$$ -88 -69 -328 -192 51 -82 5 -42 110 126 -285 145 16 -137 -128 -2 30 -55 -28 38 155 -62 -279 -369 -47
3900d7Q7j64rK3J34j96K64P7o8J3l29J96K7N3n2j64M21j53kq7j05j05O8J56j56
$$ -47 40 -124 -133 -110 24 -172 92 169 101 114 -215 -19 8 61 9 -155 266 113 111 24 -81 -186 -118 38 -118
3925a18M8J29J6l22K57k22K17J04j19J67p4k68L95l55O3k1J22J79k90j5K06J68
$$ -118 -70 59 75 -247 10 -212 5 109 -10 157 83 -185 210 -145 -82 -103 19 198 -92 -107 99 267
3947B67n26L41j8j1k0j40J16pO2J01j64k59M68j79n8K19j99J27l79K10q4J57k16
$$ 267 -259 82 64 53 33 -107 9 2 64 165 1 -258 210 31 -27 192 -7 120 -259 -49 -133 24 -192
3970a92L14j0j69Q6k1K2Q9m7k70L02q8k4J21k28nK10J68k64j88L43k3O1j22j74
$$ -192 122 112 -57 29 8 30 119 72 -198 104 16 -8 113 -115 -120 90 258 -6 -194 149 126 187 65 -109
3994a09P1Q5K5L0k27N3k26L53O7j43MJ96k49Q4R8o4J30j07Q7j94o1J75m6n3q3
$$ -109 -38 47 72 102 -125 -72 -298 55 122 -21 -17 179 -70 14 112 48 178 71 158 -36 -97 78 32 -21 -104
4019a04P1o2J42j57J98k01L1J29p1j04J88%j39K34m33L60K1o5N5J97l07J13j52
$$ -104 -33 -95 47 -110 88 -113 -82 47 -24 -128 60 60 -79 155 -278 82 103 38 93 290 -17 96 -56
4042e6J21O5j47n8L20k65l5j7k21L65j13L86o54K51K59k36Mj9p8j25K86J7j28
$$ -56 65 130 -17 -75 245 -20 -55 -72 -293 72 -41 345 -309 -58 201 -35 -31 -50 -128 -253 33 50 -78
4065g8J80J18k67M4j7J31L9J4k70j08L24k99J58N0l3M9k15Q0P2j18O9R4L6Q0J16
$$ -78 102 220 -47 -3 -20 111 150 164 -106 -214 110 -189 -31 19 -14 35 -180 -100 -28 -146 -77 17 53 133 249
4090B49k05o6k9J02o3J06J39l01J03L11l18j55K23l16J48k2l6L7O5K7p0K16k01
$$ 249 44 -22 -51 51 -12 94 233 -68 35 346 28 -127 96 -220 -72 -94 -130 -93 -28 -1 -71 145 -56
4113e6J50k21oK23m37N72l68J93k2k19K36j85R5J59j51J48k42L48k71J3l18L78
$$ -56 94 -127 -133 90 -347 225 -143 50 28 -191 45 -140 -45 114 -37 111 -131 217 -54 -41 -359 19
4135A9M1l08J70J3K7K90l72J68N9j52j99K08j66R6R8k61Q6J09J03j07ol9Q7J64
$$ 19 60 -248 -78 -65 -38 252 -120 48 107 -45 -244 -36 -202 -106 -8 -269 -183 -74 29 -78 -84 -123 -36 128
4159A28k48K51j75q9k6L63l19QK94l06Q1%J45k92J37k20L27Pm24L24j2R1j21Q2
$$ 128 -120 131 -44 -133 -159 204 -115 -107 187 -119 -38 -38 107 -185 -48 -268 59 66 -358 -34 -46 45 -76 6
4183FO0j74K13L1k18R1K37l65J59k42K02K28j44j23j71J12K6qJ96j67l6K4J41
$$ 6 66 -108 105 136 -82 9 246 -119 40 -202 0 228 84 -39 -210 -98 -72 -80 116 -51 -87 -63 78
4206G8j30L29k30n0q4qJ40Q5j26k17J70L8K79j98K00m70K15j44qJ44k27J97K73
$$ 78 -52 277 47 -3 -87 -95 45 130 4 -213 -43 -5 274 76 276 -194 21 -123 -131 13 -214 -17 256
4229B56q5j13j3R8K0p1m4k7J21r3j69J48K8n3k51J32J55p7N7j59RJ82l56L53j95
$$ 256 171 58 45 143 163 92 48 21 142 49 -120 28 56 3 -248 -116 39 -38 19 -140 -131 51 -305 48 -147
4254a47J10j08K28qM2j4j76j6J53P5k04j22K21j35l8O4M1K60j39j03L7J24m1P9
$$ -147 -37 -145 83 75 117 103 -73 -89 64 139 -65 -187 34 -101 -139 -75 -34 226 87 -16 21 145 104 183
4278A83j39N3q7j15L01j65n1q3k5J34r0J37J08j65j92L96lk16l7J15j25L3r5K40
$$ 183 44 97 10 -105 196 31 -20 -103 -128 6 -84 53 161 -4 -196 200 197 -19 -56 59 -66 -33 -128 112
4302A12l67m8K55N5o5K65n07L65R6j61L9m07L47j88K47k43J41J26K15q0k26o3
$$ 112 -255 -303 -48 7 -58 207 -300 65 161 0 39 -368 -21 -209 38 -205 -64 62 277 197 -29 -92
4324i2J83N9j58k36N36m31K76k80J77j00R8Rk12J51J49k51J16j29L57l98p3R2
$$ -92 91 150 -8 -244 292 -139 137 -143 34 -66 32 41 -171 -20 129 -122 -6 -135 222 -176 -249 -157
4346a57Q9J59m3m4J8j81M6K79j84N0J22o5j59J20K0l14K06J04p1o2J99l10N0J3
$$ -157 -68 91 48 4 22 -159 -113 166 -18 32 154 89 -70 50 70 -244 -38 66 -5 -67 132 -178 -128 -115
4370a15j68L68r4Q3q2jk8K3o9P8o4J39mJ29k27m7l4k2J83j72jK51j11j61J47J6
$$ -115 -283 85 -9 74 -8 -9 -37 -14 -83 -5 -69 70 66 195 -32 -79 -113 -135 48 -124 -125 126 15 -146 1 17
4396A7K59q9o5j54J1j96K26J35k39K6j13L71l10o5N8J50j09M6M6p9j51J04q8L23
$$ 17 276 187 122 -32 -21 -217 9 144 -95 -69 -182 189 -121 -186 -128 22 -87 -41 5 -74 -225 -121 -209 114
4420A14j09q8K66j38K40J4n68J46J0L9K54j71J7l7L0k4Kj10J58J3r2K22k25J66
$$ 114 5 -83 183 45 285 299 -269 -123 -113 -74 180 9 26 -11 19 -5 -3 -113 45 58 -34 188 -37 129
4444A29j12P5k29J90j49J23R3k5j01j18J34J5J01l16N13l11R0O1j44J59j85rJ10
$$ 129 17 92 -137 53 -96 27 120 95 -6 -124 10 25 126 -190 323 12 102 163 19 178 -7 -16 94
4467I4O2k27J46J7J6P5k12J53q0P0k24J77r3m4K8K3qk96L63PLj45L4ll0q5J20
$$ 94 156 -71 75 92 108 183 -29 124 44 114 -110 67 -26 -70 -42 -19 -27 -323 40 47 50 -95 -61 -64 -94 -179 -59
4494e9J04J36j57J64l32k65M12l15J87L17Q0m13J91k20p7M01p6k1k39K20l2J6
$$ -59 45 181 24 188 -144 -409 3 -312 -125 192 272 -141 50 -170 -247 154 78 57 -182 38 6 22
4516B2J45p9j73J60K13j50R3j43ml8j78L8R5k3j78n5K90P4k41L18m90M21J35l38
$$ 22 167 88 -85 75 288 138 231 88 84 46 -132 -94 1 -22 -200 -255 35 109 -132 186 -304 117 252 -86
4540h6K99k81r8J77k44J50k85M75k19J98j80K61l48P0J61o2J10j84K49p0o4p6
$$ -86 213 -68 -166 11 -233 -83 -368 107 -112 86 -94 167 -181 -111 50 -12 98 -86 163 93 29 -47
4562d7J33j40J31J28k67J41J02k76M8q2L15k58J45k38K40J6p3J84j71PP6j70R9
$$ -47 86 -54 77 205 -62 79 181 -95 -47 -129 186 -72 73 -165 75 91 18 202 31 38 114 -56 43
4585D3j31K48NJ28m39L07j35J73j52j14J42n0j26n6N9L91l40l6M3P5J60k62o8
$$ 43 -88 160 165 293 -146 161 26 199 47 -67 75 25 -101 -157 -98 293 -47 -83 -40 35 195 -67 -135
4608a35K72m6m48M92j52j53J70r1K99k45J93k79RL73m33J53k29L13j45L40q8k31
$$ -135 137 91 -357 135 -17 -170 0 -91 208 -37 156 -123 -114 259 -174 -21 -250 63 -82 258 170 -61
4630f1J9qP3j5Q2lj82K81k55k50M37j38J51j52K38k01Q2m4k3k2O1j47QJ66Q4p4
$$ -61 -42 -50 23 8 90 87 -95 186 -69 -319 118 -20 131 -21 217 16 98 54 31 9 70 -77 -69 97 181 107
4656A07k50k5R0M5j67J64o7l6J83j29L70m26L33k57Nj80K17n1J64k5o3j18j69
$$ 107 -143 -168 -78 -33 -200 -36 -103 -139 44 -85 285 -141 192 -65 -60 -240 -23 -74 90 65 2 -116 -285
4679b85K96k11M86K0m86RJ93j93J68K05q8k59J4NoJ46J29j29J48k75r6M42l55
$$ -285 11 -200 286 306 -180 -171 22 -171 -3 202 114 -145 -131 -126 -132 14 143 14 162 -113 -209 233 -122
4702a22K67N5l13J89j9O2J14l4j36k6j64J34k04M91j79j52J58q2j40J7K80l56
$$ -122 145 200 -113 76 57 119 233 199 63 37 -127 7 -197 294 115 -37 121 39 -101 -84 196 -160
4724a60M54j62n9k3n1J44J1J13l79o9K52L1j59J99j19L08j95j2j23K6J34J03m37
$$ -160 294 132 73 50 -1 143 154 267 -112 -181 71 102 -57 142 23 331 136 124 1 27 161 264 -173
4747a73K18o7K6J31j28o9M3M9mj00q4J64r5l4R6J9R6Ol11M6J53K5j69R0K60J01
$$ -173 45 -22 4 135 7 -62 -19 30 26 -74 -158 6 -89 -123 -27 -8 88 94 -217 -171 -18 7 -162 -72 188 289
4773B89l17K9L4j4k43J56k4K13l32N2J49o5J49K05j98J13J1k52N4r2%K3j04J16
$$ 289 -28 1 35 21 -222 -66 -90 123 -209 -157 -8 -73 76 281 83 196 207 -45 9 -83 -83 -60 -164 -48
4797d8P7K6J7p0r9J14p3K79k0l31O8n2P3J32k8j01L16l65M2L6j41L44k55j35K07
$$ -48 29 55 72 2 -97 17 -56 223 203 -128 -60 -112 -39 93 65 -36 280 -85 -43 -7 -148 196 -59 -194 13
4822A3l6Pj38J85j62J73j22J31q6P5m7L26j28k10J85k55j6J00R1P6k63J06P6j28
$$ 13 -23 -16 -154 31 -131 42 -80 51 -35 40 -7 319 191 -19 166 -89 -105 -5 86 162 -101 5 81 -47
4846d7k78K55k7j03L24N2l45L96k41q3L08k81J57nk27L7K91k05K4O3q6j48L16
$$ -47 -325 -70 -97 -200 124 176 -169 227 -14 -97 211 -70 87 82 -145 -108 183 -22 2 65 -21 -169 147
4869A47o2q5L5Pk43K38q4L08j81Qj5r3k9J4K31l09L42j78M2j20j49J85j09J8J31
$$ 147 85 0 35 42 -201 37 -47 261 80 88 73 -20 -49 -35 196 -113 229 51 93 -27 -176 9 -100 -82 49
4894D9k45K34J01j98j18Q7J97R6j74M4m0J37j25L0j31J8J04j24J16p8j04R3p9
$$ 49 -196 38 139 -59 -177 -90 107 203 29 73 33 170 45 75 -56 -38 66 -58 58 -20 -124 -31 -110
4917a10J84o3Oj89Q8m1K99k36r4J92k70L16l00J75m7K33j43J54l70L5J81jj58
$$ -110 74 11 17 -172 -84 -125 174 -62 -156 36 -234 82 -218 -43 -90 143 0 154 -216 -181 0 -1 -159
4940a59j8L43n7k20L22%k69J96j09j07J30K38m88N5K92K4k55K27j26p5J20J8j44
$$ -159 -177 166 109 -111 211 211 -58 138 29 -78 52 290 -198 -143 149 173 -82 145 19 -56 64 82 -62
4963f2J23q0J23j36L40l83j28J58K92l38J49j63L08l85J51k75K69j05K0J66P1
$$ -62 61 -19 104 -32 308 -75 -203 -45 247 -91 58 -105 203 -182 -31 -306 -37 -142 -122 44 115
4984A15p3M6l52rP05j09n15K78j56l1J65J11m4J75l68J49k66J4R9K34Q9j10j56
$$ 115 42 88 -264 -273 432 323 -192 86 -70 -101 64 175 131 306 -62 87 -179 -165 -66 168 257 147 -9
5007iM8J15n4k09k13M22j36Q2K27l93q4L72p0k3j58J60o5j98J28LM8M5J71o8l70
$$ -9 39 154 100 -109 -322 100 -36 46 273 -120 -204 168 98 75 -83 77 12 -186 -58 -55 -7 38 209 141 -229
5032b29K36J1J72m59L07J7k16K26R4k29Q7J34l36L49r9K62l62rK14j91K07j47
$$ -229 7 18 190 -269 38 55 -161 65 159 -70 17 151 -185 164 65 327 -35 -44 170 -21 186 39
5054C9r2l6J31l3k3J0Q5m20L70k87J02J59k3oK9M3L7j12j07M4M6J90n5k10%J74
$$ 39 -53 -89 42 9 -14 -4 81 -339 31 -256 -154 5 -18 -24 5 48 85 -27 -134 -90 -44 146 91 -119 -119 55
5080E5j9L7k20Q1j52J72n0J39K41k15k66M6j33K66n3K18r6o6K59k58k4j74K00
$$ 55 36 73 -147 -66 -218 -46 -96 43 284 69 -197 -151 -284 -18 -71 147 51 -15 244 -14 -38 -212 -12
5103a2k9n3L76l18J78k54J45P6p2l4k46K52p4mLr7J86r4K47k18J71l62M82k53
$$ -12 -41 -94 282 -36 142 -112 33 109 37 3 -243 9 -65 -69 -66 -163 23 -71 176 -42 129 -233 249 -4
5127dJ63j68j6J08M7j01Ok40J54n9j31K28J12k4r0k4J26j38r0K90k12o4M48n01
$$ -4 159 -9 -25 83 130 29 35 -205 -51 -110 -241 -13 99 75 -15 -39 87 -51 -141 149 -63 -127 321 -180
5151a80J64L6Jo0N7K7J90K35q02L58j03J76J8%L7J24j32k00J9j41R7r8J79j3J22
$$ -180 -16 20 21 -39 18 45 235 470 -332 26 -77 99 117 117 154 278 146 -54 -35 -176 -79 -177 2 -11 111
5176A11o7O2j02J86l84J48q6Q9l11M48J51k73%m2J43j99K0R1j13M5j3J87J02j4
$$ 111 44 106 4 190 -194 -46 -132 -43 -354 94 245 -28 -28 -70 73 -126 -106 -15 -128 -83 -96 91 193 179
5200A79j64j76J25K5r7l4K98n6J56m40L53j05j57p2K25k01K29j65J56r8J65M2
$$ 179 15 -161 -36 -11 -108 -142 156 100 256 -184 169 64 -93 -165 60 -141 88 -77 79 -19 146 188
5222A88k2k37N8K19k36n3K44j49J9j89J18K15k28r9O7J82k82J08j77K12j41P3
$$ 188 166 -71 -13 206 -30 -83 161 12 31 -158 -40 175 -53 -152 -85 97 -185 -77 -254 -42 -183 -110
5244a10R9j0J01j38J8J02J17j36K53l75N5J64p5j71J78p1p4k45M68k81R6J44j34
$$ -110 -11 -21 80 -58 -40 62 179 43 296 -79 -24 140 65 -106 72 1 -73 -318 150 -131 -35 109 -25
5267b5J25k36K04l24K69n7K14R2k63J03j71J66k63n9K30o6P3Pq9J08j05J10J23
$$ -25 100 -136 68 -256 13 -44 170 262 -1 102 -69 97 -166 -225 5 -61 12 19 -70 38 -67 43 166
5290A66k48J84r4J74k88O4oK10k33j6K40l72L36l07j42L40j11J16j6J03k2j81
$$ 166 -82 102 8 182 -106 -42 -48 162 -71 -87 153 -219 117 -190 -332 8 -103 13 -3 100 78 -103
5312a03K81k72r7Q3K40Q7k55OL04j96j8j45K55k13L8J35k72M64m41K97j76l61
$$ -103 178 -94 -191 -108 132 219 -36 -30 274 78 60 -85 170 -43 -5 130 -142 322 -119 178 2 -359
5334c59K75j83K63J11k45K14j66J4m7J51o6M2k3j34K15J06q8j9j34k4k42K00N3
$$ -359 -84 -267 -4 107 -138 76 -90 -76 -123 28 -38 4 -19 -153 62 168 80 61 -73 -97 -339 -139 -86
5357h6O8k02K41O5L1JN4j04j21m5m8K38n5MJ07j06O0JK2j72J07n4r8J43k27K86
$$ -86 -18 -220 21 86 117 118 172 68 -53 -98 -146 92 37 41 148 42 102 103 125 -47 60 6 -92 51 -176 110
5383A10J08k47QK35k78N9J36j97K71l96J53j19L01j19J07k1j30q8R3k89K23N0
$$ 110 218 -29 -21 214 -64 -5 131 -66 205 -191 -38 -157 144 25 132 111 -19 -107 -14 -303 -80 -30
5405c0J73j92j32o7M11j31m4l4q4J18K77m7m24L61j46o8j0K15p3L1K67m87K76
$$ -30 143 -49 -181 -248 163 32 -12 -46 -130 -12 265 218 -206 155 9 -59 -69 146 73 104 371 -116 160
5428A60j27P6k82J24P4jK29j66j27J5R5o9J06j33P7J76m57K53j31O2Q7j98K03
$$ 160 33 109 -173 -49 25 24 253 87 -40 -25 70 1 107 -26 51 227 -230 23 -108 -46 41 -157 46
5451D6l49M39Q1k52r7n0K67L3k34K45k46p6J55k0N6J45M8j80P0j89K29j45pK40
$$ 46 -303 136 217 -35 -132 -182 85 118 -116 129 -117 -193 -38 -58 -2 143 191 11 81 -108 121 -24 -31 209
5475B09k17l0j11j10L94l6j06M5nJ17j88J44k46R4j90M69j75k38L62k71K37k00
$$ 209 -8 -38 -149 -259 135 99 -7 38 33 150 -38 106 -140 -46 -236 233 58 -180 182 -89 148 -52
5497e2L4q1J94q0k87K70j87K58j18l6Q3n3K87k73R6k25J93K0l17L38k04J13J69
$$ -52 -18 -99 95 15 -272 -2 -189 69 -49 -85 -2 -55 232 -41 55 -170 23 43 -274 64 -140 -27 142
5520A42k23K21k30j32J37q3J38K1j62m9M34l94K19rK5O7k15K80k77J35l3N7p8
$$ 142 -81 140 -90 -222 -85 -168 -30 -9 -171 -220 214 -180 39 30 55 122 -93 187 -90 45 12 69 -9
5543ij75Q5P8J06j0r1J11j56J9K00j27J55k0J8j89l0K70l83J5p2J87M2o9J3o3
$$ -9 -184 -99 -21 85 75 -16 95 -61 -42 158 31 186 166 184 -5 -35 235 -148 -133 -205 -18 24 -45 -32 -95
5568i5K22l44M85k00j94O2O7m7L1j38J47P5J25j87J28r2n1r1j8J17L4J1j14N3
$$ -95 127 -217 268 68 -126 -64 3 -44 -13 -151 -4 71 196 9 137 45 -6 -97 -115 2 36 47 -67 -14
5592a4Q6j29O5k24qK00Ol9J15J78j23k15J50m6j84R8M5J33k09L28j02k34k0J29
$$ -14 72 -57 8 -216 -224 -24 -18 -57 58 236 113 -102 48 2 -182 -84 -39 94 -115 213 111 -123 -143 -14
5616a4p3J52O6o3L8r2N6l5k46K32K21l27n0J68J15k93k6J65M3j26K09k29j33M63
$$ -14 -87 65 131 68 106 14 70 35 -211 21 242 -85 -135 33 148 -145 -171 -6 37 -89 120 -109 -242 221
5640B21j66n9j01N8L31l73MJ55r2m05K51K18J45k36j06K03j89K10k8q6K59m24
$$ 221 55 -4 -105 -47 284 -89 -85 70 -22 -427 -176 42 187 -49 -155 48 -141 69 41 -45 214 -210
5662b10M0J67j46k4J65l11N88k72n4J54j46k3K9J24j88L9K51l20J00J12N5j89
$$ -210 -170 -3 -149 -173 -8 -319 269 -3 -57 97 -49 -72 -43 81 -107 -68 183 -137 -37 75 130 -59
5684e9k5l6J37j55M56n13J40O9J18j99K11J72k96J22m82K86k50L50M0K12j36K10
$$ -59 -84 -120 17 -138 318 -195 -55 14 132 -67 144 316 20 142 -340 -54 -304 46 86 298 162 372
5706C72k43j64J62j31n0J55K41k22j22k4R4L3j60j76J86Pj68R5J22Q4n0J14l09
$$ 372 129 -35 127 -4 -54 101 342 120 -2 -26 68 101 -59 -235 -49 -42 -210 -115 7 91 41 155 -154
5729a54K09k87L64k24j60K69q7K4j21L69k51q6J72j98K88p0n6q0J22r9M7o5J23
$$ -154 55 -232 132 -92 -252 17 -70 -46 -167 202 -49 -135 37 -161 127 57 1 -79 43 -56 -9 -74 49
5752D9j50j1r0K89q9J1J20j94J11j12R3o7j76J37K3J97n7j08oJ32k1Q7o5J14k04
$$ 49 -101 -112 -202 87 -2 9 129 -65 46 -66 27 -40 -216 -79 -56 141 84 -24 -30 102 81 168 103 217 13
5777A3J30k15J34l12KJ48J32J23k44Q2j39J33K18j70N9Qj72K33j47j33M01j88
$$ 13 143 -72 62 -250 -248 -100 32 155 -89 -7 -146 -13 205 35 94 102 -70 163 16 -117 284 96
5799I6K9r3j66j1PJ5J43J27j42K35l08j4N8n4N6Q7j18P4R7l08K31k49j3M83k92
$$ 96 125 32 -134 -145 -138 -123 20 147 5 240 -68 -82 -24 -78 -22 65 -53 21 118 -190 41 -208 -221 262 -30
5824c0J42k44J1K19P9l76J13J30j8k0rJ1P0k1r0j17K12k05L50q8l30M51K8k56
$$ -30 112 -132 -121 98 177 -199 -86 44 26 6 -3 8 78 57 -33 -150 62 -143 207 119 -211 240 268 12
5848A2J89qk34L69l17J37J31m17K31m0K7l7M5k61J6K29q7J13l31J34K95j25k24
$$ 12 201 193 -41 328 11 148 279 -138 93 53 80 43 88 -173 -157 72 -15 98 -233 -99 196 71 -153
5871a53K90k5J45j77J92j90P8n3j04K12k13Jj74L28l16K42j24J72j20P6j4R3k62
$$ -153 137 112 257 80 272 82 160 107 3 215 2 3 -171 157 -159 83 -41 131 11 87 73 166 -96
5894i6N7L54k21J08j03l2m2P9k6L3mj19p7L18n9j84j1o9K60r3N8R1j92j70M9j6
$$ -96 -39 315 94 202 99 67 25 104 78 111 107 -12 -89 229 170 -14 -25 -94 166 73 131 222 30 -140 -91 -107
5920a07L93l21J24l15R0R4M4K71m43K31r6l4K03j05J81l81j41L27j16j2K4K74
$$ -107 286 -35 89 -226 -136 -42 2 273 -170 61 -35 -69 134 29 210 -171 -312 15 -101 -113 -89 185
5942A85m25L71k46J08K29k18J47l31j35M55j89J16M0j81q1K00j58K85J6l75L47
$$ 185 -240 131 -115 -7 222 4 151 -180 -315 140 -49 67 107 -74 -155 45 -113 172 188 -187 160
5963A60l41J32j00M57l01J16k36R4m1jK31j60m3J79j97J7J38P1j31Q7l48K53Q2
$$ 160 -181 -49 -149 308 7 123 -113 -19 -60 -61 170 10 -33 146 -51 -34 104 175 44 131 -217 36 118
5986A18q6l1J00k45o2J29J52k37M9K29o4j8n7J52k60OJ07J34l38L46J90k90k70
$$ 118 32 1 101 -144 -206 -77 75 -162 -113 116 52 34 -23 129 -131 -125 -18 116 -222 124 314 24 -246
6009b46J16J96J40k39O4r1K21k01K75j20J64j35j42J9J5J95k72L6N1N1M1k44j01
$$ -246 -130 66 206 -33 31 -60 161 -40 235 115 279 144 2 21 36 231 -41 -5 46 97 138 -106 -207
6032b07K3K47Q1j21L1k32M25j70J26l20k5J52k28L6L14j11O3K27l54J53p3l18
$$ -207 -184 63 144 23 54 -178 247 77 203 -117 -142 10 -218 -182 132 21 84 311 -43 110 37 -281
6054b81L35J21k60J10j77K56k95K97l19K71l4r5J29K3K58m49N1J9J8M6Q9l12J80
$$ -281 54 175 -85 25 -152 104 -191 106 -213 58 24 -71 58 81 339 -110 -59 -40 -22 24 113 -199 -19
6077a9p6K32l38K11O6o2q8P5J37k31M3J69J1q0M4j60K19k89J81r1j20J89L0J7
$$ -19 -95 137 -201 10 76 14 -74 1 138 -93 -50 119 130 50 94 -66 153 -136 45 -46 -166 23 53 70
6101G0k19J42j6No3J49l2R1j40n8K23j01p8J08j16J95j58OMk04K54o9k08%K85
$$ 70 -149 -7 -23 -18 -81 68 36 127 -13 -71 152 51 -27 81 -35 160 2 8 12 -192 62 -7 -215 -215 70
6126G0j61J84k30K87j03Mq4J93k9n7p0k70L43k7N4r5J10n1m3j2q1K66j45N9j23
$$ 70 -91 93 -137 150 47 51 -33 160 131 74 4 -266 77 50 104 9 119 68 25 13 -68 198 53 112 -11
6151a1K2p8M2L3k06M51l10J45j61J8k35J60K11j13j26QJ93k25j4K11N8J8K53m35
$$ -11 11 -67 -25 8 -198 253 -57 88 -73 -55 -290 -130 81 -32 -158 -150 43 -182 -196 15 73 91 344 -91
6175i1J43k8j07%J09j91K64k12mO9P5J96j17L3k47K69p5r1k63K68n8r4K74l6L8
$$ -91 52 24 -83 -83 26 -165 99 -113 -117 -48 27 223 106 139 -108 161 86 -5 -268 0 -58 -152 122 86 124
6200A24j98j18J20J15M3P1j64k38M47k03O5k02J55m08K09K88j17N6K3Lo9k1K24
$$ 124 -74 -192 -72 43 86 157 -7 -245 202 -1 64 -138 17 -391 -182 106 -11 45 68 71 2 -19 205
6223B05o6k54O6K34k34j37J33K9K37j90p3L65j70k97r2P8J43jp3J40k1q3j8R5
$$ 205 139 -115 -49 185 -49 -186 -53 -24 213 23 -50 315 145 -152 -244 -166 -23 -24 -97 43 22 -61 -79 16
6247A6K10j22K5l4J5M5j32j99J73l20J82J97K76m35K89j95R4M0k8j55L58m02K29
$$ 16 226 104 129 95 110 155 23 -176 -3 -323 -141 56 332 -103 186 -9 85 125 97 -58 300 -102 127
6270A27j35j6L15k62r8J7R6q4K4N1j03K03k14J62K06l13j1J21N2l4j85J31r6K
$$ 127 -8 -24 291 29 -69 -52 44 -40 -16 35 -68 135 -79 83 289 -24 -35 86 138 104 -81 50 -46 -44
6294d4k25M57k43K5o4o6N2m8J05J90j34N4K0j24Pq9K82l24J55k59L60l0j57J38
$$ -44 -269 188 -55 -30 -94 -160 -108 -156 -51 139 5 59 79 -45 -38 -127 155 -169 -14 -273 87 57 -100 38
6318C8J27k93L3j23L52o3k40O36o37K82j8K9m36J99p9jJ19J28j8KJ75k07j9p6
$$ 38 165 -128 -95 -218 134 71 -169 467 -170 112 94 123 -313 -114 -193 -194 -75 53 35 37 212 5 -14 -90
6342i0L61k53N4m7j00J14j44K95j86J30k00j15K7M55l76j03J50Q0o3kK7J24j02
$$ -90 271 18 72 25 -75 39 -105 190 4 134 -66 -181 -154 301 -75 -178 -28 52 -11 -13 14 138 36
6365C6q0Q3J6oj37J38m7N1O1r1Q1k81J72o7M67o49L39j25J46j70Q3L7j90M52m14
$$ 36 -44 39 55 49 -88 50 3 54 115 24 105 -176 -4 -71 396 -253 86 -39 107 -63 20 57 -133 319 -95
6390i5N5O9P4j11O0J1M5k06K0J78k6j64K39k9P7l22K62l8j51J33p2j30J08J86
$$ -95 -40 29 103 -8 52 63 108 -98 -78 100 74 -90 149 120 197 -125 137 99 -52 81 9 -121 -13 173
6414A73l55L26r6j66K52l16K08k53K21P2k20KM6K12p3R8q3N5o2q3j49P2L22j46
$$ 173 -182 144 48 -118 134 -182 26 -227 -6 66 -154 -152 -106 106 33 131 48 103 41 -42 -191 -119 203 57
6438E7M6j92J57k90J5L49l91K58j28J94L8j28j61nK7L6L18j40k2K24j91K37l89
$$ 57 103 -89 68 -222 -207 142 -249 9 -119 75 113 -15 -176 -181 -154 -118 200 60 38 262 71 308 -81
6461h1K27J5J51l8l57k1N2o5K03K36k82J1k05J06j4K39k60L2J11j82j14K99l20
$$ -81 146 161 312 274 -83 -104 -52 -117 86 322 40 51 -154 -48 -62 177 -83 -51 60 -122 -236 63 -257
6484b57M59k13O2m3j60J86j66L12k12K66j07J0l16Q6J90o4k2j55L27k52J20k76
$$ -257 202 -11 51 8 -152 34 -132 180 -32 234 127 137 -179 -93 97 33 11 -144 183 -69 51 -225
6506b25O2J96K03j22j62N9Q0l53L75Q0l30J50J24j86L89k25j28k0j15K4K22k82
$$ -225 -163 33 236 114 -48 11 91 -262 113 193 -137 13 137 -49 340 115 -13 -33 -148 -124 98 -184
6528a84K88j60J9j80M9J61j75J01J21K9K5j53p2P2q3K42K3J16k29L3R1j03r8M54
$$ -184 104 -56 -37 -217 -168 -7 -182 -81 40 69 94 -59 -131 -59 -142 100 123 239 10 43 134 31 -67 387
6552C87l10K03N6n27K90M5j37j1j36K49l67L19J63l2r0j26mN6k7j15K53l91K34
$$ 387 77 280 336 -191 99 144 7 -4 -140 109 -258 61 224 192 102 -24 -28 28 1 -114 139 -252 -18
6575a8N2m8N4Q6j42K6j51J58j14P4J62j45q5M4J9J71O1o9p2o5m1L3P3J1J98j69
$$ -18 34 -14 40 126 -16 10 -141 17 -97 -23 139 -6 -91 -47 -28 143 204 135 63 -2 -43 -10 63 74 272 103
6601A03k49J77k38M39k41m5P4N8k12K5J61Rk8j87J25p6J36Q4j51PL1K85j10J08
$$ 103 -146 31 -207 232 -9 -54 20 78 -134 -109 52 61 33 -154 -29 -105 31 115 -36 -29 2 287 177 285
6625B85l27o4M4mp1J60m0p2J8K49j57k6j78N0J34O8j98R6QJ36j08k81N07m56J86
$$ 285 -42 -106 -62 -66 -137 23 -17 -89 -71 178 21 -5 -183 -133 1 69 -129 -33 -25 111 3 -278 229 -227 -41
6650d1M6l6K34J9k51J12l7r9j6k3K00J56k47Ko5J41j56J91j40R5j72N6J5o7N2
$$ -41 5 -31 203 222 -29 83 46 -53 -69 -92 108 264 17 19 -46 95 -61 130 -10 85 -87 -31 -16 -83 -31
6675c1j01P5R7pO6k41m6K93Ql48J73J20k76J15K0J42R6k09M9K2J26l34J25N4k03
$$ -31 -132 -57 40 33 99 -142 -188 105 113 -235 -62 58 -218 -103 -83 59 155 -54 -5 17 143 -191 -66 -12 -215
6700b15K03J26P4j17J46j31j24K89m2j31l43L14nj90J19Q2J32L5K4j36j10j43
$$ -215 -12 114 188 71 217 86 -38 251 209 78 -265 49 44 -146 -27 55 187 222 246 110 0 -143
6722a43L26j29l39L91j90J22k26M23k07m2J14j50j05L01r0kJ03o8J6k6j37J05
$$ -143 183 54 -285 106 -84 38 -188 235 28 -14 100 -50 -155 146 56 54 157 89 105 79 -58 47
6744D7K6j94K38j42p9j68L12j56K32j04Pj22K34k42J5K50q0rm3n3m6P5k7N4M81
$$ 47 73 -121 117 -25 -104 -272 40 -116 116 12 19 -103 131 -111 -96 154 74 65 22 -31 -77 -2 -29 25 506
6769E06n67o9M15k54o9L4r2M6oO3j13j10K75k96K9M3K93n0k12L96l09j81L35q2
$$ 506 -61 -130 285 31 -38 -4 -96 -50 -56 7 -106 -216 59 -237 -208 -165 128 78 -134 262 -47 -228 107 25
6793B5K30j61j88n4j85M24j92Nr8J93K15k38J37j03j88K54j53N6o9Q1M2L9k35
$$ 25 255 94 -94 -148 -333 91 -101 -96 -194 -1 214 -24 113 10 -178 76 -77 -21 -90 -9 33 72 -163
6816a63L11j91O7l2N7p3J46k03J19j04j27L84k23k3M5j06J90j4k83K26M9k42K33
$$ -163 148 -43 24 -8 49 -24 122 -81 38 -66 -193 191 -32 -55 -10 -116 74 60 -223 3 52 -190 43
6839D3m1oQ3l52K83l3j35L3P9J23r5J40r0k5j78J95r8P9l3J84m78K37n0J24j99
$$ 43 2 -4 79 -273 10 -23 -158 -125 -46 77 -18 122 32 7 -171 24 -74 5 -28 156 -322 -85 -135 -11 -210
6864b10J54J89m0om4m9O2L2j60O0l32J70O6K51j47o3J50j28J12J16Lj53K01j00
$$ -210 -56 133 93 87 43 -6 56 88 -72 -12 -344 -174 -108 143 -4 -67 83 -45 67 183 186 33 234 134
6888A34n0k04L42R9m13j42K00J65j16J71k40J27j22K5L26l13K4J0k92L65k11K22
$$ 134 84 -120 222 321 -92 -234 -34 131 15 186 -54 73 -49 -24 302 -11 13 23 -269 96 -115 107
6910A07j42r2Q5R4k70N05l07l5N1J85l40p9J41n0J76j52K19o5Qk51R0K90r0N5
$$ 107 -35 -127 -42 52 -218 287 -20 -55 -4 181 -159 -238 -97 -147 29 -123 96 31 39 -212 -122 168 78 133
6934A33k6p9k3j20J67j14J15k00j28J32L82k28j65J30J46j16k68M18j01k75J00
$$ 133 107 28 5 -115 52 -62 53 -147 -275 -143 239 11 -154 -24 122 6 -262 156 55 -220 -120
6955a20J61j17j34J75k50K51J0k31K57k10K55j03k6K71m1j11N4j3j21p6R9o9N7
$$ -120 41 -76 -210 -35 -285 -34 -24 -255 2 -208 47 -56 -82 189 148 37 91 78 -43 -119 -20 -89 -32
6978c2O8J8lr4K57j06n6k9OO1j05PRP3N0k01r9M41r5k05n6N0K97l17Jr1rM62j9
$$ -32 36 54 51 -43 214 108 52 23 29 90 -15 -8 1 74 124 -77 -176 265 170 -35 -91 -41 256 -61 -60 -151 -160 302 283
7007B83k54j24J0J05j03K90j08J6j89j0P1j61L36j35K32l12N8m0l25N84l21J83
$$ 283 29 -95 -85 20 -83 207 99 115 -74 -84 -13 -174 162 27 259 -53 5 -35 -360 224 -97 86
7029H6k5J23J38k69K08j25j96K70m02Q8j38M03J23l19J37j6N8q9PP5k8j71K8J74
$$ 86 61 184 322 53 261 136 -60 210 -192 -104 -242 161 284 -35 102 86 144 55 62 137 109 -62 -34 140
7053A40j95p4K70j01O5L1k51N8l2L44q7l89L4J68J87l78L05k08l6M16k71k90M57
$$ 140 -55 -129 141 40 105 136 -115 -57 -89 255 168 -221 -187 -19 168 -210 95 -113 -149 267 -4 -294 163
7076A63k41j52O3K24q6J28M2N4k76k11N78k72j24J2j2K90k73n3J96j59J15k5O1
$$ 163 -78 -230 -167 57 -29 99 141 195 -81 -292 286 14 -110 -98 -110 180 -93 -146 50 -109 6 -19 42
7099D2m7o9p0K25Jj34L8o1Km8L46j4j25J03j18j46L6J66j7j49J54m9j93Kq7R4
$$ 42 -5 -74 -144 81 82 -52 -14 -75 -73 -121 225 211 86 189 71 -75 -39 127 110 -39 115 66 -127 -125 -212 -118
7125a18O0O0P3p1j53J3K42p7QJ24k79J19l2K77j31P2o9l44J50n1j10J50o4J63
$$ -118 -58 2 75 4 -149 -136 106 29 37 161 -118 1 -31 246 115 187 118 -226 -76 -127 -237 -87 -151 12
7149A2l09L48j0K5J8N2j82j47J78l4j3o4J00J88l14o2O7K53l7j37j52M26j20j08
$$ 12 -297 51 41 66 84 136 -46 -193 -15 -49 -62 -126 -26 162 -152 -214 -147 106 69 -68 -220 206 86 -22
7173b2J77m9O7j34r7m5K40j86J38m2rn3JKk69M4K99j49K09l13L04k20L30j93j40
$$ -22 155 106 173 39 -58 -103 137 -49 89 47 38 -15 -14 -12 -281 -237 62 -87 122 -191 113 -107 223 30 -110
7198a10K65j07k64L14r2j1Q6q4P7j70J78m1j29R0P3o3O7R2j97p9n2J02K77k33
$$ -110 155 48 -216 98 6 -5 81 -3 74 -96 82 41 -88 2 75 12 79 171 -26 -105 -157 -55 222 -11
7222a1K61l24K23r6j13O7O4l9j74L23k15J77j82K56q9k45M43o40L27j8J24m71
$$ -11 250 -74 149 53 -60 7 71 32 -142 181 -34 143 -39 217 128 -117 326 -314 13 -5 119 -352
7244c52K56m4J22m4k63O19l73M6J85j15J4q8j44J28j02J22J16Kj10K88j72j51
$$ -352 -96 -140 -18 -62 -325 294 -79 -33 152 37 51 -37 -181 -53 -155 -33 83 85 -25 263 91 -60
7266f0O7j06K31l81L28k8k72K38kk1N1r8J04j72K12O1j91J50p2l0j92O14n71j
$$ -60 7 -99 132 -249 79 51 -221 17 15 -6 45 -53 51 -121 91 152 -39 111 39 9 -183 431 -140 -141
7290a41J64r1L71m43J44Q9j01j97K46m7j43K16L5l08J91J26j52L15j31j68J5R8
$$ -141 23 -68 303 -140 4 93 -8 -205 41 -6 -149 67 102 -206 -15 111 -41 274 143 -25 -10 88
7312H8q4j2K31j29l22K25k0L44k13k39Q1n9N1L14k16k55K05lJ07N5j4o6J7k46
$$ 88 4 -8 223 94 -228 -3 -23 321 108 -131 -50 -109 -58 256 40 -215 -10 -13 94 149 135 69 86 -160
7336a60P4L22l03J85k82L15j29P9o6k69K97J5m35J18L04k57L2m6K53N8k49J94
$$ -160 -86 236 -67 118 -164 151 22 101 35 -234 63 78 -357 -239 65 -192 -160 -206 47 105 -144 50
7358E0K46l85J07L2m6j3m3M5K20l40L64n56L41J59l27L32j71j50K66N1k79j08
$$ 50 296 -89 18 50 4 -9 -52 -7 213 -127 237 -319 22 181 -146 186 15 -135 131 182 -97 -205
7380b05J72k4k22J84J16k11J33o9nkj58M31M1j87K56j79p6O7M0j50J33j96M6K41
$$ -205 -33 -57 -279 -95 21 -190 -57 -126 -131 -133 -291 140 181 -6 250 71 -5 62 102 -48 85 -111 -65 176
7404A76m01K41M2p5M8O4q8J62j07k60K39J39j81M9M7K7m07M64R5m93N18k72q2
$$ 176 -225 16 58 -17 31 95 7 169 62 -198 41 180 -1 48 95 122 -285 179 274 -219 299 27 -55
7427e5j2O0PM3k39R9J01l69L69j30K70k24J08j28J41j30J60l9k24K83k90L36j59
$$ -55 -67 -7 0 43 -196 -97 4 -365 4 -126 144 -80 28 -100 41 -89 71 32 -192 91 -199 137 -22
7450b2j83P8J08j20M04j53j5j70J39Q2l07N7N2j29N6j05K67j51N7k6m3J67LK30
$$ -22 -205 -127 -19 -139 265 112 97 -73 66 148 -159 -102 -50 -179 -123 -228 39 -112 -55 -81 -124 43 46 276
7474B76j63p9k5j53L98j05j38J4J65k05l7L5J10j01J80J9j02Pn7L9j63K21M2j96
$$ 276 113 34 9 -144 254 149 11 25 190 -15 -52 -17 93 -8 172 191 89 96 39 78 -85 136 178 -18
7498a8P2jL1p3J8M2j59J84K0j73j03j56L88l23n8L52K30l85J98L2p7p5k23J50
$$ -18 54 53 84 11 29 71 -88 96 116 -57 -160 -316 72 -251 -309 43 273 -112 86 118 41 -34 -257 -107
7522a07J84L1j17N3j81O9r6K88N0k60J22L14m37k3J92j92L9K38N6j92j05L88l44
$$ -107 77 108 -9 44 -137 -68 -164 124 174 -86 36 350 -87 -110 82 -110 -71 167 223 31 -74 314 -30
7545c0J3j08R7N3k15k6K76J4o3K5j79J75q2K32L6j65j67K94j56o9q5Q1M7R7q8
$$ -30 -17 -125 -28 25 -190 -216 60 74 11 36 -143 32 -50 182 218 53 -114 180 24 -45 -130 -49 -2 95 7
7570GQ5k72m8J78j44J30P7L5M7M4oj88K45J50j27j85J01p2j4o5j15J81k32K49
$$ 7 92 -180 -228 -50 -194 -64 13 48 95 139 133 -55 190 340 213 28 129 57 43 -22 -137 44 -188 61
7594F1L3J84l12P7P7L43n14l1O2J7j23N0J53l1p2j0N8L8QL4j25O7J62j88m2J84
$$ 61 94 278 -34 43 120 463 -51 -82 -20 -3 -126 -76 77 46 -26 -36 22 60 68 102 -23 44 206 18 -24 160
7620A60l97J42L07k32O0j67j0K68j79J35o6l9O3q4K05k88N7N7j24K30j23K5o7
$$ 160 -237 -95 212 -20 40 -127 -137 131 -48 87 21 -18 45 -39 166 -122 -65 -8 -132 98 -25 0 -67
7643f7J58j69N4l8R8P5k78J14J48L6L0j84J68k25L0O6j22M61j97p4l75N71m12
$$ -67 91 -78 -24 -62 36 111 -167 -53 95 131 161 -23 145 -80 -50 16 -106 355 158 84 -291 280 -132
7666a32J56O2k97K72J34j94k9k9lPk5J43L7p2k48L95k44j3j9K24q4O2m0j49l8
$$ -132 24 86 -211 61 195 1 -28 -57 -60 -53 -78 65 102 30 -218 177 -67 -80 -99 125 41 103 63 -86 -124
7691a24K49j00j6l87K43K8R2l18L68k6M2J2j64J44P4j26L2o6P0k01p2J59P4l7
$$ -124 125 25 9 -378 -135 -107 -15 -333 35 9 51 63 -101 43 117 -9 23 -43 27 -174 -246 -87 -13 -50
7715e0J27J35k76J00O1n5j02J70j14M1j4J77l37l8O5j62L53j18j26J16J60j56
$$ -50 77 212 -64 36 97 42 -60 110 -4 37 23 200 -137 -175 -110 -272 81 -37 -163 -47 113 -43
7737d3m0k18L68o4RK71m94K29k00P6J07j49P6L3J26R7L2k82N7qJ02o9m0N5o3K06
$$ -43 -83 -301 67 3 12 283 -211 18 -182 -106 1 -148 -72 -39 87 184 216 -66 -9 -17 85 16 -24 31 -32 174
7763A74k77m2K76l03J85O4j36K94r7Nj46j35P5o7M1J11L22O3m38m09N39N5n3k03
$$ 174 -103 -145 131 -172 13 77 -59 235 138 143 -3 -138 -63 -130 -89 22 344 407 -31 -440 99 154 101 -102
7787a02r8L37P0q4k39J2J72K47n12J08Q8K00k74J99k40M2K9J55J24m26K16k24
$$ -102 -200 137 207 123 -116 -104 68 315 -197 -89 -1 199 -75 124 -116 -74 -45 110 234 -192 24 -200
7809b00J74k5J75j32O7o7j8K21l00L5q7K11J52l80K11k86K74P5O1o8k28M29l01
$$ -200 -26 -51 124 -8 59 -8 -26 195 -105 -70 -157 54 206 -174 37 -249 25 100 161 93 -135 294 -7
7832gp7J34k49J56J04K94k19O2n2k0r5k4p9Q6o8l5J94j40J2P1Q2oP8M9k46P3n2
$$ -7 -84 50 -199 -43 61 355 136 198 146 126 31 7 -72 14 -54 -89 105 -35 -23 48 130 124 202 251 5 78 26
7859B6L81n87K57l52J83q2q8J16K34j8k2k00O5M0J69j61j9J75l48M05r9k42J59
$$ 26 407 -180 77 -275 -92 -174 -262 -146 88 70 48 -152 -87 -47 122 -39 -58 117 -231 174 75 -167 -8
7882hL04j59m59N69j59k12o4K24Jm4p0m6q7K93j03J96j10l45l4R1M81l33r3K74
$$ -8 296 137 -322 247 88 -124 -188 36 37 -7 -77 -123 -210 83 -20 176 66 -279 -313 -222 259 -74 -167 107
7906A07l52L91k40L10N6l76J8J25m3m8M9Oj05j5O4m9J14j54M0K11N5m6k30J18
$$ 107 -245 146 -94 216 272 -104 -86 39 -4 -52 -3 3 -102 -117 -53 -102 12 -142 -102 109 164 118 -112 6
7930Fj35K77k65J09J23k29L11k84%K36j27j37K93l23K15J1l45K58q4L0j8j62K51
$$ 6 -129 148 -117 -8 115 -114 197 -87 -87 149 22 -115 178 -145 70 81 -264 -6 -90 -60 -78 -240 11
7953A1n9K15q6j98J0K99m29K36J34p9k80M11l22L5J52K4J0j35J36Nk2q6mJ07J0
$$ 11 -48 167 81 -117 -107 192 -237 -1 133 54 -226 185 -137 -102 50 74 84 -51 85 90 68 -18 -22 85 95
7978I5j04l4j39J89R2k1q8l3J28j27J40j07n3R5k18K56n2m1O9L5Pk09K09M1k75
$$ 95 -9 -43 -182 7 99 78 -10 -43 85 -42 98 -9 -62 33 -185 71 19 -22 47 82 89 -120 89 130 -145
8003a45J2J58K3p6p9j54J35N9J52k69M27k38j00L27m83M49k51j05K18N4j61l2
$$ -145 -133 25 48 -28 -107 -261 -126 -67 85 -184 243 5 -95 232 -251 198 -53 -158 60 114 -47 -79
8025g9J53K7k72J51j60K03j38J76j29K9M5LR7j55J46J42k28R5J44l84J88j30J02
$$ -79 74 101 -171 -20 -180 23 -115 61 -68 -39 6 9 106 -49 97 239 11 106 250 -134 54 -76 26
8048B6j01P8j09J7n0N4j69M78k58PO3k17q4K64K29j69R7p9J63k15%k08J28J37
$$ 26 -75 3 -106 -89 -139 -85 -254 224 -34 -27 36 -181 -265 -1 228 59 156 77 240 25 25 -183 -55 82
8072H2J36m53M92k87r7Q4l6r2Q5J42J7j99J08j00R0j49J06L16k26j84K13j08j85
$$ 82 218 -235 257 -30 -127 -43 -79 -171 -86 56 73 -126 -18 -118 -28 -177 -71 245 19 -165 48 -60 -245
8095b45K28r5J17kj59J35K6n4N0j90K33J37k78J32J87l0K9L6k5l53L89m00L26
$$ -245 -17 -112 5 3 -156 -21 5 -49 1 -189 44 181 -97 35 222 192 221 257 232 -121 268 -132 194
8118A94j43k03j5J87l13K79Om8J70Oq6r8k99L54q7o5mL49l8r7n7n1K16k64J57
$$ 194 51 -152 -167 20 -293 -14 -8 -56 114 120 34 -64 -363 -9 -96 -161 -165 184 146 49 -8 -59 157 -107 50
8143E0j39K32j6j96J09k35RK32j05K60j84k50PK06J38k56n9K57M6J75l40l3O6
$$ 50 -89 143 127 -69 40 -195 -186 46 -59 201 17 -233 -226 -20 118 -138 -197 60 106 281 -59 -92 -26
8166b6L92n57O06m77m6K08k06K46lq7M0J4m0J9K47n27L6K97m43R2J28j7lL68k74
$$ -26 366 -191 415 -62 -108 100 -106 140 137 50 90 104 64 83 330 -197 -161 136 -307 -215 -87 -104 -107 261 -13
8191a3
$$ Imaginary data points
##PAGE= N=2
##DATA TABLE= (X++(I..I)), XYDATA
0@%%%%%%%%%%%%%%%%%%%pJ5j6J6j6J6j6K4l2L2l4M2m8N5o3P1q0Q9j03J13j23J38
$$ 0 0 0 0 0 0 0 0 0 0 0 0 0 0 0 0 0 0 0 0 -7 8 -8 8 -8 8 -8 16 -16 16 -18 24 -24 31 -32 39 -41 48 -55 58 -65 73
41G3j54J70j88K11k32K56k85L11l42L77m15M59n06N59o20O88p66Q58r66J095j251
$$ 73 -81 89 -99 112 -120 136 -149 162 -180 197 -218 241 -265 294 -326 362 -404 454 -512 583 -668
62f68J448j707K061k573L375m850Q395l1588l4380N7819O579j0222J8513M3882
$$ -668 780 -927 1134 -1439 1936 -2914 5481 -26107 -60487 -2668 3911 -6311 12202 56084
76E6084J4678k9581N082K8018l8603l3129R133M451j4741j8009J8024K2416l4342
$$ 56084 70762 41181 46263 74281 35678 2549 11682 16133 1392 -16617 1407 23823 -10519
89a0519j3659J7299j5904k6465q745J6459J4930j6655J9114M2223l558o586J2467
$$ -10519 -24178 -6879 -22783 -49248 -57993 -41534 -26604 -43259 -24145 18078 14520 7934 20401
102B0401R482p176k5678J1732K3178k0239k118K5607L703j4783j8578O355l509
$$ 20401 29883 22707 -2971 8761 31939 11700 9582 35189 38892 24109 5531 11886 8377
115H377m2904o010K1498j2742r336J4376K2431J00k0546J6530J5549k8503l114
$$ 8377 -34527 -40537 -19039 -31781 -41117 -26741 -4310 -4210 -24756 -8226 7323 -21180 -24294
128b4294K0987O775j705K898K7472J0468k3184N697J0175k0811j4526k406P218
$$ -24294 -3307 3468 1763 4661 32133 42601 19417 25114 35289 14478 -48 -2454 4764
141D764k817j4202J6571J1757j7628j459L101m973r245j0872J3920Q154j0266
$$ 4764 1947 -12255 4316 16073 -1555 -3014 87 -4886 -14131 -25003 -11083 -2929 -13195
154a3195J4872J5741n51q25m362N836m627j9657P605O436r737K203M525N404n495
$$ -13195 1677 17418 16867 16042 11680 17516 12889 -6768 837 7273 -2464 -261 4264 9668 4173
169D173j5010O657l706j9925K946N145k98K218L006J5479J753r701J1188N22q937
$$ 4173 -10837 -4180 -7886 -27811 -24865 -19720 -20018 -17800 -14794 685 2438 -7263 3925 4447 -4490
184d490K901P08O240K015k322J2840p28q720L782p300o349l016q213M623j188
$$ -4490 -1589 -881 5359 7374 5052 17892 17164 8444 12226 4926 -1423 -4439 -12652 -8029 -9217
199i217l323R856k246n25M827p143K306J350l427P243J154M556R669l036N974
$$ -9217 -12540 -2684 -4930 -5455 -628 -7771 -5465 -4115 -7542 -299 855 5411 15080 12044 18018
214A8018L847q092J696l538m465J396p071K632L190q672K617j677o582m45q217
$$ 18018 21865 13773 15469 11931 7466 8862 1791 4423 7613 -1059 1558 -119 -6701 -7146 -15363
229a5363R01K593p258O571O724j599M733n7M972L182q425O964O126p139L736L880
$$ -15363 -14462 -11869 -19127 -12556 -5832 -7431 -2698 -2755 2217 5399 -3026 3938 10064 2925 6661 10541
245A0541K586n76q523O490J54j5602J974K958n883l438k139Q538j873j2311R753
$$ 10541 13127 12551 4028 10518 10672 -4930 -2956 2 -5881 -9319 -11458 -2920 -4793 -17104 -7351
260g351M804j0268J160N458N734k476l765J5496K472j1765P201N893l922n419
$$ -7351 -2547 -12815 -11655 -6197 -463 -2939 -6704 8792 11264 -501 6700 12593 8671 3252
274C252j261J0210m710j2439J0741K360j1118l032J005M080q762q149J4417J028
$$ 3252 1991 12201 7491 -4948 5793 8153 -2965 -5997 -4992 -912 -9674 -17823 -3406 -2378
288b378j1445O897P548N99o990l36J4511m752j0960J3955O835o502k598N317Q391
$$ -2378 -13823 -6926 622 1221 -5769 -6105 8406 3654 -7306 6649 13484 6982 4384 9701 18092
303A8092j2068j0086J4192k563j4337K861P204R89j1528p77J5057r168j3670J1396
$$ 18092 6024 -4062 10130 7567 -6770 -3909 3295 4284 -7244 -8021 7036 -2132 -15802 -4406
317d406M539o752l808Q466J2308j0245m301J7388k432j2521K241O561K98j1588
$$ -4406 133 -6619 -10427 -1961 10347 102 -4199 13189 10757 -1764 477 7038 7336 -4252
331d252J584J6127q295j0735R228K098q558r738L948R020j3040m153J6908L73
$$ -4252 -2668 13459 5164 -5571 3657 5755 -2803 -12541 -8593 427 -12613 -16766 142 515
345E15p978J803Q387K760j4152Q57J5550p631p093J0958P323k333q336N982R217
$$ 515 -7463 -5660 2727 5487 -8665 -7808 7742 111 -6982 3976 11299 8966 630 6612 15829
360A5829j6049p109J1857k510q653k06R885M356j3451K073J2576j0502r151N595
$$ 15829 -220 -7329 4528 2018 -6635 -6841 3044 7400 -6051 -3978 8598 -1904 -11055 -5460
374e460M827k190p631J0638J1806j1295j190J0962k811q370m186O839K755j2544
$$ -5460 -633 -2823 -10454 184 11990 695 -495 10467 7656 -714 -4900 1939 4694 -7850
388g850M533J2697o318m782L322L102m731j2189N946P276j0789R38J0891K086
$$ -7850 -3317 9380 3062 -1720 1602 4704 -27 -12216 -6270 1006 -9783 -8845 2046 4132
402D132k646k735Q135J418j3848K387Q192n208k453M138P678m4r399N925M082
$$ 4132 1486 -1249 6886 8304 -5544 -3157 5035 -173 -2626 1512 9190 9146 -253 5672 9754
417I754j2903k867L629r7l107k557J0099L802r331M434M845o084l644o52N258
$$ 9754 -3149 -6016 -2387 -2484 -5591 -8148 1951 5753 -3578 856 5701 -383 -4027 -4679 579
432E79k32n610R443O020n827J347J488j348n097o818M884k01p678M970L676j812
$$ 579 347 -5263 4180 10200 4373 5720 7208 5860 763 -6055 -1171 -1372 -9050 -4080 -404 -2216
448b216m24k308K746l038p905M395J567k670M457K928N692J523k661N712q47n924
$$ -2216 -2640 -4948 -2202 -5240 -13145 -8750 -7183 -9853 -5396 -2468 3224 4747 2086 7798 6951 1027
464A027K120k99L50J027p67N627l04m651L264l732n195j139m393J562l73j795
$$ 1027 3147 2848 3198 4225 3458 9085 8781 4130 7394 3662 -1533 -2672 -7065 -5503 -5876 -7671
480g671N896N92o63L608k740J11M34l343L673P34J080N648l23K548K648m352K3
$$ -7671 -1775 -1183 -1846 1762 -978 -867 -433 -3776 -103 631 1711 7359 7036 9584 12232 7880 7903
497G903k335m398L14m535J256K199m578K685J798m624r10k708q51p4m841M734
$$ 7903 5568 1170 1484 -3051 -1795 404 -4174 -1489 309 -4315 -5225 -7933 -8784 -8858 -13699 -8965
513h965M438k234M574L577R46Q63l509L408Q65n844L485L624j410J313m4K772
$$ -8965 -4527 -6761 -2187 1390 2336 3199 -310 3098 3963 -1881 1604 5228 3818 5131 5087 7859
529G859j506p514K733k54p233N71J090K278l90k795P214R69p424L048K056k625
$$ 7859 6353 -1161 1572 1318 -5915 -5344 -4254 -1976 -2366 -5161 2053 3022 -4402 -1354 702 -1923
545a923j462J61P192j46m943P762K482n669j100M31J360n147m910Q437O1p159
$$ -1923 -3385 -3224 3968 3822 -1121 6641 9123 3454 2354 2785 4145 -1002 -5912 2525 2586 -4573
561d573M095L605k204m208j638O211m148o815P795K880l383L9M012M734n625m718
$$ -4573 -478 3127 923 -3285 -4923 1288 -2860 -9675 -1880 1000 -2383 -2344 1668 6402 777 -3941
577c941Q257j774p714L022M056K34m438M53Q314m793p147O179R52m770k037L497
$$ -3941 4316 2542 -5172 -2150 1906 2140 -2298 -1845 6469 1676 -5471 708 1660 -3110 -5147 -1650
593a650N864n397k319J0222q43o519J849L505k35o473M24R269n097n768O819J726
$$ -1650 4214 -1183 -3502 6720 5877 -642 1207 4712 4477 -1996 -1572 7697 2600 -3168 3651 5377
609E377m550m520K412M310q618l361R223j594n205J540N025J630p429J300R159
$$ 5377 827 -3693 -1281 3029 -5589 -8950 273 -1321 -6526 -4986 39 1669 -5760 -4460 4699
624D699n676m383O634K757k041l824M993N751q707k490Q129k572n519n61M373
$$ 4699 -977 -5360 1274 4031 1990 -1834 3159 8910 203 -2287 5842 3270 -2249 -2810 1563
639A563J072q361J529Q319o235m906M629K618k154n283M999O497p328o21Q071
$$ 1563 2635 -5726 -4197 4122 -2113 -7019 -2390 228 -1926 -7209 -2210 4287 -3041 -3662 4409
654D409o48l416m30N402K041q048J956P304n448l244K734K461j995o456M152L864
$$ 4409 3761 345 -85 5317 7358 -690 1266 8570 3122 -122 2612 5073 3078 -3378 774 4638
670D638q060j205N255r84l442j743M762J652p400K898O090l450k163K154L459
$$ 4638 -3422 -4627 628 -356 -3798 -5541 -779 873 -6527 -3629 2461 -989 -3152 -998 2461
685B461r42n181N057L925o447M76L857j99j922k829M348N42p101K334L901l817
$$ 2461 1519 -3662 1395 5320 -1127 -651 3206 3007 1085 -1744 2604 3146 -3955 -1621 2280 -1537
701a537q31K24L160q30n159M380K497n002M25K153R14r73k292N125O95m694K418
$$ -1537 -2368 -2144 1016 186 -4973 -593 1904 -3098 -2673 -520 394 -579 -2871 2254 2949 -1745 673
718F73K146j921o87j115L085o39m105M409J059l254Q92K72L78j204l019L778k64
$$ 673 2819 898 211 -904 2181 1542 -2563 1846 2905 -349 543 815 1193 -11 -3030 748 484
735D84l621K863Q15m07M72j831K887j296l290L395n02j351J785n25J623K55k297
$$ 484 -3137 -274 541 134 606 -1225 1662 366 -2924 471 -31 -1382 403 -122 1501 1756 -541
752e41K677q49k207J771j363O17K78q99K558o44j554K103j733m77Q66k697J469
$$ -541 2136 1287 -920 851 -512 105 383 -516 2042 1398 -156 1947 214 -263 603 -2094 -625
769f25M97j540K659j282K82J645k734R66K59k555J758p92J37K242k229K463J390
$$ -625 -128 -1668 991 -291 -9 1636 -1098 -132 127 -2428 -670 -1462 -1325 917 -1312 1151 2541
786B541l319J067k39j127M95j860K133J557l245K531J408j923J84j144J082k26
$$ 2541 -778 289 50 -1077 -582 -2442 -309 1248 -1997 534 1942 19 203 -941 141 -85
802h5l568L138J718k915K061J553op11k613L070n06m196K785J555j161L73m65
$$ -85 -3653 -515 1203 -1712 349 1902 1896 1185 -1428 1642 1136 -3060 -275 1280 119 492 27
819B7L260r44m393L592o3l452L36J119J774j604j518N119p92m544K307J100j960
$$ 27 3287 2343 -2050 1542 1479 -1973 -1637 -518 1256 -348 -1866 3253 2461 -2083 224 1324 -636
836f36j582k4L990j458l540N333O65l252n87R04J664l676k378O096o71m108L674
$$ -636 -2218 -2242 1748 290 -3250 2083 2748 -504 -1091 -187 1477 -2199 -4577 1519 848 -3260 414
853D14J970m97k929n29M270l207l944N116J100k611l3K162K852m112k492N746
$$ 414 2384 1887 -1042 -1571 2699 -508 -4452 664 1764 -847 -880 1282 4134 22 -2470 3276
869C276k327m402J991K028L51k751M07N820l460l488L944L16k744j606K207L537
$$ 3276 949 -3453 -1462 566 917 -1834 -1427 4393 933 -2555 1389 1705 -1039 -2645 -438 3099
885C099m133j050O206j763l235O73J871k71m720M18N734l812k392M056R86k107
$$ 3099 -1034 -2084 4122 2359 -876 -203 1668 1397 -3323 -2905 2829 -983 -3375 681 1667 -440
901d40k557J762L046n349j160N816j244k385J429L310R70m974J165M768m140k527
$$ -440 -2997 -1235 1811 -3538 -4698 1118 -126 -2511 -1082 2228 3198 -1776 -611 4157 17 -2510
917b510L806J076j023k389K887L330n675o95L725j947k699p72K941Q74m773K337
$$ -2510 1296 2372 1349 -1040 1847 5177 -498 -1193 2532 585 -2114 -2886 55 929 -3844 -1507
933a507M429l373j850K400J139j306l159L339L447m722O74M300r19j525j532K887
$$ -1507 2922 -451 -2301 99 1238 -68 -3227 112 3559 -1163 -489 3811 2892 1367 -165 2722
949B722L91n496J622L723l542j466J712J249j171l471K672J467m981Q62K402j31
$$ 2722 3113 -2383 -761 2962 -580 -2046 -334 915 -256 -3727 -1055 412 -4569 -3707 -1305 -1436
965a436q02q31L808Q90l881K348K619k924j47L91K230l78k816L553J435l853N23
$$ -1436 -2238 -3069 739 1629 -2252 96 2715 -209 -356 35 2265 1887 -929 2624 4059 206 729
982G29R39o01j171k105K592L82l636J916J632j555l46k35J982n66k661K931J056
$$ 729 1668 1067 -104 -2209 383 765 -2871 -955 677 -878 -1224 -1459 523 -43 -2704 227 1283
999A283j759J049N09P75k36j556K553m74k692J648mr30J92j181J920n74k506K175
$$ 1283 -476 573 1082 1857 1621 65 2618 2144 -548 1100 1096 166 358 -823 1097 523 -1983 192
1017A92l90j719P42m33R11l6j371K562r0j468J865p34L4L64j578K210l09j448
$$ 192 -198 -1917 -1175 -1608 -697 -733 -2104 458 368 -1100 765 31 65 429 -1149 1061 752 -696
1035f96K012j051j81Q05j527J020j19j591J412o37k81J505j567R47R31j622J329
$$ -696 1316 265 84 889 -638 382 263 -1328 84 -553 -834 671 -896 51 982 -640 689
1052F89k88k93J175j435P13J098k187J647j55p72Q91j607M83N28k469J198M88
$$ 689 401 108 1283 -152 561 1659 -528 1119 964 192 1083 -524 -41 487 -1982 -784 -296
1069b96j488P46j18O43K18j684J987R78k374J534M51jM04j614K713j27k270J697
$$ -296 -1784 -1038 -1156 -513 -295 -1979 8 986 -1388 146 597 596 1000 -614 2099 1972 -298 1399
1087A399M10j192n3p96J175p67k491K628J01k434R38K48J50o78j615K943L33k668
$$ 1399 1809 617 564 -232 943 176 -2315 313 414 -2020 -1082 -834 -684 -1362 -2977 -34 299 -2369
1105b369K065J285n81L0k68K748j328k277L330J11k331N01M25P31j926j362L026
$$ -2369 -304 981 400 430 162 2910 1582 -695 2635 2746 415 916 1341 2072 146 -1216 1810
1122A810j194l097J509M83o45j511j82L105j799j934L531M7j270j32J222J927
$$ 1810 616 -2481 -972 -489 -1134 -2645 -2827 278 -1521 -3455 76 123 -1147 -1279 -57 1870
1138A870k505o33M386j192k018J727R01k25j877m42L148k657k651K926Mj760q26
$$ 1870 -635 -1268 3118 1926 -92 1635 2536 2311 434 -8 3140 483 -2168 758 762 -998 -1824
1155a824J081J472k947q98L804j555j782J240J492P19k151O87L646k416j488K818
$$ -1824 -743 729 -2218 -3116 688 -867 -2649 -1409 83 802 -1349 -662 2984 568 -920 1898
1171A898K37j308j254J163K262l219q36L634j843k128L72J323K00l521R64L432
$$ 1898 2135 827 -427 736 2998 -221 -1057 2577 734 -1394 -1022 301 501 -3020 -2056 1376
1187A376k926r60K573O52j018j287J812K102l656J64L285q79j167K99J491N64
$$ 1376 -1550 -2510 63 715 -303 -1590 222 2324 -1332 -1168 2117 1238 71 370 1861 2425
1203B425l456R67L123l559j125J472P76q33j769J711K219l752N3K638q73j017
$$ 2425 -1031 -64 3059 -500 -1625 -153 623 -210 -1979 -268 1951 -1801 -1748 890 17 -1000
1219a000n69K233J006l267J804K477k463o35J265O01n94k563J951J622l504N97
$$ -1000 -1569 664 1670 -1597 207 2684 221 -414 851 1452 858 -1705 246 1868 -1636 -1039
1235a039J381m15j041q21J623M55l096J692J752j575K14O65J320J41k348K200
$$ -1039 342 -73 -1114 -1935 -312 143 -2953 -1261 491 -1084 -870 -205 1115 1256 -1092 1108
1251A108J032k718Q42J298r5m37j221J903j00k525J149O15j430k44k34R50l02
$$ 1108 2140 -578 264 1562 1467 1030 -191 1712 1612 -913 236 851 -579 -823 -1057 -107 -409
1268d09j929K143M89j381O42K32M68Q3j491K281K40j861J548O10m31j13p09J004
$$ -409 -2338 -195 294 -1087 -445 -213 255 338 -1153 1128 1368 -493 1055 1665 1234 1121 412 1416
1286A416m94j777J251k52j329O98o32J047m78j489J757n67j573J569r4K41N65
$$ 1416 922 -855 396 144 -1185 -487 -1119 -72 -550 -2039 -282 -849 -2422 -853 -947 -706 -141
1303a41o12J509k2q46J671p23k41M50r25R93j35r58J202o32q53P29j156M15k65
$$ -141 -753 756 734 -112 1559 836 595 1045 120 1113 978 20 1222 590 -263 466 -690 -275 -540
1322e40j214J461j87j010J437n56N02P73j070J048P9q00J184p19L34Q22j142O31
$$ -540 -1754 -293 -480 -1490 -53 -609 -107 666 -404 644 723 -77 1107 388 722 1544 402 1033
1340A033L59j236K27o16J96P1j224M58M35j020O63K4n33N89q61J051J34j224J615
$$ 1033 1392 156 383 -233 -37 34 -1190 -732 -297 -1317 -654 -630 -1163 -574 -1435 -384 -250 -1474 141
1359A41J80k19N41j77O21L03j673J631p7j354O99K54l21k87j114J154k52j640
$$ 141 321 102 643 466 1087 1390 -283 1348 1271 -83 616 870 549 262 -852 302 50 -1590
1377a590J107m6o83L78l04J412l33j188K257N4j274O96M92K69n99p91J995k65
$$ -1590 -483 -529 -1212 -834 -1138 274 -59 -1247 1010 1064 -210 486 978 1247 648 -143 1852 1587
1395A587j798J240M0m91o95o31J595j047j856J521K47j438M79L82J013j200p83
$$ 1587 -211 1029 1069 578 -117 -748 847 -200 -2056 -535 -288 -1726 -1247 -865 148 -1052 -1835
1412a835K652o26j479J442M94J71q54k3K170j287j434K128m48j299j42K28J091
$$ -1835 817 191 -1288 154 648 819 -35 -58 2112 825 -609 1519 1071 -228 -370 -142 949
1429I49j799o29K296q97j462P42Q51K56j883N72K135j531n06J814N81j109p15
$$ 949 -850 -1479 817 -80 -1542 -800 51 307 -1576 -1004 1131 -400 -906 908 1489 380 -335
1446c35J158J129k022m06K308j156j386R58N4K46j589J62J998j952q86J537P6
$$ -335 823 1952 -70 -476 1832 676 -710 248 302 548 -1041 -879 1119 -833 -1719 -182 -106
1463a06n45o14J217J080j884O7K125n53j095N25Q70L36j915O32J618j950n32R53
$$ -106 -651 -1265 -48 1032 -852 -785 1340 787 -308 217 1087 1423 -492 140 1758 -192 -724 229
1481B29L42n92j479J144J129k461J39J697q43m36K25R92L05j198O84J972j607
$$ 229 571 -21 -1500 -356 773 -1688 -1549 148 -695 -1131 -906 86 391 -807 -123 1849 242
1498B42m00J100L71J00j507R71J190k296j20J129q16j88r00P33M68j922Q26R98
$$ 242 -158 942 1313 1413 -94 877 2067 -229 -349 780 -36 -224 -1124 -391 77 -1845 -1019 -21
1516b1j103j99J98Q63Q0j349J481J268j694N11J178J86m81p22J111J18j855J130
$$ -21 -1124 -1323 -1125 -262 -182 -1531 -50 1218 -476 35 1213 1399 918 196 1307 1425 -430 700
1534G00P14j043p7k94J76j15j810J179N58j523N49K83K7q6o67J386M13j494J488
$$ 700 1414 371 294 0 176 61 -1749 -570 -12 -1535 -986 -703 -676 -762 -1429 -43 370 -1124 364
1553C64M99n61L36k91O79k39p33Q48L76r67J77k1L4n8j254R65k58p61M54j66l61
$$ 364 863 302 638 347 1026 787 54 902 1278 311 488 467 501 443 -811 154 -104 -865 -411 -577 -938
1574i38L05m84R87J4r30R87J83q98Q98k04N06K52q71Q47j66o80O37o97N43M2n46
$$ -938 -633 -1117 -130 -116 -1046 -59 124 -774 124 -80 426 678 -193 654 488 -192 445 -252 291 333 -213
1595b13N17p7p72P20k59k26M13l89M66j50j85Q35n79m2L16p57N64K14p43M80j99
$$ -213 304 227 -545 175 -84 -310 103 -286 180 30 -155 680 101 59 375 -382 182 396 -347 133 -66
1616f6N3J35m24M51P2j000O30j48k86N94n70L94N65r06O87L64q09M55L7n2M47
$$ -66 -13 122 -302 149 221 -779 -149 -297 -583 11 -559 -165 400 -506 181 545 -264 191 228 176 623
1637F23j003R37K44j041O70P2k39k01m01Q5Q4j116J294Po55M71r9K49j6j159J537
$$ 623 -380 557 801 -240 430 502 263 62 -339 -254 -170 -1286 8 15 -640 -169 -268 -19 -35 -1194 343
1658C43L5p52N78Q6M60l02l88J089l54p90R94l38m28l27N5O64n24j349J631n62
$$ 343 378 -374 204 290 750 448 60 1149 795 5 999 661 233 -94 -39 625 101 -1248 383 -179
1678a79r52M99J43K78p13m70J247Or51Q11P05l66l11P1J249p08p09J221r1q03
$$ -179 -1131 -632 -489 -211 -924 -1394 -147 -141 -1092 -281 424 58 -253 -182 1067 359 -350 871 780 -23
1698b3M07K44K88q01o56J344n52q65L83K07k30n25o9J160q92n20J017O2k92L9
$$ -23 384 628 916 115 -541 803 251 -614 -231 -24 -254 -779 -848 312 -580 -1100 -83 -21 -313 -274
1718b74M49M46j008P1J938r79n87K72Q9O54j114K12J062r29r02J028l09k49o28
$$ -274 175 621 -387 -316 1622 643 56 328 417 1071 -43 169 1231 302 -600 428 119 -130 -758
1737g58M88O90j311J4J088n98m64M96L82L14j057K52J404j230j84O26J71k56m63
$$ -758 -270 420 -891 -877 211 -387 -851 -355 27 341 -716 -464 940 -290 -474 152 323 67 -396
1756c96N00O96j083k68J197n36o02J30Q01J73j261K33J444j139k44M24K47j2p89
$$ -396 104 800 -283 -551 646 110 -492 -362 439 612 -649 -416 1028 -111 -355 69 316 304 -485
1775d85N43P49j357M03O46l62j81m88Q16J44j064N74N43q68L33N4N36m90p91Q62
$$ -485 58 807 -550 -147 499 137 -44 -532 284 428 -636 -62 481 -387 -54 0 536 46 -745 117
1795A17L82r94K73N30k90m1m21P21L71j762Q22P58o15j62K17J53J86q02P05M19
$$ 117 499 -495 -222 308 18 -23 -444 277 648 -1114 -292 466 -149 -311 -94 59 245 -557 148 567
1815E67q44J90j3K34k91k27N01L44r33N24N76q27M37k3J42Q5q01P02J21n10K64
$$ 567 -277 -87 -100 134 -157 -384 117 461 -472 52 628 -199 238 215 357 442 -359 343 464 -46 218
1836B18m22N93j6q93Q86K9j014O88J42m35m3j56M70l3o12Q30k00j03J75j61J73
$$ 218 -204 389 373 -520 366 395 -619 69 211 -224 -267 -423 47 14 -598 232 32 -71 104 -57 116
1857A16K04q82R89j64o05Q02l7k88K77o88K08j4l37L21Q4k40L49m60J90L07o68
$$ 116 320 -562 427 263 -342 460 423 135 412 -276 -68 -82 -419 -98 -14 -254 95 -365 -175 132 -536
1878e36O98k06m33O87n86M63K42o99O57j10K3J37k81Q0J58n11L86k95p8K76m66
$$ -536 162 -44 -477 210 -376 87 329 -370 287 177 200 337 56 136 294 -217 169 -126 -204 72 -394
1899c94J67J41n58M85l8q0J24k18L2N20m96O66k2o36M46K39Ql65J02L78O6q02
$$ -394 -227 -86 -644 -159 -197 -277 -153 -371 -339 181 -315 351 329 -307 139 378 386 21 123 501 567 -235
1921b35N25Q9o79J68k17L56j0q00P99Q7p20L90P0rK02l68P26k62p89J009L47o49
$$ -235 290 379 -300 -132 -349 7 -3 -803 -4 83 -637 -247 -177 -186 16 -352 374 112 -677 332 679 30
1943C0M6L00K37l16o25Q07M4q42M77J73j43l50l75Q21j52q22O60Op0j73J4O31
$$ 30 76 376 613 297 -328 479 523 -319 158 331 188 -162 -537 284 132 -690 -30 -24 -94 -267 -253 378
1965C78n93k13P25J47o99L66m7M90m85j55N88k93n21L12J97Q2m39j82O21l79n97
$$ 378 -215 -428 297 444 -255 111 64 554 69 -86 502 209 -312 0 197 279 -160 -342 279 -100 -697
1986f97P86R5j83l41j39Q37m25o62J077m26k46K77P3L82n99j16Q73o58l33O99
$$ -697 89 184 1 -340 -479 358 -67 -729 348 -78 -324 -47 26 408 -191 -307 566 -92 -425 274
2006B74l10p2j92L12L86m89m91R67o41J6J56J09N47q74N3P01m22l43M38l5r6j20
$$ 274 -36 -108 -300 12 398 -91 -582 385 -256 -240 -84 25 572 -302 -249 452 30 -313 125 90 -6 -126
2028a26Q8N71r28J20N71o18K97j11k42Q76j329O94N68n46j40K33K31n5j76J22
$$ -126 -38 533 -395 -275 296 -322 -25 -136 -378 498 -831 -137 431 -115 -255 -22 209 154 -22 100
2048A00N62p48Q0M37J58o85L3M30P6r11L84M76o13j77L11j60p6m58N44O59r37
$$ 100 662 -86 -6 431 589 -96 -63 367 443 -468 -84 392 -221 -398 -87 -247 -323 -781 -237 422 -515
2069e15K31M33l48L04k00K71M08q63O24M16q50M4J13M18j58m61K51N44q97QL69
$$ -515 -284 149 -199 105 -95 176 584 -279 345 761 -89 -45 68 486 328 -133 118 662 -235 -227 142
2090A42j14k30J09r5P0o33L83N12n92J46j67M91J21m85M66l7q6K04j10K78l6k92
$$ 142 28 -202 -93 -188 -118 -751 -368 144 -448 -302 -469 22 143 -342 124 87 1 205 95 373 337 45
2112D5J82R3m76M33q3j79L68n19J55L9l94K35j37j76N87j88l6O9m42Q7M49k86
$$ 45 227 320 -156 277 194 15 383 -136 19 58 -336 -101 -238 -414 173 -15 -51 18 -424 -337 112 -174
2134a74K34N4j76L15n74N03Qk52K19j12j02L11k33J91j22l20N01j70l33M42m20
$$ -174 60 114 -62 253 -321 182 190 -62 157 45 -57 254 21 212 90 -230 271 101 -232 210 -210
2155b10M52J33o12J47M3l76N60qk24J88l30L19J46m11M91l47J86p9K3L7l3k31
$$ -210 242 375 -237 -90 -47 -423 137 129 -95 93 -237 82 228 -183 308 -39 147 68 91 128 95 -136
2177a36N70l38k91J65J6j31L30n80M81J19l49K60l42j46L97n51M07p0j42K18l10
$$ -136 434 96 -195 -30 -14 -145 185 -395 86 205 -144 116 -226 -372 25 -526 -119 -189 -331 -113 -423
2198d23L21P7l18M20J77n06M18M6N2k96R9r3n7j49L90J4k12M06l18R5J1o68L74
$$ -423 -102 -25 -343 77 254 -252 166 212 264 -32 67 -26 -83 -232 158 172 -40 366 48 143 154 -514 -140
2221a40P6k46K47k04j13K42o31P52J2k04K80r5J38k57K80J37j5n22P98k73j71
$$ -140 -64 -310 -63 -267 -380 -138 -769 -17 -5 -209 71 -24 114 -143 137 274 259 -263 535 262 91
2242I1l44K85J48K9n12O97k16n95M80j36Nn0k92N94p12J75M91k61J8k10K65n1
$$ 91 -253 32 180 209 -303 394 178 -417 63 -73 -68 -118 -410 184 -528 -353 138 -123 -105 -315 -50 -101
2264a01j90J14M85k00j82K34M9J52k32j8L97l74n19P74l08k95Q0K3M73o06j88
$$ -101 -291 -177 308 108 -74 160 209 361 129 111 508 134 -385 389 81 -214 -134 -111 362 -244 -432
2285d32O27l00r4K72j45J66m38J77O37m53l79N64J2j18k33k0K31k92q1N77k04
$$ -432 195 -105 -199 73 -72 94 -344 -167 470 17 -362 202 214 96 -137 -157 74 -218 -299 278 74
2306G4P7l09K09L62o14P8O32n63l6J32jk18j32NN30o30L29M3j71np6K16L72k52
$$ 74 151 -158 51 413 -201 -123 509 -54 -90 42 41 -177 -309 -304 226 -404 -75 -32 -203 -208 -284 -68 304 52
2330E2k92O18j91J0l73K32q0o0L8M74o93L83K53n08M9O3r4O80r19K17N88n75J75
$$ 52 -240 378 187 197 -176 56 -24 -84 -46 428 -265 118 371 -137 -88 -25 -119 561 -358 -141 447 -128 47
2353D7lj31K90m02m1M71n88K16K24Mm3k98J59O47o17N5M99n45K02k17J69l1k39
$$ 47 44 -87 203 -199 -240 231 -357 -141 83 87 44 -254 -95 552 -65 -10 489 -56 146 -71 98 67 -172
2376a72L68j31j70Q0J47m5O4m04K42K31m05K07l3j55K52l00K42J13k56K5L76l33
$$ -172 196 65 -105 -25 122 77 141 -263 -21 210 -195 12 -21 -176 76 -224 18 131 -125 -100 276 -57
2398e7N3q5Q9L30o25M27J49m60M99j47k47J77j77K3J09k88K48r8k39K45M8J0J09
$$ -57 -4 -89 0 330 -295 132 281 -179 320 173 -74 103 -74 -51 58 -230 18 -80 -319 -74 -26 -16 93
2421I3n36L96q8j1k0N3K27K9k27K29j4j34K60l40J56L06p77M24L06m53K7K57m46
$$ 93 -443 -47 -135 -146 -166 -113 114 143 -84 145 131 -3 257 -83 73 379 -398 26 332 -121 -94 163 -283
2444b83R0J27L16k06j91J03L5m18M37j52k3K81k14L33j51j56K6LL56k77j66K50
$$ -283 -193 -66 250 44 -147 -44 -9 -427 10 -142 -165 116 -98 235 84 -72 -46 -43 313 36 -130 120
2466A20L30n40j36J90j33J95r3m3J81l56M73j95k8n5k42N20L0m48N74q7l94L43
$$ 120 450 -90 -226 -36 -169 26 -67 -110 71 -285 188 -7 -35 -90 -332 188 218 -230 344 257 -137 206
2488B06k89N6J00j55K57J80l81J41o2m9N2m73N70m6m08M13j01N8j7j36J37j97
$$ 206 -83 -27 73 -82 175 355 -26 115 53 4 56 -417 153 107 -301 112 11 69 52 -84 53 -144
2510a44j09L92L2k33K34k86J73K5o31Q01j40k45M63k83L16j89j04K66n3m22M26
$$ -144 -253 139 171 -62 172 -114 59 84 -547 254 114 -131 332 49 365 176 72 338 285 -137 289
2531B89j63k26J42M6j2M26o91M22m9l77L0J06r8J81k02L03j53k01J68J50m02J03
$$ 289 126 -100 42 88 76 502 -189 233 184 -193 -163 -57 -155 26 -176 127 -26 -227 -59 91 -311 -208
2553b08J49K43k88J14j29J17K0P4J74j98j71J25L08m8o6j2Jj93k82R8K54k05q6
$$ -208 -59 184 -104 10 -119 -2 18 92 266 68 -103 22 330 282 216 204 205 12 -270 -172 82 -123 -209
2576b09L59k36l4k25J43K03o0j14K53k33P3M90m82J05J36l14M37k38j10L63k79
$$ -209 150 -86 -120 -345 -202 1 -59 -173 80 -153 -80 410 -72 33 169 -145 292 54 -56 307 28
2597B8o7l4k1J23j09l0L03n2k00k40L92r7j95l3K35j18K4K8J46k17p1J98J98m56
$$ 28 -39 -73 -94 29 -80 -110 193 141 -59 -299 93 -4 -199 -232 3 -115 -91 -63 83 -134 -205 -7 191 -265
2621b65K57J71J31k37L9K9K2l3k92J63m2J31M7j9j98P5j48M09q02L85J51j8k7
$$ -265 -8 163 294 57 96 125 147 114 -178 -15 -57 74 121 102 -96 -21 -169 240 -562 -177 -26 -44 -71
2644g1k54K35J46k79J80L33l73P5J88J8L39m98R7J99l07j17K03k67J92j39K22
$$ -71 -325 -90 56 -223 -43 290 -83 -8 180 198 537 39 136 335 28 -89 114 -153 39 -100 122
2665A22Q0k50lJ40j94K08J34k42j67j42M10j32n5k2L02k80M3J9q2J06M2M3J2k09
$$ 122 202 -48 -51 89 -105 103 237 -5 -172 -314 96 -36 -91 -113 189 -91 -48 -29 -111 -5 37 80 92 -117
2689a17J14j8QM12l25k34J07Q0J18M5k78J24j36L0J83m95J66L14k15J37k9p1J70
$$ -117 -3 -21 -13 399 74 -160 -53 27 145 190 -88 36 -100 -70 113 -382 -216 98 -117 20 -9 -80 90
2712I0k45K35k18RL33l44K45P5j22LP8J03k37r7K06J34k68j3K9j27K08k93J58
$$ 90 -155 80 -138 -129 204 -140 105 180 58 61 139 242 5 -92 114 248 -20 -33 -4 -131 77 -216 -58
2735e8K22j16l07J42q8K1J46l9J75l82K36j2lJ03M3M2j81J47p9m7j50N35l19J32
$$ -58 164 48 -259 -117 -205 -184 -38 -77 98 -284 -48 -60 -63 40 83 125 -56 91 12 -35 -185 350 31 163
2759A63k64L21j57K49k66n7Q7j09p8K30k19O7ORp0j27K24Qj57J77Q8l7K56m60
$$ 163 -101 220 63 312 46 -11 76 -33 -111 119 -100 -33 -27 -18 -88 -215 9 17 -140 37 125 88 344 -116
2783a16J52M7k22L15k31j3M5P8o1K42m78L33j09J22k57l5K20P2l71L54N1l84N56
$$ -116 36 83 -139 176 -55 -68 -23 55 -6 236 -242 91 -18 104 -153 -188 32 104 -267 87 138 -246 310
2806C10q67N32N0L8j64J18k31K54J2q1K11l41L05J62m82J86L0j01R3k17J12K3
$$ 310 -557 -25 25 63 -101 17 -214 40 52 -29 182 -159 146 308 -174 12 42 -59 34 -183 -71 -48
2828d8r3K27k36j72J79L41k45O7m8P7j22r7M8K02l83M40j86M03l70q2K92j76j73
$$ -48 -141 86 -150 -322 -143 198 -47 20 -28 49 -73 -170 -122 80 -303 137 -49 354 -16 -98 194 18 -155
2851a55J69j01M18l47l60N06j64k34L74j1J14k52j39K78k34j08K38k11L4Q8J01
$$ -155 14 -87 331 -16 -376 130 -34 -268 106 95 209 -43 -182 96 -138 -246 -8 -219 -185 -97 4
2872DL19n26J46K60l03P5J18j19K40l75K44Q4n7l04J51Q6j87Q6L6J40j79r3L08
$$ 4 323 -203 -57 203 -100 -25 93 -26 214 -161 83 167 110 -194 -43 43 -144 -58 -22 118 -61 -154 154
2895A54j99q0K24k34J84Q9n3l24L67p7l1M0k07n3K83J74j53J2r9J64j01j14K49
$$ 154 -45 -125 99 -135 49 138 85 -239 128 51 20 60 -147 -200 83 257 104 116 17 181 80 -34 215
2918B15j46k27J60Q3j21j49K26J08j97k04J36Q6j35J34K06l48K49j64K96%m27
$$ 215 69 -158 2 85 -36 -185 41 149 -48 -252 -116 -30 -165 -31 175 -173 76 -88 208 208 -219
2939b19L55R6k44Q8j43k7J96k56J59k85N39l20Q0j56L82l01R5K16m34O9L0m3J48
$$ -219 136 232 -12 76 -67 -94 102 -154 5 -280 259 -61 19 -137 245 -56 39 255 -179 -110 -80 -123 25
2962B5j01rJ55j63J1J00R2j12r6l4M7J37K26l9j38p2J32l19L85k91j83M74m50
$$ 25 -76 -85 70 -93 -82 18 110 -2 -98 -132 -85 52 278 239 101 29 161 -158 227 -64 -247 227 -223
2985b23M00l02M6J58r9j20J41P4j45J80j81J41j7k13L87k32K2l3j05K23j77M0
$$ -223 177 -125 -79 79 -20 -140 1 75 -70 110 -71 70 53 -160 227 -5 17 -16 -121 102 -75 -35
3007c5J36o7k5P5k23K03J01m03K02K08j84K47l44L7J02M5k7o0L3P2k46L66k18
$$ -35 101 34 9 84 -139 64 165 -238 -36 172 -12 235 -109 -72 30 75 48 -12 21 93 -153 213 -5
3030er8J35j17L68K9k73o7K41k10K27j29J64j15m1qo4pQ6j23l1J15j93k7K85m56
$$ -5 -103 32 -85 283 312 39 -28 213 3 230 101 265 150 109 101 37 30 116 -7 -38 77 -116 -143 142 -314
3055c14K26J18j48j09J70LL63o80L96J63k2lk42mk4K78q7l78K93J85N3k90L5M
$$ -314 -88 30 -118 -227 -57 -54 309 -371 25 188 166 163 -79 -83 -107 171 84 -294 -1 184 237 -53 -18 -14
3079a4k1K28m20L68j60k45K77k54J41N2LL3r5J64j27j20K28j40K55p8J7k14P5
$$ -14 -35 193 -227 141 -19 -264 13 -241 -100 -48 -45 -12 -107 57 -70 -190 38 -102 153 75 92 -122 -47
3102d7Q3J74p4k25K66J23j03j41Ok38L14k67K65M0k84L60j42k23K10J02m16P1
$$ -47 36 210 136 -89 177 300 197 56 62 -176 138 -129 136 176 -108 252 110 -113 97 199 -217 -146
3124a46Q6O3N5k40J80J23n20L35l12M33j62r7K42l7L2n4K79l46J56N2Rl5j21m7
$$ -146 -60 3 58 -182 -2 121 -399 -64 -376 57 -105 -202 40 3 35 -19 260 -86 70 122 131 96 -25 -72
3148g2J14R4r8j55N3J44n5O5j33p7K43q0l62M59m24J00K59p7L27N1m34K40k66
$$ -72 42 136 38 -117 -64 80 25 90 -43 -120 123 43 -319 140 -284 -184 75 -2 325 376 -58 182 -84
3171h4l1J27K6p1j9n6k6K87m2k42J78j28K05l69K62O0j68j1J94j11j16r2L07O6
$$ -84 -115 12 38 -33 -52 -108 -134 153 111 -131 47 -81 124 -245 17 77 -91 -102 92 -19 -135 -227 80 146
3195A46k38qK2kO4p9O4j60J91lk9k5J62k9J89j26J88l90O9K10j32o1L1j80m8K48
$$ 146 -92 -100 -78 -80 -16 -95 -31 -191 0 -3 -32 -57 105 76 265 139 327 -63 6 216 84 23 54 -126 -174 74
3221G4k82N1J71O6J04l95K69j52q8K59N9p0K22p1j90o8J71J13k22Q3m4k30K18
$$ 74 -208 -157 14 80 184 -211 58 -94 -182 77 136 66 288 217 27 -41 130 243 21 104 60 -170 48
3244D8K13k43k03M57r4j8P2k42O9O5j46K59l26j70K12J07k92K16j25OK09J04Q7
$$ 48 261 18 -185 272 178 160 232 -10 59 124 -22 237 -89 -259 -47 60 -232 -16 -141 -135 74 178 265
3267B65k44O0l02L28j91L8K44j16r6R7l0j78M1l6K3N1K8L21l21k35J76K6n5K08
$$ 265 21 81 -221 107 -84 -46 198 82 -14 83 53 -125 -84 -120 -97 -46 -18 303 -18 -253 -77 -51 -106 102
3291A02k96K84J23j76k02J15L55k42l54M81k5k18P3M5l55M66k44j66K99n6J51
$$ 102 -194 90 213 37 -165 -50 305 63 -291 190 165 -53 20 65 -290 176 -68 -234 65 9 160
3312A60m8qj66J90L4j24r4r3J44k03J73K10k22J56L3j17k09L27j20Q0k96L76j58
$$ 160 112 104 -62 128 162 38 -56 -149 -5 -208 -35 175 -47 109 142 25 -184 143 23 103 -193 183 25
3335B5k67K67j6K26L4l69M3J25k69L03l27L53j99j71K05K19k26J34j82L3P5k51
$$ 25 -242 25 9 235 269 -100 -57 68 -201 102 -225 128 -71 -242 -37 182 -44 90 -92 -59 16 -235
3357b35K31qP0P4j21j7j49K1J78j66K30k72K43J24J4j86r1L3M0K63m77J27K76
$$ -235 -4 -12 58 132 11 -6 -155 -134 44 -122 108 -164 79 203 217 31 -60 -27 13 276 -201 -74 202
3380B02k56Q1M3k75R6Q2j80J58K09k3j02k57J04K94J9j02O0J14l07Lj69L38k83
$$ 202 -54 27 70 -205 -109 -27 -207 -49 160 137 35 -222 -118 176 195 93 153 267 -40 -37 -206 132 -151
3403a51J98j27N7J25j12M8j76R4l0K78j42N7n10L45j14K58p7J16N7j63J30j69
$$ -151 47 -80 -23 102 -10 38 -138 -44 -74 204 62 119 -391 -46 -160 98 21 137 194 31 161 -8
3425hJ00k21L16k79J47p9J34j02j84K64l24M76k59j7J58J18n61L03P1Kj88m2L36
$$ -8 92 -129 187 -92 55 -24 110 8 -176 88 -236 240 -19 -36 122 240 -321 -18 53 55 -133 -175 161
3448A61J27l01J17j40l2n5J20k4j27O6J28o3j2Q5l0J26j22M1j18K48k14J3m4K5
$$ 161 288 -13 104 -36 -68 -123 -3 -27 -154 -88 40 -23 -35 50 20 146 24 65 -53 195 -19 -6 -50 -25
3472b5j37L82k32j45j3L46k10p7M6K9j35lJ65j24N2J22J14kk85L79k07r0J08l62
$$ -25 -162 220 -12 -157 -170 176 -34 -111 -65 -36 -171 -174 -9 -133 -81 41 155 153 -132 247 40 -50 58 -304
3496c04M32j75K18j66q9L53r7j21K72o18J89O0M0k7j3M1m00M99Mm11M25qj46J47
$$ -304 128 -47 171 5 -84 269 172 51 323 -295 -106 -46 -6 -33 -46 -5 -405 94 98 -313 112 104 -42 105
3520A05k04n5L26j50K82l17q4L11K9l84P3j15K96J5j84K03k03J9J2k31oJ77J64
$$ 105 -99 -154 172 22 304 -13 -97 214 243 -141 -68 -183 113 128 -56 147 -56 -37 -25 -256 -262 -85 79
$$ [...]
8191i7
##END NTUPLES=NMR FID
##END=
