##TITLE=1H_Pr 2944
 CDCl3
 8 sc, 
 9.2.2023
##JCAMPDX= 6.0         $$ Bruker NMR JCAMP-DX V2.0
##DATA TYPE= NMR FID
##DATA CLASS= NTUPLES
##ORIGIN= UXNMR, Bruker Analytische Messtechnik GmbH
##OWNER= root
$$ XWIN-NMR		Version 3.5
$$ Thu Feb  9 17:01:51 2023 Russian Standard Time (UT+4h)  she@DPX200
##.OBSERVE FREQUENCY= 200.13135
##.OBSERVE NUCLEUS= ^1H
##.DELAY= (6, 6)
##.ACQUISITION MODE= SIMULTANEOUS
##.ACQUISITION SCHEME= undefined
##.AVERAGES= 8
##.DIGITISER RES= 18
##SPECTROMETER/DATA SYSTEM= spect
##.PULSE SEQUENCE= zg30
##.SOLVENT NAME= DMSO
##.SHIFT REFERENCE= (INTERNAL, DMSO, 0, 15.7039)
##AUDIT TRAIL= $$ (NUMBER, WHEN, WHO, WHERE, WHAT)
$$ ##TITLE= Audit trail, XWIN-NMR		Version 3.5
$$ ##JCAMPDX= 5.01
$$ ##ORIGIN= Bruker BioSpin GmbH
$$ ##OWNER= she
$$ F:/spectra/data/she/nmr/H-F/1/audita.txt
$$ ##AUDIT TRAIL=  $$ (NUMBER, WHEN, WHO, WHERE, WHAT)
(   1,<2023-02-09 17:00:43.95 +0400>,<she>,<DPX200>,
      <created by zg, POWCHK disabled, PULCHK disabled
       configuration hash MD5:
       00 E9 B6 7A A2 85 ED C7 34 08 36 98 17 FE 4E 26
       data hash MD5: 16K
       09 E4 A7 B1 C4 29 4E BE F8 61 5D C4 93 BA 35 DB>)
$$ ##END=
$$ 
$$ hash MD5
$$ D9 B7 7B 10 FE 4F 41 32 0E 6E E9 0B 0C 5C 45 9D
##$RELAX= 
##$RELAX= 
##$RELAX= 
##$RELAX= 
##$RELAX= 
##$RELAX= 
$$ Bruker specific parameters
$$ --------------------------
##$DU= <F:/spectra>
##$EXPNO= 1
##$NAME= <H-F>
##$PROCNO= 1
##$TYPE= <nmr>
##$USER= <she>
##$AMP= (0..31)
100 100 100 100 100 100 100 100 100 100 100 100 100 100 100 100 100 100 
100 100 100 100 100 100 100 100 100 100 100 100 100 100 
##$AQSEQ= 0
##$AQ_mod= 1
##$AUNM= <au_zg>
##$AUTOPOS= <>
##$BF1= 200.13
##$BF2= 200.13
##$BF3= 200.13
##$BF4= 200.13
##$BF5= 200.13
##$BF6= 200.13
##$BF7= 200.13
##$BF8= 200.13
##$BYTORDA= 1
##$CFDGTYP= 0
##$CFRGTYP= 5
##$CHEMSTR= <none>
##$CNST= (0..31)
1 1 145 1 1 1 1 1 1 1 1 1 1 1 1 1 1 1 1 1 1 1 1 1 1 1 1 1 1 1 1 1 
##$CPDPRG= <>
##$CPDPRG1= <>
##$CPDPRG2= <>
##$CPDPRG3= <>
##$CPDPRG4= <mlev>
##$CPDPRG5= <mlev>
##$CPDPRG6= <mlev>
##$CPDPRG7= <mlev>
##$CPDPRG8= <mlev>
##$CPDPRGB= <>
##$CPDPRGT= <>
##$D= (0..31)
0 1.2 0 0 0 0 0 0 0 0.06 0 0.03 0 0 0 0 0.0002 0 0 0 0 0 0 0 0 0 0 0 0 
0 0 0 
##$DATE= 1675947643
##$DBL= (0..7)
120 120 120 120 120 120 120 120 
##$DBP= (0..7)
150 150 150 150 150 150 150 150 
##$DBP07= 0
##$DBPNAM0= <>
##$DBPNAM1= <>
##$DBPNAM2= <>
##$DBPNAM3= <>
##$DBPNAM4= <>
##$DBPNAM5= <>
##$DBPNAM6= <>
##$DBPNAM7= <>
##$DBPOAL= (0..7)
0.5 0.5 0.5 0.5 0.5 0.5 0.5 0.5 
##$DBPOFFS= (0..7)
0 0 0 0 0 0 0 0 
##$DE= 6
##$DECBNUC= <off>
##$DECIM= 32
##$DECNUC= <off>
##$DECSTAT= 4
##$DIGMOD= 1
##$DIGTYP= 9
##$DL= (0..7)
0 120 120 120 120 120 120 120 
##$DP= (0..7)
150 150 150 150 150 150 150 150 
##$DP07= 0
##$DPNAME0= <>
##$DPNAME1= <>
##$DPNAME2= <>
##$DPNAME3= <>
##$DPNAME4= <>
##$DPNAME5= <>
##$DPNAME6= <>
##$DPNAME7= <>
##$DPOAL= (0..7)
0.5 0.5 0.5 0.5 0.5 0.5 0.5 0.5 
##$DPOFFS= (0..7)
0 0 0 0 0 0 0 0 
##$DQDMODE= 0
##$DR= 18
##$DS= 0
##$DSLIST= <SSSSSSSSSSSSSSS>
$$ [...]
##$SUBNAM2= <"">
##$SUBNAM3= <"">
##$SUBNAM4= <"">
##$SUBNAM5= <"">
##$SUBNAM6= <"">
##$SUBNAM7= <"">
##$SUBNAM8= <"">
##$SUBNAM9= <"">
##$SW= 18.05172834244
##$SWIBOX= (0..15)
0 0 2 0 0 0 0 0 0 0 0 0 0 0 0 0 
##$SW_h= 3612.71676300578
##$TD= 16384
##$TD0= 1
##$TE= 0
##$TE2= 300
##$TE3= 300
##$TEG= 300
##$TL= (0..7)
0 120 120 120 120 120 120 120 
##$TP= (0..7)
150 150 150 150 150 150 150 150 
##$TP07= 0
##$TPNAME0= <>
##$TPNAME1= <>
##$TPNAME2= <>
##$TPNAME3= <>
##$TPNAME4= <>
##$TPNAME5= <>
##$TPNAME6= <>
##$TPNAME7= <>
##$TPOAL= (0..7)
0.5 0.5 0.5 0.5 0.5 0.5 0.5 0.5 
##$TPOFFS= (0..7)
0 0 0 0 0 0 0 0 
##$TUNHIN= 0
##$TUNHOUT= 0
##$TUNXOUT= 0
##$USERA1= <user>
##$USERA2= <user>
##$USERA3= <user>
##$USERA4= <user>
##$USERA5= <user>
##$V9= 5
##$VALIST= <valist>
##$VCLIST= <CCCCCCCCCCCCCCC>
##$VD= 0
##$VDLIST= <DDDDDDDDDDDDDDD>
##$VPLIST= <PPPPPPPPPPPPPPP>
##$VTLIST= <TTTTTTTTTTTTTTT>
##$WBST= 1024
##$WBSW= 4
##$XGAIN= (0..3)
0 0 0 0 
##$XL= 0
##$YL= 0
##$YMAX_a= 172493
##$YMIN_a= -175822
##$ZGOPTNS= <>
##$ZL1= 120
##$ZL2= 120
##$ZL3= 120
##$ZL4= 120
##$ABSF1= 10
##$ABSF2= 0
##$ABSG= 5
##$ABSL= 3
##$ALPHA= 0
##$AQORDER= 0
##$ASSFAC= 0
##$ASSFACI= 0
##$ASSFACX= 0
##$ASSWID= 0
##$AUNMP= <proc_1d>
##$AZFE= 0.1
##$AZFW= 0.1
##$BCFW= 1
##$BC_mod= 2
##$BYTORDP= 1
##$COROFFS= 0
##$CY= 11.3945322036743
##$DATMOD= 1
##$DC= 2
##$DFILT= <>
##$DTYPP= 0
##$F1P= 2.36226072786647
##$F2P= -0.459571619588291
##$FCOR= 0.5
##$FTSIZE= 0
##$FT_mod= 4
##$GAMMA= 1
##$GB= 0.15
##$INTBC= 1
##$INTSCL= 1
##$ISEN= 128
##$LB= 0.24
##$LEV0= 0
##$LPBIN= 0
##$MAXI= 10000
##$MC2= 0
##$MEAN= 0
##$ME_mod= 0
##$MI= 1.114404
##$NCOEF= 0
##$NC_proc= 0
##$NLEV= 6
##$NOISF1= 3.799351
##$NOISF2= 2.8
##$NSP= 1
##$NTH_PI= 0
##$NZP= 0
##$OFFSET= 15.70392
##$PC= 1
##$PHC0= -19115.49
##$PHC1= 15.60078
##$PH_mod= 1
##$PKNL= yes
##$PPARMOD= 0
##$PSCAL= 0
##$PSIGN= 0
##$REVERSE= no
##$SF= 200.130013532006
##$SI= 16384
##$SIGF1= 3
##$SIGF2= 2
##$SINO= 400
##$SIOLD= 16384
##$SREGLST= <1H.CDCl3>
##$SSB= 0
##$STSI= 0
##$STSR= 0
##$SW_p= 3612.71676300578
##$SYMM= 0
##$S_DEV= 0
##$TDeff= 0
##$TDoff= 0
##$TI= <>
##$TILT= no
##$TM1= 0
##$TM2= 0
##$TOPLEV= 0
##$USERP1= <user>
##$USERP2= <user>
##$USERP3= <user>
##$USERP4= <user>
##$USERP5= <user>
##$WDW= 1
##$XDIM= 8192
##$YMAX_p= 0
##$YMIN_p= 0
$$ End of Bruker specific parameters
$$ ---------------------------------
##NTUPLES= NMR FID
##VAR_NAME=  TIME,          FID/REAL,        FID/IMAG
##SYMBOL=    X,             R,               I
##VAR_TYPE=  INDEPENDENT,   DEPENDENT,       DEPENDENT
##VAR_FORM=  AFFN,          ASDF,            ASDF
##VAR_DIM=   8192,          8192,            8192
##UNITS=     SECONDS,       ARBITRARY UNITS, ARBITRARY UNITS
##FACTOR=    0.0002768,     1,               1
##FIRST=     0,             0,               0
##LAST=      2.2672688,     0,               0
##MIN=       0,             -175822,         0
##MAX=       2.2672688,     172493,          0
$$ Real data points
##PAGE= N=1
##DATA TABLE= (X++(R..R)), XYDATA
$$ [...]
1869e00r48k83K580O80k345k09Q58j07L14Q21J017j435k060J714J962r99j174
1886a14K61N8q57j69K154j20k558k16J221K15r5k58O80j071j271J890J606p50
1904F06j384L49Q12j30l4J434r5k459j83K104Q57j359j082J186n77j302J760J107
1922A610k005j458N66J450O6j136J398l32j742P82J797M31j299j290J348L74p33
1939a73J314O01j701j256M92K151n16j647P09k55p77O98J050L61j918j251K063
1956e5N14o22J97L83n01j168J018K256r44j924R20M33l21J39O19l3j820k82J754
1975E63O90j487l53j1M9n92Q44J460j207j818J226N53N41l37L4J02j125J39J851
1994A122L62j480n38N61J83J05n6R07j678q49Q49J306n3r39n56P15r21N73J565
$$ plain form
1869 -500 -1448 -1731 849 1529 -816 -1025 -167 -274 40 861 1878 443 -1617 97 2059 1060 -114
1886 -114 147 205 -652 -821 1333 1213 -1345 -1561 -340 -125 -220 -478 202 -869 -2140 -250 1356 606
1904 606 -778 -429 383 253 219 1653 1558 -901 -1084 1020 1877 518 -564 622 45 -1257 503 1610
1922 1610 -395 -1853 -1287 163 229 -907 491 159 -1583 -801 996 1427 128 -1162 186 560 -173
1939 -173 1141 1742 41 -1215 -723 1428 912 -735 -26 -281 -1058 -360 690 1051 -867 -2118 -55
1956 -55 459 -163 34 417 -84 -1252 -234 2022 1078 -846 74 507 186 325 944 911 -909 -1191 563
1975 563 1253 -234 -587 -598 -549 -1141 -297 1163 -44 -1862 -636 -83 458 121 155 257 -868 -729 1122
1994 1122 1484 4 -534 27 210 315 259 1166 -512 -1361 -512 794 741 -198 -754 -39 -960 -387 1178
2013A178r10r25k86P56P47j41j92K50q05k17Q55O80j56j259n43R47M7J47L94n43
2033B4p48k26R68J155r31m22K10p98P28R71j36n47r30K00J057J16M7l32r73N9
2053e08J57O12M18r61n22K24M46M39m2m95k04l30L42Q87m1l59m5n27N59K70K10
2074E30L10j027j0j36N73N33p17m29o5m8M80N28j83n15o57j19J189J96k14k52
2094c3r96N95L66O15J07l33r33O03P32o1K73r63k23k84N31P95k42j004j23J1M27
2115a40J04l6M06j024m35R87P93n3o47k33K58r8L78P42l79o67m23N38Q46o26l68
2136g7J68o01j67Q97K25J46j268l62J174l50l2N55l45n52j62J157Q33j211l90
2155c62K18J52N0M99K55l95j524N77J291l03n99J20K6m21k41J255L90j449m76
$$ plain form
2013 1178 268 -657 -943 -187 560 419 227 477 -328 -545 310 990 834 -425 -968 -21 26 173 567 24
2033 24 -724 -950 18 1173 242 -180 30 -768 -40 931 795 248 -682 -482 575 691 738 406 -567 -508
2053 -508 -351 261 679 -282 -804 -580 -134 305 263 -232 -436 -766 -424 463 422 63 18 -509 50 320 530
2074 530 840 -187 -197 -333 240 773 56 -373 -438 -486 -6 522 339 -176 -833 -952 237 433 219 -33
2094 -33 -1029 -434 -68 547 654 321 -612 -9 723 662 935 -28 -251 -535 -4 791 549 -455 -578 -567 -140
2115 -140 -36 -72 334 -690 -1125 -138 655 602 -45 -278 -20 -118 260 1002 623 -44 -467 71 917 291 -77
2136 -77 91 -510 -677 220 445 591 -677 -1039 135 -215 -247 308 -37 -589 -751 406 1239 28 -362
2155 -362 -144 8 58 557 812 417 -1107 -530 761 458 -141 -21 5 -416 -657 598 988 -461 -937
2174i37O16N71j40K5L4k65r66O96J493o76q36p5L47M42r15J062M88j930N5J179
2194B68j12N9l67L41k89o50Q72Q65n79j076J58O29O02r87P14p2j275J83J219K00
2214G03r54o19O93R6m93P28N77r10o44K01J302j71j008L85N24r14J45R60M69j040
2234C0j212J196N96l17%K78q53m94K68J444j54j225o2L78m05N00M41j12o67o35
2254a005O82J099o79j77J92k62K3M11J014p05j191L39N25M1J8l9k32p27m9J154
2274D32J99r33l10K15K46o2L74M82n80r72N68R44O7l80m87K89k10j05J130O5r16
2295E6k93J41N34J87o60K76n69o87R01N57J06q67k41L92J40k01O71k91r60K56
2315e52M46O63k89n32K19p7pM72K93l32m37o79J064k1k82K86l19l37K28K52N77
$$ plain form
2174 -937 -321 250 110 135 169 -96 -1062 -366 1127 451 -385 -460 -113 329 -586 476 964 -966 -911 268
2194 268 156 215 -152 189 -100 -750 122 987 408 -668 -510 119 721 -266 448 376 -899 -716 503 703
2214 703 -251 -870 -177 -81 -574 154 731 -179 -823 -622 680 509 -499 -114 410 -504 -359 601 1070 30
2234 30 -1182 14 610 293 293 571 -282 -776 -508 936 782 -443 -505 -127 -532 -32 409 297 -370 -1005
2254 -1005 -323 776 97 -80 112 -150 -127 284 1298 593 -598 -259 266 307 325 286 54 -673 -722 432
2274 432 631 -302 -612 -397 -151 -213 161 643 63 -909 -341 603 670 290 -197 92 -118 -223 907 972 56
2295 56 -237 -96 438 625 -35 241 -328 -1015 -114 443 549 -318 -559 -167 -27 -228 443 152 -808 -552
2315 -552 -106 557 268 -264 -45 -122 -129 343 636 304 -133 -812 252 231 -51 235 -84 -421 -193 59 636
2336F36l35j004M82J16J83L89n43k48j62J0Q54k3p5k46m52J33J45N03M8p15k83
2357e87L93M03J76J21n84K49n34K75O10j0o23j27j29O02N2k4l35k68P2L51K42
2378C25P7m72o09M89j91M97J54m72q1q5L0N74L54n54j02k15L09K58j6K97q99q7
2400d19N58J57K16j85n72J47l2j46R20n89n83J43J50L65J10k73J84m59j83O36
2420A45L21l6o75k80M53K69M0K36l28n71O3N07M92o11k99J01j15J91P6K22j98
2441Co45J17O43J83k46r9q0k71K68N65N23p60o70L54J36L32j20j0L05r05J5Q72
2463E10k56l56p9j38R9k3N55O9n66o55P54L57k37k12K0O0k63L91P34m27m15k58
2485c36M45m5L41l45M77o96l42Q40j11j31m21L41o3j09J05M49k57n07n2O23J53
$$ plain form
2336 636 301 -703 -221 -105 78 467 -76 -324 -486 -476 378 355 280 34 -418 -285 -140 363 411 -304 -587
2357 -587 -194 209 385 506 -78 171 -363 -88 522 512 -111 -238 -367 235 287 263 -72 -340 -268 83 325
2378 325 402 -70 -679 -190 -381 116 270 -202 -283 -368 -338 236 590 36 -66 -281 28 286 270 567 -332 -419
2400 -419 139 296 512 327 -245 -98 -130 -276 644 55 -528 -385 -235 130 240 -33 151 -308 -491 145
2420 145 466 430 -245 -525 -72 197 237 473 145 -426 -363 144 636 25 -274 -173 -288 -97 -21 201 3
2441 3 -642 -525 118 301 55 -44 -124 -395 -127 438 961 201 -469 -115 21 353 233 223 528 -377 -362 510
2463 510 254 -102 -181 -319 -220 -243 312 381 -185 -840 -86 271 34 -178 -158 -98 -361 30 764 337 -78 -336
2485 -336 109 64 405 60 537 -159 -501 339 228 97 -324 17 -46 -155 -50 399 142 -365 -417 206 359
2506C59q5k42J97p88L25R46j79m10o26N20K33j89J34J23l66l78J96L95K37n71
2526a69o5K36j56l6O62k06n21m62P30N04m02q7j2l45J8J27O65l65m80L2L89k05
2548a48L97R0k19k69m94O57L50l2q89N43K85J5k49N83O0j172K80O03j16k62k72
2569b59K76k43j36O70Pn51m27M92JM78k52l9R1p26P15J88K91o53k26J49J79q2
2591e7K58J64o56l4J86K32N8l33o9n6j43M93J36J22n32l29N79K04k12K27k83m01
2613d46J74N08L18k45n80K81J51k66K26J4J00n30q4M72J78l04m4k23l1M6N73O5
2635C53m61k59J66L15J8P9j9j36j72l8N18J46m38j27j6O8L56k52L83p89m03P45
2657C7o7K90l50l44O2J04J52K73j48m00K11k20O18k0j90k01J16j06J86K26l2m66
$$ plain form
2506 359 274 32 229 -559 -234 712 533 123 -503 17 250 61 195 318 -48 -426 -230 165 402 -169
2526 -169 -234 2 -154 -190 472 266 -255 -717 13 517 115 28 16 -329 -311 -184 481 116 -364 -332 57 -148
2548 -148 249 339 120 -149 -643 14 364 332 -557 -14 271 286 37 620 680 -492 -212 391 275 13 -259
2569 -259 17 -226 -362 308 315 -236 -663 -171 -170 308 56 17 108 -618 97 285 576 -77 -303 -154 25 -57
2591 -57 201 365 -291 -325 -139 93 151 -182 -251 -307 -450 43 179 301 -231 -560 19 223 11 238 -45 -446
2613 -446 -272 236 554 309 -271 10 161 -105 121 135 235 -295 -379 93 271 -33 -77 -300 -331 -285 288 353
2635 353 -108 -367 -201 114 132 211 192 56 -116 -154 364 510 72 -55 -71 -3 353 101 484 -305 -708 37
2657 37 -30 260 -90 -434 -372 -268 -116 157 9 -391 -180 -400 218 198 8 -193 -77 -183 3 229 197 -269
2679b69L5J87J14K47rk82l68M76k89L75J21n89o9J33J67J57J48n16K6KJ85L11
2701B93j23j93j08K85j70K05J92m61K6k75J78N59k0n81K7j16J81K80K9j93j59
2722a44l16O01Q9k44j14J64k11L0K59J74j40k64k54L96k00P32l51q8l76K68K88
2743B99J39k86m62R8l3L13k3N46p61l38M28q1M51m2l81K00k23K23K47j23n30J25
2765b14N8L71k6M4n9l57l40O55L46j98k64l69M42j39qM70n04l18K60K30M45l25
2787B00j08J98m23j1L00R3j79l25K1J56nK30j0l39M3j90K79O21p28O9J33j98j1
2810a84L66K79l36m45K14L56j18j08O2k71K33J8K0K63o93l8K11J8OL71l22o4l41
2833e03L59N33k8m09R7N0r1r9M77J1o82O4M59p4k28j93N53l23j93j8N74n39J9
$$ plain form
2679 -269 -234 -47 67 314 305 23 -345 131 -158 217 338 -251 -320 -187 -20 137 285 -231 -205 -203 -18 293
2701 293 170 -23 -131 154 -16 189 381 -80 -54 -329 -151 408 388 -193 -166 -282 -101 179 208 15 -144
2722 -144 -460 141 230 -14 -128 36 -175 -145 114 288 148 -116 -370 26 -174 558 207 119 -257 11 299
2743 299 438 152 -310 -212 -245 68 45 591 -170 -508 -80 -161 290 248 -133 67 -156 67 314 191 -339 -214
2765 -214 -156 215 189 233 174 -183 -523 132 478 280 16 -353 89 -50 -58 412 -92 -410 -150 80 525 200
2787 200 92 290 -133 -144 156 249 70 -255 -234 -78 -83 147 137 -202 -159 -349 -70 551 -177 -108 25 -173 -184
2810 -184 182 461 125 -320 -106 250 132 24 86 -185 48 66 86 349 -344 -382 -171 -153 -147 224 -98 -162 -503
2833 -503 -144 389 361 -48 49 99 8 -91 386 397 -285 -221 238 164 -64 -257 296 -27 -220 -238 336 -203 -184
2856a84J1J2K74l64K49Om18J88N09J20n03k46O7M53l58M35J20n05p0L28NJ89l42
2879b4n6j02j69K08N58l50l31L29k71J53K9J40Nl78j32K52K73K05o98J30K73p5
2901c1K62kj13j00J7K28K5j65p8j58rJ87J34k2j19o72L62J01j3J37K21k04k21
2924b33j34N68K24l28k52l2K06O9K85k57j42l37K40M32p7r3Q1j35k6j28L56k78
2946Ik05r0j22K08K66j95M4N9q7l7L77pk58j07K24j8PM8J1l51J97Q2J96j9m10
2971a78J80r0n1N20m74K10j13k53K41L12k57Q5j94j66R9MK34O9n81J28J53O4K06
2994A48n2m0l8k55M21L46m16k6l07L81j86K41J3j9m22K99J09q4J03l28M9q1J2
3017a32L60j72j73K53l45K98N4n47N20k83J49Q9R4j30M0j71P5k8L16P3j41l30
$$ plain form
2856 -184 -173 -161 113 -251 -2 4 -414 -226 283 403 -100 -346 -279 174 -184 251 371 -134 -204 124 129 318 -24
2879 -24 -80 -182 -351 -143 415 65 -266 63 -208 -55 -26 114 119 -259 -391 -139 134 339 -359 -229 44 -31
2901 -31 231 229 116 16 33 261 286 121 43 -115 -124 63 197 175 56 -616 -254 -153 -166 -29 192 -12 -233
2924 -233 -367 201 425 97 -155 -187 19 88 373 116 -26 -363 -123 309 232 139 220 85 59 -69 287 9
2946 9 -196 -286 -408 -200 66 -129 -85 -26 -113 -150 227 220 -38 -145 79 61 68 116 127 -224 -27 55 251 232 -178
2971 -178 2 -88 -139 381 -93 117 4 -249 -8 304 47 132 -62 -228 -129 -125 109 178 -403 -275 -122 -58 148
2994 148 96 56 18 -237 184 530 114 88 -219 162 -24 217 230 211 -211 88 197 113 216 -112 -63 -144 -132
3017 -132 228 56 -117 136 -209 89 143 -404 116 -167 -18 71 165 35 75 -96 -21 -49 267 340 199 -131
3039a31l4j18K56L65n73j80J5J78l1M18m5j09k83Q3L03M1j90L0j12L74k45J85
3061A97J64k76l41K29oK21q7n4k6l06K84PJ66l32j21K88r0O5K72m18K90l25J48
3084e1jJ16n5j6m7j10J13J41J04m12J80K22l00O6m2m5m8J60K78m5k09k98O6J26
3108a07K30N4j31k13n9m8N32l01K35k0k42N4j25L38N7l09J14j9K22q8Q5o8m46
3131b55M2J09M59k31q3M4k05K34j65J09L0l62N3L06J83j05j97k26K21j86R7M12
3153B84l89j10J56j8M34m83mJ89n34K01O04p6r3k09j15J00L54k47l8k84K8K93
3175D3Q4p1k12K97k26k85L33K21k1j43m32M78J90l56J56Q2l47m5L22K09k3l94
3197a40m4N8N11j01l0j91k37J51J23K94l44K7k0l43J11K0N2N50o95J45K66j07
$$ plain form
3039 -131 -165 -283 -27 338 -235 -415 -400 -222 -253 165 120 11 -272 -189 114 155 -35 -5 -117 257 12 197
3061 197 361 85 -256 -27 -33 188 101 47 21 -285 -1 6 172 -160 -281 7 -83 -18 254 -164 126 -199 -51
3084 -51 -52 64 9 -7 -54 -164 -51 90 194 -218 -38 184 -116 -50 -92 -137 -185 -25 253 208 -1 -299 -233 -107
3108 -107 123 177 46 -167 -226 -274 258 -43 192 172 -70 -16 -141 197 254 -55 59 40 262 174 259 191 -255
3131 -255 -213 -104 355 124 41 85 -120 114 -51 58 88 -274 -221 85 268 163 -34 -260 -39 -225 -128 284
3153 284 -105 -215 -59 -77 357 -126 -130 59 -475 -274 330 254 161 -48 -163 -63 291 44 6 -278 -250 43
3175 43 127 56 -156 141 -85 -370 -37 184 163 20 -412 66 256 -100 56 138 -209 -254 68 277 254 -140
3197 -140 -184 -126 385 284 254 63 -174 -23 100 394 50 77 57 -286 -175 -155 -103 447 -248 -103 163 56
3219E6K10l27qk6o6K36K09q4k00O2j46L26j01j83K67l23K31J41j73q6m20K10J32
3242f3O9J44o9l02Q9N2L28l14m2J70k02j70N44J96m09m8j76L39q7j28J01Q1k05
3265a02K20k26K25p6j45%J75n2J03n6m9l1l68M35J72j67L0k22r1M43j22J45k45
3288dk28K6K56J81m54L49k17J12l67N25Lk63l9k02N28J13l01K07l02j91J57K2
3310h9L36j77l41R6L54l3L3n4j91j1K4M4O8R4K4J09l20J47p0K13j20l45o9L41
3334F3j8L01k91k39m6K13J95q5k00j24M8J8K64j0j28O6l33K54K10J8r8k44J57
3357iJ39k93M87j96l35j50L16L60j47q0j53l2N6L10j78o2k49p7K28L06p1q2r2
3380dj84j07K79M68k28n73K90J36j99L15j33J66k27J36k60L98l74L7K25k81l2
$$ plain form
3219 56 266 -61 -69 -95 -161 75 284 200 0 62 -84 242 141 -42 225 -98 133 274 101 15 -405 -195 -63
3242 -63 6 150 81 -221 -132 -80 248 -66 -108 62 -140 -310 234 430 21 -27 -203 136 49 -79 22 103 -102
3265 -102 118 -108 117 41 -104 -104 71 19 122 66 17 -14 -382 53 225 58 88 -134 -225 218 96 241 -4
3288 -4 -232 -206 50 231 -223 126 -91 21 -346 179 182 -81 -120 -322 206 319 18 225 -77 -268 -111 -89
3310 -89 247 70 -271 -175 179 146 179 125 -66 -77 -53 -9 59 153 177 286 -34 113 43 256 136 -209 -278 63
3334 63 45 346 55 -184 -230 -17 178 93 -107 -231 -183 -165 99 89 -39 27 -306 -52 158 176 78 -166 -9
3357 -9 130 -163 324 128 -207 -357 -41 319 172 92 -61 -93 -37 273 95 33 -216 -293 -65 241 170 88 -4
3380 -4 -188 -295 -16 452 224 -349 -59 77 -122 193 60 226 -1 135 -125 273 -101 -64 161 -120 -152
3401a52K70j05K0m86M67J39k35J11J61j79l32K68K32m4k89J4n1J92J61k36M64
3422C90l23k05K81j12p3q9o9K78J22j76J6J21m40J30k98P74m99J50q4j00J46L16
3444B56J3l12j41Q1J87j25J25K26j37l17K42J94j03j55L1N0m24J00L90Q0j02l97
3466b38K28J98l85J73K59m41m1K01K53j4j21k48J57K21J3m6qj25k10O1L06k80
3488h7J13k31L26k67K48k68M28o56J53K19Q4l5P8l30Q0k8L58K08o18k4K92j87
3510a44J24O6K60k91k22N0J13J83j87J62j92J29k3K81nj36m42M57m2k6j29o4j76
3533b54P7n5K68O5k70q5j50M13p5L89m29j73q8L64j2K50j85l39M65j26p4J02k8
3556E0l9p5q5K80N7K19k58l91K31J30q0J63o41K24J1J69OK75k58P6j23J55m3n7
$$ plain form
3401 -152 118 13 33 -453 14 153 -82 29 190 11 -321 -53 179 135 -154 -140 -191 1 162 -74 390
3422 390 67 -138 143 31 -42 -131 -200 78 200 24 40 161 -279 -149 -447 327 -172 -22 -106 -206 -60 256
3444 256 269 -43 -184 -103 84 -41 84 310 173 -144 98 292 189 34 65 115 -309 -209 181 261 159 -238
3466 -238 -10 188 -197 -24 235 -206 -247 -46 207 193 72 -176 -19 202 215 169 161 36 -174 -113 193 -87
3488 -87 26 -205 121 -146 102 -166 262 -394 -241 -22 62 27 105 -225 -145 -173 185 393 -225 -249 43 -144
3510 -144 -20 46 306 15 -207 -157 -44 139 -48 114 -78 51 28 309 304 168 -274 183 141 115 -14 -78 -254
3533 -254 -177 -232 36 101 -169 -254 -404 9 -66 323 -106 -279 -367 -3 -15 235 50 -289 176 50 -24 78 50
3556 50 11 -64 -149 131 188 407 149 -242 -11 119 39 202 -439 -215 -204 -35 -29 246 -12 64 -59 96 53 -4
3580dk66K37l7J57k3o9M8k72K00J12m0n0l7l8%J71J4j22k5O4l17R5L94Lm29K27
3606gk31J67K06l36M01k32j2M6O7o1L7l2j14K07J31K5j41j82j10O7K79Q1l32J67
3630I1n06M21J93l19k02J76R4j09J55j10L83l24L8l0k53O62k13k2l14J73K96k4
3652B56l11n0l6L13K49l78J20j46k01l4L46O0J39l01k10L60l60J58J12j4r7k60
3674b85J52L38p1J23m72J49L42N8j10l10j28J04P0k8J90j04n8j01O1L57l80o9
3696a72J70n1j05J11j83M00k18k9J13L0o0K24k70M8J22J24O3j74l88j62L60l9
3718h6K70n1l28K24n8P5Q7k03K83m67J81K10j12J75J23p56L65P8N1q7p5J7O4j4
3742c4K77M3l27k2m9K62J08j97j09J99m20J36L93j57p4j81J88J99j64L44k71l01
$$ plain form
3580 -4 -270 -33 -70 87 64 -5 43 -229 -29 83 43 -7 -44 -82 -82 89 103 -19 -44 20 -297 -202 192 195 -234 -7
3606 -7 -238 -71 135 -201 200 -32 -44 2 69 8 45 13 -101 106 237 262 121 -61 -171 -104 175 256 -76 91
3630 91 -415 6 199 -120 -322 -146 -52 -161 -6 -116 267 -57 -19 -49 -302 360 147 125 -189 -16 280 256
3652 256 -55 -105 -141 172 421 43 163 17 -184 -218 128 188 327 26 -184 176 -184 -26 86 72 -25 -285
3674 -285 -133 205 134 257 -215 -66 276 334 224 -86 -214 -110 -40 -68 122 18 -40 -141 -80 277 -103 -172
3696 -172 -2 -53 -158 -47 -230 170 -48 -77 36 66 6 230 -40 8 130 254 317 143 -245 -407 -47 -86
3718 -86 184 133 -195 29 -29 46 133 -70 213 -254 -73 137 25 200 323 -433 -68 10 61 -26 -101 -84 -20 -34
3742 -34 243 286 -41 -63 -112 150 258 61 -48 151 -269 -133 260 103 29 -152 36 235 71 415 144 -157
3764a57m4j93P68l43j27J20J94m33M43Lq1k90j40K30P9J12R3k56Qj56l1K31r2
3787f2l6Ln5P0J28l30J92J68j24K61l8k52r7J46j1k2J37m0j16j1k4O4K49Q0n5
3812B25k36j81JK32k11K89r6l3M0J31r6q0l1j76R2K25M3r7Pnk9j91L99m6k07k49
3838b80J00J81K14j82j04R8o5P7k60L68j20j22M38n10K97j62ql2r4K53o9J03k02
3861h1j55M14k98K64K06k95k76L47q2p8l3J37j93J64p7K1K62l97j25R6J93J4J12
3884A40l36O7J34j05J96j54O4j5q3j43K47J91k65j54l8L80k25K67j28j39k2OL29
3907B14Rj00n8l57K88K48p6j28k39N3k09M75k99L20n0l47n8K64L49j69j95j0J5
3930f0L5R2j07K93l47N8K99l42J92j13k29m3M19k62J90p5o8K52j51K8J43n34j53
$$ plain form
3764 -157 -201 -394 374 31 -96 24 218 -215 228 231 150 -140 -280 -50 29 141 234 -22 -14 -170 -201 30 -62
3787 -62 -98 -95 -150 -80 48 -282 -90 78 -46 215 177 -75 -172 -26 -37 -59 78 38 -78 -89 -113 -49 200 280 225
3812 225 -11 -192 -191 41 -170 119 23 -10 30 161 65 -15 -46 -222 -130 95 138 41 48 43 14 -177 222 176 -31 -280
3838 -280 -180 1 215 33 -71 27 -38 39 -221 147 27 -95 343 -167 130 -32 -40 -72 -166 87 18 121 -81
3861 -81 -236 178 -120 144 350 55 -221 126 44 -34 -67 70 -123 41 -36 -15 247 -150 -275 -179 14 28 140
3884 140 -196 -129 5 -100 96 -58 6 -9 -92 -235 12 203 -62 -216 -254 126 -99 168 40 -99 -121 -115 214
3907 214 223 123 65 -292 -4 244 168 40 -199 -146 -355 120 -179 141 91 -256 -314 -50 299 130 -65 -75 -60
3930 -60 -25 67 -40 253 -94 -36 263 -79 113 0 -229 -272 147 -115 75 0 -68 184 33 61 204 -330 -483
3953d83M31j87L84q2k77K36j23o2K98j19r6N4rJ03k71L89K7m73L31q5L5N3j68
3976i4k9J11p4K93q5j7o5k48K00N5r7pM8L7r7p0J39m0r6J67%j36J03K39l39J50
4002D8m7J4J95J16l34r3l2lJ10K11p6m14K89K5K64k05k51K41P7l99J93K42K99
4025D70n32L0q4J50M5j4j34J33k07M37l60R1j08K04k99J0P9J31K10m24K75k0k36
4048a53M31l45k01K98n4K51k30N8j90J79J86J0j48o1j92L4L77k32Q1j27M4Q6j00
4071BJ81j77K69k38k97K97J40k64N3o6J3K10k77M46o05j1J59K03%P9r0r3k5P5
4095a6K26j80K5j26j39K58QQ6j43r7N4J01R7j88N40m85K9j37Q2L67l88j8J16l30
4119b58M11j96J18J3j98N9l8q3P6J97j70J37K07m08J41K2o1n5J8J46p2Q7k32J47
$$ plain form
3953 -483 -52 -239 145 63 -214 22 -101 -163 135 16 -80 -26 -35 68 -203 186 213 -260 71 -14 21 74 -94
3976 -94 -123 -12 -86 207 122 105 40 -208 -8 47 -50 -57 -9 28 -69 -139 0 -40 -136 31 31 -105 -2 237 -102 48
4002 48 1 15 210 326 -8 -101 -133 -136 -26 185 109 -305 -16 9 273 68 -183 58 135 -264 -71 171 470
4025 470 -62 -32 -116 34 79 65 -69 64 -143 294 -66 25 -83 121 -178 -168 -89 42 252 -172 103 83 -153
4048 -153 278 -67 -268 30 -24 227 -3 55 -135 44 230 240 92 31 -161 -127 250 18 99 -28 16 102 2
4071 2 183 6 275 37 -260 37 177 -87 -34 -100 -87 123 -154 292 -313 -324 -165 38 38 117 27 -66 -91 -16
4095 -16 210 30 55 -71 -210 48 56 142 -1 -98 -44 57 154 -34 506 21 50 -87 -5 362 -26 -44 72 -258
4119 -258 153 -43 75 88 -110 -51 -89 -172 -96 101 -69 68 275 -133 8 30 -31 -86 -68 78 6 93 -139 8
4143Hj57Q3k46K29j01j46J64L91j87j3j79M9N7L7j42N0o2K44K7N2qj59r6l1L92
4168B56q5j94K56k49j66L47k23M5L9p9n3J70n5L37j86k71R8r2R5o4J03j02R3L7
4192E7P0K32k82q3j40L28j64K2J61r5k99J55K8K96k50r9j53K09J17j56r6J16k12
4215b38K42k10K62K74k44j45K11n8JK37l18Jj29K44k31L14Pk90N9O8N5J9N5j16
4239G0q7J6j2j9J05k34j19M00k78K29R6l94K4J71K63k30j16NJ6J24k61K07on2
4263h2M8j95M07p9o4K15o32L14K7K03Pk1j22l17J05J43M7k5n3p1R7J38j43J50
4287I7p2k28J66J06j04K51j84j67L06k24K08k66l7J76J65j67j90J85j40K56l29
4308a92K34k40J48n0l9J95o1K70k62n5O8m5N7J6j59j21L09p9r4L30j09j87L13
$$ plain form
4143 8 -149 -66 -312 -83 -184 -330 -166 225 38 25 -154 -105 -48 -11 -153 -103 -165 79 106 158 150 -9 -105 -136 256
4168 256 171 -23 233 -16 -182 165 -58 -13 26 -53 -106 64 9 346 160 -111 -13 -105 -10 -74 29 -73 20 57
4192 57 127 359 77 -6 -146 182 18 40 201 106 -193 -38 -10 286 36 -63 -216 -7 110 -46 -142 -26 -238
4215 -238 4 -206 56 330 86 -59 152 94 95 332 14 15 -114 130 -101 213 220 -70 -11 57 112 131 186 70
4239 70 -17 -1 -13 -32 73 -161 -280 120 -158 71 167 -227 -203 -32 231 1 -115 -110 -94 30 -231 -24 -30 -82
4263 -82 -34 -229 178 99 35 250 -382 -68 -41 162 169 148 26 -291 -186 -43 4 -21 -74 -145 -48 90 -53 97
4287 97 25 -203 -37 69 -35 216 32 -135 171 -53 155 -111 -148 28 193 26 -164 21 -119 137 -192
4308 -192 42 -198 -50 -100 -139 56 -5 265 3 -52 16 -29 28 44 -115 -236 73 -6 -100 230 121 -66 247
4331B47k70R9l0R5k37pk25K60L9l86N71l64j66L16O8K6l18O5L7J94J34lj26r3
4355g4J08j1J55k19N8j87L35j07k04L11P0l19M6k25J45L72l53K07m44l0L70j40
4377a36M9J56j76K62M5p8j71k0L8j4NM0K58j31%Pk00m6J84j64N6P3j1L1m1p0j30
4404a84K7K20N7n5J98l41m3K33M1L27k26m51L75m9o8J02j53j52O9k3K43j70j8
4427d1O4j13o7K49r3O0j66J75L03l70J65n1o3p0j64J83J07l00K98j8j61J26L20
4450C73l21p5k58L45r7M8q9K56m3q4j48J91K80o04K70kJ50m7j6l23M4O4K6k04
4474b64J59J98k51j73K78K88j18j60k8J64M8L7j69j20J38m5J2Lj30J45P3J88k25
4497D8K5N3o0j36r7R7K54l35L02j92r8K42m1K12l93r0J07K02l7p9J08j95R8k24
$$ plain form
4331 247 -23 76 46 141 -96 -103 -328 -68 -29 -415 156 -208 -374 -58 10 36 -282 -217 -180 14 148 145 19 -74
4355 -74 34 23 178 -41 17 -170 165 58 -146 165 235 -84 -38 -263 -118 254 -99 108 -336 -366 4 -136
4377 -136 -87 69 -107 155 200 122 -49 -69 -31 -45 -40 0 258 127 127 134 -66 -112 72 -92 -36 37 26 57 16 -54 -184
4404 -184 -157 63 120 65 263 -78 -121 112 153 480 254 -197 178 129 61 163 10 -142 -73 -96 147 -23 -41
4427 -41 23 -90 -157 92 -1 59 -107 68 371 1 166 115 52 -18 -182 1 108 -192 106 88 -73 53 373
4450 373 52 -23 -281 64 -33 15 -74 182 139 55 -93 98 378 -226 44 42 192 145 129 -194 -150 -86 -60 -264
4474 -264 -105 93 -158 -331 -53 235 117 -43 -71 93 141 178 9 -111 27 -18 -6 -3 -133 12 85 273 48
4497 48 73 126 66 -70 -167 -70 184 -151 151 -41 -139 103 62 274 -119 -209 -102 100 63 -16 92 -103 -5 -229
4521b29L67j31Q0r4j25L6K0K44j80L1L0j97K35K65j85k81K59m05L09j0R0M8k0
4544A57Mj37p3J45j06R1l2j56o2J00r3J97j57J34k47N25l26j60J13j81L97n2q4
4567cj81O9O5J88p3j27j32j52K02J44p6K83k96J0L75l15L35n55K23o7j34N98l55
4590B6k30J53j60K69P9l52J76K6r1j7L7L67l75K37m48p6L07J97j26m0q1n5o0K71
4614C4J29P7l61L2qJ13J72o7k3j44J71j91J82m9k71K51o8k36P2J09j45J80j41
4637a82K36J36j23J25k87m9K29Q1P1j38k84p1O7K25q6J78k7j30j24J94n3N7N1
4660I6m1j87L76k11k83K89l01N85l99L69k40j41K95o1k05Q5j97K38J83l70K84
4681A64k56K35k69J77L2L7l71L53k62J83L8o7K05k25p8L46k05l3K3j94L75j97
$$ plain form
4521 -229 138 7 87 -7 -132 -96 -76 168 -12 19 49 -148 87 352 167 -114 145 -260 49 39 129 177 157
4544 157 161 24 -49 96 -10 81 49 -107 -169 -69 -162 35 -122 12 -235 290 -36 -196 -83 -264 133 81 -3
4567 -3 -184 -115 -50 138 65 -62 -194 -346 -144 0 -76 207 -89 -79 296 -19 316 -239 -16 -83 -217 381 26
4590 26 -204 -51 -211 58 137 -215 -39 -13 -104 -121 -84 283 -92 145 -303 -379 -72 125 -1 -41 -122 -177 -237 34
4614 34 163 240 -121 -89 -97 16 188 121 98 -46 125 -66 116 67 -204 47 -21 -257 -185 -76 -221 -41 -182
4637 -182 54 190 67 192 -95 -144 85 166 237 99 -185 -256 -189 36 -50 128 101 -29 -153 41 -12 45 96
4660 96 55 -132 244 33 -250 39 -262 323 -76 293 53 -88 207 146 -59 26 -171 67 250 -120 164
4681 164 -92 143 -126 51 83 120 -251 102 -160 23 61 -6 199 -26 -104 242 37 4 27 -167 208 11
4703A1nq2J55k23J23j30J16R4j2K36l50l6J96k8LP9j36k50K55P3rk66L1K0J46
4728A1N6J43l63K01k25K44J7p2M1j23K67Rn6O8Jk18P9p7M4J43p6k43%oJ15J82
4754A62k47L00l33n2K0K89n6K7j64O3q4Q6M47k51l35k7K05L28m04k6J44j69K9
4777d8J30j62O6m3j3%j57K00J02j57j57K81j39J80j17k29N30l10LJ11L0j34K5
4800hk2J68P8k39j7n9J48Q8j84J13r2q4PK35J32l33Q1q3K52j67J01m59N17l22
4824a49J94j42L32k94J39J47k25J45k92L42k58j03P5J73J54j64l4J00j99J44j37
4845e2J69j04Q6l16J77m4R8k20J48k12L64J38j53K00l70mj08M52j79P1l9k39M9
4868h8M9J49j51J50j64%L0j6K0P1j72J86Kk31J71J9k61k0L07Q7o6k8k11J46j03
$$ plain form
4703 11 6 -76 79 -144 -21 -151 -35 59 47 283 -67 -103 93 65 68 147 11 -239 16 89 80 -186 -155 -135 11
4728 11 67 210 -153 48 -177 67 84 12 53 -70 197 206 150 218 219 1 80 3 47 190 114 -129 -129 -135 -20 162
4754 162 -85 215 -118 -170 -150 139 83 110 -54 9 -75 11 458 207 -128 -155 50 378 -26 -52 92 -77 -48
4777 -48 82 -80 -14 -57 -70 -70 -227 -27 75 -82 -239 42 -97 83 -34 -263 267 -43 -40 71 101 -33 -8
4800 -8 -30 138 216 -23 -40 -99 49 137 -47 66 -26 -110 -103 132 264 -69 12 -71 181 14 115 -344 173 -149
4824 -149 45 -97 235 -59 80 227 2 147 -145 197 -61 -164 -89 84 238 74 40 140 -59 85 -52
4845 -52 117 13 99 -217 -40 -84 14 -206 -58 -270 94 232 79 279 -91 -95 -203 249 70 141 102 -137 -88
4868 -88 -39 110 -41 109 -55 -55 -25 -41 -21 50 -122 64 66 -165 6 25 -236 -256 51 138 72 44 -167 -21 -124
4893a24L00k03q9R0j21J55J18J0n9l9j38K44q7K20j66l84M70l53J14L03J14k86
4915H9j34K03Q4k46N9Q5l99K08P3J81J25l61K8J13k2J72r6j06K8j26oR3k06J80
4939A9l7l1K27j40j56J51m0P8J71j03p9Rq7L4R5k31N2J79m81L2K74R5j18J38q9
4964c8J19p0K38o6j02K06n00P4J91n9J44J0j99J33q1M06n36J46j04O3J80k18M9
4987a4k24M3P7Q2J85k05J04K29k05qq5l9L28l51J60l4J47j11j42Q3J06k38K17
5010A05l74K30j11k05L15k8Lj66K47M8j47J88J9q0m06J08K93O4l3j98J86o7P6
5033F7J20j39j3l9J8j72L71k5m34K67J85J30m05L88k77k07R2J49j73L51o8j91
5055ej20J05k81K84k33K21K67k69q7L17L3j02j35J07Ol7N5k15l0R0P9j05P2j64
$$ plain form
4893 -124 176 -27 -116 -26 -147 8 126 136 77 38 -100 144 57 277 111 -273 197 -156 -42 261 375 89
4915 89 -45 158 242 -4 55 140 -259 -51 22 203 328 -33 -5 108 86 258 162 56 84 -42 -48 45 -161 19
4939 19 -18 -49 178 38 -118 33 -7 71 242 139 60 69 -18 16 111 -120 -68 111 -370 -338 -64 31 -87 51 -38
4964 -38 81 11 249 183 81 287 -213 -139 52 -7 137 147 -52 81 0 406 -130 16 -88 -25 155 -63 -14
4987 -14 -238 -195 -118 -36 149 -56 48 277 72 64 -21 -60 268 -83 77 43 190 79 -63 20 126 -112 105
5010 105 -269 -39 -150 -355 -40 -68 -65 -231 16 64 -83 105 124 44 -362 -254 39 103 70 -128 58 -9 67
5033 67 187 48 35 -4 14 -158 213 188 -246 21 206 336 -69 319 42 -165 -73 76 -97 254 186 -5
5055 -5 -125 -20 -301 -17 -250 -29 238 -31 -118 199 232 130 -5 102 108 71 126 -89 -119 -29 50 -55 17 -147
5079a47N2J7J12K8j5Q4j32j71J90O5j90J43o8j57K6K43J38j65J68j12j15J31L6
5102A61l05L04J93j43J74p23K13j60N58k91R4J33n0l79J71j12m3K99M8k47q5L59
5124A69j89J5k59L15R7j57K96k20K38l87o5L20j48m7m2J28r0r3J47J31o1L5l96
5147b63K98M5MN1m30L58J70j23L4j36j48J92K49n70K50J60n5J00k32M29l71Q3
5169I5p6J5o5OJ93Ok29q5K72Krl3l1J57l22J73j0P5l15L46j35j46K15j58K80l10
5195h9n0K1O3R0O5P2j67k99L77j89M6J25K4Q4j90q7j4K94r8k97K45J63j88N1L6
5220H8K15k40Q9k37k6J54k29J58k3J01J0j13k07M51j58Q9r7R1j15l9M4j1j1k99
5244c15K57O8j00o9J21M0k66J43N2Q4L7q9J72p0j27P8n2k5O3L2K96j36l40j4J25
$$ plain form
5079 -147 -95 -78 34 62 47 131 -1 -172 18 83 -107 36 -32 -189 -163 80 218 53 221 109 -6 125 161
5102 161 -144 160 353 210 384 -339 -126 -286 272 -19 75 208 158 -221 -50 -162 -205 94 142 -105 -190 169
5124 169 -20 -5 -264 51 148 -9 287 67 305 -82 -147 173 25 -22 -64 64 -26 -119 28 159 98 133 -263
5147 -263 35 80 84 135 -295 63 233 110 144 8 -140 52 301 -269 -19 141 86 186 -46 383 12 95
5169 95 19 34 -31 -25 168 174 -55 -140 132 134 125 92 61 218 -104 69 59 134 -181 165 30 -116 99 -59 221 -89
5195 -89 -139 -118 -55 35 100 172 5 -294 83 -106 -60 65 89 173 -17 -104 -118 176 78 -219 26 189 1 52 88
5220 88 303 63 152 -85 -111 43 -186 -28 -51 50 60 -53 -260 191 33 122 25 116 1 -38 6 -5 -16 -315
5244 -315 -58 10 -90 -159 -38 2 -264 -121 -69 15 52 -37 135 65 -62 16 -36 -61 2 34 330 194 -146 -160 -35
5269c5K9K7L5j51J88o5j75J24L1n5r5N6O9k9N1J26j57k68K43L9L53k9k1k70j71
5294a50R2L71j11l14M0J28j26L40l20k7Nk02L56j90K66j8j17j47L8L0j03J59K25
5317B25m06J79J43j33L22l59j37J84q5J87Q1j96O7o1k31J78J3J38j93K18k50K74
5339A58J09l53J29j59J37M9j50J76k60K37k41lL09j98J52j55J45m5k2r9R1j09
5361a02M7p9NK6K77k6j16j17O1J31k87R2j40J19K33l4j75K66k01j33J84J95j71
5384E5j26j43L43r2J25j18j90P0J55k30J18k53J65l1L05j75J30p6p1m7k8j40Q8
5407a66K62m5M9k99J61p7J49l2o3L90j85k79K95k0p3R0J10l80m0J11j43P7J99
5430I1k04K92j44j26J04j06kj0J74n8J25j27R7k31j04K23L1J01l7q6J51l14Q6
$$ plain form
5269 -35 -6 21 56 -95 93 28 -147 -23 8 -47 -142 -86 -17 -46 5 131 -26 -294 -51 -12 341 312 291 21 -150
5294 -150 -58 313 202 -112 -72 56 -70 270 -50 -77 -72 -274 82 -108 158 140 23 -124 -86 -56 -159 0 225
5317 225 -181 -2 141 8 330 -29 -166 18 -67 120 201 5 72 11 -220 -42 -29 109 -84 134 -116 158
5339 158 267 -86 43 -116 21 70 -80 96 -164 73 -168 -171 138 -60 92 -63 82 37 15 -84 7 -102
5361 -102 -55 -134 -129 -103 174 148 32 -85 -24 107 -180 -88 -228 -109 124 90 -85 181 -20 -153 31 226 55
5384 55 -71 -214 129 37 162 44 -146 -76 79 -151 -33 -286 -121 -152 153 -22 108 32 -39 -86 -114 -254 -166
5407 -166 96 51 100 -199 -38 -115 34 2 -61 329 144 -135 160 140 67 157 267 -113 -153 -42 -185 -108 91
5430 91 -113 179 35 -91 13 -93 -95 -105 69 11 136 9 106 -125 -229 -6 25 126 89 3 154 -160 -74
5453g4K75j21j29oK18r5q3m1Pj13J22K10l9J17l70M73k95k33j6M15l18J04j77
5476a69K19J08j11j83L01j41Q8N2j94K03R9l32J73j73J06o9O8k22L35j5k54L4
5498g7P6L9l1N6J38l49J52K1j5J72k66K68l24K35k05O2J20k51J8J23J39K48n79
5521b30J43j1J78k87K17K12k78K27k98J40o6J76j40K79k73K1J10r2j14K41l25
5542a70noJ80Q3l29M07k33o0K11k32K92n5j03j95J28K53j51P1j52K49k85K03o5
5565C6j96K40l86K36P0k5K71l59J83l62M15N7q8j40J00P0p3j21J48j93K09j53
5587f1J0J36o8M5k95L52p8o6Ko9k22L48M2m8l37L72j77L51k24J09k06J68l62L92
5611A14j13J15j28J20j02l3K4k01J61l6L02on5K5N6m41Q8M1N5n8J13n2k08K20
$$ plain form
5453 -74 201 80 -49 -55 163 68 -15 -56 -49 -162 -40 170 131 248 -122 351 56 -177 -193 222 -96 8 -169
5476 -169 50 158 47 -136 165 24 112 164 -30 173 272 -60 113 -60 46 -23 45 -177 158 143 -111 -77
5498 -77 -1 38 7 63 201 -148 4 25 10 182 -84 184 -140 95 -110 -48 72 -179 -161 -38 101 349 -230
5521 -230 -87 -98 80 -207 10 222 -56 171 -127 13 -53 123 -17 262 -11 10 120 28 -86 155 -170
5542 -170 -175 -181 -1 82 -247 160 -73 -133 78 -154 138 83 -20 -215 -87 166 15 86 -66 183 -102 101 36
5565 36 -160 80 -306 -70 0 -25 246 -113 70 -292 123 180 92 -48 52 122 49 -72 76 -117 92 -61
5587 -61 -51 85 17 62 -233 119 41 -25 -23 -92 -314 34 76 28 -309 63 -114 237 13 122 -84 84 -278 114
5611 114 1 116 -12 108 6 -27 -3 -204 -43 -79 223 217 162 187 243 -198 -110 -69 -14 -72 41 -11 -219 1
5635AK37k67K66n6k01Q7j27K44j57n6qJ40o7M2Q7j7q4l7n8j23J80k5K3k61n8L77
5661H2J3Q8p6k91K59K2j63K71j35k08L68k19j0M9k26K83k2q6K40j53r6J85k98
5684a23k9K34k06J58OJ9K2o8n8J39k9r0J53q8j55R1J1k00L30l01L2J13K39k97
5708i7L76j20Rk95L33j01N1R3l98K57M7k80q1K53R0l02O2K12j7K2R6k52p4Q9m1
5733f8K21n4j36r5OK64k11m7J35k45K97o8rJ35k52J66j2J09j66K84m2m16K86J09
5757A91kj91m2K02k10j49K60k30n2J03j52J10L38j68k26K10j75J74o5K75j86k63
5779b48L44l23J24J19J12k94M22j89j54K72o5Q0j39m1J06%K70l86l1q1M4J58j5
5802H5J99m32J30j02K08J77k35m8J39j37K64j51j5j53L2J11n61K45L59k76J53
$$ plain form
5635 1 238 -29 237 181 -20 67 -60 184 27 -29 -37 103 36 78 165 148 64 27 -31 -154 26 1 24 -237 -295 82
5661 82 95 183 107 -184 75 97 -66 205 70 -138 230 11 1 50 -176 107 85 -1 239 86 -10 175 -123
5684 -123 -152 82 -124 34 40 59 81 13 -45 94 65 -25 128 40 -115 -24 -13 -213 117 -184 -152 -39 200 -97
5708 -97 279 159 168 -127 206 105 156 249 -149 108 155 -125 -206 47 137 -165 -103 109 92 114 210 -42 -116 -27 -68
5733 -68 153 99 -37 -132 -126 138 -73 -120 15 -230 67 -1 -10 125 -127 39 27 136 -30 254 212 -204 82 191
5757 191 189 -2 -44 158 -52 -201 59 -171 -223 -120 -272 -162 176 8 -218 -8 -183 -9 -74 201 15 -248
5779 -248 96 -227 -103 16 128 -166 256 67 -87 185 120 200 61 20 126 126 396 10 -21 -102 -58 100 85
5802 85 284 -148 -18 -120 88 265 30 -18 121 -16 248 97 82 -71 -39 72 -489 -244 115 -161 -8
5823hr0K43N9M1Nj36k01r4L80j08k42O%j3K74q6M9o6p1j8J00P1n1q7Q6k23L52
5850A72O7j66m6j28J7J15M0j46R6l4K24n8R0l07J3J19N6j72j92Q7L29k01K1J83
5874A79k58j27J19O6o4K16j85j8m0J84l23j3L19P6J09k99J4Q2PM4l14J2K2K99
5898A07l1n9k54J38K18j10l7J21q8n4l8k7J78m4j07K36k00k8K14j90n4p1K16J61
5922A97Nk81K45K8k13L5j42K87j70k22K91k8L61k92j28j28lR0J0k2j08k0J60J0
5946c8P0N8Q8k0n4k06n3M0J74l26L55j60J37j24O5r9K58j61j3J92k84K78k33j9
5970g5O4j5J98j91K12n23M23j11q0m3JmJ26L16k52q5O0M2J95k97J42k86m4L48
5994A21p7R4k79K05j70K3K2pJ75q7j31K55j94J48n41M58M4k06K12o9l1R6j16N6
$$ plain form
5823 -8 -98 145 204 245 250 114 -87 -181 199 91 -151 -145 -145 -158 116 30 79 13 -58 -76 24 95 44 -43 43 -180 172
5850 172 239 73 27 -101 -84 31 71 -75 21 -13 211 153 243 -64 -51 68 124 -48 -240 -153 176 -25 -4 179
5874 179 -79 -206 -87 -21 -85 131 -54 -72 -112 72 -251 -264 55 131 240 -59 -45 37 44 88 -226 -214 -192 107
5898 107 76 17 -237 -99 119 9 -28 93 5 -49 -87 -114 64 20 -87 149 -51 -79 135 -55 -109 -180 36 197
5922 197 202 -79 166 194 -19 16 -126 161 -9 -231 60 32 393 101 -27 -155 -158 -68 -58 -80 -188 -208 -48 -38
5946 -38 32 90 178 158 104 -102 -155 -115 59 -267 88 -72 65 -59 6 -93 165 4 -9 183 -101 177 -56 -75
5970 -75 -11 -26 172 -19 193 -330 93 -18 -98 -141 -140 -144 -18 298 46 -39 21 63 258 -39 103 -183 -227 121
5994 121 44 138 -141 64 -106 -83 -61 -68 107 20 -111 144 -50 98 -443 15 59 -147 65 -4 -35 61 -55 1
6018AP4j55m6m5q7J92J65j12q7q9K48k10L37l14J85J02p3k14K2K23l6k65k4M18
6042B10j03j05O6J10k04j38J82o1N0M3J68l19J26k83K88%o2n5J25J65J0k99K22
6065A36l4q5J6l3J40k47m3Q3Q9K0K73k44p8J33j47pL4j92J17M5j17M23k57j18
6089i3J74j89K38k59p3K18J65m62L01j28J52N0p1J23j01K13o8k32L6R8j53J29
6111F8k37M5L33K9k36K38l22L46l56o5M1k75K36K15l91M60j84J3K88j92j21J82
6133A15O9k85J82J2J11m90L37j13L85m34J37J62k18r8K88j90k3p2L00l34j5J91
6155A7o7Q4j15J06J6qN3q5k30J97L1L4j3j43J51j25K13M6k60J77J27j14j71K33
6179A54k43K39l71K66k68L70k21K06k01J53k55j1J46r0J06j12J62Q0m6j93L13
$$ plain form
6018 1 75 -80 -126 -171 -258 -66 99 -13 -100 -189 59 -151 186 -128 57 159 86 -128 -106 117 81 -184 -208 210
6042 210 107 2 68 178 -26 -164 18 -43 7 50 218 -101 25 -258 30 30 -32 -87 38 203 213 -86 136
6065 136 102 17 33 0 140 -107 -150 -67 22 42 315 71 -7 126 -21 -28 6 -186 -69 -24 -141 282 25 -93
6089 -93 81 -108 130 -129 -202 16 181 -281 20 -108 44 94 23 146 45 258 190 -42 -6 92 -61 68
6111 68 -169 -124 209 238 2 240 -82 264 -92 -157 -116 -391 -155 60 -331 129 -55 -42 246 54 -67 115
6133 115 184 -101 81 93 204 -286 51 -62 323 -111 26 188 -30 -128 160 -30 -53 -125 175 -159 -174 17
6155 17 -50 34 -81 25 41 33 86 1 -229 -32 -1 33 20 -123 28 -97 116 162 -98 79 206 92 -79 154
6179 154 -89 150 -221 45 -223 147 -74 132 -69 84 -171 -182 -36 -126 -20 -132 30 110 64 -129 184
6200A84k32O9K3j3N2k0L9k19J54o3R9J60m13J84j0J45J38j05j63l8R5j93P7PK80
6225B37j28l84L81k12P4K75l48J93k31jK10p3J46j21K5K42m87J40R8j10%N14n31
6248i1J82m10L25Q4j63L5j19O4M2J8M6K0k86L34k6j79L45k36R3J13l48K5K08O3
6272A39k68j7K22k19nQ2knlK9M5J08k32P3J76k88K08k8oO1j05n5K23n3K24j97
6298A07j09J08j43J80j55n7J17K5P3p6m9q8J52k01J05j4O9j95J06L8J03Q5l66
6321a85j6K62n6m4q5L99l21K54p0j81J08l73K82J10j4j84J12J43j4l9q8p3J11
6344C8Pl99qM17k04K11J2m9j82L96k47J02j26j78M42j41j26q8K61j07Q8r9N1j88
6368a17J98l0J27l27J88j12P1O7r3k8P5O1l54L31K41k76M7j1k02J21k19R0n5K63
$$ plain form
6200 184 -48 21 44 31 83 63 102 -117 37 -26 73 233 -180 4 -6 139 277 172 9 -29 66 -127 -50 -43 237
6225 237 109 -275 106 -106 -32 243 -105 88 -143 -144 66 -7 139 18 43 285 -202 -62 36 -74 -74 440 -91
6248 -91 91 -319 6 90 -73 -38 -157 -93 -51 -33 13 33 -253 81 55 -124 221 -15 78 191 -157 -132 76 139
6272 139 -129 -146 76 -143 -148 -66 -68 -73 -76 -47 -2 106 -126 -53 123 -165 43 15 9 70 -35 -90 133 80 304 107
6298 107 -2 106 -37 143 -12 -69 48 73 146 70 21 -67 85 -116 -11 -25 44 -151 -45 -7 96 181 -185
6321 -185 -201 61 5 -39 -124 275 -46 208 138 -43 65 -308 -26 84 70 -114 -2 141 127 88 0 -73 38
6344 38 45 -354 -362 55 -149 62 74 25 -157 239 -8 94 -32 -210 232 91 -35 -123 138 31 119 20 71 -117
6368 -117 81 51 178 -149 39 -73 -2 65 -28 -56 19 80 -274 57 298 22 69 58 -144 -23 -242 -152 -207 56
6392E6j01J48%k08K68l66J71K56l58M3J8L2J16j74J18jk25K69k89k2J80J47j46
6415f8J37j62R2O3L8m2O4j46j29K68k81J57r3L71l61j11M47m41J94J65m30N16
6437B48j64j50j95L53J89j96R5m80M15L63m20k0P5j68K97j37Jk18K28k07K58o4
6459A03k16J19K98j62K05o7k40j69rM3J81j30J5L5m4RL4j33J57n6J35j48J91M4
6483A95P1j4j57N8n7Q3k12k13L79k60K04j00k05L48q4k18J09k03K10j79J11J24
6505a0j05j1R7K5k73K47q4Q1K08K54n55J51Ok09J98M5QJ90k85j43M27l17O7ro6
6530f3J75R2p0k28R6j04J66k3j2lJ5n9k18K72O5l31m1L89k80m2K76j30L96o30
6554b92L8K16m5K38l66R0K60k40J62j08j79P9J73J31k58J84j54j39K91j23K6N2
$$ plain form
6392 56 -45 103 103 -105 163 -203 -32 224 -134 -91 -73 -41 75 -99 19 18 -207 62 -227 -249 -69 78 -68
6415 -68 69 -93 -1 62 100 58 122 -24 -153 115 -166 -9 -102 269 -92 -203 244 -197 -3 162 -268 248
6437 248 84 -66 -261 92 281 85 180 -300 115 478 58 38 113 -55 242 105 106 -112 116 -91 167 103
6459 103 -113 6 304 142 347 280 40 -129 -138 -95 86 -44 -29 6 -38 -29 5 -128 29 -27 108 -40 151 195
6483 195 266 252 95 153 96 179 -33 -246 133 -127 77 -23 -228 120 36 -182 -73 -276 -66 -245 -134 -10
6505 -10 -115 -126 -29 -4 -277 -30 -114 -33 175 429 -126 25 31 -178 20 65 73 263 -22 -165 262 -55 12 3 -63
6530 -63 112 204 134 -94 2 -102 64 41 29 26 41 -18 -236 36 101 -230 -271 118 -162 -204 72 -58 338 -292
6554 -292 -254 -38 -83 155 -211 -121 139 -101 61 -47 -226 -147 26 157 -101 83 -71 -210 81 -42 -16 36
6576C6j80J18J53k77K15j45j19L66k51J46j01K93j79j57o8K51N6j49r1j67o9M10
6598I1K51l60J26J9k24J68k30M87k62m44M37L7N5Q7k74K20r4j29J75j43l3J89
6620A49l7l02K83j15J98j10P3j14J27m21K41q6j53K89j68Qm1J33nj35K64km6j3
6644A7k49J4L57j8j50m8J74r0j42K5K54k18q0K27n0K63m59J52l27L8M70j01l13
6667b54K56qo1Q0lJ73j11q2L2J83j2l50P7L45l02k35J26k5J01J21k98J23K45o
6691A15q9j25Q4j18J57j48J51qj48J43K88m00J63l4q3K0j08J10L56n81N15m32
6713a72J07%p7L22l39K30l58L70j3j35Q9j85L16j62p2J64m95L82K8Q8j5R8k65
6736i4q2M37m60K06k4J5%m08K38K08Q8m3k4l0PJ3R3j47N3J1K0Rj34j6J34J3J2
$$ plain form
6576 36 -144 -26 127 -150 65 -80 -199 167 -84 62 -39 254 75 -82 -150 101 157 8 -83 -250 -319 91
6598 91 342 -18 108 127 -97 71 -159 328 66 -378 59 96 151 238 -36 184 90 -39 136 -7 -40 149
6620 149 112 -190 93 -22 176 66 139 25 152 -269 -28 -114 -267 22 -146 -138 -179 -46 -51 -186 78 76 30 17
6644 17 -232 -218 139 121 -29 -77 97 7 -135 -110 144 -74 -154 73 23 286 -173 -21 -348 -310 160 59 -254
6667 -254 2 -6 -67 13 10 183 72 -10 22 205 193 -157 -80 265 -37 -272 -146 -171 -70 51 -247 -124 121 115
6691 115 26 -99 -15 -133 24 -124 27 19 -129 14 302 -98 65 31 -52 -32 -140 -30 326 -255 260 -172
6713 -172 -65 -65 -142 180 -159 71 -287 83 70 -65 24 -161 155 -7 -79 85 -410 -28 0 88 73 171 -94
6736 -94 -176 261 -199 7 -17 -2 -2 -410 -172 36 124 81 57 27 34 47 140 -7 46 57 77 86 -48 -64 70 83 95
6763I5l2k60K97j58j63J20l27M29J19l78J55J75rN5j32K28k12j98K02K58k49Q5
6785A00o7j64K9O4l7m2N9n1Q8K25l90N1P6K2r3Q1J20jk7O2l9j55r3j52M55N6j84
6812gK98m56Q9J75k72L69j16J08j90k48J45L9L3nj04K54j75M9m6j45K16j70L57
6835A98l21j7J19j6R1J18j97j93k3L22k04L8P7R0J5O5k02j20K38rq2J06j20m0
6859f7j7Q9l0j37K81k38L58k40j69K95j10Q0J08j3j00j8k0J6l24L75J07l34nN9
6883e4r7K64l2l18K34J0n3O8j9Q7j85J52k14K35p1k8K03k85K03q4K04Q0l40N0
6907A0J33q4j9K5K3o0j05J25m43M78P4k77J9O3l2J39j88j0J96k11L44k61m2J37
6931C4r6%J15k40K41j0j77J97j30K47k15J39j91j44M03k45R5P7j58M1R2q5J42
$$ plain form
6763 95 63 -197 100 -58 -221 -101 -428 1 120 -258 -103 72 63 118 -14 214 2 -196 6 264 15 100
6785 100 33 -131 -102 -38 -75 -117 -58 -109 -21 204 -186 -135 -59 -37 -130 -49 71 70 43 105 66 -89 -182 -334 121 177 -7
6812 -7 291 -165 -76 99 -173 196 80 188 -2 -250 -105 -66 -33 -38 -142 112 -63 -14 -60 -205 11 -159 198
6835 198 -123 -140 -21 -37 54 172 -25 -218 -241 81 -123 -85 -8 82 97 162 -40 -160 78 69 -13 93 -27 -67
6859 -67 -84 5 -25 -162 119 -119 239 -1 -170 125 15 95 203 190 90 72 52 68 -256 119 226 -108 -113 -54
6883 -54 -151 113 81 -237 -3 7 -46 22 3 90 -95 57 -157 78 7 -21 182 -103 100 16 220 300 -40 10
6907 10 143 59 40 65 88 28 -77 48 -395 83 157 -120 -101 -38 -70 69 -119 -129 67 -144 200 -61 -103 34
6931 34 -62 -62 53 -187 54 44 -133 64 -66 181 -34 105 -86 -230 173 -72 23 100 -58 -17 75 -10 132
6954A32j65J02Oj60K98k09o9r6J11k63K30Q7l9p3L8J38j4J37p5n2n2k04K59m7
6978B0M1k45L25k90J31l6l15J85K25n6J64LO1kj13K3j46m0K32k12K00j81K93k90
7002b3J4J19k13J25P3J97n11L17m9l3j4o9J38j73J47p3M1n4r6J43L8N2K3M5k63
7027i9L8J91J36k61k8R3j77R0r3J3K60N5k13Q4J1k48K26o5L1j32N7j5k01PL08
7052F8M4k46j2K72k80J50j45K30n3Ok3m4J40j84M2J14O9j83J15j01k35K98n3j31
7076a42L95p2n9ro2l16J79L1j33K63j13K42k80N4J98k11n3J63J34j57L3n8K46
7099B73n03N28l17J49N7l65K78j93N2L67k40j35J85j3n7m6NM2jJ43o8m5o0k3O
7124A9J63l80nJ42J04K46m62m0L02o2l2j3n1J53K9p0Q6l1k31J44mj10K7R3oj8
$$ plain form
6954 132 -33 69 75 -85 213 4 -65 -161 -50 -313 -83 4 -35 -108 -70 68 54 191 116 64 12 -192 67 20
6978 20 61 -184 141 -149 -18 -54 -369 -184 41 -15 149 152 213 211 98 121 -25 -65 167 -45 155 -26 267 -23
7002 -23 -9 110 -103 22 95 292 -219 98 49 16 2 -67 71 -102 45 -28 13 -41 -137 6 44 96 119 164 -99
7027 -99 -61 130 266 5 -23 70 -107 -17 -110 -97 163 218 5 89 100 -148 78 13 44 -88 -31 -46 -247 -240 68
7052 68 112 -134 -146 126 -154 -4 -149 81 28 34 11 -33 107 -77 -35 79 148 -35 80 -21 -256 42 -11 -142
7076 -142 253 181 122 113 51 -265 -86 -55 -188 75 -38 204 -76 -22 176 -35 -88 75 209 52 85 27 273
7099 273 -230 298 -19 130 187 -178 100 -93 -41 326 86 -49 136 123 66 20 25 67 66 209 141 96 36 13 19
7124 19 182 -198 -203 -61 43 289 -173 -213 89 27 -5 -18 -69 84 113 43 129 98 -133 11 7 -103 -76 17 11 -7
7150gm1R5j29M0J20k8O3qM2J56k36R4j64jn1J63k20J61j67L08j21k1J03k90R2
7175d7L41j54M1k98m1l4J11j40J02J06p8J89M1l27L3L33k02j46J35J95j32P5j55
7198e2J17m4J04n13N04p8k78L64m25L43J11j36j05K65p3j15K00l85r4K80rJ36
7220A17J2r9j98J63j0K70m7j05q7M0L6q6Q0J79m33N6J93j34J26j31k6J55K2O2
7244A55J06j28k45N1J19r7r6J94kP6K6k71K47k77J96j20J50Q5o5j53J40o8k32
7267b09K30j71J60N6k36K51q8MM3P7j58P9j9M3j89R0Mq1j7K5N8J19p8n0OJ94k51
7294a08K37j42J02k34l9K41N8m5m3J14o7o8R8o6Rj02nM4K71k25j80J91kJ07j13
7319C3N3j17lj32K79M0j05K7k40j74M51k08K24l9j61j02L00q8j28L32j06l54K06
$$ plain form
7150 -7 -48 47 -82 -42 78 50 113 105 147 303 67 161 -3 -4 -55 108 -112 49 -118 190 69 48 151 -139 -47
7175 -47 294 140 181 -117 -158 -192 -81 -221 -119 -13 -91 98 139 -188 -155 178 -24 -170 -35 160 28 103 -52
7198 -52 65 21 125 -388 116 38 -240 124 -301 42 153 17 -88 177 104 -11 189 -196 -290 -10 -19 117
7220 117 129 30 -168 -5 -15 255 208 103 16 56 92 6 86 265 -168 -112 81 -53 73 -58 -84 71 93 155
7244 155 261 133 -112 -61 58 -39 -135 59 57 133 159 -112 135 -142 54 -66 84 169 104 -49 91 23 -209
7267 -209 21 -150 10 66 -170 81 -7 -3 40 117 -41 38 19 62 -127 -37 -33 -114 -131 -106 -48 71 -7 -57 -51 143 -108
7294 -108 129 -13 89 -145 -184 57 115 70 27 141 74 6 104 38 47 -55 -60 -16 255 30 -150 41 39 146 33
7319 33 86 -31 -34 -166 113 153 48 75 -165 -339 112 -96 128 89 -72 -174 126 38 -90 242 136 -218 -12
7342a2k23K50K6l23M16j11j90J67o3J6L9l1J19L4K6l60M52j07j13J90m44L06m9
7365A5j60K10K27m34K66n6q5R2J05%l5k01j27O7R5K13k89J45J37m9j49k57J76
7388i4o4K08K1j14r8l2L94j16O8j30r9J17M4o6K41l57j25J76m3j5K94k82J59J8
7412A05j02j25J4K59k16n1K94k87P5j31K03J18k76N7J95j94M1J5L0j09j13K21
7434B3L6k59L0L7K50k24o9J39P4J1k65J48L11Ml22K12k39J87l2P2K7j4k10m8J58
7459C7J7j81L7L5OQ6K3j44J38k26K99m55K34K0qj59K21N2m65K29j29L88j34M6
7483c3M8j00J37k2j4J16j56R6k75j5J91J66k84J08j32L12k29J0J01j16K3P6J33
7506A41k08n8J38K19l16J20J39m4j23m7J28m80N37J9k56j5K27k93J27k81K06L14
$$ plain form
7342 -12 -235 15 41 -282 134 23 -167 0 -63 -47 -8 -39 80 114 140 -220 232 125 12 202 -242 64 15
7365 15 -145 65 292 -142 124 68 -17 75 180 180 145 -56 -183 -116 -21 192 -97 48 185 136 -13 -270 -94
7388 -94 -158 50 71 -43 -141 -173 221 105 173 43 -56 61 105 39 280 -77 -202 -26 -69 -84 210 -72 87 105
7412 105 3 -122 -108 151 -65 -116 178 -109 -34 -165 38 156 -120 -63 132 -62 -21 -6 24 -85 -198 23
7434 23 59 -200 -170 -133 117 -107 -176 -37 37 48 -217 -69 242 246 -76 136 -103 84 52 124 151 137 -73 -121 37
7459 37 54 -127 -90 -55 -49 37 60 -84 54 -172 127 -328 -94 -74 -82 -241 -20 32 -433 -204 -333 55 -79 -33
7483 -33 15 -85 52 30 16 132 -24 72 -203 -218 -27 139 -145 -37 -169 143 -86 -76 25 -91 -68 8 141
7506 141 -67 -125 13 232 -84 36 175 131 8 -39 89 -391 146 165 -91 -106 121 -172 -45 -326 -120 194
7528A94k59J43j8j56J49K57m04M4l7P5M0p6M0l56K90J21Q6k15p3k8k13N04k20
7551a12J36j9q4O1J14j08O7o2J29k79R8o3j47M03k05r5N4J51k8m4q1K23k87L30
7575A52j48k13J05j8J11JJ59j45r0n1J06J43j24j91nJ82j20K70l1j49K58p8j0
7598A14lO4l51K75k47N8J55j18Q0nj6K91j09j32j87j92K50J88j47J54r2j85J52
7621cj88K87l00L19k45JK32j4r7l8Jj19J53K55l24j02K73j82Q5J24l7J06l73L53
7645A67k03M6K79k69k0j00J83k8N1k19K74j31j5k05k8L50j86J50l22K24j07K15
7667A06k64L98k07l9R2l39K22m1J4K2Qq4K62k79J25rL7q0J88l68K52j46J06l9
7691f3k9k11J35K83j45p8M30l36j39M9k8J73Q5r9k12L21k91J11QP7P9k0j40K59
$$ plain form
7528 194 -65 78 60 -96 53 310 -94 -50 -87 -12 28 -48 -8 -364 -74 47 133 -82 -155 -183 -396 108 -112
7551 -112 24 5 -79 -18 96 -12 55 -7 122 -157 -59 -122 -269 134 -71 -166 -112 39 11 -33 -114 109 -178 152
7575 152 4 -209 -104 -122 -11 -10 149 4 -86 -137 -31 112 -12 -203 -208 -26 -146 124 93 -56 202 124 114
7598 114 111 175 -176 99 -148 -90 65 -53 27 22 6 297 188 56 -131 -323 -73 115 -32 122 30 -155 -3
7621 -3 -191 96 -204 115 -130 -129 103 89 -8 -46 -45 -164 -11 244 -80 -182 91 -91 -6 118 81 187 -186 167
7645 167 -36 10 289 20 0 -100 83 55 106 -113 161 30 15 -190 -218 132 -54 96 -226 -2 -109 106
7667 106 -158 240 33 -6 86 -253 -31 -72 -58 -36 -28 -112 150 -129 -4 -13 24 -56 132 -236 16 -130 -24 -63
7691 -63 -92 -303 -168 115 -30 -108 322 -14 -153 -104 -132 41 126 27 -185 136 -155 -44 -36 41 120 100 -40 219
7715B19j91L2k6P4l6o3r7p9J52k59K00J31j18J70k59J26J3k0Q4J01l21K42J43
7738B18l31K9J22N4j22l24K61N2j99K52o9J43k09L07l66O1j3R0%l2N8J67l55L20
7762A14j55j74K87j52K01j33P2m3K14l52J90M7j39K7Q1J1k22L99l31J95n1q1M6
7785E1J9j55K91k08k57M39j06J45q3o9K3p6j4O8J09k29J82j36p8K88m36L00J28
7808A96l33L10m28M60k64J82j43J7J1K7Q1k1j19j83Q0K4NLo6J8J23r6M00l8k87
7833d1R2Qj94J94j57j32L8L22M2l39K96j19J96r2j6k7Q3k37L76m67N2J52k62M04
7857A72k30K48k45k23L18o0k76J76O7q3L56k50o9K18k29J17j13K27q1J57l78J30
7879e1j72R9J1J32j51n7K10K84k12Q1j73j00J20P0q6oL8r9r9l9%K16r9J44J66
$$ plain form
7715 219 28 60 34 108 72 9 -88 -167 -15 -274 -74 57 -61 109 -150 -24 -11 -31 53 154 -167 75 218
7738 218 -113 -84 38 92 -30 -354 -93 -41 -240 12 -57 86 -123 184 -182 -121 -134 -44 -44 -76 -18 149 -206 114
7762 114 -41 -215 72 -80 121 -12 60 17 231 -121 69 116 -23 4 85 96 -126 273 -58 137 86 5 51
7785 51 70 -85 206 -2 -259 180 74 219 136 67 90 14 0 68 177 -52 130 -6 -84 204 -232 68 196
7808 196 -137 173 -255 205 -59 123 -20 -3 8 35 116 95 -24 -207 -127 -103 -98 -95 -161 -143 -20 -116 284 246 -41
7833 -41 51 59 -135 59 -98 -230 -192 130 172 -167 129 10 206 114 98 71 154 -83 293 -174 -122 30 -232 172
7857 172 -58 190 -55 -278 40 -20 -296 -120 -53 -136 220 -30 -99 119 -110 7 -106 121 40 197 -181 -51
7879 -51 -223 -124 -113 19 -132 -189 21 305 93 174 1 -99 21 91 5 -1 37 -62 -161 -200 -200 16 -83 61 227
7904B27l9Kl30K3R4p5nP3Q1k90L20k87L57o6j11K74l80k49K40O9O6r8J39l1L1
7929C5j4k81J49K0J25j74M2n7l9R7J5J30rQ1r5j82m7K84k03K06L8NPk06m9j95
7955c17L73j49q3J65k3nj02J96NO6J31m83L07j08N2L98j41j09j50lj24K3J24J
7979D4j59L81j94k41J86j3j24J17o1J61K35k87q4L50l56p3K0Q9n2M8q6K92l43
8002a50N48k68j63N9j33J01J45p3k64K42M3l51L72o6k58R6O5j6K31l06J37M29
8024D20l35j49O4R4j91O8K8L5j36J70j05l3m0j13K91m4R9j45l0j03K29M1k65N3
8048i7J1j09K50j71lJ73m5J86n0k83L24k95k9n6L3j33K57K4J63kk98J78J48j98
8072b2M8J36j73j54J33q7K22j75L2K4j80M97k92jr8kj82PJ4L73j19J36j91j2K66
$$ plain form
7904 227 188 190 -140 -117 -23 -98 -103 -30 51 -239 81 -206 151 85 -26 248 -132 -381 -141 -72 -6 -104 35 4 35
7929 35 21 -260 -111 -91 34 -140 -98 -155 -194 -97 -82 48 39 120 25 -157 -204 80 -123 83 121 126 133 -73 -122 -317
7955 -317 56 -93 -176 -11 -34 -39 -141 55 60 126 257 -226 81 -27 25 423 282 173 23 20 -104 -81 43 44
7979 44 -115 266 72 -169 17 4 -120 -3 -64 97 332 45 -39 311 -45 -118 -98 -9 -61 -13 -99 193 -150
8002 -150 398 130 -33 26 -107 -6 139 66 -198 44 87 -264 108 42 -216 -120 -55 -71 160 -146 -9 420
8024 420 85 -64 0 94 -97 -29 -1 34 -102 68 -37 -70 -110 -223 68 24 123 -22 -52 -155 74 115 -150 -97
8048 -97 -86 -195 55 -116 -119 54 9 195 145 -138 186 -109 -138 -194 -161 -294 -37 -13 150 148 -150 28 176 -22
8072 -22 26 162 -11 -165 -32 -119 103 -72 -40 -16 -196 301 9 8 -90 -92 -274 -267 -253 120 1 137 -54 -66 200
8097B00l6Jj59k97K45p7M68jk39q4j11L38k91k0K27k65J93j58J23j50j8L3PJ78
8121A07J05r9J09k23j94J20j37J66O9J13j1J26j56j27j31Q5M3j09J40mL8j2p4
8144e6J41j6j44J75j20j72K79r0k8Q9n7P1O1k44J03J49n9j81j7J29p4J55J25p5
8168A44k33Q2J07J88j43L2j72l69L50k29L03mr8j90L55j76qJ22J40j41l86Q0L76
$$ plain form
8097 200 164 165 6 -291 -46 -123 345 344 105 21 -90 248 -43 -63 164 -101 92 -66 57 -93 -111 -78 -71 107
8121 107 212 113 222 -1 -195 -75 -212 -46 23 136 125 251 95 -32 -163 -78 -35 -144 -4 -8 30 18 -56
8144 -56 85 69 -75 100 -20 -192 87 -3 -31 58 1 72 133 -111 -8 141 82 -99 -116 13 -61 94 219 144
8168 144 -89 -7 100 288 145 177 5 -364 -14 -243 60 56 -42 -232 123 -53 -61 61 201 60 -326 -246 130
8191A30
$$ Imaginary data points
##PAGE= N=2
##DATA TABLE= (X++(I..I)), XYDATA
0@%%%%%%%%%%%%%%%qJ6j6J6j6K0k8L2l6M4m9N7o9P8q9J03j18J34j50J67j89K13
37A12k40K69k98L32l71M12m55N02n56O14o77P46q21R05r97J100j213J339j484
56g81J647j834K052k307K615k995L473m092M938o168Q122j1712K0423p8784j10419
71a75822J31020N6153j2918K9929Q9886N791n8405L1786P5073p9479j19251j4150
83d0387L5977j6507l1496M4651L5136q9317m8096O2461J1181q2564m9382L9693
95a28650K9024k2304O5588J07975j1947n1962K9474N5696j2885n4804J4791K7018
107D7014m4947r62P9483L0497n9328o0134J4092q17p2025j2326L7331l4234m2327
120a18683M5397Q2735Q846m7764J4173K5274l8933l642N4248K2360l0623j1390
$$ plain form
0 0 0 0 0 0 0 0 0 0 0 0 0 0 0 0 0 -8 8 -8 8 -8 12 -16 16 -20 24 -25 32 -37 41 -48 55 -63 71 -79 88 -101 112
37 112 -128 141 -157 175 -196 216 -239 263 -293 321 -356 390 -431 474 -523 577 -636 703 -781
56 -781 866 -968 1084 -1223 1392 -1603 1870 -2222 2716 -3452 4670 -7042 13381 -65403 -175822
71 -175822 -44802 11351 -1567 28362 118248 124039 65634 97420 172493 93014 -26237 -40387
83 -40387 -4410 -20917 -52413 -7762 27374 -61943 -110039 -47578 -36397 -118961 -168343 -128650
95 -128650 -99626 -121930 -56342 51633 39686 -12276 17198 72894 60009 5205 19996 47014
107 47014 2067 1105 80588 111085 51757 -8377 5715 4898 -67127 -79453 -42122 -76356 -118683
120 -118683 -73286 9449 18295 -29469 -15296 9978 -28955 -32597 21651 44011 13388 1998
132A998O5775M7276l5266j4408Q555m2061n0487M395L9146j6779n7220J5843M1394
145H161j5745j0873J4572q918m5474k0772N2739L8452k1527P049L4984J1873j52
158D4369J2859K3773k4837n5975R292L5578o502j2515L331J77k5723j9500K5405
171I732k544n3918k2008J2380J2779P602J0380K2166q518k3708K4108L0789n203
184A4037j5367n019J4790P924O545L0495M88l6587j3578O522N410j0873k0542
197a5755m525j2912j0033K3591J3422j2812j9797j3859J2126J3031M310J2798
209a0415m054q680J5624K1355J9066k630k0604n115r11O925J7738m909j4552j1833
223b995q631J0304N393j0466j5060k2588q08J8991Q949Q459j961j2728R80R965
$$ plain form
132 1998 67773 115049 79783 65375 73930 31869 -18618 -14223 24923 8144 -49076 -33233 8161
145 8161 -7584 -18457 -3885 -12803 -58277 -79049 -26310 12142 -9385 -2336 32648 44521 44369
158 44369 57228 81001 56164 189 9481 45059 38557 26042 29373 29550 3827 -15673 9732
171 9732 7188 -46730 -68738 -56358 -43579 -35977 -25597 -3431 -11949 -35657 -11549 19240 14037
184 14037 -1330 -6349 8441 16365 22910 53405 53893 17306 3728 10250 15660 4787 -15755
197 -15755 -20280 -33192 -43225 -19634 -6212 -19024 -38821 -52680 -40554 -27523 -23213 -10415
209 -10415 -14469 -23149 -7525 13830 32896 30266 9662 4547 3636 10561 28299 23390 8838 -2995
223 -2995 -11626 -1322 4071 -6395 -21455 -44043 -44851 -25860 -16911 -8452 -10413 -23141 -22161 -12196
237a2196J9237J0227j7579m589J1368R082J7039R697m427j6760k2433R424J4826
250B2916j4423j2585o506n829J669O425J7112n616l5735o868J6054N957L644M649
264i136Q030k468l730L1572K3495k1516j9689j207N289Q2R88J8627m276l1107
278e046M804K3588l812k4753j8586O88j0144j0935L0256K2344k1224j2488J7134
291h174K0469p019j4261J2771m758k4379J8732L9003O586k0926p930J8608o380
304B2342k4125R957K282l3282j7472K4041L0684j0361k0323J5279j653k7067N918
317b3780K2721o209k8903K452M3339J3872j3463J5556Q881k6157j8358J7669K1331
330B8951k5908k7066K5725J7323j3568M680J6348j2740m1878q792L4043k372k9064
$$ plain form
237 -12196 7041 17268 -311 -4900 6468 15550 32589 42286 37859 21099 -1334 8090 22916
250 22916 8493 -4092 -10598 -16427 -14758 -8333 8779 3163 -32572 -39440 -23386 -17429 -13785 -9136
264 -9136 -1106 -3574 -7304 24268 47763 26247 6558 5351 10640 10722 11710 30337 26061 -5046
278 -5046 -242 23346 19534 -5219 -23805 -23117 -33261 -44196 -13940 8404 -12820 -25308 -8174
291 -8174 12295 5276 -8985 3786 -972 -25351 -6619 32384 38970 18044 10114 28722 22342
304 22342 -1783 8174 10456 -22826 -40298 -16257 14427 4066 -16257 -978 -2631 -29698 -23780
317 -23780 -1059 -7268 -36171 -33719 9620 23492 10029 25585 34466 8309 -10049 7620 28951
330 28951 3043 -24023 1702 19025 5457 10137 26485 13745 -28133 -36925 -2882 -5254 -34318
343c4318J0762K2287l413l946K5591K1566l3785l2774K4296J7734j5909k109K1038
356A7020N934k2123O266L8110j1920m6232o843J4192o516j3592J7580K3430k4317
369i011j8132L4103J9098k5106k1696P511P479j7801J0488M2336j773k9664O913
382D745K7115q55k7740l465J0548k5424j5338L4361K2264k1242k0418J3582J2428
395A0561k3653p380K0516j3570k8494J2253L8657J1238k0653L272J9777j5652
407F872j3902K1116R702k5109j9899K4034K7857j4500p885J5773j3361k8181J543
420a5940K1564m203l3164P77K6926j520m893J6911N736k1566j9242K0138K2883
433A4407j7576r543J8137N846o329Q501K1200o626l5469l742K1315n724j2167
$$ plain form
343 -34318 -23556 -1269 -4682 -8628 16963 38529 4744 -28030 -3734 14000 -1909 -4018 17020
356 17020 22954 831 7097 45207 33287 -12945 -19788 -5596 -12112 -25704 -8124 15306 -9011
369 -9011 -27143 6960 26058 952 -20744 -13233 -5754 -23555 -13067 29269 27496 -2168 4745
382 4745 31860 31005 3265 -200 10348 -15076 -30414 3947 26211 4969 -15449 -1867 10561
395 10561 -13092 -20472 44 -13526 -42020 -29767 8890 20128 -525 2747 22524 6872
407 6872 -7030 14086 23788 -1321 -21220 2814 30671 16171 8286 24059 10698 -17483 -15940
420 -15940 5624 1421 -31743 -30966 -4040 -5560 -10453 6458 12194 -9372 -28614 -8476 14407
433 14407 -3169 -12712 5425 11271 4942 13443 34643 28017 -7452 -11194 10121 4397 -7770
446g770N126M835j0906r974K0575J4783k5887j7881Q099O092k522K866J6234M28
460D098j9622R478K7085j873j6302m671M608m028n550J7343Q995k2034j1234J0979
474b728P398o425j1255J34m603j4156J0198J9660j722j1513l514J1896O051m222
488d801Q895L234j5114o04J5314J1967k780j1311J034j088p330O853L130j0830
502c431j2426n439R999O496p500q57l716p817M108J0694P853m097r666O332Q753
517g14M387R600j184p769k180K831J1069M053q354o298p175O4O990j622m052q348
533h702r490M183O976K796M52r834m804N434O525P053K62l775M85m62J0158J2394
549A9651o118q099k984q72L512J810K214l326j3334N8J0309J595l427q791m749
$$ plain form
446 -7770 -2644 2191 -8715 -18689 1886 16669 -9218 -27099 -19000 -12908 -15430 -12564 3670 4098
460 4098 -15524 -6046 21039 19166 2864 -1807 2801 -1227 -6777 10566 19561 -2473 -13707 -2728
474 -2728 4670 -1755 -13010 -12876 -17479 -31635 -21437 -1777 -3499 -15012 -18526 -6630 -579 -4801
488 -4801 4094 7328 -7786 -8390 6924 18891 16111 4800 5834 4746 -2584 4269 7399 -3431
502 -3431 -15857 -21296 -11297 -4801 -12301 -13158 -16874 -24691 -20583 -9889 -2036 -6133 -15799 -9467 -714
517 -714 3673 13273 12089 4320 2140 4971 16040 20093 11739 5441 -1734 -1670 5320 3698 -354 -8702
533 -8702 -18192 -14009 -7033 -4237 -3785 -13619 -18423 -12989 -6464 589 851 -2924 -2439 -2901 7257 19651
549 19651 13533 5434 2450 1578 5090 6900 9114 5788 -7546 -7488 2821 4416 989 -7802 -12551
564a2551n29k349R772J1329q661p350N375R922L997m760K172k485j4462M992J6527
579A0939J895q619p347L716J878o906M122K311j6486j0523P945J5260J795r326
593i346M322L811r625M550J4398j673j5434n123J6846R665o086N699M226j2751
607C479q676P141J0542r774j9697M751R582n794K592J0188k199j7981o861J8626
621d081N455j6154J652J0290k241n19J3513J5150j1064j9802R129J1096q256m266
635i8O580J592j2074j683K1866K627k3530o198P497l455q149O365J3412j0650
649e898j4305J8160J7284q816r987K897L122j0230l21K1447K604j9336K2J6208
663A2851M741j2049l954P396j3710j5347J6569J5378j1248j2651O811J1608q140
$$ plain form
564 -12551 -13080 -15429 -5657 5672 -2989 -10339 -4964 4958 8955 4195 6367 3882 -10580 -5588 10939
579 10939 12834 4215 -3132 584 2462 -4444 -322 1989 -14497 -25020 -17075 -1815 -20 -9346
593 -9346 -5024 -1213 -10838 -6288 8110 6437 -8997 -14120 2726 12391 6305 12004 16230 3479
607 3479 -5197 1944 12486 2712 -16985 -12234 -2652 -8446 -5854 4334 2135 -15846 -22707 -4081
621 -4081 1374 -14780 -13128 -2838 -5079 -5598 7915 23065 12001 -7801 1328 12424 4168 -98
635 -98 6482 8074 -4000 -5683 16183 18810 -4720 -10918 -3421 -6876 -15025 -8660 4752 -5898
649 -5898 -20203 -2043 15241 6425 -3562 -665 2457 -7773 -8094 13353 15957 -3379 -3357 12851
663 12851 17592 5543 1589 8985 -4725 -20072 -3503 11875 627 -12024 -5213 6395 -1745
676a745n110J3265m808k0386J766K0330P946j1601j909J3897n292j0952J2286
689G687Q483j5544j6640Q794J7163p100o768J2223k016j6492P53J4635Q22j9629
703a3629n214J5888P31n342J0802Q339j1175j3048R407J6415j0774j2457R336
716g21L154o941L638J5037J000k0372n403J5391n99j0554K295M852o294p358J2451
731d24J6223j2054j4313O875M731m839j228R081J358j5379J619J9816J612j1778
745A300k405L151k862p020Q673J0820j2611j0307R616R117j952o092K453Lj2448
760a0564K012J5608K69j0660k645P200L866m503L839M908j2710p031Q582Q993
774G164j940q256J863L588o120K805R466m600j0616l401Q593N991n035R30K918
$$ plain form
676 -1745 -6855 6410 1602 -18784 -17018 3312 11258 -343 -2252 11645 6353 -4599 7687
689 7687 16170 626 -16014 -7220 9943 2843 -3925 8298 6282 -10210 -9457 5178 6000 -13629
703 -13629 -18843 -2955 -2224 -7566 3236 11575 400 -12648 -3241 13174 2400 -10057 -721
716 -721 2433 -4508 -870 14167 15167 -5205 -10608 4783 4184 -6370 -4075 777 -5517 -12875 -424
731 -424 15799 3745 -10568 -3693 1038 -3801 -5029 4052 5410 -9969 -8350 11466 13078 1300
745 1300 -1105 2046 -816 -7836 837 11657 -954 -11261 -1645 7472 5520 -572 1881 1884 -10564
760 -10564 -8552 7056 7325 -3335 -5980 1220 5086 583 4422 9330 -3380 -10411 -1829 7164
774 7164 5224 -3032 -1169 2419 -3701 -896 8570 3970 -6646 -10047 -1454 4537 -498 432 3350
789C350p368j305P704N830m396j0447J632O057k005K909L879m777o039j075Q598
804B547M459p953k680Q60k507K736M859K104m147q038L493P157o68J89k062l837
820c488m82J888O598K054p505k397J316K026M105k27k628l540m414M756N026j033
836B055j433m493j545M579K180J983j766o157k78J651L872M911m136l553M02Q70
852h58N360P06k222j863n828J598P137J296j966l704k182L336L01K064J874p682
868b633n109K628M870L430l615j815J106l879K609P169j750o111m392L629O773
883B910j249J242K692n687l560N238N671r89r349q30M822j917J842N749j698p697
899b810m716P124N449p520k750K306l019m76N636P323k728j1274K091P870k171
$$ plain form
789 3350 -4018 -5323 2381 8211 3815 -6632 -5000 1057 -948 1961 5840 1063 -4976 -6051 2547
804 2547 7006 -947 -3627 -2767 -5274 -2538 2321 4425 278 -7760 -4267 2890 2222 2411 349 -3488
820 -3488 -3970 -2082 4516 6570 -935 -3332 -2016 10 4115 3888 1260 -2280 -6694 -1938 3088 2055
836 2055 622 -3871 -5416 -837 1343 3326 1560 -4597 -4875 -3224 648 5559 1423 -2130 -1728 -858
852 -858 4502 5208 2986 1123 -4705 -3107 4030 5326 3360 -344 -2526 810 1111 3175 5049 -2633
868 -2633 -7742 -5114 -244 3186 -429 -2244 -1138 -5017 -2408 4761 3011 -3100 -7492 -3863 2910
883 2910 1661 2903 5595 -92 -3652 1586 7257 6268 -3081 -3911 911 -1006 836 6585 4887 -2810
899 -2810 -7526 -402 5047 -2473 -5223 -2917 -5936 -6412 -776 6547 3819 -7455 -5364 2506 335
914C35j700K681k92n172j241J1741N489j0307m582M087m96k684J933N052m820
929B4j0075N928J1118l029n246j23O52m046k432J0281L760j1392k307Q901M329
944F343l386j461M653m834j0432P511R966m842p650J368O098k239l473P377K61
959E260j3752k256J0198N047n521l651P204l55p025P863P862p294r855K423R816
974E964j362n081O535J200r651o01R281K378j0217p401O820J301n801N407O132
989D904o048q513M018J1384l643r092M820K676n033J650R411L843r757n390J0226
1004E456K369o939M75K792m009o361M528J1367n052j1165L184M344m454j950N194
1019b21J693r799k846J2873L663o576q87K974p27m360L787R131o227r370N078
$$ plain form
914 335 -1365 1316 1024 -4148 -5389 6352 11841 1534 -3048 1039 543 -2141 -208 4844 24
929 24 -10051 -4123 6995 3966 -1280 -1403 -751 -4797 -7229 3052 6812 -4580 -6887 2014 6343
944 6343 2957 1496 6149 1315 -9117 -1606 8360 3518 -4132 -2764 3334 1095 -2378 4999 5260
959 5260 -8492 -10748 -550 4497 -1024 -4675 2529 2174 -4851 3012 10874 3580 -6275 -3852 5964
974 5964 4602 -479 6056 7256 -2395 -2996 6285 8663 -1554 -8955 -2135 -834 -6635 -1228 4904
989 4904 -1144 -9657 -5639 5745 2102 -6990 -2170 506 -4527 -2877 6534 10377 620 -4770 5456
1004 5456 7825 886 1361 4153 144 -6217 -1689 9678 4626 -6539 -3355 989 -3465 -5415 -221
1019 -221 1472 -8327 -11173 1700 5363 -1213 -2100 874 147 -4213 -426 8705 2478 -6892 -1814
1034a814P249r86l711J857J318r160k457J1210J343q864k548M374K834k769K183
1049E9N970o938p276N330P374l31n763P22M269m219l04Q899j187r189l569N586
1065e67M212m848o12L602n559l337O080M994k310p483Q8N747j427M38N343j303
1081C058m870q70O589N153n901l153K831k779j572M343K778l578p361J277N630
1096A575k156j296P00k927k526l5N643M071n505k751L421J378J516J963R45k392
1112A624m870L579O360j219k473j358j828M50R81K428p68o587k244K689J972J536
1128B72k293j889k50j718M300M370k676k334r52J443L907J154R03j344l558J615
1144I50K728J301J0m219k777O33P31K455m20l096j712j631J786L895j476j637
$$ plain form
1034 -1814 5435 4449 738 2595 3913 -5247 -7704 3506 4849 -4015 -6563 -2189 645 -2124 59
1049 59 6029 -909 -8185 -2855 4519 4188 -1575 -853 3416 -803 -1107 7792 6605 -2584 -6153 -567
1065 -567 3645 -1203 -1815 1787 -3772 -7109 -1029 3965 1655 -5828 -5740 7 -1420 -982 4361 3058
1081 3058 -1812 -2682 3907 9060 3159 6 2837 58 -1514 2829 5607 2029 -5332 -4055 1575
1096 1575 -581 -1877 -1177 -4104 -6630 -6665 -1022 3049 -2456 -5207 -1786 -408 1108 3071 4016 1624
1112 1624 -3246 333 6693 5474 3001 1643 -185 265 1246 3674 2906 -3681 -5925 -3236 -1264 272
1128 272 -2021 -3910 -4160 -5878 -1578 2792 116 -2218 -3170 -1727 2180 3334 4237 2893 -665 950
1144 950 3678 4979 4989 770 -2007 -1374 -643 1812 1392 -1704 -3416 -5047 -3261 634 -842 -2479
1160b479j818r20M187J813J031Q65k862j117L187K687J471l476k849J702n05J352
1176B269K903k289l763k400J242L718j893k285r7k875K07L424L373L9n101p22
1192d250M698L61M93J662j477k484n22N086M485m873l280J523r55m11J140J217
1208B413k441n867J316N949p06j990q43l04j132q16M801L475o069k046M226K828
1224B794l1k45J437j784n744L151N930k008m799j030K335j10j745L375J376p475
1240d573k774N522L173k169k652K518Q47l981M561N862l150n576l21N091J274
1255C652l359K794J089n995r57N543K507m673n792K712J981l532K168M423l604
1270a043m847J425P013P41n893J633K324l800Q85N241K615n076m515M977L385
$$ plain form
1160 -2479 -4297 -5217 -1030 783 1814 2679 -183 -1300 1887 4574 6045 2569 -280 1422 917 2269
1176 2269 5172 2883 -880 -3280 -2038 1680 -213 -2498 -2595 -5470 -5263 -1839 1534 1573 -3528 -4250
1192 -4250 448 809 1302 2964 1487 -997 -1519 3567 8052 3179 -101 1422 467 56 1196 2413
1208 2413 -28 -5895 -4579 1370 664 -1326 -2169 -2473 -3605 -4421 380 3855 -2214 -4260 -34 2794
1224 2794 2763 2518 3955 2171 -3573 -422 5508 3500 -1299 -2329 6 -104 -1849 1526 2902 -4573
1240 -4573 -7347 -1825 1348 -821 -3473 -955 -108 -4089 472 6334 3184 -2392 -2713 2378 3652
1255 3652 293 3087 4176 -1819 -2776 2767 5274 601 -5191 -2479 -498 -4030 -1862 2561 -1043
1270 -1043 -5890 -4465 2548 3289 -2604 -971 1353 -2447 -1562 3679 6294 1218 -3297 1680 5065
1285E065m358K41J530l015m328J356P135q92p469J216K995j874n34L118J508n154
1301c460l601P687M458m247p31J978j96k877J698O208k783p962J853M216n47j835
1317a41L75J150m977l034O309K856n732k637K521K222j184J102N208k797o236
1332d995L598N454j39l314j24K613k460j521O119N73o053l005K650K577k466j904
1348b397K894k616m535L888M479r25m434q85L862n69p21M585K13m109j293M758
1364B195L991l144k836K520j375k083K548K335j360n411m98M747q85k080J275
1379f1o88l093m19M048L376l891k796L125P19J20J596J170j239l906P67N655j023
1396C460k382j97n93p42k3K207J437m737k439K570J363K19k32n03l03j855K055
$$ plain form
1285 5065 707 948 2478 -537 -4865 -3509 3626 2734 -4735 -3519 -524 -2398 -2932 186 1694 -3460
1301 -3460 -7061 626 5084 837 106 2084 1888 -989 709 6917 4134 -3828 -1975 2241 1694 -141
1317 -141 234 1384 -3593 -6627 -318 2538 -3194 -5831 -3310 -1088 -2272 -1170 4038 1241 -4995
1332 -4995 -1397 4057 3918 604 480 3093 633 -888 5231 5804 -249 -3254 -604 1973 -493 -2397
1348 -2397 497 -2119 -6654 -2766 1713 788 -3646 -4531 -669 -1238 -1959 2626 2839 -1270 -2563 2195
1364 2195 6186 3042 206 2726 1351 -732 1816 4151 2791 -2620 -3118 1629 744 -1336 -61
1379 -61 -749 -3842 -4261 -213 3163 -728 -3524 -399 320 440 2036 3206 1967 -1939 -1172 4483 3460
1396 3460 1078 881 288 -454 -477 1730 3167 -1570 -4009 -1439 -76 143 -89 -592 -895 -2750 -695
1413f95M158j054k780n14J106J768J17Q04L07l645j004K903J338q23k449j353
1429a816K22o79J705K052k378k442k04K225J880l88j62m23j517J436L091O33n54
1446B681k225m97J674O14Q57n08k689q52j44J420J524j937k039m14k36K024Q83
1463A36j138l70j619M69K591J350M61j649j514J916N47J025J101k141j459k35
1479e29J247K255j410j726n64r73M74J381L59j027k593m93L115J123p83M81j226
1496h89k83L42K269K541k877j979J282Q94O44M60l11j432k793L08L434n30k467
1513a387j148K16Q98l38J431J847l801j642K984K264m3r77L18M38j779J783L668
1530D732j569k816j039J623J246j518O9Q07l553j305L026J860j986k901R25J286
$$ plain form
1413 -695 3463 2409 -371 -885 221 1989 2106 2910 3217 -428 -1432 1471 2809 1986 -463 -1816
1429 -1816 -1594 -2273 -568 1484 -894 -3336 -3540 -1315 565 177 15 -408 -1925 -489 2602 3235 2681
1446 2681 456 -41 1633 2247 3104 2596 -93 -945 -1089 331 1855 -82 -2121 -2535 -2771 -747 136
1463 136 -1002 -1372 -2991 -2522 69 1419 1880 231 -1283 633 1180 2205 3306 1165 -294 -529
1479 -529 718 2973 1563 -163 -727 -1700 -1226 155 514 -513 -3106 -3599 -484 639 -144 337 -889
1496 -889 -1172 -830 1439 3980 1103 -876 406 1300 1944 2404 2093 661 -2132 -1824 1610 1080 -1387
1513 -1387 -2535 -2319 -1421 -1759 -328 1519 -2282 -3924 -940 1324 1281 304 622 1060 -719 1064 4732
1530 4732 3163 347 -692 931 2177 659 728 1535 -2018 -3323 -297 1563 -423 -3324 -2399 -1113
1546a113j715J181L050j534k320J62L508J633k157M5J195k176j61K769J544j892
1562B019l863J579K902k291m29J273j901k736L22L951N28m061j98K186p55K04
1578a270J875J167k631k739L267L620j838j073Q72n27j166L17L441m76n297L03
1594b155K787l74n98J6P28k091k276L479K857l208j745J273J312l10j17K865k47
1611B196m302N26L999K06k060o24J431j611j784L545J302l375k130J078J708j99
1627i4j324J880m21l757J958L201Q76k788j323K344j21j373K778J389l431j663
1643a869J890K745j182k224J422r23j744J173K360m46l256j135L122Q20j360Q36
1659B29K76k133n22K431K979j954k783J891M14p74J047J359j133k767k34L199
$$ plain form
1546 -1113 -2828 -1647 1403 -131 -2451 -2289 1219 2852 695 740 1935 -241 -402 2367 3911 2019
1562 2019 -1844 -265 2637 346 -83 1190 -711 -3447 -3125 826 1354 -2707 -2905 -719 -1474 -1270
1578 -1270 605 1772 -859 -3598 -331 3289 1451 378 1250 723 -443 -126 3315 2839 -2458 -2155
1594 -2155 632 258 -340 -324 404 -1687 -3963 -484 2373 -835 -2580 -1307 5 -305 -422 2443 2196
1611 2196 -2106 -1580 2419 2625 565 -59 1372 -239 -2023 1522 2824 -551 -2681 -1603 105 -94
1627 -94 -1418 462 41 -3716 -1758 1443 2319 -469 -1792 552 431 -942 1836 3225 -206 -1869
1643 -1869 21 2766 1584 -640 782 -141 -1885 -712 1648 1202 -2054 -3189 -67 753 -607 229
1659 229 505 -1628 -2150 281 3260 1306 -1477 414 828 54 1101 2460 1327 -1440 -1674 1525
1675A525J64k360P8r3n09k32J332J882k687k053J677J720n19K51N48l53j660O00
1693f89L628m74k269j52K14M26K2M85O78k611j814J919J370l46j243q61P34r88
1711a971L65K978q24k281M9J173J451j48l74L37j441J15K060R86r19j802l36J063
1729D81J7j5Q48j469j797J39J554J386j404j174J28k85N63J760k19p17p89k30
1747a223K059K33k54R3j257J79O06Q76O78j598j227N10P9P69M92j118p38o50M34
1766a057J446r4n77n72j093J558N40L66O52j255q79Q77J007J068q43j661L79J01
1784c7Q45N84p70o60q00j89J691Q9q32o43m94K79O76P15L94j381j125J110R17
1803C69M96n11l72l03n36N23K094j44j929m48K58R08L65j46M04j810r43J823J182
$$ plain form
1675 1525 1689 -671 -593 -686 -1195 -1427 -95 1787 -900 -2953 -1276 444 -75 176 724 371 -1289 -689
1693 -689 2939 2465 196 44 258 684 706 1191 1869 -742 -2556 -637 733 387 -856 -1717 -983 -1971
1711 -1971 -1606 1372 548 -1733 -1684 -511 940 792 418 755 -686 -571 1489 2475 1556 -246 -582 481
1729 481 498 483 1331 -138 -1935 -1796 -242 1144 -260 -1434 -1306 -1591 -1028 732 513 -204 -993 -1223
1747 -1223 836 1069 815 908 -349 -170 436 1312 1990 392 -835 -325 -246 523 1015 -103 -841 -1491 -1057
1766 -1057 389 295 -282 -854 -1947 -389 151 517 1169 -86 -965 -88 919 1987 1144 -517 -138 -37
1784 -37 808 1392 622 -38 -838 -1027 664 753 -79 -722 -1216 -937 -261 454 848 -533 -1658 -548 369
1803 369 865 354 -18 -321 -857 -334 1760 1616 -313 -761 -503 405 770 624 1028 -782 -1725 98 1280
1822A280l45j317n32O63l89K20J884j194j629N5J424J186o60r07O65j133n91J751
1840D31R26q41k198N27J470n73K71R35j193j302M80J685J110j956n14R47m73J59
1858a09J174M89j458j541O37K444p88q31L13n76n76M7J575N39k743n89J719j54
1876d28P5M72J45r69j045J387K288j205j352N06K70K65r6J505K23k655k68K126
1894A244K03q33o16K57o47j095J301J967k104j436O06J131j8q40J429k52k153
1911a856P99K167P86j603p78R83K84q39R07J149j917j457J191J565k09j516P1
1928b73L38j426O26J657Q0j879r72J454J097j097M68R61j570q51J450J720p00
1945A083j744O75O51p03M56J151r06j486r29J860R22j418k56K38o66N6R74J202
$$ plain form
1822 1280 935 -382 -914 -251 -640 -420 1464 270 -1359 -1304 120 1306 646 -261 404 -729 -1320 431
1840 431 1357 516 -1682 -1155 315 -258 13 948 -245 -1547 -1067 618 1728 -228 -742 205 -268 -109
1858 -109 1065 1554 96 -1445 -808 1636 848 17 330 -246 -822 -775 800 1339 -1404 -1993 -274 -428
1876 -428 -353 119 264 -705 -1750 -363 1925 720 -632 -126 144 409 313 1818 2041 -614 -882 1244
1894 1244 1447 614 -2 255 -392 -1487 -186 1781 -323 -1759 -1153 -22 -40 -880 549 297 -1856
1911 -1856 -1057 1110 1896 293 -485 498 782 -57 850 1999 82 -1375 -184 1381 1172 -344 -273
1928 -273 65 -1361 -735 922 1002 -877 -1849 -395 702 -395 73 1034 -536 -1387 63 1783 1083
1945 1083 -661 14 665 -38 418 1569 663 -823 -1752 108 1030 -388 -644 -406 -1072 -1016 -42 1160
1963A160r54j922R07J268m98L67J71o6r55m52K390L81j400q30M41j45N52j87R57
1982A185j213j909J276J296m36o68J6J06n30J6J516L89j941J28N34P94%r1L64
2001H32r29j110J549J369j119p14n41P66Pk07R27n00j292R4O86R48o20q43O29
2020f8k21k78R19Q92j085p85k23J090K63n86P49p84r20P96N98P33r34r48K58K72
2040b62P4Q90l60p13n62j1J698kr79K67m85J84N84K32N52j144r42P32O14R8m0
2061D25q04k58l26O06J175p15p89r4j75J077K48k80J13o16j04R75J39K29o25j026
2081h25M42P19j04P25r60k44l4j01Q97j41k06p30l08N39N53j63L42j096l03Q73
2101a25O71o0j98m76k63L05J91J135n35j144J31K13R34l2q44K17n66m42J018K43
$$ plain form
1963 1160 206 -1716 -809 459 -39 328 499 433 -522 -974 1416 1797 397 -433 8 -137 415 228 1185
1982 1185 -28 -1937 -661 635 199 -469 -453 -347 -877 -861 655 1044 -897 -769 -235 559 559 468 832
2001 832 -97 -1207 342 1711 592 -122 -663 103 110 -97 830 330 -962 -868 -182 766 146 -697 -68
2020 -68 -289 -567 352 1244 159 -626 -849 241 504 -82 667 -117 -1037 -241 357 1090 156 -792 -534 -262
2040 -262 -188 702 342 -371 -933 -944 754 752 -227 40 -445 -261 323 555 1107 -37 -979 -247 367 465 425
2061 425 -379 -637 -963 -357 818 103 -686 -780 -955 122 370 90 203 -413 -517 458 597 826 201 -825
2081 -825 -383 336 232 957 -3 -247 -281 -382 515 374 168 -562 -870 -331 222 59 401 -695 -998 -125
2101 -125 546 486 288 -188 -451 -146 45 1180 645 -499 -368 -155 779 747 -97 120 -446 -888 130 373
2121C73j25n78m36P23J11J0L88n00p13L86N06P27o15p34N34Jk34R37J05o55r25
2142g14K13R33j47k59J24n13k56K36N96N66p23j013N18M10o6N07j70m66o21L52
2162d93J535l47q75O3j5m0K47O63L87j494m98J276J77k87k7m82m9m95O67J134
2182A047p63j046L29L49M93m08M20R6j245r1J310M30r54n06K66M20n88L66Q50
2201G75q66p52K04J251K87r55N5L37q35R8J106O14j326n75N04O56p19L70O77j291
2221c85n30K17J169K41j202l23P54l21K70P12j22p19o03P94J049q82j39L82m78
2240a16l59O55Q84m39r68j40P75j3j78L15j28r24l49J046O68j046j46K19J00j30
2260b74K48M31K0j231M64R21n8l73q7k19J10p4Q21L70j500MK80K94Mk76J68k83
$$ plain form
2121 373 248 -330 -766 -43 68 78 466 -34 -747 -361 145 872 257 -477 57 58 -176 761 866 211 -714
2142 -714 -501 432 285 26 150 -363 -619 -383 213 779 56 -957 -439 -29 -95 412 242 -224 -845 -493
2162 -493 1042 695 -180 -117 -132 -172 75 738 1125 -369 -867 409 586 299 272 -210 -259 -754 -87 1047
2182 1047 284 -762 -433 -84 409 1 421 517 -728 -819 491 921 -33 -539 -273 147 -441 -75 775
2201 775 -91 -843 -639 612 899 -56 -1 336 -499 -401 705 1319 -7 -582 -78 578 -141 229 906 -385
2221 -385 -915 -698 471 712 -490 -813 -59 -380 -110 602 480 -239 -842 -48 1001 119 -20 362 -116
2240 -116 -475 180 1064 625 -343 -483 292 279 101 416 288 -636 -985 61 729 -317 -463 -244 -144 -274
2260 -274 -26 405 425 -806 -342 579 521 148 61 -158 -48 -122 699 1069 -431 -427 -147 147 151 -125 43 -240
2282b40q44J056N27l11l68l45L23L49l54O42R5q18k52P20N27j89n37K27Q3q62
2302e71J055N46o89n49m57P35Q6n09P09m88p71N45L68K49R3p09J53j45L5O60J16
2323D62n28n01m4J131L36p80J9o8l73L68K08O35n27j042O22M81j82J69Jl98n65
2344e76M29P35j79p87K07j03K52L84k00J88o14k39N63L29l06J60p57K49R9R2Q64
2365G90m70p82M97k36Q37k48k73j37j88L6N76N1k15j82n54M23K01r4L36o86l88
2386g06J81L43O84j72p22J84j05L33N34k46l34l24K17K78K88j62p8n69K69L98
2406B91R4J61l63p11J35K81N48k48l33%j22J48J54K41l13l83r5N34N16k94J97
2427D38n03m52M24L65K37k34m28K33qO0K44R6n45q1l98O61J85o33J29j55j63L24
$$ plain form
2282 -240 -1084 -28 499 188 -180 -525 -202 147 -207 435 530 -288 -540 180 707 518 -19 208 291 -571
2302 -571 484 1030 341 -208 -665 70 156 -353 356 -132 -903 -358 10 259 352 -357 -204 -349 -314 346 462
2323 462 -66 -567 -611 520 856 76 95 27 -346 22 230 865 338 -704 -82 399 217 386 387 -11 -576
2344 -576 -147 588 409 -378 -171 -274 -22 362 162 350 -264 -503 60 389 83 243 -514 -265 -166 -74 790
2365 790 320 -462 35 -201 636 388 115 -22 -210 -174 402 453 238 56 -498 -75 126 32 368 -318 -706
2386 -706 -525 -182 502 330 -392 -208 -313 20 554 308 -26 -350 -133 145 433 271 193 -376 -107 291
2406 291 385 546 183 -528 -393 -112 436 188 -145 -145 -267 -119 35 276 -37 -420 -515 19 535 241 438
2427 438 -65 -517 -93 272 509 275 -153 80 72 132 376 472 -73 -154 -552 109 294 -339 -210 -365 -528 -204
2449b04M36J87n91n47O78L28k31L90l02k34k13K09O46j20m22j10L8J00J46k7j
2470A56o12k93P87N64l79n56j44M95l26P6Q62o84o08N69K64J99k31q0K24n99j7
2491c33J029j03m92n65K22L84l6J03M11r00k53K22N34J96n15m22N80m24J19N92
2511C49Ql82n97M15L99Jm22M56m76j22M45M07lp42j38N14p4j79M33L9o04j33J86
2534b20Q74n52n53K96j7J26J7O36l29o59r1R59n8m54k3R7k09l61N17N98q97k11
2556e14M06r0M29k24J21J14q84J26J008P0o21q8K3K40k85L66p0l10j78L07L23
2577B69k74k5j58K34o88N91O16l67k83l21K18M63k40J29P4k66j71M21P5J52n02
2598e3m3K99n47N01M13m80l35j17M03P2p1J2k61k92O0P20j09J63q89K58M05k49
$$ plain form
2449 -204 232 419 -172 -719 -41 287 56 446 144 -90 -303 -94 552 432 10 -100 -62 38 184 157 156
2470 156 -456 -749 38 602 223 -333 -477 18 -308 -232 630 -54 -662 -93 171 370 139 59 283 -316 -333
2491 -333 696 593 101 -464 -242 142 106 209 620 -280 -533 -311 223 419 -96 -518 62 -362 -243 349
2511 349 357 -25 -622 -207 192 193 -229 227 -249 -371 74 481 478 -264 -402 112 38 -141 292 331 -273 -406 -220
2534 -220 654 102 -451 -155 -172 -46 -29 607 278 -381 -472 487 429 -25 -48 49 -160 -521 -4 594 -303 -514
2556 -514 -108 -198 231 7 128 242 -642 -516 492 562 -59 -147 -124 116 -169 197 127 -183 -361 -54 269
2577 269 -5 -30 -188 46 -642 -51 565 198 -85 -406 -188 275 35 164 238 -28 -199 222 297 449 -53
2598 -53 -96 203 -344 157 570 90 -245 -362 41 113 42 54 -207 -499 -439 281 172 335 -554 -296 109 -140
2620a40O65m39J7m96J01P41P1k21o15N02l83J56K05j23l84k49K36N24k73J54j09
2641f0m33K71N6K48P6k65k15N06JP8K7j93k13k45K43O11l22m48K3L25k21L22J69
2664C41k58m48j45M93M7P3l48J62j08k5m1M92M5m91o1L66N8j63L17n65K4K10p
2687c2M11j52m49P1j63M97J85m71r8N2o46P59K44k44J91l81l7N17o5J65n90k93
2709e29N40p2P5J45n52Q8N21j73L11o8k71j59j11L33J60k61M5M5o8j56M63j77
2731A29j40k34k28O90k59K67m92K53k43R8N51N3l95j59o4J20K64k03L38m33k62
2752c49L08K47p0k1j78l32K19Q6M31k22j52k02L28p6q5L16q6j31m24O67J01k61
2774A14n0l90K20K17p5R6N1n38J15L74K12Ql40J43l36n5L50J31l51j3Q8K61j22
$$ plain form
2620 -140 525 86 103 -393 -292 449 520 299 -316 186 -197 -41 164 41 -343 -592 -356 168 -105 49 -60
2641 -60 -493 -222 -166 82 158 -107 -322 184 185 263 290 97 -116 -361 -118 493 171 -277 -254 71 -150 172 341
2664 341 83 -365 -510 -17 30 103 -245 -83 -191 -216 -257 235 280 -211 -272 94 152 -11 306 -259 -235 -25 -32
2687 -32 379 227 -222 -151 -314 183 368 -103 -201 -149 -795 -36 208 -36 155 -226 -263 254 189 354 -236 -529
2709 -529 11 -61 14 159 -393 -305 216 43 354 286 15 -144 -255 78 238 -23 22 67 -1 -157 306 129
2731 129 -11 -245 -473 217 -42 225 -267 -14 -257 -159 392 445 50 -109 -173 -53 211 8 346 -87 -349
2752 -349 -41 206 136 115 -63 -395 -176 -90 341 119 -33 -235 93 17 -68 248 162 31 -393 274 375 114
2774 114 64 -326 -106 111 36 132 183 -355 -240 134 346 354 14 157 -179 -234 116 247 -104 -117 -29 232 110
2797A10n6o5r8l4N0J54K04k64n61N52Mj32J30j34J82m33N14L96j63l48j32l6l32
2820d92N23L63J54m40k88K30J25j53j37R6k01OJ75K74q1n86L35o2kK28p4K40l13
2843h0j84P04j99O6l20j70J52J49L1K23k40m84N09NO8k79o0K77m28p2P94l47k34
2866a19ml1N38n42M53k6n67l5J68N58k33J0m09J31J05j8L35k68k80j9r3O36k58
2889C2j13J17j93n4L03kq8k92J09K27q4K7J04k83k1p0J90M72j65l90K68j28K33
2912A99k78M65l59k40N2M81l56K35o3j36j54R4K96J27l44m08R9p1M82j1j62J35
2934H3l60K83K71k82q9r5J83j47K88J82N8l78m80M93M0J60j54k00K5k7K72P0J76
2957C72n73J13L45K06k98j32j35o0j57L63n4L54m90M6j83r4M25j2j29M7j14K12
$$ plain form
2797 110 54 -11 -109 -143 -93 61 265 1 -560 -8 -4 -136 -6 -140 42 -391 123 519 356 8 -124 -160 -492
2820 -492 31 394 548 108 -180 50 175 22 -115 -19 -220 -214 -39 235 154 -432 -97 -159 -161 67 -7 233 -80
2843 -80 -264 440 241 307 -13 -183 -31 118 149 372 132 -352 157 162 230 -49 -109 168 -260 -332 462 115 -119
2866 -119 -123 -154 384 -158 295 269 -298 -333 -165 393 160 170 -239 -108 -3 -21 314 46 -234 -253 -346 290 32
2889 32 -81 36 -157 -211 92 90 2 -290 -181 46 -38 -11 93 -190 -211 -281 -91 381 216 -174 94 -34 199
2912 199 -79 386 27 -213 -161 320 -36 199 136 0 -154 -60 236 363 19 -389 -290 -361 121 110 -52 83
2934 83 -277 6 277 -5 -94 -189 -6 -153 135 317 375 -3 -483 10 50 210 56 -144 -119 -146 126 196 372
2957 372 -201 -88 257 463 165 33 -102 -162 -319 44 -10 344 -146 -100 -283 -377 48 36 -93 -46 -160 52
2979E2M37n48J91n2k11M52k73J56p3k56j6J08J03J20m58K8J29k33M66J75l36k98
3001c37q2L30K06p4K17o5m62L11J35L6J6l36J89R6J7l7O9k88k06K30j11L62m43
3024b27J5nK03P7O6j38m8j36o7O04l97K52l51M8KJ02J91p0j78p0K26R3K2j6k37
3049c9Ok55L09L65m57L39n58l7L30k25L73m0n23L06L40Nk81P5l3m19J11N60L4
3072B86l43k76K67J92j6q6J11k26j26K1M14o4j6n89J16M58j08J11J20k05k41N0
3094a50Q4L49j05j34k53K8j1M24k78k0l43J67M79j32j84M1k53r9J85M78k09l32
3116b68M6L5j02M45l16K54l96J16L05P8J8k92L4K4k31K85L37k78n87J37P00j89
3138A55n8k23J53k19J80K43P2m82p7K09J69q6K43k16j28k88L7J48K57j15k21J25
$$ plain form
2979 52 489 -59 132 80 -131 321 48 204 131 -125 -141 -33 70 190 -268 -240 -111 -344 122 297 -39 -337
3001 -337 -419 -89 117 43 260 195 -267 44 179 215 231 -105 84 180 197 160 229 -59 -265 -35 -146 216 -227
3024 -227 -212 -217 -14 63 129 -9 -57 -193 -260 344 -53 199 -152 -104 -102 0 191 121 -57 -127 99 192 214 198 -39
3049 -39 -33 -288 21 386 -71 268 -290 -327 3 -222 151 111 -412 -106 234 239 -42 33 0 -419 -308 252 286
3072 286 -57 -333 -66 126 110 24 135 -91 -217 -196 218 154 138 -451 -335 123 15 126 246 41 -200 -150
3094 -150 -66 283 178 44 -209 -181 -192 232 -46 -66 -409 -242 237 105 -79 -38 -291 -390 -205 273 64 -268
3116 -268 -222 -187 -289 156 -160 94 -302 -186 119 197 215 -77 -43 -19 -250 35 372 94 -493 -356 344 155
3138 155 97 -126 27 -192 -12 231 303 -179 -256 -47 122 36 279 63 -65 -353 -316 -168 89 -26 -247 -122
3160a22M00o41L16O9J0l57K78L96j86q9o7Mk13K86m7L16k70m28N64j80l84N94
3182B49l62J34k31J85K35j82l7o8J44j87l6R0K81n42O2L72k83J60K87j52k10k08
3204b99M39J02o2k12J77l46l6N5M25k91J05r3J31mj48L1j95K98l93M01K16k21
3226H0k55J32J61l08J58o2k20N9K96K08K8k96l07K30L03J39l77L3j24k12K82K28
3248A76K6m89J09r4L37q5L02j0o02q2L54J47k20J25l9K8nK93Q7j95l09m4K85j14
3272a9K95k61j97j15L89j5j07J23m50K38j48K70R1r3M0l82N06j09o3J14j35NJ97
3295A74j74N9o2o2L5k0r7K43l3k87M01m33R9N23n95L04k85O9O9K66J00l20k37
3318b63K82lJ80J42n06J78j94J5L26n5k1q3J1j27L30j0N3k83l07L74J39k36J84
$$ plain form
3160 -122 278 -363 -47 22 32 -325 -47 349 163 74 7 11 -202 84 37 353 83 -345 219 39 -345 249
3182 249 -113 21 -210 -25 210 28 -9 -77 67 -120 -156 -66 215 -327 -265 107 -176 -16 271 119 -91 -299
3204 -299 140 242 180 -32 145 -201 -237 -182 243 -48 57 -36 95 91 -57 -26 -221 77 -316 85 301 80
3226 80 -175 -43 118 -190 -32 -94 -314 -255 41 249 277 -19 -326 -96 207 346 -31 2 -122 -334 -52 176
3248 176 202 -287 -178 -272 65 -20 282 272 -330 -412 -58 89 -131 -6 -45 -17 -22 271 358 163 -146 -190 95 -19
3272 -19 276 15 -182 -297 92 77 -30 93 -357 -119 -267 3 94 1 41 -341 165 56 -7 107 -28 -23 174
3295 174 0 59 -3 -65 -30 -50 -147 96 63 -224 177 -256 -157 366 -229 75 -210 -141 -72 194 294 -26 -263
3318 -263 19 16 196 338 -168 10 -184 -169 157 102 81 -2 9 -118 212 202 255 -28 -335 39 178 -58 126
3341A26m4j14J95l31K42L2l03l5p1J12K50p8l5j29j1M01j31J44j18k42l3K19J95
3364B41kM9Qp7j45r4J34l69K13j14K24k1l36K12n1j73L69J83l60N7j01o1J40N
3388f9m2K30m33L98l6NQ9k25J7P6l19N64M5m08J41k70M61Q4l74J5j88J34k8J72
3412C9L49l08j65J85j51j44L22j28l6R1JJ70k07j09k6j06K80K01m61L99j88M8
3434E6o6J46j10Q6j82n7K2J51K78l01l29m9K14J23L15k37p8j92K6K84K3L23l84
3457F2p6k38M27k38K09k50J48j72k0L60K7k87K6J88k79J41k4J87k39o3J81l74
3479c04L58j0j93N5J91O3j6m2n31O91k92J96j0L4k2l84R2J24L06j76l32K04M3
3502D5O6j06L43n79k14M46J35J42j11l61K06j31J98M28k83n14m1J28L34j54j2
$$ plain form
3341 126 82 -32 163 -168 74 106 -197 -232 -303 -191 59 -19 -54 -183 -194 207 76 220 102 -140 -173 46 241
3364 241 239 288 296 219 74 -20 114 -255 -42 -156 68 47 -289 -77 -128 -301 68 251 -109 -52 -153 -214 -74 -69
3388 -69 -111 119 -314 84 48 53 142 -83 -66 10 -309 255 300 -108 33 -237 224 308 -66 -51 -239 -105 -133 39
3412 39 388 80 -85 100 -51 -195 127 -1 -37 54 55 225 18 -91 -117 -223 57 258 -203 196 8 56
3434 56 -10 136 26 112 -70 -127 -105 46 324 23 -306 -355 -141 -18 297 60 -18 -210 -184 100 123 446 62
3457 62 -14 -252 175 -63 146 -104 44 -128 -148 212 239 -48 -22 166 -113 28 4 191 -48 -111 70 -304
3479 -304 54 44 -149 -94 97 160 144 102 -429 262 -30 166 156 190 168 -216 -124 0 306 130 -202 2 45
3502 45 111 5 348 -231 -445 1 136 278 167 -194 12 -119 79 507 224 -290 -331 -203 131 -23 -35
3523c5L28l88k7M8O8J16o6j0Oj15J11P3j93O0j63R2M63k18k41K37m66K14K07k81
3547a80N8q4k53M10P7KJ47j17P9l36N72J36n38J46k88Q3J58J36k82l7q9J82M8
3570C0M4j69L3J23m41L37O0J68k55p0J25J62j59K96l52J33P5j77L80m48J66O9
3592A30o14O55j12q7p3J7j40J67K15k2k43j08L41l31N07k5p4l43J06r0J40j40
3614a24L1J47JO7L6J1P5l49k73L46l0k47L78k01J73k3k33K73k3JK30m31J42M6
3638B3J7P5l41j8K60k2j00J64J21k81J86j34J99l13J04n4K80J68m38OL16k39j00
3661a21M83q2k08l34K87N5j70L17r4l71l76N22j05M41k48k03J21L3n8J77o9k8
3683c1k93L37K20m6n8Pm75J58L16M0j3m04j2L03j28J36k4j14L5J41j11K25l15
$$ plain form
3523 -35 293 -95 -122 -74 -6 110 44 34 40 -75 36 109 -84 -24 -187 -95 368 150 -91 146 -320 -106 101 -180
3547 -180 -122 -206 -459 -49 28 30 177 60 139 -197 375 511 -27 119 -169 -86 72 208 -74 -111 -200 -18 30
3570 30 74 -95 -62 61 -380 -43 17 185 -70 -140 -15 147 -12 284 -68 65 140 -37 343 -105 61 130
3592 130 -484 171 59 -28 -101 -84 -224 -57 158 136 -107 -215 126 -205 302 277 203 -140 -34 -124 16 -124
3614 -124 -93 54 55 122 158 169 244 -105 -378 -32 -62 -309 69 -132 41 18 -215 58 35 36 266 -165 -23 23
3638 23 40 115 -226 -244 16 -6 -106 58 179 -102 84 -50 149 -164 -60 -114 166 334 -104 -98 218 -21 -121
3661 -121 362 280 72 -262 25 80 -90 227 133 -238 -614 -92 -197 244 -4 -207 -86 -53 -111 66 -3 -31
3683 -31 -324 13 233 187 129 136 -339 -181 135 175 162 -242 -254 49 -79 57 33 -81 -46 95 -16 209 -106
3706a06RL6lK1K46P2K9m01j8J18l1J19o1j44R9o9J73J39n7r9p4r4J96j12n6L04
3732B36l85K31K04k1k58k10m5M48l26Q7p1N0N7J4K11j16j76J37j14p9K88l6j34
3755hL8l20K46L91l26o4K93l74m4K33K83q5n55K76k2m8K74j33l02k19M01lJ92
3778A24R8k73J02m6N4M6Q9j05k49J14J6J29J22l52M1q3L6N65k12m20R9j35K14
3801b6J68j42K08l50k94O79q6p1n5j47J50k10Q5J36k8k81J01j89N81k11J96r8
3823A16j99N4L20j60k19O7l13J17L23j17J25m07J70M4M7J20L1Kk61K60k23L99
3845B96j54k51kj30L19n3j78K07j38r2P1n4J54l2m7J9K82q6l3k22M64l04k0j5
3869AJ87m6l46N08l51J13O5Nj33j65J85j6J51k8l07O2J53j75L39J01m12k69L10
$$ plain form
3706 -106 -97 -61 -64 -43 203 275 304 -97 -115 3 -28 91 30 -114 -15 -84 89 228 171 72 -2 -96 100 -12 -68 236
3732 236 -149 82 286 265 7 -203 -248 200 -126 -39 -110 -60 -3 11 222 106 -70 67 -47 -126 162 126 -8
3755 -8 30 -290 -44 347 21 -43 250 -124 -168 65 348 263 -292 -16 -38 -86 188 55 -247 -466 -65 -68 124
3778 124 222 -51 51 5 59 105 194 89 -160 -46 -30 99 221 -131 -90 -173 -137 428 216 -204 -105 -240 -26
3801 -26 142 0 208 -142 -436 243 157 86 31 -116 34 -176 -91 45 17 -264 -163 -352 229 18 214 116
3823 116 -83 -29 291 131 -88 -21 -334 -217 106 -11 114 -293 -123 -79 -32 88 119 121 -140 120 -103 296
3845 296 142 -109 -111 -241 78 25 -153 54 -84 -176 -105 -159 -5 -37 -84 -65 217 131 98 -124 340 36 16 1
3869 1 188 142 -204 304 -47 66 131 136 3 -162 23 7 158 130 -177 -115 38 -137 202 303 -109 -378 -68
3892f8K53J17j26O2m39P1rL22k41q0k3L40j00Kq0J1j2K4p5L87l82L4m5K35l0j4
3918A34O9j08q5j32L20j22k70K32J7m34M35j87L56j38k22K84k70K52J39k43O5
3939I2J06k10O8J6r3J83o1k64L48K4kn47J79J61j97L05m4j40m3j04rN07j54r1
3963C0O2m70L26J45J89p4m45J95lJ3L60m90Q5N6qJ37J18Rr8m57K97J09N7p7k12
3988a46K39l05O3L35j86k30L28jl90M44j74k3r8J79J19K77m38M1j49P8J44K0j60
4011c3K18k90N4K56j66o1jj65LK56j40O5P3l15M69k92K14M2k10o0j43K03o8J27
4035C6M5j30l2R1o9nP7k77J71J60k27M47n68J28J56K62k33J64k67j96oL21P1m11
4059b92P0M81n40J07L61j12K61n15J23K27k02P6Q5k40k92J51L00K25l55J23k66
$$ plain form
3892 -68 185 302 176 238 -201 -130 -139 183 -58 -138 -161 179 79 81 1 12 0 24 -51 336 -46 -12 -57 178 148 134
3918 134 203 95 10 -122 198 76 -194 38 55 -379 56 -131 225 87 -135 149 -121 131 270 27 92
3939 92 198 -12 56 72 -21 162 101 -163 185 209 207 -340 -161 0 -197 108 64 -76 -119 -223 -232 275 121 30
3963 30 92 -378 -52 93 282 208 -237 -42 -45 -32 328 -162 -77 -21 -29 108 226 235 137 -320 -23 86 143 66 -146
3988 -146 93 -212 -149 186 0 -230 98 97 -293 151 -23 -46 -144 35 154 431 -7 34 -115 -37 107 127 -33
4011 -33 185 -105 -51 205 39 -22 -23 -188 -185 71 -69 -4 69 -246 223 -69 145 187 -23 -83 -226 -23 -91 36
4035 36 81 -49 -81 10 -59 -64 13 -264 -93 67 -160 287 -281 -153 3 265 32 196 -71 -267 -273 48 119 -292
4059 -292 -222 259 -281 -174 187 75 336 -179 -56 171 -31 45 130 -110 -402 -251 49 274 -81 42 -224
4080b24K49l8k49K62r0P4o4J34k2p3O2j46P8o3J89J16l02N2k2L3J31j38j1K38
4104A76k94o7M65j50k15Q6j78O8M7K71l65J41j73J88J32jm1J34l87k62N32k01
4126i4N6l15L68O8o1j34J76j9l00N19j06J71k14jp8n3o6M20k79J22j73J0J67l9
4150A45j81m6K03j90R8j8L01j67l09K83M3L4R0l08K8k42J57J06N9R0j30k03M22
4173B65r2j56J80j94j40K02l77K84k63J53pK22k97M94j16j33k47N1L9K68k20K19
4195A35j57k24M35j30N9J87k73k31m7M6J50j50J61p4J96J85j54k66N8n5K25J07
4217A83l20J77k00L6J93L08m92k6P3o8J53J68n0k44o1K1K05R1j27p5P4j59P9J71
4241A10j81r6j79L9L80m8J34K21k77j97M27k63j24J31j45K79j79J1J20j74O0j14
$$ plain form
4080 -224 25 -13 -262 0 -90 -16 -80 54 32 -41 21 -125 -47 -110 79 195 -107 -55 -77 -44 87 -51 -62 176
4104 176 -118 -185 280 130 -85 1 -177 -109 -62 209 -156 -15 -188 0 132 131 90 224 -163 -425 107 -94
4126 -94 -38 -353 15 83 22 -112 64 45 -255 264 158 329 115 114 36 -17 -83 337 58 180 7 17 184 145
4150 145 -36 -82 121 -69 29 11 312 145 -164 119 162 196 286 -22 6 -236 -79 27 86 176 46 -157 265
4173 265 173 17 197 3 -137 65 -312 -28 -291 -138 -145 77 -220 274 158 25 -222 -171 -132 136 -84 135
4195 135 -22 -246 189 59 118 305 32 -199 -246 -200 -50 -200 -39 -113 83 268 114 -152 -94 -149 76 183
4217 183 -137 40 -160 -124 69 377 -115 -141 -68 -136 17 185 135 -109 -170 -149 56 147 20 -55 19 -140 -61 110
4241 110 -71 -167 -346 -307 73 25 159 380 103 -94 333 70 -54 77 -68 211 32 43 163 -11 49 -65
4263f5k57L38J42k18P3j05J4%J88q3k44J2L34n6J46M4m51K6M9N2J16J5K01m68
4287a97QM81l56J95j00q7j12L65q2j03M2j92K12j29N1P4k35K8N5J38k9J54j75
4310Fm0j39J88j34J98N2j14j55J88J3j45nk57P6N6J89m7K29m5k28O7J59R7k82
4334g3K36k83J79k23KK2n9j26M14p6j19n4q0K13M4J09p8j86l0R9M0j3M9Qj90O2
4360a13Q7k8Q5Kj5K9q5J80j76m9J22j11p4J15o2J60j37l5j32J66K19l1O1k07J08
4385G9m09M63j76J30r9j03L0L08r5j33R6o5Pk20J95o5k03N70k91qM3K8l46M1J56
4410f7K33k63K46k44K40j61j41J1K86k19M0J72k85J38k0j16j52L90m0n7r1K92
4432A92j52rP2k5l2m8l69L35J15lJ23n1j25j04j21M93j80j97j6k18L44j58N6N8
$$ plain form
4263 -65 -322 16 158 -60 13 -92 -78 -78 110 27 -217 -205 129 73 219 263 -188 -162 -113 -61 55 70 271 -197
4287 -197 -189 292 -64 131 31 -56 -168 197 115 12 54 -138 74 -55 -4 70 -165 -137 -82 56 27 181 6
4310 6 -34 -173 15 -119 79 131 17 -138 50 63 -82 -87 -344 -268 -212 -23 -70 159 114 -114 -47 112 209 -73
4334 -73 163 -120 59 -164 -162 -140 -199 -325 89 13 -106 -160 -240 -27 17 126 48 -138 -168 -69 -29 -42 7 15 -175 -113
4360 -113 -26 -54 31 33 18 47 -38 142 -34 -83 39 -72 -146 -31 -93 67 -70 -105 -237 -71 148 117 178 -29 79
4385 79 -330 133 -43 87 -12 -115 -85 223 128 -5 91 26 33 -187 8 -57 -260 310 19 11 54 82 -264 -223 -67
4410 -67 166 -97 149 -95 145 -16 -157 -146 140 -79 -39 133 -152 -14 -34 -150 -302 88 48 -9 -100 192
4432 192 40 31 103 78 46 -2 -371 -36 79 76 199 148 23 -81 -202 291 111 -86 -102 -320 24 -134 -78 -20
4456b0j23M3R0l5K65l85J92M4K20j93r6j26j41K25K00r3P3k38j0J57j81N9N0j02
4480a25J51k86K30J34j63j09P3K4N8R5J58j22l05M38Pk14J62j41K60m28j7O8K43
4503A91k16J80m71K09J69k46Q3K16k04p8Mj3K86r5j79J53P0L9J25n6j6j14KN39
4527E78k06m37J90l15J30J93N4k24Q1K16m49J56M6o2%Q8K78l39K34k20l4N8n2
4550c6K28J50l82J12l58N55K4l73K62k08J00k4o4PM1q9NrQ6K13j13k85L93m11
4574a76K02m2O0o6m5o2J69n7J2j45o7K02m0J83K3l03L57j94o1J80L3j58K02k93
4598h6P6J4J93l02K8Rm5K43o1jk29J63J4n6K40l03r9J08J41J68o1k63J96m44K40
4623a17o1J75J1p2l3N0m9L42k94j16p3L79j45m3j26J16N9j03Q7J49J19m60K38
$$ plain form
4456 -20 -143 -100 -10 -45 220 -165 27 71 291 98 2 -124 -265 -40 160 67 140 -98 -108 49 -132 -73 -23 -125
4480 -125 26 -260 -30 104 -59 -168 -95 -71 -13 82 240 118 -187 251 258 44 206 65 325 -103 -120 -52 191
4503 191 -25 155 -316 -107 62 -184 -101 115 -89 -167 -163 -176 110 15 -164 -11 59 98 223 167 151 37 39 578
4527 578 372 -65 125 -190 -60 133 187 -37 44 260 -189 -33 13 -49 -49 39 317 -22 212 -8 -42 16 -36
4550 -36 192 342 -40 72 -286 269 293 -80 182 -26 74 50 -14 -7 34 -55 -50 -59 27 240 127 -158 235 -176
4574 -176 26 -16 44 -22 -67 -129 40 -17 -5 -150 -217 -15 -55 128 151 -152 205 11 -50 130 163 5 207 -86
4598 -86 -10 4 197 -105 -77 -68 -113 130 69 68 -161 2 16 -40 200 -103 -202 -94 47 215 154 -109 87 -357 -117
4623 -117 -178 -3 8 -64 -97 -47 -96 246 -48 -164 -237 142 -3 -46 -172 -56 3 -100 -13 136 255 -205 33
4646C3M8j45J4o7J0R8k43M86j20L12l17q0k16J44J53p1n9L1j51K08l4j10J88o1
4670E1R5k02o6N4K16k60J85r9J42l4j58p1j05J42K01o1M3j31Q1L46k57k6K51k91
4694D6j61j9J53k62J32J40l3J71k5M0o0j18O7k15L3J63j14k9j2J91J05k29K95
4717B59o7o0l79L16k26L6J72r9K35k2j61j16K43J31j61k80m1r4M0J03K79Qj11
4740EL35m58l9J27K79qj75Q9k2r0K5o1J48m14K33J29m61L62K07l82Q0R6J16P8
4764A99k91J81kj47M4J81o3l9j8P6m8j11L15p9j42rl3R6J67k52J87l45J03J21
4788I1L6n3j00k25L24N3R8l23O2J65K9k68n8K05r2J12k14J51j83L65j44m2j26
4811a37J02p3J60P4k10K05n9k1k4K08l4j57j59J25lL0j46J22r4O7r9J46j42k9
$$ plain form
4646 33 81 -64 -50 -117 -107 -9 -252 234 114 426 109 29 -187 -43 110 39 -20 11 -140 68 34 -76 112 51
4670 51 146 -56 -122 -68 148 -112 73 -26 116 82 -76 -147 -252 -110 91 30 73 -58 23 369 112 86 337 46
4694 46 -115 -134 19 -243 -111 29 -4 167 142 182 122 4 71 -144 -111 52 -62 -91 -103 88 193 -36 259
4717 259 192 132 -247 69 -157 -121 51 -48 187 165 4 -112 131 262 101 -179 -220 -314 -274 -171 108 116 5
4740 5 340 -118 -157 -30 249 241 66 155 133 43 68 7 155 -259 -26 103 -358 4 211 -171 -91 5 121 199
4764 199 -92 89 87 -60 -16 165 102 63 45 121 73 -38 277 198 56 47 14 110 277 25 212 -133 -30 91
4788 91 127 74 -26 -251 73 126 224 -99 -37 128 157 -111 -169 36 -56 56 -158 -7 -190 175 31 -11 -137
4811 -137 -35 -108 52 126 -84 121 62 41 17 225 191 34 -125 0 -3 27 -119 3 -91 -24 -123 23 -119 -148
4835a48J16K55j86J17k61K22j94L58q9j61j59K63q4l77N26k63m7Q2j32K22Nj31
4857f6L21m69K35oJ56j64j78J38%j84K25M7M1L2l14J55M9Q9j73J39j4j86J66J7
4881E6k2M2j34P6J35l23L48k08j66K8J27lO6k47K63J0p8n4J00k10j27K88j29K65
4905A03l3m9j08j82pO1K85j69P9j1O3J66k08J25j83q7K38o7j18J00K12k51p7K26
4929A08J40j81k01J20L4N8L53m32P7j58J41p7J6j42M9K05j48M34n00L2J83K9k72
4952a32L37j21j57m7M0K85l20J86q4l6o1J52j46K32j72O3mQp7k05M38k75j0l8
4976a44K73j04M7j22j40K43j51L68k24k14O5J91k51K02k19l5J96l3q4K81l24M64
4998B85j07k93L19j51J20M7l11j42L94j60P1O0k47K3k07K52N5J67l20L93k97j13
$$ plain form
4835 -148 -32 223 37 154 -107 115 -79 279 190 29 -130 133 49 -328 198 -65 -112 -30 -162 60 65 -66
4857 -66 255 -214 21 15 171 7 -171 -33 -33 -217 8 55 96 128 -186 -31 18 107 -66 73 59 -127 39 56
4881 56 34 76 -58 18 153 -170 178 -30 -196 -168 -41 -44 22 -225 38 48 -30 -84 16 -194 -321 -33 -162 103
4905 103 70 21 -87 -269 -276 -215 70 -99 -20 -31 32 198 -10 115 -68 -155 83 16 -102 -2 210 -41 -118 108
4929 108 248 67 -134 -14 20 78 431 -1 76 -82 59 -18 -2 -144 -95 110 -38 396 -104 -72 111 140 -132
4952 -132 205 84 -73 -120 -80 205 -115 71 -13 -49 -110 42 -104 128 -44 19 15 23 -54 -259 179 -96 -106 -144
4976 -144 129 25 72 -50 -190 53 -98 270 46 -168 -103 88 -163 39 -180 -215 -19 -52 -136 145 -179 285
4998 285 178 -115 204 53 173 220 -91 -233 161 1 72 132 -115 -92 -299 -47 8 175 -145 248 -49 -162
5020a62K20j28o4J26j2j15M17n25M17p4j46j49M42j71k3o6o7J26p2J27L9j26K08
5043B22j82j61j26J86KK1q9J55k01O1m3L7K0M0J19p1K0j60O3K11lm34J07nL02
5068I1p7j39n1O8l8K36K6r9J37j05ln7M9lP7j8m14M00O3j2M4k02J17j07R1k11
5094a37L29k41o5L55l61K37M1j19J08Qk95M3k6o3K9N6K17J76l64J34k26K24j76
5117a16J58j50K6j36J28K36lj57j65L05p0n7m9P4J14r7j39r0J58k2R2j2LK39l06
5142c6j36lM6Q1L5O5J67k43j1K14j35L5K34o08J15J11Q8L7J25k58L11m30K11K15
5166B30k86P9J38l56O6OM23k68m3J07K5J30l14jJ09k87L06o7J2O4Rl30K29J48
5190A29j93m9m7J98j33J32J5j07K07J07k01oJ8j55Q2k47O4J57K92k55P5j65J00
$$ plain form
5020 -162 58 -70 -134 -8 -20 -135 282 -243 174 100 -46 -195 247 76 53 -13 -80 46 -26 101 140 14 222
5043 222 40 -121 -247 -61 -59 -38 -127 28 -173 -112 -155 -118 -98 -58 61 -10 10 -150 -87 124 121 -313 -206 -211 91
5068 91 14 -125 -176 -108 -146 90 116 17 154 49 46 -11 38 35 112 94 -320 80 143 131 175 -27 90 -17 74 -137
5094 -137 192 -49 -114 241 -120 117 158 39 147 155 -140 -97 -123 -186 -157 -101 116 292 -72 62 -164 60 -116
5117 -116 42 -108 -82 -218 -90 146 143 -14 -179 126 56 -1 -50 24 138 41 -98 -188 -30 -52 40 28 31 270 -36
5142 -36 -172 -175 -129 -48 -13 52 219 -24 -35 179 44 79 313 -295 -180 -69 19 56 181 -77 234 -196 15 230
5166 230 -56 23 161 -195 -129 -123 300 32 -11 96 121 251 -63 -64 45 -242 64 -3 9 73 82 -248 -19 129
5190 129 -64 -113 -160 38 -95 37 52 -55 152 259 58 52 70 -85 -3 -250 -186 -29 263 8 83 -82 18
5213A8J20m0RM5k55R9J62j37l4J02l0m8M7k24J75k24K95l48J14K00q9O9J00j3
5237A13J70n22K19K66l97J66M9j27J73J50l22l1q2K87r6%l0j97K34M4l85J93Q5
5260d0j47M33j37k90L93l03J16mQ4Qk05J75O3o1r4K0j19K98j01m18M62P1j05j6
5284H3j6k1O6m16P1K85k01J17l5LJ55K6j82K9J3J42l19J32K37l15J49l2L8q5M1
5309c5k30K32m8J18%j09k7Q8J14k15k04M20j73j00K69q3J35k05j05K84l24K29
5331C1J64k25R7q9J65j37J46n3R2j91n6q4J21M3M3k32J67J14q8j08j65J71L7k12
5355b49J29pJ17o8j0J59p7K01j21j77L7n6L91k45N1j40J04Q0n3m12J25J21R5r3
5379i8J9J31Q8j36j28j11L58m48L95j24L01j27m21J11j08N36k62j0J77oj79K51
$$ plain form
5213 18 138 98 107 152 -103 -4 158 21 -13 89 59 11 58 -166 9 -215 80 -268 -154 46 -43 26 126 113
5237 113 283 -239 -20 246 -151 15 64 -63 110 260 -62 -93 -175 112 16 16 -14 -211 23 67 -318 -125 -40
5260 -40 -187 246 109 -181 212 -91 25 21 105 113 -92 83 146 85 -9 11 -108 190 89 -329 133 204 99 83
5284 83 67 46 112 -304 -233 52 -149 -32 -67 -64 91 117 -65 -36 -23 119 -200 -68 169 -146 3 -29 9 -76 -35
5309 -35 -265 -33 -81 37 37 -72 -99 -11 103 -112 -316 104 -69 -169 100 17 152 -53 -158 126 -198 31
5331 31 195 -30 67 -22 143 6 152 99 191 0 -56 -140 -19 24 67 -165 2 116 28 -80 -245 -74 -37 -249
5355 -249 -120 -127 -10 -78 -88 71 -6 195 74 -103 -66 -122 269 24 75 -65 39 119 66 -346 -221 -100 -5 -98
5379 -98 -79 52 140 4 -124 -235 123 -325 70 -54 247 120 -301 -190 -298 238 -24 -34 143 137 -42 209
5401B09l62R7Q4J74l05J7J63l04M03l20m1J85j45j63K76Rj13P6K39j31j09J03
5423D2l0O8k45O5J6rK02m38L30j03J37j4J31o6k02L5J86n7K8j51j35L13j90k2
5447a09J65k57k16L07j32R3L5O2jJ65nk22lJ22O5l43L42K3l5j55J19j17L47j38
5471A12j20J09m87K36J03K46k76K64o0Ql30L50j97n7k01J58O8Q7Q9Q0q3P5l06
5494a32pR9j03J72N5j63k64M22r2k08M55j88J07k51P6J32k8L0J4k57J05j2kl6
5518g6pk7J41r0K00j2l57M69k13j15K92r6j35nK33l36L7j84L63j4j39J19j65q0
5542a97L39j19q5n6l3P0J47p3QQj44J69k7j89L08j16J18M5J22l38j20M4RQ2oJ78
$$ plain form
5401 209 -153 -56 28 202 -103 -86 77 -227 176 -144 -185 0 -145 -308 -32 -23 -136 -60 179 48 -61 42
5423 42 12 80 -165 -100 -84 -93 109 -329 1 -102 35 21 152 86 -116 -81 105 48 76 -75 -210 103 -87 -109
5447 -109 56 -201 -417 -110 -242 -149 -114 -52 -53 112 107 -115 -118 4 69 -274 68 91 56 -99 20 -97 250 112
5471 112 -8 101 -386 -150 -47 199 -77 187 127 135 -195 155 -42 -99 -300 -142 -74 13 102 182 99 174 -132
5494 -132 -139 -40 -143 29 84 -79 -343 79 -13 -221 234 46 153 -98 -22 110 82 112 126 -131 -26 -38 -40 -76
5518 -76 -83 -110 31 -59 141 129 -228 241 28 -87 205 109 -26 -31 202 -134 -97 -281 82 68 -71 48 -117 -197
5542 -197 142 23 -62 -118 -151 -81 66 -7 1 9 -135 34 7 -182 126 10 128 173 295 -43 -163 -119 -110 -28 -34 144
$$ [...]
8191D2
##END NTUPLES=NMR FID
##END=
