##TITLE=1H_Pr 2938
 CDCl3
 8 sc, 
 9.2.2023
##JCAMPDX= 6.0         $$ Bruker NMR JCAMP-DX V2.0
##DATA TYPE= NMR FID
##DATA CLASS= NTUPLES
##ORIGIN= UXNMR, Bruker Analytische Messtechnik GmbH
##OWNER= root
$$ XWIN-NMR		Version 3.5
$$ Thu Feb  9 14:54:37 2023 Russian Standard Time (UT+4h)  she@DPX200
##.OBSERVE FREQUENCY= 200.13135
##.OBSERVE NUCLEUS= ^1H
##.DELAY= (6, 6)
##.ACQUISITION MODE= SIMULTANEOUS
##.ACQUISITION SCHEME= undefined
##.AVERAGES= 8
##.DIGITISER RES= 18
##SPECTROMETER/DATA SYSTEM= spect
##.PULSE SEQUENCE= zg30
##.SOLVENT NAME= DMSO
##.SHIFT REFERENCE= (INTERNAL, DMSO, 0, 15.7039)
##AUDIT TRAIL= $$ (NUMBER, WHEN, WHO, WHERE, WHAT)
$$ ##TITLE= Audit trail, XWIN-NMR		Version 3.5
$$ ##JCAMPDX= 5.01
$$ ##ORIGIN= Bruker BioSpin GmbH
$$ ##OWNER= she
$$ F:/spectra/data/she/nmr/H-F/1/audita.txt
$$ ##AUDIT TRAIL=  $$ (NUMBER, WHEN, WHO, WHERE, WHAT)
(   1,<2023-02-09 14:53:36.07 +0400>,<she>,<DPX200>,
      <created by zg, POWCHK disabled, PULCHK disabled
       configuration hash MD5:
       00 E9 B6 7A A2 85 ED C7 34 08 36 98 17 FE 4E 26
       data hash MD5: 16K
       58 64 38 03 B9 06 9F EA CF 5D 25 76 3F A3 82 C9>)
$$ ##END=
$$ 
$$ hash MD5
$$ C7 3D 4D 6D FD 5E 42 CA A8 02 53 D8 67 66 27 14
##$RELAX= 
##$RELAX= 
##$RELAX= 
##$RELAX= 
##$RELAX= 
##$RELAX= 
$$ Bruker specific parameters
$$ --------------------------
##$DU= <F:/spectra>
##$EXPNO= 1
##$NAME= <H-F>
##$PROCNO= 1
##$TYPE= <nmr>
##$USER= <she>
##$AMP= (0..31)
100 100 100 100 100 100 100 100 100 100 100 100 100 100 100 100 100 100 
100 100 100 100 100 100 100 100 100 100 100 100 100 100 
##$AQSEQ= 0
##$AQ_mod= 1
##$AUNM= <au_zg>
##$AUTOPOS= <>
##$BF1= 200.13
##$BF2= 200.13
##$BF3= 200.13
##$BF4= 200.13
##$BF5= 200.13
##$BF6= 200.13
##$BF7= 200.13
##$BF8= 200.13
##$BYTORDA= 1
##$CFDGTYP= 0
##$CFRGTYP= 5
##$CHEMSTR= <none>
##$CNST= (0..31)
1 1 145 1 1 1 1 1 1 1 1 1 1 1 1 1 1 1 1 1 1 1 1 1 1 1 1 1 1 1 1 1 
##$CPDPRG= <>
##$CPDPRG1= <>
##$CPDPRG2= <>
##$CPDPRG3= <>
##$CPDPRG4= <mlev>
##$CPDPRG5= <mlev>
##$CPDPRG6= <mlev>
##$CPDPRG7= <mlev>
##$CPDPRG8= <mlev>
##$CPDPRGB= <>
##$CPDPRGT= <>
##$D= (0..31)
0 1.2 0 0 0 0 0 0 0 0.06 0 0.03 0 0 0 0 0.0002 0 0 0 0 0 0 0 0 0 0 0 0 
0 0 0 
##$DATE= 1675940015
##$DBL= (0..7)
120 120 120 120 120 120 120 120 
##$DBP= (0..7)
150 150 150 150 150 150 150 150 
##$DBP07= 0
##$DBPNAM0= <>
##$DBPNAM1= <>
##$DBPNAM2= <>
##$DBPNAM3= <>
##$DBPNAM4= <>
##$DBPNAM5= <>
##$DBPNAM6= <>
##$DBPNAM7= <>
##$DBPOAL= (0..7)
0.5 0.5 0.5 0.5 0.5 0.5 0.5 0.5 
##$DBPOFFS= (0..7)
0 0 0 0 0 0 0 0 
##$DE= 6
##$DECBNUC= <off>
##$DECIM= 32
##$DECNUC= <off>
##$DECSTAT= 4
##$DIGMOD= 1
##$DIGTYP= 9
##$DL= (0..7)
0 120 120 120 120 120 120 120 
##$DP= (0..7)
150 150 150 150 150 150 150 150 
##$DP07= 0
##$DPNAME0= <>
##$DPNAME1= <>
##$DPNAME2= <>
##$DPNAME3= <>
##$DPNAME4= <>
##$DPNAME5= <>
##$DPNAME6= <>
##$DPNAME7= <>
##$DPOAL= (0..7)
0.5 0.5 0.5 0.5 0.5 0.5 0.5 0.5 
##$DPOFFS= (0..7)
0 0 0 0 0 0 0 0 
##$DQDMODE= 0
##$DR= 18
##$DS= 0
##$DSLIST= <SSSSSSSSSSSSSSS>
$$ [...]
##$SUBNAM2= <"">
##$SUBNAM3= <"">
##$SUBNAM4= <"">
##$SUBNAM5= <"">
##$SUBNAM6= <"">
##$SUBNAM7= <"">
##$SUBNAM8= <"">
##$SUBNAM9= <"">
##$SW= 18.05172834244
##$SWIBOX= (0..15)
0 0 2 0 0 0 0 0 0 0 0 0 0 0 0 0 
##$SW_h= 3612.71676300578
##$TD= 16384
##$TD0= 1
##$TE= 0
##$TE2= 300
##$TE3= 300
##$TEG= 300
##$TL= (0..7)
0 120 120 120 120 120 120 120 
##$TP= (0..7)
150 150 150 150 150 150 150 150 
##$TP07= 0
##$TPNAME0= <>
##$TPNAME1= <>
##$TPNAME2= <>
##$TPNAME3= <>
##$TPNAME4= <>
##$TPNAME5= <>
##$TPNAME6= <>
##$TPNAME7= <>
##$TPOAL= (0..7)
0.5 0.5 0.5 0.5 0.5 0.5 0.5 0.5 
##$TPOFFS= (0..7)
0 0 0 0 0 0 0 0 
##$TUNHIN= 0
##$TUNHOUT= 0
##$TUNXOUT= 0
##$USERA1= <user>
##$USERA2= <user>
##$USERA3= <user>
##$USERA4= <user>
##$USERA5= <user>
##$V9= 5
##$VALIST= <valist>
##$VCLIST= <CCCCCCCCCCCCCCC>
##$VD= 0
##$VDLIST= <DDDDDDDDDDDDDDD>
##$VPLIST= <PPPPPPPPPPPPPPP>
##$VTLIST= <TTTTTTTTTTTTTTT>
##$WBST= 1024
##$WBSW= 4
##$XGAIN= (0..3)
0 0 0 0 
##$XL= 0
##$YL= 0
##$YMAX_a= 229203
##$YMIN_a= -233703
##$ZGOPTNS= <>
##$ZL1= 120
##$ZL2= 120
##$ZL3= 120
##$ZL4= 120
##$ABSF1= 10
##$ABSF2= 0
##$ABSG= 5
##$ABSL= 3
##$ALPHA= 0
##$AQORDER= 0
##$ASSFAC= 0
##$ASSFACI= 0
##$ASSFACX= 0
##$ASSWID= 0
##$AUNMP= <proc_1d>
##$AZFE= 0.1
##$AZFW= 0.1
##$BCFW= 1
##$BC_mod= 2
##$BYTORDP= 1
##$COROFFS= 0
##$CY= 11.3945322036743
##$DATMOD= 1
##$DC= 2
##$DFILT= <>
##$DTYPP= 0
##$F1P= 2.36226072786647
##$F2P= -0.459571619588291
##$FCOR= 0.5
##$FTSIZE= 0
##$FT_mod= 4
##$GAMMA= 1
##$GB= 0.15
##$INTBC= 1
##$INTSCL= 1
##$ISEN= 128
##$LB= 0.24
##$LEV0= 0
##$LPBIN= 0
##$MAXI= 10000
##$MC2= 0
##$MEAN= 0
##$ME_mod= 0
##$MI= 1.114404
##$NCOEF= 0
##$NC_proc= 0
##$NLEV= 6
##$NOISF1= 3.799351
##$NOISF2= 2.8
##$NSP= 1
##$NTH_PI= 0
##$NZP= 0
##$OFFSET= 15.70392
##$PC= 1
##$PHC0= -19112.47
##$PHC1= 10.40078
##$PH_mod= 1
##$PKNL= yes
##$PPARMOD= 0
##$PSCAL= 0
##$PSIGN= 0
##$REVERSE= no
##$SF= 200.130013532006
##$SI= 16384
##$SIGF1= 3
##$SIGF2= 2
##$SINO= 400
##$SIOLD= 16384
##$SREGLST= <1H.CDCl3>
##$SSB= 0
##$STSI= 0
##$STSR= 0
##$SW_p= 3612.71676300578
##$SYMM= 0
##$S_DEV= 0
##$TDeff= 0
##$TDoff= 0
##$TI= <>
##$TILT= no
##$TM1= 0
##$TM2= 0
##$TOPLEV= 0
##$USERP1= <user>
##$USERP2= <user>
##$USERP3= <user>
##$USERP4= <user>
##$USERP5= <user>
##$WDW= 1
##$XDIM= 8192
##$YMAX_p= 0
##$YMIN_p= 0
$$ End of Bruker specific parameters
$$ ---------------------------------
##NTUPLES= NMR FID
##VAR_NAME=  TIME,          FID/REAL,        FID/IMAG
##SYMBOL=    X,             R,               I
##VAR_TYPE=  INDEPENDENT,   DEPENDENT,       DEPENDENT
##VAR_FORM=  AFFN,          ASDF,            ASDF
##VAR_DIM=   8192,          8192,            8192
##UNITS=     SECONDS,       ARBITRARY UNITS, ARBITRARY UNITS
##FACTOR=    0.0002768,     1,               1
##FIRST=     0,             0,               0
##LAST=      2.2672688,     0,               0
##MIN=       0,             -233703,         0
##MAX=       2.2672688,     229203,          0
$$ Real data points
##PAGE= N=1
##DATA TABLE= (X++(R..R)), XYDATA
$$ [...]
1905b95j004K080O83k386L37K119l90j675L25J559k47k315J466J640k221p59J418
1922C35O44j219j177J860J40j907M48J205m67p80%J543k12j650J167J134r67j87
1940i0O09J032j028r26J174M68j643K47P17n44p59l09J470n59j313N21R38q94
1958h89j10L34P87l01q31J616op32N20M09N0l04o50J212n07o42K72Q7nl71l27
1979c88O27k89j047R75k18j66k3j22N22J49n42R08j1l67K62j56N75K1n88M97J28
2000G47n54J36k01j9n0r29O53L6o11L05k85O62J46o72N75L85p43N97N01k91k22
2021A66l16J034j1j659R43O21p79k42p2P97n43r54J046L35j073P6P09K32o42m56
2041g88J554O1j342R39N79m75p66L47J107q81j224J164L93j239L4M01P89j441
$$ y = [-295, -1299, 781, 1464, -922, -585, 1534, 1144, -531, -206, 1353, 1106, -1209, 257, 1897, -324, -1083, 335, 979, -240, -1417, 443, 583, -1324, -876, 329, -138, -918, -918, 625, 413, -1237, -70, 1064, 97, -90, 519, 1551, 523, -403, 771, 1239, -404, -157, 560, 16, -743, -1052, 418, -141, -1454, -933, 5, -889, -999, -665, 122, -179, -1010, 606, 600, -132, 388, 797, 847, 543, -107, 1105, 598, -44, 228, 315, 310, -61, -388, 239, -50, -1097, -122, -340, -506, -529, -651, -129, 20, -522, 386, 375, 8, 270, 114, 689, 710, 122, 619, 747, 193, 329, 128, 109, 59, -870, -217, -181, -792, -487, -772, -110, 36, -636, -61, 324, -419, 178, 679, 388, 166, -150, 884, 873, -786, 157, 778, -1, -243, -315, 482, -61, -1015, 31, 366, -707, -631, 78, 310, -332, -788, 766, 827, -515, 424, 1003, 528, -238, 109, 1216, 335, -889, 275, 668, -571, -537, -136, 653, -788]
2059g88o41J876l23j457Q38R55l11o82L36J479j196q07J425M27j336o5O14J074
2077A418j537q90J965l59j805M96J160n08j192J1K082j160j481J651P69j182m74
2094a036J212Q59j302m61J886j93j450N04R85p5j652M44J692j177j177J312O27
2111I98j360o01R05R92j740n38K459o72j579O08J206j60j488O34J690j203j134
2128i83J409Q12j017r15J047R02k011k3J671l28j393M29P03K99j753O39J791j802
2146e23m33R63O35n42j169J324M98j527pJ493l80p50j81J048M4j465M94J261r49
2165a66o26Q16Q31n50j044Q92R24j496Q9R27j8o27o03J064M3j164N15Q78r19k80
2185e14K46O75n50n97R21N35j253J73Q99J58o25m10J009K04j368O34N50m88k33
$$ y = [-788, -1429, 447, 124, -1333, -495, 460, 149, -533, -197, 1282, 86, -721, 704, 1131, -205, -270, 344, 1418, -119, -1009, 956, 597, -1208, -712, 448, -60, -1252, -1241, 841, -319, -1800, -149, 620, -562, -1036, 176, 1035, -267, -728, 1158, 965, -485, 19, 1004, 929, -723, -279, 1413, 236, -941, 371, 998, -362, -963, -58, 934, -806, -1344, 1115, 443, -1136, -528, 678, 518, -970, -336, 1354, 151, -983, 426, 1238, 221, -694, 353, 1255, -756, -779, 892, 564, -829, -400, 303, 602, -1151, -512, 1279, -523, -956, 7, 642, 100, -1069, 255, 753, -774, -781, 712, 332, -418, -599, 449, 493, -972, -478, 783, -166, -792, 24, 855, 305, -739, 153, 1077, -419, -330, 597, 579, -48, -651, 413, 456, -708, -193, 685, -234, -514, -268, 407, -143, -740, 181, 716, -537, -364, 535, 693, 68, -342, 667, 871, -497, 137, 687, 199, -34]
2204c4K25J15j91o85N34M38o19j41K91K8k69n08J013k9o62J63M99k40k14k32R59
2225D41k99m92L61K68k68L2l20M91Q3j026R34n5o23K84l6M1M1m01O50k13l11M37
2247A9Q5p8Nl62M35L06p72L38L48k15j52k03K23M60o58L31K53l66n8q5M37L92
2269F83r09P20R9o41J40N4K07J60q27K99N17p28o9M77l28p8l82O73J98j006N05
2290b36M52m28m9J98O70j42j054J062M35j144J73L25K48k97p58R41M2j076K38
2309d00O02m60j17k49R66k75j281J182K34o89j14P09L25k45n71J010K48j275N06
2328A06Q33k98o76k46J302q40j003N75N80p63m34M60R41q51n77J192K00j215K68
2347d46R91m9p55j16R82l15r54P06Q00q61k82M65O14q22o26J264k43r22J38N57
$$ y = [-34, 191, 306, 115, -570, -36, 402, -217, -358, -67, -39, -308, -816, 197, 168, -494, -331, 168, -72, -286, -518, 441, 142, -350, 11, 279, 11, 43, -277, 214, 297, -729, 205, 150, -473, -189, -225, -184, -143, -544, 106, -107, -418, 19, 104, 26, 31, -331, 104, 410, -362, -24, 324, 109, -43, -246, -23, 437, -221, 110, 363, -3, -61, -146, 291, 683, -226, 494, 593, -48, 92, 146, 353, 513, -314, -15, 502, -226, -295, 182, -146, -224, -606, 67, 265, -741, -236, 216, -212, -261, -63, 607, 465, -589, 473, 908, -236, -63, 262, 510, 213, -545, 396, 438, -638, -400, 202, -258, -375, -624, 342, 67, -1214, -32, 202, -487, -601, 108, 433, 188, -383, 627, 875, -400, 106, 939, 641, -35, -281, 1021, 181, -822, -247, 333, -430, -864, -404, 537, -314, -891, 301, 501, -714, -446, 545, 496, -259, -375, 607, 292, -662, 44, 844, -17, -299, 166, 780, -42, -668, 596, 353, -569, -431, 126]
2367A26J92j051m4J553p53j122J122N97p18l44L84J068j073p99J206J41o78k31
2385d24L82M18q94J28Q54n02p84Q68J11j78n89K55J294j166m20J089K27p47R6
2404A8L27N06j003j92J238o01r42O07L74j77q59L17J052j058l83Q22K41k25l32
2423b70N28M51j157L23P62n81k52L41L37M8j062O56M86o08l88N70J5j96n61L38
2443b20K64o88J96O53k86m8j1O4L33o36N29N72q23%N40j9o3m71K89O60j040q4
2465b89P72n48j88j66M08P4o66M12L76p00K03L81j71J71m96O11M48p04J39M26
2485D93l06K06k60J04K4l52J85J57l61K62k60J1L75q03M51J61p13N65j96J72N7
2506b8j97R9N23n18L26k86K29J66m48M42J80o27J99n3K0L0k3P4r2o8l48N47n1
$$ y = [126, 318, -733, -777, 776, 23, -1099, 23, 620, -98, -442, -58, 1010, -63, -862, 344, 485, -193, -424, -42, 376, -518, -390, 464, -38, -822, 46, 157, -21, -610, -355, 939, -227, -647, 442, 669, -78, 18, 345, 851, -152, -344, 894, 293, -649, -42, 332, 155, -704, -387, 665, -393, -776, 46, 287, 62, -270, 258, 709, -448, -125, 637, 56, -196, 145, 482, 530, -532, 124, 610, 2, -386, 184, 199, 3, -558, -220, 44, -644, -448, 205, -81, -129, -140, -76, 257, -379, 150, 722, -101, -101, 439, 420, 357, -114, 175, 835, -205, -289, 483, -65, -253, -419, -11, 63, -603, -191, 185, -515, -312, 69, -102, 69, -427, 184, 632, -72, 67, 493, 187, 393, 133, 237, 261, -91, 94, 251, -110, 152, -108, -97, 278, -525, -74, 87, -626, -61, -257, -85, -28, -225, -126, 397, -121, 205, -81, 148, 314, -134, 308, 488, -139, 60, 7, 27, 57, 34, 108, 16, -52, -400, 147, 96]
2529I6J09p04K71K49k43L9N18k98p5J17Q9J14o46O62K15o95K33J57O3N7n86M20
2551A62K65q86K31N20l72l60K49J99O4m25L11N29o50p2L65L43J18r86L89L70o17
2572b53J85M99k16l88k08N28j59k55M1K40R7m96J92K71j0m49M60L98p48R1K35
2593E5J03m8m89R02K52j112M76N31o74k63N3O10k20p71O21K4k83k99O55M5n51
2614c83p5O66M98j003N77J53M2m14L07K07m20m74P10M15q13r1lM34o71l99R67
2635B30k96j039Q13M5K64p78M58N50m71k80O09K23n38j07O02P0k14k97P32m58
2655A18m13Q7O24l57l05%P83o71n26M65J67N4p42O06L70m46k52Q82k80m48L65
2676H1N10j05m23p2O30l87l32N43P4l68k70j9N03m31p11Q75j65l59J45J76M81
$$ y = [96, 205, -499, -228, 21, -222, -183, 335, 37, -38, 79, 168, 282, -364, 298, 513, -182, 51, 208, 271, 328, -258, 162, 427, -459, -228, 292, -80, -440, -191, 8, 72, -353, -42, 487, -163, -235, 130, 473, 591, -395, -6, 364, -253, -68, 431, 215, -173, -381, 147, -12, -267, -226, 14, 111, -385, -193, 78, 68, -381, 79, 477, -271, -180, 55, 158, 110, -379, 523, 775, -337, 139, 670, -4, -267, -214, 396, 176, -595, 26, 50, -233, -532, 123, 168, -383, -458, 208, 706, -297, 280, 433, 475, 61, 368, 575, 155, -319, 391, 806, -7, -98, -101, 333, -338, -737, 230, -66, -1105, -292, -247, 17, -761, -303, 247, -224, -504, 105, 328, -210, -317, 285, 355, 141, -156, 576, 118, -295, -208, 416, 59, -246, -246, 537, -134, -660, -195, -28, 26, -716, -110, 260, -186, -438, 444, 164, -284, 81, 591, 486, 63, -9, 621, 234, -98, 445, 519, 151, -119, -138, 365, -66, -777, 98, -67, -426, -281, -105, 376]
2697C76o77q7Q51l73n10N66K78l42j92K98J70j38k95L12p8k88J07j1L01k77l00
2718c09M46m39J65J09k11J50q4k23O30m39K4L3J85K10l81L21J40n16K16L43q0
2739B90j3k28Kj28r1R2L22k55j76K44r9K39l01k2O08l98O2M9k43Lj76M23J25m57
2763a28R8M4J40m29J41o6J90r3l44M60k35O9Q7R2p1j02n8L15k5q1J57o1O0k25
2787f5J45L07l55l5K21l21K52j66l77L20l85n0O35m99R8R2Q5n4j34J84N04l44
2809E8k61L89j7J17l74J73N43o09j56N93n13k05J78Q3K8l98lN07j94l66K97L7
2831i3K08j95nL76k47m13L42K67j93k27K78K34q6k44K74j90j87j31M73m7o02L19
2853h9L85o47l9M76p2J7l88M44K62o23p4O77j44l73K14K56%m52L01L73o14m8L29
$$ y = [376, -301, -388, 463, 90, -420, 146, 424, 82, -110, 188, 358, 220, -75, 237, 159, -129, -22, -33, 268, -9, -309, 137, -302, -137, -28, -239, -89, -173, -396, 234, -205, -181, -148, 37, 247, -134, 187, 327, -189, 27, 370, 290, 277, 49, 51, -77, -168, -76, 246, -9, -185, 59, -40, 199, -102, -124, 484, 86, 148, 197, -46, -43, -219, 204, 329, -128, -30, 14, 154, -275, -134, -200, -10, -103, -447, 13, -222, -153, -66, 26, -45, -147, -205, 110, 85, 4, 161, 100, 160, -65, 80, 387, 32, -3, 218, -103, 149, -17, -394, -74, -459, -509, 126, -373, -275, -183, -98, -152, -286, -102, 402, 58, -203, 186, 169, 286, -88, 85, 628, 19, -137, 456, -57, -262, -84, -1, 27, -371, -374, 133, -61, -427, -130, -93, 115, -80, -85, 291, 44, -369, -27, 240, 47, -180, 98, 332, 246, 2, 276, 86, -101, -232, 241, 194, -408, -89, 296, -351, -390, 86, 14, 31, -357, 87, 349, -274, -348, 329, 185, -188, 26, 282, 282, -170, 131, 504, -110, -158, 171]
2876A71J40l66n9K66L6l64j52L44j69q9J31N55m77k26l8O70m07j90L65M9j84l78
2898c72N35M12n28k01L72Ml53n0M45j45n26K51N05k21m45j8N60k34m10L03N77
2919D61p42J31l5M24l27k22N94j55m89N82p4O8l19J73J35n6k99J24K45l29p9j2
2941b01M12k77m88N92K51n98K21L00m3l27q2L73j99r2M32j09m80L86j39K15l06
2962a59M2N87o17o4K68Np3k37J72K64k02O6m4K08l0j02J46J55k90l6k02M48m21
2985a16J64j03L7K8k00K65k60j01m6K87l44K48k21K81J30r3J88l4j74P2k9J10
3007H9m3O1L94l65l83K94N0L7k76J48K89l93K1j17N3L6j88M0K97p3L5J50k18N07
3031D45k84k5R6M0l8rj43O9k01Q2K08m00M1J42j71r9J66k1R2j53j27L02Q7l51
$$ y = [171, 311, -55, -114, 152, 188, -176, -328, 16, -153, -242, -111, 444, -33, -259, -297, 373, -34, -224, 141, 190, 6, -372, 163, 575, 47, -154, 218, 222, -131, -181, 264, 119, -407, -156, 349, 128, -317, -335, 225, -9, -419, -116, 461, -281, -150, -185, 239, -88, -310, 284, 129, -360, 222, 148, 216, -103, 70, 205, 149, -150, -26, 219, -110, -189, -201, 211, -66, -554, 38, 289, -309, -88, 212, 169, -158, -240, 133, -66, -158, 274, 165, -315, 71, -68, 147, -159, -117, 470, -147, -211, 57, 62, -11, -248, -76, 188, -14, 52, 8, 216, 186, 84, 230, 385, 95, 59, -143, 305, -116, 48, -55, -18, 10, -190, 75, -185, -286, -332, -45, -389, -141, -362, -81, 49, -44, 144, 110, -64, 8, -21, 89, 46, 107, 501, 136, -247, 47, 97, 134, -142, 6, 295, -98, -77, -194, -141, -105, -293, -253, 44, -29, 6, 156, -62, 445, 161, 136, 232, 272, 234, 225, 82, 151, -50, 32, 240, -160, -119, 23, -148, -247, -81, -102, -10, -163, -290, 12, 99, -252]
3055b52K67j18K69k31PN73l48j49O2K72l32J45n1o3l4j57L7N5q6Q7j39K38n6j77
3079a81K67j58o1K40k17L5k53K79K63l14J7L70j42J15k57J39ll14o7M45n22L71
3101E2o0J7k28q2M14K45m06l67O39r5j48k11L57lk54Q0L92j80j89K17j96Q2j41
3124f5R8K36l48N6K0j93K9K1K44o0k33K48J57n8J9j28O3K41n36K86K9j67n6M25
3148C28j57n06PK38J34Lk08J05j03J17m9k4L67m61R0L76L8n68K10R1J08k94M05
3171B47q5m62L96j98o5l5l73O03r4k90O07q8m89L18q8O0K67m01J51K44l66L18
3193A77j0m5j10l48N04Q0l78L95p4k49K62j57m4N7n48P34j13n82M89J67k22r0
3215a05j99M19j31l49L96J19n5k62L71o0m4l58L58Q2j68J70j09J53l26J51K07
$$ y = [-252, 15, -103, 166, -65, -58, 515, 167, 18, 80, 352, 20, 165, 114, 51, 17, -140, -103, -48, -134, -47, -186, 52, -4, -181, 86, -72, -133, 107, -110, -75, -328, -49, 214, -100, -83, 287, 145, 260, 3, 142, 139, -175, -242, 203, -319, 52, -8, 9, -219, -301, 113, 358, -48, -415, 224, 129, -19, -230, 127, 124, -130, -50, 342, 162, -27, 190, -6, 76, -65, 33, 269, -79, -23, -3, -196, -167, -146, 98, 38, -195, 53, 210, 152, 171, 43, 106, 347, -189, 97, 126, -41, -97, 328, 171, -335, -328, -90, 44, 47, -161, -56, -159, -42, -91, -115, 252, -209, -119, 257, 295, -273, -63, 28, 136, -158, 247, 162, -300, 96, -102, -167, -202, -575, 28, -66, -356, 251, 163, -326, -8, -96, -36, 231, -170, -19, 225, -141, 177, 167, 122, 12, -336, 168, 248, -130, 265, 191, -58, 204, 47, 3, 60, -488, 246, 133, -449, 40, 207, -15, -105, -304, 115, -16, -365, 31, 150, 95, -167, 204, 144, 100, -258, 100, 182, 14, 184, 75, 228, -98, 53, 260]
3236B60k11j93j24L71q8l24O7M04n78K96J8J05j74K12k34P6J36j96K08J50j44
3257C7J31k38Q3J45l68J16j24k13K09R8m6J78q1L23j88k64M20k55K02m01Q5K03
3279E2K83k78J88L4m92K37j02K68l57K67qj56o2R1J93J84m52Q9l77O69k06l92
3301c27M15L5J11m99L26K03l24J11P5n6k4m8Kr6J21Q9l0k90Q9K41j51P4l62N39
3325B24j60j10J09J82q7l17p0K60l1J61j25K01m41k3M5K41k5J8q0j10j43L21m1
3348ar8J31k24M85l37J45j03n1j33M06k57K37m5k03K97j38K04l11O8n0j96R5K65
3371A86k42n9P6Q5j29j31j55O55k35l98L66n6q4J52J61K8j41j55L53j6j77J93
3393B77l32K11l27j76L80m2k58M56j93k44N0Q2L53l40Q1J94j22l79J71J46M4j51
$$ y = [260, 49, -144, -268, 103, 15, -309, -242, 162, -416, -120, -102, 3, -171, 41, -193, -117, 19, -177, 31, 181, 37, 168, -70, 13, 158, -210, -94, -218, -431, -222, -124, -170, 8, -73, 250, 62, -202, 218, -37, 165, -236, -151, 52, 335, 57, 245, 279, -213, 24, -78, 190, -167, 100, 92, -64, -126, -35, 158, 342, -110, -21, -398, 271, 65, -327, 88, 123, 234, -265, 61, 264, -60, 51, 126, 70, 46, -2, 0, -96, 25, 114, 84, -206, -117, 124, -27, 47, -315, 224, 64, -46, 63, 245, 158, -159, -229, 31, 0, 161, 36, 237, -204, -227, -182, 59, 34, 52, -28, -138, -281, 40, -1, -99, 32, -192, 293, -44, 101, -2, -53, -186, 220, -37, 200, 155, -48, 249, 111, 315, 4, 72, 22, -174, -79, 186, -56, -115, -39, 46, -83, -214, -369, 286, 51, -347, 19, -37, -121, 31, 192, 220, 79, -76, 277, 261, 84, 277, -55, 156, -171, -347, 33, -9, -267, 189, -4, -248, -198, -116, 237, -103, -22, 172, 50, -329, -158, -12, 32, -119]
3415a19L23qm46J51L68k44r6L4O5M0m65L87L01l96J1K31J39j82k15J75K37m75
3437a84J41k1O7J51l67L16J62l92J61P9j26J65j44n5J17p7K48J81m44k6J51r2
3459A1L28o14N54q0l47L75j19J0O5q9j39O8j65J50Q1j89p2J87rR9k56J40K90m03
3483a24J93P3j27K91k53lMj5j59K13j16m2k59N79j08l65L54j23Q9m0o9K3m19J57
3507b46J88J44k90K14M8J07r4J47L6l22mJ25j1K15j71QJ1j39K39J53k67j68k10
3530b87K59k2L5j94M01l81K03j8l1rj61K26o3J35j88K07k1k53K52l3J09j71N8
3553E3Lk03J3J26l27L06J75l89K85J06j41k45j02L73o2j42M10l59J83K00m97k7
3575b61Q4j24L75p3R0k32M19l44q1M8K45n42L81N8J3q0J27J25k65r9M5K0J43j71
$$ y = [-119, 204, 196, -250, -99, 269, 25, -71, -37, 28, 68, -397, -10, 291, -105, -94, 137, 276, 94, -121, 54, 291, -184, -43, -64, 3, 154, -213, 103, 265, -127, 34, 113, -13, 152, 8, -47, 70, -7, 241, 422, -22, -48, 103, 11, 339, -275, 279, 199, -148, 227, 108, 118, 183, 94, -45, 23, -142, 8, 89, -100, -172, 15, 6, 105, -151, -11, 279, -124, 69, 142, 15, 306, 53, 50, 54, 39, -120, 93, -23, -65, -324, 255, 147, -218, 136, 13, 102, 62, -7, 16, -403, -246, -58, 86, -204, 10, 58, 165, 71, 218, 254, -68, -72, 53, 42, 257, 86, 94, 105, -34, 205, 358, 91, -77, -287, -28, -50, -15, -209, 192, -189, 14, -4, -35, -44, -205, 21, -42, 93, -95, 112, 91, -162, 90, 57, 166, -5, 53, 56, -147, -134, -8, -335, -29, 146, -243, 42, 148, 7, -238, -340, 33, -29, -171, 239, -120, 63, 263, -234, -261, -177, -301, 74, 1, 91, -141, 278, -66, -147, -99, 146, -396, -15, 43, 56, -24, 103, 228, -37, -136, -91, -71, 72, -99]
3599i9Q7P2j24J3Q6k84L54j03J48o7l88L41pQ4J69k94J78k80J39j01l9Q3N2R9
3623A19j49j75N7K91L3k45p9Pj22M96j77j51j25pK24K06j77k16J62J76j50r1Q2
3646a1K10k56K77m5j21k86J82K17k01r8M05k72J63o3k60J74m7r9K7j19K41k30
3668b12K04pj04j4LL19k80j22M14k01p9L6J92k52L1K20j48k30K88l3J03j37j12
3691a21K4J03K5j38M7P9Q0M9k02P1j64J92Q6p7l35J31J96j27l61M41k2j6j98K01
3715c6P0l36M27J47k19OK8j09L97n51J01J51j21j22M12j44J82l48K0O3o5J56J41
3738B50l39K45k25M0J58m25N32j32k12J68j33J61K34k50o7J41k58m7L56m13mJ12
3760a08K07n19N58j52m0O1j36Q7k5Mm1L02r5k6j91K89J4j74r6L00j03j75o7J52
$$ y = [-99, -12, 60, -64, -51, 35, -249, 105, 2, 150, 83, -305, 36, 29, 113, 282, -12, 166, -114, 25, -76, -115, -32, 20, 119, -30, -205, -148, 143, 176, -69, -148, -141, -263, 233, 56, -95, -220, -227, -3, 203, 26, -190, -28, 148, -2, -93, -11, 199, -57, 220, 175, 54, -232, -50, 167, -34, -132, 273, 1, 164, 101, -159, 15, -32, -131, -104, -223, 18, -212, -8, -15, -119, -133, -130, 189, -91, -213, 201, 0, -79, -43, 149, -103, -72, 148, 0, -230, 58, 25, 128, -9, -121, -97, 6, 31, -107, -60, 19, 99, 148, -54, 17, -147, 45, 131, 54, -281, -150, 46, -81, -442, -1, -23, -39, -237, -36, 34, -302, 125, 272, 53, 59, 87, -22, 375, -176, -75, 76, -45, -167, 245, 101, 283, -65, -45, 18, -47, 109, 250, -89, 156, -69, -29, 129, -296, 236, 104, -108, 60, -73, 88, 322, 72, 5, 146, -112, -159, 197, -216, -220, -108, 99, -420, 138, -14, -54, 7, -129, -42, -67, -63, -104, 198, 103, 77, -114, 175, 189, 15, -81, 219, 116, -59, -126, 26]
3784B6J84p9k62K54k39J36k4n3K94j17J00k74Q4k75J75k9q8N26l83j03J85j90
3806a52J05Q4r6J18M6K7k53J30k40N19l02J09j07n3J75m1j16K09j44l40L65j0
3828C3j2J3j28L4J96O1om45J40J21n6N2k6L4j6j84J41j89J44J54q6K84k09j60
3852a10K54Oj80r3J27m2M1j5J4K7j49K6K27Q3j91LJ82p3j5j68k20K16N7L51k73
3877H5R1j13JL8k16P6Nn7J43J04k5l02NK64R2l96J56n2K62k16J01J87k16q9J6
3902e6J69p2l9k07L43j70k02J07J56%J2j88n7L25j14j67K57j51j75K13l0j17M
3925a59J41n8o6R0l3L6MlM5O9l6N4k04J03J41j10J23j56j10N40k93j78J9K73j40
3950I2p6j78K24k60K21n2K8j77K01j13L46l57nK54j21n7J6k5J53J54j98MJ09o4
$$ y = [26, 210, 131, -131, 123, -116, 20, -4, -57, 237, 120, 220, -54, 30, -245, -70, -99, -187, 339, -44, -147, 38, -152, -47, 37, -59, 59, 105, 132, -121, 9, -231, 288, -14, 95, -12, -65, 110, 69, -47, 162, 18, -322, 43, 33, 21, 34, -94, -60, 136, 197, 191, -254, -114, 7, -49, 3, -23, 11, -5, -189, -48, -237, -93, 61, -25, 259, 50, -110, 144, 150, -30, -123, 4, -38, 3, -12, 2, 29, -120, -94, 133, 216, 25, 28, 210, 137, 122, -46, -266, -50, 7, 358, 85, 176, 63, 64, 102, -114, -38, -33, -90, 53, 157, 132, -170, -165, 99, 191, -205, -49, -101, 161, -55, 46, 233, 17, -72, -56, 113, 41, 2, -205, 138, -32, -234, -127, 29, 29, 41, -147, -204, 121, 7, -160, 97, -54, -229, -16, -46, -163, -159, -18, -76, -142, -52, -85, -49, -45, -48, -3, 66, 30, 84, -120, -17, 124, 14, 137, -19, -129, 411, 118, -60, -41, 232, 92, 16, -162, 62, -198, 23, -29, -1, -178, 23, -90, 256, -101, -106, 148, 27, -30, -14, -39, 114, 268, 70, 74, 183, 119]
3974A19j41J79j32J96q8M1j02k15o0L07J6r5O3R5k49O4j33J88l05P7L26J06l52
3997i5m0K61k6o7m4j84J12L35l92K98l07K21M3j91K1Q7n9J25mP2j75p1R1JK5P9
4023A16j33J04k30J54p1r1K84J62m23Q2j0m13N90N9j95J62j56l0J43k64L93j99
4045C4k60L69jk88M47l66K9K9k61J53J86k65K97o7j84J1J76j81K94k1j29J39j05
4068C6L30j93k10J04L4j82J4k6N9J54j17L44k33N9j27m9p8lO8J9j62J46J18j63
4092e8m0o1J46O4R0j78j2R2l7l32N27j11j67J26N6P2k37K36j94Q7p6O1lj89J47
4117IJ98o09N98k19j16J49K4q6J76l60M01j62j46j3J17K64l8k20O9r6lJ97k93
4140a59M5K00k40L57J4m88M52Jk95j1PM7j56K85J05m76L21j31J16j9J60l77J78
$$ y = [119, -22, 157, 25, 221, 133, 174, 72, -143, -203, 104, 120, 25, 88, 183, -66, -2, -135, 53, -252, -175, 151, 257, -95, -135, 126, 100, 33, -11, -195, -83, 252, -140, 158, -149, 72, 115, -76, -55, 32, -27, 98, 94, 166, -9, -80, 11, 12, 37, 116, -17, 87, -143, 11, -60, -151, 133, 295, -128, -46, -56, -469, 121, 180, -15, 147, -9, -39, 104, -160, 233, 34, -226, 143, 142, -146, 301, -65, -36, -7, -268, -115, 71, -194, 103, 36, -148, -137, 39, -142, 152, 131, 2, 141, 36, 366, 173, -37, 67, 101, -81, -67, -93, -34, 120, 3, 347, 114, 173, 46, -3, -81, -84, -16, 3, -159, -13, 105, -58, -98, -159, -13, 51, 141, -37, -49, 43, 6, -326, 201, 90, -77, 49, 105, 177, -60, 176, -18, 69, -7, 54, 51, -138, 9, 207, -402, 196, -23, -139, 10, 34, -52, 124, -236, 165, 3, -143, -156, -39, 225, 187, -33, 36, -60, -63, 134, -159, -114, 86, -154, 203, 217, -271, 181, 182, -113, -124, -117, -70, -226, 59, 164, -312, 9, -122, -6, -25, 135, -242, -64]
4163f4J87nN1k68J16L1k17M64j43o4j36L2j66L00r1k4m6J33r4J27m17M67j65m2
4187c4j7L25j40rq5P0r6N6O8K6J1k99q2L20j37k18K37P7q1l1j63K51j13J62n4
4212D4J59k59J56r0q1J60m00L87r7q2M2J46Q4l83K67n4mq5J47j80M07o5j48p3
4236bp0J23k44L62k1p5k43K49p3p7K74l32R4J57m1K18k46O2k14L9n7N0Q6J33j10
4261D2j02K17k29n6J25k88L20p1J40k28O3J33J29k33L6m0j60N58m47J69l3j60
4283a15n0R2K83l7p5j1J12k86k2J96o7m5j26nJ79Rp6J11p2N4j31K53J05n28Q9
4308a63K56o8J33J54n23M04l98J79q0J84r4k08J50j70P9L18j05L0q0r8m3M10j55
4331A12J38k34k18K11N0l50L79J87m09K08k27K6jNL45O3l77J10p7L3L2M9j0M1
$$ y = [-64, 123, 118, 169, -99, 17, 48, -169, 295, 152, 88, -48, -16, -182, 118, 27, 3, -43, 90, -4, 123, -294, 173, 8, -34, -51, 274, 134, 125, 40, 110, 14, 70, 138, 164, 175, -124, -206, 114, -23, -241, -4, 73, -8, -39, -202, 49, -64, 98, 44, 203, -56, 100, 10, -71, 89, -311, 76, -21, -103, -61, 85, 169, -214, 53, -1, -5, -90, 57, -123, 284, 219, 71, -2, -72, 51, -193, 169, 148, 73, -170, 79, 6, -71, 203, -129, -35, 122, 81, 299, 53, 115, -99, -60, -117, -67, 19, 152, 42, -60, 157, -72, -128, -3, -291, 29, -42, 98, -130, -67, 66, 195, -38, -2, -42, -202, 356, -91, 78, 45, -115, -165, -73, 210, 173, 98, 87, 199, -87, -109, 87, 20, -25, -151, -156, 23, 32, -44, 67, -5, 49, -82, 171, 276, -252, -163, 93, 25, 158, 312, -211, 193, -205, -26, -106, 78, -16, -224, -74, -244, -165, 153, 48, 78, -2, -100, -143, 267, 112, 250, 16, -202, 9, 59, -291, 88, 275, -134, 74, -153, -127, -128, -123, 222, 285, -92, 18, -59, -26, 6, 55, 45, 86]
4355H6K7N7n1J91k43k73L45j58R0j49J88n66M85J41j94K02k24J3k02P5J14o8K18
4378A04q6j57K97K8j35n9j20L03j32j1J95j30l67K11J24j52M7O6K45l02Nk1J56
4401A09j23j76J42jk8J60K5l0pK5J13Kn6M8k61J52N3j61j97K94k03O3p6J96j00
4426c7K54l23K77J71l36%q4K83kj27k83J68P3j79J05M3Q4l39j23O28m45J15J79
4449A02l25J00L13j20m45L73Q4j75J27q5Q1p3J28j03N6R6j87O1K79l68L8p9J92
4472G0L1J5n8Lr1R3M8m41M46l5l37K74J77j10j75k44M61j13J4K0l19M03k53J95
4496G4j03J93m85J26J86j84Q5J2L57r8k62Q2j2l6K46k04R9k18M22j96J96j31j
4519A48l2r5p2j28O8K22p6m9j18J74mj6k37J89j05J72j46m5N5p9r7K07k32J94
$$ y = [86, 113, 170, 119, 310, 67, -206, 139, -19, 71, -78, 110, -456, 29, 170, -24, 178, -46, -33, -235, -160, -46, -114, 104, 18, -139, 158, 186, 51, -8, -128, 175, 43, 32, 227, 97, -270, -59, 65, -87, -40, 26, 271, -31, -26, -47, 109, -14, -190, -48, -49, -77, 83, 108, 78, 71, 96, 209, 211, 155, 203, -58, 94, 147, -14, -211, 83, -120, -57, -133, 63, -37, 217, -106, 171, 342, 6, 6, -78, 205, 203, 76, -207, -39, 34, -145, -40, 3, 87, -252, -375, 253, -192, -77, 102, -223, -123, 190, 70, -375, -2, 82, -93, 34, -51, 30, -43, 85, -18, 38, 134, -53, 8, 287, -81, -43, -122, 70, 101, 116, 58, 61, -30, 63, 111, -330, 116, 81, -256, 18, 195, 85, -90, -334, 127, 14, 28, 48, -271, 132, -121, 74, -29, 164, -321, -195, -9, -193, -108, -96, 261, 163, -99, -17, -29, -65, 181, -23, 76, -142, 280, 84, 280, 149, 148, 116, 21, -51, -179, -111, 111, 35, -14, -132, 42, 38, 22, -215, -26, -131, 41, -105, -150, -95, -174, -271, -64, -296, -102]
4543a02J28k76K40K64l46j13KJ17MQ4J59m5q7N2n6k81K96k56L28j18p0O7J06M
4567A01L6r9p5m1M25m72r7L92k44O3Q7k74J42L95m91K27j3n4Ok22R5L93n28J72
4591g6K17j63J89k55J45n1N3M4L1l69K15K19l31K66j16J05l53J01K30J7j27J03
4613I4L2j36J66n57N38j29K65J8k54p7J46j78j08J62j91L71k99N8J31j68Q0rl31
4636c76O28m18K25n6k4M7j32K7Q4j86J73J13K03r4k83J71o7j62K23k69K39o3m6
4659d3L4k16K97r8O7mj68J14M4l16L28n8M2M0k06K92j47r2J19P5J9j04q4K29j85
4684b1J33n8Nj5l79K03rK73l62L60k75K85j67j89L65k89k2J98j90K90ol63L91
4707A58r7k56M15j72o6N6j1J04j63m2J82J15j2k59R1Pk33J77K23k86P9m6nj56
$$ y = [-102, 26, -250, -10, 254, -92, -205, -203, -86, -82, 2, 161, 116, 29, 81, 25, -256, 40, -216, 112, -6, -76, -9, 97, 101, 137, 38, -37, -78, 347, -125, -222, 170, -74, -11, 76, -198, -56, 339, -152, 75, 62, 8, 14, -208, -113, 280, -248, -76, 141, -22, 167, -88, 57, 6, 59, 103, 134, -235, -20, 199, -132, 134, 18, 123, -230, -129, 101, 118, -9, 94, 126, -10, 156, -401, 137, 8, 273, 291, 37, -40, 106, -72, -180, -18, -209, 162, -137, -79, 52, -116, -36, -45, -376, 252, -166, 59, 3, -21, 26, -106, -79, 5, -181, -8, 105, 308, 214, -69, 102, 35, -127, 96, -173, 66, 3, -43, -9, -225, 72, -26, 41, 37, -131, -17, 27, -289, 39, -19, 23, 63, -143, 149, 2, -90, 29, 104, 123, 19, -65, 164, -21, 112, 54, 59, 44, -335, -132, -141, 132, -230, 130, -145, 140, -27, -216, 149, -140, -162, 36, -154, 136, 130, -233, 158, 61, -195, 220, 48, -18, 38, 27, 131, -32, -74, 108, 223, 211, -48, 43, 50, -183, -6, 217, -69, 10, -36, -41, -197]
4731a97N5J40J96l64J24K02k00L8j2q7q4J85m5J45k9J49m13J4K19j93L09k01k08
4754b57M86j29mk00QJ31j71K70k50J16k85K29K05pj17rp0j20J71j24J58m3J89
4777A77j86R2Q0k68K03P3j73J60k63Q9O9J62l95L41l65L23j45K35k33m6j75O1
4799a84n3o6K28j19L81j6J34k04R5j65K54k11q6j93J70Or9J20n0J94j44j84K58
4822F6j41j23J43j70K57l2J03k60l7L7J87j73J37n5R8p5L3N7j26N2L6j1L6j17
4846g8M3K24l42K04j08J64K14p29K76K74j73r7J50O5q9j15L09k58J39J18r5l25
4868b29K13k57J53K45l04j13M97q2J13j42k92M78k24J39k37l2m0K67p7%k11L21
4890A86k07n4P1J83p8K78j62k72O9J55l22M54l21k55K30J11n5k52L78j67k43K07
$$ y = [-197, -142, -2, 194, -170, -46, 156, -44, -6, -18, -105, -189, -4, -49, 96, 67, 216, -197, -183, 36, -157, 152, -49, -257, 229, 100, 96, -104, -96, 35, -136, 134, -116, 0, -285, -56, 149, 142, 25, 16, -54, -174, -3, -127, 31, -12, 177, -9, 83, 163, -105, 98, 171, -2, 158, -105, -16, 53, 215, -180, 161, -204, 119, -26, 209, -24, -70, -245, -184, -237, -303, -75, -194, 187, 171, 305, 101, 196, 31, 285, 74, -12, -205, -35, -29, -128, -8, -58, 136, -8, -192, 66, -75, -198, -55, -225, 32, 0, 103, -157, -194, -157, 30, -143, -6, -61, 37, -38, -5, 52, -74, -22, 14, 3, 39, -78, -35, 189, -153, 51, -57, 107, 321, -408, -132, 142, -31, -128, 22, 87, -2, -117, 192, -66, 73, 191, 96, -229, -16, -273, -120, 125, -179, -292, 205, 123, 236, 94, -198, 280, 56, 195, -42, -74, -114, 153, 76, 76, -135, 186, -21, -75, -4, 179, 101, 379, 217, -55, 14, 169, -153, 301, -20, -275, -45, 66, 11, -241, 137, -30, -273, -66]
4912f6K40%r0j98J47q2j22N13j68l5k43J49kj15J67n3J56l31L8R7O0l2K31n98
4936c37M47j0j73M27m72R9K97m58J61J17Q8l08M00k08k34J59J07j55J19j19K05
4957A52j44R0l50J32n5J10K43l17K54o9J0j12K64L9j94k7k3j04J5Q0J56k83L25
4980A92m37M37J8k97K7j57L56j02r9K63k90L6k35L15k16J02J41J14k57Nj05L0
5002a59J67K57l66J46M5n10O25l90P8K80k36J37n7j32L22k07l39L06M7k96M16
5023A34j30k09L21j50j27k1M23j12O4k15oN7j83K30O1r7l83N38O0n5k75J28L18
5046C71k66k69K6J22j31J35k94K32J59j28J25n1r6r2K22k07K08j76j71L16m8K46
5068B33k20J7j06P7J01k73K0K09l97N49O1n04L06J03j99n4J07J20l69J74J77m
$$ y = [-66, 174, 174, 84, -114, 33, -49, -171, 342, 174, 139, -104, 45, 43, -72, 95, 42, 198, -133, -95, 2, 62, 30, 261, -337, 110, 100, -73, 354, -118, -19, 278, -180, -19, 98, 186, -122, 278, 70, -164, -5, 102, -53, 66, -53, 152, 8, 98, -252, -120, -175, -65, 178, -139, 115, 46, 56, -56, 208, 247, 53, 26, 3, -101, -86, -6, 150, -133, 192, -245, 192, 210, -87, -60, -217, 139, 37, -62, 201, -89, -53, -288, 27, -189, -87, 54, 168, -89, -84, -189, -159, 8, 265, -101, 45, 90, -420, 205, -185, -107, 173, -63, 74, 17, -115, 207, 0, -339, -33, 14, -282, 134, 4, -205, 116, -34, -161, -182, 241, 129, 193, -22, -28, 29, -154, 76, 137, 40, -343, 195, 255, 200, -75, 53, 371, 105, -164, -138, -16, -147, -12, -306, -74, 85, -43, 82, 31, -65, -157, 65, -142, 66, -110, -281, 35, -13, 233, 13, 30, -76, 1, 102, -171, -151, 58, -339, 210, 271, -233, 73, 176, -23, -77, 30, 150, -219, -45, 132, 128]
5090A28K0o9o7o6j32K88K6P6j77j57J71j18QM3jj96K98Om45N97k54J15j08L13
5114B99r5j81OJ42m53K70J53l05J34j04L4J68K40o69L63J81l66J02j75L50j37
5135d3J74k86q1J77O1J42j98J29J53j20J0j74R0q7Q2k94l9K60K1J55k20K3L1K
5159c2O3K61m87K20J9j0n3l5k9J07R1o7L9K6l5k75J67L6p4J68l58L65m13M13J26
5184B33n5k14q5L08l33J87k91J28J14L5o1K53j26l35L42m9j90K82K9j7m8l9j0
5207E8o1k7j0K30m42J25m1L69k44NRQ8Jj61J23j27O9qL98m44P5K00L5j70M1k8
5233F3j60K9J41j81J23M9N6j17J04k03K07j98J52k0n1L6l00K20r9L30j36k03J69
5256A1k8k25K91k00j03K11J81j80K4QQ6k35l2J33j7R8K5Jj15J04J28j85j8J13
$$ y = [128, 148, 79, 12, -54, -186, 102, 128, 204, 27, -130, 41, -77, -69, -26, -27, -223, 75, 81, -364, 233, -21, 94, -14, 299, 204, 23, 29, 171, -282, -12, 141, -164, -30, -134, -100, 68, 308, -361, 2, 183, -183, -81, -256, 94, -43, 131, -155, -236, -59, 2, 144, -54, 75, 228, 108, 118, -56, 34, -53, 29, -265, -304, -44, -23, 132, -88, -65, -34, -32, 31, 292, -195, 25, 44, 34, -19, -54, -83, 24, 115, 48, 87, 113, 78, -197, -30, 6, -68, 100, -258, 107, -306, 107, 233, 178, -36, -121, 187, -146, 41, -250, -122, -8, 27, -34, 219, 93, -242, 100, 51, -139, 143, 172, 155, 107, 68, 58, -3, -30, -40, 190, -252, -127, -168, 201, -43, -38, -29, 59, 60, -101, 22, -105, -36, -44, 354, -90, -15, 185, 220, 50, 91, 63, -97, -68, 73, -108, 15, 64, 120, 3, 107, -96, 111, -87, 65, 45, -6, 30, -270, -50, -149, 181, 45, -158, 11, -17, -242, 49, -151, -254, -43, 138, -42, -18, -10, 76, -159, -191, -58, -75, 23, 48, 49, -66, 38, 166, -19, -37, 76]
5280G6K04l34J0J6RO0m4j26j4K74m17L02j98K17j17j2K34k5N2k95J34l2Q6n1J15
5305A24M2k14l3n9K56m00J51K38l22L45k40J96J59j03j06L36k20j55j32J72L63
5326C98k28k47k3K65k81J90k33J27L6l4j1M5J22m5o2j47J79p9J2j0o7k37L08k0
5350d2K03j04m5K72k50k18K90O3j05j30L47k37l05M73j57J79k24O8O2k35J33l06
5372b68K36J35q1J93j61k5J20l53M52j02j47j72K0J8N1L18j72q0J25k90J59R0
5394F6mj49J21P6k53J6J09L15l43L3q4j00K27K42l30J65J19K1j85k84J54o7pJ36
5418fm3j21J94k55K64N3j30R6pk28K17j3N0j93RJ33N8j43K30K32m82L20n05L71
5442A01j0P9K6k4m16L18j22o5L36k13r0P8J66jn6K0N7m58L56J97k64j95L35j6
$$ y = [76, 280, -54, -44, -28, -19, 41, -3, -129, -143, 131, -286, 16, -182, 35, -82, -94, 140, 115, 167, -128, 6, -26, 60, 9, 124, 166, -48, -81, -140, 116, -284, -133, 105, -217, 128, -112, 84, 243, 140, 34, 370, 150, -5, -137, 35, 398, 170, -77, -100, 165, -116, 74, -159, -32, 4, -30, -41, 4, 126, 81, 19, -128, 51, -28, -16, -26, -93, -330, -22, -42, 161, 57, 12, 284, 34, -184, 106, 169, 64, -66, 281, 44, -261, 212, 55, 234, 10, 78, 140, -95, 38, -268, -32, 103, 22, 215, 54, 29, 149, -204, 248, 146, -1, -173, -153, -135, -84, 234, 62, -18, 107, -183, -24, 66, 62, -87, 34, 110, -143, -127, -18, 297, -46, -13, -97, -197, 30, 272, -58, 107, 226, 247, 62, -222, -68, -135, -142, -6, -49, -170, 24, -231, 33, 86, -44, 52, 45, -183, 34, 21, 71, -122, -113, 20, 78, -65, 165, 397, -85, 235, -270, 101, 91, 170, 196, 172, -244, 74, -48, -113, 223, 10, -80, -2, 164, 163, 107, 127, 184, -274, 82, 279, 15, -180, 155, 139]
5466A39k20J50j96J23j33N7Q2k42J40j53L51oQ4j96p5J06j04N9j98P6MJ53L62
5489C63l45Om5J90k03J46j48p5m5m2K01j07K84k23L0k38m0K76l6N2L1K1j05j87
5513b39K94Q3m0j09qj16j17J69R5L0k03K36O3l5k33M32l62j9J85J29m0k43K17
5536A69k47O0q1L16j73r6K70j63Rr7J23k3lk11K01l40K27N2q5k6K05l4k04M5J12
5561FN1k19L92j34k66L36j05k2r9j22R6J95n29O40P3n9k60o9O0k12R7kK23j44
5585g3J07O5j34j04K7q3J32J40K71l83Q0k40J78m7K0Mn0K05k44K7L8J49k43K13
5609E5L5j88K1J13K3j18J29J01M6j91R0k65K47k7k00J63j89O7J5LJ12o2p7PL7
5634e3j1q7J3o2K52k43P5L39l88K30K11l12k7L32m35K51j39RK44j77R6j22N4j32
$$ y = [139, -81, 69, -127, -4, -137, -80, 2, -240, -100, -253, 98, 92, 176, -20, -95, 11, -93, -34, -232, -156, -152, 1, 363, 18, 24, -21, 169, -34, 112, -36, -111, -156, -198, 3, -104, 180, -43, -13, -251, -291, -15, -51, 1, 32, 53, -52, -239, 55, 138, 98, -11, -19, -135, -252, -83, 12, 42, -161, 75, 138, 103, -130, 302, -60, -79, 106, 235, 195, -48, 169, -78, -18, -99, 217, 44, -52, 218, 55, 64, -33, 90, 67, 64, -147, 54, -286, -59, -7, -92, -118, 87, 53, -151, -106, 6, 57, -162, 230, 96, -170, 166, 61, 39, -60, -182, -86, 109, -420, 220, 293, 234, -26, -95, -35, -247, -150, -152, 71, -73, 34, 99, -35, -139, -112, -195, -63, 77, 348, -35, 45, -195, -17, -64, -44, -40, -90, 115, -129, -102, -64, 85, -158, 55, 90, -98, -77, 36, 59, -59, 70, 171, 217, 26, 116, -149, 98, 71, -129, 34, -155, -88, -73, -70, 42, -20, -97, -90, -53, -64, -151, -138, -200, 52, -191, -116, 223, -165, 65, 276, -36, -63, 269, -166, 85, -54, -45, 199, 22, 118, -4, 50, -82]
5658h2J60r4K8p5J8K7J15j25P8j33Q6K3k13L39k23k09M72k82K77J9k09k2m2n1
5682a18L3K50j64N0j42R1n6j41K61j68J11j15j36N5M10k39K04k50R5p4n7K55j14
5705D1r6J02Q0k20k94L24J95r4k35L90k28l8J33k08L01j26o6k0q4R1l3q3J66J45
5729A43l6j10J23j76J15j88J88m5j39J68q4M03l51k5j04M35m38J42j42J48K9K42
5751B98k71j61J92j53J20Q8j2Q8k52K18k15J88j97N7J04nm9L6k05K93m12p1N34
5774B13l28O1N0K96j63q5Q7j59J02k75L02j74m0J12O2K36k18q2q2L41j92J09o
5797A67k85J98k38L13J55m27Q0j3k6J68j43L8J34k27K5J11r6K41m1r9m7K08k19
5820b3j24K55k78K39r7j92L04j97J30l5n6j12J61o3j46J09J45P8n6J10k36J17
$$ y = [-82, 78, -16, 12, -63, -45, -18, 97, -28, 50, -83, 3, 26, -187, 152, -71, -280, 192, -90, 187, 206, -3, -25, -67, -118, -85, 165, 1, 51, -91, 0, -56, -197, 64, -104, 7, -108, -244, -189, 221, -18, 186, -64, 31, -43, -100, 155, 41, -55, 47, 127, -93, -387, -63, 132, 38, -197, 193, -35, -73, 60, -148, 153, 27, -39, -59, -143, -52, -85, -168, -2, 143, 107, -3, 120, -56, 59, -129, 59, 14, -125, 43, -41, 362, 11, -14, -118, 317, -121, 21, -121, 27, 56, 298, 27, -134, 58, -95, 25, 113, 101, 189, -63, 155, -60, 128, -69, -12, 92, 87, 38, 74, -131, 162, -250, -321, 213, -115, -54, -4, 292, 129, 44, 131, -28, 74, -201, 101, -73, -113, -1, 61, 297, 79, -3, -85, 256, 64, 173, 167, -118, 80, -158, 155, 310, -117, -37, -50, -76, 92, -51, -13, 121, -106, -81, 30, -66, 175, 134, 35, -12, 196, -23, -147, 108, -170, 69, -28, -220, 84, -113, 17, -18, -74, -186, -25, -88, -234, -125, 20, 98, 42, 152, -84, 33]
5842C3k3k18J63j5r6K95j13K13l14K18j16r2R0q9N3J36j43p9K01k61j1R0l4J78
5866F6J10j09j87j33K35K9N0J01k14n3P8O1J01j65J3Q0J4j35J67m3J9j37M5J6
5890IO9nN6l20J19J1Q8k3J12k46K99j96L8p1j78J36p4M07l86r6K05k76L49J45
5914A72Ml43K33n4l77O02k63K2j8K16k97L52l76J87j03r2K70k9M6ok43R7l1lJ05
5939G1j83J56j42k41L65K11j91j3j97J24K99k42nr2K9R6j13m4J23q1j39J90l73
5962c92L41l4L8K12o3p5rj53L29j64j08J53j17N5n0m8K14m1J09k17q9J13K03k39
5986c2k6N3M1k67J14L6L47k45%O3k99Qr0M39l10J00m4N4K43J9j77lp2J96j77J5
6012a4J36r4j33O2N5j12Q6Kp7J28m0n4L2j48K03k79K06R2k47K73m57J48K65r3
$$ y = [33, 10, -208, -45, -60, -156, 139, 26, 239, -75, 143, 27, -65, 25, -64, -11, 125, -18, -97, 104, -157, -168, -78, -112, 66, 176, 67, -120, -253, -18, 11, 61, 162, -52, -105, -27, 34, 135, -30, -17, 63, 77, -58, 109, 66, 85, -52, -7, 9, 78, 73, 129, -191, -72, -61, 27, 4, 116, -130, 169, -27, 11, -60, -238, -102, -176, 231, -155, -251, -46, -322, 27, 172, 176, -167, 66, 12, -365, 237, -26, -4, -22, 194, -103, 249, -127, 60, -43, -135, 135, 106, 152, 146, -97, 0, -31, -34, 71, -112, 44, -98, -339, 26, 237, 46, 33, -164, -40, 259, 17, 12, -80, -51, 45, -68, -112, 11, -70, -209, -19, -392, -51, -85, -47, 165, 102, 27, 18, -135, 194, 30, -78, 75, -42, 13, -37, -85, 129, 88, 197, -20, -109, 4, 207, -32, -58, -5, 36, -231, -117, -81, 266, 21, 21, 84, -215, -207, -297, 142, -168, -68, -112, -58, 185, 204, 27, 24, -48, 148, -29, -14, 122, 28, -105, -43, 12, -100, -14, -12, -89, 39, -1, -55, -23, -171, 32, -247, -41, 51, -196, 77, -380, -232, 33, -60]
6036f0K24k70J01j62M29k18Q4N8l00r0L27k76K67m34R7J07K07k09j7L07l5k96
6058a59K84k40o7N3k1J11o2N2K12k98j5K58l41J03N4J60k01K46j64J03Nn9n4R9
6082E9j22J37l1k10lQ7K8j9J27p8M0J27j57k40J91N0K73j60K10l46J17j21K59
6105B18k00J09j04m45N58j52j5P2J2r8J17k47K98nl12K42K2K20J1j72l43Q3j62
6128b93M77j26j15J8K6J36j42K1J09P0k56J04Q2l03M73l21N7q1j12J69M4J55m8
6151A44k84Q1j54L70k02J49j8q0L25l95J19q0j40J26K1K23j55kJ5m6j44K95l0
6174A38j1j15K99l03l63K77K19r7q1kk02J93J67N9Pm93L63J57k56P1%j14J93q2
6198B4j48K29k0k87K75m7m18O76m99QK12k1jk18M06m5o6J18k21j6K90j81J29j55
$$ y = [-60, 164, -106, -5, -167, 262, 44, 128, 186, -114, -204, 123, -153, 114, -320, -223, -116, 91, -118, -135, 172, 137, -159, 125, -115, -182, -129, -150, -39, -101, -49, 163, -135, -150, 108, -233, -130, -76, 84, -117, 129, -35, 68, 73, 14, -40, 59, -63, 74, 43, -167, -170, -83, -55, -74, 53, -25, 15, 142, -15, -255, -64, -14, 259, 99, 309, -37, 80, -41, 218, 18, 127, 23, -422, 136, -16, -31, 41, 53, -45, 72, -175, 123, 118, -194, 48, 70, 290, 301, 129, -214, -131, -293, 184, 58, -57, -39, -13, 123, -19, 2, 111, 181, -75, 29, 111, -192, 281, -40, 17, -64, -176, -7, 37, 192, 144, -140, -59, -213, 157, -45, 104, 86, 6, 331, -64, 55, -25, -165, -39, -18, 205, 50, 48, 63, 17, -127, 168, 138, 127, 12, 311, 8, -355, -78, 141, 44, -37, -39, -241, -48, 119, 178, 185, -308, 55, 212, -44, 27, 27, -87, 106, 24, -124, 105, 85, -202, 73, 26, -392, 284, -215, -207, 5, -16, -17, -235, 171, 126, 60, 178, -43, -59, 231, 50, 179, 24]
6222B4J07j19K4j85l5R7P1J56k3j31Q7P8j58J47j92p4M1N3k4q9J85o9K26l15N
6247a13R8j46L22m18J85J55J66k43k69K00lQ5K09k23m0J3p5L79m64K25J7P5k9
6270A06n2k9j03J43j86J85p2J0j88J15J47j89O5k01J28J12k52K61J51j98m0J59
6292G2j08P5k12L27j7j85R4q9j72K86j49P6K4K32l40R6J50j68J8l0k50M20k95
6315a45k0K90k34K45k46L72j17m08L16J19p8k52J44n3P5j11q4J45N1n0l8J37J64
6338B22j29l64P6K08J25J12p8l88N20l84J4Q0PJ06k59K36r0J26k02N9K51r9m8
6361A01o9J26K0k41P8m4J39j08k83L83j31n6JJ28j42J13j96m2J94O4k22K69k71
6384a89OJ23n4M45m42J9JL27n38M21q2M8k26n7j95J81L95j39Pj23J20n8j78Q7
$$ y = [24, 131, 12, 36, -149, -184, -87, -16, 140, 117, -14, 73, 151, -7, 140, -52, -126, -85, -32, -56, -145, 40, -29, 197, -118, -113, -15, -161, 161, -257, -72, 83, 249, 6, -263, -63, -66, 19, 228, 5, -35, -22, -97, 282, -182, 43, 60, 135, 106, 54, 25, -78, 65, -121, 64, -8, 2, -186, -71, 76, -113, -48, -249, -121, -9, -261, 0, 151, -47, -87, 72, -36, 39, -173, 154, 137, -48, 46, -43, -215, 71, -78, -2, 22, 254, -86, 10, 160, -8, 10, -20, -270, 150, -145, -165, 125, -109, 136, -110, 262, 145, -263, 53, 172, 94, -158, -14, -67, 8, -103, -187, -42, 9, -41, -79, 58, 222, 93, -271, -195, 13, 138, 250, 172, -216, 304, -80, -66, 14, 21, 127, -132, 104, 14, 140, -62, -3, 248, 149, 101, 32, 158, 178, -63, 15, -29, 110, 2, -281, 102, -29, -85, -84, 44, -98, 15, -181, -223, -29, 35, -187, 82, -189, -183, -60, -114, 331, -111, -92, -91, 236, -302, 119, 37, 85, -141, -198, -393, -212, 183, 44, 51, -72, 48, -10, -188, -101]
6408a01J57J49l32M7m4l2L22q4j72K3J6j15M00l83J12J46p9j31J74J31k40L25
6430B89k85L2J55k78m4K90q4J54k26k4l9J68j95P3jK5mJ05P5l36K13m2q1m6O8
6455c8L13k24OQ9l20J17L4L42K1l81l2R1J9L4L3j51N8J81op0r1k25K68j47L1j13
6481a61m1K57j99K37j32O1j51M9J36O1n5J63Oj96Jj47j33N02l73K74j24K57l63
6504g1K47l17J08J15l3j51L73k88N2R8j38K51k17M6q8j81J20N4k1K00j23j8r8
6527h0K72j93R5j94M5Q3N8j58Q2K11j99M3k80J51o0J85j6O0N8j99J25p9J44j65
6551a1j26J70q1R0P5j19J36o6j63R7J78l29K78j52J70J9l17P3J33J28l64L51j86
6574a6k17K06RJ81k63n3K68l51M16k4k37K5K07k77L52k51J7m2K9o9k19L34J1J42
$$ y = [-101, 56, 205, -127, -80, -124, -156, 166, 82, -90, -67, -51, -166, 234, -149, -37, 109, 30, -101, 73, 204, -36, 289, 4, 36, 191, -87, -131, 159, 75, 229, 3, -21, -60, 108, -87, -14, -15, 10, 6, 111, 186, -150, 63, 21, -60, -106, -38, 275, 51, 57, 146, -174, -57, -23, 319, 340, -41, -73, 18, 37, 71, 104, -47, 11, 192, 186, 116, 25, -200, 68, -79, -48, -161, -202, 55, -144, 93, -39, 22, -129, -80, 56, 117, 62, 225, 231, 35, 36, -111, -244, 258, -115, 159, 35, 292, -71, 176, -141, -33, 82, 49, -102, 271, -17, 35, 133, -5, 246, 29, 75, -13, -194, -74, -20, -41, 159, 36, 18, -80, 192, -1, 94, -100, -55, 28, 86, -72, 10, 221, 22, 65, -215, -64, -124, 61, 45, 105, 163, -36, 89, 10, 154, -11, -137, 33, -48, 42, 117, -2, 134, 68, -95, 2, 180, -149, 129, -23, 147, 166, -151, -78, 55, 183, -181, 170, -16, -233, -27, -18, 163, -100, -153, 115, -236, 180, 156, -81, -56, 151, -126, 226, -25, -8, -50, -21, -90, -309, 25, 36, 178]
6598A78l89K05r8L2p0O8J1l8P3r7K3K26R7j84J3q7N3K3M6J71k43O4j27L09k83
6623b4j32L01k28J48p9P7r6q3J61R6n3m0J1k42j8L27l16O1J25k22J94J91N3j58
6647E4k12K25J9J8j66R9j51J07J40j71l2j36K39j65J91r5Q5J37k82K33k60J10
6669a3j78J65K82l76K14k00K82r2R4O2k95M3l64N58j05k38L12o2j76K43m5l13
6691b02J54l01L19l4P4j2P2k6J27r7R4k38M18n22J23R0K01j08k10J69l49K07J67
6714A16mk94L31K05l40J37rk71K7L41J09k27k80RJ07Q4j38K78k10o9J13P8k0j84
6738a11J45K8j00O8r9o5K54j18J22j23L1N2j57k7K92k89k3L64l35j00K33N7O9
6761A68k33J95p3J3k15o5L04k77P4Q2O1k24L3K71J60l12J51o8j90K10R8j22M2
$$ y = [178, -211, -6, -104, -72, -142, -74, -63, -101, -28, -125, -102, 124, 221, 37, 50, -37, 16, 39, 85, 256, 13, 77, -50, 259, -24, -156, 145, -83, 65, -14, 63, -33, -116, 45, 141, 88, 48, 59, -183, -201, 126, -190, -129, -4, -226, -32, 159, 212, 54, -158, 67, 86, 104, -62, 37, -114, -7, 133, -38, -70, -206, 33, -132, 59, -36, 49, 186, -96, 137, -123, -13, -191, -26, 256, -120, 94, -106, 176, 84, 178, 240, -55, -12, -376, 182, 77, -161, 151, 89, -87, 156, 111, -202, -48, -349, -30, -64, 10, -2, 70, 44, 171, 74, 168, -70, 348, -174, -51, 39, 240, 132, -78, 91, -258, -51, 116, 112, -182, 149, 354, 14, 151, 142, -129, -102, 239, 348, 121, -159, -150, -43, 41, -97, 181, -29, -98, 15, 93, 73, -111, 34, 62, -38, 30, -69, -134, 120, 2, 124, 1, 32, 84, -73, -100, 192, -97, -120, 244, -91, -191, 42, 99, 168, -65, 130, 57, 70, -145, -210, 94, -183, -109, -27, 34, -190, -157, 114, 274, -38, 113, 45, -145, 65, 163, 41, 83]
6784H3j1l73K76N3k8m1j33J85j67K9N3K61j80K18j81J46m62L20J33j85k44L22
6806G4l9p3J90j33%Q4M8p0k56P5J64lJ99k12L9j38L35J9l51j34K55q7k37L76j40
6831a5j93J81J26M1j65p8M4R8p1j51M6K00j78J07L8J48N6l92Q4p0L42l99M27j18
6855A08N2l3k43M91l34o8Q4Q7Ok38N2p7J06Pp6J99k89k0K31m24M25L3J72m25J70
6880dk06R6J10j76J60R5l1m6O5o0j2j94O2K88k10j29K24j80mM15l43J23j96K45
6904I2q4k70L08q1J52j93o8P8J18r7Q2J97l02J28OK5j24K63j11j59R7r1P7O2n88
6929d83M45p9O5K37r4k9k36L36k86J20K40p6q3j11P0K04j59J6m45M44l1p1r4R7
6953cK7j29J63K6j38R4Q2j36j44J30j98K54k95K78j80J67L5r2K0K33k63m1J65
$$ y = [83, 72, -301, -25, 28, 0, -41, -174, 11, -156, -127, -74, 187, 7, 225, 44, 190, -272, 48, 181, -4, -248, 74, 35, -38, 152, 19, 19, 103, 151, 81, -175, -100, 64, 61, 260, 48, 87, -51, 284, 303, -48, -182, 73, -14, -251, 125, -15, -208, -27, 99, 140, -25, -103, -59, 39, -32, -183, -137, 63, -115, -8, 30, 178, 234, -158, -74, -144, 198, -201, 226, 108, 160, 127, -116, 375, 41, -27, 57, 144, 150, -88, -36, -113, -7, 0, -76, 123, -166, -186, 45, -379, 46, 79, 251, -174, -4, -210, -114, -4, -180, -20, 75, 44, -2, 63, 3, -9, -203, -141, 147, -63, -192, 32, -148, -152, 263, -80, 43, -153, 92, 8, -262, 46, -35, 117, -76, -144, -66, 52, -45, 37, 234, -68, 60, 66, 91, -33, 230, 119, -40, 57, -34, 43, 105, -483, -38, -117, -52, 185, 91, 62, -174, 162, -124, -4, 236, 160, 77, -34, 36, 240, 81, 97, -348, 96, 65, -6, -100, -3, 24, -105, 58, 84, -54, 40, 122, -14, -158, -28, -226, 28, -267, 11, -169, -2, 33, -59, -39, 194, -69, -110, 55]
6976E5l9Q2l27L43j98K26m04Q9K94m0J22k13O5j28J29j05O8M7j92J43R1j22j8
6999c2K37j79k2O4j05j96L62L3j77j25K92j50Jj00J52j61k2L7j54L87j4j20j0
7022bm4K29k87l6J70K31L3m08K24j49l8J16O9j92K9n9k3KM54m11Q7n2J24l8r3
7047f4l4L03j27r3k46J18L8N5n0R0K49M7l60r0L1L0J6O8L4j6j63j65K34J36l6
7072EO2n1j72L31j14N2j28j17O4k4j90K15j2J17j30N1K38l68r0Q6K65o3p8k5r2
7097a68M59k86L1n1j48J4P4J83o0p1R2k00J70l02K02J07L1k03O5J31j51R7m5o
7121c5L1P5j44mJ14J29j10L5j94k88M08l4Oj7K4mK4J46k40J44m8k28J02J18J6
7146B6%J7p4n5L7j26J10J6J07r0J69M4k7lj86L3K53l44J86P1k75q8K34J4q6q4
$$ y = [55, 16, 98, -229, 114, -84, 142, -262, -173, 121, 81, 203, -10, 55, -73, 56, -49, 19, 66, -126, 17, 108, -14, -32, 205, 26, 4, 68, -37, -233, 129, 162, -15, -140, 152, 2, 3, -97, 55, -106, -128, -91, -245, 142, 128, 8, -2, -46, 183, -104, -140, 30, 261, 294, -114, 110, -39, -77, 39, 108, -84, -55, -114, -137, -135, 319, -92, -5, -57, 67, 29, -64, -98, 205, 78, -15, -261, -143, -105, -50, -100, -10, 239, 286, -74, -164, -133, -103, -87, -19, 15, -1, -164, -329, -95, 41, 5, 67, 16, -156, 175, 61, 113, -15, -132, -68, -92, -282, -67, -79, 38, -92, -41, 197, -171, -261, -175, 90, 27, -51, -76, -168, 291, 5, 36, -15, -163, -149, -75, 108, 48, -23, 69, -131, 39, -263, -61, 46, 77, -126, -61, 70, -81, 16, -29, -35, -4, 71, -73, -77, 37, 166, 56, 91, -103, -391, 17, -17, -11, -28, -4, -8, 16, 162, -78, 66, 18, -210, -108, 10, 26, 26, 43, -31, -86, -49, -175, -65, -49, 58, -32, 137, 181, 154, 151, -35, -2, 251, -93, 93, 164, -111, -199, 35, 49, -37, -121]
7172a21j29J28m2M18j05l31j83L48J55l44K53j41N7K41l13J6K41l58M5J81n7J94
7194A53j41k75J86K94l72L94k98J11j14J32K26l32j65J63N7K93l05l6J33j53J43
7215I4o7k05J59O0K0J63j76Q2J63N0o63K49K69l69J7K77k24K01k24L90l72M35
7237C29k64J41J43j67j10q2p1J59J76l64L7M2R6K2j71K90J01m24L04j85R6j47
7259d9K87j84R0j44J58l71M55m6k75J23R8j97L28m39L76R6k26k31N0J13M2j77
7281a23j22L93k37J67j82J23k40K22J0K64k10p4L31k47R7PQ7r2j71l6R0k57K07
7304GNj65K78r4p9J3j6N7j70L14j47N9o1j63M3l5K50K6k15J0o4O9K36l56J98j24
7330a24M12k70n9P0Kj1J11k72L2J55k36O3K24k36K57l12MK12p3m6J6J35j33J05
$$ y = [-121, -250, -122, -164, 254, 149, -182, -365, -17, 138, -206, 47, -94, -37, 204, -109, -93, 148, -210, -165, 16, -41, 153, 12, -263, -77, 217, -155, 239, -59, 52, -62, 70, 296, -36, -201, -38, 19, 312, 7, -29, 104, -49, 94, 27, -178, -19, 41, 61, 224, 48, 130, 293, 343, -320, -71, 198, -171, -154, 123, -101, 100, -124, 266, -106, 329, 65, 206, 349, 182, 72, -10, -81, 78, 254, -110, -73, -31, 65, 87, -84, 206, 307, -117, 187, 2, 98, -49, 238, 54, 144, 0, 158, -213, 242, 196, -79, 44, 142, -55, 273, -166, 210, 306, 80, -151, -101, 12, 54, -123, -245, 148, -89, 78, -104, 19, -221, 1, 11, 275, 65, -9, 322, 75, 172, 179, 266, 174, 3, -33, 57, -200, 7, 12, -153, 125, 31, -48, -35, -51, 6, -164, 150, 3, 62, 1, -162, -119, -154, 96, 122, -93, -83, -147, -78, 158, -198, 0, -124, 288, 18, -41, 29, 31, 20, 131, -141, -109, 46, -190, -127, 97, -139, 118, -194, -190, 22, -51, -97, -81, 54, -79, 26]
7354B6m5j5L5P2j87M1M0j45j11K56L7Q2q3j11N6K23k00q2QJ22n4J46j01k47J16
7379a21J11l7J05j83J90J07j69ql6M1J70l88M59m39P4j11j5J88r3j76L96j03L27
7402B89k49j9N8j80j0l0J57Mj82K97K7P0l5k56L39k63j47J62J82l41mR5L14k30
7426D8J37j20j01j55J10K7J95q1k88L85l76M16m28Q4K56n3j01J07k9j91J21M1
7448DN4l16M07n8p1J03l67L9J86Q8J27j3j68L3J42k09j00nJ47O7j88Q2o3k0J29
7473C0JR5l03L64j17k38Q0J83j71J62k96J89p5J10n2J79j83L95j97j54K8N9k61
7496a72J82m2j63r4Q0K42m7O7k25J27N9l8p1R5P2k61JL15m1J26j36r5L02j49Q
7521A42k14j1O3j52J04K00o9M5j4J5k72J38K02k64j38N13m76N21k62qJ07j49l9
$$ y = [26, -19, -34, 1, 73, -114, -73, -33, -178, -289, -33, 4, 86, 3, -108, -52, 171, -29, -111, -103, 19, -35, 111, 10, -237, -121, -10, -47, 58, -125, 65, 172, 3, -5, -41, 0, 170, -218, 241, -198, -124, -235, -250, -62, -155, -331, 65, -38, 289, 40, 21, 79, -101, -111, -141, 16, 20, -162, 135, 162, 232, 197, -59, 280, 17, -130, 32, 214, -127, -131, -36, 278, 48, 185, 65, -36, -191, -81, -54, 141, 60, -228, 157, -219, 197, -231, -147, 109, 56, -45, 62, 33, -158, -37, 4, 58, -258, 149, 91, 20, 123, -244, -205, -19, 69, 196, 183, 15, 48, 190, -19, -119, -124, 23, 90, -98, -16, -79, -99, 30, 31, 126, -177, 187, 70, -168, -88, 95, -76, 86, -210, -21, -96, 14, -38, 141, -42, 353, 156, 2, 30, 89, -172, 10, -32, -195, -289, -209, 33, -14, 53, -172, -45, 14, -24, -95, 0, 72, -189, -188, 127, 86, 212, 76, -19, 283, 134, 142, -72, -83, -20, -172, -68, 132, 63, 108, 94, 109, -163, -25, 177, -87, -225, 288, -188, 333, 71, 63, 170, 21, -18]
7544a8j8J21k51J95k4p2R8n0J14j27r2O9j36J71K90l40J50k24K00j60P4J4r0j15
7568b21K81O9k40K36j84q8K0p3J97p5q0K42R0k31k28P5J49J83M8l3Rk1P8l81L38
7593A60j63m3K91j66k49K44j50J59j83J10%p1k6J51k05J30j70J53n9J05l9K02
7615A81j11l4j60p1M94l74J14J47k82J09J8j69J14K0n8m5J25N0k30J27n2LN7L5
7639Hj95L32j13j43K66k03J77p5j3j73J41j5K69k70Q8r4l0j31J76NPp0p0K22j19
7664b3jML19k56J37j02m3k13K09K2j56J37j94%K92j74M0n7L6L0J92lj96M6k38
7689a92P5R0j88Q4j04kK70N1k20J34j34J35L00l75K0L8o9J00j26pj49K28P8q3
7713d6O5k0J0lQ2M9j48q1J00P9K9j72K46l91Q0J07M1m3N3P7l4j77J04j20J36o2
$$ y = [-18, -36, 85, -166, 29, 5, -67, 31, -19, 95, -32, -124, -55, -191, -20, 270, -70, 80, -144, 56, -104, -30, -16, -106, -221, 60, 129, -111, 125, -59, -147, -127, -200, -3, -78, -158, 84, 174, -57, -285, -210, -61, 122, 170, 137, 146, 125, 203, -178, 160, -3, -46, 245, 79, -170, 74, -76, 83, -100, 10, 10, -61, -87, 64, -141, -11, -181, -28, -87, 18, -21, 181, 70, 36, -124, -195, 299, -75, 39, 186, -96, 13, 31, -138, -24, -4, -62, -107, 18, 68, -162, -35, -87, -84, -27, 8, -187, 145, 32, -111, 155, -48, 129, 54, 41, -132, 9, -6, 263, -7, 81, -13, -43, -174, 2, 7, 14, -56, -126, 96, -23, -24, -20, 299, 43, 180, 78, 35, -178, 31, 53, -103, 34, -160, -160, 132, -42, -2, -59, -23, 7, 199, 196, 0, 46, -192, -117, -27, -215, -131, -235, -237, 33, 84, -136, -2, -136, -1, 299, -76, -56, -18, -87, 13, -113, -120, -269, -41, 37, -46, 19, -1, 9, 6, 88, 137, -11, -92, 8, 87, 116, -56, 190, -201, -121, -14, 27, -16, 37, 114, 80, -97, 7, -113, 23, -39]
7739c9M1K52k37J12l25O7n4Q2O3l3jK70m67M26j34J45j57m0K29j41K6o4j16K10
7763A15k46J71q6j38J24P6J79j33L5r7J93q8j34J80l54N9K20l39K42k4J94rl26
7786a86J49J65l17K87Q8k53l49M07j45L88l02N8J24R4k17n0j64J51J62k21J18
7807a3J79l34K30K33k07Q9N5l10J57j7j08J94j77M95q02K67J88j25j41J57L3r6
7829e3L1p8J48j51L5K3j39N6J17k32K25P7J33j36k19K40j25O3k89J91J72j32L7
7852fq2L1J22j01P9J07l32L08l42J83K17j92j84J85M7k11P1L0K30J4k68o8O3p4
7876a73L13l3p2n2j2q6N1j85K35J17K13l72R3j86J39K1j66J64N4j2k07J13J20
7899G7n8j30K96m01M08p8j41K16p8j19j79L73l78O2K89l32L71m00rm7K85om6o
$$ y = [-39, 2, 254, 17, 129, -196, -129, -183, -101, -38, -71, -72, 198, -269, 157, 23, 168, 11, -29, 200, 59, 85, 21, -95, 115, -131, 40, -46, -184, -60, 16, 195, 62, 97, 0, 193, 105, -29, 151, -203, -144, 76, -263, -21, -45, 149, 140, -186, -37, 128, -189, 98, 186, -67, -416, -9, -154, 234, -68, -10, 114, 208, -9, -59, -223, -72, 90, -131, -13, 166, -168, 62, 295, 88, 177, 232, -78, 79, 62, -46, 148, -29, 466, -336, -69, 119, -6, -147, 10, 43, -53, -22, -100, 48, -103, -68, -45, -184, -128, -11, -243, -18, 59, 192, 56, -163, 77, -48, 15, -274, -83, 89, -43, -6, -88, -57, 65, -36, 43, 150, -182, 126, -216, -33, 184, -8, -192, -7, 40, -171, -100, -70, 160, 174, -94, -162, -99, -173, 140, 107, 35, -17, -29, -115, -64, -249, -14, 103, 316, -56, 37, -149, -10, 11, -155, 9, 63, 51, -156, -43, 77, 19, -111, 185, -216, 192, 114, -27, 189, 111, -8, -187, 186, -192, -130, 159, -173, 198, -202, -211, -258, 27, 21, -25, -31]
7923c1k11J37J73j8j48K45J2k29j9J0J57J05j55m4j76J69Q9J8J4j09k23J98m3
7946g9K45n30N16j46m4j60J77p9R5j32p2K97l7l44J51K57k41n9R9J50Pk34J25
7969c8K28k60J30mJ27o6o4J07n65P41n12L40k30J66j75N1J88m1p3P2k41K15k10
7992a14L35l49J17m9Q2M0k43N28k13j46l05M20k56K05j08Q0JN3m5r6r9K91k65
8015a36K66j84N6J83l52j23L85r7o1N3p8Q6P2j05K12M0k25M8j19qj19J86l8J21
8039F3L1k00p7J7K27q8J50J73n1j10j42%o3K7j68j5Q0J23j23O7J85J02k88L15
8063B35k28K20k03J03K9k25N9J89k63J26N9o6j8M7L8j42o0l3J55kK99k01M9J3
8087A80m86K51J62j19J02k77K06J17l22K24R1J1r7k48K59j72j62K07J76j87Q0
$$ y = [-31, -242, -105, 68, 50, -98, 147, 159, -70, -89, -79, 78, 183, 28, -16, -192, -23, 66, 84, 98, -11, -234, -36, -79, 166, -364, 152, 6, -38, -198, -21, -100, -5, -137, -209, 88, 51, -293, -142, 115, -126, -185, -86, 64, 71, -163, -38, 190, -70, 60, 56, 183, 117, 53, 160, -405, 336, -176, 164, -66, 100, -75, -24, 164, 123, 50, 122, -119, 96, -114, 221, -128, -11, -60, 22, 62, -181, 347, 134, -12, -317, 103, -153, 52, -56, 24, 25, 78, 33, -63, -162, 129, -136, 130, -54, 2, 185, -167, -290, 95, -2, -63, -10, -88, -2, 70, -35, 177, 217, -8, 40, -79, -87, -206, -20, -58, 63, 94, -106, -183, -166, 61, -27, 123, 296, 245, 135, -7, -7, -70, -43, -211, -226, -146, -23, -146, -79, 106, 208, -80, 235, 7, 227, 24, 127, 156, -69, -10, 179, -84, 42, 101, 35, 17, 64, 102, -40, -100, -133, 22, 20, 319, 118, 167, 180, -306, -55, 107, -12, 90, -187, 19, 136, -186, 38, 129, 140, 43, -205, 54, -118, -280, -73, 103, -84, -4]
8108dr3p4M4L26j85j58%J27J61k18J79k63R7J77j93O4K6J4n2k35J70K09m38K34
8132h5M0j65K16k5j08n8Q5K74k64J28p7M2P1N1J25k60J68k17o1M2J38M2J92n46
8156b52J93K39j58j53Q5J97j40j00J18lj07J78k85J92P4j97J65j92J89r1J00j65
8178a13P6R4j0k2n6L9P3j66L34k76n0O0j09
$$ y = [-4, -97, -171, -127, 199, 14, -144, -144, -17, 144, -74, 105, -158, -61, 116, -77, -13, 13, 27, -25, -260, -90, 119, -319, -85, -45, -210, 6, -19, -127, -185, -100, 174, -90, 38, -39, 3, 74, 125, 250, -10, 158, -59, -120, -78, 60, 102, 294, -252, -59, 180, 22, -131, -46, 151, 11, -89, 29, 26, -81, 97, -188, 4, 78, -119, 46, -146, 43, -48, 52, -113, -37, 57, 47, 25, -31, 8, 81, -85, 249, -27, -77, -17, -126]
8191a26
$$ Imaginary data points
##PAGE= N=2
##DATA TABLE= (X++(I..I)), XYDATA
0@%%%%%%%%%%%%%%%qJ6j6J6j6K4l2L2m0M8n6O6p4Q8j03J18j34J51j69J91k16K41
37A27k70L02l38L77m19M65n15N70o30O96p66Q43r31J027j130J244j372J518j679
56h81J861k074K321k611K957l382L920m618N565o940R121j3110K2732q8162j05793
71a79094J50480M6533l3086N4203J57234L2933q6307R925P0594j01937j29143
82g665J5077M1960o6959o0384P6634N9440j03629n8253N5199k4364j10281j9515
94b02740Q9129L3456m0466Q0991J40170k24m3776M8469M4456o1373p2210N3171
106F9053N3453o1248j1373Q1573Q221q3481n1086J6085m9763j22133j2225O1673
118a01251k1885k8752O3398P7312j4486m3829M7882L2555o6910j5655P3317M1429
$$ y = [0, 0, 0, 0, 0, 0, 0, 0, 0, 0, 0, 0, 0, 0, 0, 0, -8, 8, -8, 8, -8, 16, -16, 16, -24, 24, -32, 34, -40, 48, -55, 63, -71, 80, -89, 102, -114, 127, -143, 159, -179, 198, -221, 244, -271, 299, -331, 365, -401, 442, -489, 538, -592, 652, -720, 798, -881, 980, -1094, 1227, -1384, 1573, -1809, 2111, -2507, 3058, -3882, 5239, -7871, 14861, -73301, -179094, -28614, 17919, -15167, 39036, 196270, 229203, 142896, 152821, 223415, 121478, -7665, 7412, 49372, -17587, -77971, -1337, 58103, -45526, -103779, -48580, -72944, -183225, -202740, -113611, -80155, -120621, -39630, 100540, 100316, 56540, 105009, 149465, 88092, 15882, 69053, 122506, 61258, 49885, 131458, 139679, 56198, 5112, 21197, -28566, -150699, -162924, -101251, -123136, -151888, -88490, -11178, -25664, -69493, -21611, 10944, -55966, -71621, 1696, 43125]
130D3125j0988K3749Q1564J3747o9086p655J6557o3721p2226j049K9618k0382
142c6747l0025M8913L2333n2114k7813J7549r384m3913q227N8463L1940n350N2783
155B8408O4512o25k0266J644Q808l2963l8789K4458K0883j8776N469K5123J41
168F8027l6380l6598o790l0286m7207M033K2336Q305J3902K5687L1372L17j7223
181e05Q258o130j9669M577J5580K2165J7635J1175J9983m229k3120j5624k8809
194A287k6440j4852j4606O434J0662P558J3430l758m954m704k4032r193M320K105
208e6743J3886K0756L1994K6508o24R356O881k5360k0314m279K046l411n874K4225
222A9047J9495j8206o513M180k0674l3750j9396J2796M002j4727K7778M0449j382
$$ y = [43125, 32137, 55886, 137450, 151197, 82111, 74456, 91013, 27292, -44934, -45983, -16365, -36747, -66772, -17859, 14474, -37640, -65453, -47904, -57288, -101201, -109428, -50965, -19025, -24375, 28408, 92920, 92295, 72029, 73673, 82481, 49518, 10729, 35187, 56070, 37294, 42763, 67886, 68027, 31647, -4951, -11741, -42027, -89234, -85201, -62865, -54560, -40658, -14971, 16401, 16718, -505, 7753, 1623, -18046, -13469, 2111, 24276, 41911, 53086, 73069, 68840, 45720, 30096, 1287, -25153, -40005, -54611, -48177, -37515, -29957, -16527, -20285, -25239, -29943, -53975, -63168, -58848, -56743, -42857, -22101, 9893, 36401, 35777, 45133, 52014, 26654, 6340, 2061, 4107, 696, -5178, 19047, 38542, 20336, 13823, 18003, -2671, -36421, -55817, -43021, -39019, -53746, -25968, 14481, 13099]
235A3099o108J3934J2553k2308k8608K2327J9503j9761J1653M1353J2259k1934
247D7962j0650J7927k0434n3997k23J9886k0610j6477K5102L3042j7836k8521
259b4829K4831N535m7163j2528L2277J1875j8939J2584N7048P974l5643J5714
271B8736K4140l2464l8197J2548K9531k4001k2804M4691K1551m2348j6338K3182
283H227q145n4322j4100M4382k151l4351L2610M9055j3123k9035K1456L0964l7665
296f198l4118M3555K4212l1389J845M8842J3917m4786j2110L6707k3597n7935
308d1055R657L2347j8050k9435K9725M1833l1501l3503L5181J0481m5163j2189
320e1672M1771J9914l0888R982N9660k095m1005J3285K6583k7100m2367J8359
$$ y = [13099, 6991, 20925, 33478, 11170, -17438, 4889, 24392, 4631, 16284, 57637, 69896, 47962, 37312, 55239, 34805, -19192, -19415, 471, -20139, -36616, -11514, 21528, 3692, -24829, 2, 5537, -41626, -54154, -21877, -10002, -28941, -16357, 40691, 48665, 13022, 28736, 52876, 20412, -17785, -5237, 24294, 293, -22511, 22180, 43731, 1383, -14955, 8227, 82, -54240, -68340, -23958, -26109, -60460, -27850, 21205, 8082, -20953, 503, 31467, -6198, -40316, 3239, 27451, -3938, -2093, 46749, 60666, 15880, 3770, 40477, 16880, -41055, -31398, 949, -17101, -46536, -16811, 25022, -6479, -39982, -4801, 5680, -39483, -51672, -9901, 10013, -20875, -10893, 48767, 46672, 5667, 18952, 45535, 18435, -23932, -5573]
332e573L6076k9914k3673M2428J6929m0199j9551K6249J179n0834o032M8636k347
345f626k8465K6186M2322j0263l2691J9516L0481l5308k6015L6323J9723k5138
357A0045o166L7305J1046m4530j0416K9700j9412m1157P376K8111q263k5799K4754
370g406L3524k6671k2035K4576Q575k7408j0697L2097J6941k5354P121L7495o495
383C4263k8188J449J4706j6462l2316J2522K3846k1191j2373K3162Q950k2251
395a3883j5895J5997L317l0219J525K9220P06r442J2621K3076l170k0911R980
408B922J3897k0065j0207J4950R724p757n980J7262M043k4377m216Q273r506j3828
422b4865J600J4174J957q295J4098J2789r568m036M630K297m022m231J3643Q583
$$ y = [-5573, 30503, 589, -23084, 19344, 36273, -3926, -23477, 2772, 3951, -46883, -52915, -4279, -6626, -35091, -8905, 33417, 23154, -9537, 9979, 40460, 5152, -20863, 15460, 35183, 10045, 3879, 41184, 52230, 7700, -2716, 26984, 7572, -33585, -26209, 1902, -6361, -32160, -7406, 26118, -553, -22588, 1988, 10563, -16845, -27542, 4555, 21496, -3858, 3263, 40758, 34263, 6075, 7524, 22230, 5768, -26548, -14026, 9820, -11371, -23744, -582, 8368, -13883, -29778, -13781, -10464, -40683, -39158, -9938, -9232, -18674, -6053, 17023, 13853, -7058, 2922, 16819, -3246, -13453, 1497, 11221, 3464, -2516, 14746, 18789, -5588, -9804, -1531, -11037, -24865, -23265, -9091, -7134, -15429, -1331, 11458, 1890, -2146, 2484, 4781, 759, -3472, 10171, 18754]
436A8754n128P463P625k757n183p076o88m822j0535M359K671k951K861n98o66
451C329j447p316j289k690l285M916M07M378R960L7J020K715j250j309o972M3
467A247N880p015l81R174J19m547n119Q94j371j5997k638R027o560n623O423R269
483g218k55r567P579R503j4002m759J3654N347n524n19J6833P241j6323K836J4768
498A9594r637j5137K820J2113o100j5737J2976J3776j8212q763J3481L136j6683
511a2373r290J9513N795k0167P893K4471m829j4730P489J8670q899k0320J6724
524I947J6329j9218q193J9384Q271k0150j1514J9938m64l0528J530K0812q582
537b438j9964P480K2862j0490k2491J8696J6621k1915r612K1279J2337j8025o848
$$ y = [18754, 13626, 21089, 28714, 25957, 20774, 13698, 13010, 8188, -2347, 2012, 4683, 1732, 4593, 3995, 3329, 1882, -5434, -6723, -9413, -12698, -7782, -7375, -2997, 6963, 7000, 8020, 10735, 9485, 8176, 1204, 1247, 7127, 112, -269, 8905, 9024, 4477, -642, 252, -1119, -17116, -19754, -10727, -17287, -22910, -16487, -7218, -7473, -17040, -9461, 42, -13960, -18719, -5065, 282, -5242, -5761, 11072, 18313, 1990, 4826, 19594, 9957, -5180, -2360, 9753, 3653, -12084, 892, 14668, -3544, -12307, 1174, 4310, -12373, -21663, -2150, 3645, -16522, -8629, 15842, 11013, -3717, 3772, 22442, 13543, -6777, 9947, 26276, 7058, -1135, 18249, 26520, 6370, -5144, 14794, 14330, -16198, -14668, 6144, -2438, -22402, -14922, 7940, -2550, -25041, -6345, 10276, -11639, -21251, 28, 12365, -5660, -12508]
550a2508K9173M992k7027M111K2728q632k4223M941K2966j3100k5081J8871J6341
563A3552k3585j3340J8531J0520k4234j0139K9250M031k5518P893K6986l083k1211
576a0347Q694K6994j3007k2606K0441J7014k0290j2668J9425J2077k5280j2264
588a1817K5220o55k8733J594K1136m832k2869P026K5820j2271k0383J9561J5906
601A4703j6651j1065J9603J4732k0610p889K6378J491k3517J954J8310m863k3931
614a1355L255K0742j4209k0656J5123J1338j5724j2123J5477J2279k0392o136
626b2381K3753K208j7404M374J9115N78j7799O114K1217j1051j5632J3251R211
639A5554j2912j1547J1688R539j9155o967J7147r67j5603K87J3107j09j5136N080
$$ y = [-12508, 16665, 21657, -5370, -1259, 21469, 12837, -11386, -6445, 16521, 3421, -21660, -2789, 13552, -10033, -23373, -4842, 5678, -18556, -28695, 555, 4586, -20932, -13039, 13947, 10864, -10347, -1653, 25341, 12334, -10272, 10169, 27183, 6893, -5775, 13650, 25727, 447, -11817, 13403, 12748, -15985, -14391, 6745, 1913, -20956, -13930, 11890, -381, -20764, -1203, 14703, -1948, -13013, 6590, 21322, 712, -7177, 19201, 20692, -2825, -871, 17439, 12576, -11355, -8100, 12642, -1567, -22223, -7100, 4238, -11486, -23609, -8132, 4147, -16245, -22381, 1372, 3580, -13824, -9450, 9665, 10243, -7556, -1442, 19775, 8724, -6908, 6343, 15554, 2642, -8905, 2783, 12322, -6833, -13800, 3347, 2380, -13223, -12936, 171, 62, -15074, -9994]
653i994J7488p387q978J1843R058o023p740J0596R190j3196l795J2574o96r914
667C026p21P931n14j4005J682R325q801p089M448M402l728o134P339O620q629
682d848n27P954l19l544q3N613K410p381L396O237m642k191N77j28j293n343J561
699b551K209m854O21J593j415R61k095P7J781l303J925J458o21M093l69k96L699
716B913j322j44n94o45K601l367j017N946j569k843J657P41Q7n753kN871n396
733b836l798O555K342l005k463M268M132q999j787R240k175o527K852O884P22
748E405q482M058R698q717p136P337L476o072n318Q679O313j1789j327J1643k688
763E080j0876K61Q724j561j2296O303J3019q701p289R494N987q806p982J0745
$$ y = [-9994, 7494, 107, -8871, 2972, 12030, 6007, -1733, 8863, 18053, 4857, 1062, 13636, 12940, 3026, 2305, 10236, 9722, -4283, -2601, 6724, -2077, -9166, -4718, -316, -4044, -10178, -2839, 3781, -4848, -5375, 2579, 2260, -1284, -1367, 4246, 6656, -725, 2671, 8908, 4266, 2075, 2652, 2524, 1231, -4112, -2551, -342, -5196, -4575, -2982, -4397, -3436, -5531, -5454, -3673, -6976, -5051, -3593, -4214, -121, -490, -786, 2913, 1591, 1447, 853, 208, 2809, -558, -1575, 4371, 2802, -41, 1616, 2357, 2444, -3309, -3311, 2560, -2836, -6634, -79, 2263, -742, -3205, 1063, 5195, -3804, -5591, 3649, 1474, -5053, -2201, 4683, 5405, -3077, 981, 10679, 1962, -5174, 2163, 5639, -433, -5751, 2928, 9241, -2548, -3875, 7768, 5080, -5796, -5535, 3189, 1628, -10668, -4365, 8654, -47, -7336, 2158, 8145, -661, -8643, 2102]
777B102O525j4713l97J5472k23j0802O34J2475k966j6515O123J2596j1362r266
791a0317J0301R358r786r650J3861N671j7928k298J4565n62j2855J442J7008j710
805G100j6236Q615J3914j1744j1122R401R427j1231j0235J5987P381j7389k065
818h197J4582j273j5754r90J5477k986j6511R355J5023r025r780R885J0465j1546
832a275j1168J5293O924j6387o99J6266J425j3981o62J5228m820j8111O947J2811
846G791r971r863R780J2396j0767j0102J5512N197j6312j983J4008K117j2452
859d649O98J7970k566j4974P997J0690r933j1073O374J0526j1461r125J4568M386
873I428j3776k518J0595J128j4024j786J4557k836j1487Q061J1205m895q157O204
$$ y = [2102, 8627, -6086, -6483, 8989, 8766, -2036, -1402, 11073, 8107, -8408, -2285, 10311, -1051, -10317, -16, 9342, -444, -10094, 3767, 9438, -8490, -10788, 3777, 3215, -9640, -8198, 8810, 7100, -9136, -521, 13393, 1649, -9473, -72, 9355, -1876, -12111, 3876, 11257, -6132, -8197, 6385, 5112, -10642, -11632, 3845, 859, -15652, -6297, 8726, -299, -10079, -194, 10271, -1275, -12443, 2850, 9774, -6613, -7312, 8954, 10379, -3602, -4264, 10964, 6144, -11967, -5020, 7791, -2180, -12043, -2263, 10133, -634, -10736, 4776, 9973, -6339, -8322, 5686, 7803, -4649, -3951, 14019, 11453, -3521, 4476, 15166, 5233, -5840, 534, 11060, -401, -9526, 5042, 9428, -4348, -6866, 3729, 4857, -9167, -10953, 3604, 768, -10719, -2658, 8547, 3652, -4505, 1699]
887A699R574j0231q906J1997L294j0291j051R299K655j1387k041J0978n549j2097
901a2057M422O467m390o632O307R409p315n561R697K176p712j522P217L855p296
916b935O73J1361k425o462L316L461l425p606K262O397o581l348P128R70m229
931a443j991L096J530p155n47P044k003j612L901L744O81l436J659L816m797j781
947G06L209m66l08n24J942K340m233j100R54l467j549q16m28J641j285P51K384
964b49j438M69N5k084J646j326m06K937M78J623N66n55L356k151l314J808r78
981D37k196j04M86L197k473k242M335j453m524K13R71M58l511O81P031j500k884
998c078M741K087k676k974K350M582n305j834P797O10m250k3M337n65p872p85
$$ y = [1699, 11273, 1042, -7864, 4133, 7427, -2864, -3915, 5384, 8039, -3348, -5389, 5589, 40, -12057, -7635, -1168, -5558, -12190, -5883, 3526, -3789, -9350, 347, 2523, -5189, -6711, 506, 4361, -2935, -2262, 9099, 6674, 212, 3528, 6989, 3564, -4042, -1780, 4617, -1964, -5312, 1816, 2786, -1443, -3434, -338, 1192, -5963, -6510, 534, -1469, -3081, 820, 4564, 5245, 1809, 3468, 7284, 2487, 706, 3915, 3449, 3141, 2617, 4559, 6899, 2666, 1566, 2520, -947, -2496, -3312, -3740, -2099, -3384, -2633, -249, -1687, -1218, -1163, -3247, -1601, -2927, -3333, -396, 82, 1705, 2271, 1716, 5072, 2921, -393, 1415, 437, -1759, -1863, -1377, 1820, -653, -2895, 1440, -13, -4537, -4324, -3353, -2895, -6406, -5725, 1306, -194, -3078, 1663, 3750, 1074, -1900, 450, 5032, -273, -2107, 5690, 6300, 2050, 2027, 6364, 5799, -2073, -2858]
1014b858O987m996n394M496M309k771m671M671N502q716l548Q435J10n822R66
1029c300P779K065q124K368R313n822p559L945M729m789o648O360O917r598l168
1044e532P889K67q884k325P538J112j0355L233J1685l795o524N632O965m931p966
1059e991P187P191r870k672J0114K208p701k685Q842n76j3159J510R302n666p564
1074i530N167Q288m822p855Q436P031j1005l251R837K892p638j372J2225J587
1088I990j1582L404R717n799q927K833P437n975q918Q303O356j0251l946Q178
1102H20J375r173l823J0730Q09j0508M809J0465k633o109L627Q546n093q601P663
1117B904O170r187k658Q133K756q196l889Q588j161j1930K025P146l776o637L539
$$ y = [-2858, 4129, -867, -6261, -1765, 2544, -227, -4898, -227, 5275, -3441, -6989, 1446, 1556, -4266, -3300, 4479, 6544, -1580, 788, 10101, 4279, -3280, 665, 5394, 605, -6043, 317, 7234, -2364, -5532, 2357, 2624, -6260, -8585, -1047, 65, -10290, -7057, 4628, 833, -5691, -59, 6906, 1975, -5991, 1196, 8387, -1483, -4155, 5959, 8167, 466, -2219, 6623, 6047, -7112, -5602, 3700, -1966, -9530, -4363, 3925, -897, -8752, -316, 6715, -4290, -7541, 2296, 5188, -2450, -3822, 8403, 9990, -1592, 1812, 11529, 5730, -3197, -364, 7073, 1098, -7820, 483, 6839, -3412, -7358, 820, 2195, -6978, -10801, -71, 738, -9770, -4961, 5504, 2871, -3238, 389, 8935, 3842, -4759, 2904, 9074, -113, -2771, 5362, 8118, -78, -3967, 4621, 3460, -8470, -6445, 701, -3075, -9712, -6173]
1132f173Q769m345p158Q170M980p483k224O753L963n795j533J0333O86q390K539
1147C092N286k969p132K77O633m807o734O549L156o503k676L596K686o660k650
1162h856P774K63n255L407N910j44l606J483N974l725m593M761J968l311j447
1177F03K843K616m803l001M430k199n603M85K036j86k853J057M747k019k413L451
1193h09P40j365r97J937L367j711k94M571j88j709L42M9k0k831j215K203k140
1210g0r78J516q24j5j672p10J252k063n69J444l11J684R08j00K443J19m76P69
1228B347p74R51k77j397K435m4j825J178l72j065j736k365J588j173l266K183
1244c612R77o48o49J052K729j848k376L864Q23k216R52K946J603j855o32M914
$$ y = [-6173, 2596, -1749, -8907, -737, 4243, -3240, -5464, 1289, 5252, -543, -2076, 8257, 8943, 553, 3092, 8378, 5409, -1723, -1446, 5187, 380, -6354, 195, 3351, -3152, -5828, -2232, 454, -6206, -8856, -1082, -819, -6074, -2667, 3243, 3099, -507, 976, 6950, 3225, -1368, 3393, 5361, 2050, 603, 3446, 6062, 1259, -1742, 2688, 489, -5114, -4629, -2593, -2779, -5632, -4575, 172, -1847, -4260, -809, -69, -1434, -2431, -494, 2873, 1162, 868, 5439, 5251, 3542, 3884, 3933, 3913, 1082, -133, 2070, -70, -1048, 468, -356, -371, -2043, -2753, -1501, -3564, -4133, -2689, -3000, -1316, -408, -508, 1935, 2054, 1578, 2347, 1573, 2524, 2247, 850, 3285, 3241, 1416, 2594, 2222, 1157, -579, -2944, -1356, -2529, -5795, -3612, -2635, -3283, -3932, -2880, -151, -1999, -4375, -511, 312, -1904, -952, 1994, 3597, 1742, 1110, 6024]
1260F024j753m702J965J058k396k870R88M009l509l556M623M18m408q15L036K038
1276A50m489K07P134m72l666L221L905j253m136K075M848m429l836N717J053m540
1292A489k162L516J193p605j601O001k476n473K556M604r10m895L388O456m894
1307h13l591O463K180l997j213N758K930o967k62O512k686o888J226L792k658
1322b14o984K609O000o011m050N747J986m633l023O292L551o865J153R141q66
1337C833m607K498N782j665o807L497N810o085m421N013K109n534m009N328J155
1352A897q614n21O638j510m942J810O741r64n378M774O518m684k759N272L401
1367G679l892l015O494J708p173n24N160k218o795o04M745k402o852L180M552
$$ y = [6024, 4271, -431, 1534, 2592, 196, -2674, -1686, 2323, -1186, -4742, -119, 299, -4109, -4924, -1888, 150, -4339, -4132, 3002, 2530, -1136, 2085, 5990, 4737, 601, 2676, 7524, 3095, -741, 4976, 6029, 1489, -673, 2843, 4036, -3569, -5170, 831, -1645, -7118, -4562, 42, -868, -5763, -2375, 4081, -813, -4404, 2059, 4239, 242, -971, 4787, 7717, 750, 488, 7000, 4314, -2574, -1348, 2444, -214, -7198, -4589, 1411, -4600, -8650, -2903, -917, -5550, -8573, -2281, 1270, -5595, -4442, 4699, 3833, -774, 1724, 7506, 5841, -966, 2531, 8341, 2256, -2165, 2848, 4957, -577, -4586, 742, 1897, -6717, -7238, -600, -2110, -7052, -5242, 1499, 535, -4843, -69, 6449, 1765, -994, 4278, 7679, 3787, 772, 7266, 8974, 1801, 1277, 6437, 4219, -2576, -3180, 1565, -837, -7689, -4509, 43]
1382D3m472k740L802L263l375k680O189K968n315J238O196K35l874M30N214k011
1398E111o119K605K898m204l261J902K443m435l670M408P91n413M77L864L28k518
1414d793O55N681j3l727M026L255k363j266J742K746k737k691L838M10m450m94
1430a81J447n93l561j423L001r13l454K513K038o52q07J212K637q91j542L849
1446B680R39j632J017J168R68j781j366J718j137k924N48j74j433j187m08J482
1462a522j455j303J831m27m73M98M11J772N8M82K013M91l4Q36n51O66n82j284
1480A427Q18p73r75o0j182K90o27j999L87j02r82K61K11J127M77p41K466R99q16
1499B06M98J133J029l79l99J826K42k498Q24J012j313j668r32J058j525k754J942
$$ y = [43, -4429, -7169, -3367, -104, -3479, -6159, 30, 2998, -2317, -1079, 5117, 5352, 1478, 1908, 7122, 5111, -1008, 1597, 4495, 291, -2970, -1068, 1375, -3060, -6730, -2322, -1531, -6944, -6467, -2603, -2275, -4793, -4138, 1543, 1530, -2197, 1829, 5084, 2721, 1455, 3197, 5943, 3206, 515, 4353, 4763, 313, -181, 1266, 673, -2888, -4311, -1310, -2223, -5677, -3164, -1126, -1778, -2585, -1373, 1264, 373, -1169, 2680, 3619, 1987, 3004, 4172, 5140, 3359, 1993, 3711, 2574, -350, 198, 24, -1409, -2596, -3004, -1522, -2977, -4280, -2449, -2876, -3349, -2851, -2440, -668, -610, -128, 1885, 2376, 2342, 3178, 2627, 3293, 2711, 1427, 2245, 1472, 497, 437, -745, -455, -1082, -3081, -2694, -2796, -3778, -3517, -3306, -2179, -1702, -2443, 23, 1022, 206, 704, 1837, 2866, 2487, 2088, 3914, 4156, 1658, 2482, 3494, 2181, 513, -419, 639, -886, -3640, -1698]
1516a698O35k284l10J187J536j773j067L499N94k459J592L014j24j582R03K970
1532D633j170l123K359J214k938j328J060J297k948k005L365p21l848M22K555
1547a176p06k630P51M447j652k413L606K386k016j194K624K554l419j278M528
1562D412N1l767O5K782n28m612j57L915k811l951K995K058k886k271L062K619
1578I76l811j502N275L61l226O95L972J101m445J356M573k559l790K948J994k718
1594A200l386K542K553m998j817M243k58m112k76L568P12m789J502N041k057k691
1610c023L085K821j359k977L324L142m658j041M326o1l601o03L039R3n165P60
1626a898L892k774k937J828K607j870k937L036L100l469q80M024P64k331n19L467
$$ y = [-1698, -1063, -3347, -3657, -2470, -934, -2707, -3774, -275, 319, -2140, -548, 2466, 2342, 760, 1663, 4633, 3463, 340, 2699, 3913, 975, -353, 707, 2004, -944, -2949, 416, -305, -4153, -3731, -1176, -1882, -4512, -3761, 686, -966, -3379, 227, 2613, 597, -597, 2027, 4581, 1162, -116, 4412, 4463, 696, 761, 3543, 3015, -1597, -1754, 2161, -650, -4601, -1606, 452, -2434, -4705, -1643, 976, -2835, -4337, 938, 1299, -1927, -1232, 2740, 3841, -604, 752, 5325, 2766, -1024, 1924, 3918, 1200, -2186, 356, 2909, -2089, -3906, 337, 79, -4033, -4309, -741, -29, -4818, -3316, 1725, -332, -3023, 62, 2883, 1524, -1453, 1871, 5013, 355, -686, 3640, 3579, -22, -625, 2414, 2507, -2658, -1898, 1994, -780, -3717, -1889, 718, -1152, -4089, -1053, 2047, -1422, -2302, 1722, 2486, 155, -364, 3103]
1642C103R45m356J337L317k214k718J040K111j983l558K350K085l877q92K408
1657i02N14k511q88L387O41k786Q95L642j180j515J514J891r78k011J957J688
1673C358l174p63J439L74k026j645K459q8l354P93K006j406r08N99K200k80j691
1690b107K262K034j869K84J128R57j145n13J864j50k036K77R79j137j062o13R94
1707A47o42j730J187J84r04K71N86M27K67r46J585M44p40R76K15N11j21k48P56
1726B225k6j685O59l50l93m54r34M08m8j080J09n1j00Rk76M79O93p51R46N59J25
1747F4M44o91J188N79j556M28J210j008m34j99N60l76j337N66P68j574R7K69O05
1766c97n20q86J445P78j561O41J255J36r46k91J891J22k137J426J301j621q36
$$ y = [3103, 4048, -308, 1029, 4346, 2132, -586, 454, 2565, 582, -2976, -626, 1459, -2418, -3310, -902, -388, -2899, -3787, -400, 241, -2545, -1650, 1992, 812, -703, 811, 2702, 1724, -287, 1670, 3358, 184, -579, 860, 1234, -792, -2437, 22, -66, -3420, -2627, -621, -2027, -2935, -2336, -136, -416, -2107, 155, 2189, 320, 604, 1732, 2689, 1544, 1031, 2895, 2745, 709, 986, 1965, 828, -234, -847, 147, -495, -2225, -1038, -854, -1758, -1487, -901, -474, -207, -1153, 432, 876, 136, 1112, 1327, 1838, 1717, 1469, 2225, 2199, 514, 1173, 823, 430, -24, -958, -550, -598, -1678, -1569, -1620, -1720, -1711, -1987, -1508, -815, -1566, -620, -61, 64, 508, -183, 1005, 1584, 28, 456, 1666, 658, 224, 25, 585, 209, -1128, -562, 206, -1368, -1271, -1002, -397, -917, -1803, -358, 420, -1141, -500, 755, 891, -55, -346, 1545, 1667, -470, 956, 2257, 636, -200]
1783b00Q91R13j266j935K178N84k459L34J616O6j560m36K724o88k109J209K055
1800A917j681j038J264J663j881j980K561P85k560l22J806J02j969m69K893p44
1816C47k412J179K255j644j281J172J902j554j854K829N97k511Q1J781P37k617
1832i93p27L424j240k637J181J810p34j973Q86K562k137j742K968P73k007q13
1848a399K338J110k687k55L097r83k557J250J893q17k153R44K482k322j752K597
1864G86O02k209p24J923J058k686m58L333q58k219J218J594p58k269J310K632
1880B275k250j603K187Q51j999q01J922J083k690k97K738q59j953R03J729l35
1896I01k663J355J926k064j133J846Q27j669j000J848J338k970J40K051l00j404
$$ y = [-200, 691, 1604, 338, -1597, 581, 1165, -1294, -960, 656, 722, -838, -1274, 1450, 762, -1347, -138, 1917, 236, -802, 462, 2125, 244, -1736, 825, 1610, -950, -1272, 534, 636, -1333, -1802, 1091, 347, -2065, -886, 1369, -275, -1556, -384, 1518, -36, -1890, 939, 1536, -975, -894, 887, 1624, -993, -1720, 1704, 464, -2173, -992, 818, 84, -1889, -1003, 1559, -578, -2320, 648, 1421, -586, -1399, 939, 2049, -638, -893, 2204, 1221, -1336, -86, 1807, 990, -1163, -219, 2263, -59, -1811, 786, 1388, -821, -1545, 378, 1436, -1250, -1708, 1625, 767, -1452, -234, 1360, 602, -1667, -357, 2275, 25, -1578, 609, 1460, -539, -1340, 582, 1665, -1025, -1322, 1416, 557, -1396, -493, 1236, 901, -1762, -407, 1519, -545, -1678, 168, 995, -674, -1674, 174, 1512, -1458, -1318, 733, 433, -971]
1912i71M82J469j95k087J245K057j822j106J664N36j053p92J416P58k435K68J590
1929A024q41r15k9J207j78k191J103J509j148o01R06N41l24j083J384J092j637
1946a81J7J464k49q85p4J075j05j628Q17P59j391j27J56J77j66j017P57Q31j251
1965a021L13N11n4n2k65Q44N90j275P09M66n82L33k01K50j7p28M47L57o71k7k55
1986c28K31Np77M39J84m74K06Q8J07P33n99J88M93n35K95J74K4L51j022M38P74
2007I95j151m1L75j41j21m85L52O28j255o8J209l17m08l6Q31J77j004N52O52n67
2027A77k69M85K78k02r66Q26N43j497J18N70J43n68o46J448N2j704P39J375r18
2046a6o37P49P78o63r58J404R37j767k7J294l4j056o96J304J11j726L49J378q10
$$ y = [-971, -489, 980, 785, -1302, -57, 2000, 178, -928, 736, 1272, 219, -573, 843, 1601, -834, -566, 1024, 183, -732, -761, 446, 268, -1923, -820, 689, -459, -1060, -154, 387, 63, -1020, 364, 1456, -181, -164, 1300, 1051, 166, 92, 1167, 1062, -566, 251, 1010, -381, -508, -352, -175, -341, -1358, -601, 230, -1021, -708, -197, -251, -303, -568, 276, 866, -409, 300, 766, 184, 517, 316, 566, 549, -179, 268, 625, -46, -73, -328, -97, -92, -869, -430, -246, -720, -514, -426, -319, 414, -185, 3, 496, -39, 256, 430, 454, 805, -217, 221, 995, -156, -197, 178, 37, -84, -569, -217, 411, -844, -912, 297, -20, -428, -464, 367, 544, -460, 92, 744, 177, -92, 393, 671, 469, -497, 329, 872, -625, -507, 63, 206, -362, -1008, 440, 492, -1212, -473, 902, -16, -653, 96, 874, 211, -747, 657, 1594, -173, -200, 1094, 1060, 4, -692, 612, 723, -1003, -654, 724, -86]
2065h6j033L86J165m30j802J644J053j761M5J139P78p58j115J616N65k116P47
2082C7J144n74j161J76J517p79j817J514Q34j746l21P82P34j172j050K399j2j642
2100a137K75J593l58q52J45J523n60j725J617O18j226n49Q40J086j852p23K018
2117G33k6j830L98J244j87j215L09J628r51j584J537J050j058p52Q60J113j327
2134e8q29J939j24j524O24P60l4j438J38J699j078q76J109M94j008q73R27J443
2152A291j656q38J979l70j099K38Q27J3j218j79J701p35j101R11P36o98o95Q68
2170b5Q34j180m45J282k79n81j42R79J23j149J58J454r53q40R38M20k39j066P29
2189A8N77j250m2Q41K60n81nL41L96j138L12R85m70l40K11M54o7m97k48J080p54
$$ y = [-86, -1119, -733, 432, 2, -1800, -156, 897, -864, -819, 320, 1098, 340, -775, 841, 1406, -710, 37, 1181, 607, -554, -378, 1139, 360, -1457, 57, 891, -855, -1176, -394, 340, -832, -1882, 517, 505, -1137, -862, 731, 373, -479, -334, 1189, 629, -1096, 521, 1139, -87, -636, 204, 1290, -562, -1285, 733, 707, -1123, -725, 519, 332, -883, -574, 1054, 103, -1481, 56, 1106, 48, -704, 156, 1269, -58, -887, 1052, 928, -596, 28, 788, 754, -684, -546, 1153, 75, -801, 308, 802, -206, -1079, -152, 1291, -365, -1203, 776, 406, -693, -455, 372, 385, -833, -1012, 689, -46, -1147, -236, 500, -198, -893, -25, 809, -371, -816, 466, 187, -394, -536, 443, 566, -583, -425, 1029, 76, -764, 174, 594, 355, -711, 18, 595, -655, -697, 144, 404, -177, -182, 159, 555, -583, -271, 714, 244, -96, 115, 569, 502, 5, -243, 837, 83]
2210H3k50L43j39K8m20L39M71q89K84N31n35R4j56K93J82q57Q03M42q84J26M75
2231C64l65K12l35K79K95r72L29M03r3J24n21R6L75m84J05K2k49O23o32K71N54
2252D01o25m0M38k88k8j76J69M33l00j74K50o4k17j40K99L04n11K71M93l64RJ3
2274A53P3n2j94J15P40p82K6K53J31k56l87N10k17n31m8Q41o03j26K50J99Q4q57
2296f78M36Q92r00O7O38j09k26m15R58L15j189K05N60o24k7j92P40j12j120O18
2316a63O74r42k01N27K39m33n39P67M32q15k35J138j82o24J1P46J70j098M83P86
2336G41p70k90M23M23m39j030J108L11j300L84P69O2r65j82J371k7j332P73R14
2355I44j083k81N98Q15m98j339J291M54j171N7P67M8q63k09J028l82j215O49J135
$$ y = [83, -167, 176, 37, 65, -355, -16, 455, -434, -150, 381, -154, -60, -216, 77, 259, -598, 205, 647, -237, -111, 364, -1, 211, -124, 155, 450, -522, -193, 210, 117, 241, -280, -184, 191, -293, -188, -166, -415, 208, -424, -153, 401, -224, -264, 174, -114, -142, -318, -149, 284, -16, -190, 60, -4, -221, -361, -62, 242, -269, 2, 495, 131, 140, 153, 226, 174, -20, 95, 835, 53, 79, 332, 463, 207, -180, 330, 113, -418, -466, 375, -228, -354, -104, 95, 179, -678, -242, 650, -250, -183, 455, 346, 120, -295, 663, 978, -211, -6, 554, -70, -97, -289, 451, 339, -781, -163, 511, -431, -632, -105, 134, -299, -838, -71, 361, -454, -689, 449, 267, -357, -346, 400, 570, -528, -45, 741, -29, -319, 104, 527, 88, -942, 166, 477, -823, -439, 330, 392, -573, -755, 616, 589, -743, 30, 944, -139, -420, 178, 993, 495, -844, 447, 901, -270, -213, 554, 602, -261, -470, 558, 176, -1039, -390, 745]
2374G45q26n41L03Q54o12o40J148K08j057K18O61o5l52l59R48k94j137N69Q64
2393F35p27j76lR02q73o33J080j12q11K97O09L06p47pR57k80q40M18Q25o82n09
2414c71L55N94o57m74Q30K38j021p6L94M86o90j35P66r5o35L38N35j60l16N9Q09
2435G74n79k44M56J5k00l23L8Q01r08m58P66l23l73J89L96j13k33p8L43m32k21
2456g07Q10K4j13k51O07J3j83q9L65j13n9QJ12j14m01j36M79m02l32K97R6q6m21
2479e96M76J79k84j33L37r6J38j62Q6L46l03M3O91l65j85N5p8J19k73j05K21l39
2501b28J49K42m46M43l72L9R2n79J97L19J24K02l40J31J4J42l05K03J5J30q8j56
2523g2M51l32j9K52k94k72K40j89N85n82l61J017l75j92o8N1K68m76K93K54l17
$$ y = [745, -81, -622, -319, 535, -77, -717, 431, 639, -418, -200, 461, 396, 44, -315, 633, 339, -798, -229, 635, -92, -268, -271, 631, -242, -875, 205, 93, -718, -421, 188, 494, -253, -260, 697, 417, -423, -5, 820, 138, -371, -16, 578, -79, -553, 277, 515, -506, -582, -188, 298, -392, -527, 239, 144, -491, -153, 382, 222, -94, -35, 774, 195, -49, 407, 422, 222, -101, -63, 738, -170, -628, 138, -185, -558, -369, 27, -86, -319, -397, -54, -486, -707, 103, 127, 14, -237, 370, 383, 200, 111, 476, 363, 304, 312, 424, 310, -91, -227, 252, -150, -482, -185, -89, -175, -596, -120, 59, -225, -358, -21, -117, 21, -141, -55, 291, -12, 31, 722, 357, 172, 227, 149, 268, -5, -110, 111, -228, -79, 163, -283, 160, -212, -173, -81, -660, -463, -144, -20, 182, -158, -27, -13, 129, -176, 27, 42, 172, 84, -72, 379, 47, 28, 280, -14, -286, -46, -235, 350, -232, -593, 424, 49, -143, -211, -160, 108, -368, -75, 179, -138]
2544a38J6K84J87m92K28j09N48o02k17O70j48n09N6M23J46p50L19K85k53l64L41
2565g9J29R3l60J08O82n50k36N85j16k43k5M34L7q40O2O47l49n78L79M56k48p59
2587g71M18O20r15R2N88K13o46J4O30j43m34K70P24m79l57L11K89k39n32M14M32
2608D99o65j14L56Q4l03l83L52L98p98K34P34l12l61J25M15J02p63O96L03n53
2628D6l20Q29j20l07m29O37M42j179K25O27n38p3l43L16K25j058R65J28m77j0
2648d14M95L73p04l20R39K45p55K58M07J78n23k93P86m16m30O21qn64m23N74j5
2669A1m12l09P77l9q32L85L97K29m70j26O22l2p87Q84j5r3r8K3N19m62k45L20
2691B47Q0m51N2K35j05l60r8O35m31l13L98J05j50k28O4O65n48k12Q45Ml24Q0
$$ y = [-138, -122, 162, 349, -143, 85, -24, 524, -78, -295, 375, 227, -282, -226, 197, 343, -407, -88, 197, -56, -420, -79, 50, 143, -217, -109, 573, 23, -213, 372, 256, 13, -12, 422, 459, -381, -319, 328, -21, -599, -220, 236, -12, -771, -353, 267, -648, -556, 32, 245, -401, -387, 243, 100, -334, -64, 660, 181, -176, 135, 424, 185, -347, 67, 499, -166, -280, 76, 160, -143, -526, -174, 224, -574, -340, 394, 82, -279, -154, 261, 363, -400, 296, 599, 46, -274, 555, 435, 128, -301, 336, 778, -401, -176, 451, -87, -160, -503, -187, 38, -1020, -55, 73, -404, -414, 81, 454, -250, -570, 369, 614, -141, 117, 524, 702, 179, -114, 672, 256, -174, 447, 439, -125, -548, 26, 11, -401, -710, 67, 28, -804, -419, -22, 207, -263, -389, 233, 201, -586, 298, 283, 190, 92, 115, 634, 172, -73, 247, 327, -124, -72, 163, 58, -302, -400, 235, -196, -509, -111, -6, -156, -384, -320, 345, -203, -415, 430, 434, 110, 190]
2713A90j57J03o7n5M28j84k60p0l3L04l24M9P6j84k58P48l21l84M54k8P6l37K95
2736F1J89J01j07k75p1J96J27l61M20k53o6J76m9j58o9J2K13j81J7J30l09J14
2758a43Q3j03L13j14kK15Rj81Q6j62J36L09m07N3j74K35j45j73K21l12j11N17
2780A50j58j79P4K23l31L62O6j72J83n52L64M7J32K0j47K02j40o2LN6m47K91j52
2803a67J72l00l32Q71k85j37J03J87l04j5p4M10j05k08N26j35r9J08K6M80p57
2824c5j37K45j19j2J53J59k01l89P1M55n84J6M43j06k58k62O21J34k01l05O11
2845B99j4l44j17N14j87l19r7P90o31j48N13j44l02j8J74J82m83O3N18j68l38
2866b57j55N39j5o56N01M16j75m80M72Kr2l59M01L73n67p9N45m33m4j05Q0M53
$$ y = [190, 33, 136, 69, 14, 442, 258, -2, -72, -105, 199, -125, -76, 0, -184, -442, 306, -15, -399, 55, 27, 103, -234, 61, 250, 351, 244, -31, -102, 94, 221, -140, 280, 27, -39, 137, 88, -70, -139, -127, 86, -95, -78, 52, -257, -143, -60, -163, 150, 36, 34, 249, 258, 77, 163, 1, 137, 446, 39, 92, -82, 153, 8, -165, 56, -256, -367, 150, -8, -187, -113, 110, -221, 141, 207, 35, 218, -334, 30, 77, 209, 229, 82, 284, 144, 82, 85, 141, -306, -15, -167, 5, -295, -627, 244, -41, -178, -75, 112, -192, -207, -281, 129, 24, -184, 342, 207, 108, 216, 242, 722, -35, -172, 73, -46, -58, 95, 254, 53, -336, -265, 190, -394, -378, 65, -41, -299, -561, 60, 194, -7, -312, 299, 285, -59, -176, 338, 151, -168, -265, 525, -106, -254, 259, 115, -187, -205, -31, 151, -332, -269, 249, 81, -257, -412, 127, 112, -544, -43, 373, 198, -282, 190, 192, 100, -259, 142, 515, -52, -131, 414, -19, -63, -168, -88, 365]
2888C65p91K89N47n62k99K90M24k04m20N44N2l29l07N75K72l73j52M03J10n99
2908a65P5L42l46J78j01L48k93m61M95K05n91J84K42M8m46m7M92Q7m45M8L00k55
2930a06k5N0M39m03l19M29J58m24N1M51k14j69J2m1L20j50k41J88j88J88k20M90
2952B76r3r0L7N5j62K11l5p8j83JK04j05m82O10j11p0j86O3K73J0m24N15j53l93
2976c10M59m03O66l53l21K53Q5k69K46K88l67m3j24L87o5k49Q2K04k14j47J02
2997i3Q8k39o7L71l06J50o8p4L42j23j84K64K05l77K64NJ92k75lo0K93n49L64
3020A20P1m25K64l35M18l13r6j54N1J79J05k72K99J27k61P5K76j82K51J8N8J47
3042D21l20J86o4j30O7n0j52J2n2J69j42k01L87p7k17J49m03M63m9k67M20J89
$$ y = [365, -426, -137, 410, -152, -451, -161, 263, 59, -361, 183, 235, -94, -401, 174, 446, 73, -79, 324, 434, -165, -90, 252, -94, 84, -17, 331, 38, -423, 72, 277, -314, -130, 112, 160, -286, -333, 159, 246, -199, -151, 149, -106, -131, -81, 358, -45, -364, 65, 223, -201, -150, 301, 87, -82, -70, -111, 209, 59, -182, 6, -182, 6, -214, 276, 183, 93, 130, 185, 23, 234, 199, 121, -62, -61, 143, 38, -444, 166, 55, -15, -201, -138, 135, 145, -279, 236, 83, -310, 149, -254, 412, 59, -262, -9, 76, -193, 53, 341, -26, -69, -193, 194, 129, -120, -38, 166, -48, -195, -93, -5, -244, -311, 60, -246, -96, -164, -238, 104, -19, -203, 61, 266, -111, 153, 158, 350, 75, 72, 12, 305, -244, 120, 191, -234, 30, -305, 113, -200, -296, -450, -399, -220, -115, -387, -88, 39, -222, -147, 129, -53, 198, 216, 274, 421, 101, 287, 223, 93, 160, 110, -42, -30, -82, 87, -55, -256, 131, 54, -163, -14, -417, 46, -3, -270, 150, 339]
3064C39k95r3j69Q23m63k20L34P5l98k2Q3K0J2k05M65k51k02PL86n69K33j8J67
3087C9j01P1J83j66r7P8K17j52K51o78O91j01k83K52k87j17J86m1K00k45k18L01
3109a7Q9q1J0K18j9l10J05K91k94J31j66L02k19J25l69L52j24m05O18j36k20K35
3131A16k69K45J52m14K94k42M9K48j21O1j50nO27m22l51K98l4Q6p3k75O36m58
3153bk24O00m15o8P7k66j25L38p3L74k42k8LJ30r7j69L82R4k90q6M26l79L8l5
3177c7J81L6k81K54L57o88l9N3L26l10L9Q4J82j65r7J55jk8j71M48k66l75K20
3200a23K21J1l49J26K97m5j38J25nl5l50M11j79J88l79L06J25m46k9K72j16J32
3222B0k65J38ol28M52K53l79K18Q3j96R3l53M64j47j63K95L20n97K23k95J25K38
$$ y = [339, 44, -49, -218, 605, 142, -78, 256, 331, -67, -89, -6, 14, 26, -179, 286, 35, -167, -160, 226, -343, -110, -128, 39, -62, 9, 192, 26, -71, 7, 224, 72, 323, -355, 336, 235, -48, 204, -83, -200, -14, -55, 145, -100, -318, -17, 72, -9, 1, 219, 200, -110, -5, 286, -8, 123, -43, 259, 40, 165, -204, 148, 24, -381, 237, 101, -119, 116, -153, 92, 244, -170, 124, -118, -69, 179, 58, 119, -31, -36, 591, 169, -182, 116, 82, 168, 95, -180, 456, -2, -226, 374, -41, -109, -32, -298, -423, -85, -158, 216, -26, -54, -51, 79, -18, -187, 195, 289, -1, -87, 339, -40, -2, -37, 144, 180, -101, 153, 510, -178, -217, -164, 162, -148, -109, -25, 157, -8, -105, 50, 49, 21, -150, 298, 32, -343, -123, 98, 109, -240, -114, 183, 138, 0, 125, 120, 85, -265, 146, -33, 155, -224, 82, 207, -239, -268, 4, -112, 20, -245, -107, -113, -441, 11, 264, -115, 103, 186, -10, 83, -270, 194, 47, -116, 179, 499, -98, 125, -170, -45, 193]
3244A93l57L76j26j91J79p8j18j2L3mJ56k15K16N3n7Q3j29O3k8Q4j45Q1j08J96
3268A45m46L40j9j19J67k48k8K37l4l6J27l57K24J25l70J2L76Q7k50k2J98j5j65
3291g1J20J34Q8m30O6K73o3P4q7j86NJ53j79K07j41j13J99J93k61K50k68l8Q5
3314A0J10j34m5lJ73R4l17R2j77L54l59K09j25j22n1L84j80M72l17j8J21j85m8
3337f2K93j08J5pj86O5J7j31K66j27Oj72j14N58m46j6m5J09j00J44N8J63k52R4
3361B2N9M2j39O0m0o7N8RL78j95l28K98J66n24J27J2J97k32j83L07j47j5J54J21
3385A40j63j32j18O01m25K2J7J46k22R3O0K4K5n69N37K75l14j55L10k4l12K96
3407A12o0k4q6O7j56K37j21L6j0k04J76J48K5k16R0o6M0j49K63J27j82j35k4J16
$$ y = [193, -164, 212, 86, -105, 74, -4, -122, -134, -101, -105, 51, -164, 52, 105, 48, 131, 2, 65, 37, 121, -24, 57, -51, 145, -301, 39, 20, -99, 68, -180, -208, 29, -5, -41, 86, -271, -47, 78, -292, -280, 96, 183, -67, -89, 109, 94, -71, 49, 183, 271, -159, -93, 180, 117, 191, 104, -82, -77, 76, -103, 104, -37, -150, 49, 242, -19, 231, -37, -75, 10, 120, -14, -59, -62, 111, 205, -112, -20, -197, 157, -202, 7, -118, -240, -291, 93, -87, 385, 68, 50, 171, -14, -62, 231, 123, 138, 131, -55, 10, 27, -104, 162, 35, 41, -131, -245, 313, -133, -149, -194, -85, -185, -41, 17, 180, -72, 22, 81, 123, -16, 44, 4, -63, -5, 4, 382, 187, -141, 157, 323, -201, -74, -62, 135, -97, -280, 27, -120, -135, 19, 140, -23, -155, -273, 328, -97, -75, -58, 88, -134, -41, 19, 43, 68, -501, 36, 311, -3, -158, 152, 128, -184, 112, 52, 28, -58, 9, -147, 90, -31, 5, -5, -209, -33, 115, 140, -76, 14, -52, -12, -161, 102, 229, 47, -88, -112, 4]
3431Dk04nO1Q9J56l13r8N24k29J45k19j07J47K6J96m7j62r0j07K68j87j10M39
3454A77k04k27Q3J28n7J35k12M91k58q9J80r7J03k56K69l0k85J47J07jn6N2k44
3477a44R5j92K7K93k32k45J75O3J59K45k33p6J81l7m4k54K23O2Lq3j19M86j65
3500A88J7j37k28K18k44L3P6J97M7k88L42m54M80j17m6r4j52N5L43k20R5j47l0
3523f6K45k69P7L76k04k00O9o8K06j49p4J57l13K79q8n4J86p0OJ00n52K75J7O7
3547d7J25j15M8k6r6K12N5j55k03J8K97l9j51Q8M0j33M3J20J28p5p5J8o5j32K43
3572A23j30k87L21j31lJ05k45K09L47l02j71R6M4n9P6J23p2M0PJ3l7k1K8P5j9
3597A30l88J76L41l55K62k84J48kj83P4K34k93oo4J10P1o3K18j65K50k40J82k61
$$ y = [4, -200, -205, -144, -55, 101, -212, -310, 214, -15, 130, -89, -196, -49, -23, 173, 126, -36, -126, -233, 35, -152, -262, 177, -27, -254, -171, -43, -100, 35, -177, 314, 56, -33, 147, 50, 153, -103, 166, 136, -149, -2, 105, 104, 48, 100, -144, -49, -241, -214, 79, -153, -398, -223, -160, -1, 244, 11, -65, 116, 79, 35, -219, 4, 66, 69, -14, -133, 353, 188, 205, 68, -160, 58, -186, -153, -77, 120, 167, -121, 221, -233, 247, 130, 84, -10, -162, -107, 236, 16, 111, -36, -66, 179, -90, -13, 363, 159, -41, 28, -40, 166, 17, -57, 100, -213, 66, -22, -76, 110, 40, 46, 146, -406, -131, -114, -47, 78, -37, 11, -15, -111, 101, 156, 1, -202, -184, 113, 74, -77, 11, 51, -82, -39, 81, 209, 134, 59, 77, 12, -120, 123, -7, -294, 27, -104, -107, -2, -247, -38, 309, 7, -164, -68, -24, -83, -7, 116, 44, 84, 91, 104, 67, 46, 74, 149, 130, -258, -82, 259, -96, 166, -118, 30, 28, -155, -81, 153, -140, -146, -210, -100, -29, -92, 126, -39, 211, -29, 153, -108]
3620a08K41l11K78j85J52J9J49l17k5K39j59m0q0K56K12o41L19J96l90J98k8n4
3642g9J38r9P6J25k03P9J45j27j08%r9j18Q7L1P7l44M49Nq3q1L6N9k60R7L66l36
3668a67K39k34L00J58l97m7K77k0j64L4M7J44k68m43O10K92m23o2J8N50m01j79
3690a36L21j01j91M74l66R0K4j19O4l6j2K08k39J17l63M83l25k5kN2K36k45K14
3713A23l18K18j82q6J89L3l1K65k93K44j44J27j82O1r2l4J03q5K38k97K10j81
3735a14K02Ql60N4K96l61K64j98K81j85J83J19L2Q8l63p5J58J24k37J84J70j01
3757A69j08qj2J66k44J12o9J48k03J50r2j48pLK13m2Q4j3j07j08R0p8K71r2m0
3782C5P3l0k1j2Kj77L63m61J56K96k34k15J72J98j52j03K22k46J83J21l5j14j09
$$ y = [-108, 133, -178, 100, -85, 67, 86, 235, -82, -107, 132, -27, -67, -147, 109, 321, -320, -1, 195, -195, 3, -25, -79, 59, -40, 36, 161, -42, 37, 182, 55, -53, -53, -152, -270, -183, -152, -75, -419, 30, 35, -48, -129, -93, -34, -294, -197, 169, -167, 72, -162, 138, 296, -101, -148, 129, 109, -55, -21, 26, 170, -98, -541, 69, 361, -62, -124, -106, 444, 43, -136, 185, 84, -107, 367, 1, 91, 115, -4, 60, 24, 12, 220, -19, 98, -265, 218, -107, -132, -134, -82, 154, -91, 123, -195, 23, -159, -245, -56, -23, -54, 211, -82, 162, 18, 145, -37, 24, -68, -102, 1, -84, 154, -143, 67, -114, 88, 96, -264, -210, 86, -275, -11, -209, 72, -113, 70, 189, 221, 309, -54, -129, 29, 153, -84, 100, 270, 169, 61, 53, 41, 207, -37, 75, 6, 154, -49, 101, 9, -139, -146, -143, 70, 28, 112, 99, -8, -116, -26, -104, 167, 75, 35, 108, 78, 57, 45, 47, -130, 233, -228, -72, 224, -10, -225, -53, 145, -7, -110, 112, -134, 49, 170, 135, 21, -88]
3805h8j61K66l1j28M16l57J39j28J14K2j38K78j61L7R7P3l50M8K3L6Q8m07L14
3828Bm8L8J17l74K59J40j32L3q1J61l42O1J57Mk03L08J76l71m2L84k18Lk29L28
3852A31k32K42j91q9K45j07N8k89J98mm4J80k54L1K11j03j69J75R4k27J18P8k19
3875a67J92k25m8J55J62k9j43J4n6J28J71l46M05j02K0j06p5K35J2N7j80Mj00
3898b2O7j40k6J94j65J52pK52k54K9P7q8K93n07M6K7L2j0K66k65l9R4K18k22r3
3923i1J01R8O7l70J75j42K06k53P3J40j18N6K25k15l5J12m0j7R6k19K37L1k13
3946i6p7M23j80p7K49k26J6j74K03R4k36J51p0K01n18P2J27k16Q5K97j80R1k0
3969f1R2j29K60j26m9K05no1K0P8k17r3M5l4J62k00M1J19j79m3J63M9n5J6j73
$$ y = [-88, -249, 17, -14, -142, 274, -83, 56, -72, 42, 64, -74, 204, 43, 80, 177, 250, -100, -52, -29, 7, 95, -312, 2, -46, -8, 109, -265, -6, 134, 2, 35, -46, 115, -227, -166, -9, -5, -208, 100, 276, -95, -137, 247, 29, 32, -197, 131, -101, 141, -50, -139, 106, -1, 57, -232, -34, -38, -82, 98, -156, -125, 86, -17, -186, -11, 83, -144, -26, 52, -167, 25, -200, -248, -93, 69, 40, -103, -89, -145, -17, 154, -192, 213, 111, 131, 25, -50, 185, 197, 254, 74, 78, -22, 45, -95, -121, 73, -92, 60, 53, 305, 51, 80, 157, 69, 362, -145, -99, -72, -40, -50, 216, -49, -88, 6, 224, 2, -91, 10, 108, 175, -195, -20, -162, 44, -209, -136, 4, -114, -58, 167, -48, -83, 29, -11, -28, 68, -151, 86, 117, -96, -173, 250, 70, -7, 242, 16, 32, -142, 61, 155, -81, 70, 0, 201, -317, -245, -118, -334, -249, 48, -132, -41, -61, 31, -98, 162, 36, -13, 192, 187, 126, 146, 224, 7, -86, -41, -75, 87, -113, -72, 47, -132, -175, -12, 37, -18, -2, -175]
3994a75L04p4l12J61O2J6J93j61j67J39L37l75N1n6K29k31M02k84J18j99M1j87
4016a68J68j63J53M15m23J48k44L04l8k39j86M28j79K15m89K14J87j14J90M2m1
4037A80j18l45J00J28l12K83J56l11L94k05J51l12K20o3K13j75j30P3P1M8J9j27
4059f2L65j54l50M04q9J82k76mp5J87l73L94j54J02k01K06Jk47J61L9q1J49L02
4082D26n00K02R9l65O4L2P8P1k10J24Q6j31l5L69K0k71j59J47nm7P0n2K28n4k27
4107d0j38L40o0K05m51n7K34J53j35j32K23k66P0O7J24j70K15j49K3j21J04j41
4129a02K51k15K25l40MJ57J50l07K51q1j22J10k17L66o9Q8p5j1K5k37J2J44J95
4152B02l50JL92l09J36l77M87n7m34M89L8k06J07J19r6k73J45r4K52r3j13L61
$$ y = [-175, 129, 55, -257, -96, -34, -18, 175, 14, -153, -14, 323, -52, -1, -57, 172, -59, 343, 59, 177, -22, 19, -168, 0, -163, -10, 405, -18, 130, -114, 190, 152, -87, -273, 155, -24, 191, -298, -84, 103, -11, 179, 221, 180, 62, -283, -183, -55, -367, -84, 72, -239, 155, -50, 101, -211, 9, -54, 159, -16, -146, -73, -2, 46, 65, -62, 303, 149, -201, 203, 114, 296, 20, 16, -59, 128, -245, 149, -5, 97, -104, 102, 103, -144, 17, 56, -25, 124, 426, -74, 128, 227, -138, -74, -42, 36, 107, -103, 21, 107, -24, -59, 310, 330, 59, -100, 47, 42, -5, 65, 13, 241, 187, -40, -178, 162, 102, 307, -144, -201, 33, 186, 51, -81, 142, -124, -54, 13, 137, -33, 182, 33, 56, -65, 39, -102, 149, -66, 159, -181, -177, -20, 130, -177, 74, -7, -129, -19, -236, 130, 61, 149, 74, 63, 88, -149, -137, 7, 202, -148, -147, 245, -64, 72, -305, 182, 125, -309, 180, 218, 12, 119, 238, 142, -131, 14, -80, 172, 79, -34, 327]
4174C27k85J3r6J71k05J63L25o14K39k29M9R8j49J69K27k87K04o4J8q0J49k35
4196i2K24k00M1J51Q2j19j44J86j73J07M8J8j93m5J90l61M56P0l29j6J57j48N5
4219c5p5P8r3j27L86k32J08J45n1n4j01K83l33Q6j11K17j3p6J3n8Q2L9O5k47n3
4244a57J61J7k01J74P7j57J15qk04L96l81n0L82k31L48l72L2N0O7k91L56m3j64
4267h4Q2k9J57k90J25J23j4j54m6R3j1pj87M28j32r8M1r2M9j35k3K07K0Q8o3j26
4293g8K98m97k50N89rk7R5j63j65M1N26n71K90r3J92j72k29J53J76r5j74K74M
4316A15k56k2J39m0K47j34K4k4LK5O4j12J0m0K0j17J30r7Q2K45j28O3l44J03r
4341e3l4j8N4J41J00k37L08r5n35K95J40j07P5j86j66M22k73R2n9K40N1j59M4
$$ y = [327, 42, 55, -41, 130, -75, 88, 413, -201, 38, -191, -142, -44, -193, -24, 203, -84, 120, 56, 74, -6, 143, -92, 132, -68, -27, 124, 206, 87, -57, 129, -44, 63, 111, 129, -64, -109, 81, -280, 176, 246, -83, -99, 58, -90, -35, -110, -32, -125, -252, 134, -98, 10, 155, 104, 50, -51, 232, -101, -15, -126, 91, 78, 2, 15, -43, 39, 78, 143, -104, -157, 4, 21, -180, -6, 71, -86, 29, 21, -183, 213, -168, -218, 164, -67, 281, -91, -59, -9, 58, -233, 123, 80, -84, -2, -31, 126, -164, -39, 84, 70, -84, -130, -37, -48, -55, -242, 186, 54, -44, -3, -95, -46, -181, -204, 3, 23, 111, 48, -78, 220, -277, -527, 62, 53, 26, 121, -42, -207, -166, 360, -211, 79, -14, 178, 6, -223, -70, 106, 11, -163, 111, 115, -141, -163, -24, -64, 183, 49, 73, 49, 52, 77, 141, 29, 39, -1, 19, -98, 32, -65, 17, 262, 134, 197, -147, -44, -53, -87, -105, -51, 90, 190, -47, 261, 166, -369, -74, 66, -41, 34, -152, -318, 104, -169, -77, -136, 104, 155, -4, 40]
4364D0K08j84r6L86l39J11n8j45K06k16R5j6M9k28J9R1l0J04K04j14j14j0K50
4387B13l07j34K19n9q6k2K41q5J4K43j44j18ml7J61o6J28l89K45j79J98J26j68
4410a0J33k76M7J74j02L10n77M29n4j47M2q5L28m27K89j21n1L03K8k81k1o4M4
4433h9L40l24o6J74n7p3J42L9L3j0k30K18J7r3J1J41j95J71j05K5k23Q1m6L13
4457A94j16k3o2K05k6l04O3K08k3l02J31j64L69K02j27l69O9k46L87j84J61q1
4479c8mR8k46J12J61r6K14k15J96j87j8J18k24j36P2L67k36r4L00k3j29J61k37
4502h4L3j79J70l4O7p2J91o8q6J80j47k55QK8K88K1j01j59J77K68j96R1l03J72
4526A0n9K5k0J85j50j24K68k8l26l4K65NJ67q2j16P0j00j63J43p3Q7M1P6K8j03
$$ y = [40, 248, 64, -32, 354, 15, 126, 68, -77, 129, -87, 8, -8, 41, -187, -168, -77, -107, -3, 201, 87, -27, -37, 213, -94, -228, -9, -68, -154, -176, 65, -20, -6, 237, 93, -25, -29, -66, 95, 29, 157, -232, 13, -166, 32, 158, -10, 123, -153, -106, 68, -34, 276, -301, 128, 74, -73, -31, -116, 212, -215, 74, -47, -98, 205, 233, -48, -69, -133, -89, 251, -73, -139, 35, -22, -95, 47, 86, 119, 109, -121, 97, 114, 21, 32, 173, -22, 149, 44, 69, -154, -73, -119, 194, 78, 55, -7, 198, 172, -132, -69, 139, 116, -186, -55, -219, 150, 352, 225, -144, -75, -321, 66, -118, 43, -38, -42, 56, -190, -78, 83, -13, 201, -14, 182, -5, -23, 95, -129, -265, -193, 174, -62, -156, 144, 121, -8, 153, -84, -51, -230, -60, -94, -27, -99, 92, 24, -62, 118, -29, -284, -276, -248, 40, 61, -40, -199, -22, 246, 50, 141, -162, 10, -49, -24, -44, 141, -9, -133, 135, 107, -219, -253, 12, 17, 184, 102, -14, 56, -44, -207, -64, -137, -50, -9, 67, 95, -8]
4551hj1M7J7J06l30R4N3j76J68P9Rj21L17k00q5l0K06l62K43R6j26J24l11J95
4575fK13nk94m3O1J66k33N7k12J39J88j87J90P3l03K76k39J96j21j58L64k71O1
4598h8K81j65rJ21j92k0MK03J39n63K01J97r0J74k72J36J6j75K34k45r5M81j88
4621H5k3J12k50j04J49n6J63j52J95o3q8L23l21k39K07J22j42K14j67K75m41J71
4643c0R8K4l0j9J26j62j01q2P9O8K6P5J6j18jK0m0J99j1%k78O3n8L4%L26k81Q4
4671B7J15j91j30K7J63l9R4l1K00n0q7j91M5j25J91r0J32j85L28k83J6J05j15
4694g4P9j32J12j01K02J60o7p3k41J76k73L67p4l63M97j54LK60k73J78Jm20M62
4717B52j95k06L14l97J80n9j86M39j56J6j62K71k01L51l96p2K78o5O0J29j31l09
$$ y = [-8, -19, 28, 45, 151, -179, -85, -32, -208, -40, 39, 48, -73, 244, 44, -41, -71, 135, -227, 16, 112, -14, 110, -201, -6, 207, 202, -92, -135, -74, 92, -141, -84, -296, -157, 31, -156, 34, 107, -196, 80, -159, 37, -84, -242, 122, -149, -88, 193, 28, 19, 140, -52, -72, -68, 135, 274, -289, -88, 109, 19, 193, -79, 57, 73, -102, 132, -113, -208, 273, 85, 62, 174, -76, -180, -31, -87, 76, -76, 119, 56, -32, 291, -30, -269, -62, 60, -82, 132, -35, 240, -201, -30, 68, 92, 62, 43, 169, 7, -94, -176, -97, -29, -3, 72, 88, -30, -31, -11, -51, 148, 137, 137, -141, -78, -136, -102, -102, 224, -57, 27, 142, -49, -179, -152, 11, -28, 66, 35, 235, 185, 98, -93, -48, -173, 18, -72, 60, -125, 203, -80, -64, 41, -74, 5, -127, -15, -116, 86, 246, 179, 106, -135, 41, -232, 135, 61, -302, 195, 41, 44, 304, 31, 209, 210, -210, 252, 57, -149, 165, -232, -52, -111, -297, 142, -14, 2, -160, 111, -90, 261, -135, -207, 71, 6, 66, 195, 64, -245]
4739b45J49o9qK24L9j23K17K2j45jl5j55K49j17J0M18k93l3k70Q2P6J3j32N0K12
4764A35l89L13j7j89K01k39N6N5l4K62n3j48k22K17R6L1j76K52j01P3K2k66L84
4787B63k07J29k8p3k99L77R7j87J49J34n02K86k38%J97k37M20j84l6l18M08ok7
4810A18j89J28j20J8j6J71Q2j23q3N9J5L6o2KJ80l63P8K8P6k62J53P7j7j68K68
4835H6J25k83k8R2j5j05J40j19L2J61J15J16k90m0Q4P1r6j92K96n5J13n7J11k66
4859dk48K84o5K0j44O3j13J76o9J99J19k56K9j19J77k92K90j50j08L33J07J7k00
4882D6J7o4K0J02k03M9J17k1O6mk27J33R5k52K22k02J49k34K54q5r9K6l4J78J94
4907B43k63q2j03K66J27j53J05L7j27J62p0k18q2K36j21j01J71J07j58J55j06
$$ y = [-245, -96, -165, -173, 51, 90, -33, 184, 206, 61, 60, 25, -130, 119, 2, 12, 430, 137, 104, -166, -84, -8, 5, -127, -77, 135, -254, 59, 42, -147, 54, -185, -129, -74, -108, 154, 101, -47, -269, -52, 44, 75, -101, 151, 50, 123, 145, -121, 263, 56, 185, 157, 84, -215, 162, 259, 72, 221, 355, -147, 139, -99, -99, 98, -139, 281, 97, 61, -257, 151, 145, 118, -71, 57, -63, -45, -61, 110, 192, 69, -14, 45, 60, 96, 34, 36, 216, -147, -69, -41, 35, -227, -74, 3, -14, -182, 86, 211, -72, -100, -8, -23, -128, 12, -107, -75, 86, 201, 317, 27, -13, 71, 142, 46, -146, 150, 95, 208, 151, 262, -4, -252, 32, -33, -13, -157, -94, -207, -31, -100, 99, 218, -38, -9, -128, 49, -243, 47, -103, -211, 122, 229, 246, 46, 63, -1, 19, 121, -82, -33, 84, 63, 129, 125, -102, 31, 126, -126, 96, -106, 43, -191, 63, -22, -121, -95, -129, 49, 243, -20, -102, -205, 61, 188, 35, 140, 177, 50, 212, 142, -76, -158, 78, -43, -144, 27, 134, -24, 131, 25]
4928B5q4p4N9k03L38rj2o0k4J71l07K38N4M8j60k2j05K5P0pJ04j99j41K49k2K2
4954b6J48k5j42j3R6j23L00j30n1j60L48l82J24j20K06R9j96L15l81N1J18m9J76
4977A83l14K11R3q3j66j53J38K32n5O4K3l24L49k65M9J33j79J86j18R5j55j85
4999b41P5L99l85K83j02N9m5r2J76k11j95K93p4r1J26K22j55pJ85k7l8k94K00
5022F1q6j90J81l4J1M9J04r1l2J32j71k50J90J30m8J16j69R0%J4L03j07o9J05
5046B39k19q0j08N97k01m29K58j64j21J61K63k63k60M34n1k61k0K65K7q3o6J80
5068I8o2j2K7J6k69J24n8L6j31J42J00P8k03J49k11K93J7m9R2Kl04P1n9r3L72
5093A66k78J12J04l5J97l12j1J19q8K85m13L90j51m8J40j15J29k15k6N5P7j82
$$ y = [25, -59, -133, -74, -277, 61, 52, 40, -20, -44, 127, -180, 58, 112, 160, 0, -22, -127, -102, -32, -39, 65, -134, -275, -26, -48, -26, 122, 97, -45, -58, 38, -85, 215, 85, 34, -126, 222, -160, -36, -156, 50, 149, -47, 268, -113, -62, 56, 7, 183, -131, 80, 173, 90, -76, -229, -91, 141, 86, 150, 173, -151, 198, -67, -18, 115, -64, 122, 4, 99, -56, -241, -166, 233, -152, 131, 29, 88, 43, -49, 127, -84, -279, 14, -60, -151, -25, 197, 42, 35, 220, 193, 155, -139, 61, -25, -215, -34, -68, -57, -8, 96, 5, -27, 105, -66, -316, -126, 4, -44, 72, -97, -7, -7, 7, 310, 203, 134, 239, 20, -60, -168, 429, 228, -201, 57, -107, -228, -67, 196, -67, -327, 107, 56, -205, -225, 40, 67, -16, -82, 98, 36, 24, 51, 67, -202, -78, -136, -100, -231, -89, 11, 89, -114, 35, -176, 117, 134, 85, 177, 179, -125, -54, -113, -206, 166, -112, 0, 104, 69, 266, -46, -57, 62, -26, 259, -154, 236, 85, 37, 177, 62, 191, -24, -50, 5, 82, -100]
5115a00J70k14QL66j09j45J42j48Q5j22oj70O6J49j39K92J61l88K54m8l8Q6r0
5138F2j17P6oj8j9Q8r2l21K78J36P2l1j20j75K8Q0o1K48j84k2L1K8J30L1k20k24
5164c22M57r6j75O9j23o2J94J08q9ql4j0n4K04p4J92m42K95OR8k04J20l51J78
5188a23K35K8j85j66J43Q6j10j40J45R2j64J40q8pK3J76q0o9L41j44j35j50K04
5211E2j61P4j02J81o9o0J89K35m81K70J0p7J80j28j54k6J1J43J33l91K69J4k76
5234a64J58m7J15M7o3l11K00J34l2k65L85O4l53l2R1J40j62L61k74K1j58J50J21
5257A26j62j72M09k3o0j63N9m7K87j58p0p0m1j58L37J94m77K60l08L54k23J24
5279A8j21J16J15m75L25j08P4j03J70j27K68j26k35L32k78K47j42l7M0J47L2l01
$$ y = [-100, 70, -144, -136, 230, 121, -24, 118, -30, 55, -67, -73, -243, -177, -28, -167, 125, 286, -102, 152, 104, 66, 152, 62, -55, 21, 15, -3, -22, 66, -26, -347, -69, 67, 139, 108, -12, -187, -159, -79, -140, 108, -76, -98, -67, -39, 91, 122, -98, -322, 135, 39, -136, -67, -190, -252, -58, 50, -39, -47, -81, -91, -145, 59, -15, 177, -265, 30, 36, 134, -70, 50, -301, -123, 112, 140, -45, -211, -68, 18, -92, -232, -87, 5, -159, -19, -107, -114, -91, 85, 5, -64, 277, 133, -2, -152, 52, -109, -35, -137, 44, -25, -85, 104, 339, -142, 128, 138, 61, 241, 113, -41, -67, -56, 87, 220, -171, 98, 112, -164, -6, -53, 62, 109, 46, -265, -65, 69, 37, -228, 157, 221, -132, -164, -73, 67, -95, 266, -8, 13, -145, 5, 126, -36, -208, 201, 178, 118, -45, 14, -33, 254, 96, 26, -44, -85, -243, 94, 288, -189, 71, -237, 117, -106, 18, -103, 13, 128, -347, -22, -130, -56, -159, 11, -116, 152, 26, -209, 123, -155, 92, -50, -87, -47, 100, 132, -169]
5301a69O8kL06k19k33K52P5m7k3j15m0j9j5N2K28k78k9M40m20K75L3j0k9k6lo3
5327a1j25J37mJ5N3J31j27m0L47l56m1P2m3m2K17m18L59K46j73j26k63J59J05
5350G2J70j10r1K60k45q9K7k0l10J84J28J03j90J96r3J16j10J2n3J2J20j66Q8
5373A1j7K56j99j41r3P3J56J55k36O5N9nj79P6k3m4J79r7M6J5O3J3m9k18K17O9
5399A52k13nj58K66j33k0M12m29K60j51l1J14j39j63L60k00K45j74n8j25K81k60
5421a69K52J46Kl96qJ69k1J49k91M45l85R6j29J97l9j21J03Lk27J86P4q7K25K8
5445B02j30m0j5K9j33K89j58J62j88J34k96K9K91l14O4R7k34J95J14j48K33n23
5467c40N17j48j22J21J34l05nL52k59K17k38Lo3M4J34o3N0j56l7L64j37k13J52
$$ y = [-169, -101, -103, 203, -16, -249, 3, 78, 31, 8, -107, -147, -166, -181, -129, 99, -179, -208, 232, -188, 87, 120, 110, 81, 55, 52, -11, -136, 1, -3, 12, 65, 196, 69, 29, 376, 20, -21, 51, 8, -34, 183, -235, 124, 370, 197, 71, -192, -33, 72, 242, 132, 41, 301, 56, -33, -6, -26, -336, -152, -24, 79, -111, 85, -8, 108, -2, 10, -43, -31, 89, -77, 11, -6, 250, 51, -90, -183, -110, 46, 201, -35, 30, 89, 84, -95, -19, -42, -86, 93, -4, 42, 57, 120, 133, 84, -134, 83, 152, -61, -66, -224, 42, -91, -111, 301, -128, 132, -19, -50, 64, -75, -238, 122, -78, 167, -7, -65, -190, 91, -169, 83, 229, 231, -165, -173, -4, -25, 124, -167, 278, -107, -11, -140, 57, 18, -103, 0, 3, -224, -38, 36, -51, 174, 202, 72, 32, 17, 46, -87, 202, 44, 206, 18, 152, -144, -115, 176, -138, -74, 23, -211, -16, 98, -50, 183, -340, 177, 29, -93, 28, 162, -143, -148, 204, -55, 162, -76, -73, -136, -92, 42, -21, 29, -127, -164, 200, 63, -150, 2]
5490Bj01P6J75k08J27L6m7l2lJ80l48J07L73j12l03R3Pj44K59l63J43R2J67l08
5514a32Q6O2r0K04j37O0j44j78K53J1m3K18m01K52J29l90J69J30j3k23L77j72
5536B8K57l57N4J73k63K16j43l00L75j31J46q2kR9J17k20q6j57P9M50j75J77m45
$$ y = [2, -99, -23, 152, -56, 71, 107, 60, 28, 25, 205, -143, -36, 337, 225, -78, 15, 22, -122, 137, -226, -83, 9, 176, -132, -46, 16, -74, 130, -7, 53, -91, -269, -16, -5, -48, 170, -231, 21, 150, -240, -71, 59, 46, -177, 200, 28, 285, -72, -18, 155, -108, 108, -35, -335, 40, -91, 55, -27, -29, 70, 187, -33, -119, -276, -197, 253, 78, 255, -190]
$$ [...]
8191A74
##END NTUPLES=NMR FID
##END=
