##TITLE=1H_Pr 291
 200.13MHz, CDCl3,
 8 sc
 
 27.1.2025
##JCAMPDX= 6.0         $$ Bruker NMR JCAMP-DX V2.0
##DATA TYPE= NMR FID
##DATA CLASS= NTUPLES
##ORIGIN= UXNMR, Bruker Analytische Messtechnik GmbH
##OWNER= pz
$$ XWIN-NMR		Version 3.5
$$ Mon Jan 27 14:10:24 2025 Russian Standard Time (UT+4h)  she@DPX200
##.OBSERVE FREQUENCY= 200.1313
##.OBSERVE NUCLEUS= ^1H
##.DELAY= (6, 6)
##.ACQUISITION MODE= SIMULTANEOUS
##.ACQUISITION SCHEME= undefined
##.AVERAGES= 8
##.DIGITISER RES= 18
##SPECTROMETER/DATA SYSTEM= spect
##.PULSE SEQUENCE= zg30
##.SOLVENT NAME= CDCl3
##.SHIFT REFERENCE= (INTERNAL, CDCl3, 0, 14.3821)
##AUDIT TRAIL= $$ (NUMBER, WHEN, WHO, WHERE, WHAT)
$$ ##TITLE= Audit trail, XWIN-NMR		Version 3.5
$$ ##JCAMPDX= 5.01
$$ ##ORIGIN= Bruker BioSpin GmbH
$$ ##OWNER= she
$$ F:/spectra/data/she/nmr/H-C/1/audita.txt
$$ ##AUDIT TRAIL=  $$ (NUMBER, WHEN, WHO, WHERE, WHAT)
(   1,<2025-01-27 14:08:28.87 +0400>,<she>,<DPX200>,
      <created by zg, POWCHK disabled, PULCHK disabled
       configuration hash MD5:
       00 E9 B6 7A A2 85 ED C7 34 08 36 98 17 FE 4E 26
       data hash MD5: 16K
       68 43 34 16 15 F6 2C ED 6F D1 2F 51 41 85 07 E0>)
$$ ##END=
$$ 
$$ hash MD5
$$ 14 04 AD E0 32 5A 90 64 4C 5B 86 6D 04 CA 14 93
##$RELAX= 
##$RELAX= 
##$RELAX= 
##$RELAX= 
##$RELAX= 
##$RELAX= 
$$ Bruker specific parameters
$$ --------------------------
##$DU= <F:/spectra>
##$EXPNO= 1
##$NAME= <H-C>
##$PROCNO= 1
##$TYPE= <nmr>
##$USER= <she>
##$AMP= (0..31)
100 100 100 100 100 100 100 100 100 100 100 100 100 100 100 100 100 100 
100 100 100 100 100 100 100 100 100 100 100 100 100 100 
##$AQSEQ= 0
##$AQ_mod= 1
##$AUNM= <au_zg>
##$AUTOPOS= <>
##$BF1= 200.13
##$BF2= 200.13
##$BF3= 200.13
##$BF4= 200.13
##$BF5= 200.13
##$BF6= 200.13
##$BF7= 200.13
##$BF8= 200.13
##$BYTORDA= 1
##$CFDGTYP= 0
##$CFRGTYP= 5
##$CHEMSTR= <none>
##$CNST= (0..31)
1 1 145 1 1 1 1 1 1 1 1 1 1 1 1 1 1 1 1 1 1 1 1 1 1 1 1 1 1 1 1 1 
##$CPDPRG= <>
##$CPDPRG1= <>
##$CPDPRG2= <>
##$CPDPRG3= <>
##$CPDPRG4= <mlev>
##$CPDPRG5= <mlev>
##$CPDPRG6= <mlev>
##$CPDPRG7= <mlev>
##$CPDPRG8= <mlev>
##$CPDPRGB= <>
##$CPDPRGT= <>
##$D= (0..31)
0 0.7 0 0 0 0 0 0 0 0 0 0.03 0 0 0 0 0 0 0 0 0 0 0 0 0 0 0 0 0 0 0 0 
##$DATE= 1737972508
##$DBL= (0..7)
120 120 120 120 120 120 120 120 
##$DBP= (0..7)
150 150 150 150 150 150 150 150 
##$DBP07= 0
##$DBPNAM0= <>
##$DBPNAM1= <>
##$DBPNAM2= <>
##$DBPNAM3= <>
##$DBPNAM4= <>
##$DBPNAM5= <>
##$DBPNAM6= <>
##$DBPNAM7= <>
##$DBPOAL= (0..7)
0.5 0.5 0.5 0.5 0.5 0.5 0.5 0.5 
##$DBPOFFS= (0..7)
0 0 0 0 0 0 0 0 
##$DE= 6
##$DECBNUC= <off>
##$DECIM= 32
##$DECNUC= <off>
##$DECSTAT= 4
##$DIGMOD= 1
##$DIGTYP= 9
##$DL= (0..7)
0 120 120 120 120 120 120 120 
##$DP= (0..7)
150 150 150 150 150 150 150 150 
##$DP07= 0
##$DPNAME0= <>
##$DPNAME1= <>
##$DPNAME2= <>
##$DPNAME3= <>
##$DPNAME4= <>
##$DPNAME5= <>
##$DPNAME6= <>
##$DPNAME7= <>
##$DPOAL= (0..7)
0.5 0.5 0.5 0.5 0.5 0.5 0.5 0.5 
##$DPOFFS= (0..7)
0 0 0 0 0 0 0 0 
##$DQDMODE= 0
##$DR= 18
##$DS= 0
##$DSLIST= <SSSSSSSSSSSSSSS>
$$ [...]
##$SUBNAM0= <"">
##$SUBNAM1= <"">
##$SUBNAM2= <"">
##$SUBNAM3= <"">
##$SUBNAM4= <"">
##$SUBNAM5= <"">
##$SUBNAM6= <"">
##$SUBNAM7= <"">
##$SUBNAM8= <"">
##$SUBNAM9= <"">
##$SW= 18.0517328524113
##$SWIBOX= (0..15)
0 0 2 0 0 0 0 0 0 0 0 0 0 0 0 0 
##$SW_h= 3612.71676300578
##$TD= 16384
##$TD0= 1
##$TE= 0
##$TE2= 300
##$TE3= 300
##$TEG= 300
##$TL= (0..7)
0 120 120 120 120 120 120 120 
##$TP= (0..7)
150 150 150 150 150 150 150 150 
##$TP07= 0
##$TPNAME0= <>
##$TPNAME1= <>
##$TPNAME2= <>
##$TPNAME3= <>
##$TPNAME4= <>
##$TPNAME5= <>
##$TPNAME6= <>
##$TPNAME7= <>
##$TPOAL= (0..7)
0.5 0.5 0.5 0.5 0.5 0.5 0.5 0.5 
##$TPOFFS= (0..7)
0 0 0 0 0 0 0 0 
##$TUNHIN= 0
##$TUNHOUT= 0
##$TUNXOUT= 0
##$USERA1= <user>
##$USERA2= <user>
##$USERA3= <user>
##$USERA4= <user>
##$USERA5= <user>
##$V9= 5
##$VALIST= <valist>
##$VCLIST= <CCCCCCCCCCCCCCC>
##$VD= 0
##$VDLIST= <DDDDDDDDDDDDDDD>
##$VPLIST= <PPPPPPPPPPPPPPP>
##$VTLIST= <TTTTTTTTTTTTTTT>
##$WBST= 1024
##$WBSW= 4
##$XGAIN= (0..3)
0 0 0 0 
##$XL= 0
##$YL= 0
##$YMAX_a= 732717
##$YMIN_a= -778815
##$ZGOPTNS= <>
##$ZL1= 120
##$ZL2= 120
##$ZL3= 120
##$ZL4= 120
##$ABSF1= 10
##$ABSF2= 0
##$ABSG= 5
##$ABSL= 3
##$ALPHA= 0
##$AQORDER= 0
##$ASSFAC= 0
##$ASSFACI= 0
##$ASSFACX= 0
##$ASSWID= 0
##$AUNMP= <proc_1d>
##$AZFE= 0.1
##$AZFW= 0.1
##$BCFW= 1
##$BC_mod= 2
##$BYTORDP= 1
##$COROFFS= 0
##$CY= -3
##$DATMOD= 1
##$DC= 2
##$DFILT= <>
##$DTYPP= 0
##$F1P= 0
##$F2P= 0
##$FCOR= 0.5
##$FTSIZE= 0
##$FT_mod= 4
##$GAMMA= 1
##$GB= 0.15
##$INTBC= 1
##$INTSCL= 1
##$ISEN= 128
##$LB= 0.25
##$LEV0= 0
##$LPBIN= 0
##$MAXI= 10000
##$MC2= 0
##$MEAN= 0
##$ME_mod= 0
##$MI= 1.114404
##$NCOEF= 0
##$NC_proc= 0
##$NLEV= 6
##$NOISF1= 3.799351
##$NOISF2= 2.8
##$NSP= 1
##$NTH_PI= 0
##$NZP= 0
##$OFFSET= 14.38212
##$PC= 1
##$PHC0= 249.1964
##$PHC1= 14.1922
##$PH_mod= 1
##$PKNL= yes
##$PPARMOD= 0
##$PSCAL= 0
##$PSIGN= 0
##$REVERSE= no
##$SF= 200.129724274929
##$SI= 16384
##$SIGF1= 3
##$SIGF2= 2
##$SINO= 400
##$SIOLD= 16384
##$SREGLST= <1H.CDCl3>
##$SSB= 0
##$STSI= 0
##$STSR= 0
##$SW_p= 3205.1282051282
##$SYMM= 0
##$S_DEV= 0
##$TDeff= 0
##$TDoff= 0
##$TI= <>
##$TILT= no
##$TM1= 0
##$TM2= 0
##$TOPLEV= 0
##$USERP1= <user>
##$USERP2= <user>
##$USERP3= <user>
##$USERP4= <user>
##$USERP5= <user>
##$WDW= 1
##$XDIM= 8192
##$YMAX_p= 0
##$YMIN_p= 0
$$ End of Bruker specific parameters
$$ ---------------------------------
##NTUPLES= NMR FID
##VAR_NAME=  TIME,          FID/REAL,        FID/IMAG
##SYMBOL=    X,             R,               I
##VAR_TYPE=  INDEPENDENT,   DEPENDENT,       DEPENDENT
##VAR_FORM=  AFFN,          ASDF,            ASDF
##VAR_DIM=   8192,          8192,            8192
##UNITS=     SECONDS,       ARBITRARY UNITS, ARBITRARY UNITS
##FACTOR=    0.0002768,     1,               1
##FIRST=     0,             0,               0
##LAST=      2.2672688,     0,               0
##MIN=       0,             -778815,         0
##MAX=       2.2672688,     732717,          0
$$ Real data points
##PAGE= N=1
##DATA TABLE= (X++(R..R)), XYDATA
$$ [...]
$$ plain form
1655 978 1999 -2314 -1660 3069 952 -3570 -237 3217 -643 -2496 1442 1512 -1864 -56 2137 -897
1671 -897 -2508 1935 1970 -2717 -1608 2971 803 -2976 58 1870 -1234 -1264 2067 417 -2659 906
1687 906 2888 -1678 -2489 2363 1799 -2430 -878 2537 -276 -1712 1430 699 -2706 -102 2999 -1046
1703 -1046 -3016 1610 2364 -1970 -1335 2169 18 -1486 1465 1086 -2396 -310 2935 -391 -2893 898
1719 898 2045 -1457 -1296 1391 16 -1519 851 838 -1638 -604 2209 149 -2345 422 2068 -541
1735 -541 -973 1010 432 -721 489 913 -1029 -784 1464 470 -1650 -501 1500 172 -1274 183
1751 183 603 -402 -110 1007 -537 -964 891 1538 -1191 -1069 1355 601 -1211 -267 969 -505 -795
1768 -795 994 165 -1781 411 1828 -1187 -1518 1569 1260 -1694 -224 1691 -388 -1153 1436 772
$$ packed form
1655I78J021m313O54M729k117m522L333L454l860j853L938P0l376J808K193l034
1671h97j611M443L5m687J109M579k168l779L034J812l104l0L331j650l076L565
1687I06J982m566q11M852n64m229J552L415k813j436L142p31l405K604L101m045
1703a046j970M626P54m334O35L504k151j504K951l79l482K086L245l326k502L791
1719H98J147l502J61K687j375j535K370j3k476J034K813k060k494K767J646k609
1735e41m32J983n78j153J210M24j942K45K248r94k120J149K001j328j446J457
1751A83M20j005K92J117j544m27J855O47k729J22K424p54j812R44J236j474k90
1768g95J789q29j946K192J417l015l31L087l09k954J470J915k079p65K589o64
$$ plain form
1784 772 -1955 46 2247 -886 -2026 1433 1171 -1837 -801 1590 -535 -1516 1559 710 -2088 -178
1800 -178 2466 -455 -2073 1182 1616 -1433 -642 1644 -302 -1442 899 1071 -2087 -698 1947 -20
1816 -20 -1943 402 1549 -823 -1094 1106 425 -1270 434 1195 -948 -1047 1498 827 -1644 -500 1667
1833 1667 -26 -1625 562 1020 -1281 -449 1528 -244 -1698 772 1488 -1210 -1012 1858 601 -1647
1849 -1647 299 1593 -1064 -1278 1448 355 -1970 197 1932 -918 -1746 1526 1250 -1956 -421 1876
1865 1876 -327 -1599 1403 1000 -1594 -421 2137 -248 -2113 1144 1575 -1469 -863 1506 -230 -1631
1881 -1631 790 1246 -1475 -851 1597 302 -1608 332 1647 -833 -1164 1247 643 -1206 -46 1368
1897 1368 -571 -1311 855 855 -1408 -503 1466 -59 -1578 639 1229 -825 -1045 1441 152 -1452 459
$$ packed form
1784G72k727K001K201l133j140L459k62l008J036K391k125r81L075q49k798J910
1800a78K644k921j618L255M34l049P91K286j946j140K341J72l158J389K645j967
1816b0j923K345J147k372k71K200o81j695J704P61k143r9K545o71k471J144K167
1833A667j693j599K187M58k301Q32J977j772j454K470P16k698J98K870j257k248
1849a647J946J294k657k14K726j093k325K167J735k850q28L272k76l206J535K297
1865A876k203j272L002m03k594J173K558k385j865L257M31l044O06K369j736j401
1881a631K421M56k721O24K448j295j910J940J315k480l31K411o04j849J160J414
1897A368j939p40K166%k263R05J969j525j519K217N90k054k20K486j289j604J911
$$ plain form
1914 459 1444 -1127 -1007 1488 554 -1823 47 1653 -1009 -1356 1177 707 -1794 -107 1601 -774
1930 -774 -1366 1264 842 -1564 -210 1728 -528 -1221 1083 1046 -1324 -341 1588 -271 -1530 726 980
1947 980 -1276 -570 1156 -99 -1401 525 806 -647 -762 1355 229 -1262 369 1086 -499 -809
1963 -809 836 544 -905 69 949 -349 -909 682 493 -888 -280 1103 10 -1022 550 978 -478
1980 -478 -640 1078 456 -1010 222 1000 -554 -687 1008 461 -1217 -180 1106 -492 -1190 786 625
1997 625 -1116 -168 1243 -434 -928 948 828 -968 -490 1308 -360 -1096 717 715 -1168 -177 1231
2014 1231 -456 -1343 595 690 -1245 -659 1036 -156 -1008 711 915 -874 -303 1106 -179 -945 589
2031 589 807 -595 -543 857 276 -853 165 667 -746 -476 887 323 -921 72 838 -283 -729 686
$$ packed form
1914D59R85k571J20K495r34k377J870J606k662l47K533m70k501J687J708k375
1930g74n92K630m22k406J354J938k256o93K304l7k370R83J929j859j259K256K54
1947I80k256P06J726j255j302J926K81j453j15K117j126j491J631P17j585l10
1963h09J645k92j449R74Q80j298n60J591j89j381O08J383j093j032J572M28j456
1980d78j62J718o22j466J232P78j554j33J695n47j678J037J286j598o98J976j61
1997F25j741R48J411j677m94J876j20j796M78J798j668p36J813kj883R91J408
2014A231j687q87J938R5j935N86J695j192q52J719K04j789N71J409j285p66J534
2031E89K18j402N2J400n81j129J018N02j413K70J363n64j244R93P66j121m46J415
$$ plain form
2049 686 475 -716 -76 655 -118 -654 360 674 -778 -614 958 62 -991 172 845 -554 -538 900
2067 900 276 -943 299 1064 -513 -694 1074 516 -1100 77 820 -340 -711 741 438 -1029 -187
2084 -187 1218 -330 -1218 554 1002 -1021 -415 1112 -62 -1034 560 853 -905 -437 1340 154 -1271
2101 -1271 287 1314 -579 -904 798 372 -1180 167 978 -667 -784 1083 355 -1230 37 1243
2117 1243 -131 -749 562 552 -804 -141 1069 -280 -875 745 629 -1283 -443 1246 111 -1156 101
2134 101 579 -499 -209 734 -96 -802 345 915 -603 -717 789 518 -854 -367 799 -135 -603 512
2152 512 332 -841 22 1156 -191 -979 345 890 -477 -386 789 317 -601 148 695 -564 -571 949
2170 949 65 -1161 -111 1125 -323 -912 611 554 -717 -230 839 -423 -506 756 660 -1067 -253 1217
$$ packed form
2049F86k11j191O40P31p73n36J014L14j452J64J572q96j053J163O73j399J6J438
2067I00o24j219J242P65j577j81J768n58j616J177P43j160l71J452l03j467Q42
2084a87J405j548q88J772M48k023O06J527j174r72J594K93j758M68J777j186j425
2101a271J558J027j893l25J702m26j552J347Q11j645j17J867p28j585J267J206
2117A243j374o18J311j0j356O63J210j349n95J620j16j912Q40J689j135j267J257
2134A01M78j078K90R43q30p06J147N70j518j14J506k71j372M87J166r34m68J115
2152E12j80j173Q63J134j347p88J324N45j367R1J175m72r18P49N47j259pJ520
2170I49q84j226J050J236j448n89J523n7j271M87J069j262q3J262r6j727Q14J470
$$ plain form
2188 1217 -38 -936 264 759 -743 -183 660 -175 -726 643 705 -1013 -546 853 53 -971 222
2205 222 812 -270 -259 631 -112 -833 407 748 -789 -756 653 438 -729 -68 416 -84 -215 394 243
2224 243 -688 52 809 -294 -776 479 745 -242 -482 521 247 -355 201 168 -563 -147 623 79 -822
2243 -822 115 822 -185 -657 528 390 -372 97 476 -390 -441 706 338 -893 -241 924 17 -892 183
2262 183 197 -482 -215 532 -322 -656 376 574 -743 -302 728 -42 -664 334 521 -409 -192 296 -87
2281 -87 -723 327 499 -722 -521 569 259 -576 -91 283 -225 -134 326 141 -280 84 545 -181 -450 409
2301 409 252 -407 -379 480 70 -402 105 150 -480 -160 597 12 -698 -27 711 -197 -398 540 287 -460 74
2322 74 377 -290 -247 743 112 -836 -134 747 -327 -667 351 452 -670 53 581 -433 -618 793 344
$$ packed form
2188A217j255q98J200M95j502N60Q43q35n51J369O2j718M67J399q00j024J193
2205B22N90j082J1Q90p43p21J240L41j537L3J409k15j167O61M84n00j31O09j51
2224B43r31P40P57j103m82J255K66r87k40J003k74o02N56l3p31M16P70n44r01
2243h22R37P07j007m72J185j38p62M69L79q66n1J147l68j231O52J165r07r09J075
2262A83J4o79K67P47q54l34J032J98j317M41J030p70o22R98J87r30K17M88l83
2281h7o36J050J72j221K01J090l10q35M85L74n08R1M60j85m21L64M61p26k69Q59
2301D09j57o59K8Q59m10m72N07M5o30L20P57n85p10O71P38r08k01R38k53p47N34
2322G4L03o67M3R90o31r48P02Q81j074l40J018J01j122P23N28j014j85J411m49
$$ plain form
2341 344 -677 -175 674 48 -454 518 357 -670 -13 457 -165 -776 407 514 -585 -263 658 -53 -565
2360 -565 102 411 -286 -204 367 89 -383 307 349 -369 -430 162 236 -198 -56 142 -30 -354 149 323 -349
2381 -349 -183 521 147 -483 9 640 -209 -491 388 335 -673 52 551 -269 -562 380 371 -916 -155 741
2401 741 -153 -646 524 539 -769 -261 812 -57 -529 655 410 -840 -275 905 -55 -683 414 431
2419 431 -515 -261 576 -56 -784 467 432 -552 -324 627 91 -547 248 450 -377 -148 655 92 -693 164
2439 164 366 -413 -345 435 137 -305 -67 127 -174 -421 174 376 -297 -59 605 22 -395 242 427 -252
2459 -252 -229 343 131 -439 -33 186 -361 -232 294 165 -452 -151 444 83 -480 393 608 -430 -72 564
2479 564 -83 -661 283 351 -718 -333 576 -161 -517 397 620 -427 -416 470 -91 -675 321 526 -385 -235
$$ packed form
2341C44j021N02Q49o26n02R72j61j027O57M70o22o11J183J07j099L22R21p11n12
2360e65O67L09o97Q2N71k78m72O90M2p18o1N92P4m34J42J98j72l24N03J74o72
2381c49J66P04l74o30M92O31q49k82Q79n3j008P25M99q20k93R42rj287P61Q96
2401G41q94m93J170J5j308N08J073q69m72J184k45j250N65J180r60o28J097J7
2419D31r46K54Q37o32p28J251l5r84K28R51n36o38P95K02q27K29Q03n63p85Q57
2439A64K02p79O8P80k98m42K38J94l01k47N95K02o73K38O64n83m17O37J85o79
2459b52K3N72k12n70M06K19n47J29N26j29o17L01N95l61n63Q73K15j038L58O36
2479E64o47n78R44O8j069L85R09p37l56R14K23j047J1Q86n61n84R96K05r11J50
$$ plain form
2499 -235 325 -53 -477 49 407 -341 -488 372 56 -447 -128 473 -111 -464 474 229 -541 123 421 -119
2519 -119 -430 341 432 -133 -185 336 -84 -500 89 232 -476 -231 298 75 -397 153 313 -330 -260 465 3
2540 3 -388 -18 385 -204 -240 428 197 -480 -44 375 -231 -449 362 252 -574 -142 475 -24 -531 266 302
2561 302 -375 -101 448 -170 -348 383 377 -324 -145 428 54 -508 242 422 -282 -162 327 161 -354 21 236
2582 236 -247 -336 230 147 -214 -27 363 0 -141 167 136 -166 -103 251 -44 -475 214 516 -263 -300 281 -61
2604 -61 -505 159 554 -331 -256 558 269 -468 -99 565 -5 -374 293 156 -574 -46 327 -117 -386 428 255
2625 255 -469 -165 680 -154 -626 158 371 -479 -130 490 -181 -307 333 484 -531 -319 655 -63 -475 -93
2645 -93 341 -135 -299 133 41 -254 134 317 -233 -233 307 249 -334 -74 251 -63 -432 -127 266 -306 -152 475
$$ packed form
2499b35N60l78m24N26L58p48j47Q60l16n03L19O01n84l53R38k45p70O64K98n40
2519a19l11P71R1n65n2N21m20m16N89J43p08K45N29k23m72N50J60o43P0P25m62
2540Cl91L70M03n89l6O68k31o77M36M19o06k18Q11j10q26M32O17m99n07P97L6
2561C02o77K74N49o18j78P31op01J79N73l74n62P50J80p04J20M89j66n15L75K15
2582B36m83q9N66q3l61J87L90l63j41L08l1l02O3L54k95m31O89L02p79l7N81l42
2604f1m44O64L95q85P5Q14k89p37L69O64n70l69O67j37p30N28L73m44k69Q14j73
2625B55p24L04Q45q34m72P84K13q50L49O20o71j26O40J51j015K12R74p18m12L82
2645i3M34m76j64M32r2k95L88J83n50%N40n8n83K60L25l14l69L05L93n72J54O27
$$ plain form
2667 475 125 -476 56 642 -200 -246 446 315 -255 9 503 123 -220 351 146 -530 -160 313 -159 -442
2687 -442 -2 247 -292 -55 277 -127 -352 235 317 -270 -249 451 131 -415 -38 369 -141 -359 171 53 -392
2708 -392 123 303 -44 -324 155 160 -266 -12 387 37 -174 99 217 -237 -68 404 -52 -366 331 283 -308
2729 -308 -361 143 233 -184 -32 223 -190 -287 357 -118 -375 37 324 -39 -35 131 95 69 110 206 -136 -263 85
2752 85 28 -356 -35 299 174 -180 -118 113 -118 -34 -3 -49 -37 154 38 -180 -110 311 206 43 60 179 -190
2775 -190 -67 48 -135 -40 121 95 -309 -240 324 295 170 -37 229 -46 -204 64 93 -107 5 240 43 -185
2797 -185 257 203 -257 -186 153 -27 -245 35 217 -278 106 283 43 -340 199 344 -186 -75 152 43 -287
2818 -287 187 -121 -361 22 248 -214 -291 184 212 -323 -134 152 -28 -331 4 -26 -264 -194 549 28 -346
$$ packed form
2667D75l50o01N32N86q42m6O92j31n70K64M94l80l43N71k05o76L70M73m72k83
2687d42M40K49n39K37L32m04k25N87Q2n87K1P00l20n46L77M07n10k18N30j18m45
2708c92N15J80l47k80M79Nm26K54L99l50k11K73J18m54J69M72m56l14O97m8n91
2729c08n3N04R0m17J52K55m13r7O44m75k57M12K87l63MJ66l6k6M1R6l42j27L48
2752H5n7l84L21L34j25l54O2K31k31Q4L1m6J2J91j16k18P0M21j05j63J7J19l69
2775a90J23J15j83R5J61k6m04O9N64k9j25k07K66k75j58K68K9k00J12K35j97k28
2797a85M42n4m60P1L39j80k18K80J82m95L84J77k40l83N39J45n30J11K27j09l30
2818b87M74l08k40L83K26m62p7M75K8n35J89K86j80l03L35l0k38P0P43n21l74
$$ plain form
2839 -346 68 266 -11 -73 40 -77 -193 145 110 -158 -151 169 -3 -207 -94 166 112 -14 20 75 35 -46 25
2862 25 -29 -149 198 95 -190 -293 241 166 -312 -101 193 132 -150 185 249 -272 126 357 -117 -484 141 373
2884 373 -309 -264 257 -30 -253 168 244 -297 -203 305 -69 -221 182 368 -200 -110 385 -41 -249 32 161
2905 161 -234 -54 281 -67 -399 -167 108 -78 -298 105 8 -252 -65 410 -136 -142 56 242 -167 37 326
2926 326 118 -254 34 339 97 -306 160 -66 -208 71 270 -127 -277 260 294 -233 37 310 -128 -165 44
2947 44 341 -289 -79 371 -15 -353 155 115 -420 -134 384 66 -250 -58 321 -325 -199 310 -122 -338 102
2968 102 151 -346 112 347 -23 -151 127 119 -19 -275 81 23 -212 -46 184 -128 -188 117 40 -131 2 206
2990 206 -10 71 -45 223 22 -3 76 49 -137 -159 105 -192 -206 -52 233 -73 -164 131 147 -441 47 258 -259
$$ packed form
2839c46M14J98k77o2J13j17j16L38l5k68PL20j72k04J13K60n4j26L4N5m0q1P1
2862B5n4j20L47j03k85j03N34p5m78K11K94o1k82L35O4n21L98K31m74l67O25K32
2884C73o82M5N21k87k23M21P6n41R4N08l74j52M03J86n68R0M95m26k08K81J29
2905A61l95J80L35l48l32K32K75j86k20M03r7k60J87M75n46oJ98J86m09K04K89
2926C26k08l72K88L05k42m03M66k26j42K79J99l97j50N37L4n27K70K73m38l7K09
2947D4K97o30K10M50l86l38N08m0n35K86N18l18l16J92L79o46J26N09m32k16M40
2968A02M9m97M58K35l70j28K78qj38k56L56n8k35J66K30l12o0L05p7j71J33K04
2990B06k16Q1j16K68k01k5P9k7j86k2K64k97j4J54K85l06r1K95J6n88M88K11n17
$$ plain form
3013 -259 -153 288 2 -127 107 237 -152 -229 319 120 -239 147 27 -257 -136 194 -133 -377 -36 220
3033 220 -304 -188 217 -16 -309 127 257 -267 -28 235 28 -119 155 -23 -83 -133 208 15 129 119 29
3054 29 -24 -161 26 11 -182 -33 183 -41 -260 231 121 -68 -102 215 22 32 -20 173 -73 39 109 206 -258
3077 -258 21 147 -2 15 -28 186 -104 -206 208 158 -375 77 75 -37 -270 143 -98 -265 74 254 -210 -253
3099 -253 61 -16 -129 146 142 -158 54 247 3 -261 105 24 -93 -201 11 -32 -216 61 123 -235 -127 155
3121 155 136 -68 9 253 -229 -189 -1 122 -204 38 130 -121 39 41 121 -45 -96 90 -70 -197 49 86 69
3144 69 -260 -24 -55 -50 -125 155 -140 -155 192 27 -239 65 96 33 -155 232 65 -142 -79 -151 119 -115 123
3167 123 125 -340 -212 132 78 -118 107 155 -167 -31 11 -69 -286 130 120 -97 -129 -37 150 -79 130 43 -34 -135
$$ packed form
3013b59J06M41k86j29K34J30l89p7N48j99l59L86j20k84J21L30l27k44L41K56
3033B20n24J16M05k33k93M36J30n24K39K63k07j47K74j78o0n0L41j93J14j0r0
3054B9n3j37J87j5j93J49K16k24k19M91j10j89l4L17j93J0n2J93k46J12P0R7m64
3077b58K79J26j49J7m3K14k90j02M14n0n33M52kj12k33M13k41j67L39J80m64m3
3099b53L14p7j13K75ml00K12J93k44k64L66q1j17j08K12m3j84K77O2l58J08K82
3121A55j9k04P7K44m82M0J88J23l26K42R2k51J60KQ0j66n1J86j60j27K46L7j7
3144F9l29K36l1Np5K80k95j5L47j65k66L04L1o3j88L87j67k07O3p2K70k34K38
3167A23Km65J28L44n4j96K25M8l22J36M2q0k17M16j0k17l2R2J87k29K09q7p7j01
$$ plain form
3191 -135 214 -40 -114 -20 79 50 2 83 -36 -12 -127 83 119 -37 9 95 -115 -48 123 8 -291 -31 199 131
3215 131 -97 74 74 -36 -1 7 -33 -206 132 177 -98 -161 -39 13 -118 42 56 -204 -165 186 -43 -225 204 386
3239 386 -43 -252 193 -24 -172 -117 50 -112 42 250 -11 -109 -29 -2 71 -89 139 -25 -71 115 40 44 -12
3262 -12 174 49 -193 -116 67 -108 -119 -79 121 -70 -120 19 -163 24 -65 117 -50 -61 51 89 -131 106 -49
3285 -49 -74 44 -13 -31 37 -27 75 -16 -143 64 -24 -153 -153 -75 -20 -113 -23 80 -118 44 242 -88 -179 131 135 -33
3311 -33 -115 163 43 23 6 -26 -99 -155 -32 -6 -267 -29 43 55 -22 -22 -19 97 -107 -20 -14 64 276 69 -263 -54
3337 -54 138 -37 -65 85 112 -127 -95 92 -203 282 96 6 -68 214 322 57 27 109 -2 -121 -36 -42 64 -47
3361 -47 236 119 -146 -37 33 -91 -98 86 44 -54 99 136 -187 -45 250 128 58 -148 82 -86 -66 -204 277
$$ packed form
3191a35L49k54p4R4R9k9m8Q1j19K4j15K10L6j56M6Q6k10O7J71j15k99K60K30o8
3215A31k28J71%j10L5Qm0j73L38M5k75o3J22N2j31J60J4k60L9L51k29j82M29J82
3239C86m29k09M45k17j48N5J67j62J54K08k61r8Q0K7P3j60K28j64m6J86p5Mn6
3262a2J86j25k42P7J83j75j1M0K00j91n0J39j82J87q9J82j67j1J12L8k20K37j55
3285d9k5J18n7j8O8o4J02r1j27K07q8j29%P8N5r3R0J03j98J62J98l30r1L10Mj68
3311c3q2K78j20k0j7l2p3n6J23K6k61K38P2J2p7%LJ16k04Q7OP8K12k07l32K09
3337e4J92j75k8J50K7k39L2J87k95M85j86r0p4K82J08k65l0Q2j11j19Q5oJ06j11
3361d7K83j17k65J09P0j24pJ84m2r8J53L7l23J42K95j22p0k06K30j68K0j38M81
$$ plain form
3384 277 58 -155 52 49 117 -88 -2 -186 -86 -193 -52 -119 40 48 22 18 -148 -45 -153 -318 -26 -33 -230 -240
3408 -240 281 -20 11 -118 194 -260 -106 39 162 20 126 181 -81 -208 186 93 -188 23 0 -53 -365 217
3430 217 -32 -148 70 123 -129 -6 375 9 -59 71 185 -324 -41 136 61 -118 -104 -8 -150 66 127 -54
3452 -54 26 3 87 -160 2 35 -165 -111 31 112 -36 34 97 143 -210 -43 -204 29 -113 -139 59 -256 -46 77
3476 77 -71 63 -224 155 52 -200 32 236 -26 -260 65 16 -183 5 149 14 -164 91 -58 -26 -119
3497 -119 -98 -110 -185 76 -72 -68 76 117 -137 -113 55 -25 -149 0 104 41 -95 -60 112 -160 36 108 21 -104
3521 -104 144 138 -161 51 41 91 -83 -8 27 -57 -18 13 -23 -54 0 -38 54 -55 -47 -40 -73 41 134 -112 85 11 100
3548 100 -62 -78 48 -96 44 -25 216 58 -21 -52 56 -6 55 268 -92 -234 110 65 168 172 58 -33 -126 99
$$ packed form
3384B77k19k13K07lO8k05Q6j84J00j07J41o7J59Qk6mj66J03j08j65K92pj97j0
3408b40N21l01L1j29L12m54J54J45J23j42J06N5k62j27L94r3k81K11k3n3l12N82
3430B17k49j16K18N3k52J23L81l66o8J30J14n09K83J77p5j79J4R6j42K16O1j81
3452e4Q0k3Q4k47J62L3k00N4J42Q1j48P0O3M6l53J67j61K33j42k6J98l15K10J23
3476G7j48J34k87L79j03k52K32K04k62k34L25m9j99J88J44j35j78K55j49L2r3
3497a19K1j2p5K61j48MJ44M1k54K4J68q0j24J49J04o3j36L5J72k72J96P2q7j25
3521a04K48ok99K12j0N0j74P5L5q4L9L1l6l1N4l8R2j09QPl3J14R3k46J97p4Q9
3548A00j62j6J26j44J40o9K41j58p9l1J08o2O1K13l60j42L44m5J03Mj14r1r3K25
$$ plain form
3572 99 146 49 3 80 61 -80 40 42 -55 113 207 -68 -98 181 92 -167 113 89 116 69 -106 -124 -38 129 82 40
3598 40 209 150 -64 -25 26 72 -66 -37 -75 180 20 83 31 -60 -203 70 175 31 -111 136 7 60 -43 -112
3622 -112 110 -33 66 172 158 49 -63 -34 105 112 86 82 -238 114 -23 -219 -33 59 -18 -25 186 -14 -96 -22 163
3647 163 27 -61 138 77 -162 41 69 -133 -148 146 -66 -55 89 76 -90 -30 155 54 -96 30 97 -219 -39
3670 -39 79 -247 -39 88 -213 -99 -66 19 -101 -108 203 -25 54 -82 -39 25 -105 162 -66 79 58 57 84 -83
3694 -83 -114 58 -6 -67 -171 -38 48 205 -130 205 138 -83 253 191 -185 -62 76 28 21 148 8 -348 58
3717 58 -3 -205 -181 5 2 -50 38 12 -70 54 186 82 -156 -51 -56 -175 -2 118 56 -42 -55 61 -58 -65 48
3742 48 -13 -208 -13 14 -118 143 73 -10 40 -182 114 -98 42 43 83 -129 150 4 77 -12 -63 193 -13 -123
$$ packed form
3572I9M7r7m6P7j9j41J20Kr7J68R4k75l0K79q9k59K80k4K7m7j75j8Q6J67m7m2
3598D0J69n9k14L9N1M6j38K9l8K55j60O3n2r1j43K73J05j44j42K47j29N3j03o9
3622a12K22j43R9J06j4j09j12K9J39Pk6ml20L52j37j96J86R2p7pK11k00q2P4J85
3647A63j36q8J99o1k39K03K8k02j5K94k12J1J44j3j66O0J85j01j50J26O7l16J80
3670c9J18l26K08J27l01J14L3Q5j20pL11k28P9j36M3O4j30K67k28J45k1jK7j67
3694h3l1J72o4o1j04J33Q6J57l35L35o7k21L36o2l76J23J38m8pJ27j40l56M06
3717E8o1k02K4J86ln2Q8k6q2J24J32j04k38J05nj19J73J20o2r8j3J16j19pJ13
3742D8o1j95J95K7j32K61p0q3N0k22K96k12J40JM0k12K79j46P3q9n1K56k06j10
$$ plain form
3766 -123 60 144 -2 46 6 0 79 -104 55 -94 31 62 11 127 57 -107 -84 -143 -96 -194 89 135 -12 -3 24 71
3792 71 4 -180 -150 46 -140 -124 129 -18 -60 57 125 -39 -72 81 -79 -35 -84 90 -72 -49 30 7 -9 -48 -82
3817 -82 54 -86 177 184 146 9 -128 60 91 -121 -29 -6 -129 30 -59 -28 -86 -59 -186 -104 30 11 43 105 -273
3842 -273 28 61 184 -123 176 29 -23 -86 -114 80 -29 47 -17 29 -120 -87 65 -27 34 -66 -161 -12 187 -57
3866 -57 112 -37 -83 29 36 161 115 112 67 -113 -10 65 -114 -86 -99 -13 -190 99 5 -16 70 -88 -54 -43 149 -42
3892 -42 -50 -63 -176 65 -51 21 -29 126 -163 -26 -94 -143 155 -76 -155 10 18 4 80 -114 73 -109 -15 214 -133
3917 -133 -29 -48 21 -79 -2 -126 105 -81 73 -6 -207 -55 -128 44 -203 15 66 -9 67 -114 45 -3 112
3940 112 -81 -86 57 88 9 -55 -120 43 -16 -132 -18 47 -20 -4 12 -95 175 0 -16 -186 46 30 -101 -74 33
$$ packed form
3766a23J83Q4j46M8m0oP9j83J59j49J25L1n1J16p0j64K3n9M7r8K83M6j47RK7M7
3792G1o7j84L0J96j86J6K53j47m2J17O8j64l3J53j60M4m9J74j62K3P9k3j6l9l4
3817h2J36j40K63Pl8j37j37J88L1k12R2K3j23J59q9L1n8K7j27Q2J34j9L2O2l78
3842b73L01L3J23l07K99j47n2o3k8J94j09P6o4M6j49L3J52r2O1j00r5J49J99k44
3866e7J69j49m6J12PJ25m6lm5j80J03P5j79K8j3Q6j77K89r4k1Q6j58L4J1J92j91
3892d2qj3j13K41j16P2n0J55k89J37o8m9K98k31p9J65Qj4P6j94J87j82R4K29l47
3917a33J04j9O9j00P7j24K31j86J54p9k01J52p3J72k47K18N1p5P6j81J59m8J15
3940A12j93nJ43L1p9o4o5J63n9j16J14O5o7J6J6j07K70j75j6j70K32j6j31K7J07
$$ plain form
3965 33 50 106 -140 50 -28 -91 212 46 42 -121 98 37 31 17 38 214 -69 -12 -42 165 -8 -25 94 -32 92
3990 92 15 70 -60 -12 2 -88 45 -44 -60 -146 -48 -67 198 128 -125 66 68 48 140 -95 -5 48 14 142 91 27 -70
4017 -70 -49 59 87 -183 91 -86 -152 -211 105 -132 -96 9 50 72 2 104 -39 -52 22 43 -98 -84 -109 30 -39
4042 -39 -28 40 53 6 -113 84 154 58 99 36 155 74 -58 133 -9 48 -16 81 208 -43 -74 49 -31 -94 -21 101
4068 101 -56 31 -47 84 -109 -4 13 146 -91 127 -32 -32 -24 61 79 -78 -13 -92 119 -164 -19 30 119 -9
4092 -9 44 -159 112 -46 146 145 6 12 13 60 67 58 2 37 63 -109 -128 -25 84 18 -44 -31 138 -9 -70 69 -38
4119 -38 -71 -181 74 -51 -55 -85 -51 25 88 143 48 -75 -54 -83 -140 -36 99 -2 101 246 -68 56 -116 79
4143 79 -40 -107 30 86 52 -161 -9 7 39 -30 29 -104 -40 29 81 -76 120 -181 -137 -32 51 20 -28 18 -71 138
$$ packed form
3965C3J7N6k46J90p8o3L03j66mj63K19o1oj4K1J76k83N7l0K07j73j7J19j26J24
3990I2p7N5j30M8J4r0J33q9j6q6R8j9K65p0k53J91Kk0R2k35R0N3l4J28n1o4r7
4017g0K1J08K8k70K74j77o6n9L16k37L6J05M1K2p0J02j43j3P4K1j41J4k5J39o9
4042c9J1O8J3m7j19J97P0r6M1o3J19q1j32J91j42N7o4R7J27k51l1J23q0o3P3J22
4068A01j57Q7p8J31j93J05J7J33k37K18j59%QQ5J8j57O5p9K11k83J45M9Q9j28
4092iN3k03K71j58J92jj39OJM7Prn6L5K6j72j9J03J09o6o2J3J69j47o1J39j07
4119c8l3j10K55j25ml0L4P6O3N5r5j23K1k9n7J04J35j01J03J45l14J24j72J95
4143G9j19o7J37N6l4k13J52J6L2o9N9j33O4O9N2j57J96l01M4J05Q3l1m8M6q9K09
$$ plain form
4169 138 20 113 -31 127 -40 -18 5 -20 64 -9 -47 -133 133 10 279 -82 69 -104 8 91 -80 -158 53
4192 53 -7 -111 -9 55 164 -115 44 33 -92 -90 116 32 -75 -61 39 147 -90 3 -85 -20 -92 87 -101 -23
4216 -23 -35 76 -66 -155 -15 253 58 132 -103 -11 37 73 102 2 101 42 33 92 63 -137 61 -77 74 96 -205
4241 -205 -29 86 -46 -119 55 -133 -92 -50 66 -269 -72 7 114 -20 -87 -130 91 82 91 99 -90 -33 -2 134 -38
4266 -38 62 -120 -99 25 33 20 213 188 -84 -141 -105 54 5 -146 45 21 -134 30 12 -55 -69 2 -50 -119 74
4291 74 28 168 -111 -97 -155 81 14 -10 -146 -25 86 -5 32 -12 -32 93 74 131 51 -57 21 37 96 -103 226
4316 226 2 21 8 -94 13 229 -4 -52 158 -23 60 100 23 -149 43 -153 -27 -122 62 122 -83 -39 -23
4339 -23 -26 11 117 -63 -2 137 79 83 42 135 74 60 -15 188 -99 -66 -5 -88 -80 253 47 -27 63 -73 -231 -98 52
$$ packed form
4169A38j18R3j44J58j67K2K3k5Q4p3l8q6K66j23K69l61J51j73J12Q3j71p8K11
4192E3o0j04J02O4J09k79J59j1j25KK06q4j07J4J00J08k37R3q8O5p2J79j88P8
4216b3j2J11j42q9J40K68j95P4k35R2M8L6K9j00R9n9rN9k9k00J98j38J51K2l01
4241b05J76J15j32p3J74j88M1M2J16l35J97P9J07j34o7m3K21rRQj89N7L1J36j72
4266c8J00j82K1J24Qj3J93k5k72n7L6J59m9j51J91k4j55J64j8o7j4P1n2o9J93
4291G4m6J40k79J4n8K36o7k4j36J21J11r1L7m4k0J25j9N7q0j08P8J6N9j99L29
4316B26k24J9j3j02J07K16k33m8K10j81Q3M0p7j72J92j96J26r5J84O0k05M4J6
4339b3lL7J06j80O1J39n8Mm1R3o1j4p5K03k87L3O1q3QL33k06p4R0j36j58J33J50
$$ plain form
4366 52 -209 20 54 88 -53 -163 7 -109 -59 46 2 -40 31 -9 -59 35 -23 69 -14 -75 -56 48 -184 20 -88
4391 -88 48 -12 50 -46 -63 45 -115 -65 -83 33 6 126 111 -138 -3 78 -203 233 43 -139 -1 -32 -74 81
4415 81 -2 102 -47 131 114 68 -112 114 -87 -86 140 -37 -26 -116 147 -8 66 25 0 -74 138 -169 -84 93
4439 93 116 33 -128 -41 48 -158 8 -103 79 -57 -96 132 -58 146 -61 137 42 -7 54 26 92 -128 137 73
4463 73 -75 -75 11 154 18 41 18 65 83 -97 128 -2 15 89 -49 69 100 16 38 155 180 86 -40 -94 -99 -101 79
4490 79 88 -206 119 -46 39 -79 -19 155 18 4 -70 84 -100 -115 -122 38 -73 -115 -19 -145 -217 89 -102 -44 12
4515 12 -34 125 -93 41 92 -141 -166 34 -79 84 -20 41 -83 47 46 110 -54 -51 90 135 31 -27 15 27 23
4540 23 43 13 -3 49 18 -25 80 -14 78 -53 63 45 -108 -47 -27 4 99 72 -13 75 -167 83 1 -75 55 76 -20
$$ packed form
4366E2k61K29L4L4j41j10J70j16N0J05m4m2P1m0n0R4n8R2q3o1J9J04k32K04j08
4391h8J36o0O2r6j7J08j60N0j8J16k7J20j5k49J35Q1k81M36j90j82J38l1m2J55
4415H1q3J04j49J78j7m6j80K26k01JK26j77J1r0K63j55P4m1k5p4K12l07Q5J77
4439I3K3q3j61Q7Q9k06J66j11J82j36l9K28j90K04k07J98r5m9O1k8O6k20K65o4
4463G3j48%Q6J43j36K3k3M7J8j80K25j30J7P4j38J18L1q4K2J17K5r4j26n4nkJ80
4490G9Rk94L25j65Q5j18O0J74j37j4p4J54j84j5pJ60j11m2R6j26p2L06j91N8N6
4515A2m6J59k18J34N1k33k5K00j13J63j04O1j24J30jO4j64LJ41M5j04n8M2J2m
4540B3K0l0j6N2l1m3J05r4R2j31J16j8j53O1K0L1R5k7q5Q8k42K50q2p6J30K1r6
$$ plain form
4567 -20 119 -11 17 52 -16 38 70 147 134 -117 -107 -75 123 61 -42 35 66 -127 21 92 48 55 4 -47 134 92 -67
4594 -67 219 -103 -160 -19 -9 -23 145 103 0 29 122 101 14 107 56 90 25 -79 191 1 -179 -39 107 42 13
4619 13 30 -9 173 99 -11 -83 -60 -25 150 -3 -86 42 -107 5 -31 128 -32 -51 25 92 15 25 99 -22 -71
4644 -71 -75 8 -29 -30 89 -95 6 -2 -126 -160 45 8 -68 31 16 -3 -116 105 -133 179 -42 70 132 76 21 -54
4670 -54 188 122 16 54 -14 -151 -82 -44 -36 113 89 -30 -86 37 -77 257 -129 -127 -50 20 -158 8 110 -24 132
4695 132 -93 52 -25 -14 -9 -49 81 155 64 100 -138 -84 -18 -58 -96 -2 52 42 112 15 -4 -192 45 15 68 -12 -20 -90
4723 -90 45 12 5 115 -12 137 -108 -124 34 88 -135 102 141 213 -121 -150 -172 -122 104 -147 130 40 79 -38
4747 -38 47 15 60 -24 -137 76 -68 -82 -225 93 -131 -73 -23 -80 -187 -3 29 36 145 -51 70 -215 59 76
$$ packed form
4567b0J39j30K8L5o8N4L2P7j3k51J0L2J98o2j03P7L1j93J48P1m4Pn1n1J81m2j59
4594f7K86l22n7J41J0j4J68m2j03K9R3k1q7R3n1L4o5j04K70j90j80J40J46o5k9
4619A3J7l9J82p4j10p2K3L5J75j53q3J28j49J12l6J59j60j9P6O7p7J0P4j21m9
4644g1mQ3l7jJ19j84J01qj24l4K05l7p6R9j5j9j13K21k38L12k21J12O2n6n5p5
4670e4K42o6j06L8o8j37O9L8QJ49k4j19n6J23j14L34l86KP7P0j78J66J02j34J56
4695A32k25J45p7J1Nm0J30P4r1L6k38N4O6m0l8R4N4j0P0r7j9j88K37l0N3q0qp0
4723i0J35l3pJ10j27J49k45j6J58N4k23K37L9P2l34k9k2N0K26k51K77r0L9j17
4747c8Q5l2M5q4j13K13j44j4j43L18k24N8N0n7j07J84L2PJ09j96J21k85K74J7
$$ plain form
4771 76 22 -195 67 -54 -193 -32 79 24 -62 85 -177 -148 51 159 -61 -41 18 48 -46 -11 111 -2 68 -21
4795 -21 38 39 125 -184 111 25 -58 107 -185 46 -107 -49 -12 -90 14 145 -126 143 -18 -10 -59 8 32 -62 42
4820 42 79 -47 -26 -78 72 -116 -216 -75 99 -84 31 -3 -72 -15 -61 21 20 24 -5 197 70 -21 -136 -68 -154 25
4846 25 -144 82 228 -159 44 -32 92 131 38 -64 53 150 -53 -70 94 -95 -14 -108 3 -44 -15 -13 35 104 19
4871 19 15 -90 117 -81 -10 -2 12 -2 -97 175 19 43 160 179 13 60 -107 -102 106 22 -84 -2 97 -160 27 -37
4897 -37 13 -35 68 8 105 9 33 -28 43 -67 -93 -21 134 31 -1 -122 40 -14 -59 37 -43 -45 -63 -29 57 -110 37
4924 37 16 21 -48 -84 -53 -310 20 32 -30 -84 90 -22 -22 10 -63 -11 19 -56 96 -27 19 -100 -9 -10 0 0 -149 135
4952 135 -34 -172 116 115 -38 5 41 34 -105 -40 -89 -140 88 29 157 -104 -51 -85 68 -209 70 59 51 101 197 -3
$$ packed form
4771G6n4k17K62j21j39J61J11n5q6J47k62K9J99J08k20K0N9L0r4L5J22j13P0q9
4795b1N9JQ6l09K95q6q3J65k92K31j53N8L7p8J04J31k71K69j61Qm9O7K4r4J04
4820D2L7j26K1n2J50j88j00J41J74j83J15l4o9N7m6Q2jMk9K02j27r1j15O8q6J79
4846B5j69K26J46l87K03p6J24L9r3j02J17R7k03j7J64j89Q1r4J11m7K9KM8O9q5
4871A9mj05K07j98P1QJ4j4r5K72j56K4J17J9j66M7j67NK08q4j06Q2R9k57J87o4
4897c7N0m8J03o0R7r6K4o1P1j10k6P2J55j03l2j21J62n4m5R6q0kj8L4Q6j67J47
4924C7k1No9l6L1k57L30J2o2n4J74j12%L2p3N2L0p5J52j23M6j19R1jJ0%j49K84
4952A35j69j38K88jj53M3L6pj39O5m9n1K28n9J28k61N3l4J53k77K79j1qN0R6k00
$$ plain form
4978 -3 -174 44 17 39 118 140 -115 54 -7 -78 -84 -34 46 -31 -40 -7 -35 8 174 -62 -81 -39 53 -99 -77 -47 -246 5
5006 5 4 15 92 -173 95 -119 60 -7 136 -21 -199 28 127 69 14 82 -85 110 29 54 -40 222 -78 42 62
5031 62 40 4 -19 21 -54 -30 -69 19 -8 -83 100 57 -183 -70 12 -106 -12 -120 -59 1 -39 -56 -142 218 -80 -86 5
5058 5 45 1 67 -110 -104 -116 -71 -5 30 -10 -48 18 -157 -38 31 -35 -98 -63 202 -85 234 49 -35 59 41 155 24
5085 24 -18 41 -222 -32 -14 -6 -90 -68 90 172 136 54 63 -128 71 -35 15 -102 124 -37 -105 88 -56 23 -12 67
5111 67 -99 39 117 18 -124 -20 117 222 60 -138 -50 76 -74 22 -80 -10 70 -38 3 146 170 102 -1
5134 -1 20 -136 17 -176 -46 -85 -93 -32 -88 -59 64 -25 41 194 -206 29 111 31 54 -157 -85 -46 58 89 30 -77
5160 -77 -108 30 39 -50 -87 31 -121 64 52 -31 -65 42 -13 57 4 -97 31 -133 32 21 33 153 -28 82 22
$$ packed form
4978cj71K18k7K2P9K2k55J69o1p1oN0Q0p7rL3k8M3J66k36j9M2R2j52K2L0j99K51
5006EjJ1P7k65K68k14J79o7J43j57j78K27R9n8n5O8j67J95q1K5r4K62l00J20K0
5031F2k2l6k3M0p5K4l9Q8k7p5J83m3k40J13Q2j18R4j08O1O0m0j7q6L60k98oR1
5058EM0m4O6j77Oj2M5O6L5m0l8O6j75J19O9o6o3L5K65k87L19j85q4R4j8J14j31
5085B4m2N9k63J90J8Qq4K2J58Q2l6q2Rj91J99j06N0j17K26j61o8J93j44P9l5P9
5111F7j66J38P8r9j42J04J37J05j62j98Q8J26j50R6j02P0Q0j08M1J43K4o8j03
5134aK1j56J53j93J30l9qO1n6K9J23q9O6J53m00K35Q2q0K3k11P2L9J04L1n9j07
5160g7l1J38Rq9l7J18j52J85j2q3l4J07n5P0n3j01J28j64J65j1J2J20j81J10o0
$$ plain form
5185 22 119 25 -129 30 7 41 -20 -52 -65 145 -163 65 17 154 -141 11 -42 169 6 -47 -203 31 102 -28
5209 -28 14 -148 112 74 -26 -69 66 -103 1 -149 52 9 -164 -97 171 -51 -111 -67 -69 -74 -88 -10 13 -94 -144
5234 -144 -50 88 -112 36 83 153 -42 -117 185 -91 88 -96 -60 -34 -65 -11 94 -63 6 110 26 -53 -115 -5
5258 -5 -122 -35 117 75 67 92 78 -76 -68 111 -63 -205 198 -49 -47 56 78 -47 17 -84 135 -33 -251 -135 26
5283 26 -4 44 87 67 -21 49 34 -163 8 201 -79 75 68 -65 -83 115 45 -70 122 43 115 -96 -62 -119 -111 -108 -15
5310 -15 -11 -44 -5 45 -35 22 35 -20 -53 -33 -4 48 84 9 89 72 -52 -76 8 126 1 -68 -51 29 -51 -39 31 -97 -79
5339 -79 -106 183 100 100 55 -48 56 -43 -9 -59 114 -104 44 -13 -37 54 -3 -65 54 -96 -104 94 -115 0 -13 206
5365 206 36 30 29 0 8 -55 41 -17 -14 65 -137 115 22 98 -9 -167 -164 -4 -28 -43 -39 101 107 170 -14 32 14 -57 16
$$ packed form
5185B2R7r4j54J59k3L4o1l2j3K10l08K28m8J37k95J52n3K11j63n3j56K34P1j30
5209b8M2j62K60l8j00m3J35j69J04j50K01m3j73O7K68k22o0M4knj4P8K3j07n0
5234a44R4J38k00J48M7P0j95p5L02k76J79j84L6K6l1N4J05j57O9J04q4p9o2J10
5258ej17Q7J52m2qK5j4j54QJ79j74j42M03k47KJ03K2j25O4j01K19j68k18J16J61
5283B6l0M8M3k0q8P0j5j97J71J93k80J54pj33j8J98p0j15J92p9P2k11L4n7QLR3
5310a5Ml3L9N0q0N7J3n5l3K0K9N2L6p5Q0j7j24k4Q4J18j25o9J7Q0q0J2P0j28J8
5339g9k7K89q3%m5j03J04r9L4n0J73k18J48n7k4R1n7o2J19j50qJ98k09J15j3K19
5365B06j70ojk9Qo3R6n8LP9k02K52r3P6j07j58LJ60k4j5MJ40OO3j84M6j8p1P3
$$ plain form
5394 16 -94 74 2 105 43 -100 183 19 -1 -3 -64 37 -55 -121 -79 -35 -12 -87 45 -154 -161 97 -142 -5 -135
5419 -135 -50 109 70 -16 -86 -133 21 27 -51 82 78 99 43 188 21 -145 20 49 -8 -58 -83 124 66 4 3 102 38
5446 38 -151 -52 -95 -31 -30 6 -43 -73 -153 -32 253 -43 -40 -203 -16 -61 130 -111 45 4 -19 -18 12 -56 -50 68 -207
5473 -207 -13 -127 -14 144 1 100 -60 51 5 110 36 -21 218 87 -25 137 29 32 252 3 -84 -29 -108
5496 -108 81 -14 120 90 113 -149 40 -193 -176 32 -78 111 108 -55 -26 212 -80 -51 51 -20 -34 -56 -11 108
5520 108 87 -78 7 82 80 -51 -23 16 31 154 44 -86 151 58 56 24 -60 -24 103 27 -52 4 19 173 130 -26
5546 -26 -39 -142 131 96 80 38 -127 -32 -64 45 -157 8 -88 7 122 -16 137 -72 -117 -39 145 -31 85 171
5570 171 -92 -131 -86 16 -61 35 -24 -81 11 -8 -112 -33 -8 25 37 -121 103 -14 -50 104 115 25 -20 106 -27
$$ packed form
5394A6j10J68p2J03o2j43K83j64k0ko1J01r2o6M2M4K3p5J32j99pK58k39J37j30
5419a35Q5J59l9q6p0m7J54Op8J33mK1n6J45j67j66J65K9n7n0k5K07n8o2jR9o4
5446C8j89R9m3O4JL6m9l0q0J21K85k96Lj63J87m5J91k41J56m1k3JL0o8OJ18k75
5473b07J94j14J13J58j43R9j60J11m6J05p4n7K39j31j12J62j08LK20k49q7N5p9
5496a08J89r5J34l0K3k62J89k33J7K08j10J89lj63K9K38k92K9J02p1j4k2M5J19
5520A08k1j65Q5P5kj31K8L9J5J23j10j30K37r3kl2q4L6J27p6p9N6J5J54m3j56
5546b6j3j03K73l5j6m2j65R5l2J09k02J65r6R5J15j38J53k09m5P8J84j76J16Q6
5570A71k63l9M5J02p7R6n9n7R2j9j04P9K5L3J2j58K24j17l6J54J1r0m5J26j33
$$ plain form
5595 -27 8 125 44 -133 132 -140 -47 -73 -90 -25 53 -85 46 190 -49 -1 -42 4 -31 -133 -14 -210 19 271
5619 271 -18 147 -31 -95 28 97 -3 -100 -21 45 58 80 -88 39 31 -118 -123 -76 59 -6 -133 -45 108 -92 -7
5644 -7 159 -19 113 131 14 -58 126 73 207 -38 95 112 133 -101 -94 -21 42 -18 212 63 11 51 -29 109 -137
5669 -137 -102 56 -64 136 101 51 -110 -57 -93 -67 176 -130 -92 -26 -43 96 -54 -91 51 23 -38 -184 6 -37
5693 -37 26 186 166 -37 -13 72 18 47 37 -109 -28 138 -76 -50 -9 -84 82 23 84 135 13 103 87 -159 4 22
5719 22 75 84 44 28 -47 -86 12 -124 -31 154 -124 -2 66 52 56 -50 -206 65 35 3 -160 -142 -3 -87 22 -67
5745 -67 1 -30 44 -83 27 77 -68 152 -57 -9 -41 41 100 -89 8 -40 52 -130 72 74 64 -91 -54 -14 -16 27 -59
5772 -59 183 -75 27 -46 18 -30 70 190 171 105 -217 98 41 59 -237 -115 17 63 -51 7 -176 32 44 -39
$$ packed form
5595b7L5J17q1j77K65k72R3k6j7O5P8j38J31J44k39M8m1M6l5j02J19j96K29K52
5619B71k89J65j78o4J23O9j00r7P9O6J3K2j68J27qj49nM7J35o5j27Q8J53k00Q5
5644gJ66j78J32J8j17p2J84n3J34k45J33J7K1k34PP3O3o0K30j49n2M0q0J38k46
5669a37L5J58j20K00l5n0j61N3l6K6K43l06L8O6j7J39j50l7J42k8o1j46J90m3
5693c7O3J60k0k03K4Q5n4K9j0j46Q1J66k14K6M1p5J66n9O1N1j22R0j6k46J63J8
5719B2N3Rm0j6p5l9R8j36R3J85k78J22O8j4Mj06j56K71l0l2j63J8J39q4J09q9
5745f7O8l1P4j27J10N0j45K20k09M8l2Q2N9j89R7m8R2j82K02Kj0j55L7M0kM3q6
5772e9K42k58J02p3O4m8J00J20j9o6l22L15n7J8k96J22J32M6j14N8j83K08J2q3
$$ plain form
5796 -39 -39 49 -123 -74 42 -19 -49 120 45 -101 199 100 -78 -19 -3 -4 30 167 -117 -88 133 110 22 -60 -48 51 7
5823 7 -113 157 6 -102 42 -113 27 -59 133 119 108 -91 39 232 -72 1 -51 -58 3 -78 86 -76 39 19
5847 19 -79 -103 -99 -1 -45 -50 17 33 14 -3 -63 -1 88 49 11 -1 4 3 30 -19 12 -30 118 -94 -11 36 133 160 150 51 -17
5878 -17 -93 166 101 -57 -69 62 -16 25 99 24 19 -194 85 -33 -19 60 -36 68 53 20 67 94 87 2 -7 105 -34
5905 -34 -103 -9 -95 11 80 -216 76 -17 -64 1 -17 -144 125 -5 123 -151 -190 -130 17 -51 26 107 92 55 54 -31
5931 -31 -5 -129 14 40 121 10 16 -142 -88 127 -95 -121 -238 29 -111 24 40 20 -1 -165 -180 81 -17 141
5955 141 61 20 -80 45 -63 83 -45 88 -41 28 -70 -69 28 -12 64 -69 8 48 66 24 -58 116 26 115 -45
5980 -45 -118 -103 -35 -66 32 -116 92 76 82 86 -83 36 -102 51 -67 112 57 -3 52 -92 -90 -53 -26 63 14 -11 -34
$$ packed form
5796c9%Q8j72M9J16o1l0J69p5j46L00r9j78N9J6jL4J37k84K9K21k3q8q2J2R9m4
5823Gj20K70j51j08J44j55J40q6J92j4j1j99J30J93l04P3n2pO1q1J64j62J15k0
5847A9r8k4MR8m4nO7J6j9j7o0O2Q9l9l8j2NjK7m9L1m2J48k12Q3M7R7K7j0r9o8
5878a7p6K59o5j58j2J31p8M1P4p5nk13K79j18J4P9r6J04j5l3M7K7pq5rJ12j39
5905c4o9R4q6J06O9k96K92r3m7O5j8j27K69j30J28k74l9O0J47o8P7Q1j5l7jq5
5931c1K6j24J43K6Q1j11Oj58N4K15k22k6j17K67j40J35J6k0k1j64j5K61r8J58
5955A41q0m1j00J25j08J46j28J33j29O9r8JR7m0P6j33P7M0J8m2q2J74r0Q9j60
5980d5p3J5O8l1R8j48K08j6OMj69J19j38J53j18J79n5o0N5j44KL7K7Q9m9k5k3
$$ plain form
6007 -34 -29 -42 84 -193 -77 -15 100 -121 -189 35 -48 -72 129 -44 155 -150 -25 183 9 -72 -42 73 13 62
6031 62 177 41 -41 -15 -145 -140 -32 -97 9 -101 -45 102 79 34 -212 -9 -79 20 -114 -151 32 23 44 -4 -113
6056 -113 11 -66 16 122 -7 128 43 -70 -49 76 -64 32 -122 -91 -84 -42 14 40 47 85 -11 61 -205 -54 22 157
6082 157 -58 18 -20 66 -65 0 24 -202 -81 -99 -55 -13 -124 43 -8 -47 -7 -51 42 32 -145 -30 -58 -46 -43 -55
6108 -55 32 71 15 104 -61 -162 -54 -107 -133 -143 -115 105 153 12 23 48 -51 -95 64 -4 -138 51 5 -37 -57 168
6134 168 -37 53 -15 -121 -191 -142 184 -35 -152 38 -71 25 18 -35 -64 95 12 9 -43 -82 -244 -82 -91 51 122 -79
6160 -79 -134 -8 109 -95 103 -25 227 -21 -47 1 -73 -6 95 128 -16 50 92 85 26 77 78 -3 -44 133 -60 23
6186 23 -14 -37 -56 -22 3 62 6 15 -118 21 -202 55 169 47 -25 -57 -30 19 31 -133 -67 -142 130 252 -172 18
$$ packed form
6007c4Nj3J26k77J16O2J15k21o8K24q3k4K01j73J99l05J25K08j74q1L0J15o0M9
6031F2J15j36q2K6j30NJ08o5J06j10N6J47k3m5k46K03p0R9j34l7J83rK1m8j09
6056a13J24p7Q2J06j29J35q5j13K1J25j40R6j54L1PM2N6K6PL8r6P2k66J51P6J35
6082A57k15P6l8Q6j31O5K4k26J21j8M4M2j11J67n1l9M0m4R3j0j77J15k8J2Lj2
6108e5Q7L9n6Q9j65j01J08n3k6j0K8K20M8j41J1K5r9m4J59o8j34J89m6m2k0K25
6134A68k05R0o8j06p0M9L26k19j17J90j09R6pn3k9J59q3ln2l9j62J62rJ42P1k01
6160g9n5J26J17k04J98j28K52k48k6M8p4O7J01L3j44O6M2pn9N1Jq1m1J77j93Q3
6186B3l7k3j9L4K5N9n6Rj33J39k23K57J14j22p2l2K7M9J2j64O6p5K72J22m24J90
$$ plain form
6212 18 79 -23 48 -37 -20 -74 58 -109 24 -98 147 -34 -56 23 5 133 -76 -75 41 -85 45 121 17 -52
6236 -52 -3 147 -121 -53 -160 74 70 27 -65 99 -90 -66 19 80 -24 -2 -72 -137 -31 110 -28 -49 35 77 -126
6261 -126 2 -69 58 -84 -2 154 93 53 -45 83 11 -43 -200 145 -17 22 43 46 -2 -5 -9 32 -81 15 -50 -114 44
6288 44 40 68 -52 39 26 -44 -86 65 121 4 -139 25 77 63 162 49 -102 45 12 -33 -150 43 42 -146 67
6313 67 -1 20 4 17 40 67 -231 84 109 17 99 -35 -67 51 -140 -56 47 -111 71 -53 40 101 -29 66 -85
6338 -85 26 27 38 131 -120 78 -60 -138 36 300 85 19 47 -154 22 -83 180 63 11 23 204 223 -152 143
6362 143 81 -37 -15 0 69 116 -91 -67 101 158 -32 37 142 84 259 45 -130 -56 30 -68 -67 -54 39 17 8 89 -171
6389 -171 -80 103 -109 -24 -90 115 78 110 -31 32 -82 118 22 -33 -177 0 68 104 104 -82 31 -20 13 -99 133
$$ packed form
6212A8O1j02P1q5J7n4J32j67J33j22K45j81k2P9j8J28k09JJ16j26J30P6j04o9
6236e2M9J50k68O8j07K34mm3r2J64j89K4Q5O1j04K2p0o5J06J41j38k1Q4M2k03
6261a26J28p1J27j42Q2J56o1m0r8J28p2n4j57L45j62L9K1Lm8lmM1j13R6o5o4J58
6288D4mK8j20R1j3p0m2J51N6j17j43J64N2j4R9j13j51J47l3m5j17J93jj88K13
6313F7o8K1j6J3K3K7k98L15K5r2Q2j34l2J18j91Q4J03j58J82j24R3O1j30R5j51
6338h5J11JJ1R3k51J98j38p8J74K64k15o6K8k01J76j05K63j17n2J2J81J9l75K95
6362A43o2j18K2J5O9M7k07K4J68N7j90O9J05n8J75k14j75P4Q6r8JJ3R3k2rQ1k60
6389a71R1J83k12Q5o6K05l7L2j41O3j14K00r6n5j44J77O8L6%j86J13n1L3j12K32
$$ plain form
6414 133 -114 124 -23 81 -174 98 -5 -40 -14 -96 138 -145 -22 72 77 -47 65 76 148 22 91 -147 -154 -61
6438 -61 70 -32 -114 21 9 90 -63 -100 59 115 -40 -170 -74 -82 61 34 24 176 109 -23 -52 -132 51 -26 -86
6463 -86 91 -121 104 -19 60 -195 -67 -118 -156 116 73 -76 -173 -148 -49 22 199 -22 -98 74 -185 -120 -24 64
6487 64 -10 120 77 -25 -156 -78 22 -30 -27 16 6 48 -56 -110 0 -169 69 -92 14 -163 21 6 -135 66
6511 66 -20 50 -27 60 1 59 0 -18 -98 88 120 -92 -120 19 -72 116 40 -94 -60 -97 4 -49 22 92 57 -35 39
6538 39 134 35 1 18 120 26 -5 97 -78 -116 -59 -16 72 -87 -57 -136 11 -6 3 31 -83 -48 -160 205 -29 132
6564 132 -83 68 -98 -152 61 -14 -34 -36 74 -53 -150 13 90 51 32 -66 -56 -35 -150 -31 -113 -82 106 -84 56
6589 56 42 62 41 173 50 -86 -30 -19 -91 145 -19 29 48 76 15 -163 36 -135 44 10 -144 35 -75 13
$$ packed form
6414A33k47K38j47J04k55K72j03l5K6q2K34k83J23R4Nj24J12J1P2j26O9k38pR3
6438f1J31j02q2J35j2Q1j53l7J59N6j55j30R6qJ43k7j0J52o7j32k9q0J83p7o0
6463h6J77k12K25j23P9k55J28n1l8K72m3j49r7K5R9P1J77k21p6J72k59O5R6Q8
6487F4p4J30m3j02j31P8J00n2LM3j0M2j04n4J10j69K38j61J06j77J84j5j41K01
6511F6q6P0p7Q7n9N8n9j8q0J86L2k12k8J39r1J88p6j34L4l7J01n3P1P0l5r2P4
6538C9R5r9l4J7J02r4l1J02j75l8N7M3Q8j59L0p9J47j7RK8j14L5j12L65k34J61
6564A32k15J51j66n4K13p5k0kJ10j27r7J63P7l9j9r8J0K1j15J19q2L1J88j90J40
6589E6j4K0k1J32j23j36N6J1p2K36j64M8J9K8o1j78J99j71J79l4j54J79j10Q8
$$ plain form
6613 13 -68 -4 20 116 -36 107 141 -66 55 49 -10 -160 -77 100 10 36 -130 -7 126 -49 -184 23 -90 199
6637 199 -36 40 -123 93 -105 9 -85 -2 71 -56 -52 -36 55 -132 -10 23 117 -142 75 104 36 -60 35 13 -12
6662 -12 144 1 -271 -1 58 -74 -30 0 75 49 -96 -223 -74 -96 -43 -65 20 70 152 -69 30 -119 94 -110
6686 -110 22 73 -12 34 55 110 13 27 -64 -108 27 185 62 3 15 28 60 -6 107 -63 70 -22 104 -45 -158
6711 -158 -142 16 -23 39 49 -245 197 -73 -46 -29 -31 57 65 27 35 -133 55 106 -1 7 -200 -17 85 -163 59 -88
6737 -88 -21 -73 -38 -40 100 18 87 101 -10 86 -140 -104 -119 158 -62 -82 -110 -39 -167 94 -50 -12 2 62 -48 -71
6763 -71 73 -15 45 115 -221 74 39 -169 -14 -22 169 -140 127 8 4 -33 -118 -14 138 -29 17 45 105 130 62
6788 62 -20 49 112 37 173 81 22 24 -132 194 24 8 37 -79 5 -136 -18 49 -16 32 24 192 111 -30 -125 -86 -140
$$ packed form
6613A3q1O4K4R6j52J43L4k07J21on9j50Q3J77r0K6j66J23J33j75j35K07j13K89
6637A99k35P6j63K16j98J14r4Q3P3j27MJ6R1j87J22L3R4k59K17K9o8r6R5k2k5
6662a2J56j43k72K70N9j32M4L0P5k6j45j27J49k2N3k2Q5N0Q2k21R9j49K13k04
6686a10J32N1q5M6K1N5r7J4r1m4J35J58j23n9J2J3L2o6J13j70J33r2J26j49j13
6711a58J6J58l9O2J0k94M42k70K7J7kQ8Ql8Qj68J88N1j07Qk07J83J02k48K22j47
6737h8O7n2L5kJ40q2O9J4j11R6k26L6j5K77k20k0k8P1j28K61j44L8J4O0j10k3
6763g1J44q8O0P0l36K95l5k08J55qJ91l09K67j19ml7q5J04J52j67M6K8O0K5o8
6788F2q2O9O3p5J36r2n9Kj56L26j70j6K9j16Q4j41J18O7o5M8qJ68q1j41r5L9n4
$$ plain form
6815 -140 25 -131 78 92 -130 -127 68 13 125 -44 13 64 -70 -105 -72 36 112 33 -92 53 21 67 39 6 235
6840 235 -50 -90 121 -21 -26 33 -61 121 134 -91 58 -121 0 -147 7 29 -85 7 -7 95 14 110 -15 56
6864 56 -149 24 -100 -25 -93 33 -16 -15 103 116 29 -70 -3 -65 51 -68 70 -71 37 -134 93 65 -67 40
6888 40 76 15 4 70 -3 207 77 -114 -35 -159 -49 -4 88 2 -124 -115 120 -18 -33 65 84 183 -182 -130 -157 32
6914 32 12 56 -91 118 -116 -200 -21 62 32 -202 3 54 -44 -17 -86 100 -22 -106 -73 89 191 109 -135 -34
6938 -34 -154 -2 -70 68 -73 97 -52 -135 21 36 -23 -208 16 -31 27 135 96 13 73 5 -175 -33 -100 -19
6962 -19 -118 49 125 84 -70 -46 24 62 -10 -95 -18 -100 18 15 -56 -65 36 -4 -151 31 -44 -108 -95 37 -79 36 48
6989 48 6 -59 26 -225 147 138 -27 25 -118 -165 5 -42 -151 11 153 -42 -125 67 -41 24 117 -106 61 2
$$ packed form
6815a40J65j56K09J4k22LJ95n5J12j69N7N1j34l5L3J08P6p9j25J45l2M6k8l3K29
6840B35k85m0K11j42nN9r4J82J3k25J49j79J21j47J54K2j14R2j4J02q1R6j25P1
6864E6k05J73j24P5o8J26m9JJ18J3q7r9O7o2J16j19J38j41J08j71K27k8j32J07
6888D0L6o1j1O6p3K10j30j91P9j24J10M5R2q6j26RK35j38j5R8J9R9l65N2k7J89
6914C2k0M4j47K09k34q4J79Q3l0k34K05N1r8K7o9J86j22q4L3J62J02q2k44J01
6938c4j20J52o8J38j41J70j49q3J56J5n9j85K24m7N8J08l9q3O0o8j80J42o7Q1
6962a9r9J67P6m1j54K4P0L8p2q5P7q2J18lp1rJ01m0j47J82p5o4J3J32j16J15J2
6989D8m2o5Q5k51L72rj65N2j43m7J70m7j09J62J42j95q3J92j08O5R3k23J67n9
$$ plain form
7013 2 -105 -82 -140 179 -192 -23 5 -83 8 178 -73 8 25 15 151 -55 -194 24 -125 -69 -56 -138 42 -61
7037 -61 2 39 160 -75 -171 85 -72 65 81 45 0 61 -42 119 64 -25 -28 -93 106 -62 -62 113 -30 -6 25 68
7063 68 -84 -107 148 20 -11 219 179 -25 -23 -149 45 -1 22 -86 -180 -11 -5 -108 -71 -18 -122 -54 31 -112 -47
7088 -47 -193 37 3 -165 -46 -69 -79 19 62 41 3 -75 -128 31 56 -53 6 161 -12 28 -16 -29 152 43 -33
7113 -33 191 -65 175 105 20 24 110 16 106 145 -72 44 190 13 -53 -155 57 47 11 -89 31 16 12 -197 44
7138 44 112 104 -13 -1 -57 81 99 132 -80 -74 -153 121 -13 12 110 -60 56 -91 239 -17 -23 -52 -81 14 -1 92 -112
7165 -112 126 39 19 142 -126 121 17 1 -86 -94 119 -1 -16 -99 -182 101 -170 172 71 87 -6 104 156 -124
7189 -124 71 179 30 -23 18 27 9 -84 -137 -143 -20 -9 -18 73 -41 -33 -39 50 36 63 -130 -27 -41 -85 70 7 -30 -67
$$ packed form
7013Bj07K3n8L19l71J69K8q8R1J70k51Q1J7j0J36k06j39K18j49N6J3q2J80j03
7037f1O3L7J21k35r6K56j57J37J6l6m5O1j03J61n5q9lo5J99j68%J75j43K4L1M3
7063F8j52k3K55j28l1K30m0k04Kj26J94m6K3j08r4J69Oj03L7N3j04O8Q5j43O5
7088d7j46K30l4j68J19k3j0R8M3k1l8p8n3J59K5j09N9J55j73M0m4j3J81j09p6
7113c3K24k56K40p0q5MQ6r4R0L9k17J16J46j77o6j02K12j0l6j00J20j5mk09K41
7138D4O8qj17J2n6J38J8L3k12Op9K74j34K5R8j70J16j47L30k56ok9k9R5j5R3k04
7165a12K38q7k0J23k68K47j04j6q7qK13j20j5q3q3K83k71L42j01J6r3J10N2k80
7189a24J95J08j49n3M1Rj8r3n3oJ23J1rR1j14QoQ9j4K7j93J03j4m4J55o3l7l7
$$ plain form
7217 -67 6 -57 67 113 28 -80 66 146 67 60 -112 15 20 11 -64 -34 -114 -164 56 154 209 49 60 -59 -33 122 -77
7244 -77 65 5 31 120 -104 -98 101 -28 9 210 -67 -84 47 3 128 3 -11 -19 31 34 -31 -154 31 62 72 -115
7270 -115 97 97 26 26 53 -119 3 -35 28 35 -70 -18 -6 -22 101 -16 74 -75 -87 -73 -33 -31 -54 -81 25 49 -49 -67
7298 -67 109 -18 -30 114 5 -8 85 -84 43 47 -89 -87 -11 -155 -112 -112 -66 -27 35 96 229 100 -96 -120 -51 86
7324 86 -76 104 11 -39 150 26 45 -178 -20 -51 29 -31 72 -19 -105 123 55 111 -12 -25 -15 -103 35 83 170
7349 170 -71 59 -182 -81 15 -14 -29 -78 -71 39 -33 -7 24 -60 56 30 -102 38 230 4 14 -142 72 75 -53
7374 -53 -23 -3 -20 41 78 -31 10 10 7 207 -47 52 92 65 -123 -65 80 -76 -129 -149 162 -126 152 115 -129 -38
7400 -38 -124 46 -24 202 -70 67 10 157 -55 -20 61 32 -3 13 -198 64 -89 -32 17 -115 -47 56 94 7 55
$$ packed form
7217f7P3o3J24M6q5j08J46Q0p9pj72J27Nrp5L0q0n0K20R8N5j60J1j19K6J55j99
7244g7J42o0K6Q9k24OJ99j29L7K01k77j7J31m4J25j25j4qN0Lo5j23J85L1J0j87
7270a15K12%p1%K7j72J22l8O3Pj05N2J2j6J23j17R0j49j2J4M0Kk3k7J06K4r8j8
7298f7J76j27j2J44j09j3R3j69J27Mj36KP6j44M3%M6L9O2O1J33j29j96k4O9J37
7324H6j62J80r3n0J89j24J9k23J58l1Q0o0J03r1q6K28o8N6j23j3J0q8J38M8Q7
7349A70k41J30k41J01R6k9j5m9PJ10p2K6L1q4J16k6j32J40J92k26J0j56K14Lj28
7374e3L0K0j7O1L7j09M1%lK00k54R9M0k7j88N8J45j56n3k0L11k88K78l7k44R1
7400c8q6J70p0K26k72J37n7J47k12L5Q1k9l5J6k11K62j53N7M9j32O8J03L8q7M8
$$ plain form
7425 55 31 -128 180 -38 18 -51 -98 -21 149 -40 6 12 24 -99 88 20 86 56 104 -55 -37 13 -99 166 82 -55
7451 -55 -105 5 -53 102 -187 -14 -2 -53 -108 76 74 50 -55 -79 -61 -12 -70 -113 14 59 -11 131 -56 -31 -119 26
7477 26 2 -154 -79 -1 227 -15 19 -213 70 140 -35 121 -27 -78 80 -109 -46 95 75 -42 -90 6 53 -98
7501 -98 74 -31 78 64 98 145 95 144 -54 18 -40 180 -37 42 -55 18 38 -80 -75 -20 10 41 5 -15 -115 111
7527 111 75 43 71 31 -5 -21 81 99 -23 -39 27 80 -56 -145 34 -29 -87 -60 -178 -3 62 -90 70 -193 27
7552 27 138 -26 -39 110 -22 26 76 157 63 -130 10 98 17 -128 224 13 -62 8 -117 -32 53 -54 -32 99
7576 99 -18 14 98 -43 95 -8 -30 0 -33 -78 -67 -164 50 58 -3 132 46 16 -25 78 -2 -4 122 52 54 62 -35 170
7604 170 -107 -18 -75 -124 159 77 -15 -43 127 -2 9 -85 -124 112 -30 5 -132 22 39 -20 -66 24 93 71 169 139
$$ packed form
7425E5k4j59L08k18N6o9m7P7J70j89M6OJ2j23J87o8O6l0M8j59J8N0j12K65q4j37
7451e5n0J10n8J55k89J73J2n1n5J84kk4j05k4J8M9n8m3J27M5p0J42j87K5q8J45
7477B6k4j56P5P8K28k42L4k32K83P0j75J56j48n1J58j89O3J41k0j17m8R6M7j51
7501i8J72j05J09j4L4M7n0M9j98P2n8K20k17P9r7P3K0j18NN5L0L1l6k0j00K26
7527A11l6l2K8m0l6j6J02J8j22j6O6N3j36q9J79o3n8K7j18J75O5j52J60k63K20
7552B7J11j64j3J49j32M8N0Q1r4j93J40Q8q1j45L52k11p5P0j25Q5Q5j07K2J31
7576I9j17L2Q4j41J38j03k2L0l3m5J1r7K14Qo1J35q6l0m1J03q0kJ26p0KQr7K05
7604A70k77Q9n7m9K83q2r2k8J70j29J1r4l9K36j42L5j37J54J7n9m6R0O9k2R8l0
$$ plain form
7630 139 60 -97 50 13 202 -107 -127 142 150 47 -119 -27 91 -73 29 48 19 -175 119 132 -24 -262 46
7653 46 54 -167 30 107 -39 -47 18 63 -147 -138 -28 -134 -162 -182 -8 -247 59 -130 75 -6 -76 -68 32 -90 -128 -59
7679 -59 49 -5 53 -9 37 -63 -25 57 75 16 -40 -34 -107 -153 68 133 -34 -49 -24 -166 -91 106 45 -141 -143 51 80
7706 80 20 -197 11 59 3 55 14 81 -38 157 80 -101 -7 -59 -18 -5 45 -10 338 -58 209 154 -18 -62 -36 30
7732 30 165 -124 116 159 -182 -8 -92 49 157 -14 136 28 73 192 -67 -43 1 -97 44 -1 11 -72 -31 40
7756 40 -127 -59 -22 1 -99 -38 -71 -24 -96 130 -113 166 19 107 -30 -20 39 125 192 192 116 -190 2 -32 -54 66
7782 66 -103 -29 158 -42 82 -55 -34 -106 -79 -276 87 -215 36 5 -65 -33 -221 -4 89 -52 28 -89 -78 47
7806 47 137 31 21 103 -49 173 -146 85 123 177 -120 -97 -29 127 -141 -1 -68 -27 -19 -68 148 -70 11 73 15
$$ packed form
7630A39p9j57J47l7J89l09k0K69Qj03j66R2J18j64J02J9k9j94K94J3j56k38L08
7653D6Qk21J97P7j46qO5M5k10RJ10j06k8k0J74k39L06j89K05q1p0QJ00j22l8O9
7679e9J08n4N8o2M6j00L8Q2J8n9n6Op3m6K21O5j67j5K5j42P5J97o1j86kJ94K9
7706H0o0k17K08M8n6N2m1O7j19J95p7j81R4n2M1J3N0n5L48l96K67n5j72m4K6O6
7732C0J35k89K40M3l41J74q4J41J08j71J50j08M5J19k59K4M4r8J41m5J2q3M1P1
7756D0j67O8L7K3j00O1l3M7p2K26k43K79j47Q8j37J0N9Q6O7%p6l06J92l4k2J20
7782F6j69P4J87k00J24j37K1p2K7j97L63l02K51l1p0L2j88K17R3j41Q0j17J1J25
7806D7R0j06j0Q2j52K22l19K31L8N4k97K3O8J56k68J40o7M1Qm9K16k18Q1O2n8
$$ plain form
7831 15 67 27 -46 41 -35 -71 -172 47 32 15 -120 -108 68 -92 -119 -44 -139 -113 -71 -169 -4 -21 -202 115 23 42
7857 42 -67 42 25 -35 -145 -71 -42 -135 104 -171 26 181 -52 -70 30 4 -134 20 -13 94 163 -30 75
7880 75 66 -56 17 -51 145 127 77 -19 -138 204 -33 99 -16 4 -42 80 -61 -64 -44 38 6 9 -86 173 -96 -34
7906 -34 51 192 60 51 -10 5 104 8 -23 -83 -123 -9 188 -29 165 156 -40 42 16 66 -47 -67 -28 -63 -89 3 -25
7933 -25 -160 -132 -26 -108 93 6 136 29 -122 59 25 -140 71 47 9 56 -91 -47 -66 -211 -71 -69 -32 66 -34
7958 -34 -67 4 -106 -218 51 23 -67 206 40 97 92 -103 30 -160 33 97 -59 14 -110 245 104 -19 31 -100
7982 -100 79 -40 132 7 -46 56 -47 -52 76 -97 -55 157 -148 17 -42 26 49 25 97 32 202 46 -1 20
8006 20 -71 189 -79 26 32 -190 139 123 -15 -130 41 138 15 45 -136 -73 -104 -27 -14 -101 84 152 -92 120
$$ packed form
7831A5N2m0p3Q7p6l6j01K19j5j7j35J2J76j60k7P5r5K6M2r8J65j7j81L17r2J9
7857D2j09J09j7o0j10P4K9r3K39k75J97J55k33j8J00k6j38J54l3J07O9j93J05
7880G5rj22P3o8J96j8n0r6j19L42k37J32j15K0m6J22j41lK0Q2l2Lr5K59k69O2
7906c4Q5J41j32ro1J5R9r6l1o0m0J14J97k17J94rj96Q2k6N0j13k0L9l5k6R2k8
7933b5j35K8J06q2K01q7J30j07j51J81l4j65K11k4l8M7j47M4j9j45J40KL7R8j00
7958c4l3P1j10j12K69k8r0K73j66N7nj95J33j90J93O4j56P3j24L55j41j23N0j31
7982a00J79j19J72j25n3J02j03nJ28j73M2K12l05J65n9O8K3k4P2o5J70j56m7K1
8006B0r1K60k68J05Ok22L29j6j38j15J71R7j23L0j81O3l1P7J3q7J85O8k44K12
$$ plain form
8030 120 78 -154 89 10 -95 -104 -56 65 -25 119 60 -106 -45 89 70 78 11 -72 128 68 -14 113 -6 -60 -50 -16
8056 -16 -98 -113 24 -45 -9 -15 68 -20 -49 109 63 -30 -77 72 -52 52 93 -132 -95 -62 -79 -75 92 -175 -26 13 17
8083 17 19 41 85 178 26 -18 -21 17 81 -53 28 42 14 -11 -23 85 44 265 -45 -49 -134 -11 -95 -276 -5 54 34 -22
8111 -22 -199 20 29 3 -54 -24 -112 70 227 47 -87 -55 -10 -14 208 66 -60 -36 82 21 153 118 -88 8 -218
8136 -218 -145 -30 -85 70 -16 98 -106 108 -73 70 8 -45 -110 24 9 -7 12 0 29 56 167 39 3 147
8160 147 257 36 18 -85 120 84 77 30 -85 -4 -60 48 -77 -109 76 37 -34 179 142 -60 -241 177 75 -11
8184 -11 -116 5 102 38 -75 40 34
$$ packed form
8030A20m2k32K43p9j05rM8J21r0J44n9j66O1J34j9Qo7q3K00o0q2J27j19n4J0L4
8056a6q2j5J37o9L6oQ3q8k9J58m6r3m7J49j24J04M1k25L7L3j7MJ67k67J49L9M
8083A7KK2M4R3j52m4lL8O4j34Q1J4k8k5j2J08m1K21l10mq5J23q4j81K71N9k0n6
8111b2j77K19Rk6n7L0q8J82J57j80j34L2M5mK22j42j26K4J18o1J32l5k06R6k26
8136b18P3J15n5J55q6J14k04K14j81J43o2n3o5J34j5j6J9j2K9K7J11j28l6J44
8160A47J10k21j8j03K05l6pm7j15Q1n6J08j25l2J85l9p1K13l7k02j81M18j02q6
8184a1j05J21R7o4j13J15o
8191C4
$$ Imaginary data points
##PAGE= N=2
##DATA TABLE= (X++(I..I)), XYDATA
$$ plain form
0 0 0 0 0 0 0 0 0 -8 8 -8 8 -16 16 -24 24 -32 48 -56 64 -80 96 -120 137 -161 192 -225 263 -302 345 -401
30 -401 457 -521 591 -669 758 -854 955 -1072 1200 -1337 1489 -1652 1833 -2032 2249 -2483
46 -2483 2739 -3020 3330 -3667 4038 -4450 4906 -5413 5979 -6618 7346 -8183 9152 -10291
60 -10291 11661 -13336 15444 -18181 21903 -27276 35740 -51081 87569 -356137 25563 732717
72 732717 -305779 -394309 410648 191513 -482616 177595 492672 -417539 -511020 525798
82 525798 310331 -569452 -94352 581470 -101929 -421951 334058 294834 -502716 -166351
92 -166351 482837 -63243 -454658 272739 359605 -402450 -179687 537894 44306 -556364
102 -556364 50404 426150 -198091 -256710 312041 59662 -371196 180120 443059 -313128
$$ packed form
0@%%%%%%%qJ6j6J6k4L2m0M8n6Q0j04J20j44J76k16K57k98L53m17M88n65O47p46
30d01Q58r78J112j260J427j612J809k027K272k537K826l141L485l865M281m732
46b483N222n759O350o997P705q488R356j0319J1392j2597J3964j5529J7335j9443
60a0291K1952k4997K8780l3625M0084m9179O3016q6821J38650m43706L81700P07154
72G32717j038496q8530Q04957k19135o74129O60211L15077r10211r3481J036818
82E25798k15467q79783M75100O75822o83399l20022P56009l9224p97550L36365
92a66351O49188n46080l91415P27397Q6866p62055K22763P17581m93588o00670
102e56364O06768L75746o24241n8619N68751k52379m30858N51316K62939p56187
$$ plain form
112 -313128 -433341 349519 296595 -375728 -143653 324816 -55072 -233401 278623 173502
122 173502 -406003 -83511 443166 -36328 -424334 128327 312590 -220448 -147555 322580
132 322580 21501 -337322 104511 279015 -228560 -197843 283009 53593 -321606 86957
142 86957 336956 -165267 -271193 219060 159985 -237266 -30372 200080 -126318 -154282
152 -154282 263041 124316 -313218 -61180 312420 -7505 -260450 61205 135635 -144124
162 -144124 -17846 206214 -75276 -218199 156045 205865 -190288 -150659 186713 50361
172 50361 -178046 49216 155515 -117625 -96692 172875 36742 -187321 28174 160074
182 160074 -111320 -136639 159692 92379 -176004 -29917 169848 -24336 -122725 81248
$$ packed form
112c13128j20213P82860n2924o72323K32075M68469l79888j78329N12024j05121
122A73502n79505L22492N26677m79494l88006N52661J84263n33038P2893M70135
132C22580l01079l58823M41833J74504n07575L0717M80852k29416l75199M08563
142H6957K49999n02223j05926M90253n9075l97251K06894K30452l26398k7964
152a54282M17323j38725m37534K52038L73600l19925k52945L21655P4430k79759
162a44124J26278K24060k81490j42923L74244M9820l96153L9629L37372j36352
172E0361k28407K27262J06299k73140K0933K69567j36133k24063K15495J31900
182A60074k71394k5319K96331o7313k68383J46087J99765j94184r8389K03973
$$ plain form
192 81248 53002 -138704 9273 174201 -57831 -174813 98594 153909 -109207 -94296 104344
203 104344 6750 -103264 65292 82090 -128380 -57155 164699 30316 -159979 13707
213 13707 132979 -60573 -89586 97182 35843 -116184 21777 119585 -65333 -94787 104170
224 104170 55036 -133468 -15532 133849 -33555 -120509 68723 85127 -88386 -29940 100638
235 100638 -26658 -99679 78666 87953 -115159 -62939 131930 30407 -119696 14877 92436
246 92436 -59690 -56635 93111 10410 -120452 26468 121512 -62233 -101806 90997 66081
257 66081 -104627 -17245 106684 -30248 -92583 73754 67220 -103454 -26875 121082 -17558
268 -17558 -118809 58917 95478 -94746 -62538 109738 15208 -111190 34276 95729 -80074
$$ packed form
192H1248k8246j91706J47977J64928k32032j16982K73407N5315k63116J4911J98640
203A04344r7594j10014J68556J6798k10470P1225K21854j34383j90295J73686
213A3707J19272j93552k9013J86768o1339j52027J37961R7808j84918k9454J98957
224A04170m9134j88504J17936J49381j67404q6954J89232J6404j73513N8446J30578
235A00638j27296p3021J78345R287k03112N2220J94869j01523j50103J34573P7559
246I2436j52126L055J49746q2701j30862J46920R5044j83745l9573J92803k4916
257F6081j70708Q7382J23929j36932o2335J66337o534j70674P6579J47957j38640
268a7558j01251J77726L6561j90224L2208J72276r4530j26398J45466O1453j75803
$$ plain form
279 -80074 -63493 117024 23963 -131873 21213 126187 -60012 -96324 93063 53329 -112739
290 -112739 -1837 115778 -52089 -103751 92925 69175 -121965 -27092 128897 -20071
300 -20071 -116784 64749 89434 -97904 -45959 119465 -1886 -118907 52296 101555 -91136
311 -91136 -68060 116341 24713 -126187 19278 113630 -64976 -87081 98196 43391 -117995
322 -117995 5772 120210 -51430 -101802 90940 71078 -114425 -25290 124596 -23016
332 -23016 -112857 69799 83202 -105933 -41857 123059 -8967 -124557 54695 103500 -95753
343 -95753 -67715 121058 19312 -126675 34067 113525 -78810 -79189 113487 35778 -128379
354 -128379 15199 124957 -63301 -101471 100454 58975 -123415 -9692 123394 -43378
$$ packed form
279h0074J6581J80517r3061j55836J53086J04974j86199l6312J89387l9734j66068
290a12739J10902J17615j67867n1662J96676k3750j91140R4873J55989j48968
300b0071r6713J81533K4685j87338N1945J65424j21351j17021J71203M9259j92691
311i1136K3076J84401r1628j50900J45465R4352j78606k2105J85277n4805j61386
322a17995J23767J14438j71640n0372J92742j9862j85503Q9135J49886j47612
332b3016q9841J82656J3403j89135O4076J64916j32026j15590J79252M8805j99253
343i5753K8038J88773j01746j45987J60742P9458j92335l79J92676p7709j64157
354a28379J43578J09758j88258l8170K01925m1479j82390J13723J33086j66772
$$ plain form
364 -43378 -106705 85777 72030 -115632 -26666 128022 -21526 -117146 68769 90318 -101248
375 -101248 -46123 119048 -2425 -117071 50197 96591 -91680 -63338 115263 16761 -123166
386 -123166 29636 107907 -72546 -76744 102585 34535 -114870 14731 111919 -58659 -88132
397 -88132 95682 52416 -114476 -7151 114138 -38978 -96526 76504 62129 -104106 -21597
408 -21597 111902 -24910 -103638 65631 77924 -94575 -39583 108763 -2189 -102371 45310
419 45310 82999 -78496 -49136 100330 9331 -105492 30724 92408 -66528 -67044 87764
430 87764 29146 -97081 10806 89873 -49570 -69680 81174 40725 -97274 -3566 99421
441 99421 -31151 -82938 63070 55638 -83873 -19400 91658 -20216 -86224 54900 64669
$$ packed form
364d3378o3327J92482j3747j87662Q8966J54688j49548r5620J85915K1549j91566
375a01248N5125J65171j21473j14646J67268M6394j88271K8342J78601r8502j39927
386a23166J52802P8271j80453m198J79329o8050j49405J29601R7188j70578k9473
397h8132J83814m3266j66892J07325J21289j53116n7548J73030j4375j66235Q2509
408b1597J33499j36812p8728J69269J2293j72499N4992J48346j10952j00182J47681
419D5310L7689j61495K9360J49466r0999j14823J36216O1684j58936n16J54808
430H7764n8618j26227J07887P9067j39443k0110J50854m0449j37999R3708J02987
441I9421j30572n1787J46008p432j39511O4473J11058j11874o6008J41124R769
$$ plain form
452 64669 -83189 -35530 95175 -1451 -92478 37590 75564 -66187 -45137 86145 9669
463 9669 -89791 30348 81183 -63319 -57985 86192 26218 -94359 7708 84087 -42909
474 -42909 -62722 69059 29512 -86241 6209 88623 -39337 -75202 65956 51084 -78030
485 -78030 -17006 79719 -17219 -67371 50038 46804 -73596 -19943 82648 -10375 -79324 35711
497 35711 60968 -57483 -36614 68185 7173 -68703 23244 59295 -48287 -38540 67624
508 67624 14907 -74295 10949 71520 -32275 -56672 48410 32634 -59097 -4978 58856 -26763
520 -26763 -53102 51444 38717 -67840 -20145 73014 -440 -64541 23827 48011 -43757 -21936
532 -21936 60315 -4060 -65472 28326 59887 -47490 -44696 58114 20808 -63320 4047 56597
$$ packed form
452F4669j47858M7659J30705r6626r1027J30068L7974j41751K1050J31282p6476
463I669r9460J20139N0835j44502N334J44177n9974j20577J02067P6379j26996
474d2909j9813J31781l9547j15753R2450Q2414j27960l5865J41158j4872j29114
485g8030O1024R6725r6938n0152J17409l234j20400N3653J02591r3023o8949J15035
497C5711K5257j18451K0869J04799o1012p5876R1947L6051j07582R747J06164
508F7624n2717q9202Q5244O0571j03795k4397J05082j5776r1731N4119O3834q5619
520b6763k6339J04546j2727j06557M7695R3159p3454o4101Q8368K4184r1768K1821
532b1936Q2251o4375o1412R3798L1561j07377K794J02810l7306q4128O7367N2550
$$ plain form
544 56597 -30246 -41936 50094 20453 -60484 4592 62623 -26702 -53421 46625 39033 -56974
556 -56974 -17412 58096 -6562 -48157 29681 29537 -50317 -10310 61303 -10043 -64394 25117
568 25117 55156 -36300 -35063 43065 10011 -42631 18100 39793 -39157 -30679 53854 18558
580 18558 -58532 -2966 54295 -15307 -43195 29555 23711 -41713 -4405 46240 -15121 -44103
592 -44103 31808 35344 -44236 -19400 53187 3299 -51952 13104 42846 -25633 -24613 36730
604 36730 2619 -45071 17674 45761 -36671 -41318 46519 27748 -49195 -10091 43018 -10428
616 -10428 -29830 32434 15883 -48123 662 56996 -14686 -53132 27495 39682 -36456 -20117
628 -20117 39671 -3469 -40054 22878 32716 -39199 -20361 47996 3662 -49533 14148 45511
$$ packed form
544E6597q6843j1690R2030k9641q0937O5076N8031q9325k6719J00046p592r6007
556e6974L9562P5508o4658m1595P7838j44p9854M0007P1613p1346n4351Q9511
568B5117L0039r1456J237P8128l3054n2642O0731K1693p8950Q478Q4533l5296
580A8558p7090N5566N7261o9602k7888P2750n844o5424L7308N0645o1361k8982
592d4103P5911L536p9580K4836P2587m9888n5251O5056K9742o8479J020O1343
604C6730l4111m7690O2745K8087q2432m647Q7837j8771p6943L9104N3109n3446
616a0428j9402O2264j6551o4006M8785N6334p1682l8446Q0627J2187p6138J6339
628b0117N9788m3140l6585O2932R838p1915J8838O8357m4334n3195O3681L1363
$$ plain form
640 45511 -26900 -33516 35819 18129 -37530 2469 35354 -22434 -28521 38414 17329 -49531
652 -49531 -6063 50907 -6546 -45094 16450 29751 -26425 -9361 35671 -10586 -39525 28346
664 28346 38449 -38655 -28041 44311 13354 -42985 4486 35591 -23325 -24428 36942 8023
676 8023 -46321 7915 45400 -24579 -37346 37538 24100 -44171 -6575 44605 -10812 -35272
688 -35272 28719 21398 -40649 -3146 46635 -15321 -46020 29022 36732 -38392 -22627 38886
700 38886 1476 -35111 19520 26847 -36506 -14890 46931 2786 -47297 11291 41301 -22280
712 -22280 -27574 30906 10545 -34952 7483 33534 -24019 -28363 33826 16620 -40166 -3774
724 -3774 39583 -10149 -34509 22564 24058 -30052 -8495 34699 -7022 -32638 22774 27095 -34394
$$ packed form
640D5511p2411o616O9335j7690n5659L9999L2885n7788o087O6935k1085o6860
652d9531M3468N6970n7453l8548O1544J3301n6176J7064M5032m6257k8939O7871
664B8346J0103p7104J0614P2352l0957n6339M7471L1105n8916j103O1370k8919
676H023n4344N4236L7485o9979j2767P4884j3438o8271L7596N1180n5417k4460
688c5272O3991p321o2047L7503M9781o1956l0699P5042P710p5124J5765O1513
700C8886l7410l6587N4631P327o3353K1616O1821m4145n0083N8588L0010o3581
712b2280n294N8480k0361m5497M2435K6051n7553m344O2189j7206n6786L6392
724c774M3357m9732k4360N7073J494n4110K1557M3194m1721k5616N5412M321o1489
$$ plain form
737 -34394 -17571 40127 5000 -40021 8024 31487 -22345 -19343 32352 3492 -38109 11925
749 11925 37441 -24568 -30059 34821 18288 -37623 -1225 35865 -15396 -27239 29809 15461
761 15461 -38649 -1685 39735 -13569 -35727 25578 24370 -34745 -10277 36901 -5679 -32446
773 -32446 20642 24044 -30941 -10547 37595 -2500 -36944 16120 31001 -26171 -19691 31329
785 31329 4446 -32317 9588 27075 -23119 -19736 31635 8976 -35372 3302 33498 -14430
797 -14430 -25004 24233 14240 -29007 -510 30570 -11716 -27409 22223 18948 -30011 -8769
809 -8769 31859 -4280 -29832 14912 22388 -24010 -12134 29274 684 -29825 11987 26679
821 26679 -21833 -17448 29136 7237 -30617 4812 27222 -15924 -20581 23978 9739 -29544
$$ packed form
737c4394J6823N7698l5127m5021M8045K3463n3832L002N1695k8860m1601N0034
749A1925K5516o2009n491O4880j6533n5911L6398L7090n1261j1843N7048j4348
761A5461n4110L6964M1420n3304k2158O1305j208n9115K4468M7178m2580k6767
773c2446N3088L402n4985K0394M8142m0095l4444N3064J4881n7172O480N1020
785C1329k6883l6763M1905J7487n0194L383N1371k2659m4348L8674L0196m7928
797a4430j0574M9237r993m3247K8497L1080m2286j5693M9632l275m8959K1242
809h769M0628l6139k5552M4744P476m6398J1876M1408k8590l0509M1812J4692
821B6679m8512M385M6584k1899l7854L5429K2410m3146m657M4559j4239l9283
$$ plain form
833 -29544 1149 28818 -13196 -24213 21955 15624 -26574 -4338 27920 -6734 -24211 17562
845 17562 17780 -24422 -7700 27850 -3352 -26500 13031 20380 -21031 -12528 24743 1895 -25710
858 -25710 8091 22217 -17394 -15204 23430 6200 -25000 4222 23618 -12477 -18051 19526
870 19526 10734 -23301 -988 23332 -9010 -20249 16237 13000 -21693 -5160 22932 -3912
882 -3912 -21416 12212 16660 -18163 -8658 22344 389 -21288 9058 18250 -15746 -11745 20107
895 20107 3511 -21977 4417 19279 -12940 -14598 17787 6575 -20631 1473 19759 -9092
907 -9092 -15895 15858 9952 -18851 -1742 20081 -5766 -16945 12706 11579 -17299 -5004 18543
920 18543 -3146 -18019 9175 13486 -15064 -8076 17546 966 -17558 6257 14910 -11466 -9657
$$ packed form
833b9544L0693K7669m2014j1017M6168o331m2198K2236L2258l4654j7477M1773
845A7562K18m2202J6722L5550l1202k3148L9531P349m1411Q503L7271k2848k7605
858b5710L3801J4126l9611K190L8634j7230l1200K9222J9396l6095n574L7577
870A9526q792l4035K2313K4320l2342j1239L6486l237l4693J6533K8092k6844
882c912j7504L3628M448l4823R505L1002k1955k1677L0346R192l3996M001L1852
895B0107j6596k5488K6394J4862l2219j658L2385j1212k7206K2104J8286k8851
907i092o803L1753n906k8803J7109K1823k5847j1179K9651j127k8878J2295K3547
920A8543k1689j4873K7194M311k8550O988K5622j6580j8524K3815Q653k6376J809
$$ plain form
933 -9657 16111 4096 -17089 2800 16130 -9089 -12499 13476 6593 -16476 -572 15823 -6377
946 -6377 -13844 11215 9149 -15266 -3064 16868 -2780 -15039 9266 11702 -13175 -5446 15997
959 15997 -499 -15738 6914 12928 -12808 -8656 15426 2034 -16756 3791 14400 -10108
971 -10108 -10057 14084 4043 -16132 2738 16298 -8234 -12386 13667 7294 -15819 -842 15972
984 15972 -5717 -13277 10938 8098 -15379 -2967 16410 -3864 -15988 9151 11774 -13401 -6121
997 -6121 15600 106 -14998 7053 12846 -11907 -7933 16055 2239 -17617 3660 15564 -9821
1010 -9821 -11795 13055 5144 -15779 1165 15381 -7986 -13039 13682 8310 -16942 -2017 18311
1023 18311 -3877 -15314 10121 11058 -13873 -4325 16236 -3330 -16397 9328 13287 -14945 -8749
$$ packed form
933i657K5768j2015k1185J9889J3330k5219l410K5975o883k3069J5904J6395k2200
946f377p467K5059k066k4415J2202J9932j9648j2259K4305K436k4877P729K1443
959A5997j6496j5239K2652O014k5736M152K4082j3392j8790K0547J0609k4508
971a0108N1K4141j0041k0175J8870J3560k4532m152K6053o373k3113J4977J6814
984A5972k1689p560K4215k840k3477J2412J9377k0274j2124K5139K623k5175P280
997f121K1721j5494j5104K2051N793k4753L974K3988j3816j9856K1277J1904k5385
1010i821j974K4850p911k0923J6944J4216k3367n053K6721n372k5252J4925K0328
1023A8311k2188j1437K5435R37k4931R548K0561j9566j3067K5725L959k8232O196
$$ plain form
1036 -8749 17097 1926 -17084 4643 14604 -10174 -9317 14956 3345 -17004 3919 17169 -9515
1049 -9515 -13844 13941 8594 -16348 -2482 15911 -4814 -14162 10387 9062 -15480 -3264 17813
1062 17813 -2896 -17231 8584 14866 -12344 -9042 15294 2359 -15325 5295 13877 -12045
1074 -12045 -9699 16616 4004 -19137 1344 18020 -7509 -14596 12150 8043 -15617 83
1086 83 16647 -7123 -14360 13685 10765 -17099 -4653 18654 -1788 -17284 8126 12494 -13440
1099 -13440 -6255 15508 -1913 -16507 8334 14079 -13736 -10112 16580 4731 -16479 2077
1111 2077 14354 -7732 -9304 12680 3690 -15021 2644 15731 -7682 -14322 11245 9882 -13324
1124 -13324 -4260 12944 -2790 -11334 8372 8220 -12280 -3747 15005 -578 -14777 5578 13316
$$ packed form
1036h749K5846j5171j9010K1727R961k4778Q57K4273j1611k0349K0923J3250k6684
1049i515m329K7785n347k4942J3866J8393k0725r348K4549j325k4542J2216K1077
1062A7813k0709j4335K5815O282k7210L302K4336j2935j7684K0620Q582k5922
1074a2045K346K6315j2612k3141K0481J6676k5529p087K6746m107k3660J5700
1086H3J6564k3770p237K8045k920k7864J2446K3307k0442j5496K5410M368k5934
1099a3440P185K1763j7421j4594K4841N745k7815L624K6692j1849k1210J8556
1111B077J2277k2086j572K1984q990j8711J7665J3087k3413o640K5567j363k3206
1124a3324R064J7204j5734q544J9706j52k0500Q533J8752j5583j4199K0355P738
$$ plain form
1137 13316 -9115 -8682 11217 3181 -12016 2422 10687 -8152 -8753 12059 4661 -14868 -455
1150 -455 14660 -4105 -12196 7873 7998 -10127 -1723 11719 -3984 -10898 9752 8948 -13076 -5338
1164 -5338 13917 625 -12759 3656 8740 -8166 -4644 10817 -429 -11592 5501 10822 -9010
1177 -9010 -7952 11419 4038 -10732 803 9351 -4933 -6482 8116 2575 -10302 1410 10133
1190 10133 -5716 -9399 7895 6563 -8794 -2924 8532 -1000 -6687 5148 4645 -7799 -1234
1203 -1234 10176 -1443 -10139 3902 8528 -5595 -5471 6377 1226 -7058 2349 6129 -6137 -4848
1217 -4848 8873 2416 -9692 290 9205 -2831 -6682 5648 4089 -7003 -338 7618 -3445
1230 -3445 -6680 6960 4534 -9097 -2110 9052 -925 -8174 3494 5313 -6008 -1907 7204 -1679
$$ packed form
1137A3316k2431M33J9899q036j5197J4438Q265j8839o01K0812p398j9529J4413
1150d55J5115j8765q091K0069J25j8125Q404J3442j5703o914K0650q04k2024P738
1164e338J9255j3292j3384J6415N084j6906L522J5461j1246j1163J7093N321j9832
1177i010J058J9371p381j4770J1535Q548j4284j549J4598n541j2877J1712Q723
1190A0133j5849l683J7294j332j5357N870J1456r532n687J1835n03j2444O565
1203a234J1410j1619q696J4041M626j4123J24J1848n151q284R407L780j2266J289
1217d848J3721o457j2108R982Q915j2036l851J2330j559j1092O665P956j1063
1230c445l235J3640k426j3631O987J1162r977p249J1668J819j1321M101R111q883
$$ plain form
1244 -1679 -6915 5669 6523 -7482 -4189 8168 1619 -7327 1380 5587 -4556 -3249 6167 -8
1258 -8 -7257 2473 6945 -4731 -5662 5922 3504 -6140 -382 5961 -2053 -4515 4799 2875 -6020
1273 -6020 -394 6634 -1578 -6553 3268 5131 -4766 -3496 5484 666 -5778 1975 4710 -4462 -2955
1288 -2955 6619 1563 -7304 833 7028 -2647 -5443 4863 2955 -6203 23 6056 -3439 -5520 5460
1303 5460 3546 -7356 -1647 7444 -1085 -6175 4073 4424 -5814 -1341 6847 -1387 -6064 4226
1317 4226 4949 -6191 -2986 7165 66 -6896 2359 4935 -4585 -2946 5448 94 -5989 2195 5519
1332 5519 -4211 -4053 5333 2174 -5490 376 5222 -2367 -4003 4025 2300 -4964 -527 5525 -1469
1347 -1469 -5289 2824 3879 -4228 -2151 4872 142 -4778 1859 4439 -3464 -3069 5131 1495 -5448
$$ packed form
1244a679n236J2584Q54j4005L293J2357o549q946Q707M207j0143J307R416o175
1258hp249R730M472j1676r31J1584k418r644N758O343q014k462R314j924q895
1273f020N626P028q212m975R821J863r897J270Q980m818o444P753K735r172J507
1288b955R574n056q867Q137O195r675k796J0306j908r158O226O033r495k081J0980
1303E460j914j0902N709R091q529n090J0248L51j0238M473Q188q234m677J0290
1317D226P23j1140L205J0151p099o962R255K576r520J639Q394n354o083Q184L324
1332E519r730J58R386l159p664N866M846p589j636Q028j725p264M437O052o994
1347a469l820Q113J055q107K077P023m730m920O637K580p903L95Q200l636o943
$$ plain form
1362 -5448 686 5502 -2695 -4419 4222 2396 -5447 -632 5363 -2041 -4993 4081 3357 -5719 -1258
1377 -1258 6043 -923 -5404 3465 4434 -4711 -1969 6003 -686 -5884 2983 4555 -4756 -2974 5706
1392 5706 269 -5840 1813 4816 -3847 -3240 5256 989 -5503 1344 5119 -3192 -3547 4748 1834
1407 1834 -5004 178 4811 -2220 -4002 3580 2359 -4535 -739 4568 -1272 -4200 2822 3050 -3840
1422 -3840 -1635 4440 -90 -4186 2093 3489 -3341 -2209 4419 762 -4481 1061 3871 -2663 -3057
1437 -3057 3584 1176 -4652 254 4355 -2210 -3379 3637 2194 -4160 -409 4677 -1117 -3821 2848
1452 2848 2763 -3970 -1073 4465 -954 -4261 2546 3070 -3891 -1697 4422 -162 -4353 1833 3414 -2985
1468 -2985 -2043 4305 483 -4063 1433 3820 -2663 -2519 3940 1047 -4251 672 3620 -2245 -3109 3341
$$ packed form
1362e448O134M816q197j724Q641j826p843M815N995p404k952R074p24r076M461
1377a258P301o966m481Q869R69r145K742P972o689n198Q867J572r311J782Q680
1392E706n437o109P653L003q663O07Q496m267o492O847L775q311l55Q295k914
1407A834o838N182M633p031j782P582j221o894L796N307n840k928P022K28o890
1422c840K205O075m530m096O279J396o830J132O628l657n243N542K810o534l94
1437c057O641k408n828M906M101o565j169P016j443o354L751N086n794k704O669
1452B848q5o733K897N538n419l307O807N24o961K194O119m584m191O186J581o399
1468b985R42O348l822m546N496K387o483J44O459k893n298M923K948n865q64O450
$$ plain form
1484 3341 1398 -4091 5 3949 -1654 -3323 2962 2434 -3622 -651 4174 -673 -3462 2345 2640
1499 2640 -3349 -1317 3806 -666 -4130 1817 3316 -3083 -2226 3592 255 -3724 1277 3366 -2923
1514 -2923 -2058 3898 1006 -4125 613 3888 -2089 -3082 2928 1347 -3836 49 3531 -2034 -3324
1529 -3324 3036 1941 -3989 -582 4208 -843 -3682 2407 2587 -3015 -858 3650 -601 -3506 2051
1544 2051 2926 -3459 -2147 3776 600 -3776 971 3036 -2179 -2121 3137 681 -3697 1131 3709 -2340
1560 -2340 -3224 3276 2244 -3575 -520 3491 -1021 -2984 2391 1999 -3560 -998 4139 -803 -4167
1575 -4167 1931 3212 -2839 -2197 3331 716 -3060 1262 3023 -2787 -2088 4151 973 -4515 338
1590 338 4060 -1666 -3285 2558 1848 -3284 -375 3417 -1715 -3027 3314 2384 -4078 -1203 4299 55
$$ packed form
1484C341j943n489M096L944n603j669O285n28o056K971M825m847k789N807K95
1499B640n989K032N123m472l464N947J499o399Q57N818l337l979N001K089o289
1514b923Q65N956k892n131M738L275n977r93O010j581n183L885L482n565j290
1529c324O360j095n930L407M790n051k839O089J80n602K157M508m251k905N557
1544B051Q75o385J312N923l176m376M747K065n215N8N258k456m378M828K578o049
1560b340q84O500j032n819L055M011m512j963N375l92n559K562N137m942l364
1575d167O098J281o051O42N528k615l776M322J761n810O99O239l178n488M853
1590C38L722n726j619N843p10n132K909L792n132j312O341r30o462K875N502m244
$$ plain form
1606 55 -3851 1473 2967 -2712 -1636 3380 -221 -3573 1679 3330 -3310 -2874 3528 1514 -3885 -223
1622 -223 3320 -1299 -2369 2834 1337 -3622 465 3965 -1491 -3515 2665 2730 -3117 -1575 3151 -24
1638 -24 -2727 1460 1828 -2885 -1066 3580 200 -3810 907 3489 -1948 -2375 2436 1316 -2367 457
1654 457 2261 -1722 -1564 2732 1117 -3553 -783 3509 -528 -3003 1114 1917 -1633 -878 2089 -323
1670 -323 -2305 1439 2269 -2363 -1885 3002 1305 -2808 -312 2244 -599 -1638 1586 648 -2464 18
1686 18 2710 -1274 -2706 1919 2076 -2569 -1226 2630 232 -2014 1135 1341 -2095 -476 3008 -493
1702 -493 -3216 1317 2530 -1927 -1948 2159 661 -1994 537 1392 -1741 -661 2850 162 -2753 749
1718 749 2625 -1037 -1637 1682 761 -1682 156 1236 -1482 -926 1956 248 -2326 -25 2103 -565
$$ packed form
1606E5l906N324J494n679J076N016l601l352N252J651o640M36O402k014n399L662
1622b23L543m619j070N203j497m959M087L500n456k024O180O5n847J542M726l175
1638b4k703M187L68m713J819M646l380m010M717K582n437m27M811j120l683K824
1654D57J804l983J58M296j615m670K770M292m037k475M117Q03l550P55K967k412
1670c23j982L744Q30m632M78M887j697m113K496K556k843j039L224r38l112K482
1686A8K692l984j432M625J57m645J343L856k398k246L149K06l436J619L484l501
1702d93k723M533J213m457k1M107j498k655K531Q55l133J080L511k688k915L502
1718G49J876l662o00L319r21k443J838J080k718N56K882j708k574K301K128k668
$$ plain form
1734 -565 -1538 644 836 -816 119 976 -500 -746 1367 642 -1550 -751 1610 196 -1289 -126 897
1751 897 -330 -433 540 -299 -1041 801 1377 -1045 -1229 1320 1028 -1280 -539 1364 -22 -783 873
1768 873 450 -1477 -3 1967 -818 -1696 1104 1234 -1781 -983 1554 39 -1388 906 776 -1837
1784 -1837 -78 2323 -503 -2101 1223 1720 -1625 -1170 1810 41 -1603 846 1013 -1894 -597 2058
1800 2058 -185 -2127 1003 1776 -1370 -1220 1679 419 -1365 853 1333 -1542 -802 1874 83 -1931
1816 -1931 36 1750 -813 -1576 1016 659 -1371 32 1310 -799 -1227 1409 952 -1403 -624 1741
1832 1741 156 -1561 338 1437 -840 -729 1156 -33 -1785 311 1651 -1165 -1350 1521 934 -1915
1848 -1915 -103 1686 -535 -1435 1282 940 -1771 -203 2110 -607 -1872 1365 1410 -1888 -965 1839
$$ packed form
1734e65r73K182J92j652R35Q57j476k46K113p25k192P99K361j414j485J163J023
1751H97j227j03R73q39p42J842N76k422j84K549k92k308P41J903j386p61J656
1768H73m23j927J474J970k785q78K800J30l015P98K537j515j427K294j30k613
1784a837J759K401k826j598L324M97l345M55K980j769j644K449J67k907J297K655
1800B058k243j942L130P73l146J50K899j260j784K218M80k875P40K676j791k014
1816a931J967J714k563p63K592l57k030J403J278k109m28K636m57k355P79K365
1832A741j585j717J899J099k277J11J885j189j752K096J340k816j85K871n87k849
1848a915J812J789k221r00K717l42k711J568K313k717j265L237M5l298R23K804
$$ plain form
1864 1839 -236 -1771 985 1049 -1596 -685 2061 0 -2074 686 1791 -1208 -1000 1726 422 -1630
1880 -1630 517 1474 -1121 -1103 1531 549 -1703 -92 1552 -700 -1234 1003 825 -1247 -201 1593
1896 1593 -194 -1351 796 1131 -1236 -685 1493 175 -1530 163 1267 -824 -899 1172 576 -1609
1912 -1609 197 1772 -708 -1162 1316 800 -1600 -55 1597 -359 -1234 985 1014 -1430 -548 1696
1928 1696 -323 -1641 1073 1234 -1544 -543 1512 -190 -1491 855 1135 -1176 -785 1646 -38 -1355
1944 -1355 737 1205 -1126 -947 1162 325 -1385 222 1119 -876 -937 945 279 -1208 -38 995 -457
1961 -457 -1043 795 577 -786 -66 947 -199 -845 676 715 -820 -397 903 27 -1231 279 943
1978 943 -503 -762 714 408 -1059 -51 1034 -395 -865 900 917 -1102 -219 1283 -253 -1100 567
$$ packed form
1864A839k075j535K756O4k645R11K746k061k074K760J105k999K08K726j304k052
1880a630K147R57k595J8K634r82k252J611J644k252n34K237j78k072J046J794
1896A593j787j157K147L35k367N51K178j318j705J693J104k091p5K071n96k185
1912a609J806J575k480m54K478n16k400J545J652j956q75K219K9k444Q82K244
1928A696k019j318K714J61k778J001K055j702j301K346K80k311L91K431j684j317
1944a355K092M68k331J79K109q37j710J607Q97j995o1J882o66j487J170J033j452
1961d57n86J838k18j363P20J013j146o46J521L9j535M23J300q76j258J510O64
1978I43j446k59J476l06j467J008J085j429m70J765J7k019Q83J502j536q47J667
$$ plain form
1995 567 793 -1146 -338 1225 -151 -1157 761 773 -1158 -625 1059 47 -1122 501 781 -916 -201
2012 -201 1225 -95 -1142 562 1015 -902 -692 1066 142 -1248 315 766 -846 -581 1058 211 -921
2029 -921 250 982 -640 -542 858 393 -897 -42 819 -338 -733 704 287 -1009 -176 925 -245
2046 -245 -991 370 585 -653 -271 767 -138 -783 434 758 -599 -506 913 441 -943 -41 828 -425
2064 -425 -642 643 461 -770 -188 934 -313 -917 662 752 -1011 -306 1186 134 -865 557 776
2081 776 -738 -631 985 -128 -1313 332 1035 -844 -672 834 195 -887 142 1089 -578 -588 1084
2098 1084 206 -1356 50 1377 -379 -942 852 562 -1192 -66 992 -331 -1120 808 653 -1259
2114 -1259 -414 1191 -171 -1073 387 896 -820 -445 995 78 -926 576 796 -968 -441 1142 269
$$ packed form
1995E67K26j939Q08J563j376j006J918J2j931N33J684j012j169J623K80j697P15
2012b01J426j320j047J704M53j917K10J758r24j390J563M51j612K65J639q47j132
2029i21J171P32j622R8J400m65j290Q55Q61j157l95J437m17j296Q33J101j170
2046b45p46J361K15j238L82J038r05o45J217L24j357R3J419m72j384R02Q69j253
2064d25k17J285j82j231N82J122j247o04J579R0j763P05J492j052r99J422K19
2081G76j514J07J616j113j185J645P03j879J72J506o39j082J029R47j667j0J672
2098A084q78j562J406J327j756n63J794k90j754J126J058j323p89J928j55j912
2114a259Q45J605j362r02J460N09j716L75J440r17j004J502K20j764N27J583q73
$$ plain form
2131 269 -1157 -7 838 -481 -663 800 55 -1121 169 1055 -489 -876 813 640 -827 -137 957
2148 957 -176 -814 518 453 -972 -168 979 -239 -1099 330 926 -532 -817 673 439 -617 -3
2165 -3 702 -364 -645 837 462 -939 -204 1051 -125 -1046 364 743 -857 -304 734 -237 -825 726
2183 726 664 -989 -509 1206 342 -1116 332 785 -651 -346 592 -35 -789 458 740 -858 -612 924
2201 924 301 -1063 -61 789 -192 -318 762 221 -817 443 907 -664 -657 855 550 -702 -142 653
2219 653 -316 -419 166 360 -577 158 678 -478 -859 219 650 -369 -390 396 250 -449 84 440 -368
2238 -368 -263 658 157 -847 -153 822 -174 -794 129 531 -423 -284 465 -185 -558 573 402 -605 -200
2257 -200 1112 126 -861 198 549 -351 -221 459 -62 -552 310 617 -662 -411 737 51 -840 -55 430
$$ packed form
2131B69j426J150Q45j319j82J463p45j176J290Q86j544l87J689j73j467O90J094
2148I57j133o38J332o5j425Q04J147j218q60J429N96j458k85J490k34j056O14
2165cP05j066k81J482l75j401P35J255j176r21J410L79j600N53J038r71n88J551
2183G26o2j653M80J715q64j458J448M53j436L05R38o27p54J247K82j598K46J536
2201I24o23j364J002Q50r81j26J080n41j038J260M64j571PJ512l05j252N60P95
2219F53r69j03N85J94r37P35N20j156l81J078M31j019k1P86j46o99N33L56q08
2238c68J05R21n01j004O94R75r96o20R23M02r54J39P49o50l73J131j71j007M05
2257b00J312r86r87J059L51r00J30O80n21m90Q62L07j279K51J148o86q91P85M85
$$ plain form
2276 430 -225 -211 456 108 -448 394 469 -214 -521 729 338 -724 -268 306 -227 -293 405 93 -379 106
2296 106 800 -149 -372 418 467 -232 -324 389 257 -413 -31 121 -419 -228 571 166 -603 -7 644 -254 -684
2317 -684 370 283 -352 -14 672 -65 -482 638 410 -889 -90 862 -145 -654 226 438 -625 40 540
2336 540 -217 -650 483 359 -791 -4 812 161 -590 279 306 -314 -159 563 -265 -552 318 275 -562 -347
2356 -347 423 197 -830 207 465 -118 -231 519 174 -582 298 612 -219 -468 275 320 -306 -261 585 64
2376 64 -277 154 103 -93 -170 442 -17 -706 73 584 -62 -631 411 541 -658 -165 632 -56 -626 400
2396 400 359 -635 -351 857 135 -699 234 414 -680 -228 810 -40 -586 428 391 -514 -210 706 217
2415 217 -741 403 556 -484 -452 749 -76 -792 381 680 -598 -521 642 65 -667 227 535 -288 -258
$$ packed form
2276D30o55J4O67l48n56Q42P5o83l07J250l91j062M56N74n33o6O98l12m72M85
2296A06O94r49k23P90M9o99r2P13j32o70L82J52n40J91P99m05p69N96O51q98m30
2317f84J054q7o35L38O86p37m17J120k28j299P99R52j007n09Q80K12j063O65N00
2336E40p57m33J133j24j150P87Q16o51p51Q69K7o20J55P22q28k87Q70m3q37K15
2356c47P70k26j027J037K58n83j13P50l45p56Q80L14q31k49P43M5o26M5Q46n21
2376F4l41M31n1j96p7O12m59o89P79N11o46n69J042J30j199M93P97o88n70J026
2396D00m1r94K84J208p22q34R33J80j094M52J038q50n46J014l7r05L04R16m89
2415B17r58J144J53j040L2J201q25p16J173K99j278P7J163n77p32Q94L08q23L0
$$ plain form
2434 -258 307 279 -471 135 516 -229 -426 259 259 -463 -52 286 -5 -507 270 261 -245 -272 348 -34 -367 -9
2456 -9 357 -151 -276 420 327 -289 -215 464 43 -577 219 340 -457 -111 535 -213 -518 220 378 -316 -295 650
2478 650 60 -608 345 507 -405 -174 710 192 -497 88 542 -367 -447 515 125 -630 -31 607 -212 -443
2498 -443 574 286 -536 -30 604 -49 -352 413 195 -444 -77 338 -46 -347 304 216 -605 -198 394 52
2518 52 -277 72 249 -169 -135 537 86 -448 107 388 -127 -195 446 115 -386 -115 520 -204 -452 259 49
2539 49 -683 -28 348 -123 -395 244 385 -442 -89 348 76 -447 192 215 -411 -158 634 -11 -579 238 470
2560 470 -218 -96 369 92 -602 77 224 -339 -155 321 104 -309 37 284 -152 -225 314 225 -469 125 313
2581 313 -206 -453 244 225 -206 -136 295 -78 -454 388 230 -195 -181 544 -28 -384 1 426 -2 -311 252
$$ packed form
2434b58N65k8p50O06L81p45j97O85%p22M11L38k91n02P77rn06k7O20l82l33L58
2456iL66n08j25O96r3o16P4O79m21o20P96J21p97L46O46p48l05P38J58o94K1R45
2478F50n90o68R53J62r12K31Q84n18o89N85M54r09q0R62l90p55N99O38q19k31
2498d43J017k88q22N06O34o53l03P65k18o39L67M15l84l01O51q8q21M07N92l42
2518E2l29L49J77m18L4O72m51n34N55K81n15o8O41l31n01K71O35p24k48P11k10
2539D9p32O55L76m71k72O39J41q27L53M37k72n23O39K3o26K53P92o45n68Q17K32
2560D70o88J22M65k77o94O79J47n63J84M76k17m13L46K47m36p3N39q9o94N94J88
2581C13n19k47O97j9m31P0M31l73l76Q42j58m25J4P25n72l56L85M25m28l09N63
$$ plain form
2602 252 199 -510 -176 531 -188 -327 268 41 -499 -254 476 -100 -578 344 382 -468 -177 480 -200 -490 181
2623 181 504 -547 -350 720 -34 -681 37 501 -317 -241 326 16 -363 188 504 -214 -442 655 250
2642 250 -248 47 273 -46 -413 24 115 -331 -66 444 -7 -461 168 453 -478 -309 519 200 -214 50
2662 50 289 -225 -348 388 141 -407 -5 489 -149 -492 248 192 -393 -109 197 -57 -291 284 339 -317 -113
2683 -113 542 113 -663 110 532 -290 -308 222 -62 -312 136 364 -325 -499 410 167 -274 -197 463 -78 -258
2704 -258 318 64 -175 -43 421 -118 -390 207 457 -288 -420 243 -54 -444 68 136 -71 -191 340 58
2724 58 -414 454 417 -72 -384 117 90 -136 -192 187 -210 -289 338 197 -322 25 273 -101 -371 108 238 -182
2746 -182 -211 153 -88 -208 339 92 -319 42 453 50 -225 11 290 -136 25 -15 -81 -27 102 71 -124 -113
$$ packed form
2602B52n3p09L34P07p19j39N95k27n40K45P30n76m78R22L8q50K91O57o80k90O71
2623A81L23j051J97J070p54o47P18M64q18P6N67l10l79N51L16p18k28J097m05
2642B50m98K95K26l19l67M37R1m46K65N10m51m54O29K85r31J69Q28l19m14K64
2662E0K39n14j23P36k47n48M02M94o38l43P40n6n85K84L06k54k34N75N5o56K04
2683a13O55m29p76P73M22q22j8N30k84k50M48K28o89j74R09k43m41P7O60n41j80
2704b58N76k54k39J32M64n39k72N97K50p45j32O63k97l90N12O8k07j20N31k82
2724E8m72Q68l7m89l12N01k7k26n6L79l97p9O27j41n19L47K48l74k70M79J30m20
2746a82k9L64k41j20N47k47m11L61M11m03k75K36K79m26J61m0o6N4J29l1j95J1
$$ plain form
2768 -113 277 254 -293 -20 122 89 -31 -62 -78 -56 129 -26 -242 -101 118 -2 -103 -286 218 -43 -221 -3
2790 -3 -50 -142 -33 124 -46 -296 129 261 -60 -79 74 80 -145 42 111 -153 -176 317 9 -404 -62 92 -149
2813 -149 -211 153 63 -249 124 148 -287 -67 391 -3 -381 81 331 -382 -367 117 -126 -179 42 72 -246 -20
2835 -20 376 -39 -284 222 326 39 -108 211 43 -184 112 26 41 -261 366 182 -149 -314 270 0 -180
2856 -180 -50 112 -189 -56 260 93 -133 -57 356 68 -216 90 76 -326 -8 110 100 -386 14 140 -159
2877 -159 -148 297 -8 -438 225 324 -212 -322 275 8 -296 97 164 -348 4 303 67 -499 109 236 -200
2898 -200 -66 183 112 -281 44 281 -112 -202 271 161 -251 -12 380 107 -110 219 232 -62 -73 137 -250
2919 -250 -251 -117 323 -97 -184 68 114 -239 -17 427 -10 -187 217 82 -326 -58 274 26 -387 143 240 -451
$$ packed form
2768a13L90k3n47K73J42l3j20l1j6K2J85j55k16J41K19j20j01j83N04k61j78K18
2790cm7r2J09J57j70k50M25J32l21j9J53Ok25J87O9k64k3M93l08m13L42J54k41
2813a49o2L64r0l12L73K4m35K20M58l94l78M62K50p13J5M84k43n3K21L0l18K26
2835b0L96m15k45N06J04k87j47L19j68k27K96q6J5l02O27j84l31j65N84k70j80
2856a80J30J62l01J33L16j67k26P6M13k88k84L06j4m02L18J18j0m86M00J26k99
2877a59J1M45l05m30O63R9n36j10N97k67l04L93O7n12L52K99k36n66O08J27m36
2898b00J34K49p1l93L25K37l93r0M73j10m12K39L92k73k17L29J3k94j1K10l87
2919b50jJ34M40m20q7K52M6l53K22M44m37j77M04j35m08K68L32k48m13N30R7o91
$$ plain form
2941 -451 -179 208 13 -374 8 237 -244 -135 400 105 -401 295 369 -195 -108 337 112 -325 93 239 -166
2962 -166 -168 278 152 -337 33 164 -233 -83 277 169 -275 34 177 -114 -126 93 74 -308 63 195 -190
2983 -190 -311 163 213 -264 16 83 -87 -27 109 165 -59 -195 31 16 -152 -121 242 25 -192 71 103 -203
3005 -203 -193 188 80 -291 1 164 -251 -171 292 -79 -276 110 113 -118 -259 313 34 -201 53 330 -320
3026 -320 -296 272 50 -378 -104 172 -243 -221 146 -123 -233 274 398 -112 -163 117 3 -138 -28 253 -123
3047 -123 -152 214 -65 -130 76 159 -83 -123 163 55 -124 -18 127 -41 -24 78 -13 50 71 131 161 -184 -92 154
3071 154 -103 -178 -147 173 -9 -162 49 35 -147 45 262 -98 -85 228 19 -238 18 321 140 -260 254
3092 254 -41 -278 90 341 -57 -255 85 159 -240 -5 70 -118 -217 470 83 -151 124 83 140 -103 184 171
$$ packed form
2941d51K72L87j95l87L82K29m81J09N35k95n06O96P4n64Q7M45k25m37M18J46m05
2962a66kM46j26m89L70J31l97J50L60j08m44L09J43k91j2K19j9l82L71J32l85
2983a90j21M74N0m77K80O7j70O0J36N6k24j36K26j5j68L1L63k17k17K63L2l06
3005b03J0L81j08l71K92J63m15Q0M63l71j97L86Lk31j41N72k79k35K54K77o50
3026c20K4N68k22m28K74K76m15K2L67k69j10N07J24n10n1K80j14j41J10K81l76
3047a23k9L66k79o5K06Q3k42m0K86j08j79J06J45j68J7J02r1O3K1O0L0l45R2K46
3071A54k57p5L1L20j82j53K11j4j82J92K17l60J3L13k09k57K56L03j81m00N14
3092B54k95k37L68K51l98j98L40P4l99K35P5j88r9O87l87k34K75m1N7k43K87j3
$$ plain form
3114 171 -327 137 340 -228 -141 185 99 -127 19 162 -38 -183 188 152 -96 35 13 -245 131 201 -70 -147
3136 -147 -88 107 7 -125 -119 150 225 -116 45 -15 -44 -89 -98 -186 -84 179 145 -42 -14 233 140 -96 112 44 -291
3161 -291 -261 145 -78 -50 29 235 -158 -197 0 2 -154 38 30 -170 23 245 146 -103 97 209 -74 -69 55 127
3185 127 -1 -81 -12 -62 -190 178 182 -254 -10 232 164 -8 27 113 78 3 122 54 -21 80 246 -216 -171 119
3209 119 116 -118 -105 210 -55 -4 -71 115 -4 -107 119 -126 62 92 279 -94 -55 180 139 -116 22 208 -232
3232 -232 -86 57 23 -239 60 214 -84 -29 253 20 35 44 209 -49 -224 210 -119 -181 -24 198 -79 -135
3254 -135 134 83 -97 10 75 -63 13 93 -17 -157 91 169 37 -96 122 206 26 -134 -18 160 14 42
3276 42 59 7 -28 24 -54 28 -7 107 22 -81 -35 -42 41 182 79 -36 -67 213 161 9 -217 -66 3 -21 -70 -10
$$ packed form
3114A71m98M64K03n68Q7L26q6k26J46J43k00j45L71l6k48J31k2k58L76P0k71p7
3136a47N9J95j00j32OK69P5l41J61o0k9m5rq8J02K63l4j87K8K47r3k36K08o8l35
3161b91L0M06k23K8P9K06l93l9J97Kj56J92qk00J93K22r9k49K00J12k83NJ24P2
3185A27j28q0O9n0j28L68Mm36K44K42o8j72L5Q6l5p5J19o8p5J01J66m62M5K90
3209A19lk34J3L15k65N1o7J86j19j03K26k45J88L0J87l73L9K35m1k55J38J86m40
3232b32J46J43l4k62K99J54k98N5K82k33J5RJ65k58j75M34l29o2J57K22k77n6
3254a35K69n1j80J07O5j38P6Q0j10j40K48P8j32j33K18Q4j80j60J16J78j46K8
3276D2J7n2l5N2p8Q2l5J14q5j03M6pQ3J41j03j15l1K80n2j52k26J51O9k4m9O0
$$ plain form
3302 -10 -91 126 98 -302 -161 38 -31 26 -172 64 227 -232 82 135 38 86 30 -93 -203 -5 108 -99 -43
3325 -43 127 -35 10 -79 75 -207 18 178 47 -105 127 272 -12 45 -60 54 -249 57 -55 -56 -74 -81 90
3348 90 11 172 64 91 -97 10 164 162 138 272 114 -58 142 66 -15 -4 52 20 47 125 154 -41 -225 -3 16
3373 16 -13 -13 114 16 -54 6 147 -42 -2 25 98 77 15 -37 -124 11 148 -64 -257 -37 -23 35 60 21 54 45 -106
3400 -106 119 141 18 149 136 -185 -104 50 -40 -117 -88 19 42 -106 -79 -10 -345 -77 313 -133 -40 72 113 -115
3424 -115 -47 243 -155 -93 -15 69 -301 -109 115 -82 -133 125 -5 -67 -126 227 -6 -88 49 49 -64 5 174 -55
3448 -55 -42 170 161 -214 37 -48 2 -88 287 5 -151 -86 49 61 70 -1 -1 -114 -122 -51 -67 74 7 -17 92 -23 -20
3475 -20 41 -175 -83 -22 39 -25 -4 -18 7 53 -28 189 4 -3 37 -117 -211 -17 120 103 154 161 -22 -311 11 25 -79
$$ packed form
3302a0q1K17k8m00J41J99o9N7j98K36J63m59L14N3r7M8n6j23j10J98J13k07N6
3325d3J70j62M5q9J54k82K25J60j31j52K32J45k84N7j05J14l03L06j12jj8pJ71
3348I0p9J61j08K7j88J07J54kk4J34j58j72K00p6q1J1N6l2K7P8K9j95j84K22J9
3373A6k9%J27r8p0O0J41j89M0K7P3k1o2n2q7J35J37k12j93K20J4N8K5l9L3rj51
3400a06K25K2j23J31j3l21Q1J54r0p7K9J07K3j48K7O9l35K68L90m46R3J12M1k28
3424a15O8K90l98O2P8Q4l70J92K24j97n1K58j30o2n9L53k33q2J37%j13O9J69k29
3448e5J3K12rl75K51q5N0r0L75k82j56O5J35J2Rp1%j13qP1j6J41o7k4J09j15L
3475b0O1k16R2O1O1o4K1j4K5M6q1K17j85pM0j54r4J94J37j7N1Pj83k89L22J4j04
$$ plain form
3502 -79 -24 112 -29 -42 149 118 -128 60 239 62 -69 116 212 -80 -29 -2 13 -83 58 -92 -233 19 -10
3525 -10 -153 -49 58 42 74 -49 52 1 -102 126 166 -142 99 -30 81 4 -12 42 -30 -45 78 -4 -64 110
3549 110 19 -48 72 -19 49 -152 18 -23 -76 -82 87 -13 -161 -175 16 24 -87 -34 -26 -16 -79 23 -6 122 10 71
3575 71 29 -124 152 -158 -205 147 -42 -86 116 -40 205 -54 -67 -17 -265 17 113 -32 -123 59 89 120 103 10
3599 10 -23 -64 61 107 201 -24 22 48 -136 -247 65 127 -121 -97 -66 257 210 75 74 -21 -66 81 144 22 148
3624 148 143 -85 -3 -72 -42 -108 -40 -29 28 65 6 157 -75 68 94 39 -106 231 37 -7 220 91 98 16 57 -111
3650 -111 46 127 13 -38 57 138 -33 -89 198 -91 98 -3 -26 124 1 73 20 -69 79 -28 -86 -132 -18 -52
3674 -52 104 25 38 -75 53 -102 1 -64 121 26 -56 -104 6 26 105 -160 63 -13 54 15 -26 82 0 -118 -20
$$ packed form
3502g9N5J36j41j3J91l1k46J88J79j77j31J85R6k92N1K7J5r6J41j50j41K52k9
3525a0j43J04J07j6L2j23J01n1j03K28M0l08K41j29J11p7j6N4p2j5J23q2o0J74
3549A10r1o7J20r1O8k01J70m1n3oJ69j00j48j4J91Qj11N3QJ0o3J02k9J28j12O1
3575G1m2j53K76l10m7L52j89m4K02j56K45k59j3N0k48K82R6j45r1J82L0L1j7r3
3599A0l3m1J25M6R4k25M6K6j84j11L12O2k48K4L1L23m7j35jr5m5J47O3j22J26
3624A48nk28Q2o9L0o6O8J1N7L7n9J51k32J43K6n5j45L37j94m4K27j29Pq2M1j68
3650a11J57Q1j14n1R5Q1j71n6K87k89J89j01k3J50j23P2n3q9J48j07n8m6J14l4
3674e2J56p9J3j13J28j55J03o5J85r5q2m8J10K0P9k65K23p6O7l9m1J08q2j18R8
$$ plain form
3699 -20 74 65 50 29 -56 58 79 35 93 -8 134 98 -6 0 30 25 -20 123 48 -4 146 94 -149 -39 -102 -22 -38 -44
3727 -44 -22 -10 -53 35 36 -144 29 45 94 -14 257 184 -22 87 44 -12 148 112 -30 8 -37 -64 94 -139 -37
3752 -37 -108 24 -311 -35 -95 121 -127 -17 -10 2 136 243 26 -68 12 31 -81 26 31 -10 105 3 -136 18
3776 18 106 121 -157 -37 34 119 87 137 117 15 184 71 -45 -110 -27 -1 19 -48 -8 -43 -95 -65 23 4 8 68 -20 -121
3804 -121 -57 -35 -100 -14 -22 69 151 -9 37 16 -12 -158 -36 -100 21 127 -36 15 -12 -6 -134 101 43 53 169 61
3830 61 -51 -59 144 -3 91 -78 62 109 -132 -7 -40 3 -27 -60 61 -67 -11 137 -30 20 127 20 14 146
3854 146 222 36 -62 178 -107 -65 -54 -109 14 32 63 134 -2 67 97 46 49 45 248 -103 63 321 -43 45 72 102
3880 102 139 -80 -2 -42 -12 75 -127 -28 16 27 155 -26 -146 97 145 58 -62 104 -45 83 50 -12 -40 125
$$ packed form
3699b0R4rj5k1q5J14K1m4N8j01J42l6j04OL0nm5J43p5n2J50n2k43J10o3Q0j6o
3727d4K2J2m3Q8Jj80J73J6M9j08K71p3k06J09m3n6J60l6j42L8m5k7J58k33J02
3752c7p1J32l35K76o0K16k48J10PJ2J34J07k17r4Q0J9j12J07Nm1J15j02j39J54
3776A8Q8J5k78J20P1Q5l2N0k0j02J69j13j16o5Q3K6K0o7M0l5n2L0Q8j9MO0q8j01
3804a21O4K2o5Q6qR1Q2j60M6k1k8j46J22o4J21J06j63N1k7Oj28K35n8J0J16j08
3830F1j12qK03j47R4j69J40M7k41J25l3M3l0l3J21j28N6J48j67N0J07j07oJ32
3854A46P6j86r8K40k85M2J1n5J23J8L1P1j36O9L0n1LmK03l51J66K58l64Q8K7L0
3880A02L7k19P8m0L0Q7k02R9M4J1J28j81j20K43M8q7j20J66j49J28l3o2k8J65
$$ plain form
3904 125 -1 -223 -16 238 108 -142 -23 45 -59 32 -17 178 15 -18 55 106 57 -127 -197 -24 39 -62 -46
3927 -46 18 266 -137 -19 -9 171 -164 -63 83 1 -29 -45 5 48 -43 0 14 128 46 -35 -35 72 11 -251 99
3952 99 52 99 -180 -36 161 57 -81 -33 27 -164 -177 30 21 264 -117 -62 137 86 143 -78 -239 -22 -44 -25
3976 -25 -153 -63 -16 -18 -101 -55 -103 -71 35 -71 -32 -161 49 44 -28 182 62 -134 -61 -25 38 57 27 180 -24 -70
4002 -70 9 68 -97 41 16 -249 -40 106 -126 -36 17 -188 -66 -34 -101 -61 -32 6 140 -118 -28 -133 1 74
4026 74 -12 170 183 -42 -42 -140 10 36 -8 -256 -37 -37 -17 29 30 -31 43 -8 -1 24 -187 52 0 156 8 -140 12
4053 12 -6 -125 -106 46 29 76 122 163 -42 -59 74 217 -59 -67 75 -24 -42 111 174 96 16 34 -75 124 93 186
4079 186 -27 126 62 -172 -75 -21 101 -29 65 13 81 29 139 65 -142 105 32 44 -49 -107 -76 -186 -55 104
$$ packed form
3904A25j26k22K07K54j30k50J19O8j04R1m9J95j63l3P3N1m9j84p0J73O3j01J6
3927d6O4K48m03J18J0J80l35J01J46q2l0j6N0M3r1M3J4J14q2q1%J07o1k62L50
3952I9m7M7k79J44J97j04j38M8O0j91j3K07rK43l81N5J99n1N7k21j61K17k2J9
3976b5j28R0M7kq3M6m8L2J06j06L9j29K10np2K10j20j96P3L6O3J9l0J53k04m6
4002g0P9N9j65J38k5k65K09J46k32R0N3k05J22L2o7M0K9L8J34k58R0j05J34P3
4026G4q6J82J3k25%r8J50K6m4k48K19%K0M6Jo1P4n1PK5k11K39n2J56j48j48J52
4053A2j8j19J9J52j7M7M6M1k05j7J33J43k76qJ42r9j8J53O3p8q0J8j09J99l1R3
4079A86k13J53o4k34R7N4J22j30R4n2O8n2J10p4k07K47p3J2r3n8L1j10J31J59
$$ plain form
4103 104 -24 -79 -75 -42 -16 143 127 181 72 -107 197 258 -138 120 -17 -13 31 190 23 90 79 -18 -140 -130 72
4128 72 146 31 -52 40 -123 -39 214 84 -228 2 203 48 92 123 162 51 77 -75 -130 -67 50 75 -137 39
4152 39 -50 11 -52 -53 115 -122 -98 -123 30 59 2 -17 5 35 -55 -123 -21 112 176 -50 24 102 -25 -55 96 23 -5
4179 -5 53 60 66 -48 -117 -47 134 47 57 -168 -37 57 73 -98 -66 88 -107 47 -80 107 120 -111 -146 -196 -65 94
4205 94 114 -79 -1 35 8 -48 -35 70 8 51 -40 30 -166 125 -55 44 106 153 38 -15 189 -10 85 -57 -23 -76
4231 -76 -70 -73 -41 -133 12 -74 70 -96 78 62 -49 48 -219 -32 -45 72 97 -108 36 125 82 5 123 116 119 45 -35
4258 -35 -14 -62 -40 -16 72 -21 -29 -47 -17 -11 -94 -143 -64 124 87 -83 0 -90 61 -41 -165 38 -84 88 29 -148 -3
4285 -3 75 44 48 -21 3 -42 -140 7 -26 -96 175 11 44 11 151 82 70 49 100 -42 -31 180 67 32 97 -68 -147
$$ packed form
4103A04j28n5ML3K6J59j6N4j09j79L04O1l96K58j37MM4J59j67O7j1r7j22J0K02
4128G2P4j15q3R2j63Q4K53j30l12K30K01j55M4L1L9j11K6j52n5O3J17K5k12J76
4152C9q9O1o3jJ68k37K4k5J53K9n7j9K2L0r0o8J02J33O4k26P4P8j27l0J51p3k8
4179eN8POj14o9P0J81q7J0k25J31R4J6j71L2J54j95J54j27J87J3k31l5n0J31J59
4205I4K0j93P8L6k7n6J3J05o2M3r1P0j96K91j80R9O2M7j15n3K04j99R5j42L4n3
4231g6OlL2r2J45q6J44j66J74j6j11R7k67J87j3J17K5k05J44Q9m3p7J18pLp4q0
4258c5K1m8K2K4Q8r3qj8L0Oq3m9P9J88l7j70Q3r0J51j02j24K03j22J72n9j77J45
4285cP8l1Mo9K4m5r8J47l3p0K71j64L3l3J40o9j2k1N1j42J1K11j13l5O5j65p9
$$ plain form
4312 -147 104 -10 86 88 -71 57 -106 -10 -35 -108 -172 -98 -54 111 169 -112 -61 20 50 -102 17 99 -98 77 -71
4337 -71 63 5 100 110 -70 -87 -9 44 -49 -12 71 -175 -68 141 49 203 -79 45 -22 -10 77 58 -4 98 53 -195
4363 -195 -121 -129 -153 -83 59 4 136 -67 -52 -53 -49 13 33 -175 120 25 101 -97 -68 55 26 -52 -104 150 -72 44
4389 44 -60 89 60 -75 -19 39 31 -136 -50 -84 -94 -295 -23 -92 -150 48 139 -30 -28 18 22 114 7 -231 -149 69
4415 69 73 -16 -62 88 34 116 45 8 -137 36 123 17 -90 -10 -98 -253 68 83 -129 114 -7 -64 109 16 40
4440 40 -117 -82 -51 156 -160 23 -143 12 -11 -19 -123 80 9 144 -59 -218 -18 13 106 2 47 21 -1 10
4464 10 -48 1 77 -177 -13 -95 -51 -169 -27 19 112 -11 -57 -56 -34 89 -29 -2 100 -52 41 -7 -69 -66 42 82
4490 82 103 -76 113 87 -40 -34 135 -36 -16 8 -103 140 136 79 4 -139 -127 -55 154 -191 -23 -14 -36 25 -15 -95
$$ packed form
4312a47K51j14R6Kj59J28j63R6k5p3o4P4M4J65N8k81N1Q1L0j52J19Q2j97J75j48
4337g1J34n8R5J0j80j7P8N3r3L7Q3k46J07K09r2J54k82J24o7J2Q7j9o2J02m5k48
4363a95P4qk4P0J42n5J32k03J5jMO2K0k08K95r5P6j98K9J23k9p8n2K54k22J16
4389D4j04J49k9j35N6N8qj67Q6l4j0k01K72o9n8J98R1j69KM6MR2j07k38Q2K18
4415F9Mq9m6J50n4Q2p1l7j45J73Q7j06j07Q0q8j55L21J5k12K43j21n7J73r3K4
4440D0j57L5L1K07l16J83j66J55k3qj04K03p1J35k03j59K00L1R3j04M5k6k2J1
4464A0n8M9P6k54J64q2M4j18J42M6R3j23m6JK2J23j18K7J02j52R3m8o2LJ08M0
4490H2K1j79J89k6j27OJ69j71K0K4j11K43mn7p5j43J2P2K09l45J68Rk2O1m0q0
$$ plain form
4516 -95 28 -53 -72 6 -2 -73 26 15 -103 -4 117 -5 306 14 -68 62 116 -1 -74 36 -186 17 77 162 -48
4541 -48 -55 29 -38 -69 -101 104 23 -45 -77 31 -80 15 -67 57 13 -72 -24 45 -105 160 -101 36 -41 70 -230 144
4567 144 -36 -64 149 66 121 -108 50 31 -60 -189 86 119 -10 -121 -135 -8 -104 -125 49 -100 27 -37 87
4590 87 -35 133 67 116 7 -31 -14 14 -68 -114 117 45 -59 -19 207 111 -49 -51 91 18 105 134 -43 -70 -1 34
4616 34 -19 77 -120 -82 -67 -18 37 155 -108 4 -115 14 102 90 175 178 177 -71 -68 164 -12 -89 -92 -95 147 -97 -187
4643 -187 114 -53 54 151 -18 -121 65 98 -50 70 177 -1 -55 -113 -55 87 51 31 3 -20 -36 32 24 112 -1
4668 -1 6 55 137 129 -71 188 -37 9 48 16 -1 -90 13 126 144 229 76 -25 14 -1 -95 127 58 100 -55 -40 -19
4695 -19 -11 -52 -234 -133 -115 39 38 43 -147 -37 -82 1 -108 -29 -23 12 -94 17 25 -161 -50 -9 -132 52 -116 -164
$$ packed form
4516i5J23q1j9P8qp1R9j1j18R9J21j22L11k92q2J30N4j17p3J10k22K03O0Q5k10
4541d8pQ4o7l1l2K05q1o8l2J08j11R5q2J24m4q5M8O9j50K65k61J37p7J11l00L74
4567A44j80k8K13q3N5k29J58j9r1j29K75L3j29j11j4J27r6k1J74j49J27o4J24
4590H7j22J68o6M9j09l8J7K8q2m6K31p2j04M0K26r6j60kJ42p3Q7K9j77k7O9L5
4616C4n3R6j97L8J5M9N5J18k63J12j19J29Q8j2Q5Ljk48LK32j76p7llK42k44r0
4643a87L01j67J07R7j69j03J86L3j48J20J07j78n4n8N8J42l6k0k8k3j6O8qQ8j13
4668aPM9Q2qk00K59k25M6L9l2j7q9J03J13J8Q5j53j01L9j5r4K22o9M2j55J5K1
4695a9Qm1j82J01J8J54jNj90J10m5Q3j09P9OL5j06J11Qj86J11M1j23J84j68m8
$$ plain form
4721 -164 -36 -63 117 47 -97 -61 67 -37 -62 -136 87 -71 76 -242 101 -94 20 -42 -102 45 65 85 76 26
4745 26 -24 -71 23 0 75 95 -122 142 71 -81 194 54 128 76 -126 10 36 46 -70 -44 -192 -60 10 -110 95
4770 95 101 45 -154 -86 89 57 12 -78 129 176 95 74 -83 -166 17 -83 172 12 58 45 -235 96 -18 231 -119
4795 -119 -7 152 -83 -42 -60 -193 -158 39 19 19 48 27 -49 176 -3 -186 5 22 -23 23 -146 -55 -66 -85 151
4820 151 -122 75 149 47 90 -7 154 -12 -20 30 -106 -18 58 3 -62 -64 -116 118 -58 -49 107 -58 50 109 -45
4845 -45 50 160 -106 106 -218 -149 -151 -126 86 -12 -183 17 -197 38 -36 132 55 0 33 121 106 42 -205 37 54
4870 54 67 -13 170 182 -10 -21 -127 154 -28 -48 -15 104 28 75 -10 110 82 -96 59 13 -68 12 190 131 46
4895 46 -106 37 70 3 -6 -3 -3 -135 166 62 89 -6 169 -8 42 108 32 121 -3 119 85 74 140 -68 105 142
$$ packed form
4721a64J28k7J80p0j44L6J28j04k5p4K23j58J47l18L43j95J14o2o0J47K0K0rn0
4745B6n0m7R4k3P5K0k17K64p1j52K75j40P4n2k02J36K6J0j16K6j48J32P0j20K05
4770I5On6j99O8J75l2m5r0K07M7q1k1j57q3J83j00K55j60M6j3k80L31j14K49l50
4795a19J12J59k35M1j8j33L5J97k0%K9k1p6K25j79j83J91J7m5M6j69R1j1j9K36
4820A51k73J97P4j02M3r7J61j66qN0j36Q8P6n5o5kn2K34j76RJ56j65J08N9j54
4845d5R5J10k66K12l24O9kK5K12r8j71K00k14K35p4J68p7n5L3Q8j5o4k47K42J7
4870E4J3q0J83J2j92j1j06K81j82k0L3J19p6M7q5J20k8j78J55m6q1Q0J78n9q5
4895D6j52J43L3o7rL%j32L01j04K7r5J75j77N0O6p6Q9j24J22l4j1O6k08J73L7
$$ plain form
4921 142 -65 -36 -40 -101 23 191 88 133 4 -24 183 -78 -153 83 33 -114 73 97 81 156 88 -83 -35 -44 -7
4946 -7 22 38 -63 -124 -43 27 -213 -264 -118 -58 -13 -88 19 75 -99 49 -86 63 -20 14 32 143 187 5 -119
4971 -119 91 -52 -84 52 -107 -171 56 14 273 -69 -98 35 -108 -38 -129 133 -35 -17 211 59 3 -195 9
4994 9 58 -59 -76 4 -4 -26 58 -83 -105 -50 -76 -70 87 -114 163 -113 55 19 145 116 -54 -68 -235 13 14 -6 4
5021 4 151 -122 77 -60 -146 76 -37 -98 -50 77 -29 97 24 126 29 40 -179 159 92 63 -29 92 12 -67
5045 -67 70 213 -66 -98 22 102 113 -134 -7 -93 -73 -118 7 -189 -107 72 -57 -33 133 138 -31 -176 94 -1
5069 -1 -104 74 252 41 109 103 45 80 -15 -84 -191 2 34 1 72 -4 -44 93 64 38 -93 19 -82 -38 94 -103
5095 -103 48 32 -21 -142 222 -68 54 139 7 -77 -59 4 28 -108 25 -28 -55 74 19 62 80 -79 -72 -51 61
$$ packed form
4921A42k07K9mo1J24J68j03M5j29k8K07k61p5K36n0j47J87K4j6P5o8j71M8rL7
4946gK9J6j01o1Q1P0k40n1J46O0M5p5J07N6j74J48j35J49q3L4J8J11M4j82j24
4971a19K10j43l2J36j59o4K27m2K59l42k9J33j43P0r1K62j68J8K28j52n6j98K04
4994IM9j17j7Q0qk2Q4j41k2N5k6OJ57k01K77k76J68l6J26k9j70j4j67K48Jk0J0
5021DJ47k73J99j37q6K22j13o1M8J27j06J26p3J02r7J1k19L38o7k9r2J21q0p9
5045f7J37J43k79l2J20Q0J1k47J27q6K0m5J25j96Q2J79j29K4J66Nj69j45K70r5
5069aj03J78J78k11O8on8L5r5o9j07J93L2l3P1p6m0J37k9k6j31J12j01M4J32j97
5095a03J51j6n3j21L64k90J22Q5j32q4J8O3K4j36J33n3k7J29n5M3J8j59PK1J12
$$ plain form
5120 61 -27 -28 -100 0 -146 -158 -55 10 -108 49 194 -12 15 39 79 -89 -81 4 43 13 -24 1 -18 107 34 -44 -59
5147 -59 -80 110 -52 -196 -204 38 53 -165 138 42 72 -129 -33 74 -44 -32 -19 158 -181 176 74 167 187 -19
5171 -19 70 57 -144 -14 -24 -23 -46 59 32 -209 -70 18 47 33 -207 113 43 -32 60 30 62 5 -62 228 82 159
5197 159 30 -241 64 21 -115 -85 -26 6 -20 -95 -158 108 111 1 27 -116 141 246 75 49 34 92 18 -21 -35
$$ packed form
5120F1q8jp2J00j46j2J03O5j18J57J45k06K7K4M0j68QQ5L9l0l7K5j9J25p3p8j5
5147e9k1J90j62j44qK42J5k18L03r6L0k01R6J07j18J2J3J77l39L57j02R3K0k06
5171a9Q9j3k01J30j0Jk3J05k7k41J39Q8K9j4k40L20p0p5R2l0L2n7o7K90j46P7
5197A59j29k71L05m3j36L0N9L2k6p5o3K66Lj10K6j43K57J05j71k6j5N8p4l9j4
$$ [...]
8191E3
##END NTUPLES=NMR FID
##END=
