##TITLE=1H_Pr 29-mat
 200.13Hz,DCDCl3.
 8 sc
 4.6.2026
##JCAMPDX= 6.0         $$ Bruker NMR JCAMP-DX V2.0
##DATA TYPE= NMR FID
##DATA CLASS= NTUPLES
##ORIGIN= UXNMR, Bruker Analytische Messtechnik GmbH
##OWNER= pz
$$ XWIN-NMR		Version 3.5
$$ Thu Jun  4 14:20:30 2026 Russian Standard Time (UT+4h)  she@DPX200
##.OBSERVE FREQUENCY= 200.131
##.OBSERVE NUCLEUS= ^1H
##.DELAY= (6, 6)
##.ACQUISITION MODE= SIMULTANEOUS
##.ACQUISITION SCHEME= undefined
##.AVERAGES= 8
##.DIGITISER RES= 18
##SPECTROMETER/DATA SYSTEM= spect
##.PULSE SEQUENCE= zg30
##.SOLVENT NAME= CDCl3
##.SHIFT REFERENCE= (INTERNAL, CDCl3, 0, 14.3821)
##AUDIT TRAIL= $$ (NUMBER, WHEN, WHO, WHERE, WHAT)
$$ ##TITLE= Audit trail, XWIN-NMR		Version 3.5
$$ ##JCAMPDX= 5.01
$$ ##ORIGIN= Bruker BioSpin GmbH
$$ ##OWNER= she
$$ F:/spectra/data/she/nmr/H-C/1/audita.txt
$$ ##AUDIT TRAIL=  $$ (NUMBER, WHEN, WHO, WHERE, WHAT)
(   1,<2026-06-04 14:19:16.71 +0400>,<she>,<DPX200>,
      <created by zg, POWCHK disabled, PULCHK disabled
       configuration hash MD5:
       00 E9 B6 7A A2 85 ED C7 34 08 36 98 17 FE 4E 26
       data hash MD5: 16K
       6A A1 DB 94 4E 10 89 EC AA E9 69 20 51 0E 7F FA>)
$$ ##END=
$$ 
$$ hash MD5
$$ CB 10 0D 21 D2 59 DF 0C DE 7C AF 3F 5A 1A 95 E1
##$RELAX= 
##$RELAX= 
##$RELAX= 
##$RELAX= 
##$RELAX= 
##$RELAX= 
$$ Bruker specific parameters
$$ --------------------------
##$DU= <F:/spectra>
##$EXPNO= 1
##$NAME= <H-C>
##$PROCNO= 1
##$TYPE= <nmr>
##$USER= <she>
##$AMP= (0..31)
100 100 100 100 100 100 100 100 100 100 100 100 100 100 100 100 100 100 
100 100 100 100 100 100 100 100 100 100 100 100 100 100 
##$AQSEQ= 0
##$AQ_mod= 1
##$AUNM= <au_zg>
##$AUTOPOS= <>
##$BF1= 200.13
##$BF2= 200.13
##$BF3= 200.13
##$BF4= 200.13
##$BF5= 200.13
##$BF6= 200.13
##$BF7= 200.13
##$BF8= 200.13
##$BYTORDA= 1
##$CFDGTYP= 0
##$CFRGTYP= 5
##$CHEMSTR= <none>
##$CNST= (0..31)
1 1 145 1 1 1 1 1 1 1 1 1 1 1 1 1 1 1 1 1 1 1 1 1 1 1 1 1 1 1 1 1 
##$CPDPRG= <>
##$CPDPRG1= <>
##$CPDPRG2= <>
##$CPDPRG3= <>
##$CPDPRG4= <mlev>
##$CPDPRG5= <mlev>
##$CPDPRG6= <mlev>
##$CPDPRG7= <mlev>
##$CPDPRG8= <mlev>
##$CPDPRGB= <>
##$CPDPRGT= <>
##$D= (0..31)
0 0.7 0 0 0 0 0 0 0 0 0 0.03 0 0 0 0 0 0 0 0 0 0 0 0 0 0 0 0 0 0 0 0 
##$DATE= 1780568356
##$DBL= (0..7)
120 120 120 120 120 120 120 120 
##$DBP= (0..7)
150 150 150 150 150 150 150 150 
##$DBP07= 0
##$DBPNAM0= <>
##$DBPNAM1= <>
##$DBPNAM2= <>
##$DBPNAM3= <>
##$DBPNAM4= <>
##$DBPNAM5= <>
##$DBPNAM6= <>
##$DBPNAM7= <>
##$DBPOAL= (0..7)
0.5 0.5 0.5 0.5 0.5 0.5 0.5 0.5 
##$DBPOFFS= (0..7)
0 0 0 0 0 0 0 0 
##$DE= 6
##$DECBNUC= <off>
##$DECIM= 32
##$DECNUC= <off>
##$DECSTAT= 4
##$DIGMOD= 1
##$DIGTYP= 9
##$DL= (0..7)
0 120 120 120 120 120 120 120 
##$DP= (0..7)
150 150 150 150 150 150 150 150 
##$DP07= 0
##$DPNAME0= <>
##$DPNAME1= <>
##$DPNAME2= <>
##$DPNAME3= <>
##$DPNAME4= <>
##$DPNAME5= <>
##$DPNAME6= <>
##$DPNAME7= <>
##$DPOAL= (0..7)
0.5 0.5 0.5 0.5 0.5 0.5 0.5 0.5 
##$DPOFFS= (0..7)
0 0 0 0 0 0 0 0 
##$DQDMODE= 0
##$DR= 18
##$DS= 0
##$DSLIST= <SSSSSSSSSSSSSSS>
$$ [...]
##$SUBNAM0= <"">
##$SUBNAM1= <"">
##$SUBNAM2= <"">
##$SUBNAM3= <"">
##$SUBNAM4= <"">
##$SUBNAM5= <"">
##$SUBNAM6= <"">
##$SUBNAM7= <"">
##$SUBNAM8= <"">
##$SUBNAM9= <"">
##$SW= 18.0517599122864
##$SWIBOX= (0..15)
0 0 2 0 0 0 0 0 0 0 0 0 0 0 0 0 
##$SW_h= 3612.71676300578
##$TD= 16384
##$TD0= 1
##$TE= 0
##$TE2= 300
##$TE3= 300
##$TEG= 300
##$TL= (0..7)
0 120 120 120 120 120 120 120 
##$TP= (0..7)
150 150 150 150 150 150 150 150 
##$TP07= 0
##$TPNAME0= <>
##$TPNAME1= <>
##$TPNAME2= <>
##$TPNAME3= <>
##$TPNAME4= <>
##$TPNAME5= <>
##$TPNAME6= <>
##$TPNAME7= <>
##$TPOAL= (0..7)
0.5 0.5 0.5 0.5 0.5 0.5 0.5 0.5 
##$TPOFFS= (0..7)
0 0 0 0 0 0 0 0 
##$TUNHIN= 0
##$TUNHOUT= 0
##$TUNXOUT= 0
##$USERA1= <user>
##$USERA2= <user>
##$USERA3= <user>
##$USERA4= <user>
##$USERA5= <user>
##$V9= 5
##$VALIST= <valist>
##$VCLIST= <CCCCCCCCCCCCCCC>
##$VD= 0
##$VDLIST= <DDDDDDDDDDDDDDD>
##$VPLIST= <PPPPPPPPPPPPPPP>
##$VTLIST= <TTTTTTTTTTTTTTT>
##$WBST= 1024
##$WBSW= 4
##$XGAIN= (0..3)
0 0 0 0 
##$XL= 0
##$YL= 0
##$YMAX_a= 1057240
##$YMIN_a= -556250
##$ZGOPTNS= <>
##$ZL1= 120
##$ZL2= 120
##$ZL3= 120
##$ZL4= 120
##$ABSF1= 10
##$ABSF2= 0
##$ABSG= 5
##$ABSL= 3
##$ALPHA= 0
##$AQORDER= 0
##$ASSFAC= 0
##$ASSFACI= 0
##$ASSFACX= 0
##$ASSWID= 0
##$AUNMP= <proc_1d>
##$AZFE= 0.1
##$AZFW= 0.1
##$BCFW= 1
##$BC_mod= 2
##$BYTORDP= 1
##$COROFFS= 0
##$CY= -3
##$DATMOD= 1
##$DC= 2
##$DFILT= <>
##$DTYPP= 0
##$F1P= 0
##$F2P= 0
##$FCOR= 0.5
##$FTSIZE= 0
##$FT_mod= 4
##$GAMMA= 1
##$GB= 0.15
##$INTBC= 1
##$INTSCL= 1
##$ISEN= 128
##$LB= 0.25
##$LEV0= 0
##$LPBIN= 0
##$MAXI= 10000
##$MC2= 0
##$MEAN= 0
##$ME_mod= 0
##$MI= 1.114404
##$NCOEF= 0
##$NC_proc= 0
##$NLEV= 6
##$NOISF1= 3.799351
##$NOISF2= 2.8
##$NSP= 1
##$NTH_PI= 0
##$NZP= 0
##$OFFSET= 14.38212
##$PC= 1
##$PHC0= -4218.114
##$PHC1= 9.39229
##$PH_mod= 1
##$PKNL= yes
##$PPARMOD= 0
##$PSCAL= 0
##$PSIGN= 0
##$REVERSE= no
##$SF= 200.129724274929
##$SI= 16384
##$SIGF1= 3
##$SIGF2= 2
##$SINO= 400
##$SIOLD= 16384
##$SREGLST= <1H.CDCl3>
##$SSB= 0
##$STSI= 0
##$STSR= 0
##$SW_p= 3205.1282051282
##$SYMM= 0
##$S_DEV= 0
##$TDeff= 0
##$TDoff= 0
##$TI= <>
##$TILT= no
##$TM1= 0
##$TM2= 0
##$TOPLEV= 0
##$USERP1= <user>
##$USERP2= <user>
##$USERP3= <user>
##$USERP4= <user>
##$USERP5= <user>
##$WDW= 1
##$XDIM= 8192
##$YMAX_p= 0
##$YMIN_p= 0
$$ End of Bruker specific parameters
$$ ---------------------------------
##NTUPLES= NMR FID
##VAR_NAME=  TIME,          FID/REAL,        FID/IMAG
##SYMBOL=    X,             R,               I
##VAR_TYPE=  INDEPENDENT,   DEPENDENT,       DEPENDENT
##VAR_FORM=  AFFN,          ASDF,            ASDF
##VAR_DIM=   8192,          8192,            8192
##UNITS=     SECONDS,       ARBITRARY UNITS, ARBITRARY UNITS
##FACTOR=    0.0002768,     1,               1
##FIRST=     0,             0,               0
##LAST=      2.2672688,     0,               0
##MIN=       0,             -556250,         0
##MAX=       2.2672688,     1057240,         0
$$ Real data points
##PAGE= N=1
##DATA TABLE= (X++(R..R)), XYDATA
$$ plain form
0 0 0 0 0 0 0 0 0 0 0 0 5 -8 8 -8 8 -14 16 -24 24 -32 37 -44 52 -61 72 -84 100 -116 132 -153 174 -201 226
33 226 -255 291 -327 367 -413 462 -516 576 -640 710 -786 872 -963 1063 -1172 1292 -1422
50 -1422 1568 -1727 1902 -2098 2316 -2561 2842 -3158 3525 -3956 4467 -5085 5855 -6842 8156
65 8156 -10001 12786 -17516 27406 -90160 478915 988388 591085 42075 -200061 -62292
76 -62292 -24995 -188281 -337415 -159990 172802 328748 159128 -66271 -135744 -62950 -14894
87 -14894 5020 35701 67565 18921 -68960 -76367 61697 184579 88827 -200699 -361552 -166221
99 -166221 219239 395974 214601 -97955 -230889 -135348 -5504 -10770 -91410 -72522 78348
110 78348 186300 105043 -87060 -180197 -70577 145371 268617 177201 -56642 -229842 -215510
$$ packed form
0@%%%%%%%%%%Nj3J6j6J6k2L0m0M8n6O9q1R6j13J33j56J84k16K48k85L27l75M27
33B26m81N46o18O94p80Q75r78J092j216J350j496J658j835K026k235K464k714
50a422K990l295L629m000M414m877N403o000O683p481Q423r552J0940j2697J4998
65H156j8157K2787l0302M4922j17566N69075N09473l97303n49010k42136J37769
76f2292L7297j63286j49134J77425L32792J55946j69620k25399o9473P2794M8056
87a4894J9914L0681L1864m8644q7881p407J38064J22882r5752k89526j60853J95331
99a66221L85460J76735j81373l12556j32934R5541J29844n266q0640J8888J50870
110G8348J07952q1257j92103r3137J09620K15948J23246r1416k33843j73200J4332
$$ plain form
121 -215510 -73921 48301 80762 57031 35016 36633 44472 36948 16213 -9206 -44509 -88817
133 -88817 -99715 -50655 11744 27331 22384 60474 117960 88881 -60765 -206422 -178056 33800
145 33800 230650 208368 -2981 -177141 -162639 -39243 30769 16412 11971 71208 130214
156 130214 98494 -14660 -105263 -102179 -40596 3800 17251 28020 36174 18697 -9399 -4448
168 -4448 30426 36090 -20687 -88704 -84806 -712 77315 68898 -2426 -49284 -36000 -4700 5192
181 5192 7222 25469 43027 30295 -9817 -41099 -44030 -31509 -18394 5251 44574 66901 38276
194 38276 -20662 -48239 -19866 21858 26215 -704 -14959 -918 7184 -14677 -37566 -20410
206 -20410 24071 42526 16919 -14204 -14169 3812 3245 -19097 -27941 -3302 27368 24068 -5747
$$ packed form
121b15510J41589J22222L2461k3731k2015J617P839p524k0735k5419l5303m4308
133h8817j0898M9060O2399J5587m947L8090N7486k9079j49646j45657K8366K11856
145C3800J96850k2282k11349j74160J4502J23396P0012j4357m441N9237N9006
156A30214l1720j13154r0603L084O1583M4396J3451J0769Q154j7477k8096M951
168d448L4874N664n6777o8017L898Q4094P8027q417p1324m6858J3284L1300R892
181E192K030J8247J7558j2732m0112l1282k931J2521J3115K3645L9323K2327k8625
194C8276n8938k7577K8373M1724M357k6919j4255J4041Q102k1861k2889J7156
206b0410M4481J8455k5607l1123L5J7981n67k2342q844K4639L0670l300k9815
$$ plain form
219 -5747 -19476 -5061 6825 -808 -8025 3852 20006 13637 -8669 -17038 532 17137 4214
232 4214 -23520 -20072 19044 43685 17833 -26289 -38074 -14451 7681 9452 2522 3727 13053
245 13053 14069 -1483 -16810 -15746 -9740 -9841 -2136 24177 40178 15405 -27655 -40434 -14167
258 -14167 15703 15937 -8297 -19302 7515 42413 36620 -9204 -43349 -38670 -15249 6206 25021
271 25021 36780 28340 1999 -23476 -33137 -25358 -10952 -1333 8894 33138 54355 29070 -36826
284 -36826 -76916 -45318 20987 54464 35008 -4167 -21598 -5634 13272 4341 -18249 -21903
296 -21903 -6744 723 2144 13628 27834 23546 1742 -18698 -30026 -29258 -17020 2168 25224
309 25224 49877 53207 8323 -61627 -90307 -45644 31686 80288 71915 18456 -38403 -57000
$$ packed form
219e747j3729J4415J1886p633p217J1877J6154o369k2306q369J7570J6605j2923
232D214k7734L448L9116K4641k5852m4122j1785K3623K2132J771o930J205R326
245A3053J016j5552j5327J064O006j01P705K6313J6001k4773m3060j2779K6267
258a4167K9870K34k4234j1005K6817L4898n793m5824l4145M679K3421K1455J8815
271B5021J1759q440k6341k5475r661P779J4406R619J0227K4244K1217k5285o5896
284c6826m0090L1598O6305L3477j9456l9175j7431J5964J8906q931k2590l654
296b1903J5159P467J421J1484J4206m288k1804k0440j1328P68J2238J9188K3056
309B5224K4653L330m4884o9950k8680M4663P7330M8602q373n3459n6859j8597
$$ plain form
321 -57000 -36446 -10707 2048 15640 32896 35707 15716 -16090 -39678 -32786 6648 40578
333 40578 26521 -20702 -44318 -21933 18713 41820 33675 2240 -29635 -41149 -29969 -1915
345 -1915 36915 63732 42762 -21463 -70662 -61298 -13674 25036 38722 38795 35295 20248 -18522
358 -18522 -67236 -74491 -11802 67947 81213 16522 -51862 -59147 -13923 30033 35963 11790 -6176
371 -6176 -4187 -4935 -20578 -23375 6208 38474 29807 -13612 -45690 -35511 5991 40444 40785 17542
385 17542 -2171 -15419 -36589 -53663 -30094 32787 77982 57246 -11522 -63790 -52881 1800
397 1800 39432 28981 2785 -1691 4989 -10529 -37822 -34081 11374 52431 42866 -8950 -46877
410 -46877 -32186 11642 30382 12336 -7357 -5707 -3058 -16993 -27085 -5769 34478 49773
$$ packed form
321e7000K0554K5739J2755J3592J7256K811j9991l1806k3588O892L9434L3930
333D0578j4057m7223k3616K2385M0646K3107q145l1435l1875j1514J1180K8054
345a915L8830K6817k0970o4225m9199R364M7624L8710J3686P3l500j5047l8770
358a8522m8714p255O2689P9749J3266o4691o8384p285M5224M3956N930k4173j7966
371f176J989p48j5643k797K9583L2266q667m3419l2078J0179M1502L4453L41k3243
385A7542j9713j3248k1170j7074K3569O2881M5195k0736o8768n2268J0909N4681
397A800L7632j0451k6196m476O680j5518k7293L741M5455M1057r565n1816l7927
410d6877J4691M3828J8740j8046j9693J650K649j3935j0092K1316M0247J5295
$$ plain form
422 49773 18675 -29994 -47072 -20481 13104 21341 13013 10316 10319 -4138 -26640 -29092 -437 32810
436 32810 38047 11591 -17961 -25472 -14716 -3527 4067 11827 15455 5795 -11970 -19236 -9585 5863
450 5863 11497 5925 -961 -3569 -7203 -13207 -9711 6962 20200 12924 -5954 -14631 -5369 6573
464 6573 9072 4171 4315 8176 2803 -12803 -17727 473 20365 16878 -4203 -14478 -4843 5421
478 5421 896 -8757 -5093 10432 16142 -1871 -21764 -17081 4803 11951 -124 -7298 1326 7560
492 7560 -3266 -17761 -14698 6647 21929 11890 -8773 -10480 7540 13016 -3618 -13585 3505
505 3505 23733 18512 -3798 -15118 -5720 7036 4038 -7996 -5646 12037 15638 -8236 -28616
518 -28616 -15067 12638 15527 -4571 -15818 -3906 9467 4925 -11823 -14260 4840 18950 5034
$$ packed form
422D9773l1098m8669j7078K6591L3585Q237q328k697Lj4457k2502k452K8655L3247
436C2810N237k6456k9552p511J0756J1189P594P760L628r660j7765p266R651J5448
450E863N634n572o886k608l634o004L496J6673J3238p276j8878q677R262J1942
464F573K499m901J44L861n373j5606m924J8200J9892l487k1081j0275R635J0264
478E421m525r653L664J5525N710j8013j9893M683K1884P148j2075p174Q624O234
492G560j0826j4495L063K1345J5282j0039k0663j707J8020N476j6634r967J7090
505C505K0228n221k2310j1320R398J2756k998j2034K350J7683L601k3874k0380
518b8616J3549K7705K889k0098j1247J1912J3373m542j6748k437J9100J4110j3916
$$ plain form
531 5034 -17805 -13319 10578 16034 -3308 -13528 739 16437 10135 -8980 -13757 4930 25694
544 25694 19398 -6619 -15304 1952 12437 -669 -11507 -1078 11642 3608 -15605 -20705 -5890
557 -5890 10262 5637 -13405 -16512 4326 18296 1684 -19659 -11876 12224 17501 471 -10825
570 -10825 -4371 7337 6700 -4528 -7963 5902 17723 5955 -12627 -7529 14371 18332 387
583 387 -9243 2443 12506 4212 -13007 -18501 -4625 10672 6466 -9379 -9438 4999 5302 -13521
597 -13521 -20512 -555 19687 14089 -5680 -13546 -4398 4508 -1144 -11784 -7392 11923 18484 1769
611 1769 -10933 1003 16484 7579 -11448 -9862 12471 25607 11847 -11833 -16429 1209 10089
624 10089 -7714 -25304 -11615 18170 23017 -1432 -16993 -8748 2448 -2901 -12047 -3585 18630
$$ packed form
531E034k2839M486K3897N456j9342j0220J4267J5698o302j9115m777J8687K0764
544B5694o296k6017q685J7256J0485j3106j0838J0429J2720q034j9213n100J4815
557e890J6152m625j9042l107K0838J3970j6612k1343P783K4100N277j7030j1296
570a0825O454J1708o37j1228l435J3865J1821j1768j8582N098K1900L961j7945
583C87r630J1686J0063q294j7219n494J3876J5297m206j5845n9J4437L03j8823
597a3521o991J9957K0242n598j9769p866R148Q906n652j0640M392J9315O561j6715
611A769j2702J1936J5481q905j9027J586K2333J3136j3760k3680m596J7638Q880
624A0089j7803j7590J3689K9785M847k4449j5561Q245J1196n349r146Q462K2215
$$ plain form
637 18630 25135 1479 -26539 -22978 3275 11227 -6842 -14389 7472 28444 16986 -12088 -20798
650 -20798 -424 17918 10412 -8438 -5394 16693 21261 -4888 -27231 -15062 9344 9453 -11173
663 -11173 -14838 8886 27660 12675 -19375 -27650 -4122 15498 4942 -13907 -6133 18513 18996
676 18996 -10511 -30765 -15472 13124 17106 -3303 -11905 7553 27081 14769 -15272 -22669 -265
689 -265 18424 9017 -8029 -6012 10561 11692 -9062 -25038 -15591 5476 12261 5111 4153 13978
703 13978 14642 -3647 -21197 -17950 -430 8639 1434 -5363 186 6805 290 -11982 -9917 5474
717 5474 13543 5679 -1904 2637 8823 1266 -14020 -15739 851 15009 8058 -6915 -3146 14890
731 14890 17252 -6614 -26777 -17480 6857 12905 -2051 -11042 3951 21567 14292 -11887 -21501
$$ packed form
637A8630O505k3656k8018L561K6253P952j8069p547K1861K0972j1458k9074q710
650b0798K0374J8342p506j8850L044K2087M568k6149k2343J2169K4406J09k0626
663a1173l665K3724J8774j4985l2050q275K3528J9620j0556j8849P774K4646M83
676A8996k9507k0254J5293K8596L982k0409q602J9458J9528j2312l0041p397K2404
689b65J8689r407j7046K017J6573J131k0754j5976R447K1067O785p150r58R825
703A3978O64j8289j7550L247J7520R069p205o797N549O619o515j2272K065J5391
717E474Q069p864p583M541O186p557j5286j719J6590J4158o951j4973L769J8036
731A4890K362k3866k0163R297K4337O048j4956q991J4993J7616p275k6179r614
$$ plain form
744 -21501 69 19456 7503 -17009 -18044 1784 10266 -3880 -16981 -5723 19301 27181 8393
757 8393 -11023 -5636 8219 2260 -18298 -21585 -1626 13080 6173 -6391 -3484 11487 18253
770 18253 6961 -8207 -7639 3545 2440 -13033 -18260 -4291 8775 5647 -848 3962 14208
783 14208 12973 -365 -11029 -8295 1828 -898 -14766 -17058 2630 19566 10815 -6696 -4483
796 -4483 12856 18334 4051 -12369 -13013 -1746 972 -13112 -22625 -6459 20658 25298 8185
809 8185 -1229 6070 10038 -2932 -19734 -21268 -6513 7277 4605 -6925 -5615 10666 18554 6046
823 6046 -6818 -2364 8394 7928 -3382 -13826 -14862 -8718 -3036 -3497 -2306 8838 22333 24198
837 24198 11882 -2156 -14722 -22678 -20088 -6879 3959 5897 5713 7931 8574 4933 -801 -4647
$$ packed form
744b1501K1570J9387j1953k4512j035J9828Q482j4146j3101J1258K5024P880j8788
757H393j9416N387J3855n959k0558l287J9959J4706o907j2564K907J4971O766
770A8253j1292j5168N68J1184j105j5473n227J3969J3066l128o495M810J0246
783A4208j235j3338j0664K734J0123k726j3868k292J9688J6936q751j7511K213
796d483J7339N478j4283j6420o44J1267K718j4084r513J6166K7117M640j7113
809H185r414P299L968j2970j6802j534J4755J3790k672j1530J310J6281P888j2508
823F046j2864M454J0758m66j1310j0444j036O144N682m61J191J1144J3495J865
837B4198j2316j4038j2566p956K590J3209J0838J938j84K218O43l641n734l846
$$ plain form
851 -4647 -2258 6079 9594 -436 -12431 -12779 -5526 -5184 -7083 71 13254 19928 14209 4734 -824
866 -824 -755 -5078 -19876 -30733 -17119 12596 28355 18456 2372 -1467 1906 -14 -8396 -13629
880 -13629 -5564 10127 15096 2142 -13995 -15569 -7137 -310 5866 15010 20710 14546 589 -11816
894 -11816 -15578 -12783 -9557 -9408 -4704 9513 22291 20115 4853 -7510 -9720 -7397 -5679 -4188
908 -4188 -666 3443 6733 4718 -1985 -6875 -8119 -5210 637 10646 17999 13108 -1900 -13441
922 -13441 -14195 -8555 -4929 -4154 167 10401 20975 19147 3276 -13109 -17205 -10942 -2851 1946
936 1946 6036 8578 8216 2981 -5542 -11778 -10287 -2727 4600 9232 10694 6513 -2632 -11984 -14982
951 -14982 -8834 2260 10060 9057 3439 1730 4340 4433 -1747 -10088 -12094 -4413 5677 9401 5427
$$ packed form
851d647K389Q337L515j0030j1995l48P253L42j899P154J3183O674n719r475n558
866h24O9m323j4798j0857J3614K9715J5759r899j6084l839L373j920q382n233
880a3629Q065J5691M969j2954j6137j574Q432O827O176R144N700o164j3957j2405
894a1816l762K795L226J49M704J4217J2778k176j5262j2363k210K323J718J491
908d188L522M109L290k015o703m890j244K909N847J0009P353m891j5008j1541
922a3441p54N640L626P75M321J0234J0574j828j5871j6385m096O263Q091M797
936A946M090K542l62n235q523o236J491P560P327M632J462m181r145r352k998
951a4982O148J1094P800j003n618j709K610R3o180q341k006P681J0090L724l974
$$ plain form
966 5427 1492 2465 3544 -1372 -8848 -10503 -2826 8711 14586 10213 -743 -9712 -13782 -11851 -5296
981 -5296 5197 12802 9940 385 -6552 -6935 -5188 -3707 -2193 1627 7580 9734 3676 -5793 -7363
996 -7363 188 5701 2977 -2009 -2077 667 2986 3855 3003 1756 -681 -5176 -8200 -4090 6410 10989
1012 10989 3918 -5039 -6024 -2305 -2489 -5445 -4205 2651 8785 6955 -3324 -11601 -7358 1932 4337
1027 4337 220 416 4003 3058 -2672 -4875 -809 4645 6754 3061 -1905 -1276 3707 3763 -1744 -3071
1043 -3071 1974 3133 -1798 -4166 -1359 2209 1408 -1489 -3361 -1927 1605 937 -4707 -6247 -333
1058 -333 3551 -990 -4768 -709 4111 2573 -1502 -1603 1269 3332 1213 -4156 -4505 2868 8972 3733
1074 3733 -3767 -951 6073 5128 -2822 -6108 -866 5188 5026 -1381 -7554 -5674 225 1172 -1572 993
$$ packed form
966E427l935R73J079m916p476j655P677J1537N875m373j0956q969m070J931O555
981e296J0493P605k862r555o937l83J747J481J514L820N953K154o058r469j570
996g363P551N513k724m986o8K744K319Q69q52j247k437m495l024M110J0500M579
1012A0989p071q957r85L719j84k956J240O856O134j830j0279q277M243R290K405
1027D337m117J96L587r45n730k203M066N454K109l693m966O29M983N6n507j327
1043c071N045J159m931k368K807L568q01k897j872J434L532o68n644j540N914
1058c33L884m541l778M059M820j538m075j01K872K063k119n369l49P373O104n239
1074C733p500K816P024r45p950l286N242O054j62o407o173J880N899R47k744K565
$$ plain form
1090 993 7577 5916 -4170 -10374 -6819 -1518 -214 -1829 -816 2478 3943 447 -3994 -609 8221
1105 8221 8911 -1371 -6983 -643 6279 3505 -3530 -3204 2687 4826 -695 -6108 -1504 10944 12959
1120 12959 -1077 -14384 -10987 547 1200 -5586 -3162 9309 14860 2714 -14743 -16782 127
1133 127 14607 7947 -9051 -11354 2181 7621 -2721 -10187 -625 13869 13962 -1200 -12156 -4839
1147 -4839 9597 9587 -4186 -11927 -2601 6649 1728 -5849 -475 13590 16373 1195 -16430 -17288
1161 -17288 -3351 8039 4827 -2560 -2453 1623 -1214 -8365 -6492 4952 12839 8732 -383 -5459
1175 -5459 -4164 -2855 -3997 -2818 3633 7881 3252 -5032 -4932 3054 7432 2583 -2732 -3096 -594
1190 -594 -1344 -3564 -89 7711 10350 1499 -9303 -9033 76 5089 273 -4170 -498 4023 -209
$$ packed form
1090I93O584j661j0086o204L555N301J304j615J013L294J465l496m441L385Q830
1105H221O90j0282n612O340O922k774p035L26N891K139n521n413M604J2448K015
1120A2959j4036j3307L397J1534O53o786K424J2471N551j2146j7457k039J6909
1133A27J4480o660j6998k303J3535N440j0342p466R562J4494R3j5162j0956P317
1147d839J4436j0j3773p741R326R250m921p577N374J4065K783j5178j7625q58
1161a7288J3937J1390l212p387J07M076k837p151J873J1444P887m107r115n076
1175e459J295J309j142J179O451M248m629q284J00P986M378m849n315l64K502
1190e94p50k220L475P800K639q851j0802K70R109N013m816m443L672M521m232
$$ plain form
1205 -209 -9881 -10219 2083 13801 11028 -1076 -5434 718 4214 -2311 -8985 -4643 5351 7313 -1749
1220 -1749 -8279 -1773 8377 8367 -1850 -5837 1147 7062 2016 -6054 -5315 3176 5524 -2247 -9215
1235 -9215 -4428 5623 7325 -1327 -6746 -293 6767 2793 -6380 -6006 2679 7185 1817 -4834 -2815
1250 -2815 4371 4561 -4081 -9076 -2043 7343 5008 -4267 -5023 3441 7435 990 -6443 -3824 5950
1265 5950 9351 584 -9405 -6778 2735 3984 -3697 -6072 2059 7763 2019 -6355 -5158 4038 8584
1280 8584 3002 -6174 -5375 2648 4161 -3204 -7587 -86 7548 3700 -5512 -6694 868 6735 3458
1295 3458 -2515 -2826 2711 3808 -2710 -7192 -730 7275 4724 -4586 -7143 -818 3909 1473 -2932
1310 -2932 -1848 3572 5128 -1033 -6339 -2765 5970 5819 -2744 -6111 5 4373 349 -5424 -3762
$$ packed form
1205b09r672l38J2302J1718k773j2104m358O152L496o525o674M342R994J962r062
1220a749o530O506J0150j0j0217l987O984N915n046q070P39Q491K348p771o968
1235i215M787J0051J702q652n419O453P060l974r173L74Q685M506n368o651K019
1250b815P186J90q642m995P033R386k335r275p56Q464L994o445p433K619R774
1265E950L401q767r989K627R513J249p681k375Q131N704n744q374J197R196M546
1280H584n582r176P99Q023J513p365m383P501P634l848r212j182P562N867l277
1295C458n973l11N537J097o518m482O462Q005k551r310k557O325M727k436m405
1310b932J084N420J556o161n306L574Q735j51q563l367O116M368m024n773J662
$$ plain form
1325 -3762 3152 6080 1258 -5377 -3771 3823 5890 -917 -5072 -91 5242 1637 -5064 -4949 1792
1340 1792 4887 1263 -4256 -3227 2995 5497 -546 -5722 -1444 6002 4596 -2894 -5215 448 3702
1355 3702 868 -3350 -2562 2394 4413 -940 -6289 -2599 5044 5929 -1344 -4911 -323 3614 911
1370 911 -3562 -2709 2673 5168 1039 -5145 -4910 1844 4405 281 -2909 527 4223 890 -4759 -4015
1386 -4015 2269 5991 2397 -3667 -5023 56 3385 592 -2777 -14 3865 1548 -4309 -4455 1260
1401 1260 5386 2928 -2172 -3671 -941 1481 -447 -2611 575 5010 3564 -3743 -6775 -2186 4001
1416 4001 4338 642 -1362 -128 655 -1296 -3209 -186 4664 4777 -1100 -5492 -3091 2286 3201 442
1432 442 -728 365 920 -1703 -4262 -1640 4176 5991 1407 -4130 -5114 -1580 665 1040 1457 3060
$$ packed form
1325c762O914K928m822o635J606P594K067o807m155M981N333l605o701J15O741
1340A792L095l624n519J029O222K502o043n176M278P446j406p490k321N663L254
1355C702k834m218P88M956K019n353n349L690P643Q85p273l567M588L937k703
1370I11m473Q53N382K495m129o184K35O754K561m124l190L436L696l333n649P44
1386d015O284L722l594o064j356N079L329k793l369K763L879k317n857j46N715
1401A260M126k458n100j499K730K422j928k164L186M435j446p307l032M589O187
1416D001L37l696k004J234P83j951j913L023M850J13n877m392K401N377R15k759
1432D42j170J093N55k623k559K622N816J815m584n537r84L534K245L75M17J603
$$ plain form
1448 3060 2495 -1560 -5559 -4321 1250 5006 3901 -107 -1673 -1287 -1689 -2211 -318 3765 4862 1302
1464 1302 -3438 -4902 -1090 3038 2837 639 -558 -886 -1485 -3152 -2011 2243 5057 3195 -1760 -4722
1480 -4722 -3301 -133 1302 944 1505 2545 354 -3464 -4843 -1016 3816 5413 2839 -1604 -2883
1495 -2883 -1526 9 -10 426 2188 2381 -78 -2275 -1908 -78 1926 1833 1069 -851 -1616 -1994 -1922 -866
1513 -866 1224 2639 1103 -1970 -2709 -1328 346 1586 1670 -65 -1709 -1697 -1142 -322 936 1531 1771
1530 1771 1052 1163 631 -693 -1388 199 1428 1095 305 -331 -1024 -803 379 1214 406 -127 55 -483
1548 -483 -1344 -1017 -838 -1004 -1456 -514 527 524 471 744 650 -131 287 206 -349 -695 -333 -205 -966 227 1539
1569 1539 1152 314 1078 1834 581 -677 -479 190 546 257 -772 -1594 -563 1483 1022 -824 -746 934
$$ packed form
1448C060n65m055l999J238N571L756j105m008j566L86m02n22J893M083J097l560
1464A302m740j464L812M128k01k198j197l28n99j667J141M254K814j862m955k962
1480d722J421L168J435l58N61J040k191l818j379L827M832J597k574m443j279
1495b883J357J535j9M36J762J93k459k197L67J830K004r3p64j920p65l78P2J056
1513h66K090J415j536l073p39J381J674J240Q4j735j644J2N55Q20J258N95K40
1530A771p19J11n32j324o95J587J229l33p90o36o93K21J182Q35q08n33J82n38
1548d83q61L27J79j66m52R42J041ln3K73r4p81M18q1n55l46L62J28p61J193J312
1569A539l87q38P64P56j253j258J98O69L56k89j029q22J031K046m61j846P8J680
$$ plain form
1587 934 415 -1623 -2742 -2096 -575 211 79 -552 -231 1381 1202 -16 93 2002 2519 -199 -2746
1604 -2746 -1662 512 1216 544 -261 117 1700 2003 -10 -1793 -332 1582 605 -1695 -1839 97 99
1621 99 -712 -899 -40 1478 1719 -893 -2577 -1464 754 443 -2316 -2480 222 1835 910 -713 -91
1638 -91 1884 2243 377 -1239 -1132 1159 918 -1166 -1543 1052 2754 854 -1997 -1278 974 1743 615
1655 615 -1149 -1265 -118 -21 -2365 -2445 214 3024 1601 -900 -1447 776 1150 -1023 -2418 -630 1557
1672 1557 1531 -1143 -2728 -238 2535 2134 -944 -1317 1071 2415 -414 -2340 -808 2212 2178 -1130
1688 -1130 -3557 -1001 3263 2839 -914 -2525 -17 1959 69 -2978 -2612 1333 3105 547 -2579
1703 -2579 -2094 1353 1873 -695 -2187 -120 3023 1002 -2344 -2608 1064 3406 1342 -1991 -1933 1080
$$ packed form
1587I34n19k038j119O46J521P86j32o31L21J612j79j218J09J909N17k718k547
1604b746J084K174P04o72q05L78J583L03k013j783J461J914r77k300j44J936K
1621I9q11j87Q59J518K41k612j684J113K218l11k759j64K702J613r25j623O22
1638i1J975L59j866j616J07K291k41k084l77K595J702j900k851P19K252P69j128
1655F15j764j16J147R7k344q0K659K810j423k501n47K223L74k173j395J788K187
1672A557k6k674j585K490K773m01l078l73K388J344k829j926J532L020l4l308
1688a130k427K556M264m24l753j611K508J976j890l047L66L945J772k558l126
1703b579M85L447N20k568j492K067L143k021l346k64L672K342k064l333N8L013
$$ plain form
1719 1080 2804 224 -1967 -518 1566 1051 -1953 -2755 37 2772 1797 -1348 -1904 485 1443 -534
1735 -534 -2106 -26 2496 1853 -1875 -3167 -791 2278 1446 -945 -1635 745 2284 -227 -2497 -559
1751 -559 3333 2932 -1206 -3180 -917 1949 1752 -1190 -1515 680 1967 -357 -2923 -1708 2888 3459
1767 3459 171 -2621 -1024 1732 1621 -975 -1816 707 2338 499 -2967 -2971 640 3272 1023 -1540
1783 -1540 -647 1675 750 -1513 -1760 1301 2880 849 -2563 -3243 176 2538 376 -2345 -918 2454
1799 2454 2264 -1504 -2842 355 2963 1845 -1464 -2527 -173 2257 448 -2907 -1514 2584 2880
1814 2880 -1561 -3700 -626 3150 2723 -923 -2296 -107 2186 1218 -2144 -2490 1017 3435 34 -3228
1830 -3228 -2145 1440 1931 -897 -1956 345 2865 2237 -1223 -2672 108 2815 951 -2433 -2029 1095
$$ packed form
1719A080J724k580k191J449K084n15l004q02K792K735r75l145n56K389R58j977
1735e34j572K080K522o43l728j292K376L069q32k391o90K380J539k511k270J938
1751e59L892m01m138j974K263K866j97k942l25K195J287k324k566J215M596N71
1767C459l288k792J597K756j11k596q41K523J631j839l466mL611K632k249k563
1783a540Q93K322r25k263k47L061J579k031l412o80L419K362k162k721J427L372
1799B454j90l768j338L197K608j118l309j063K354K430j809l355J393M098K96
1814B880m441k139L074L776m27l646j373K189K293r68l362l46L507K418l401l262
1830c228J083L585M91k828j059K301K520o28l460j449K780K707j864l384M04L124
$$ plain form
1846 1095 1707 -1045 -2742 -848 2382 2222 -21 -1321 641 2261 1136 -2190 -2437 1060 2180 -506
1862 -506 -2469 -982 1857 1949 -600 -1671 -40 1687 670 -1844 -2087 1138 2911 347 -2728 -1725
1878 -1725 1603 1867 -603 -1830 -480 1785 1091 -1750 -3078 -194 2789 1377 -848 -543 1900 1930
1894 1930 -1160 -2720 -1154 1459 1600 -1324 -2205 -480 1922 1341 -1155 -1229 1327 2696 55 -1869
1910 -1869 -936 1046 558 -1071 -2181 -339 1873 1123 -1148 -1313 1460 2356 241 -2571 -1527 680
1926 680 1447 -315 -1494 -119 1726 1365 -1129 -1775 287 1924 613 -1395 -1569 694 1366 -709
1942 -709 -2059 -501 1889 2015 251 -1430 -489 1009 395 -1671 -1579 309 1599 170 -1474 -237
1958 -237 1243 1620 -337 -1102 -209 1266 440 -1455 -1544 350 1267 89 -1317 -755 806 1205 -143
$$ packed form
1846A095O12k752j697J894L230j60k243j300J962J620j125l326k47L497J120k686
1862e06j963J487K839R2k549j071J631J727j017k514k43L225J773k564l075J003
1878a725L328K64k470j227J350K265o94k841j328K884K983j412k225L05K443L0
1894A930l090j560J566K613J41k924q81J725K402n81k496p4K556J369k641j924
1910a869R33J982m88j629j110J842K212p50k271j65K773Q96k115k812J044K207
1926F80P67j762j179J375J845l61k494o46K062J637j311k008j74K263O72k075
1942g09j350J558K390J26j764j681R41J498o14k066R2J888J290j429j644J237
1958b37J480L77j957p65Q93J475q26j895q9J894R17j178j406N62J561L99j348
$$ plain form
1975 -143 -1054 -111 1142 666 -1897 -1779 97 1985 1001 -829 -764 850 1521 -21 -1408 -901 1222
1992 1222 1419 -668 -1839 -249 1471 557 -977 -848 712 1819 351 -1705 -1411 469 1209 348
2008 348 -1680 -809 860 982 -350 -1109 -186 540 434 -781 -1281 -520 796 561 -129 -479 780 1065
2026 1065 123 -759 28 605 617 464 -362 -159 -6 399 -428 -246 567 754 -317 -446 -51 279 50 -461
2046 -461 -178 436 238 -427 -774 -389 291 722 -68 -430 3 781 -383 -1052 -72 828 650 -191 -458 -228
2066 -228 671 1150 249 -452 68 931 184 -857 -757 329 918 -12 -598 -382 -231 78 -190 -746 -250
2085 -250 574 620 -704 -1115 -276 367 243 -216 -15 56 181 0 -276 -473 302 290 -283 -363 -59 324 243
2106 243 -543 237 410 580 -189 -95 -175 -82 502 160 -350 -619 196 103 -666 -558 -99 86 -61 29 -108 -30
$$ packed form
1975a43r11R43J253m76k563J18J876J888r84j830O5J614O71j542j387N07K123
1992A222J97k087j171J590J720r14j534J29J560J107j468k056K94J880P40q61
2008C48k028Q71J669J22j332p59R23P26j06j215n00P61J316k35o90l50J259K85
2026A065r42q82P87N77J2j53q26K03J53M05q27J82Q13J87j071j29L95L30k29n11
2046d61K83O14j98o65l47L85O80M31p90l62M33P78j164o69R80R00j78q41k67K30
2066b28Q99M79r01p01N20Q63p47j041J00J086N89r30n86K16J51L09k68n56M96
2085b50Q24M6j324m11Q39O43j24m59K01P1J25j81k76j97P75j2n73q0L04L83q1
2106B43p86P80J73J70p69R4q0R3N84l42n10k69Q15r3p69J08M59J85j47R0j37P8
$$ plain form
2128 -30 -113 -2 -399 -232 312 267 372 -98 112 -324 -7 189 494 78 85 548 -86 -164 -45 186 422 30
2150 30 -141 -15 -75 -213 77 -4 96 -76 240 -171 -625 -519 224 301 10 -227 -143 -362 -3 -203 15 -54
2172 -54 435 306 -531 -523 -148 448 182 -36 -91 191 523 165 -491 -328 424 735 12 -536 -362 -4 166
2193 166 -166 -381 64 437 218 -777 -685 262 786 89 -702 -210 280 643 -593 -568 -276 658 1098 -155
2213 -155 -342 -168 307 -129 -693 -138 706 626 -95 -633 -430 350 610 -12 -592 -99 610 202 -503 -641
2233 -641 103 824 105 -585 -511 208 379 4 -606 -188 889 521 -885 -858 343 1216 270 -557 -296 215
2253 215 365 -267 -797 -185 718 923 -531 -937 16 746 249 -678 -346 656 651 -397 -950 -555 554
2272 554 1234 -107 -1089 -44 818 249 -913 -408 297 930 125 -708 -622 563 1060 -49 -1134 -219
$$ packed form
2128c0q3J11l97J67N44m5J05m70K10m36L17J96L05m16PM63o34p8J19K31K36l92
2150C0j71J26o0j38K90q1J00j72L16m11m54J06P43P7k91k37Q4k19L59k00K18o9
2172e4M89j29q37QL75N96k66k18n5K82L32l58o56J63P52L11p23n48J74L58J70
2193A66l32k15M45L73k19r95R2R47N24o97p91M92M90L63j236K5K92R34M40j253
2213a55j87J74M75m36n64N55Q44q0p21n38K03P80K60o22n80M93P09m08p05j38
2233f41P44P21p19o90P4P19J71l75o10M18J077l68j406K7J201Q73r46q27K61N11
2253B15J50o32n30O12R03K05j454m06R53P30m97r27L32J002nj048n53L95J109
2272E54O80j341r82J045Q62n69j162N05P05O33q05q33Q6J185M97j109j085R15
$$ plain form
2290 -219 1062 517 -483 -604 362 924 128 -463 -539 425 608 -278 -985 -493 1023 751 -552 -986 191
2309 191 738 430 -681 -82 637 840 -51 -854 -646 584 924 73 -704 185 855 -16 -940 -814 711
2328 711 999 274 -1167 -949 143 609 86 -1059 -270 697 668 -783 -945 68 907 433 -478 -565 313
2347 313 739 45 -1005 -347 911 1307 -688 -1560 -306 760 568 -426 -422 636 845 124 -701 -398 692
2366 692 1335 -39 -1017 -703 606 288 -760 -653 634 929 14 -830 -845 156 1105 177 -779 -398 771
2385 771 762 -1216 -1218 14 1409 387 -888 -895 -156 903 369 -639 -551 869 1110 -598 -1197 44 969
2404 969 281 -633 -815 384 1005 -27 -680 -672 588 1271 292 -1006 -476 884 823 -549 -942 182 761
2423 761 -49 -852 -790 462 805 -81 -701 -52 1342 603 -836 -869 149 1004 222 -793 -875 -150 630
$$ packed form
2290b19J281n45j000j21R66N62p96n91p6R64J83q86p07M92J516k72j303m34J177
2309A91N47l08j111N99P19K03q91q03K08J230L40q51p77Q89O70q71r24J26J525
2328G11K88p25j441K18J092M66n23j145P89R67k9j451j62J013Q39m74r11q7Q78
2347C13M26o94j050O58J258L96j995q72J254J066j92r94MJ058K09p21q25L03J090
2366F92O43j374r78L14J309l18j048J07J287K95r15q44j5J001R49r28r56L81J169
2385G71rj978kJ232J395j022j275pP39J059n34j008Q8J420K41j708n99J241R25
2404I69o88r14j82J199O21j032o53QJ260O83r79j298N30J360o1j372l93J124N79
2423G61q10q03O2J252L43q86o20O49J394p39j439l3J018Q55p82j015q2P25P80
$$ plain form
2442 630 121 -688 -133 884 737 184 -760 -136 963 586 -495 -639 265 596 81 -894 -784 596 1100
2461 1100 -271 -911 15 551 467 -303 -729 35 580 491 -783 -894 203 828 21 -736 -475 382 454 -338
2481 -338 -1001 -137 811 850 -525 -492 173 726 -20 -596 -462 705 798 -45 -558 -255 561 760 -154 -706
2501 -706 219 800 572 -780 -811 469 711 -256 -825 -334 338 337 -439 -981 -315 1073 483 -577 -712 69
2521 69 431 0 -459 -236 278 598 -210 -653 -145 631 726 46 -653 78 719 115 -448 -615 428 342 -87
2542 -87 -662 -609 -27 373 -212 -580 138 536 237 -801 -369 176 799 199 -429 -244 193 245 130 -198 -194
2563 -194 431 252 -361 -751 21 380 330 -307 -94 595 276 -211 -565 -398 323 517 -355 -528 -4 253
2583 253 41 -588 -508 423 334 -105 -414 -338 -109 281 -170 -388 -11 109 224 -466 -63 121 602 329 -50
$$ packed form
2442F30n09q09N55J017j47n53r44O24J099l77j081j44R04L31n15r75J10J380N04
2461A100j371o40R26N36q4p70m26P64N45q9j274j11J097O25q07p57K61Q57P2p92
2481c38o63Q64R48L9j375L3O65N53p46n76J34J167R3q43n13L03Q16J99r14n52
2501g06R25N81k28j352l1J280K42r67n69M91O72jp76n42O66J388n90j060j35P81
2521F9L62m31m59K23N14L20q08m43N08P76R5o80o99P31O41o04n63j67J043q6m29
2542h7n75N3N82M00n85l68P18L98k99j038M32N45O23o00o28J85M37N2j15l28M
2563a94O25j79o13l90P72L59n0o37K13O89l19m87l54J67P21J94q72j73N24K57
2583B53k12o29Q0R31q9m39l09P6K29L90m51k18L77J20J15o90M03J84M81k73l79
$$ plain form
2604 -50 -391 -119 219 187 -192 -130 199 135 -384 -552 -34 -76 122 -123 -117 147 132 -177 -410 -329 81 337 31
2627 31 -197 15 78 58 -286 -126 121 191 188 69 94 150 224 -167 -98 215 415 -147 -433 -350 -1 177 64 -517
2651 -517 -7 16 53 -42 -92 194 340 28 -334 -468 -75 160 -192 -32 -46 -216 133 49 -48 204 197 319 127
2674 127 -279 -26 36 -40 -137 -96 242 360 84 -118 152 17 315 171 -291 -237 13 51 -63 -6 259 255 76
2697 76 -14 -252 -318 45 -198 -63 -73 -108 105 -123 -262 -109 141 63 191 -55 85 -199 -240 -46 -6 -10 162
2720 162 322 115 418 -60 16 -12 352 -10 -235 -11 -440 -241 181 188 295 175 -35 -58 -338 248 99 -6
2742 -6 157 -96 -359 -68 59 -106 -55 -145 94 -113 -149 -25 -17 -84 -335 36 107 43 -100 -1 46 166 156 124 53
2767 53 -215 207 100 -227 -146 102 26 -130 -143 99 345 182 142 -72 43 270 355 -62 -95 -15 167 -176 156
$$ packed form
2604e0l41K72L38l2l79O2L29o4n19j68N18m2J98k45OK64j5l09k33Q1M10K56l06
2627C1k28K12O3k0l44J60K47P0lj19K5N6P4l91O9L13K00n62k86Q3L49J78j13n81
2651e17N10K3L7r5n0K86J46l12l62j34L93K35l52J60j4j70L49q4r7K52pJ22j92
2674A27m06K53O2p6r7M1L38J18k76k02K70j35K98j44m62N4K50L8j14N7K65mj79
2697G6r0k38o6L63k43J35j0l5K13k28j39J53K50p8J28k46J40k84m1J94M0mJ72
2720A62J60k07L03m78P6k8L64l62k25K24m29J99M22PJ07j20k10k3k80N86j49j05
2742fJ63k53k63K91J27j65N1r0K39k07l6J24Qo7k51L71P1o4j43R9M7J20j0l2p1
2767E3k68M22j07l27Q1K48p6j56j3K42K46j63m0k14J15K27Q5m17l3Q0J82l43L32
$$ plain form
2790 156 -24 267 89 7 -63 -17 134 215 -193 -251 74 184 279 -135 47 -216 -186 -242 -231 55 185 -11 198
2813 198 -127 296 211 -19 -368 -178 202 192 -207 -210 -28 -26 186 -253 -213 89 394 172 -195 -244 60 229 -188
2836 -188 -352 -49 -32 -137 -216 -198 13 221 401 -21 -277 -120 179 97 -119 91 307 189 -182 -85 -208 172
2858 172 214 32 4 -22 468 -154 53 -487 61 348 73 -331 127 294 146 63 -505 3 357 170 -174
2879 -174 -467 184 208 223 -104 243 18 260 -11 -262 184 464 81 -87 -40 -35 324 -38 -174 -61 321 7
2901 7 69 -252 -362 88 218 -54 -16 -69 62 135 -88 -96 154 313 263 -300 -28 68 101 121 -109 -256 98 278
2925 278 -302 -90 127 271 186 -122 -284 287 210 -232 -171 -31 189 394 -152 -269 80 252 163 -148 -255
2946 -255 78 146 282 -426 -5 199 324 36 18 9 8 54 -115 -189 91 480 -90 -41 -373 -104 390 -34 -318
$$ packed form
2790A56j80K91j78q2p0M6J51Q1m08n8L25J10R5m14J82k63L0n6J1K86J30j96K09
2813A98l25M23q5k30l49J90L80j0l99lJ82KK12m39M0L02L05k22l67m9L04J69m17
2836a88j64L03J7j05p9J8K11K08J80m22k56J57K99q2k16K10K16j18l71R7j23L80
2858A72M2j82k8k6M90o22K07n40N48K87k75m04M58J67j48q3n68N08L54j87l44
2879a74k93O51K4J5l27L47k25K42k71k51M46K80l83j68M7NL59l62j36J13L82l14
2901GO2l21j10M50J30k72L8n3J31P3k23qK50J59n0n63K72R6L3K0k30j47L54J80
2925B78n80K12K17J44q5l08j62N71p7m42O1J40K20K05n46j17L49J72q9l11j07
2946b55L33O8J36p08M21K04J25k88j8rjM6j69p4K80L89n70M9l32K69M94m24k84
$$ plain form
2969 -318 -362 181 305 -147 -101 -94 418 340 -26 -88 -198 111 -38 116 -169 163 272 -149 -480 7 259 -26
2991 -26 157 -199 121 371 137 -249 -297 33 253 19 -292 13 234 -17 -65 77 439 252 -48 -207 -82
3012 -82 24 83 165 -443 -84 290 -17 26 -387 -94 354 -43 -67 -161 -289 188 309 -272 -41 220 31 -193
3034 -193 -363 43 19 182 -32 48 218 46 59 -126 -266 179 212 62 -185 24 328 247 -97 -446 -170 309
3056 309 198 -325 -334 51 393 -187 -88 -9 164 548 -249 -77 -53 118 360 307 -454 -130 204 -24 -295 -62
3078 -62 -30 218 174 -178 78 -55 247 51 -59 -354 -121 139 -252 -270 152 188 -71 28 -308 33 -54 174
3100 174 -5 -94 191 215 -161 -241 32 172 238 -65 -83 223 170 -103 -294 -172 132 411 -62 -314 -150 274
3122 274 109 -323 -139 402 70 -34 59 -200 197 64 142 -293 -284 137 11 -170 -591 -141 -61 13 202 -55
$$ packed form
2969c18m4N43J24m52M6PN12p8l66o2j10L09j49J54k85L32J09m21l31M87K52k85
2991b6J83l56L20K50k34l86m8L30K20k34l11L05K21k51m8J42L62j87l00j59J25
3012h2J06N9Q2o08L59L74l07M3m13K93M48l97k4r4j28M77J21n81K31K61j89k24
3034a93j70M06k4J63k14Q0J70j72J3j85j40M45L3j50k47K09L04q1l44l49K76M79
3056C09j11n23rL85L42n80R9P9J73L84p97J72K4J71K42n3p61L24L34k28k71K33
3078f2L2K48m4l52K56j33L02j96j10k95K33K60l91j8M22L6k59R9l36L41q7K28
3100A74j79q9K85K4l76q0K73J40O6l03j8L06n3k73j91J22L04K79m73k52J64M24
3122B74j65m32J84N41l32j04R3k59L97j33P8m35RM21j26j81m21M50Q0P4J89k57
$$ plain form
3144 -55 99 -35 224 189 118 -59 19 58 -161 -164 -71 -3 -232 -76 139 131 -103 -127 -112 -78 210 304 160 -247 128
3169 128 257 -117 -90 194 -85 39 -327 -55 -116 285 93 -65 -113 14 -20 -205 -39 101 -204 265 236 -134
3191 -134 -180 -67 -112 25 222 58 114 155 -167 -244 51 278 -138 -280 -3 14 228 53 -7 -132 353 -55
3213 -55 -145 -274 -150 42 182 95 -178 63 -32 -204 -68 -95 9 -16 -30 -74 -154 69 -2 -18 108 126 451 181
3237 181 -139 -190 -66 434 134 0 -201 -101 83 -77 34 114 14 -113 -86 44 -38 -30 -109 -82 -161 127 -99
3260 -99 106 99 -201 -36 319 -154 213 2 132 -215 -180 -31 360 64 -53 27 250 -29 -71 -3 65 -46 57
3283 57 131 -432 -2 -19 140 -54 -74 -115 -9 -20 35 -170 26 93 173 -1 134 -71 85 -125 -9 21 -31 116
3307 116 -242 -66 -103 -35 -346 -45 -204 -244 -24 -28 -2 53 -165 -97 72 20 -102 153 139 -103 -74 -25 49 271
$$ packed form
3144e5J54j34K59l5p1j77P8L9k19lR3O8k29J56K15qk34k4J5L4K88R4j44m07L75
3169A28J29l74K7K84k79J24l66K72o1M01j92j58m8J27l4j85J66J40l05M69k9l70
3191a34m6J13m5J37J97j64N6M1l22p7K95K27m16j42K77J7K14j75o0j25M85m08
3213e5r0j29J24J92J40q7k73K41r5j72J36k7J04k5j4m4q0K23p1j6J26J8L25k70
3237A81l20n1J24N00l00j34k01J00J84j60J11Q0j00j27K7J30q2Qp9K7p9K88k26
3260i9K05pl00J65L55m73L67k11J30l47L5J49L91k96j17Q0K23k79m2O8O8j11J03
3283E7P4n63M30j7J59j94k0m1J06j1N5k05J96O7Q0j74J35k05J56k10J16L0n2J47
3307A16l58J76l7O8l11L01j59m0K20mK6N5k18O8J69n2j22K55j4k42K9M9P4K22
$$ plain form
3331 271 -70 -139 -226 -4 106 116 62 -79 151 -101 92 -77 -73 221 -202 -58 -157 -132 33 90 40 -16 26 -85
3355 -85 -43 -129 -251 154 216 40 -143 -125 -44 -333 -91 -20 86 -77 -57 -245 -228 15 63 277 -124 -34 -131 -118
3379 -118 145 179 -42 -143 142 48 -262 -302 52 186 -103 -372 12 114 166 -108 -197 43 71 327 187 24
3401 24 162 212 -45 -222 -84 133 -77 45 55 -188 -37 -92 10 -41 152 145 15 -274 -114 156 200 -207 -117
3424 -117 25 -110 155 -232 42 150 167 120 111 -176 144 98 -78 41 -24 265 7 123 -257 31 145 244
3446 244 111 -108 -51 172 -67 -57 -155 119 276 -59 -404 7 80 150 -113 75 151 4 102 -63 -59 106 186
3469 186 -40 0 66 -114 57 -251 -121 -47 337 -69 -36 -423 71 167 -8 -145 130 246 123 142 -343 38
3491 38 256 -31 -314 -286 290 360 -57 32 -110 440 294 178 -455 182 443 337 -29 -114 -38 264 -264 -220
$$ packed form
3331B71l41o9q7K22J10J0n4j41K30k52J93j69MK94m23J44r9K5J65N7n0n6M2j11
3355h5M2q6j22M05O2j76j83J8Q1k89K42P1J06j63K0j88J7K43M8K14m01R0r7J3
3379a18K63L4k21j01K85r4l10m0L54J34k89k69L84J02N2k74q9K40K8K56j40j63
3401B4J38N0k57j77J38K17k10J22J0k43J51n5J02n1J93pj30k89J60K70M4m07R0
3424a17J42j35K65l87K74J08J7m7rk87L20m6j76J19o5K89k58J16l80K88J14R9
3446B44j33k19N7K23k39J0r8K74J57l35l45M11P3P0k63J88P6j47R8j65MJ65Q0
3469A86k26M0O6j80J71l08J30P4L84m06L3l87M94R6j75j37K75J16j23J9m85L81
3491C8K18k87k83K8N76P0m17Q9j42N50j46j16o33O37K61j06l66q5P6L02n28M4
$$ plain form
3513 -220 -130 78 235 -269 -169 -185 144 150 -100 -19 103 343 261 -516 -316 199 144 243 197 -200 147 130 -183
3536 -183 -265 -25 301 218 -261 -249 116 137 -49 -82 -44 -26 -135 49 -300 -18 211 149 104 -123 245 101 -92
3559 -92 -417 -182 8 416 -63 -340 -65 419 291 -236 -247 102 367 -294 -77 -200 54 298 -21 -207 -230
3580 -230 149 430 -266 -287 41 211 348 -298 -287 -84 372 130 -36 -154 164 171 -100 -447 -56 69 358
3601 358 8 -33 -23 303 224 -177 -227 81 615 37 -157 -137 169 195 -163 -221 -75 408 296 -135 -201 323 -1
3624 -1 197 -10 -416 352 127 -165 -245 -44 614 378 -171 -34 206 274 28 -194 -164 113 225 32 -350 -20
3646 -20 133 113 25 -292 101 226 -131 39 -321 218 277 -97 -369 -75 374 258 -84 -56 211 182 234 -348
3668 -348 -603 -143 398 -72 -219 -252 70 370 14 -199 -239 453 87 -263 -509 19 -11 98 -213 -325 -223
$$ packed form
3513b20R0K08J57n04J00j6L29Ok50Q1J22K40q2p77K00N15n5R9m6l97L47j7l13
3536a83q2K40L26q3m79J2L65K1j86l3L8J8j09J84l49K82K29o2m5k27L68j44j93
3559i2l25K35J90M08m79k77K75M84j28n27j1L49K65o61K17j23K54K44l19j86k3
3580b30L79K81o96k1L28J70J37o46J1K03M56k42j66j18L18Pk71l47L91J25K89
3601C58l50m1J0L26p9m01n0L08N34n78j94K0L06K6l58n8J46M83j12m31o6N24l24
3624aJ98k07m06P68k25k92q0K01O58k36n49J37K40O8k46k22L0K77J12j93l82L30
3646b0J53k0q8l17L93J25l57J70l60N39N9l74k72K94M49j16l42K8K67k9N2n82
3668c48k55M60N41m70j47l3L22L00l56k13m0O92l66l50k46N28l0J09l11j12J02
$$ plain form
3689 -223 271 -32 -155 -64 161 408 37 -166 -43 282 -94 26 -167 30 114 180 -172 -69 350 148 -33
3710 -33 -387 168 423 13 -241 -56 223 25 -41 -146 -188 134 132 -24 -390 -118 371 136 -232 -424 -127 182
3732 182 140 -302 119 191 193 14 -279 -112 396 -36 -162 -83 -143 100 110 -129 -79 271 560 137 -388 109 73
3755 73 340 -57 -136 -139 41 -206 -150 113 -251 54 105 -170 -213 29 -138 -194 -336 18 -60 203 -58 -371 10
3778 10 -27 309 -100 103 41 231 10 -28 -243 -2 121 226 1 134 15 95 168 -200 68 400 -3 -266
3800 -266 -255 -180 298 60 -97 54 -54 -70 7 -253 65 -46 -27 -116 42 190 155 -155 -168 115 26 26 174 45
3824 45 192 145 -246 121 97 86 -120 -185 109 -174 -7 164 91 -28 113 85 36 42 0 172 337 98 4 -73
3848 -73 110 -4 -46 9 -22 21 -63 -121 -79 88 -186 -1 60 105 55 -181 -12 45 -192 -53 132 -69 57 -126
$$ packed form
3689b23M94l03j23R1K25K47l71k03J23L25l76J20j93J97Q4O6l52J03M19k02j81
3710c3l54N55K55m10k54J85K79j98o6j05m2L22kj56l66K72M89k35l68j92K97L09
3732A82m2m42M21P2Kj79k93J67N08m32j26P9o0K43J0k39N0L50K89m23n25M97l6
3755G3K67l97p9lJ80k47N6K63l64L05N1k75m3K42j67n6j42L54p8K63k61l13L81
3778A0l7L36m09K03o2J90k21l8k15K41J23J05k25J33j19Q0P3l68K68L32m03k63
3800b66J1P5M78k38j57J51j08j6P7k60L18j11J9q9J58J48l5l10j3K83q9%J48j29
3824D5J47m7l91L67k4j1k06o5K94k83J67J71p3j19J41k8m9Om2J72J65k39r4p7
3848g3J83j14m2N5l1M3q4n8M2J67k74J85O1M5n0k36J69N7k37J39J85k01J26j83
$$ plain form
3872 -126 95 104 80 -300 415 184 62 133 105 76 -237 134 254 153 303 5 176 5 158 15 83 -188
3894 -188 96 98 98 117 -6 218 76 -128 -69 332 44 141 125 12 169 -29 -339 -194 142 -107 238 30 13
3917 13 74 -101 273 -39 4 -74 -128 162 62 142 66 72 36 204 -110 -128 -195 152 231 -15 76 -71 -110 47 -37
3942 -37 -320 -174 308 151 -67 -51 74 -104 188 287 3 -99 44 304 -294 -170 82 -113 -192 -105 3 80
3964 80 -116 68 -233 6 -60 288 134 -189 -149 126 -100 -56 106 -60 140 31 -7 -447 68 168 -208 -109
3986 -109 -8 -92 -88 -242 -305 75 100 63 108 44 -7 18 -255 137 -189 28 352 -16 -75 50 33 17 -20 -31 -162
4011 -162 410 5 -314 -37 66 173 -37 -208 -25 90 -38 4 -167 234 -126 52 -267 35 233 -35
4031 -35 65 88 102 260 72 -239 -180 20 143 106 -284 -11 -142 -14 -80 7 58 132 79 -73 -307 -101 56
$$ packed form
3872a26K21Rk4l80P15k31j22P1k8k9l13L71J20j01J50k98J71j71J53j43O8k71
3894a88K84K%J9j23K24j42k04N9M01k88R7j6j13J57j98l10J45L36k49L45k08j7
3917A3O1j75L74l12M3p8n4K90j00Q0p6Ol6J68l14j8o7L47P9k46R1j47l9J57q4
3942c7k83J46M82j57k18J6J25j78K92R9k84j02J43K60n98J24K52j95p9Q7J08P7
3964H0j96J84l01K39o6L48j54l23M0K75k26M4J62j66K00j09l8m40N15J00l76R9
3986a09J01q4Mj54o3L80K5l7M5o4n1K5k73L92l26K17L24l68n9J25j7j6l7j1j31
4011a62N72m05l19K77J03J07k10j71J83J15j28M2j71M01l60J78l19L02J98k68
4031c5J00K3J4J58j88l11N9K00J23l7l90K73j31J28o6Q7N1P4n3j52k34K06J57
$$ plain form
4054 56 22 -262 -207 -65 157 -98 -282 -105 20 -150 219 -218 -148 124 150 -106 -199 -60 291 48 -187 -378
4076 -378 113 65 31 -90 -147 203 -30 -154 -116 -23 59 135 -170 -262 -107 144 4 -33 -132 141 353 -75 -305
4099 -305 27 51 167 -91 -62 -6 -165 -101 -106 25 322 349 -176 -153 -256 153 135 -309 -309 124 259 205 -4 -74
4123 -74 116 90 -41 75 -294 270 62 -282 -166 -41 117 158 -13 -114 60 333 146 -56 -10 -22 148 -397
4145 -397 -212 -83 132 395 -98 117 -131 75 -128 -313 -89 198 154 43 -248 67 143 189 -87 -61 114
4166 114 158 166 -78 119 51 526 81 -10 -156 116 -22 -235 -140 14 152 -31 -189 -29 303 93 306 106
4188 106 156 224 73 -444 -381 291 365 155 35 89 166 -59 13 -415 50 51 23 -131 -79 15 -9 41 -53 115 91
4213 91 182 -165 -71 -204 -335 239 100 -178 -45 190 25 -358 -410 266 101 -48 -170 -96 151 262 53 -135
$$ packed form
4054E6l4k84N5J42K22k55j84J77J25j70L69m37P0K72K6k56r3J39L51k43k35j91
4076c78M91m8l4j21n7L50k33j24L8R3Q2P6l05r2J55K51j40l7r9K73K12m28k30
4099c05L32K4J16k58K9N6j59O4nJ31K97K7n25K3j03M09j8m44%M33J35n4k09p0
4123g4J90k6j31J16l69N64k08l44J16J25J58M1j71j01J74K73j87k02M6j2J70n45
4145c97J85J29K15K63m93K15k48K06k03j85K24K87m4j11k91L15P6M6k76K6J75
4166A14M4Qk44J97o8M75m45r1j46K72j38k13R5J54J38j83j58J60L32k10K13k00
4188A06N0O8j51n17O3O72P4k10j20N4P7k25P2m28M65Jk8j54N2R4k4N0r4J68k4
4213I1R1l47R4j33j31N74j39k78J33K35j65l83n2O76j65j49j22P4K47J11k09j88
$$ plain form
4235 -135 -22 108 128 -66 -199 -96 201 52 194 -26 -201 259 65 -133 80 162 46 6 93 -116 -280
4256 -280 186 28 -110 84 300 121 -348 -341 62 47 -142 -232 -193 275 110 -22 4 63 7 -19 64 -92 85
4279 85 12 185 -309 -271 175 1 -115 -170 -166 -6 145 -110 -154 124 -28 -99 -164 -1 260 2 -193 -257 -7
4302 -7 357 5 36 26 12 86 190 -111 -15 -242 4 97 244 -167 109 123 -31 -239 -97 226 40 -98 -396
4325 -396 46 -117 -340 -484 -36 70 223 247 -235 270 112 3 -89 -44 -9 190 51 -168 68 32 126 192
4347 192 -68 -115 95 -102 -230 12 -302 171 133 -91 -171 -128 284 -241 97 -99 -12 42 -207 -27 -328 -166
4369 -166 48 -21 -258 3 25 9 86 118 116 74 -2 -55 -143 -80 49 59 -36 -215 -235 -71 281 84 141 145 -152 27
4395 27 13 -263 216 39 -215 -286 30 -214 -115 79 62 -233 -274 -47 -210 -158 91 -33 -7 -183 -12 -180 16
$$ packed form
4235a35J13J30K0j94j33J03K97j49J42k20j75M60j94j98K13Q2j16m0Q7k09j64
4256b80M66j58j38J94K16j79m69PM03j5j89r0L9M68j65j32K6N9n6k6Q3j56J77
4279H5p3J73m94L8M46j74j16n5MJ60J51k55m4K78j52p1o5J63K61k58j95o4K50
4302gL64l52L1j0j4P4J04l01R6k27K46R3J47m11K76J4j54k08J42L23j86j38k98
4325c96M42j63k23j44M48J06J53K4m82N05j58j09r2M5L5J99j39k19K36l6R4O6
4347A92k60m7K10j97j28K42l14M73l8k24q0M3M12n25L38j96Q7N4k49J80l01J62
4369a66K14o9k37K61K2j6P7L2km2p6n3q8O3J29J0r5j79k0J64L52j97N7Mk97J79
4395B7j4k76M79j77k54p1L16k44R9J94j7k95m1K27j63N2K49j24K6j76J71j68J96
$$ plain form
4418 16 -101 -135 -78 73 -59 15 64 -46 143 -70 -189 202 162 62 -129 -81 -253 -17 111 6 30 52 -195
4441 -195 -218 196 -60 -124 169 43 17 -4 -276 -268 -172 -97 -270 -15 -74 124 -43 -125 27 -153 197 203 189 -113
4465 -113 -89 -107 59 201 -108 23 51 53 21 -31 -126 93 106 -221 228 -90 139 96 -67 90 -237 222 -116
4488 -116 118 125 -83 11 95 61 34 153 45 -36 113 159 -59 155 274 236 -178 -157 -112 -55 120 -153 -198 -72
4512 -72 4 -163 149 148 -112 116 59 -118 -102 -188 -209 179 -3 28 125 168 67 285 -190 43 33 -95 125 -96
4536 -96 76 91 -57 -138 -136 285 11 -73 -6 -16 -158 -40 -25 17 -112 33 47 55 56 137 48 88 -229 192 -321 246
4562 246 -38 105 177 -247 5 -127 -59 3 -231 -300 81 50 52 -312 24 20 -188 -258 50 -122 -84 40 -67 0
4586 0 -144 345 -115 60 -10 244 119 -200 99 -144 -141 -92 -337 133 -48 119 130 18 15 -219 57 -173 132
$$ packed form
4418A6j17l4N7J51j32P4M9j10J89k13j19L91m0j00j91M8j72K36J28j05K4K2k47
4441a95k3M14k56o4K93j26k6k1k72QR6P5j73K55n9J98j67q2J52j80L50Oj4l02
4465a13K4j8J66J42l09J31K8Kl2n2r5K19J3l27M49l18K29m3j63J57l27M59l38
4488a16K34Pk08R4Q4l4k7J19j08q1J49M6k18K14J19l8m14K1M5N7J75k73m5J26
4512g2P6j67L12jk60K28n7j77J6q6k1L88j82L1R7M3j01K18m75K33j0j28K20k21
4536i6J72J5j48q1KM21k74q4O7j0j42J18J5M2j29J45J4QJQ1q9M0l17M21n13N67
4562B46k84J43P2m24K52j32O8O2k34o9L81l1Kl64L36mk08p0L08j72L8J24j07O7
4586@j44M89m60J75p0K54j25l19K99k43LM9k45M70j81J67J1j12lk34K76k30L05
$$ plain form
4609 132 61 153 -138 -31 -66 221 -87 -5 154 -99 10 -27 -29 -256 -19 -8 -124 305 88 -94 15 -198 29
4632 29 134 180 -185 278 115 36 133 8 277 -90 17 245 222 -33 -118 -17 -70 -27 -233 113 -109 71 -373
4655 -373 57 -220 1 60 195 116 -51 115 -142 -171 -20 -190 266 41 126 -71 -285 365 293 -50 -31 66
4677 66 190 11 -31 140 -1 64 -161 236 -81 -153 146 -150 80 -50 -144 -128 1 125 -105 -155 2 164
4699 164 63 134 -130 12 -64 102 -187 249 -36 -81 60 79 -123 39 164 139 -158 11 19 -97 -43 277 -45
4722 -45 32 91 -192 95 -138 -69 186 101 3 1 145 149 -57 -315 106 -46 -10 27 -231 -194 -93 305 -28 -34 295
4747 295 129 -39 83 -109 92 1 114 34 -14 -205 57 61 -199 109 -25 -85 -174 -57 73 -81 164 -49
4769 -49 196 17 -16 -216 140 1 -66 102 -179 -80 -52 -35 -5 64 113 -45 -322 -140 -111 38 -70 56 -59
$$ packed form
4609A32p1R2k91J07l5K87l08Q2J59k53J09l7kk27K37J1j16M29k17j82J09k13K27
4632B9J05M6l65M63j63p9R7j25K69l67J07K28k3k55q5J01n3M3k06L46k22J80m44
4655c73M30k77K21N9J35p9j67J66k57k9J51j70M56k25Q5j97k14O50p2l43J9R7
4677F6J24j79m2J71j41O5k25L97l17p2K99k96K30j30r4J6J29J24k30n0J57J62
4699A64j01P1k64J42p6J66k89M36k85m5J41J9k02J62J25k5k97J69Qj16N4L20l22
4722d5P7N9k83K87k33O9K55q5r8kJ44Mk06k58M21j52L6L7k58L7J01L98l33oL29
4747B95j66j68J22j92K01r1J13q0m8j91K62Mk60L08j34o0q9J17J30j54K45k13
4769d9K45j79l3k00L56j39o7J68k81R9K8J7L0O9M9j58k77J82K9J49j08J26j15
$$ plain form
4792 -59 145 23 8 122 -163 -94 -35 156 -124 95 95 35 -10 41 -97 102 98 -51 12 -95 180 -136 -28 -74
4816 -74 80 101 190 95 -119 -163 -47 -37 290 170 -189 29 -357 175 76 101 -115 -177 141 -256 94 121 -242
4839 -242 137 129 52 118 133 51 -28 132 -70 -144 27 -86 251 282 130 -2 276 -122 45 48 -186 41 -10 262
4863 262 -26 217 204 131 4 142 97 17 195 150 -54 -52 219 -246 81 -225 -15 260 -60 -149 47 -24 102
4886 102 -45 0 255 132 202 -82 142 35 -174 32 -42 -116 -175 -1 -1 -51 218 -235 97 422 138 196 -58
4909 -58 83 -153 -167 -39 140 -115 -268 -18 56 -24 -212 162 191 -144 208 -98 -43 -152 49 -12 17 75 56
4932 56 149 315 -87 29 -115 283 -161 60 -157 -23 90 -127 -18 -134 -242 -211 254 57 -107 -93 168
4953 168 139 -247 -135 -46 -183 53 -161 123 -170 253 404 14 -33 6 153 23 80 -130 -97 60 -51 55
$$ packed form
4792e9K04j22j5J14k85O9N9J91k80K19%o0m5N1j38J99mj49O3j07K75l16J08m6
4816g4J54K1Q9r5k14m4J16J0L27j20l59K18l86N32r9K5k16o2L18l97L50K7l63
4839b42L79qp7O6J5q2p9J60k02p4J71j13L37L1j52j32K78l98J67Lk34K27n1K72
4863B62k88K43j3p3j27J38m5q0J78m5k04KK71m65L27l06K10K75l20q9J96p1J26
4886A02j47M5K55j23P0k84K24j07k09K06p4p4n9J74%n0K69m53L32L25k84N8k54
4909e8J41k36j4J28J79k55j53K50P4q0j88L74K9l35L52l06N5j09K01o1K9N8j9
4932E6R3J66m02J16j44L98m44K21k17J34J13k17J09j16j08L1M65j97j64J4K61
4953A68k9l86J12Q9j37K36k14K84k93M23J51l90m7L9J47j30N7k10L3J57j11J06
$$ plain form
4975 55 -12 -111 -5 -196 -288 54 -42 14 172 -103 -177 -98 -181 -49 -15 -98 32 151 28 193 49 -20 213 -131
4999 -131 -211 -55 121 -152 -258 -50 -180 292 -27 -43 158 32 10 131 -35 -45 132 36 37 -43 39 -332 -110
5022 -110 0 292 458 -73 144 -94 138 0 -113 30 95 20 34 59 5 -91 318 225 14 -401 96 51 397
5045 397 -82 -29 27 -103 81 56 -135 184 162 -124 229 -88 318 5 -112 -88 -94 -139 -262 -42 258 -310 267
5068 267 27 -34 43 -37 157 -104 96 85 120 115 -121 -111 -80 -144 -180 -324 -77 121 174 93 -242 -247 -180 -174 90 157
5094 157 29 15 -113 -60 181 38 207 107 121 -366 -57 -291 -79 -78 139 186 34 77 125 156 45 -31 -48 12
5118 12 -42 -148 -57 10 -136 -83 19 142 -130 148 -177 20 -102 -190 38 -66 82 -25 -140 119 137 -86
5140 -86 46 -93 -50 55 124 120 134 -198 44 -55 -42 196 -232 29 93 -185 -46 -21 -10 -144 -83 241 170 98 -6
$$ packed form
4975E5o7r9J06j91r2L42r6N6J58k75p4P9q3J32L4q3J30J19j23J65j44o9K33l44
4999a31q0J56J76k73j06K08j30M72l19j6K01j26k2J21j66j0J77r6Jq0Q2l71K22
5022a10J10K92J66n31K17k38K32j38j13J43O5p5J4K5n4r6M09r3k11m15M97m5L46
5045C97m79N3N6j30J84k5j91L19k2k86L53l17M06l13j17K4om5j23K20L00n68N77
5068B67k40o1P7q0J94k61K00j1L5nk36J0L1o4l6j44K47J98N3q1l35nO7OK64O7
5094A57j28j4j28N3K41j43J69j00J4m87L09k34K12JK17M7j52M3M8L1j11p6j7O0
5118A2n4j06R1O7j46N3J02J23k72K78l25J97j22q8K28j04J48j07j15K59J8k23
5140h6J32j39M3J05O9mJ4l32K42r9J3K38m28K61O4k78J39K5J1j34O1L24p1p2j04
$$ plain form
5165 -6 -301 -222 -30 96 2 53 158 -152 -495 -59 160 -225 43 45 210 6 70 275 55 85 224 -8 17
5188 17 203 74 259 156 46 223 34 76 -216 149 17 -103 -17 69 -104 -32 135 172 11 -16 -13 -128 12
5211 12 -73 407 -247 16 -112 155 -70 258 70 -189 93 27 14 -19 117 19 -89 -11 125 26 101 106 2 -24
5235 -24 67 -10 63 200 -97 243 -85 -26 149 -308 -194 -66 -329 39 -22 128 15 -30 -80 -120 -71 140 -214
5258 -214 73 152 360 80 -218 26 -145 93 263 -47 153 -30 -171 -112 57 -18 -124 465 44 -255 -94
5279 -94 76 -269 332 10 146 96 -36 -150 188 -158 173 178 -203 -74 -60 36 -45 -38 82 29 -170 113 -59
5302 -59 68 -109 -216 60 78 213 -150 16 -72 22 329 -1 86 298 158 -202 -346 111 154 28 241 -84
5324 -84 8 -10 200 -43 -20 62 101 20 -116 222 120 214 -183 -341 62 320 117 -312 58 19 -22 -98 -7 252
$$ packed form
5165fk95P9J92J26r4N1J05l10l43M36K19l85K68KJ65k04O4K05k20L0J39k32K5
5188A7J86j29J85j03j10J77j89M2k92L65j32j20Q6Q6j73P2J67L7j61k7Lj15J40
5211A2q5M80o54K63j28K67k25L28j88k59K82o6j3l3J36r8j08P8J36r9P5Nj04k6
5235b4R1p7P3J37k97L40l28N9J75m57J14J28k63L68o1J50j13m5n0m0M9K11l54
5258b14K87P9K08k80k98K44j71K38J70l10K00j83j41N9J69p5j06N89m21k99J61
5279i4J70l45O01l22J36n0j32j14L38l46L31Nl81J29J4R6q1PJ20n3j99K83j72
5302e9J27j77j07K76J8J35l63J66q8R4L07l30Q7K12j40l60j44M57M3j26K13l25
5324h4R2j8K10k43K3Q2L9q1j36L38j02R4l97j58M03K58k03m29L70l9m1p6R1K59
$$ plain form
5348 252 225 186 -138 32 -195 69 -148 -5 2 47 394 -221 -65 6 -129 85 -129 -142 -176 -45 99 -54 -30
5371 -30 -12 -23 -66 58 -155 82 82 92 -106 -7 -245 116 209 -228 -4 71 87 80 -237 112 24 73 49 79 -267 290
5397 290 -57 -127 -93 -79 -71 -152 -133 297 -27 10 -112 268 -177 -8 -239 -162 79 -106 -38 -81 -45 -181 350 104
5421 104 -326 -175 129 -73 213 83 -13 -113 -197 -55 35 170 74 12 -273 -5 187 -106 195 -63 -43 -232
5443 -232 244 59 112 3 81 -273 -129 -208 -13 -34 -69 32 -33 115 -45 40 -71 -124 125 59 61 13 15 101 -151
5468 -151 -121 -155 129 195 32 -29 94 174 -45 59 -34 -7 168 120 -117 -111 -117 -10 -65 -95 -112 360 12 -103 -117
5493 -117 12 -82 50 -224 -4 -268 205 -68 -124 188 -135 -263 -7 -59 -277 176 177 92 172 -138 90 64 185
5516 185 -259 70 110 -50 16 91 311 -33 -72 -248 -16 -372 54 -53 6 102 211 249 222 -345 -128 -12 -137
$$ packed form
5348B52k7l9l24J70k27K64k17J43PM5L47o15J56P1j35K14k14j3l4J31J44j53K4
5371c0J8j1m3J24k13K37%J0j98R9k38L61R3m37K24P5J6pl17L49q8M9k4L0l46N57
5397B90l47p0L4J4Qq1J9M30l24L7j22L80m45J69k31P7K41j85O8m3L6j36N31k46
5421A04m30J51L04k02K86j30r6j00q4J42R0J35r6o2k85K68J92k93L01k58K0j89
5443b32M76j85N3j09P8l54J44p9J95k1l5J01o5J48j60Q5j11n3K49o6Km8KQ6k52
5468a51L0l4K84O6j63o1J23Q0k19J04r3K7J75m8k37OoJ07n5l0j7M72l48j15j4
5493a17J29r4J32k74K20k64M73k73n6L12l23j28K56n2k18M53Jq5Q0l10K28k6J21
5516A85m44L29M0j60O6P5K20l44l9j76K32l56M26j07N9R6J09L8k7n67K17J16j25
$$ plain form
5539 -137 -22 -116 165 -44 -253 -13 -308 -58 96 -207 65 94 -95 -309 -163 -233 142 119 208 149 15 -231
5561 -231 -76 55 15 -199 48 -300 25 -159 -2 -1 -36 80 -36 12 -33 3 127 -53 -39 44 81 17 -117 64
5585 64 -74 122 107 80 -31 -223 95 -124 -104 182 -92 -296 64 -29 -44 -42 -11 188 -194 153 96 142 -187 -138
5609 -138 -138 -59 -281 -130 113 106 127 197 104 3 66 -47 5 224 -102 -248 -474 -13 192 98 -78 83 -62 -67
5633 -67 163 -156 138 95 -87 -250 88 231 -118 49 105 -56 -38 12 -238 114 -23 44 -121 -178 -57 60
5655 60 158 -123 -198 -127 -21 81 -215 22 144 3 156 -11 10 81 -32 -123 327 82 72 56 -15 -131 120
5678 120 46 -209 -86 -171 172 -180 -24 205 116 -207 -140 185 -89 -300 -265 -39 -45 65 -192 218 112 -55
5700 -55 -76 -142 -78 -68 -252 43 85 -107 -47 137 31 -15 -118 -33 -56 -27 15 -123 -39 235 -93 -60 -281 -205 227
$$ packed form
5539a37J15r4K81k09k09K40k95K50J54l03K72K9j89k14J46p0L75k3Q9n9j34k46
5561b31J55J31m0k14K47l48L25j84J57Jl5J16j16M8m5L6J24j80J4Q3L7o4j34J81
5585F4j38J96j5k7j11j92L18k19K0K86k74k04L60r3j5KL1J99l82L47n7M6l29M9
5609a38%P9k22J51K43pK1P0r3j01O3j13N2K19l26j46k26M61K05r4j76J61j45n
5633f7K30l19K94m3j82j63L38J43l49J67N6j61J8N0k50L52j37O7j65n7J21J17
5655F0R8k81p5P1J06J02k96K37J22j41J53j67K1P1j13r1M50k45j0j6p1j16K51
5678A20p4k55J23q5L43l52J56K29q9l23O7L25k74k11L5K26oJ10k57M10j06j67
5700e5k1o6O4J0j84K95M2j92O0J84j06m6j03Q5k3K9M2j38Q4K74l28L3k21P6M32
$$ plain form
5725 227 -117 129 79 -24 343 120 41 -91 -58 7 -5 86 192 -162 4 115 -191 126 -18 -21 -102 273 18
5748 18 206 -21 116 63 63 184 -59 -144 40 -117 133 30 -200 117 21 -151 -140 46 51 18 -252 248 2
5771 2 250 -118 56 -66 49 98 6 -224 -7 106 -88 99 -7 70 125 83 -141 -196 221 70 12 -262 217
5794 217 132 -158 -203 -129 132 134 -40 128 103 172 -125 -44 -71 217 -35 -23 191 -298 -155 -36 200 197 -40 75
5818 75 52 9 30 -144 -3 -98 35 182 69 -19 31 120 -232 -90 -88 -13 245 157 65 85 36 -38 111 156 -45 132
5844 132 -41 83 252 -86 -245 163 216 -23 275 -35 -124 -15 8 -112 -79 88 97 98 -246 32 -51 31 -85
5867 -85 -31 40 50 171 -258 68 -11 50 -87 -139 -95 261 -27 -75 8 -74 29 -18 54 105 11 82 100 -67 -134 246
5893 246 -221 74 -19 4 -190 -61 -107 111 47 51 50 -26 -296 165 196 197 -130 -135 97 -202 -13 -31 -127 -358 -11
$$ packed form
5725B27l44K46n0j03L67k23p9j32L3O5j2R1J06l54J66J11l06L17j44lq1L75k55
5748A8J88k27J37n3%J21k43q5J84j57K50j03k30L17r6j72J1J86Nl3k70N00k46
5771BK48l68J74j22J15M9r2k30K17J13j94J87j06P7N5m2k24n5M17j51n8k74M79
5794B17q5k90m5P4K61Kj74J68k5O9k97Q1k7K88k52J2K14m89J43J19K36lk37J15
5818G5k3m3K1j74J41r5J33J47j13q8N0Q9l52J42KP5K58q8r2K0m9p4J49M5k01J77
5844A32j73J24J69l38j59M08N3k39K98l10q9J09K3j20L3J67RJl44K78q3Q2j16
5867h5N4P1J0J21m29L26p9O1j37n2M4L56k88m8Q3q2J03m7P2N1r4P1J8j67o7L80
5893B46m67K95r3K3j94J29m6K18o4Mjp6k70M61L1Jl27nK32k99J89j8r6k31L47
$$ plain form
5918 -11 -365 181 173 8 -137 109 177 204 281 -80 -47 3 -56 81 -151 71 -54 209 -79 -186 -59 -48 47 32
5942 32 208 196 47 215 -33 108 -186 181 289 64 115 -5 -55 -127 149 104 283 -77 96 112 20 -138 202
5965 202 -64 298 -64 -23 -116 -64 -11 115 -55 -69 -183 -12 -65 -9 -115 -18 39 -78 -317 -365 -129 11 -24 15
5989 15 213 70 120 -50 239 92 301 -56 -83 -234 -73 333 -287 -156 -69 243 162 -15 -62 154 -41 -106
6011 -106 23 -59 197 67 -43 -81 -306 -140 -37 242 118 179 -21 -367 87 48 -20 -347 -25 128 228 -169
6033 -169 107 100 -83 -217 -85 294 -135 -9 -273 71 -167 0 -94 -123 74 -56 -267 -117 55 -1 -85 23
6055 23 29 -41 33 26 -100 -18 -6 -80 -63 -156 -160 101 64 -380 -74 -200 -5 102 -60 193 -92 -111 -58 180 82 152
6081 152 -81 91 -118 -122 -219 -55 -27 -347 -203 314 -111 131 -77 -39 -7 -44 165 15 -57 -21 52 110 -279 64
$$ packed form
5918a1l54N46qj65j45K46O8K7P7l61L3N0n9J37k32K22j25K63k88j07J27J1R5j5
5942C2J76j2j49J68k48J41k94L67J08k25N1j20n0p2K76m5J79l60J73J6r2j58L40
5965B02k66L62l62M1r3N2N3J26j70j4j14J71n3N6j06R7N7j17k39m8K36J40l5L9
5989A5J98j43N0j70K89j47K09l57k7j51J61M06o20J31Q7L12q1j77m7K16j95o5
6011a06J29q2K56j30j10l8k25J66J03K79j24O1k00l46M54l9o8l27L22J53J00l97
6033a69K76pj83j34J32L79m29J26k64L44k38J67r4k9J97j30k11J50J72n6q4J08
6055B3Op0P4pj26Q2J2p4J7r3mK61l7m44L06j26J95J07j62K53k85j9N3K38r8P0
6081A52k33J72k09mr7J64K8l20J44N17m25K42k08L8L2l7K09j50p2L6P3N8l89L43
$$ plain form
6105 64 164 -59 200 141 -233 -278 88 125 -113 -240 -151 -27 50 -266 -191 -137 -42 -237 -103 -68 -371 -131 216
6128 216 -89 -164 -219 -378 -117 -77 -163 131 -134 -71 169 -395 5 -126 115 20 111 -302 145 -141 -297 11
6150 11 -85 -97 -89 202 115 116 -109 -28 184 96 -237 -42 -13 -280 -33 -92 18 75 -177 -46 -241 252 -217 -109
6174 -109 -117 96 23 206 55 -12 100 64 -144 -126 75 125 171 -59 -226 131 138 71 311 -6 117 -151 -207 -177
6198 -177 1 -8 231 -20 -17 -269 -41 67 -28 100 -156 -38 222 -418 327 -31 -74 -180 -232 -71 -34 104 -243
6221 -243 -49 227 -125 53 -74 343 -120 49 167 -151 -37 -64 -90 5 20 -71 201 -107 65 1 -83 -155 45
6244 45 154 58 59 -119 -184 266 150 -37 101 -155 -112 -80 94 -119 144 41 -41 231 -43 -115 -120 193 45 76
6268 76 139 -36 -262 -132 -136 72 188 -4 -130 161 -115 65 77 -27 42 113 -137 233 -40 26 95 -10 256
$$ packed form
6105F4J00k23K59n9l74m5L66L7k38j27Q9J24P7l16P5N4R5j95J34L5l03K40L47
6128B16l05p5n5j59K61M0q6K94k65O3K40n64M00j31K41r5R1m13M47k86j56L08
6150A1r6j2QK91q7Jk25Q1K12q8l33J95K9k67K47n9J10N7k52J31j95M93m69J08
6174a09qK13p3J83j51o7J12l6k08J8K01N0M6k30j67L57Po7K40l17J23k68n6L0
6198a77J78rK39k51Lk52K28J08r5J28k56J18K60o40P45l58m3j06n2J61L7J38l47
6221b43J94K76l52J78j27M17m63J69J18l18J14k7k6R5J5r1K72l08J72o4q4p2K00
6244D5J09r6Jj78o5M50j16j87J38k56M3L2J74k13K63j03q2K72k74p2nL13j48L1
6268G6O3j75k26J30mK08J16j92j26K91k76J80J2j04O9P1k50L70k73O6O9j05K66
$$ plain form
6291 256 99 -67 66 -141 129 87 65 89 -80 53 -255 196 -48 -278 -12 -164 -200 25 18 -104 42 -173
6313 -173 5 74 103 -103 -7 -8 59 -36 -200 189 -105 13 -60 96 -194 238 100 97 98 -140 121 -21 109 172
6337 172 291 -27 -60 -151 -111 83 -43 -56 -200 -61 -54 19 -101 -105 5 166 -330 293 37 -152 -62 -117 245 75
6361 75 -81 -16 62 62 104 24 68 2 -6 33 37 56 21 66 -26 193 180 24 52 11 282 -119 35 -320 132 -58 -310
6388 -310 -58 -356 32 318 119 -50 33 -40 172 -4 -60 -180 -147 -186 -169 75 -23 43 -56 1 219 45 272
6411 272 236 44 13 161 -236 -44 -47 -44 -179 200 194 -46 13 -56 78 -75 173 -47 32 -1 -44 15 248 88 3
6436 3 -35 -169 -55 -16 192 -171 124 -69 -13 142 -84 -8 -165 -153 96 185 -120 138 -174 -52 45 -24 -124
6459 -124 -223 -159 -42 -343 239 212 120 -50 -1 -187 -3 58 -24 206 -28 13 -2 -65 33 48 -51 175 44 -88
$$ packed form
6291B56j57j66J33k07K70m2k2K4j69J33l08M51k44k30K66j52l6K25pj22J46k15
6313a73J78O9K9k06R6jO7r5j64L89k94J18p3J56k90M32j38lJk38K61j42J30O3
6337A72J19l18l3r1M0J94j26j3j44J39PP3j20mJ10J61m96O23k56j89R0n5L62j70
6361G5j56O5P8%M2q0M4o6qL9MJ9l5M5r2K19j3j56K8m1K71m01J54l55M52j90k52
6388c10K52k98L88K86j99j69Q3p3K12j76n6j20L3l9J7K44r8O6r9N7K18j74K27
6411B72l6j92l1J48l97J92lLj35L79ok40N9o9J34j53K48k20P9l3m3N9K33j60q5
6436Cl8j34J14L9K08l63K95j93N6J55k26P6j57J2K49Q9l05K58l12J22R7o9j00
6459a24r9O4J17l01N82k7r2j70M9j86J84O1q2K30k34M1j5o3R8J5r9K26j31j32
$$ plain form
6483 -88 204 -9 30 200 -163 68 10 -12 378 75 -118 -65 -146 -295 227 -271 -42 92 -103 70 -117 95
6505 95 157 -26 70 180 141 -43 266 7 -9 209 59 214 -85 -109 202 -111 -236 222 125 73 170 35 187
6528 187 -274 42 82 -43 -232 -6 106 28 77 339 223 -66 86 56 -27 27 50 -13 -32 -177 -108 203 -222
6551 -222 -112 99 34 135 -33 -166 135 -69 -159 61 -49 193 44 182 -63 -43 -6 -192 64 261 168 -43
6573 -43 -102 -121 43 -145 48 187 137 -62 -273 88 78 -51 -111 -5 -167 27 66 85 -14 -34 -38 -204 10 46
6597 46 -145 138 110 -174 35 -1 162 245 -298 37 144 1 76 170 -21 -6 186 -20 -91 -135 -61 -101 103 57
6621 57 169 157 -256 159 -62 -63 23 -37 218 -75 -26 -98 -132 22 21 -8 -168 -46 -57 -111 -99 85 -82 109 192
6646 192 -199 91 31 147 92 20 32 -62 179 155 -30 86 48 40 42 -9 234 104 -97 -289 36 227 -58 175
$$ packed form
6483h8K92k13L9J70l63K31n8k2L90l03j93N3q1j49N22m98K29J34j95J73j87K12
6505I5O2j83R6J10l9j84L09k59j6K18j50J55k99k4L11l13j25M58r7n2R7j35J52
6528A87m61L16M0j25j89K26J12p8M9K62j16k89J52l0q3N4K3o3j9j45O9L11m25
6551b22J10K11o5J01j68j33L01k04r0K20j10K42j49J38k45K0L7j86K56J97r3k11
6573d3n9j9J64j88J93J39n0j99k11L61j0j29o0J06j62J94L9J9r9k0mj66K14L6
6597D6j91K83k8k84K09l6J63Q3n43L35J07j43P5R4j91J5J92k06p1m4P4m0K04m6
6621E7J12j2m13M15k21jQ6o0K55k93M9p2l4J54jk9j60J22j1n4J2J84j67J91Q3
6646A92l91K90o0J16n5p2J2r4K41k4j85J16l8qKn1K43j30k01j92L25J91k85K33
$$ plain form
6670 175 186 -27 348 -81 -73 91 -168 53 79 -89 -35 -52 -42 19 201 -277 -54 -43 -31 -290 191 -71 88
6693 88 40 139 327 -307 152 112 -38 -47 36 110 68 124 -10 -96 55 -132 48 -128 -32 -73 101 114 56 197 -97
6718 -97 358 -20 -20 -86 89 14 126 -93 -171 89 -81 78 184 153 -179 166 16 146 -34 230 159 -181 -269
6741 -269 -35 1 -3 -123 -33 128 -113 0 19 -108 140 -183 -37 35 -132 -91 -115 -29 150 4 -180 62 -121
6764 -121 129 -81 -66 55 -15 132 80 -145 -111 131 93 211 27 -59 -35 259 -126 -17 48 149 0 120 158
6787 158 258 -24 66 217 -20 281 -143 -19 -12 -147 79 -61 223 13 -112 10 6 -212 -214 -201 67 138 116
6810 116 133 -69 -170 -19 -64 77 -159 130 127 -298 -10 27 1 -110 -60 -34 -181 -202 -151 147 -249 129 69 -99
6834 -99 -117 7 55 269 161 91 -3 -119 -10 108 -66 -40 -146 77 -174 -51 -14 1 182 306 -7 477 -222
$$ packed form
6670A75J1k13L75m29QJ64k59K21K6j68N4j7J0O1J82m78K23J1J2k59M81k62J59
6693H8m8R9J88o34M59m0j50rQ3P4m2N6j34q6J51j87J80j76R6m1J74J3n8J41k94
6718i7M55l78%o6J75p5J12k19p8K60j70J59J06l1l32L45j50J30j80K64p1l40q8
6741b69K34L6mj20R0J61k41J13J9j27K48l23J46P2j67M1k4Q6J79j46j84K42j83
6764a21K50k10J5J21p0J47n2k25L4K42l8J18j84q6K4K94l85J09O5J01j49J20L8
6787A58J00k82R0J51k37L01m24J24Pj35K26j40K84k10j25J22mk18kJ3K68P1k2
6810A16J7k02j01J51m5J41k36K89lm25K88L7k6j11N0K6j47k1N1K98l96L78o0j68
6834i9j8J24M8K14j08p0r4j16J09J18j74K6j06K23k51J23L7J5J81J24l13M84o99
$$ plain form
6857 -222 -172 106 -274 94 195 10 76 332 184 -176 89 258 -71 147 -36 -163 -94 45 71 -62 78
6878 78 -48 -39 109 -215 132 -109 14 -32 -32 -212 237 -218 -70 141 90 43 128 27 135 -60 152 60 -191
6901 -191 150 83 60 256 2 -229 122 -425 1 209 262 -80 -75 118 -281 -44 13 49 245 40 45 -111 -22
6924 -22 -96 -33 47 -185 -251 34 -165 63 -160 99 186 -41 67 342 6 183 66 188 104 111 46 -31 76 -126
6948 -126 -13 -43 242 47 150 20 -59 -248 260 86 -235 -2 -173 163 179 -93 79 7 -144 -62 -134 172
6970 172 201 -197 -12 -267 -40 -86 -92 138 -28 137 -179 282 -105 -18 -190 84 56 -37 -147 -1 -137 246
6992 246 109 -37 -143 -291 38 110 -173 73 -6 -6 5 131 28 71 76 -105 -44 167 -215 148 -60 -135 32
7015 32 200 -96 -87 14 171 -83 -107 187 -36 -325 -181 49 -56 -16 71 238 -65 55 25 -40 44 -50 235
$$ packed form
6857b22N0K78l80L68J01j85O6K56j48l60K65J69l29K18j83j27O9J39K6j33J40
6878G8j26RJ48l24L47k41J23m6%j80M49m55J48K11n1m7Q5j01J08j95K12r2k51
6901a91L41o7k3J96k54k31L51n47M26K08N3l42NJ93l99K37N7L6J96k05Nj56Q9
6924b2p4O3Q0k32o6K85j99K28k23K59Q7k27J08K75l36J77j17J22q4Po5p7J07k02
6948a26J13l0K85j95J03j30p9j89N08j74l21K33j71L36J6k72J72p2j51Q2p2L06
6970A72K9l98J85k55K27m6oK30j66J65l16M61l87Q7j72K74k8r3j10J46j36L83
6992B46j37j46j06j48L29P2k83K46p9%J1J26j03M3Nj81O1K11l82L63k08p5J67
7015C2J68k96RJ01J57k54k4K94k23k89J44K30j05M0Q7J67l03J20l0o5Q4r4K85
$$ plain form
7038 235 -118 58 -236 -54 -79 4 59 207 41 -276 88 -39 158 -139 141 34 151 -277 -144 -185 -170 5
7060 5 -20 -72 3 29 -55 124 -204 -195 -128 -58 -30 -75 -199 87 109 -118 -68 -2 366 27 214 163 -49 22 20 128 -39
7087 -39 -144 -104 -25 281 104 163 -173 27 6 -3 185 75 -69 -107 -495 -9 123 194 13 -61 -115 -10 13 -85
7111 -85 126 66 144 -88 322 -15 -171 -229 -129 116 63 -148 241 117 -78 -313 -87 -227 -163 106 -48 264
7133 264 98 71 60 29 35 -47 -107 77 -75 -226 -87 -92 -79 -65 9 -78 123 70 -208 -182 78 114 42 -234 1 62
7159 62 -172 -163 152 165 -27 117 -79 -6 -35 33 -119 -55 -191 37 -103 128 -151 46 180 -36 44 -163 35
7182 35 -218 0 -91 -264 82 64 185 -45 -46 -131 -120 -68 -233 -59 96 -180 -23 154 112 69 1 -71 206 -125
7206 -125 -1 -230 -189 156 -13 -337 -227 -91 243 101 100 -192 49 -289 -213 -76 -149 -123 -249 169 -40 -60
$$ packed form
7038B35l53J76k94J82k5Q3N5J48j66l17L64j27J97k97K80j07J17m28J33m1J5J75
7060Ek5n2P5K6q4J79l28RO7P0K8m5j24K86K2k27N0O6L68l39J87n1k12P1kJ08j67
7087c9j05M0P9L06j77N9l36K00k1rJ88j10j44l8l88M86J32P1j81p4n4J05K3r8
7111h5K11o0P8k32M10l37j56n8J00K45n3k11L89j24j95k35K26j40O4K69j54L12
7133B64j66k7j1l1Oq2o0J84j52j51J39nJ3J4P4q7K01n3k78K6K60L6p2k76K35O1
7159F2k34RL15J3j92J44j96P3k9O8j52O4j36K28j40K31k79J97J34k16Q0k07J98
7182C5k53K18r1j73L46j8J21k30jq5J1N2j65J74J55k76J57J77m2m3o8p2K77l31
7206a25J24k29M1L45j69l24J10J36L34j42jk92K41l38P6J37p3K6j26M18k09k0
$$ plain form
7228 -60 -116 3 -158 142 155 -107 67 81 -58 32 18 80 95 9 228 56 -23 82 -101 -81 17 52 70 64 -66
7253 -66 -2 -194 227 -5 -45 97 -220 -82 -136 213 139 -138 124 -106 270 -199 82 222 -92 -188 31 79
7275 79 -6 26 180 50 -37 86 81 123 117 -95 -268 12 198 9 248 -44 -90 -177 208 257 52 92 0 91 -40
7300 -40 66 209 24 29 18 -138 -129 83 -144 -67 -47 -341 11 68 -314 317 -61 47 136 84 -118 98 -14 -66
7324 -66 19 -9 -182 20 4 13 -73 -293 164 11 199 297 65 -70 -82 55 65 64 87 -96 -151 135 80 40 -161
7349 -161 -102 45 95 53 -54 106 125 -177 257 4 135 28 -119 32 -185 -28 55 2 -99 175 -52 142
7371 142 -1 33 26 -246 909 171 -7 -79 -199 4 -12 198 -28 -62 23 -128 -6 73 -92 -148 39 -126 320
7394 320 -114 -17 21 114 112 -148 -80 -222 -43 -169 84 71 166 108 -50 289 40 39 -75 11 350 -51 50 241
$$ packed form
7228f0n6J19j61L00J3k62J74J4j39R0j4O2J5q6K19j72p9J05j83K0R8L5J8oj30
7253f6O4j92M21k32m0J42l17J38n4L49p4k77K62k30L76m69K81J40l14r6K19M8
7275G9q5L2J54j30q7J23nM2ok12j73K80J86j89K39k92m6q7L85M9k05M0r2R1j31
7300d0J06J43j85Nj1j56RK12k27P7K0k94L52N7l82O31l78J08Q9n2k02K16j12n2
7324f6Q5k8j73K02j6Rq6k20M57j53J88R8k32j35j2J37J0jK3j83n5K86n5m0k01
7349a61N9J47N0m2j07J60J9l02M34k53J31j07j47J51k17J57Q3n3j01K74k27J94
7371A42j43L4pk72J155p38j78p2j20K03j6K10k26l4Q5j51J22P9j65n6J87j65M46
7394C20m34R7L8R3kk60O8j42J79j26K53j3R5n8j58L39k49jj14Q6L39m01J01J91
$$ plain form
7418 241 27 -268 164 -108 91 129 -7 81 -23 -236 45 44 166 132 -137 -47 170 -3 -78 -152 -90 -10 -202
7441 -202 -240 72 41 70 -178 -123 -116 17 -149 148 15 154 81 -103 57 -130 132 93 78 40 -95 -251 261
7464 261 110 -171 151 88 147 -7 -75 -100 -118 127 -62 -81 -110 -122 -21 52 -7 215 -164 81 15 118 -11 11
7488 11 74 -62 129 -229 351 287 -44 -384 106 81 5 -180 -89 336 -470 588 -77 4 190 48 -415 121
7510 121 -461 213 -675 -24 146 -379 396 239 482 83 -63 496 406 -57 368 462 -1278 213 39 -197
7530 -197 109 -303 13 425 355 -323 536 908 -347 191 -597 -137 -217 -80 1431 36 -193 -177 37 -266
7550 -266 -920 -277 278 -253 -511 28 -132 60 222 -899 -140 308 16 -408 321 266 -752 474 182
7569 182 -359 317 673 617 188 -32 424 2 -537 -5 -332 -401 185 90 298 -97 490 129 -30 -333 -177
$$ packed form
7418B41k14k95M32k72J99L8j36Q8j04k13K81jJ22l4k69R0K17j73p5p4O2Q0j92
7441b02l8L12l1K9k48N5PJ33j66K97j33J39p3j84J60j87K62l9j5l8j35j56N12
7464B61j51k81L22o3N9j54o8k5j8K45j89j9k9j2J01P3n9K22l79K45o6J03j29K2
7488A1O3j36J91l58N80o4l31l40M90k5p6j85R1M25q06J058o65Q1J86j42m63N36
7510A21n82O74q88O51J70n25P75j57K43l99j46N59r0m63M25R4j740J491j74k36
7530a97L06m12L16M12p0o78Q59L72j255N38p88M60q0J37J511j395k29J6K14l03
7550b66o54O43N55n31k58N39j60J92J62j121P59M48k92m24P29n5j018J226k92
7569A82n41O76L56n6m29k20M56m22n39N32l27o9N86r5K08l95N87l61j59l03J56
$$ plain form
7590 -177 -81 -172 -130 -168 -238 -130 -227 160 303 -102 -205 -4 -183 -26 116 -200 -204 -175 -35 163 146 188 39 8
7614 8 106 -13 366 14 36 36 -160 174 -234 161 -311 -111 -152 -101 -26 242 -152 153 -88 -154 -250 -99 303 85
7638 85 -138 110 126 123 2 132 -317 -60 23 95 -69 1 229 158 290 -88 -34 -313 -28 -67 26 77 177 -26
7662 -26 -55 243 19 45 -325 26 70 181 112 40 -54 11 71 135 51 -117 167 137 162 89 79 13 -175 17 -8 69
7688 69 79 344 -166 68 48 -173 -58 -238 22 35 13 68 29 -84 16 88 -27 150 -111 11 233 -57 -141
7711 -141 183 -49 90 -121 178 317 228 -126 115 98 -127 -113 159 249 39 -76 -40 -232 -192 -223 -123 124
7733 124 -94 52 129 -57 -112 -65 -135 -94 -209 184 -184 108 155 -196 -136 56 171 -55 99 -92 211 -57
7755 -57 259 133 -208 -36 167 -100 151 -48 -104 -93 -63 102 -167 186 118 -195 -76 87 100 106 72 -90 32
$$ packed form
7590a77R6r1M2l8p0J08r7L87J43m05j03K01j79J57J42l16mK9J40J98j7M2j49l1
7614HR8j19L79l52K2%j96L34m08L95m72K00m1N1P5K68l94L05k41o6r6J51M02k18
7638H5k23K48J6lj21J30m49K57Q3P2j64P0K28p1J32l78N4k79K85l9R3N1J00k03
7662b6k9K98k24K6l70L51M4J11o9p2r4O5O0O4q4j68K84l0K5p3j0o6j88J92k5P7
7688F9J0K65n10K34k0k21J15j80K60J3k2N5l9j13J00P2j15J77k61J22K22k90q4
7711a41L24k32J39k11K99J39q9l54K41j7k25J4K72R0k10j15L6j92M0l1J00K47
7733A24k18J46P7j86n5M7p0M1j15L93l68K92M7l51O0J92J15k26J54j91L03k68
7755e7L16j26l41J72K03k67K51j99n6J1L0J65k69L53o8l13J19J63J3Ol4j62J22
$$ plain form
7778 32 -251 -71 -266 -101 8 16 -113 164 283 33 -115 -224 31 2 206 227 265 33 86 -351 54 57 53 136
7802 136 -58 235 -100 -150 -99 -30 53 119 83 22 -2 -60 -174 -119 -62 -160 254 120 -39 68 -44 205 -127 -146
7826 -146 -82 -122 -48 -23 -256 -79 15 -142 85 79 -101 214 -35 200 -148 -120 100 -20 112 -14 -231 217 79
7849 79 -150 172 -227 6 -212 -105 -80 -47 -55 247 -82 -76 256 -150 -65 180 170 1 -26 34 1 10 -84 166 -217
7874 -217 -5 291 -98 26 105 138 -45 165 -285 91 -150 -144 126 -171 -32 6 -104 -19 314 -187 -80 28
7896 28 -138 179 -98 77 111 -93 -28 42 63 180 -76 109 88 190 -164 -336 20 -137 -89 175 -99 -57 262
7919 262 100 -73 6 98 -107 -24 153 -204 182 230 37 70 -78 357 -217 -118 -250 -201 178 -188 148 -35
7941 -35 -85 189 -128 -131 231 -117 -35 -18 -82 317 186 -2 -183 -309 530 -65 44 -114 12 64 143 -89 -5
$$ packed form
7778C2k83J80j95J65J09Qj29K77J19k50j48j09K55k9K04K1L8k32N3m37M05LmQ3
7802A36j94K93l35n0N1O9Q3O6l6o1k4n8j14N5N7r8M14j34j59J07j12K49l32j9
7826a46O4m0P4K5k33J77R4j57K27oj80L15k49K35l48K8K20j20J32j26k17M48j38
7849G9k29L22l99K33k18J07K5L3qL02l29OL32m06Q5K45j0j69k7O0l3Rr4K50l83
7874b17K12K96l89J24P9L3j83K10m50L76k41OK70k97J39L8j10Q5L33n01J07J08
7896B8j66L17k77J75L4k04O5P0K1J17k56J85k1J02l54j72L56j57M8K64k74M2L19
7919B62j62j73P9R2k05Q3J77l57L86M8j93L3j48M35n74R9j32M9L79l66L36j83
7941c5n0K74l17lL62l48Q2J7o4L99j31j88j81j26Q39n95J09j58J26N2P9k32Q4
$$ plain form
7964 -5 -214 109 -130 -286 -141 157 145 -221 -45 -19 3 284 -263 -12 30 -150 94 -132 29 25 -327 133 -89
7987 -89 21 -113 136 106 171 10 0 239 -124 94 -74 -218 -56 -186 -60 72 -48 347 119 -171 -2
8008 -2 208 212 -51 -18 330 141 110 -57 -102 -61 159 -117 -45 66 -156 -5 116 23 -169 16 -71 123 -78 -107
8032 -107 107 -149 113 -117 -66 -149 -75 -190 303 -92 -108 -73 -149 -36 -167 -101 -86 -32 -235 -166 -336 -44 334
8055 334 86 -158 247 49 -154 -34 33 -48 116 -164 16 60 -186 -241 -59 -21 -288 -170 -238 130 78 158 -122
8078 -122 -177 -13 28 64 -110 -153 133 160 166 183 -84 19 28 -119 163 -268 -101 -56 -41 -20 89 61 80 -150 -76
8103 -76 65 -106 127 -340 -45 -130 32 35 -74 49 33 -78 -22 -61 112 83 -164 34 42 -142 150 37 74 6
8127 6 -296 -301 61 -169 17 -29 155 -109 -149 68 203 -245 -419 -26 -13 -38 -231 -239 150 26 -80 -172 32 9
$$ packed form
7964ek09L23k39j56J45K98j2l66J76K6K2K81n47K51M2j80K44k26J61ml52M60k22
7987h9J10j34K49l0O5j61j0K39l63K18j68j44J62j30J26J32j20L95k28k90J69
8008bK10Mk63L3L48j89l1j67m5M1K20k76P2J11k22J51J21r3j92J85q7J94k01k9
8032a07K14k56K62k30N1q3P4j15M93l95j6L5p6J13j31O6J5N4k03O9j70K92L78
8055C34k48k44M05j98k03J20O7q1J64k80J80M4k46n5J82L8k67J18o8L68n2Q0k80
8078a22n5J64M1L6j74m3K86K7OJ7k67J03Rj47K82m31J67M5J5K1J09k8J9k30P4
8103g6J41j71K33m67K95q5J62Lj09J23j6j11N6l9J73k9k47J98Qj84K92j13L7o8
8127Fl02nL62k30J86m6J84k64m0K17J35m48j74L93J3k5j93qL89j24j06r2K04k3
$$ plain form
8151 9 111 -20 -147 350 157 69 -141 -80 33 69 224 -86 -68 -40 -33 126 -226 40 -20 163 47 13 50 366
8175 366 2 5 117 -270 37 179 -111 -179 249 -165 174 343 80 212 -104 -68
$$ packed form
8151IJ02j31j27M97j93q8k10O1J13L6J55l10J8K8PJ59l52K66o0J83j16l4L7L16
8175C66l64LJ12l87L07J42k90o8M28m14L39J69k63J32l16L6
8191f8
$$ Imaginary data points
##PAGE= N=2
##DATA TABLE= (X++(I..I)), XYDATA
$$ plain form
0 0 0 0 0 0 0 0 -8 0 0 8 -8 16 -16 24 -24 32 -40 48 -58 72 -88 104 -122 145 -170 200 -232 266 -306 354 -402
31 -402 458 -520 590 -667 748 -840 943 -1050 1173 -1305 1450 -1608 1779 -1968 2172 -2398
47 -2398 2642 -2912 3208 -3535 3894 -4294 4741 -5238 5805 -6447 7188 -8053 9076 -10313
61 -10313 11834 -13768 16315 -19841 25059 -33590 49995 -93215 465925 1057240 161394
72 161394 -451869 -556250 -193811 -56133 -117651 -177095 67508 318267 317259 10065 -211691
83 -211691 -193583 -21794 51759 51711 33637 34803 -21839 -73778 -47688 75779 122768 -16752
95 -16752 -240712 -247559 44393 363546 348601 16892 -290653 -296398 -83723 84460 68802
106 68802 -9397 18114 138433 167375 23334 -150248 -154254 20833 197708 197373 4689
$$ packed form
0@%%%%%%qQ%Qj6K4l2M0m8N6p2Q8j06J30j60J92k26K67l15L70m32M98n72O60p56
31d02Q60r78J110j257J415j588J783j993K223k478K755l058L387l747M140m570
47b398N040n554O120o743P429q188R035r979J1043j2252J3635j5241J7129j9389
61a0313K2147k5602L0083l6156M4900n8649Q3585j43210N59140N91315q95846
72A61394o13263j04381L62439J37678o1518n9444K44603K50759j008l07194k21756
83b11691J8108J71789P3553m8j8074J166n6642n1939K6090J23467M6989j39520
95a6752k23960o847K91952L19153j4945l31709l07545n745K12675J68183j5658
106F8802p8199K7511J20319K8942j44041j73582m006J75087J76875l35j92684
$$ plain form
117 4689 -219197 -279119 -133659 69964 166661 130603 52064 5672 -3046 -6369 -24813 -48123
129 -48123 -60250 -62949 -61076 -32200 31172 79926 69374 35734 39680 53961 -2836 -122925
141 -122925 -177046 -61271 147615 241247 104398 -133084 -229606 -110461 63193 117008 62772
152 62772 27933 58048 74055 4790 -104626 -146045 -80730 16515 60305 50709 35666 25596
164 25596 109 -27759 -22874 4907 3711 -41021 -70849 -28687 58167 97400 42797 -43336
176 -43336 -67673 -20612 28356 33521 19331 16889 15538 -8002 -40417 -47386 -22356 8331 24302
189 24302 34269 45873 38151 -3835 -50545 -51237 -4850 32457 20049 -16938 -27397 -5536 9353
202 9353 -5552 -19513 1423 34529 33638 -3756 -29834 -16639 8020 6375 -15660 -19103 8066
$$ packed form
117D689k23886n9922J45460K03623R6697l6058p8539m6392q718l323j8444k3310
129d8123j2127k699J873K8876O3372M8754j0552l3640L946J4281n6797j20089
141a22925n4121J15775K08886R3632j36849k37482r6522J19145J73654N3815n4236
152F2772l4839L0115J6007o9265j09416m1419O5315R7245M3790r596j5043j0070
164B5596k5487k7868M885K7781j196m4732k9828M2162Q6854L9233n4603q6133
176d3336k4337M7061M8968N165j4190k442j351k3540l2415o969K5030L0687J5971
189B4302R967J1604p722m1986m6710o92M6387L7307j2408l6987j0459K1861J4889
202I353j4905j3961K0936L3106q91l7394k6078J3195K4659j645k2035l443K7169
$$ plain form
215 8066 31870 20005 -10859 -19945 -276 11314 270 -7919 4834 18391 9201 -12023 -16573
228 -16573 12 11009 -2801 -20645 -6994 29766 37357 -4070 -45987 -40226 -351 25981
240 25981 21673 7587 3436 5394 -822 -16517 -23480 -10151 7035 11418 13471 23017 19476 -12815
254 -12815 -44112 -33796 8558 35274 21864 -8670 -17144 8465 32009 14112 -30325 -47218
266 -47218 -20630 13839 27771 28496 22417 3608 -21623 -34964 -27377 -8032 10671 19458 22718
279 22718 30203 28379 -7779 -60730 -68202 -10208 55496 63885 19505 -24566 -31147 -7857 8641
292 8641 -3183 -21251 -13500 11187 20669 13777 11946 12547 -1191 -21954 -30124 -20735 -3983 13561
306 13561 26230 30896 27817 9150 -33774 -71662 -56196 14370 77230 79447 25955 -38606 -70629
$$ packed form
215H066K3804j1865l0864r086J9669J1590j1044q189J2753J3557r190k1224m550
228a6573J6585J0997j3810j7844J3651L6760P591m1427m1917N761L9875K6332
240B5981m308j4086m151J958o216j5695o963J3329J7186M383K053R546l541l2291
254a2815l1297J0316M2354K6716j3410l0534q474K5609K3544j7897m4437j6893
266d7218K6588L4469J3932P25o079j8809k5231j3341P587J9345J8703Q787L260
279B2718P485j824l6158n2951p472N7994O5704Q389m4380m4071o581K3290J6498
292H641j1824j8068P751K4687R482o892j831O01j3738k0763q170R389J6752J7544
306A3561J2669M666l079j8667m2924l7888J5466P0566O2860K217n3492o4561l2023
$$ plain form
319 -70629 -52256 -5097 26017 28264 23976 23751 13372 -10917 -32595 -34681 -12260 23167 37621
332 37621 8852 -33098 -35323 5051 40820 38630 6058 -29687 -44623 -28482 4683 34012
344 34012 48034 38199 -5704 -61440 -74688 -25923 38346 63196 45549 16259 -6143 -25409
356 -25409 -46651 -56984 -27532 41347 88665 55546 -30757 -80151 -48358 19779 55374 36387
368 36387 -5045 -26600 -18698 -8648 -10696 -4131 22670 38122 11014 -34325 -47320 -13444 33955
381 33955 51839 28112 -11351 -32973 -33841 -31801 -22328 14507 63538 72028 16500 -55907 -78120
394 -78120 -32844 33004 56553 25213 -12785 -18608 -8644 -16022 -28039 -8989 35370 55664 21481
407 21481 -35155 -55198 -19984 27736 35444 6059 -16269 -10709 -2737 -9680 -11993 11279 39790
$$ packed form
319g0629J8373M7159L1114K247m288k25j0379k4289k1678k086K2421L5427J4454
332C7621k8769m1950k225M0374L5769k190l2572l5745j4936J6141L3165K9329
344C4012J4022r835m3903n5736j3248M8765O4269K4850j7647k9290k2402j9266
356b5409k1242j0333K9452O8879M7318l3119q6303m9394L1793O8137L5595j8987
368C6387m1432k1555P902J0050k048O565K6801J5452k7108m5339j2995L3876M7399
381C3955J7884k3727l9463k1622q68K040R473L6835M9031Q490n5528p2407k2213
394g8120M5276O5848K3549l1340l7998n823R964p378j2017J9050M4359K0294l4183
407B1481n6636k0043L5214M7720P708k9385k2328N560P972o943k313K3272K8511
$$ plain form
420 39790 35196 -7730 -46487 -41707 -767 30959 26920 7101 -877 -1619 -11843 -24609 -15643
433 -15643 14957 36696 24701 -9806 -32566 -25660 -4242 8516 10413 10869 8689 -1853 -14320
446 -14320 -15011 -1462 11224 10218 623 -4516 -2908 -1961 -4078 -457 11021 16900 4976 -11030
460 -11030 -11850 2061 11960 7140 -2768 -4382 395 -1574 -10464 -9373 7143 18561 5329 -16257
474 -16257 -18297 -774 11360 3999 -7799 -5688 6634 7902 -7558 -18735 -6143 15157 15455
487 15455 -3373 -11142 97 8092 147 -9175 -2187 15374 19984 3234 -14508 -9074 11815
500 11815 14900 -4322 -13576 1964 17505 6850 -14308 -17939 -3090 7878 734 -11346 -7774
513 -7774 8961 10274 -11161 -24134 -5336 18932 14216 -9013 -14089 3409 16193 6564 -10644
$$ packed form
420C9790m594m2926l8757M780M0940L1726m039j9819p978p42j0224j2766Q966
433a5643L0600K1739j1995l4507k2760O906K1418J2758J897M56k180j0542j2467
446a4320o91J3549J2686j006r595n139J608R47k117L621J1478N879j1924j6006
460a1030q20J3911R899m820r908j614M777j969q890J091J6516J1418j3232k1586
474a6257k040J7523J2134p361j1798K111J2322J268j5460j1177J2592K1300K98
487A5455j8828p769J1239P995p945r322O988J7561M610j6750j7742N434K0889
500A1815L085j9222r254J5540J5541j0655k1158l631J4849J0968p144j2080L572
513g774J6735J313k1435j2973J8798K4268m716k3229n076J7498J2784r629j7208
$$ plain form
526 -10644 -10539 7502 17562 2694 -15074 -5245 17212 15499 -8297 -15999 2827 18373 8888
539 8888 -9204 -10608 7158 18281 4204 -19379 -19602 3285 12809 -3853 -16930 -6437 6384
552 6384 -1637 -15694 -11933 6242 16426 4845 -13264 -11218 11813 22506 3910 -15899 -5487
565 -5487 16359 14531 -5364 -12396 807 13122 8281 -5351 -8014 4613 13390 1546 -13134
578 -13134 -4371 14878 11636 -11201 -18936 -3313 8420 -367 -15042 -14496 875 11197 3289
591 3289 -10634 -6801 8904 8514 -9247 -13586 6908 21756 9636 -10033 -11820 1417 8827
604 8827 1423 -7851 -966 16886 18955 671 -11978 -220 11233 355 -15703 -7559 15372
617 15372 20361 -1969 -25360 -23289 -2066 8215 -5505 -15745 1916 25701 17882 -12727 -24775
$$ packed form
526a0644J05J8041J0060j4868j7768R829K2457j713k3796p702J8826J5546r485
539H888j8092j404J7766J1123j4077k3583k23K2887R524j6662j3077J0493J2821
552F384q021j4057L761J8175J0184j1581j8109K046K3031J0693j8596j9809J0412
565e487K1846j828j9895p032J3203J2315m841j3632k663J2627Q777j1844j4680
578a3134Q763J9249l242k2837p735J5623J1733q787j4675N46J5371J0322p908
591C289j3923L833J5705l90j7761m339K0494J4848j2120j9669j787J3237P410
604H827p404r274O885J7852K069j8284j2649J1758J1453j0878j6058Q144K2931
617A5372M989k2330k3391K071K1223J0281j3720j0240J7661K3785p819l0609j2048
$$ plain form
630 -24775 -7169 9916 6594 -1774 4090 16938 12624 -13367 -30324 -13422 17770 22193 -294
643 -294 -9187 9750 23214 5952 -19358 -17984 7320 19889 4308 -15489 -9752 11634 12437
656 12437 -12976 -28077 -9256 14885 10221 -9667 -8799 14542 24392 1458 -28522 -26708 3640
669 3640 22002 8100 -9689 -841 17513 9963 -19488 -29744 -2762 27143 23937 -952 -10397
682 -10397 6600 18044 164 -24656 -19902 9113 23152 5633 -15546 -11550 4907 4969 -11494
695 -11494 -18262 -1548 18241 17217 2241 -2529 4571 3863 -11728 -22530 -11588 7461 12544
708 12544 2215 -4161 2588 8396 967 -10131 -5931 9383 13880 3507 -4457 -199 3701 -5099
722 -5099 -16807 -11658 8288 19700 8869 -7332 -5107 7690 4628 -17608 -26340 -4952 20662
$$ packed form
630b4775J7606J7085l322q368N864J2848m314k5991j6957J6902L1192M423k2487
643b94q893J8937J3464j7262k5310J374K5304J2569j5581j9797N737K1386Q03
656A2437k5413j5101J8821K4141m664j9888Q68K3341R850k2934k9980J814L0348
669C640J8362j3902j7789Q848J8354p550k9451j0256K6982K9905l206k4889r445
682a0397J6997J1444j7880k4820M754K9015J4039j7519k1179L996J6457O2j6463
695a1494o768J6714J9789j024j4976m770P100p08j5591j0802J0942J9049N083
708A2544j0329o376O749N808p429j1098M200J5314M497j0373p964M258L900q800
722e099j1708N149J9946J1412j0831j6201K225J2797l062k2236q732K1388K5614
$$ plain form
735 20662 19702 -1290 -10496 2525 15508 4419 -17845 -18174 6097 19192 438 -22470 -16044
748 -16044 9579 17650 2437 -8920 2925 20934 17686 -6685 -21262 -9335 7210 553 -17691
761 -17691 -15216 8050 20255 9506 -3610 69 11325 10308 -5996 -19037 -12114 3231 4189
774 4189 -8302 -10409 4707 15297 7791 -573 3709 10695 4617 -11414 -18618 -10646 1734 2368
788 2368 -6110 -3416 14419 22875 6256 -12713 -7832 10061 11835 -5969 -19544 -14490 -479
801 -479 2899 -6527 -7745 11704 31534 23532 -4261 -16459 -7393 -1073 -10247 -18751 -10498 7105
815 7105 15788 7409 -4655 -1525 14162 16879 -78 -13943 -8050 2553 -199 -10508 -13529 -6398
829 -6398 3953 8736 6611 5305 11512 18065 10765 -7013 -20024 -23997 -19904 -8290 8728 18251
$$ packed form
735B0662r60k0992r206J3021J2983j1089k2264l29K4271J3095j8754k2908O426
748a6044K5623Q071j5213j1357J1845J8009l248k4371j4577J1927J6545o657j8244
761a7691K475K3266J2205j0749j3116L679J1256j017j6304j3041O923J5345R58
774D189j2491k107J5116J0590p506q364M282O986o078j6031p204P972J2380O34
788B368q478K694J7835Q456j6619j8969M881J7893J774j7804j3575N054J4011
801d79L378r426j218J9449J9830q002k7793j2198R066O320r174q504Q253J7603
815G105Q683q379j2064L130J5687K717j6957j3865N893J0603k752j0309l021P131
829f398J0351M783k125j306O207O553p300j7778j3011l973M093J1614J7018R523
$$ plain form
843 18251 15358 8616 5573 1918 -4162 -8460 -7836 -1671 6104 5825 -5816 -15449 -10706 1216 5233
858 5233 5174 11119 18493 14445 3 -12553 -15426 -10743 -8539 -12785 -11832 6137 29045 29817 7208
873 7208 -11927 -11557 -2421 -2527 -8904 -10051 129 12497 11546 -3338 -14733 -8938 4121 10571
887 10571 10866 12118 10327 -358 -13979 -19996 -16079 -7073 658 4875 9860 18959 21284 8267
901 8267 -12138 -21115 -14846 -4757 1593 4524 6273 6346 4215 -1139 -7129 -7544 -1986 4955 9343
916 9343 11801 9177 -2220 -15983 -19134 -9569 2683 7244 6333 7193 11103 12952 4032 -11458 -20848
931 -20848 -15301 -2540 6320 7959 7266 6598 3222 -3083 -9349 -10927 -4852 4297 10385 10078 5890
946 5890 -972 -9638 -14301 -10327 1202 12010 15412 8992 277 -3206 -2281 -2579 -7489 -10022 -4666
$$ packed form
843A8251k893o742l043l655o080m298O24O165P775k79j1641r633M743J1922M017
858E233n9N945P374m048j4442j2556k873M683K204m246R53J7969K2908P72k2609
873G208j9135L70R136j06o377j147J0180J2368r51j4884j1395N795J3059O450
887A0571K95J252j791j0685j3621o017L917R006P731M217M985R099K325j3017
901H267k0405q977O269J0089O350K931J749P3k131n354n990m15N558O941M388
916I343K458k624j1397j3763l151R565J2252M561r11Q60L910J849q920j5490r390
931b0848N547J2761Q860J639o93o68l376o305o266j578O075R149O088l07m188
946E890o862q666m663L974J1529J0808L402o420q715l483R25k98m910k533N356
$$ plain form
961 -4666 5943 12921 10096 1000 -5328 -3886 -1391 -3317 -6420 -3984 4249 11136 8819 -773 -10776
976 -10776 -13421 -8538 -1273 5786 11168 10734 3255 -6458 -8837 -4198 202 2068 2315 4485 7385
991 7385 6498 -250 -7734 -6169 1586 4938 642 -3920 -1157 3128 4128 2045 -1764 -4613 -5556 -5446
1007 -5446 -3508 2755 9922 8229 -3046 -11943 -8512 -301 2125 565 1681 5661 6694 919 -8308
1022 -8308 -10133 -763 9187 8852 1075 -1747 1068 677 -2659 -1765 3238 6476 4023 -2304 -6178 -3418
1038 -3418 2932 3229 -2485 -3748 -313 279 -4334 -5101 529 4166 2099 -2575 -4388 -2457 803 892
1054 892 -2158 -1562 3918 5751 -347 -4395 171 6023 4440 -227 -502 1202 1413 -1278 -4094 -1449
1070 -1449 6204 9055 1479 -6639 -4339 2787 1224 -5542 -5303 1617 5323 1475 -6598 -9698 -3586
$$ packed form
961d666J0609O978k825r096o328J442K495j926l103K436Q233O887k317r592j0003
976a0776k645M883P265P059N382m34p479r713k379M639M400J866K47K170K900
991G385q87o748p484J565P755L352m296m562K763M285J000k083l809k849r43J10
1007e446J938O263P167j693j1275q897L431Q211K426j560J116L980J033n775r227
1022h308j825R370R950l35p777k822K815l91l336Q94N003L238k453o327l874K760
1038c418O350K97n714j263L435N92m613p67N630L637k067m674j813J931L260Q9
1054H92l050N96N480J833o098m048M566N852j583m667k75J704K11k691k816K645
1070a449P653K851p576q118K300P126j563o766K39O920L706l848q073l100O112
$$ plain form
1085 -3586 4563 5804 1352 1252 3685 -127 -9402 -10584 -1538 6323 5794 1968 1182 2530 3238 702
1101 702 -1470 2204 8075 5065 -6239 -10351 -998 6701 3314 -3510 -2929 2128 2506 -3306 -6182
1116 -6182 448 9760 7239 -8418 -17920 -9300 4990 6373 58 1920 10657 9534 -5854 -18685
1130 -18685 -12430 7995 18552 6432 -10354 -9782 4460 8641 -1763 -6887 4680 15751 9044
1143 9044 -8348 -15601 -4477 9114 6923 -6591 -10498 1060 8997 2252 -6062 -793 10712
1156 10712 8307 -8203 -20430 -13128 4674 12636 5305 -3724 -2252 3383 866 -4709 -1862 8243
1170 8243 11609 3654 -6169 -8200 -3977 -912 -691 713 5686 7711 1522 -5499 -3983 3297 4845
1185 4845 -1289 -5995 -3273 1420 1508 -784 882 5408 4256 -4410 -10970 -6130 4751 7076 -680
$$ packed form
1085c586Q149J241m452j00K433l812r275j182R046P861n29l826p86J348P08k536
1101G02k172L674N871l010j1304m112R353P699l387o824N81N057L78n812k876
1116f182O630R312k521j5657r502Q620J4290J383o315J862Q737j123j5388j2831
1130a8685O255K0425J0557j2120j6786N72J4242M181j0404n124J1567J1071o707
1143I044j7392p253J1124J3591k191j3514l907J1558P937o745q314N269J1505
1156A0712k405j6510j2227P302J7802P962p331r029J472N635k517n575K847J0105
1170H243L366p955r823k031M223L065K21J404M973K025o189p021J516P280J548
1185D845o134m706K722M693Q8k292J666M526j152q666o560M840J0881K325p756
$$ plain form
1200 -680 -5827 -1339 3942 1259 -5557 -3180 8255 14033 4991 -8014 -9106 221 4465 -2121 -7970
1215 -7970 -2241 7033 6619 -2386 -6280 2064 9728 5086 -6363 -8578 426 6634 958 -6931 -4361
1230 -4361 3313 3532 -4145 -7570 81 9875 7603 -3467 -8210 -889 5997 1723 -5717 -3239 5508
1245 5508 6901 -1190 -7257 -3652 4380 4462 -3412 -6513 806 7962 3281 -5334 -4166 5311 7841
1260 7841 -1122 -7875 -3670 5058 5708 -2936 -9619 -3857 5578 4594 -3933 -4922 3711 8584 1263 -6063
1276 -6063 -3347 4553 5879 -1840 -8184 -3960 4754 5428 -3068 -6822 730 7372 2255 -5633 -3904
1291 -3904 4509 6993 1167 -5219 -3899 2332 3887 -2236 -5681 641 6392 1510 -7055 -6163 3087
1306 3087 7088 2145 -3565 -2384 2706 3330 -1881 -5303 -78 6580 3558 -5847 -7264 1121 5493
$$ packed form
1200f80n147M488N281k683o816K377J1435N778r042j3005j092R327M244o586n849
1215g970N729R274m14r005l894Q344P664m642j1449k215R004O208n676p889K570
1230d361P674K19p677l425P651R794k272j1070m743P321O886m274p440K478Q747
1245E508J393q091o067L605Q032Q2p874l101P319P156m681q615J168R477K530
1260G841q963o753M205Q728O50q644o683N762R435r84q527r89Q633M873p321p326
1276f063K716P900J326p719o344M224Q714O74q496l754P552O642n117p888J729
1291c904Q413K484n826o386J320O231J555o123l445O322N751m882q565Q92R250
1306C087M001m943n710J181N090O24n211l422N225O658l022r405j417Q385M372
$$ plain form
1321 5493 896 -4054 -1461 4256 4226 -1484 -5941 -1629 5958 5635 -2861 -6683 -872 4539 694 -4925
1337 -4925 -2607 4109 4754 -1228 -5738 -2362 4574 5726 -806 -5307 -824 5143 1992 -5546 -4843
1352 -4843 2474 5132 534 -3603 -2943 1782 3230 -1036 -3951 268 6232 3962 -4438 -6625 66
1367 66 4791 1342 -2942 -1695 2683 3034 -1812 -5682 -2147 4785 5699 -394 -4425 -723 2963 1
1383 1 -3697 -1305 4204 4968 -1068 -6561 -4527 2161 5363 1426 -2530 -825 2162 -440 -4295 -2291
1399 -2291 4027 6250 1291 -4876 -5175 -701 2555 1259 -816 1660 3952 404 -6258 -6333 1220 6821
1415 6821 5204 -542 -3081 -1887 -716 -1338 -1454 2062 5461 2754 -3741 -7002 -2319 3427 3797 634
1431 634 -1172 149 -253 -2212 -3252 494 5187 5245 -817 -5895 -4503 266 2611 2090 1783 2089 679
$$ packed form
1321E493m597m950K593N717l0n710m457M312P587l23q496l822N811N411l845n619
1337d925K318O716O45n982m510L376O936J152o532m501M483N967l151p538P03
1352d843P317K658m598m137O60M725J448m266k915M219N964k270q400k187O691
1367F6M725l449m284J247M378L51m846l870L535O932R14o093m031L702L686k962
1383Al698K392N509P64o036n493K034O688L202l937l956J705K987k602l855K004
1399b291O318K223m959o167k99M474L256j296k075K476K292l548o662p5P553N601
1415F821j617n746k539J194J171o22j16L516L399k707o495l261M683N746L70l163
1431F34j806J321m02j959j040L746M693N8o062n078J392M769K345n21l07L06j410
$$ plain form
1448 679 -3122 -5234 -1863 3337 5730 2550 -1804 -2621 -1227 -988 -1264 697 3656 3611 -565 -4350
1464 -4350 -4241 305 3665 1980 -991 -1815 -592 -787 -1917 -619 2780 3747 943 -3276 -4095 -1166
1480 -1166 1955 2282 743 541 1028 -43 -2585 -2549 1558 4541 4009 -364 -3473 -3053 30 1663 344
1497 344 90 893 1021 -745 -2030 -835 995 1092 99 -1147 -2112 -1418 -400 77 380 1678 1511 -417
1515 -417 -2213 -1105 1013 1991 1475 321 -1414 -2384 -906 1239 2218 1847 1796 381 -681 -537 13
1532 13 -576 -638 351 922 -369 -1573 -1261 -496 310 1194 907 -675 -2124 -1522 -772 -655 108 640 111
1551 111 -879 114 1258 1318 1258 1386 797 -713 -950 -553 -534 18 702 1076 624 699 918 92 -755 400
1571 400 1094 -104 -1865 -1441 -684 -441 -638 -716 -579 509 1345 424 -1980 -2130 37 494 -1156 -1762
$$ packed form
1448F79l801k112L371N200K393l180m354q17J394K39k76J961K959m5m176l785
1464d350J09M546L360j685k971q24J223j95j130J298L399R67k804m219q19K929
1480a166L121L27j539k02M87j071k542L6M107K983n32m373l109M20L083J633j319
1497C44k54Q03J28j766j285J195J830R7r93j246r65O94J018M77L03J298j67j928
1515d17j796J108K118R78n16j154j735r70J478K145R79l71n1j415j062J44N50
1532A3n89o2R89N71j291j204L12P65Q06Q84k87j582j449O02P50J17P63N32n29
1551A11r90R93J144O0o0J28n89j510k37L97J9N52O84L74m52P5K19q26q47J155
1571D00O94j198j761M24P57K43j97p8J37J088Q36r21k404j50K167M57j650o06
$$ plain form
1589 -1762 -286 1056 829 714 660 975 2047 1594 -384 -1090 233 795 -1115 -2495 -79 2168 1786
1606 1786 -125 -1204 -253 1222 1284 -617 -2252 -1217 451 -567 -2261 -1028 1030 1571 -341 -991
1622 -991 -50 1219 579 -1243 -1928 -182 1706 157 -2069 -1477 2393 3818 1890 -44 -66 941 612
1639 612 -747 -2010 -394 1327 1177 -1200 -1769 467 1669 96 -1724 -672 1420 1167 -1006 -2407
1655 -2407 -1358 716 802 -567 -970 1229 2520 474 -1799 -1128 1546 1313 -769 -2014 -120 1951
1671 1951 1787 -456 -1184 1051 3067 1065 -2327 -1986 1023 2000 -785 -2205 -571 1688 687 -2487
1687 -2487 -2819 634 3976 2623 -2423 -3774 -432 1966 113 -2265 -939 2675 3041 -990 -3563
1702 -3563 -1442 2138 2892 -268 -2026 312 2382 398 -2236 -1480 2406 3570 420 -3176 -2618 1421
$$ packed form
1589a762J476J342k27j15n4L15J072m53j978p06J323N62j910j380K416K247l82
1606A786j911j079R51J475O2j901j635J035J668j018j694J233K058N41j912o50
1622i91R41J269o40j822o85J746J888j549k226N92L870J425j928j934k2J007l29
1639F12j359j263J616J721j50k377n69K236J202j573j820J052K092k53k173j401
1655b407J049K074Q6j369m03K199J291k046k273O71K674k33k082j245J894K071
1671A951j64k243p28K235K016k002l392L41L009R77k785j420J634K259j001l174
1687b487l32L453L342j353n046j351L342K398j853k378J326L614L66m031k573
1702c563K121L580P54l160j758K338K070j984k634P56L886J164l150l596N58M039
$$ plain form
1718 1421 2713 118 -1842 -521 1607 104 -2683 -1928 1655 3425 1233 -1737 -2452 72 825 -615
1734 -615 -1545 645 3018 1173 -3049 -3277 162 2976 1889 -896 -1050 1002 1820 -1005 -2432 -70
1750 -70 3193 2253 -2051 -3338 -428 1760 1250 -1200 -1212 1414 2184 -808 -3157 -884 2898 3061 -1119
1767 -1119 -3078 -432 1944 882 -1804 -1794 807 2579 172 -2869 -1851 1729 3291 493 -1948
1782 -1948 -461 1931 656 -2031 -1474 1112 2232 93 -2922 -2201 1639 2707 -160 -2587 -536
1797 -536 2970 2101 -1768 -2643 185 2366 670 -2456 -2033 712 2348 27 -2899 -1241 2362 2196
1813 2196 -1511 -2677 553 3548 1420 -2444 -2644 378 2816 1192 -2006 -2236 1035 2348 -958
1828 -958 -3231 -846 3054 2139 -902 -2099 301 2355 1720 -1639 -2338 338 2001 75 -3305 -1739
$$ packed form
1718A421J292k595j960J321K128j503k787P55L583J770k192k970p15K524P53j440
1734f15r30K190K373j845m222k28L439K814j087k785j54K052Q18k825j427K362
1750g0L263r40m304j287K910K188n10k450j2K626P70k992k349K273L782J63m180
1767a119j959K646K376j062k686J0K601J772k407l041J018L580J562k798k441
1782a948J487K392j275k687N57K586J120k139l015P21L840J068k867k427K051
1797e36L506q69l869q75K828K181j696l126M23K745J636k321k926J658L603j66
1813B196l707j166L230K995k128l864k00L022K438j624l198k30L271J313l306
1828i58k273K385L900r15l041j197K400K054o35l359o99K676J663j926l380J566
$$ plain form
1844 -1739 2019 2551 -853 -1989 247 2188 1400 -762 -1260 593 2062 -124 -3439 -2267 1420 2437
1860 2437 -303 -1951 -133 2093 1199 -1768 -2008 670 2251 864 -1718 -1916 1078 2154 -547 -2666
1876 -2666 -404 2540 1859 -1164 -2144 -281 1780 711 -1549 -1599 1129 2707 751 -1835 -856 1718
1892 1718 1672 -1479 -2767 -900 1448 998 -1524 -1255 1024 2432 932 -1671 -1537 1365 1761 -477
1908 -477 -2109 -613 968 591 -1610 -1573 942 2797 1491 -1143 -1249 658 1219 -762 -2708 -609
1924 -609 2012 1543 -590 -1948 -51 1543 766 -1114 -1399 658 1569 117 -2270 -1055 1426 1912
1940 1912 -320 -1539 49 1832 1546 -715 -1642 92 1241 66 -2127 -1314 1071 2054 502 -802
1956 -802 -117 1326 678 -1408 -1902 -131 1599 454 -1617 -1585 489 1380 -4 -1085 22 1525 1148
$$ packed form
1844a739L758N32l404j136K236J941p88k162m98J853J469k186l315J172L687J017
1860B437k740j648J818K226q94k967k40K678J581j387k582j98K994J076k701k119
1876b666K262K944o81l023r80J863K061j069k260n0K728J578j956k586R79K574
1892A718m6l151j288J867K348m50k522K69K279J408j500k603J34K902L96k238
1908d77j632J496J581l77k201L7K515J855j306k634j06J907N61j981j946K099
1924f09K621m69k133j358J897J594p77j880k85K057R11j452k387J215K481M86
1940A912k232j219J588J783k86k261r27J734J149j175k193Q13K385R83j552j304
1956h02O85J443o48k086m94J771J730j145k071L2K074Q91j384j081J107J503l77
$$ plain form
1973 1148 -935 -1903 -696 1202 366 -898 -908 1310 1921 262 -1422 -585 1207 1406 -433 -2043 -779
1990 -779 872 1269 -590 -1064 593 1801 539 -1308 -1184 874 1576 71 -1335 -1221 547 825 -503
2007 -503 -1423 -198 1801 1468 -567 -1263 -487 753 457 -521 -491 624 1309 382 -699 -658 1029 1321
2025 1321 -99 -718 1 430 18 -512 -374 -127 281 260 -526 -353 126 151 -486 -301 220 127 -537 -715
2045 -715 -336 516 198 -89 -187 -117 536 363 -231 -624 27 1054 242 -837 -258 680 652 -9 -347 599
2065 599 745 441 -278 -1266 -492 619 329 -666 -327 14 158 -671 -739 -322 516 501 65 -665 -215 327
2085 327 377 -362 -387 578 856 105 -788 -379 -46 525 519 238 -41 180 233 -98 -170 732 1000 336 -501 -660
2107 -660 -139 385 -124 -300 -173 198 -276 -251 -667 -595 457 596 -26 -375 -50 -196 -85 -68 462 426 514
$$ packed form
1973A148k083r68J207J898q36j264j0K218O11j659j684Q37J792J99j839j610J264
1990g79J651L97j859m74J657J208j262j847J24K058P02j505j406J14J768K78j328
2007e03r20J225J999l33k035o96P76J240k96r78L0J115O85r27j081M1J687K92
2025A321j420o19P19M29m12n30J38K47M08k1p86J73M79K5o37J85N21r3o64j78
2045g15L79Q52l18k87r8P0O53j73n94l93O51J027q12j079N79R38k8o61l38R46
2065E99J46l04p19r88P74J111k90r95L39L41J44q29o8M17Q38j5m36p30M50N42
2085C27N0p39k5R65K78p51q93M09L33N71ok81k79K21N3l31p2R02K68o64q37j59
2107f60N21N24n09j76J27L71m74K5m16P2J052J39o22l49L25j46J11J7N30l6Q8
$$ plain form
2128 514 443 -302 -489 88 604 218 -44 186 189 -66 -487 167 50 139 279 291 -394 -311 5 53 -106 -110 122
2151 122 72 -186 -414 -340 -392 181 617 93 -389 -347 346 -124 -296 32 208 212 238 159 -263 -148 418 270 -220
2174 -220 -145 169 646 -386 -744 -267 390 451 -191 -682 -475 -143 411 -196 -454 186 651 190 -698 -592
2194 -592 -217 427 329 -491 -72 401 723 -173 -888 -151 966 712 -211 -565 -174 706 308 -335 -143 77
2214 77 609 -143 -721 -294 706 555 -247 -662 -232 312 124 -760 -486 238 670 391 -382 -761 53 388
2234 388 18 -436 62 524 439 -431 -610 90 939 623 -265 -810 215 865 96 -928 -573 901 492
2253 492 -65 -958 -289 517 108 -323 -662 420 1092 373 -1036 -634 433 520 -89 -853 -262 224 495
2272 495 -409 -620 544 901 408 -798 -830 389 716 42 -427 -310 490 769 -471 -1207 -183 1203
$$ packed form
2128E14p1p45j87N77N16l86k62K30Lk55m21O54j17Q9J40J2o85Q3L16M8j59mK32
2151A22n0k58k28P4n2N73M36n24m82M2O93m70j72L28J76MK6p9m22J15N66j48m90
2174b20P5L14M77j032l58M77O57O1o42m91K07L32N54o07k58O40M65m61q88J06
2194e92L75O44r8q20M19M73L22q96p15P37J117k54r23l54L91Q80l98o43J92K20
2214G7N32p52n78M27J000j51q02m15M30N44j88q84K74P24M32k79p73l79Q14L35
2234C88l70m54M98M62q5q70j79P00Q49l16q88n45J025O50p69j024L55J474m09
2253D92n57q93O69Q06m09m31l39J082O72p19j409M02J067Q7o09p64N91M86K71
2272D95r04k11J164L57m93j206l2J219L27o74m69J17Q00K79j240p36J024J386
$$ plain form
2290 1203 789 -418 -871 202 642 -308 -836 -325 379 540 -66 -767 -197 659 577 -469 -984 116 858
2309 858 148 -747 -775 810 758 -34 -959 -323 418 594 -178 -881 237 1081 289 -1149 -613 381 916 -109
2329 -109 -794 -575 278 935 -421 -1162 -84 1102 588 -730 -1118 388 1099 -34 -631 -322 551 756
2347 756 32 -845 -400 593 908 -544 -885 345 1263 638 -847 -204 705 594 -132 -824 -627 366 441
2366 441 -527 -1127 94 1055 549 -790 -576 340 559 -18 -715 -253 609 726 -409 -954 -236 931 404
2385 404 -870 -741 521 958 -36 -869 -254 623 1218 365 -952 -250 540 545 -385 -520 124 977 -348
2404 -348 -1158 -727 553 1169 355 -875 -411 587 817 -666 -1000 -182 929 448 -693 -1087 -139 617
2422 617 49 -498 -329 789 988 -223 -873 -197 791 652 -621 -872 19 831 113 -459 -588 501 983
$$ packed form
2290A203m14j207m53J073M40r50n28N11P04J61o06p01N70Q56q2j046n15J100P42
2309H58p10q95k8J585n2p92r25O36P41J76p72p03J118Q44p92j438N36R94N35j025
2329a09o85K19Q53O57j356p41J078J186n14j318l88J506P11j133n97L09Q73K05
2347G56p24q77M45R93L15j452l41J230R18o25j485O43R09j11p26o92J97R93P5
2366D41r68o00J221R61n06j339K14R16K19n77o97M62Q62J17j135n45P18J167n27
2385D04j274J29J262M37r94q33O15Q77N95q53j317P02P90Nr30j35O44Q53j325
2404c48q10M31J280O16q14j230M64R98K30j483l34Q18J111m81j141l94R48P56
2422F17n68n47J69J118J99j211o50O76R88j39j273k51Q91Q12p18n72j29J089M82
$$ plain form
2441 983 -159 -901 -247 731 707 -235 -666 321 814 47 -738 -839 317 1058 175 -816 -428 542 611 -248
2461 -248 -776 297 950 634 -754 -894 20 563 326 -656 -464 605 593 -321 -951 -222 843 899 -370
2480 -370 -742 91 645 264 -741 -421 467 880 49 -1168 -817 730 502 -152 -670 85 869 277 -874
$$ packed form
2441I83j142p42O54R78k4r42m31R87M93p67p85j01J156P41q83r91L88R70O9q59
2461b48n28J073O53l16j388j40R14N43k37r82J92J069j2r14o30P29J065N6j269
2480c70l72Q33N54l81j005L20Q88M13q31j217L51J547k28o54n18P55P84n92j151
$$ [...]
8191D8
##END NTUPLES=NMR FID
##END=
