##TITLE=1H_Pr 2893-Me
 CDCl3
 8 sc, 
 21.2.2023
##JCAMPDX= 6.0         $$ Bruker NMR JCAMP-DX V2.0
##DATA TYPE= NMR FID
##DATA CLASS= NTUPLES
##ORIGIN= UXNMR, Bruker Analytische Messtechnik GmbH
##OWNER= root
$$ XWIN-NMR		Version 3.5
$$ Tue Feb 21 18:58:59 2023 Russian Standard Time (UT+4h)  she@DPX200
##.OBSERVE FREQUENCY= 200.13135
##.OBSERVE NUCLEUS= ^1H
##.DELAY= (6, 6)
##.ACQUISITION MODE= SIMULTANEOUS
##.ACQUISITION SCHEME= undefined
##.AVERAGES= 8
##.DIGITISER RES= 18
##SPECTROMETER/DATA SYSTEM= spect
##.PULSE SEQUENCE= zg30
##.SOLVENT NAME= DMSO
##.SHIFT REFERENCE= (INTERNAL, DMSO, 0, 15.7039)
##AUDIT TRAIL= $$ (NUMBER, WHEN, WHO, WHERE, WHAT)
$$ ##TITLE= Audit trail, XWIN-NMR		Version 3.5
$$ ##JCAMPDX= 5.01
$$ ##ORIGIN= Bruker BioSpin GmbH
$$ ##OWNER= she
$$ F:/spectra/data/she/nmr/H-F/1/audita.txt
$$ ##AUDIT TRAIL=  $$ (NUMBER, WHEN, WHO, WHERE, WHAT)
(   1,<2023-02-21 18:57:39.40 +0400>,<she>,<DPX200>,
      <created by zg, POWCHK disabled, PULCHK disabled
       configuration hash MD5:
       00 E9 B6 7A A2 85 ED C7 34 08 36 98 17 FE 4E 26
       data hash MD5: 16K
       43 C6 09 6E 63 70 FC 50 FD F9 54 BD 53 FF DB 73>)
$$ ##END=
$$ 
$$ hash MD5
$$ 7B 56 28 8E 4F CE 07 0D AB 46 C1 5A E5 C8 42 62
##$RELAX= 
##$RELAX= 
##$RELAX= 
##$RELAX= 
##$RELAX= 
##$RELAX= 
$$ Bruker specific parameters
$$ --------------------------
##$DU= <F:/spectra>
##$EXPNO= 1
##$NAME= <H-F>
##$PROCNO= 1
##$TYPE= <nmr>
##$USER= <she>
##$AMP= (0..31)
100 100 100 100 100 100 100 100 100 100 100 100 100 100 100 100 100 100 
100 100 100 100 100 100 100 100 100 100 100 100 100 100 
##$AQSEQ= 0
##$AQ_mod= 1
##$AUNM= <au_zg>
##$AUTOPOS= <>
##$BF1= 200.13
##$BF2= 200.13
##$BF3= 200.13
##$BF4= 200.13
##$BF5= 200.13
##$BF6= 200.13
##$BF7= 200.13
##$BF8= 200.13
##$BYTORDA= 1
##$CFDGTYP= 0
##$CFRGTYP= 5
##$CHEMSTR= <none>
##$CNST= (0..31)
1 1 145 1 1 1 1 1 1 1 1 1 1 1 1 1 1 1 1 1 1 1 1 1 1 1 1 1 1 1 1 1 
##$CPDPRG= <>
##$CPDPRG1= <>
##$CPDPRG2= <>
##$CPDPRG3= <>
##$CPDPRG4= <mlev>
##$CPDPRG5= <mlev>
##$CPDPRG6= <mlev>
##$CPDPRG7= <mlev>
##$CPDPRG8= <mlev>
##$CPDPRGB= <>
##$CPDPRGT= <>
##$D= (0..31)
0 1.2 0 0 0 0 0 0 0 0.06 0 0.03 0 0 0 0 0.0002 0 0 0 0 0 0 0 0 0 0 0 0 
0 0 0 
##$DATE= 1676991458
##$DBL= (0..7)
120 120 120 120 120 120 120 120 
##$DBP= (0..7)
150 150 150 150 150 150 150 150 
##$DBP07= 0
##$DBPNAM0= <>
##$DBPNAM1= <>
##$DBPNAM2= <>
##$DBPNAM3= <>
##$DBPNAM4= <>
##$DBPNAM5= <>
##$DBPNAM6= <>
##$DBPNAM7= <>
##$DBPOAL= (0..7)
0.5 0.5 0.5 0.5 0.5 0.5 0.5 0.5 
##$DBPOFFS= (0..7)
0 0 0 0 0 0 0 0 
##$DE= 6
##$DECBNUC= <off>
##$DECIM= 32
##$DECNUC= <off>
##$DECSTAT= 4
##$DIGMOD= 1
##$DIGTYP= 9
##$DL= (0..7)
0 120 120 120 120 120 120 120 
##$DP= (0..7)
150 150 150 150 150 150 150 150 
##$DP07= 0
##$DPNAME0= <>
##$DPNAME1= <>
##$DPNAME2= <>
##$DPNAME3= <>
##$DPNAME4= <>
##$DPNAME5= <>
##$DPNAME6= <>
##$DPNAME7= <>
##$DPOAL= (0..7)
0.5 0.5 0.5 0.5 0.5 0.5 0.5 0.5 
##$DPOFFS= (0..7)
0 0 0 0 0 0 0 0 
##$DQDMODE= 0
##$DR= 18
##$DS= 0
##$DSLIST= <SSSSSSSSSSSSSSS>
$$ [...]
##$SUBNAM2= <"">
##$SUBNAM3= <"">
##$SUBNAM4= <"">
##$SUBNAM5= <"">
##$SUBNAM6= <"">
##$SUBNAM7= <"">
##$SUBNAM8= <"">
##$SUBNAM9= <"">
##$SW= 18.05172834244
##$SWIBOX= (0..15)
0 0 2 0 0 0 0 0 0 0 0 0 0 0 0 0 
##$SW_h= 3612.71676300578
##$TD= 16384
##$TD0= 1
##$TE= 0
##$TE2= 300
##$TE3= 300
##$TEG= 300
##$TL= (0..7)
0 120 120 120 120 120 120 120 
##$TP= (0..7)
150 150 150 150 150 150 150 150 
##$TP07= 0
##$TPNAME0= <>
##$TPNAME1= <>
##$TPNAME2= <>
##$TPNAME3= <>
##$TPNAME4= <>
##$TPNAME5= <>
##$TPNAME6= <>
##$TPNAME7= <>
##$TPOAL= (0..7)
0.5 0.5 0.5 0.5 0.5 0.5 0.5 0.5 
##$TPOFFS= (0..7)
0 0 0 0 0 0 0 0 
##$TUNHIN= 0
##$TUNHOUT= 0
##$TUNXOUT= 0
##$USERA1= <user>
##$USERA2= <user>
##$USERA3= <user>
##$USERA4= <user>
##$USERA5= <user>
##$V9= 5
##$VALIST= <valist>
##$VCLIST= <CCCCCCCCCCCCCCC>
##$VD= 0
##$VDLIST= <DDDDDDDDDDDDDDD>
##$VPLIST= <PPPPPPPPPPPPPPP>
##$VTLIST= <TTTTTTTTTTTTTTT>
##$WBST= 1024
##$WBSW= 4
##$XGAIN= (0..3)
0 0 0 0 
##$XL= 0
##$YL= 0
##$YMAX_a= 488581
##$YMIN_a= -441937
##$ZGOPTNS= <>
##$ZL1= 120
##$ZL2= 120
##$ZL3= 120
##$ZL4= 120
##$ABSF1= 10
##$ABSF2= 0
##$ABSG= 5
##$ABSL= 3
##$ALPHA= 0
##$AQORDER= 0
##$ASSFAC= 0
##$ASSFACI= 0
##$ASSFACX= 0
##$ASSWID= 0
##$AUNMP= <proc_1d>
##$AZFE= 0.1
##$AZFW= 0.1
##$BCFW= 1
##$BC_mod= 2
##$BYTORDP= 1
##$COROFFS= 0
##$CY= 11.3945322036743
##$DATMOD= 1
##$DC= 2
##$DFILT= <>
##$DTYPP= 0
##$F1P= 2.36226072786647
##$F2P= -0.459571619588291
##$FCOR= 0.5
##$FTSIZE= 0
##$FT_mod= 4
##$GAMMA= 1
##$GB= 0.15
##$INTBC= 1
##$INTSCL= 1
##$ISEN= 128
##$LB= 0.24
##$LEV0= 0
##$LPBIN= 0
##$MAXI= 10000
##$MC2= 0
##$MEAN= 0
##$ME_mod= 0
##$MI= 1.114404
##$NCOEF= 0
##$NC_proc= 0
##$NLEV= 6
##$NOISF1= 3.799351
##$NOISF2= 2.8
##$NSP= 1
##$NTH_PI= 0
##$NZP= 0
##$OFFSET= 15.70392
##$PC= 1
##$PHC0= -19106.23
##$PHC1= 6.20074
##$PH_mod= 1
##$PKNL= yes
##$PPARMOD= 0
##$PSCAL= 0
##$PSIGN= 0
##$REVERSE= no
##$SF= 200.130013532006
##$SI= 16384
##$SIGF1= 3
##$SIGF2= 2
##$SINO= 400
##$SIOLD= 16384
##$SREGLST= <1H.CDCl3>
##$SSB= 0
##$STSI= 0
##$STSR= 0
##$SW_p= 3612.71676300578
##$SYMM= 0
##$S_DEV= 0
##$TDeff= 0
##$TDoff= 0
##$TI= <>
##$TILT= no
##$TM1= 0
##$TM2= 0
##$TOPLEV= 0
##$USERP1= <user>
##$USERP2= <user>
##$USERP3= <user>
##$USERP4= <user>
##$USERP5= <user>
##$WDW= 1
##$XDIM= 8192
##$YMAX_p= 0
##$YMIN_p= 0
$$ End of Bruker specific parameters
$$ ---------------------------------
##NTUPLES= NMR FID
##VAR_NAME=  TIME,          FID/REAL,        FID/IMAG
##SYMBOL=    X,             R,               I
##VAR_TYPE=  INDEPENDENT,   DEPENDENT,       DEPENDENT
##VAR_FORM=  AFFN,          ASDF,            ASDF
##VAR_DIM=   8192,          8192,            8192
##UNITS=     SECONDS,       ARBITRARY UNITS, ARBITRARY UNITS
##FACTOR=    0.0002768,     1,               1
##FIRST=     0,             0,               0
##LAST=      2.2672688,     0,               0
##MIN=       0,             -441937,         0
##MAX=       2.2672688,     488581,          0
$$ Real data points
##PAGE= N=1
##DATA TABLE= (X++(R..R)), XYDATA
$$ plain form
0 0 0 0 0 0 0 0 0 0 -8 0 -8 8 -8 16 -16 24 -32 33 -40 56 -64 73 -88 105 -121 144 -167 193 -222 255 -289 334
32 334 -376 428 -482 544 -610 683 -766 851 -950 1054 -1170 1294 -1433 1582 -1746 1926
48 1926 -2121 2338 -2576 2837 -3128 3453 -3812 4225 -4689 5223 -5844 6578 -7458 8540
62 8540 -9903 11684 -14124 17688 -23409 34119 -61295 287816 472562 184134 355068 304828
74 304828 110869 5646 151803 186314 102848 2874 50872 51611 -135741 -370014 -329990
85 -329990 -247384 -365760 -441937 -233244 -88730 -155970 -166403 -39368 -29653 -120010 -126616 -25510
97 -25510 62200 96471 125452 241529 354678 308974 201616 205866 181495 31747 -39437 27648
109 27648 24854 -36145 2615 58759 12974 -50484 -85301 -136581 -182148 -195803 -188531 -145899
$$ packed form
0@%%%%%%%%qQqJ6j6K4l2M0n6O5p3R6j20J37j61J93k26K65l11L60m15M77n44O23
32C34p10Q04r10J026j154J293j449J617j801K004k224K464k727L015l328L672
48A926m047M459m914N413n965O581p265Q037q914R912j1067J2422j4036J5998
62H540j8443K1587k5808L1812m1097N7528r5414L49111J84746k88428J70934n0240
74C04828j93959j05223J46157L4511q3466r9974M7998P39j87352k34273M0024
85c29990Q2606j18376p6177K08693J44514o7240j0433J27035R715r0357o606J01106
97b5510Q7710L4271K8981J16077J13149m5704j07358M250k4371j49748p1184O7085
109B7648k794o0999L8760N6144m5785o3458l4817n1280m5567j3655P272M2632
$$ plain form
121 -145899 -96864 -70249 -6474 73094 52040 661 52676 89078 18459 20339 129341 142382
133 142382 67246 83004 147074 103725 -9727 -54314 -17654 -13091 -89153 -116204 -16144 31759
145 31759 -73282 -114610 -9727 -7884 -148943 -161167 -24947 4983 -75285 -50570 76311
156 76311 113969 36906 10107 90811 118157 14521 -26484 88938 130873 6849 -33040
167 -33040 77802 82472 -53689 -83431 11653 21460 -62147 -63699 27472 50868 -36134 -78937
179 -78937 -7196 17442 -80874 -113108 148 57081 -9100 -7864 87953 93709 2463 -25000
191 -25000 16791 5744 -55576 -64003 -6350 25314 -4960 -21362 13264 15885 -43204 -65539
203 -65539 -28284 -22174 -39862 -779 55683 52059 35340 53453 48697 3120 -15176 5578 13080
$$ packed form
121a45899M9035K6615O3775P9568k1054n1379N2015L6402p0619J880J09002J3041
133A42382p5136J5758O4070m3349j13452m4587L6660M563p6062k7051J00060M7903
145C1759j05041m1328J04883J843j41059j2224J36220K9930q0268K4715J26881
156G6311L7658p7063k6799Q0704K7346j03636m1005J15422M1935j24024l9889
167c3040J10842M670j36161k9742R5084R807q3607j552R1171K3396q7002m2803
179g8937P1741K4638r8316l2234J13256N6933o6181J236R5817N756r1246k7463
191b5000M1791j1047o1320q427N7653L1664l0274j6402L4626K621n9089k2335
203f5539L7255O110j7688L9083N6462l624j6719J8113m756m5577j8296K0754P502
$$ plain form
216 13080 7029 32348 83444 98600 58267 24858 27916 -3376 -86646 -114159 -59667 -44108
228 -44108 -81822 -47260 40375 35559 -36933 -39665 -375 -36031 -107230 -86421 -76 24509
240 24509 -5943 28109 114750 106396 9978 -3124 64085 39217 -51225 -22012 86822 84219
252 84219 6846 23911 87529 38023 -76813 -94426 -31519 -36306 -102462 -74816 40538 62342
264 62342 -19607 -25661 46265 17677 -92680 -95916 -10755 -1994 -44019 -2448 88875 99828
276 99828 39183 21614 54367 34827 -41092 -54592 8226 24083 -18997 -1307 60780 43920
288 43920 -20235 -23889 -3266 -33504 -66692 -42833 -2212 4289 -2644 11132 30210 13927 -24059
301 -24059 -27839 -8749 -21983 -33795 6878 42393 28999 29145 56719 41490 -7124 -14906 -1589
$$ packed form
216A3080o051K5319N1096J5156m0333l3409L058l1292q3270k7513N4492J5559
228d4108l7714L4562Q7635m816p2492k732L9290l5656p1199K0809Q6345K4585
240B4509l0452L4052Q6641q354r6418j3102O7209k4868r0442K9213J08834k603
252H4219p7373J7065O3618m9506j14836j7613O2907m787o6156K7646J15354K1804
264F2342q1949o054P1926k8588j10357l236Q5161Q761m2025M1571R1323J0953
276I9828o0645j7569L2753j9540p5919j3500O2818J5857m3080J7690O2087j6860
288D3920o4155l654K0623l0238l3188K3859M0621O501o933J3776J9078j6283l7986
301b4059l780J9090j3234j1812M0673L5515j3394J46K7574j5229m8614p782J3317
$$ plain form
314 -1589 -22378 -42769 -17924 17241 15777 -3489 7742 34733 12861 -39920 -34312 10749 -8990
327 -8990 -56772 -19087 45125 15802 -35992 -355 46486 9048 -40103 -8474 45233 25184
339 25184 -24944 -1672 57862 33389 -39406 -22813 41759 10688 -57889 -20756 48714 16924
351 16924 -41342 -10304 39178 4268 -53025 -32970 17787 -59 -52455 -30691 33235 16239
363 16239 -44120 -19401 42436 16186 -37021 -2018 53850 28162 -14643 8915 43616 18662
375 18662 -22481 -11086 28507 21529 -13038 2546 46366 32394 -13146 -6423 15326 -17203
387 -17203 -51889 -32981 -12714 -24959 -25278 -2013 7537 -3298 -10723 -9338 -11884 -23326 -26982
400 -26982 -8558 5466 -1493 8633 39983 34046 454 7690 30361 4071 -22794 8828 38989
$$ packed form
314a589k0789k0391K4845L5165j464j9266J1231K6991k1872n2781N608M5061j9739
327h990m7782L7685O4212k9323n1794L5637M6841l7438m9151L1629N3707k0049
339B5184n0128K3272N9534k4473p2795J6593O4572l1071o8577L7133O9470l1790
351A6924n8266L1038M9482l4910n7293K0055N0757j7846n2396K1764O3926j6996
363A6239o0359K4719O1837k6250n3207L5003N5868k5688m2805K3558L4701k4954
375A8662m1143J1395L9593o978l4567J5584M3820j3972m5540O723K1749l2529
387a7203l4686J8908K0267j2245l19K3265R550j0835p425J385k546j1442l656
400b6982J8424J4024o959J0126L1350n937l3592P236K2671k6290k6865L1622L0161
$$ plain form
413 38989 18317 3761 29641 42635 8718 -28155 -21804 -2403 -25086 -55015 -20355 31554
425 31554 11171 -22859 13832 43110 -12827 -57458 -20397 6581 -29955 -44920 5948 48293
437 48293 25738 -4627 20157 49039 4369 -51153 -18754 29891 -8607 -46245 12051 59821
449 59821 11857 -28665 5766 26227 -18831 -52178 -20858 19272 4901 -23232 9080 56193
461 56193 23462 -32283 -9514 25106 -14509 -46579 -2869 32401 11232 3372 30998 39405
473 39405 11621 -16483 -15864 -3508 -17366 -37696 -14380 19774 8556 -5880 19128 22866 -15220
486 -15220 -24247 -4123 -13978 -32054 -16209 3294 3993 5000 10151 10542 3341 -9936 -12501 893
500 893 -1165 -17743 1133 32315 15243 -5698 20138 28377 -10383 -19658 13258 15981 -11475
$$ packed form
413C8989k0672j4556K5880J2994l3917l6873O351J9401k2683k9929L4660N1909
425C1554k0383l4030L6691K9278n5937m4631L7061K6978l6536j4965N0868M2345
437D8293k2555l0365K4784K8882m4670n5522L2399M8645l8498l7638N8296M7770
449E9821m7964m0522L4431K0461m5058l3347L1320M0130j4371k8133L2312M7113
461E6193l2731n5745K2769L4620l9615l2070M3710L5270k1169p860K7626Q407
473C9405k7784k8104O19J2356j3858k0330K3316L4154j1218j4436K5008L738l8086
486a5220r027K0124r855j8076J5845J9503O99J007N151L91p201j3277k565J3394
500H93k058j6578J8876L1182j7072k0941K5836Q239l8760r275L2916K723k7456
$$ plain form
513 -11475 -7261 25947 37224 11331 -10306 8219 24348 -15145 -45961 -6532 17232 -29494
525 -29494 -42900 14683 28830 -24409 -38072 2407 10437 -27464 -42737 -9925 15841 -8741
537 -8741 -29064 12410 44396 2421 -24040 27672 52638 2241 -15401 30615 43157 5648
549 5648 -5041 20803 27510 -1620 -19758 4023 22925 -11232 -39481 -5295 17893 -22881
561 -22881 -44648 -7976 2426 -29992 -30989 -847 2474 -15702 -14832 6369 17897 4470 -6564
574 -6564 12650 31244 15767 4414 23363 23910 -279 1839 17043 2215 -13888 -970 7208
587 7208 -3528 -6206 464 -4042 -16066 -20779 -14507 -11187 -24222 -29225 -2763 16992 -1369 -7603
601 -7603 22977 28839 -2872 -5237 22794 17349 -11063 -3667 28445 30161 2172 -5376 18845
$$ packed form
513a1475M214L3208J1277k5893k1637J8525J6129l9493l0816L9429K3764m6726
525b9494j3406N7583J4147n3239j3663M0479Q030l7901j5273L2812K5766k4582
537h741k0323M1474L1986m1975k6461N1712K4966n0397j7642M6016J2542l7509
549E648j0689K5844O707k9130j8138K3781J8902l4157k8249L4186K3188m0774
561b2881k1767L6672J0402l2418r97L0142L321j8176Q70K1201J1528j3427j1034
574f564J9214J8594j5477j1353J8949N47k4189K118J5204j4828j6103J2918Q178
587G208j0736k678O670m506j2024m713O272L320j3035n003K6462J9755j8361o234
601g603L0580N862l1711k365K8031n445k8412P396L2112J716k7989p548K4221
$$ plain form
614 18845 20923 -17380 -31650 -833 3551 -33538 -30656 13867 12460 -29517 -27625 9047 4504
627 4504 -33341 -32724 6719 17884 -7104 -3587 37673 43547 892 -6783 30552 26696 -20982
640 -20982 -22733 20982 26935 -5303 -4819 26640 24512 -12774 -24128 -2079 -3587 -35805 -38507
653 -38507 -1104 10631 -14314 -15191 14125 15692 -11476 -14675 3828 2800 -11665 -3025 19980
666 19980 21649 7714 8181 18410 10765 -8397 -9787 -223 -4542 -10209 2375 14412 4477 -4768
680 -4768 2939 3111 -14980 -23659 -11419 -5080 -12505 -5244 16705 19164 4110 5407 19367 10184
694 10184 -13634 -12878 6235 4337 -11443 -2681 21735 14998 -11393 -7192 14654 95 -31433
707 -31433 -20302 10890 2364 -22758 -7911 21767 9889 -19645 -10621 16710 7798 -20963 -8412
$$ packed form
614A8845K078l8303j4270L0817M384l7089K882M4523j407m1977J892L6672m543
627D504l7845O17L9443J1165k4988L517M1260N874m2655p675L7335l856m7678
640b0982j751M3715N953l2238M84L1459k128l7286j1354K2049j508l2218k702
653c8507L7403J1735k4945q77K9316J567k7168l199J8503j028j4465Q640K3005
666A9980J669j3935M67J0229p645j9162j390R564m319n667J2584J2037r935r245
680d768P707J72j8091q679J2240O339p425P261K1949K459j5054J297J3960r183
694A0184k3818P56J9113j898j5780Q762K4416o737k6391M201K1846j4559l1528
707c1433J1131L1192q526k5122J4847K9678j1878k9534R024K7331q912k8761J2551
$$ plain form
720 -8412 29063 23818 -8955 -418 31776 17863 -20515 -13592 15107 2905 -25194 -12080 17933
733 17933 10445 -16358 -10967 13651 5296 -25285 -21671 7191 2523 -22656 -10216 19852 10976
746 10976 -11268 1735 22306 10552 -7598 1566 18243 11933 -4778 -757 13869 6675 -12772
759 -12772 -7721 8396 -801 -15395 -4035 7471 -3927 -12096 -2978 -1003 -10509 -11685 -3969 -1601
773 -1601 -4613 -2089 6903 9179 1886 1262 12619 10076 -4754 674 16718 7594 -8932 1922
787 1922 15401 -516 -16615 -4472 7924 -4399 -16811 -3618 13986 3693 -15843 -5562
799 -5562 13440 -3132 -27165 -9856 14954 -956 -17563 7392 29246 10350 -7919 7331
811 7331 20461 1036 -19944 -5717 16262 3019 -17380 1229 25263 4810 -21993 -4346
$$ packed form
720h412L7475n245l2773Q537L2194j3913l8378O923K8699j2202k8099J3114L0013
733A7933p488k6803N391K4618q355l0581L614K8862m668k5179J2440L0068q876
746A0976k2244J3003K0571j1754j8150R164J6677o310j6711M021J4626p194j9447
759a2772N051J6117r197j4594J1360J1506j1398q169R118J975r506j176P716K368
773a601l012K524Q992K276p293o24J1357k543j4830N428J6044r124j6526J0854
787A922J3479j5917j6099J2143J2396j2323j2412J3193J7604j0293j9536J0281
799e562J9002j6572k4033J7309K4810j5910j6607K4955K1854j8896j8269J5250
811G331J3130j9425k0980J4227K1979j3243k0399J8609K4034k0453k6803J7647
$$ plain form
823 -4346 14612 -8796 -28376 -6123 14266 -1591 -16473 -29 16041 219 -20614 -9320
835 -9320 11280 219 -16873 2328 26223 12666 -4439 9695 20166 285 -14849 -3277
847 -3277 5547 -2502 -6046 6273 17073 10476 1 3753 7136 -7326 -18025 -8196 -2446 -12474
861 -12474 -10348 5540 4779 -6722 -3423 2893 -5653 -14534 -7760 514 -1428 -4718 3295 12734 7279
876 7279 -4087 446 10660 93 -11335 5202 19639 7295 -99 17241 22623 691 -10246
889 -10246 1599 4644 -12061 -18869 -1461 11696 -2587 -13502 4700 15029 -9734 -25663
901 -25663 -4130 6834 -17443 -24227 4392 16153 -4228 -10908 9904 19056 -693 -13118 6272
914 6272 20756 1711 -11527 10731 24633 -741 -15603 5671 13209 -10610 -18246 3042 10544
$$ packed form
823d346J8958k3408j9580K2253K0389j5857j4882J6444J6070j5822k0833J1294
835i320K0600j1061j7092J9201K3895j3557j7105J4134J0471j9881j5134J1572
847c277Q824q049l544J2319J0800o597j0475L752L383j4462j0699R829N750j0028
861a2474K126J5888p61j1501L299O316q546q881O774Q274j942l290Q013R439n455
876G279j1366M533J0214j0567j1428J6537J4437j2344p394J7340N382k1932j0937
889a0246J1845L045j6705o808J7408J3157j4283j0915J8202J0329k4763j5929
901b5663K1533J0964k4277o784K8619J1761k0381o680K0812R152j9749j2425J9390
914F272J4484j9045j3238K2258J3902k5374j4862K1274P538k3819p636K1288P502
$$ plain form
927 10544 -5234 -11073 3786 10043 -6004 -17171 -3744 6179 -9113 -16145 4592 14871 -776
940 -776 -2867 14261 15113 -759 -1604 9435 7830 -1921 -3131 4598 6083 -3160 -7702 190 916
955 916 -10711 -9660 1980 -1900 -11703 -4157 3319 -6801 -13230 -3770 -760 -7703 -6439 5316
969 5316 9745 4222 2817 12817 17129 3156 -5132 8477 14227 -3764 -7834 12386 14472 -6161
983 -6161 -6892 10524 7567 -12461 -14038 2786 5835 -10910 -15168 3144 8898 -12583 -18845 3351
997 3351 6149 -16736 -15293 11959 14117 -5951 -4355 15841 14620 -6498 -10736 4968 7329 -10439
1011 -10439 -11988 11483 17180 -4616 -6250 16307 14410 -10942 -13050 5785 4989 -11389 -8404
1024 -8404 8967 9925 -4358 -6211 8447 8711 -9658 -12204 5674 7985 -6423 -4773 9422 5240
$$ packed form
927A0544j5778n839J4859O257j6047j1167J3427R923j5292p032K0737J0279j5647
940g76k091J7128Q52j5872q45J1039j605r751j210P729J485r243m542P892P26
955I16j1627J051J1640l880r803P546P476j0120o429R460L010o943J264J1755
969E316M429n523j405J0000M312j3973q288J3609N750j7991m070K0220K086k0633
983f161p31J7416k957k0028j577J6824L049j6745m258J8312N754k1481o262K2196
997C351K798k2885J443K7252K158k0068J596K0196j221k1118m238J5704K361j7768
1011a0439j549K3471N697k1796j634K2557j897k5352k108J8835p96j6378K985
1024h404J7371R58j4283j853J4658K64j8369k546J7878K311j4408J650J4195m182
$$ plain form
1038 5240 -7832 -5189 1791 -4334 -12221 -6102 3819 3996 -1106 2500 9382 4416 -4256 -1445 2473
1053 2473 -6695 -10549 2187 8911 -45 -1219 10185 10871 -706 -3741 2558 1124 -9782 -8137
1067 -8137 4869 5690 -6928 -6539 8144 7002 -9881 -8859 6173 3860 -9113 -2931 13320 8434
1081 8434 -8034 -4055 11872 5823 -13026 -10054 9565 8085 -8606 -2744 15668 8839 -11002
1094 -11002 -6347 10213 1167 -19115 -13174 7554 5282 -12018 -7235 12403 8407 -9970 -5517
1107 -5517 11785 5116 -12419 -4788 13645 8354 -7973 -3562 12024 8363 -6733 -3729 9958
1120 9958 6383 -7222 -1531 11563 3311 -11018 -5575 5140 -2577 -13026 -6539 2706 -796 -6181
1134 -6181 -33 7089 986 -6607 -319 6630 -1830 -8158 943 7239 -122 -2216 6550 6681 -1827
$$ packed form
1038E240j3072K643O980o125p887O119R921J77n102L606O882m966q672K811L918
1053B473r168l854J2736O724q956j174J1404O86j1577l035O299j434j0906J645
1067h137J3006Q21j2618L89J4683j142j6883J022J5032k313j2973O182J6251m886
1081H434j6468L979J5927o049j8849K972J9619j480j6691N862J8412o829j9841
1094a1002M655J6560r046k0282N941K0728k272j7300M783J9638l996j8377M453
1107e517J7302o669j7535P631J8433n291j6327M411J5586l661j5096L004J3687
1120I958l575j3605N691J3094q252j4329N443J0715p717j0449O487R245l502n385
1134f181O148P122o103p593O288O949q460o328R101O296p361k094Q766J31q508
$$ plain form
1149 -1827 -648 7082 5086 -2846 -2151 5966 4986 -4003 -4780 3581 943 -10285 -5628 7049 1404
1164 1404 -10342 -1050 11773 2601 -10525 -4076 5575 -2364 -12724 -5707 7273 2022 -9425
1177 -9425 -1082 15122 6018 -11798 -2214 13290 2395 -12088 -264 13553 3570 -7207 2677
1190 2677 13468 3584 -9449 -2086 12585 4616 -11014 -1527 14273 2818 -13077 -3030 8013
1203 8013 -6102 -17286 -4727 5608 -3366 -11415 -1457 9454 2210 -10036 -4251 6845 -1618
1216 -1618 -12702 -1820 10980 1677 -4746 7754 14850 4205 -1873 5158 7747 861 -3178 2249
1230 2249 6248 1032 -3560 1797 4877 -4718 -8920 236 553 -8782 -6290 3988 411 -6600 -1861
1245 -1861 3405 -2375 -8435 -4208 2765 625 -4739 782 10552 6840 -3390 2308 11361 727
$$ packed form
1149a827J179P730j996p932O95Q117r80q989p77Q361k638j1228M657J2677n645
1164A404j1746R292J2823r172j3126O449R651p939j0360P017J2980n251j1447
1177i425Q343J6204r104j7816R584J5504j0895j4483J1824J3817r983j0777R884
1190B677J0791r884j3033P363J4671p969j5630R487J5800j1455j5895J0047J1043
1203H013j4115j1184J2559J0335q974q049R958J0911p244j2246N785J1096q463
1216a618j1084J0882J2800r303o423J2500P096j0645o078P031K589o886m039N427
1230B249L999n216m592N357L080r595m202R156L17r335K492J0278l577p011M739
1245a861N266n780o060M227O973k140n364N521R770l712j0230N698R053j0634
$$ plain form
1259 727 -10224 168 8254 -2713 -9294 2441 9154 -1215 -7868 528 6954 -2624 -11744 -1723
1273 -1723 8826 -2005 -11674 2077 12532 -1832 -10736 4355 12144 -1835 -7622 6289 13046
1286 13046 1136 -6520 3535 11186 -1355 -12211 -583 8942 -4086 -12911 1616 9963 -4304
1299 -4304 -11149 1443 6109 -6296 -11376 -964 4153 -4308 -8968 911 7723 -1094 -6765 3670
1313 3670 9650 -1097 -4633 6980 9211 -1501 -1952 6878 6075 -1967 -1764 4849 4801 -1273 -1416 5005
1329 5005 4856 -2988 -3602 3273 888 -8386 -5438 2531 -2544 -8742 -2137 3617 -3107 -7078 -755
1344 -755 2597 -3961 -7113 -886 3900 -1729 -6286 1965 8180 -775 -6333 5189 10231 -1209 -4517
1359 -4517 8338 11665 -813 -3614 7145 8838 -3256 -7258 2933 6901 -4301 -9106 3561
$$ packed form
1259G27j0951J0392Q086j0967o581J1735O713j0369o653Q396O426r578r120J0021
1273a723J0549j0831r669J3751J0455j4364q904J5091P789j3979n787J3911O757
1286A3046j1910p656J0055P651j2541j0856J1628R525j3028q825J4527Q347j4267
1299d304o845J2592M666j2405n080J0412N117q461m660R879O812q817n671J0435
1313C670N980j0747l536J1613K231j0712m51Q830q03q042K03O613m8o074j43O421
1329E005j49p844o14O875k385r274K948P969n075o198O605N754o724l971O323
1344g55L352o558l152O227M786n629m557Q251O215q955n558J1522N042j1440l308
1359d517J2855L327j2478k801J0759J693j2094m002J0191L968j1202m805J2667
$$ plain form
1372 3561 8656 -5005 -10422 3208 5719 -9507 -12319 1855 4705 -7396 -7985 5156 7973 -3014
1386 -3014 -5824 5453 9008 -3143 -6798 6303 9858 -3182 -5299 7462 8154 -5200 -6478 4406
1400 4406 3664 -7011 -6930 2534 3677 -5259 -6362 2544 3334 -6471 -7395 2656 3226 -5134 -2443 7434
1416 7434 5980 -610 2854 8369 4550 -1220 1286 5227 2151 -2214 517 5095 1057 -4438 -879
1431 -879 2588 -4285 -9390 -2810 270 -7392 -9041 -717 1582 -6136 -6513 1212 3117 -3853 -4283 4970
1447 4970 7961 -109 -1127 8983 10718 -189 -1294 8892 8303 -3258 -2855 8017 6292 -4866
1461 -4866 -4247 5658 3688 -7952 -8725 1574 987 -10862 -9711 2903 2443 -9513 -7026 5894
1475 5894 4881 -7208 -4728 7596 6126 -4311 -2163 8699 7308 -3341 -1655 8512 6666
$$ packed form
1372C561N095j3661n417J3630K511j5226k812J4174K850j2101n89J3141K817j0987
1386c014k810J1277L555j2151l655J3101L555j3040k117J2761O92j3354j278J0884
1400D406p42j0675Q1R464J143q936j103Q906P90r805r24J0051N70q360K691R877
1416G434j454o590L464N515l819n770K506L941l076m365K731M578m038n495L559
1431h79L467o873n105O580L080p662j649Q324K299p718l77P725J905o970m30R253
1447D970K991q070j018J0110J735j0907j105J0186n89j1561M03J0872j725j1158
1461d866O19R905j970j1640p73J0299n87j1849J151J2614m60j1956K487J2920
1475E894j013j2089K480J2324j470j0437K148J0862j391j0649J686J0167j846
$$ plain form
1488 6666 -4659 -3446 7042 5178 -5870 -4225 5108 2074 -7008 -4622 3006 379 -7478 -3781
1502 -3781 3948 1729 -5229 -2129 5063 2144 -3771 -512 5012 1335 -3454 780 5317 772 -3719
1517 -3719 1030 4715 -629 -4041 566 3166 -2146 -3698 1486 2325 -3607 -4413 2074 2778 -3104 -3382
1533 -3382 3579 4205 -2113 -1721 5332 3811 -4085 -2445 5515 2767 -6057 -2793 5620 2785 -5463
1548 -5463 -3019 4338 1334 -6974 -3925 4896 1376 -7797 -3677 7107 3225 -6957 -2192 7448
1562 7448 2952 -5527 -556 7758 3614 -4146 -94 8129 3745 -6016 -3356 6219 2134 -8117 -3771
1577 -3771 5515 631 -7436 -1937 5366 -960 -7809 -2374 4086 232 -6085 -1779 5675 3508 -3042
1592 -3042 882 7375 2478 -3984 1746 7129 287 -4573 1930 5203 -7 -3529 -294 1296 -1873
$$ packed form
1488F666j1325J213J0488j864j1048J645R333l034r082K386P628k627p857L697
1502c781P729k219o958L100P192k919n915L259N524l677m789M234M537m545m491
1517c719M749L685n344l412M607K600n312j552N184Q39n932q06O487P04n882k78
1533c382O961O26o318L92P053j521p896J640P960k748q824L264Q413k835q248
1548e463K444P357l004q308L049Q821l520r173M120J0784l882j0182M765R640
1562G448m496q479M971Q314m144p760M052Q223m384r761K660R575m085j0251M346
1577c771R286m884q067N499P303o326o849N435O460l854o317M306P454k167o550
1592c042L924O493m897o462N730N383o842m860O503L273n210l522L235J590l169
$$ plain form
1607 -1873 -4556 -1615 564 -3265 -5708 -25 3055 -3162 -4607 1747 2610 -3287 -1347 4464 2359
1622 2359 -1209 2203 6772 4433 -292 221 4590 3523 -2710 -2111 4172 1542 -5850 -1696 5181
1637 5181 -1305 -8297 -2706 3295 -3140 -7940 -2803 2176 -1182 -5307 -1323 4982 1397 -5794 78
1652 78 8446 2414 -5752 2254 9501 2062 -3757 3203 7210 185 -3934 1328 5481 43 -6021
1667 -6021 -1004 5846 -127 -8259 -2243 4868 -2735 -8374 -341 3875 -3139 -5767 1233 4417 -886
1682 -886 -3855 320 4609 978 -3521 602 5393 332 -3912 2676 5453 -1338 -3465 3072 3490
1697 3490 -2486 -2206 1802 1153 -1720 -2123 354 1340 -2058 -3187 1598 2361 -3059 -2694 3414 2244
1713 2244 -3577 -833 4142 44 -3244 930 3513 132 -2258 592 3596 917 -3010 -446 3916
$$ packed form
1607a873k683K941K179l829k443N683L080o217j445O354Q63n897J940N811k105
1622B359l568L412M569k339m725N13M369j067o233N99O283k630p392M154O877
1637E181o486o992N591O001o435m800N137M979l358m125L984O305l585p191N872
1652G8Q368o032q166Q006P247p439n819O960M007p025m119N262M153n438o064
1667f021N017O850n973q132O016P111p603n639Q033M216p014k628P000L184n303
1682h86k969M175M289l631m499M123M791n061m244O588K777o791k127O537M18
1697C490n976K80M008o49k873m03K477R86l398j129M785P63n420L65O108j170
1713B244n821K744M975m098l288M174K583l381k390K850L004k679l927K564M362
$$ plain form
1728 3916 566 -4607 87 4615 -1581 -5646 994 4043 -3164 -5300 957 3540 -1699 -4182 913
1743 913 4339 -434 -4833 940 5622 -1363 -5657 2427 6487 -1047 -4261 3653 6282 -1338 -3460
1758 -3460 2843 4435 -1367 -4138 1216 4629 -1234 -4977 1014 4481 -2738 -6150 1124 2958 -3845
1773 -3845 -4933 1626 2768 -3082 -3790 1294 2249 -2218 -3342 1528 3452 -910 -2082 3711 4686 -891
1789 -891 -1377 4028 3011 -2158 -928 3296 1813 -1814 -91 2680 944 -1759 -1032 1337 -30 -3625
1805 -3625 -2166 1299 -672 -4287 -601 2767 -1306 -4105 683 2502 -1944 -3017 1512 2913 -1016
1820 -1016 -2080 2040 3643 -707 -2722 2009 4127 -1219 -2947 3017 4527 -1752 -2962 3319 3367
1835 3367 -2927 -3606 2150 2212 -3275 -3490 1909 3112 -2380 -3538 2241 3325 -3537 -4285 2616 3036
$$ packed form
1728C916l350n173M694M528o196m065O640L049p207k136O257K583n239k483N095
1743I13L426m773m399N773M682o985m294Q084M060p534l214P914K629p620k122
1758c460O303J592n802k771N354L413n863l743N991L467p219l412P274J834o803
1773c845j088O559J142n850p08N084R55m467j124M870J924m362j172N793R75n577
1789h91m86N405j017n169J230M224j483l627J723K771j736k703P27K369j367l595
1805c625J459L465j971l615L686L368m073k799M788J819m446j073M529J401l929
1820a016j064M120J603m350k015M731K118n346j728N964J510o279j210O281M8
1835C367o294o79N756O2n487k15N399J203n492j158N779J084o862p48O901M20
$$ plain form
1851 3036 -3393 -3245 3436 3603 -2834 -2333 3480 3269 -2435 -2401 2853 3308 -2234 -2784 2788 2980 -3229
1868 -3229 -2983 2667 1958 -3291 -2340 2984 1386 -2902 -1719 2078 1207 -2542 -1880 1642 945 -2520
1884 -2520 -1396 2596 1655 -2061 203 3149 874 -2050 1040 2898 -232 -1544 917 2557 -800
1899 -800 -2083 584 1999 -911 -2408 549 2205 -2030 -3207 781 1144 -2838 -3250 1199 1403 -2842
1915 -2842 -2236 2462 1882 -2027 -1535 2601 2666 -1716 -1396 3101 3036 -2097 -1634 3694 2793 -2711 -1607
1932 -1607 4102 1930 -3540 -1803 3090 1303 -3552 -2457 2413 1164 -4043 -2845 2394 1052 -3875
1947 -3875 -2150 3323 1511 -3580 -1298 3469 1348 -3331 -1005 3223 1331 -2364 -365 3506 2109
1962 2109 -2080 -323 3438 1072 -2951 -1056 2647 716 -2804 -655 2551 -331 -2622 -317 2159
$$ packed form
1851C036o429J48O681J67o437N01N813k11n704L4N254M55n542n50N572J92o209
1868c229K46N650p09n249R51N324j598m288J183L797q71l749O62L522o97l465
1884b520J124L992r41l716K264K946k275k924L090J858l130j312K461J640l357
1899h00j283K667J415k910j497K957J656m235j177L988L63l982m12M449K04m245
1915b842O06M698n80l909M92M136O5m382L20M497o5n133M63N328r01n504J104
1932a607N709k172n470J737M893j787m855J095M870j249n207J198N239j342m927
1947c875J725N473j812n091K282M767k121m679K326M228j892l695J999L871j397
1962B109m189J757L761k366m023J895L703j931l520K149L206k882k291K305K476
$$ plain form
1977 2159 -686 -2372 -32 1954 88 -1741 163 1777 -489 -2165 375 1730 -979 -2067 1364
1992 1364 2180 -1369 -1167 2086 1492 -1497 -1079 1699 531 -1767 -942 2105 1682 -1598 -1171 2460 1404
2009 1404 -2644 -1352 2752 867 -3324 -646 3249 557 -3016 -557 2664 443 -2821 -948 2401
2024 2401 859 -3026 -1200 2910 815 -3784 -1178 3589 155 -3500 -459 3527 333 -2189 843
2039 843 3096 740 -2270 -167 3052 701 -3279 -842 3586 793 -3417 67 3162 -528 -3158
2054 -3158 424 2250 -1204 -2898 48 1804 -36 -2223 -402 2255 124 -2193 286 2631 -511
2069 -511 -2109 1782 2486 -1258 -1455 1621 1447 -821 -572 772 563 -742 -1192 671 1102 -1381 -2006
2086 -2006 1422 1028 -2262 -1353 1971 278 -2001 388 2342 183 -1240 713 2200 736 -1283
$$ packed form
1977B159k845j686K340J986j866j829J904J614k266j676K540J355k709j088L431
1992A364Q16l549K02L253n94k989M18K778j168k298Q25L047m23l280M27L631j056
2009A404m048J292M104j885m191K678L895k692l573K459L221k221l264J873L349
2024B401j542l885J826M110k095m599K606M767l434l655L041L986l194k522L032
2039H43K253k356l010K103L219k351l980K437M428k793m210L484L095l690k630
2054c158L582J826l454j694K946J756j840k187J821K657k131k317K479K345l142
2069e11j598L891P04l744j97L076j74k268K49J344k09j305m50J863M31k483o25
2086b006L428l94l290R09L324j693k279K389J954k159j423J953J487j464k019
$$ plain form
2101 -1283 -315 2155 1020 -2201 -491 2600 -416 -3166 160 2904 -1194 -3584 318 1957 -1441
2116 -1441 -3005 -371 1543 -570 -2019 -15 2706 209 -2644 950 4063 -324 -2693 1722 3896
2131 3896 -257 -1588 1761 2487 -321 -1617 1120 2265 -752 -2909 -73 2287 -1027 -3501 5
2146 5 2043 -1974 -2747 808 1014 -1996 -1900 1323 1580 -839 -1013 808 2319 191 -1223 1527 2159
2163 2159 -949 -1073 2249 1676 -1517 -1078 1750 343 -1826 -751 777 -210 -1327 -788 261 219 -1729
2180 -1729 -840 1367 497 -2309 -93 2247 29 -1363 1174 2355 -175 -940 1751 1875 -497 -1202
2196 -1202 647 1656 -275 -1677 200 2064 -1087 -2511 407 1559 -2084 -3052 660 1537 -1914
2211 -1914 -1999 909 1468 -1023 -1757 1180 2198 -716 -1676 1841 2985 -670 -1570 2242 2470 -1032 -1189
$$ packed form
2101a283R68K470j135l221J710L091l016k750L326K744m098k390L902J639l398
2116a441j564K634J914k113j449K004K721k497k853L594L113m387k369M415K174
2131C896m153j331L349P26k808j296K737J145l017k157K836K360l314k474L506
2146EK038m017p73L555K06l010R6L223K57k419j74J821J511k128j414K750O32
2163B159l108j24L322n73l193M39K828j407k169J075J528r87j117N39J049m2j948
2180a729Q89K207q70k806K216K340k218j392K537J181k530p65K691J24k372p05
2196a202J849J009j931j402J877J864l151j424K918J152l643r68L712Q77l451
2211a914q5K908N59k491p34K937J018k914r60L517J144l655r00L812K28l502j57
$$ plain form
2228 -1189 2019 1714 -1459 -1155 1657 1567 -1430 -1963 1039 1190 -2142 -2407 681 853 -2138 -2031 1329
2245 1329 857 -2090 -1257 1446 888 -1402 -682 1359 975 -655 -444 1509 1244 -1085 -281 1856 889
2262 889 -1190 18 1859 351 -1386 135 1534 -163 -1502 47 939 -418 -1559 20 1062
2277 1062 -395 -1588 291 956 -961 -1812 409 1369 -1038 -1309 1300 1015 -1137 -1058 1370 1250 -1268
2294 -1268 -780 1417 1419 -1143 -1243 1550 1326 -1525 -1258 1872 1331 -1518 -1381 1705 897 -2071 -1211 1627
2312 1627 811 -1922 -1145 1520 973 -1973 -1124 1816 969 -1699 -958 2009 999 -1774 -886 1938 892
2329 892 -1670 -480 1735 834 -1539 -761 1327 630 -1466 -536 1467 512 -1751 -639 1602 -17
2345 -17 -2017 -174 1248 -94 -1557 54 1225 -166 -1304 105 1174 -91 -1126 318 1012 -159
$$ packed form
2228a189L208l05l173L04K812r0k997n33L002J51l332k65L088J72k991J07L360
2245A329m72k947Q33K703n58k290P20K041l84j630K11J953k65k329Q04K137r67
2262H89k079J208J841j508j737J521J399j697j339J549Q92j357j141J579J042
2277A062j457j193J879O65j917q51K221R60k407k71K609k85k152P9K428j20k518
2294a268M88K197Kk562j00K793k24k851K67L130n41k849J37L086q08k968Q60K838
2312A627q16k733P77K665n47k946Q49K940q47k668P41K967j010k773Q88K824j046
2329H92k562J190K215r01k373P78K088o97k096R30K003r55k263J112K241j619
2345a7k000J843J422j342j463J611J171j391j138J409J069j265j035J444O94j171
$$ plain form
2361 -159 -759 604 1618 -353 -1079 877 891 -686 -864 1154 717 -1060 -709 1115 642 -1094 -817
2378 -817 523 678 -1644 -1266 1190 819 -1567 -785 1301 455 -1518 -718 1441 466 -1482 -538 1678
2395 1678 553 -1443 -331 1872 709 -1331 -515 1824 711 -1952 -257 2026 353 -1730 -336
2410 -336 1647 66 -1691 -454 1375 -103 -1736 -210 1453 -1 -1544 -334 1691 24 -1830
2425 -1830 -109 1651 -105 -1518 275 1739 19 -1408 314 1396 -65 -954 360 1338 -9
2440 -9 -1342 314 1211 -309 -1118 528 899 -776 -1031 401 741 -802 -976 554 528 -512 -510 617
2458 617 654 -810 -648 985 616 -777 -373 1279 597 -1221 -251 1186 367 -1433 -106 997 -82
2475 -82 -934 -212 861 27 -1304 -355 1386 236 -1704 -66 1533 91 -1785 434 1490 -221
$$ packed form
2361a59o00J363J014j971p26J956J4j577j78K018m37j777L51J824m73j736K77
2378h17J340J55k322L78K456l71k386P82K086q46j973Q00K159r75j948R44K216
2395A678j125j996J112K203j163k040Q16K339j113k663J695K283j673k083J394
2410c36J983j581j757J237J829j478j633J526J663j454j543J210K025j667j854
2425a830J721J760j756j413J793J464j720j427J722J082j461q89J314R78j347
2440ij333J656Q97j520q09J646L71j675k55J432L40j543j74J530k6j040KJ127
2458F17L7j464J62J633l69j393M04J652o82j818R70J437q19j800J327J103j079
2475h2q52P22J073q34j331R49J741j150j940J638J599j442j876K219J056j711
$$ plain form
2491 -221 -1296 394 1605 -139 -1272 97 1429 153 -1391 172 1696 -544 -1907 198 1791
2506 1791 -613 -1803 400 1341 -853 -1432 365 1147 -500 -1074 481 1572 -121 -1590 445 1437
2522 1437 -671 -1406 714 1204 -837 -1061 698 723 -654 -885 284 590 -737 -896 411 675 -650
2539 -650 -917 453 415 -882 -645 958 236 -1060 -221 1029 277 -715 -141 793 284 -532 -138 626 571
2558 571 -775 -351 1180 143 -1425 -58 1113 -514 -1389 363 986 -692 -700 471 712 -4 -1110
2575 -1110 219 1152 -67 -1251 344 1359 -577 -1036 936 1347 -970 -1177 760 979 -634 -1003
2591 -1003 376 790 -508 -1045 726 1026 -831 -1191 763 1273 -905 -1365 1143 1013 -684 -465 813
2608 813 910 -810 -595 689 933 -512 -997 801 899 -993 -953 911 633 -1406 -774 842 422 -1157
$$ packed form
2491b21j075J690J211j744j133J369J332j276j544J563J524k240j363K105J593
2506A791k404j190K203R41k194n79J797P82j647n74J555J091j693j469K035R92
2522A437k108p35K120M90k041k24J759K5j377k31J169L06j327j59J307K64j325
2539f50k67J370l8j297K37J603p22j296Q39J250p52r92N74R34n09q16L94P64n5
2558E71j346M24J531j037j568J367J171j627q75J752O23j678qJ171K41p16j106
2575a110J329R33j219j184J595J015j936m59J972M11k317k07J937K19j613l69
2591a003J379M14j298n37J771L00j857l60J954N10k178m60K508j30j697K19J278
2608H13R7j720K15J284K44j445m85J798R8j892M0J864k78k039O32J616m20j579
$$ plain form
2626 -1157 -343 697 527 -635 -596 751 503 -618 -554 639 434 -735 -252 981 181 -761 -32 1063
2644 1063 -222 -622 -64 414 -321 -622 -21 515 -1 -857 384 808 -344 -1058 360 765 -628 -545
2662 -545 687 512 -868 -322 670 1142 -468 -699 852 850 -491 -880 539 810 -893 -886 923 441 -1259
2681 -1259 -953 1061 786 -800 -758 920 505 -669 -683 639 721 -773 -624 1196 696 -1055 -458 1343
2699 1343 519 -890 -600 1089 549 -685 -513 917 366 -1152 -543 854 158 -857 -448 883 231
2716 231 -1157 -353 900 24 -998 -89 780 140 -653 -28 814 29 -811 145 714 -434 -712 664
2734 664 857 -147 -524 234 719 -517 -919 387 707 -396 -385 402 133 -464 -834 389 571 -725
2752 -725 -634 550 435 -717 -225 619 474 -719 -496 674 71 -932 -299 843 368 -884 -526 1089
$$ packed form
2626a157Q14J040j70j162L9J347k48j121O4J193k05j169M83J233q00r42P29J095
2644A063j285m00N58M78p35l01O01N36n16q56J241M24j152p14J418M05j393Q3
2662e45J232j75j380N46R92M72j610k31J551kj341l89J419K71j703PJ809m82j700
2681a259L06K014k75j586M2J678m15j174j4J322Q2j494J49J820n00j751N97J801
2699A343q24j409K90J689n40j234J72J430n51j518O09J397o96j015M09J331o52
2716B31j388Q04J253q76j022R09Q69o40p93O25Q42p85q40R56N69j148k78J376
2734F64J93j004l77P58M85j236m02J306L20j103J1P87k69n97l70J223J82j296
2752g25R1J184j15j152M92Q44j45j193K23J170o03j003O33J142m75j252L58J615
$$ plain form
2770 1089 510 -757 -505 793 291 -910 -347 1106 335 -923 -338 962 122 -1178 -112 891 333
2787 333 -1178 -36 871 -131 -841 -320 996 53 -968 -119 1083 88 -785 -49 1067 170 -733 29
2805 29 748 -234 -1035 141 1033 9 -628 187 409 -195 -757 -101 815 -471 -767 170 694 -525 -784
2824 -784 333 354 -465 -485 610 442 -417 -358 502 435 -627 -388 621 315 -813 -385 917 501 -724
2843 -724 -177 734 29 -661 -52 496 230 -813 -197 665 69 -783 -178 865 -89 -865 -83 1056 -291
2862 -291 -1017 -284 1005 -151 -560 -72 825 -35 -768 100 732 -97 -657 29 889 14 -1044 209 821
2881 821 -267 -1142 64 847 -386 -1028 160 624 -320 -969 110 539 -242 -1005 65 744 -368 -482
2899 -482 253 662 -348 -559 374 492 -299 -589 654 686 -197 -435 451 463 -538 -465 502 475 -682 -517
$$ packed form
2770A089n79j267K52J298n02j201N63J453p71j258N85J300q40j300J066J003n58
2787C33j511J142R07j002p10N21J316r43j021Q49J202r95q73P36J116q97r03P62
2805B9P19r82q01J176Q92j024o37Q15K22o04n62O56R16j286k96R37N24j219k59
2824g84J117K1q19k0J095j68q59N9Q60o7j062K39J009l06j128M28J302m16j225
2843g24N47R11p05o90O09N48k66j043O16Q62n96q52O05J043r54p76P82J139j347
2862b91p26P33J289j156m09M88Q97q60p33Q68O32q29n60O86Q60q75j058J253O12
2881H21j088q75J206P83j233o42J188M64r44o49J079M29p81p63J070O79j112j14
2899d82P35M09j010k11R33J18p91k90J243L2q83k38Q86J2j001P3R67k7j157J65
$$ plain form
2919 -517 357 7 -694 -358 369 -81 -915 -244 484 84 -567 -242 477 55 -508 -153 771 269 -347 272
2939 272 865 258 -624 377 1023 113 -640 234 605 -275 -715 304 551 -468 -760 210 412 -393 -928
2958 -928 241 732 -475 -732 509 647 -437 -710 413 732 -569 -615 423 971 2 -339 722 785
2976 785 -368 -621 523 664 -793 -565 441 268 -680 -557 503 127 -542 -530 491 418 -804 -788 423
2995 423 567 -584 -718 569 212 -522 -400 633 190 -415 -278 567 429 -330 -234 376 294 -573 -358 543
3015 543 -1 -775 -33 626 -203 -602 106 486 -20 -624 196 280 -206 -606 43 455 -151 -896 337 686
3035 686 -89 -672 373 737 -448 -456 612 597 -542 -546 384 444 -509 -549 609 573 -817 -348 523 346 -606
3056 -606 -544 543 466 -596 -399 465 185 -453 -438 374 235 -471 -490 609 475 -643 -425 568 488 -814
$$ packed form
2919e17Q74l50p01L36P27m50q34O71P28m00o51L25P19m22n63L55R24n02o16O19
2939B72N93o07q82J001O46r10p53Q74L71q80m40J019K47j019k92R70K02q05n35
2958i28J169M91j207k57J241J38j084k73J123L19j301m6J038N48r69l41J061O3
2976G85j153k53J144J41j457K28J006j73r48J23J060l76o69J2J021p3j222J6J211
2995D23J44j151j34J287l57p34J22J033m43o05J37Q45j38p59R6O10q2q67K15R01
3015E43n44p74P42O59q29l99P08L80n06o04Q20Q4m86m00O49M12o06p45J233L49
3035F86p75n83J045L64j185qJ068j5j139mR30O0r53m0J158l6j390M69Q71j77r52
3056f06O2J087p7j062J97Q64k80o38J5Q12j39p06j9J099j34j118K18R93q0j302
$$ plain form
3076 -814 -371 859 268 -716 -171 499 212 -427 -117 908 373 -564 -314 582 315 -469 -19 591 103
3095 103 -425 80 659 -89 -374 -38 591 236 -547 -134 637 -13 -493 256 531 -131 -248 469 414 -215
3115 -215 -372 307 337 -340 -513 415 351 -585 -141 452 418 -507 -380 359 368 -550 -357 559 82 -580 -65 444
3137 444 104 -428 -235 764 -50 -624 -575 652 405 -639 -375 574 126 -694 -97 656 120 -592 -289 422
3157 422 137 -727 -388 507 169 -848 8 830 -1 -951 58 841 -43 -546 30 545 3 -552 67
3176 67 407 55 -513 104 595 -200 -807 171 690 -463 -367 205 550 -168 -206 -22 482 -130 -554 246 748
3197 748 -137 -417 99 452 -40 -268 250 412 -505 -314 593 213 -259 -397 531 415 -202 -228 237 198 -362
3218 -362 -335 471 137 -603 -88 535 -246 -567 84 492 114 -466 -76 543 -13 -823 126 335 70 -959
$$ packed form
3076h14M43J230n91r84N45O70k87o39L10J025n35r37K50Q96k67p84M50O10m88
3095A03n28N05N79p48k85L36O29l55p83M13P71o50m80P49K75o62j17P17n5o29
3115b15j57O79L0o77j73R28o4r36M44N93l4r25J27P39Rr18J93R16m77o62N15N09
3137D44l40n32J93R99q14n74M9J227k47j044K64R49m48q20N97P53n36p12L03P11
3157D22k85q64L39Q95l38j017Q56Q22q31r50J009P83q84n03N76N15n42n55O19
3176F7L40l52n68O17M91p95o07R78N19j153R6N72L45p18l8J84N04o12m24Q00N02
3197G48q85k80N16L53m92k28N18J62r17J91R07l80m72j38R28j16o17k6M65l9n60
3218c62K7Q06l34p40N15O23p81l21O51M08l78n80L90O19n56q10R49K09k65j029
$$ plain form
3238 -959 146 624 -57 -546 145 694 -150 -759 219 830 -191 -666 -160 833 80 -601 -153 830 58
3257 58 -702 203 580 -362 -372 320 298 -287 -640 0 409 -316 -552 117 669 -258 -600 159 583 -470 -441
3278 -441 356 387 -183 -497 347 251 -550 -217 324 521 -137 -201 186 390 -297 -331 553 354 -482 -315 541
3299 541 82 -372 -199 331 43 -427 -94 494 174 -285 56 538 -19 -373 -6 470 -50 -515 136 490
3319 490 -52 -209 391 496 -92 -392 138 638 -194 -345 -321 685 -30 -563 167 594 -91 -684 449 548
3339 548 -196 -533 500 612 -489 -471 555 657 -348 -494 182 385 -298 -383 155 456 -408 -470 422 388
3359 388 -379 -530 361 202 -418 -337 298 567 -492 -581 461 440 -420 -155 608 177 -415 -294 709 394
3379 394 -599 168 494 242 -347 -70 677 267 -246 -88 454 -20 -333 -127 660 2 -851 -27 428 -455
$$ packed form
3238i59J105M78o81m89O91N49q44o09R78O11j021m75N06R93p53o81M48R83p72
3257E8p60R05L77r42j0O92k2n85l53O40M09p25k36O69N52r27l42P59M24j053K9
3278d41P97L1n70l14Q44r6q01L33N41J97o58o4L87K04o87l4Q84j99q36J67Q56
3299E41m59m54J73N30k88m70L33N88l20m59L41M82n57l54L67M76n20m65O51L54
3319D90n42j57O00J05n88l00N30N00q32j51K4J006p15n33P30M27o85n93J133R9
3339E48p44l37J033J12j101J8J026J02j005j46O76K03o83q5N38L01q64o2Q92l4
3359C88p67j51Q91j59o20Q1O35K69j059q9J042k1q60K65P63m31n92J21J003l15
3379C94r93P67L26k52n89K77P47m10n13J58N42m74l13K06P87o58q53Q24M55q83
$$ plain form
3399 -455 -467 68 339 -85 -633 215 518 -254 -495 242 554 4 -475 172 254 -286 -531 488 463 -104 -277
3420 -277 503 592 -275 -487 377 593 -401 -193 683 567 -211 -192 392 418 -450 -311 366 322 -462 -145 360
3441 360 300 -488 -348 226 124 -479 -295 422 423 -374 -319 790 391 -552 -9 480 38 -654 -109 418 224
3462 224 -416 -340 376 16 -503 -81 381 5 -776 -112 354 56 -298 144 613 139 -403 169 450 51
3482 51 -304 199 523 -165 -491 -32 141 -327 -723 272 527 -7 -263 127 15 -259 -464 305 33 -210
3502 -210 -192 181 245 -354 -312 523 357 -365 -315 580 295 -239 -229 445 -28 -217 -36 567 298 -505 -18 329
3524 329 147 -392 -197 630 259 -925 -130 484 120 -251 -251 576 37 -483 -117 695 184 -638 10 576
3544 576 -106 -461 -71 479 142 -519 -236 422 36 -557 278 475 -147 -332 252 422 -230 -556 166 351
$$ packed form
3399d55j2N35K71m24n48Q48L03p72k41P37L12n50m79O47Q2n40k45J019k5n67j73
3420b77P80Q9q67k12Q64K16r94K08Q76j16p78J9N84K6q68J39O77m4p84L17N05
3441C60o0p88J40N74j02o03J84P17Jp97N5J109l99r43N43M89m42o92N45N27j94
3462B24o40P6P16l60n19M22M62l76p81O64M66k98l54M42M69m74n42N72K81l99
3482E1l55N03L24o88l26M59J73m68l96R95K55n34k56L90j12k74k05P69k72k43
3502b10J8L73O4n99M2Q35j66p22N0Q95k85n34J0O74m73j89J81O03k69q03M87L47
3524C29j82n39J95Q27l71j184P95O14l64l71%Q27n39n20L66Q12n11q22O48N66
3544E76o82l55L90N50l37o61K83O58l86n93Q35J97o22j85N84J70o52l26P22J85
$$ plain form
3564 351 -168 -417 236 279 -207 -485 318 218 -191 -497 36 626 -302 -528 296 420 -156 -137 293 -4 -236
3585 -236 -206 380 214 -328 -66 182 214 -430 -89 454 205 -484 -29 342 -44 -419 -229 96 126 -448 -129
3606 -129 507 -132 -474 -51 562 177 -276 53 584 47 -632 172 389 259 -328 147 634 18 -395 37
3626 37 655 -246 -268 76 350 100 -577 184 606 -188 -485 316 610 -380 -346 290 284 -110 -318 380 444 -279
3648 -279 -268 57 652 -233 -427 171 239 -373 -393 271 295 -85 -584 248 254 -254 -186 124 317 -217 -124 590 48
3671 48 -458 -248 369 195 -287 112 526 236 -523 87 472 16 -420 -10 233 35 -300 -146 228 97
3691 97 -283 35 567 -104 -687 101 339 -6 -349 407 238 129 -271 -14 221 -220 -246 334 590 30 -662
3712 -662 171 419 -178 -614 238 349 -255 -577 270 340 -328 -641 133 507 -148 -666 322 481 -100 -413
$$ packed form
3564C51n19k49O53M3m86k78Q03j00m09l06N33N90r28k26Q24J24n76J9M30k97k32
3585b36L0N86j66n42K62K48L2o44L41N43k49o89M55L71l86l75J90L25L0n74L19
3606a29O36o39l42M23O13l85m53L29N31n37o79Q04K17j30n87M75M87o16m13M32
3626C7O18r01k2L44K74k50o77P61M22p94k97Q01K94r90L4O36ol94k08O98O4p23
3648b79J1L25N95q85j94N98O8o12k0O64K4l80m99Q32On08O8L10J93n34R3P14n42
3671D8n06K10O17j74m82L99M14k90p59O10L85m56m36M10K43j98l35J54L74j31
3691I7l80L18N32o71n83P88K38l45l43P56j69j09m00K57K35m41k6N80K56n60o92
3712f62Q33K48n97m36Q52J11o04l22Q47P0o68l13P74L74o55n18R88J59n81l13
$$ plain form
3732 -413 383 305 -689 -65 256 380 -352 -134 234 222 -204 -274 88 342 -141 -364 380 351 -579 -234 406
3753 406 -167 -394 -170 439 -6 -242 -7 126 254 -469 -161 538 -210 -360 85 490 8 -511 -6 421
3773 421 31 -478 348 351 -189 -151 168 310 121 -249 60 267 -153 -565 229 472 -111 -529 222 254 -89
3794 -89 -648 271 251 -86 -239 101 180 -204 -396 214 738 -275 -21 245 237 -495 -227 511 232 -592 -401
3815 -401 206 192 -331 -73 197 354 -380 -123 322 430 -487 -398 221 273 -527 -212 161 -76 -412 -180 497
3836 497 43 -321 -233 154 307 -378 220 264 -27 -487 15 421 94 -371 -133 465 -135 -460 -7 396 -83
3857 -83 -419 140 455 -296 -244 39 263 42 -434 131 393 -58 -515 256 -69 -265 -165 216 142 -100 -294
3878 -294 271 379 -327 -37 239 81 -261 -475 184 55 -186 -204 324 113 -211 -73 503 136 -658 -275
$$ packed form
3732d13P96p8r94O24L21J24p32K18L68j2m26p0L62K54m83k23P44k9r30L45O40
3753D06n73k27K24O09m45k36K35J33J28p23L08O99p48j50M45M05m82n19N05M27
3773D21l90n09Q26Ln40L8L19J42j89l70L09K07m20m12P94K43n83m18P51L2l43
3794h9n59R19k0l37j53L40P9l84j92O10N24j013K54K66qp32K68P38k79q24J91
3815d01O07j4n23K58K70J57p34K57M45J08r17Q9O19N2q00L15L73k37l36K32O77
3836D97m54l64Q8L87J53o85N98M4k91m60N02M06l27m65K38N98o00l25M53M03m79
3857h3l36N59L15p51N2K83K24k21m76N65K62m51m57P71l25j96J00L81p4k42j94
3878b94N65J08p06K90K76j58l42k14O59j29k41j8N28k11l24J38N76l67p94L83
$$ plain form
3898 -275 392 122 -669 -166 189 362 -657 -88 422 102 -498 -66 453 263 -217 -177 572 30 -266 -308
3918 -308 230 -120 -452 18 450 115 -550 -182 736 -21 -261 96 183 -272 -359 31 236 69 -493 76 592
3939 592 -91 -240 -79 494 -364 -533 147 -75 -212 -360 117 407 -209 -295 67 80 -174 -166 310 65 18 -291
3961 -291 243 265 -464 -221 167 316 -318 -163 390 334 -319 -241 278 209 -779 -156 285 -49 -151 -1 455
3982 455 168 -410 89 359 98 -396 -120 290 84 -647 -159 472 -103 -508 -242 412 77 -293 16 606
4002 606 -219 -389 -10 452 103 -562 307 453 -294 -443 49 618 -201 -111 110 274 -291 -258 131 478 -7
4023 -7 -411 -23 198 -152 -420 56 431 -59 -372 54 306 -331 -119 326 301 -96 -413 305 388 -111 -289
4044 -289 381 39 -187 -39 310 162 -352 -201 171 144 -506 -180 191 67 -495 88 366 61 -455 -121
$$ packed form
3898b75O67k70p91N03L55J73j019N69N10l20o00M32N19j90m80M0P49n42k96m2
3918c08N38l50l32M70M32l35o65L68R18p57k40L57Q7m55q7L90K05j67n62N69N16
3939E92o83j49J61N73q58j69O80k22j37j48M77K90o16q6L62J3k54QM76k45m7l09
3961b91N34K2p29K43L88J49o34J55N53n6o53P8N19o9r88O23M41l34j02J50M56
3982D55k87n78M99K70k61m94K76M10k06p31M88O31n75m05K66O54l35l70L09N90
4002F06q25j70L79M62l49o65Q69J46p47j49M92N69q19R0K21J64n65L3L89L47m85
4023gm04L88K21l50k68M76L75m90l13M26K52o37K12M45k5l97l17P18Q3m99j78
4044b89O70l42k26J48L49j48n14J51L72k7o50L26L71j24n62N83K78l05n16L34
$$ plain form
4064 -121 491 -39 -316 -158 229 -169 -311 249 491 -164 -535 235 403 71 -646 205 423 -199 -592 240
4084 240 454 -87 -205 58 554 -267 -307 8 412 -59 -228 155 439 -311 -277 364 176 -11 -532 228 658
4105 658 -159 -325 197 273 -333 -367 211 312 -444 -138 79 267 -222 -306 144 324 -314 -137 417 386 -279
4126 -279 -425 312 28 -191 -163 370 73 -186 -314 292 2 -206 80 167 -49 -219 33 419 -102 -186 -78
4147 -78 124 248 -155 99 92 -95 -467 27 446 -326 -444 167 539 -159 -138 184 234 63 -487 185 106 -227
4169 -227 -420 235 316 -301 -252 397 410 -379 -177 85 410 -250 -385 370 282 -333 -419 205 236 -246 -135 103
4191 103 372 -386 -284 119 42 -229 -265 192 188 -287 -195 253 264 -462 -103 451 248 -416 72 278 17 -287
4213 -287 -372 109 138 -461 -149 293 256 -345 -162 434 220 -154 -199 312 -76 -304 115 73 -105 -35 -114 287
$$ packed form
4064a21O12n30k77J58L87l98j42N60K42o55l71P70J68l32p17Q51K18o22l93Q32
4084B40K14n41j18K63M96q21m0L15M04m71j69L83K84p50L4O41j88j87n21P60M30
4105F58q17j66N22P6o06l4N78J01p56L06K17J88m89q4M50J80o38J77N54l1o65
4126b79j46P37k84k19K8N33k97k59j28O06k90k08K86Q7k16j70K52L86n21q4J08
4147g8K02J24m03K54pj87l72M94M19p72j18O11L72o98K1L22N0j71n50O72p9l33
4169b27j93O55Q1o17M9O49J3p89K02K62L25o60j35P55q8o15q6O24L1m82J11K38
4191A03K69p58J02M03p7k71l6M57mm75R2M48J1p26L59N54k03o64M88K06k61l04
4213b87q5M81K9n99L12M42l7o01J83N96k14l74m5N11l88k28M19m2j78P0p9M01
$$ plain form
4235 287 -31 -178 304 274 -122 -308 168 414 -168 -330 45 290 -235 -400 322 429 -167 -270 -60 430
4255 430 -92 -339 270 291 -479 -316 305 220 -409 -367 334 218 -151 -227 353 87 -74 -137 133 282 -415 -137
4277 -137 601 236 -348 -270 351 71 -367 -270 324 63 -266 126 595 66 -265 -181 344 121 -355 69 457
4298 457 18 -350 -324 427 50 -388 -293 262 -102 -412 110 263 139 -133 28 452 45 -192 -183 211 -153
4319 -153 -482 8 124 79 -187 173 153 -144 -9 308 404 -48 -319 178 -19 -328 -245 245 56 -333 -300 218
4341 218 362 -360 -68 275 -117 -288 -409 408 209 -249 -101 263 326 -241 81 352 73 -417 -220 276
4361 276 -121 -394 -178 307 -65 -404 -212 244 57 -279 -141 460 139 -399 123 405 -256 -250 128 305 -66
4382 -66 -435 135 562 -110 -226 39 343 -96 -540 15 431 27 -524 -103 245 -401 -318 130 176 -343 -452
$$ packed form
4235B87l18j47M82l0l96j86M76K46n82j62L75K45n25j65P22J07n96j03K10M90
4255D30n22k47O09K1p70J63O21q5o29M2P01j16l69p6N80k66j61o3K70J49o97K78
4277a37P38l65n84P8O21k80m38R7N94k61l29L92M69n29l31Q4N25k23m76M24L88
4298D57m39l68K6P51l77m38R5N55l64l10N22J53j24k72J61M24m07k37RL94l64
4319a53l29M90J16m5k66L60k0k97J35L17R6m52k71M97j97l09Q3M90j89l89L3N18
4341B18J44p22K92L43l92j71j21Q17j99m58J48L64O3n67L22K71k79m90J97M96
4361B76l97k73K16M85l72l39J92M56j87l36J38O01l21n38N22K82o61OL78J77l71
4382f6l69N70M27o72j16K65L04m39m44N55M16m04n51M21L48o46Q3M48M6n19j09
$$ plain form
4403 -452 103 420 38 -211 -60 410 141 -274 203 236 -204 -31 34 232 -191 -214 49 113 -184 -341 259
4424 259 78 -203 -97 112 74 -327 -108 485 -51 -287 -62 387 75 -431 -19 258 134 -173 70 207
4444 207 190 -506 27 409 -64 -339 78 451 -129 -208 6 411 7 -279 -39 260 180 -449 228 608 129
4465 129 -637 121 334 -259 -215 43 484 -245 -372 249 222 -65 -524 73 175 -89 -271 277 351 -212 -411
4486 -411 -162 303 -263 1 229 580 -38 -531 72 325 -63 -70 237 78 -106 -374 -68 192 -191 -130 144
4507 144 304 -434 -112 105 -56 -185 -63 34 372 -118 17 271 184 -14 -127 424 195 27 -185 513 -70
4528 -70 -299 208 312 240 -264 -236 259 -273 -342 74 285 -153 -6 107 427 -104 -415 94 431 -2 -309
4549 -309 387 562 -95 -343 509 417 168 -374 17 245 -233 -188 90 229 -238 -267 340 245 -312 -431 -47
$$ packed form
4403d52N55L17l82k49J51M70k69m15M77L3m40J73O5J98m23k3K63O4k97j57O00
4424B59j81k81J06K09l8m01K19N93n36k36K25M49l12n06M12K77j24l07K43J37
4444B07j7o96N33L82m73k75M17L73n80p9K14M05m04k86K40K99q0o29O77L80m79
4465A29p66P58K13n93M4K58M41p29j27O21k7k87m59N97J02k64j82N48P4n63j99
4486d11K49M65n66K64K28L51o18m93O03K53l88pL07j59j84k68L06K60l83O1K74
4507A44J60p38L22K17j61j29J22R7L38m90J35K54q7j98j13N51k29j68k12O98n83
4528g0k29N07J04p2n04K8M95n32o9M16K11m38J47J13L20n31l11N09L37m33l07
4549c09O96J75o57k48Q52r2k49n42L91K28m78M5K78J39m67k9O07r5n57j19L84
$$ plain form
4570 -47 503 -232 -162 247 235 -110 -264 305 502 -379 -260 177 248 -348 -355 220 308 -523 -23 308 257 -307 -157
4593 -157 155 59 -241 -195 288 85 -339 -368 525 102 -316 -91 68 76 -318 80 393 13 -336 -106 25 -55
4615 -55 -162 34 357 -2 -254 186 379 -353 -259 -59 236 -132 -178 25 243 -222 17 132 525 -15 -287
4636 -287 244 484 -403 -368 397 224 -464 -469 104 82 -70 -203 -94 206 -24 -132 329 312 -442 -350 332 226
4658 226 -473 -304 208 232 -314 58 268 375 -171 25 210 114 -177 -236 363 -16 -282 -33 298 -28 -175
4679 -175 -13 154 77 -222 -4 227 -91 -308 114 249 137 -245 154 302 88 -275 32 330 -143 -281
4699 -281 -11 245 -235 -156 138 318 128 -223 353 281 24 -319 54 173 -98 -144 279 407 62 127 267
4720 267 363 -231 -82 298 412 -181 -308 313 9 -282 -116 254 265 -285 -211 272 86 -549 -240 281 132
$$ packed form
4570d7N50p35P0M09j2l45j54N69J97q81J19M37P1n96pN75Q8q31N00L31n1n64J50
4593a57L12r6l00M6M83k03m24k9Q93m23m18K25J59Ql94L98L13l80l49K30J31q0
4615e5j07J96L23l59k52M40J93p32R4K00K95l68m6K03K18m65K39J15L93n40k72
4636b87N31K40q87L5P65j73o88nN73k2j52j33J09L00k30j08M61j7p54R2O82j06
4658B26o99J69N12K4n46L72K10J07n46J96J85r6k91n9N99l79k66K49L31l26j47
4679a75J62J67p7k99K18K31l18k17M22J35j12l82L99J48k14l63L07K98m73j38
4699b81K70K56m80P9K94J80j90l51N76p2k57l43L73J19k71m6M23J28l45O5J40
4720B67R6n94J49L80J14n93j27O21l04k91J66L70J1n50P4M83j86o35L09N21j49
$$ plain form
4741 132 -291 -53 195 172 -194 -285 179 209 -135 132 182 232 -514 -55 398 -77 -344 82 247 168 -218 -114
4763 -114 134 176 -322 119 151 -2 -197 -21 524 -159 -566 182 308 133 -385 211 534 -183 -339 206 245
4784 245 192 -138 97 330 -144 -263 86 267 -40 -174 114 95 -126 -139 138 30 -217 -292 212 -37 -256
4805 -256 -231 437 189 -216 79 192 206 -474 -271 92 100 -452 -38 348 -62 -423 -137 377 63 -299 34
4826 34 297 211 -461 -11 292 47 -269 8 151 354 -362 -13 254 191 -324 85 442 -165 -384 107 188
4847 188 -133 -299 -261 240 -277 -362 258 390 -181 -330 122 406 -7 -215 330 388 -415 -68 151 63 -192
4868 -192 -218 180 237 34 -323 150 175 -158 -217 204 109 -459 -296 265 2 -132 -155 497 254 -285 25 -108
4890 -108 170 -281 -274 172 -54 -298 -357 261 212 -433 -268 438 234 -347 -206 327 -80 -67 -11 81 138 -523 223
$$ packed form
4741A32m23K38K48k3l66r1M64L0l44K67N0N0p46M59M53m75k67M26J65p9l86J04
4763a14K48M2m98M41L2j53j95J76N45o83m07P48J26j75n18N96L23p17j56N45L9
4784B45n3l30K35K33m74j19L49J81l07j34K88j9k21j3K77j08k47p5N04k49k19
4805b56K5O68k48m05K95J13J4o80K03L63Qn52M14L86m10l61K86N14l14l62L33
4826C4K63q6o72M50L03k45l16K77J43K03p16L49K67o3n15M09L57o07k19M91Q1
4847A88l21j66L8N01n17q5O20J32n71j49M52K84m13k08N45N8q03L47K19q8k55
4868a92k6L98N7k03l57M73K5l33n9M21r5n68J63N61k63j34k3O52k43n39L10j33
4890a08K78m51PM46k26k44n9O18m9o45J65P06k04n81J41N33m07J3N6R2N7o61P46
$$ plain form
4913 223 271 -22 -137 -226 467 205 -169 -68 449 -110 -169 25 46 -40 -260 60 48 -192 -117 284 339 10 -367
4936 -367 23 368 17 -222 250 536 -182 -227 397 334 -61 -196 112 182 -289 -325 145 380 -208 -245 325 136
4958 136 -225 -244 234 406 -267 -206 390 19 -307 -214 393 271 -239 -131 138 170 102 24 202 192 -19 -172
4980 -172 197 59 -131 -270 -75 27 -134 -39 320 -128 -189 -17 233 71 -267 47 280 117 -231 91 293
5001 293 4 51 -10 45 -105 -412 -114 61 -121 -355 172 193 -264 -404 208 221 -89 -349 200 375 -452 -160
5023 -160 348 198 -143 -172 178 457 -203 -39 254 3 -354 -140 402 168 -105 -51 173 54 -250 -286 39
5044 39 171 -360 -195 262 97 -210 -146 108 -56 -49 -235 110 -105 -324 -90 384 81 -380 42 534 114
5065 114 -341 -82 318 -8 -467 26 488 16 -480 57 285 27 -199 -30 307 18 -174 152 257 -32
$$ packed form
4913B23M8k93j15q9O93k62l74J01N17n59n9J94K1q6k20L20j2k40P5M01N5l29l77
4936c67L90L45l51k39M72K86p18m5O24o3l95j35L08P0m71l6M70K35n88l7N70j89
4958A36l61j9M78J72o73O1N96l71l26R3O07j22n10J08K69L2o8p8J78j0k11j53
4980a72L69j38j90j39J95J02j61R5L59m48o1J72K50j62l38L14K33j63l48L22K02
5001B93k89M7o1N5j50l07K98J75j82k34N27K1m57j40O12J3l10k60N49J75q27K92
5023a60N08j50l41k9L50K79o60J64K93k51l57K14N42k34k73N4K24j19l04l6L25
5044C9J32n31J65M57j65l07O4K54j64Pj86L45k15k19K34M74l03m61M22M92m20
5065A14m55K59M00l26m59M93M62m72m96N37K28k58k26J69L37k89j92L26J05k89
$$ plain form
5085 -32 -410 146 205 27 -301 143 293 -54 -50 57 291 -102 -222 261 103 -296 94 124 233 -269 -123 40
5107 40 91 -193 -62 119 145 -254 -109 188 123 -600 -14 420 137 -197 42 38 -4 -458 -195 300 60 -232
5129 -232 -203 173 41 -225 56 296 100 -266 -144 315 211 -309 40 249 -77 123 -3 322 -302 -539
5149 -539 -352 263 80 -437 -9 395 -21 -448 -19 160 9 -246 121 301 61 -159 185 31 -399 -145
5169 -145 298 172 -182 -99 21 2 -96 -148 274 107 86 -283 67 35 -451 -336 129 67 -327 -176 258 324 -197
5192 -197 -302 200 318 -194 -86 144 132 -305 83 351 31 -587 -26 320 -139 -256 -284 106 168 -113 54
5213 54 363 -26 -299 -220 303 26 -62 7 312 -8 -377 95 477 35 -150 -120 250 75 -403 158 146 -57
5235 -57 -35 82 429 -282 -362 256 -66 -215 -378 136 170 -449 -318 -119 390 -87 -302 228 364 64 -253
$$ packed form
5085c2l78N56N9j78l28M44J50l47MJ07K34l93j20M83j58l99L90L0J09n02J46J63
5107D0N1k84J31J81K6l99J45K97o5p23N86M34k83l34K39mm2m54K63M95k40k92
5129b32K9L76j32k66K81K40j96l66J22M59j04n20L49K09l26K00j26L25o24k37
5149e39J87O15j83n17M28M04m16m27M29J79j51k55L67J80k40k20L44j54m30K54
5169a45M43j26l54Q3J20j9r8n2M22j67k1l69L50l2m86J15M65o2l94J51M34O6n21
5192a97j05N02J18n12J08K30j2m37L88K68l20o18N61L46m59j17k8L90O2k81J67
5213E4L09l89k73P9N23k77q8O9L05l20l69M72L82m42j85L0L70j75m78N61j2k03
5235e7K2J17L47p11q0O18l22j49j63N14L4o19J31J99N09m77k15N30J36l00l17
$$ plain form
5256 -253 -90 372 -120 -338 304 249 -240 -293 143 289 -325 -64 412 -100 -6 -139 194 53 47 -19 79 -139
5278 -139 -378 70 383 -73 -38 -185 255 81 -238 -350 177 -103 -586 52 292 148 -387 144 282 113
5298 113 -268 203 441 -46 8 136 378 -243 -150 37 246 123 -272 -226 387 48 -449 -47 218 -271 -167
5319 -167 373 197 -158 -60 -35 175 -280 -82 -40 126 -133 -106 285 167 -176 -277 275 430 -132 -110 54 223
5341 223 -254 -105 296 246 -134 -288 238 211 -175 -126 345 246 -372 -74 536 202 -197 8 73 -143 -284 -2
5363 -2 423 -37 -149 -156 122 -96 -340 41 295 -145 -441 -4 308 -128 -346 407 312 -37 -211 146 225 -101
5385 -101 -49 131 491 122 -318 186 272 -109 -106 197 526 69 -174 122 234 -88 -193 341 161 -451 -88
5406 -88 207 -13 -291 157 186 89 -238 -119 196 48 -355 -124 181 160 -431 52 129 101 -65 -97 -71 360 -145
$$ packed form
5256b53J63M62m92k18O42n5m89n3M36J46o14K61M76n12R4j33L33j41oo6R8k18
5278a39k39M48L13m56L5j47M40j74l19j12N27k80m83O38K40j44n35N31J38j69
5298A13l81M71K38m87N4J28K42o21R3J87K09j23l95M6O13l39m97M02K65m89J04
5319a67N40j76l55R8K5K10m55J98M2J66k59K7L91j18l43j01N52J55n62K2J64J69
5341B23m77J49M01n0l80j54N26k7l86M9M71r9o18K98O10l34l99K05O5k16j41K82
5363bM25m60j12pK78k18k44L81K54m40k96M37L12m36k18P53r5l49j74L57P9l26
5385a01N2J80L60l69m40N04Q6l81LL03L29m57k43K96J12l22j05N34j80o12L63
5406h8K95k20k78M48K9r7l27J19L15j48m03K31L05k1n91M83P7k8j66l2K6M31n05
$$ plain form
5429 -145 -102 184 132 -378 231 188 -9 -313 -213 59 -105 -258 -101 109 32 -147 -51 508 206 -163 -209 368
5451 368 -70 -40 364 43 90 -182 139 163 159 -161 195 129 -153 -168 32 183 -213 -177 56 125 -196 -104 171
5474 171 327 -145 -101 170 150 -201 -166 199 318 -154 -309 343 180 -200 -195 250 120 -391 -277 103 466 -251
5496 -251 -262 220 87 -290 -71 101 -77 -383 -80 388 -2 -298 -177 396 30 -204 95 274 155 -325
5516 -325 -78 265 -86 -285 -70 304 285 -352 33 158 -164 -382 -148 381 -212 -238 122 407 -1 -203 197
5537 197 169 -2 -225 89 280 -21 -365 57 264 -177 -167 -46 -7 -284 -78 255 139 -233 -150 98 208
5558 208 -73 -180 159 -26 -112 129 422 335 -34 -101 117 -111 -319 -40 406 197 -427 -162 122 194 -93
5579 -93 -314 209 253 -245 -113 390 214 -321 -114 306 31 -314 -45 -31 115 -195 -103 403 15 -352 110
$$ packed form
5429a45M3K86n2n10O09m3j97l04J00K72j64j53J57K10p7j79R6N59l02l69m6N77
5451C68m38L0M04l21M7k72L21K4ml20L56o6k82j5K00J51l96L6K33O9l21R2K75
5474A71J56m72M4K71k0l51L5L65J19m72j55O52j63l80NM45j30n11J14L80L63p17
5496b51j1M82j33l77K19J72j78l06L03M68l90k96J21N73l66k34K99J79j19m80
5516c25K47L43l51j99K15L74j9o37L85J25l22k18K34N29n93k6L60K85m08k02M00
5537A97k8j71k23L14J91l01l44M22K07m41J0J21L9k77K06L33j16l72Q3K48J10
5558B08k81j07L39j85q6K41K93q7l69o7K18k28k08K79M46k09o24K65K84P2k87
5579i3k21N23M4m98J32N03j76n35K07M20k75l45K69J4J46l10R2N06l88l67M62
$$ plain form
5600 110 85 11 -493 6 180 -2 -476 182 113 -23 -249 -119 207 -228 -352 154 444 -21 -45 148 394
5621 394 -64 -405 -31 176 -391 -321 33 24 -194 -157 207 257 -212 -210 200 56 -135 -53 116 4 -182 -174 281
5644 281 374 -336 -149 406 225 -182 -185 221 283 -117 6 481 202 -392 177 156 229 -562 70 120 -7 -354
5666 -354 -172 256 -50 -275 -118 126 -23 -44 98 348 -64 -95 107 93 -159 -212 84 146 -42 -267 -77 69
5688 69 -89 -275 157 208 160 -95 128 408 77 -404 159 143 -396 -186 224 272 -147 -413 279 212 -101 -94 288
5711 288 243 -93 -212 293 322 -73 -275 207 99 -230 -238 219 179 -223 -233 330 136 -142 -147 351 148 -276 -273
5734 -273 235 128 -354 -99 311 267 -71 4 106 -32 -130 -215 371 -125 -410 -325 156 -46 -406 -51 246 -78
5756 -78 -343 162 -12 -117 -649 148 284 5 -164 184 255 -145 -140 31 81 -145 -364 -62 319 94 -289 321
$$ packed form
5600A10k5p4n04M99J74j82m74O58o9j36k26J30L26m35j24N06K90m65k4J93K46
5621C94m58l41L74K07n67P0L54rk18L7L64N0m69KM10j44j91Q2J69j12j86QM55
5644B81R3p10J87N55j81m07lM06O2m00J23M75k79n94N69k1P3p91O32N0j27l47
5666c54J82M28l06k25J57K44j49k1J42K50m12l1K02j4k52n3K96O2j88k25J90J46
5688F9j58j86M32N1m8k55K23K80l31m81N63j6n39K10M10M8m19k66O92o7l13PL82
5711B88m5l36j19N05K9l95k02M82j08l29qM57m0m02j0N63j94k78nM98k03m24L
5734b73N08j07m82K55M10m4l38P5J02j38r8q5N86m96k85Q5M81k02l60L55K97l24
5756g8k65N05j74j05n32P97J36k79j69L48P1m00NJ71N0k26k19L02L81k25l83O10
$$ plain form
5778 321 390 41 -198 56 81 -214 12 227 275 -89 -310 494 27 -281 -42 230 97 -201 -192 345 181 -125
5800 -125 -178 90 234 -248 -99 300 251 -168 -186 449 20 -100 -70 102 -115 -263 287 432 54 -183 141
5821 141 141 -54 -391 -1 267 -64 -462 -66 18 -176 -167 83 89 -22 -413 12 243 119 -105 113 213 -148
5843 -148 -363 -20 151 -173 -382 78 166 -94 -102 233 439 -144 -172 362 281 -177 -248 19 91 -186 -198 238 264
5866 264 -205 -223 340 425 -115 -29 19 161 -200 -134 167 151 -386 -237 65 80 -225 -317 125 48 -377 134 51
5889 51 3 -286 -136 279 157 -439 -190 314 -21 -322 -146 252 208 -88 42 398 167 -294 -14 369 45
5910 45 124 39 368 -81 -387 278 199 -85 -438 127 407 90 -117 225 247 -325 -124 2 159 -146 -258 223
5932 223 155 -49 -114 162 94 -144 -289 411 31 -298 -16 501 -81 -406 -375 268 -6 -491 -223 240 5
$$ packed form
5778C21O9l49k39K54K5k95K26K15M8l64k21Q04m67l08K39K72j33k98RN37j64l06
5800a25n3K68J44m82J49L99m9m19j8O35m29j20L0J72k17j48N50J45l78k37L24
5821A41%j95l37L90K68l31l98L96Q4j94RK50Oj11l91M25K31j24k24K18J00l61
5843a48k15L43J71l24k09M60Q8k60qL35K06n83k8N34q1m58p1K67P2k77j2M36K6
5866B64m69j8N63Q5n40Q6M8J42l61O6L01j6n37J49L02J5l05r2M42p7m25N11q3
5889E1m8k89J50M15j22n96K49N04l35l01J76L98m4k96J30L56k31m61K80L83l24
5910D5P9q5L29m49l06O65p9k84l53N65K80l17k07L42K2n72K01J26J57l05j12M81
5932B23o8k04o5K76o8k38j45P00l80l29K82N17n82l25L1O43k74m85K68M63k35
$$ plain form
5953 5 -130 -136 306 153 -452 -182 498 225 -540 -343 329 192 -158 -45 204 28 -251 33 203 102 -282
5974 -282 -23 220 250 -152 -6 70 278 -442 -83 194 -307 -388 26 394 -154 -389 156 141 -137 -446 139
5995 139 76 4 -348 101 304 -450 -536 271 -2 23 -208 -52 245 -176 -155 18 289 -193 -232 327 102 58
6017 58 -207 162 14 -250 -116 53 294 -255 -128 381 401 -264 -15 197 -26 -296 159 314 -51 -191 -93
6038 -93 261 16 -269 156 154 -262 -255 109 432 -100 -311 -129 648 48 -429 205 159 333 -345 18 162 -285
6060 -285 -397 -151 254 36 -209 -22 508 219 -362 200 401 96 -341 -14 253 -150 -193 4 242 -179
6080 -179 -97 400 118 -113 -183 247 137 -229 -43 155 288 -136 -149 380 113 -184 -288 212 125 -167 -231 403
6102 403 279 -128 25 86 134 -158 -471 139 305 -320 76 201 145 -337 -168 418 54 -237 -62 -153 156
$$ packed form
5953Ej35oM42j53o05K70O80k73p65J97O72j37l50J13K49j76k79K84J70j01l84
5974b82K59K43L0m02J46P6K08p20L59K77n01q1M14L68n48k35N45j5k78l09N85
5995A39o3p2l52M49K03p54q6Q07k73K5k31J56K97m21K1J73K71m82l9N59k25m4
6017E8k65L69j48k64J34J69K41n49J27N09K0o65K49K12k23k70M55J55l65j40R8
6038i3L54k45k85M25km16PL64L23n32k11J82P77o00m77O34m6J74o78L63J44m47
6060b85j12K46M05k18k45J87N30k89n81N62K01l05m37L27K67m03m3J97K38m21
6080a79Q2M97k82k31p0M30j10l66J86J98J33m24j3N29k67k97j04N00q7k92o4O34
6102D03j24m07J53O1M8k92l13O10J66o25L96J25n6m82J69N86l64k91J75r1L09
$$ plain form
6123 156 -61 -16 288 265 -183 -38 1 -55 -513 -175 260 212 -436 160 355 -22 -267 71 95 -194 -354 42
6145 42 221 -157 -174 99 294 -155 -440 407 416 -121 -229 268 303 -158 -265 187 84 -211 -382 302 363 71
6167 71 -77 278 168 -464 -159 229 336 -414 28 19 202 -185 -173 229 31 -207 -219 542 -47 -517 -279 111
6189 111 279 -155 8 14 169 -156 -28 358 -90 -340 -59 276 65 -309 -131 46 -39 -426 41 177 136
6210 136 -226 157 429 63 -82 -85 -83 32 -133 268 149 -228 -313 1 57 -210 -344 165 22 -88 -303 -3
6232 -3 392 -33 -39 216 261 -123 -299 308 504 -189 -177 225 64 -162 -227 118 230 -59 -205 123 65 3 -248
6255 -248 233 260 -76 -259 155 116 -309 -87 151 309 -460 74 460 -178 -356 -216 281 30 -289 -95 383
6276 383 -46 -232 106 391 59 -320 -139 473 -192 -187 100 263 76 -176 -42 282 88 -237 51 218 -166
$$ packed form
6123A56k17M5L04k3m48J45L9n6m58L38M35m8o48N96J95l77k45L38K4k89j60L96
6145D2J79l78j7K73J95m49k85Q47Rn37j08M97L5m61j07M52j03k95j71O84O1k92
6167G1j48L55j10o32L05L88J07p50M42rJ83l87J2M02j98k38j2P61n89m70K38L90
6189A11J68m34J63OJ55l25J28L86m48k50K81L35k11l74J78J77q5l87M67J36m1
6210A36l62L83K72l66j45lKJ15j65M01j19l77q5L14N6k67j34N09j43j10k15L00
6232cL95m25oK55M5l84j76O07J96o93J2M02j61k26o5L45J12k89j46L28n8o2k51
6255b48M81K7l36j83M14l9m25K22K38J58p69N34L86o38j78J40M97k51l19J94M78
6276C83m29j86L38K85l32l79J81O12o65NK87J63j87k52J34L24j94l25K88J67l84
$$ plain form
6297 -166 -292 -128 389 46 -354 213 402 -24 -507 358 340 -114 -53 136 278 -234 -44 88 223 -256 -243
6318 -243 -40 90 -149 -208 473 -87 -267 -107 393 257 5 -70 443 116 -193 4 308 -136 -288 -279 34
6339 34 -56 -278 68 55 205 -385 -91 509 54 -158 -44 152 241 -227 237 367 234 -216 3 408 -202
6360 -202 -107 74 398 -49 -91 -67 211 -118 -285 -238 81 -268 -243 17 404 -48 -460 -147 117 -129 -368 52
6382 52 187 -102 -121 113 -38 -91 -111 133 233 50 -384 111 104 -303 -206 105 147 -230 -336 155 -14 -232 -219
6405 -219 344 46 -40 38 329 303 -116 81 126 46 -66 -130 -12 157 -316 -42 238 -126 -393 113 253 18
6427 18 -222 27 419 -74 -162 -167 154 80 13 -29 298 19 -86 -139 474 125 -176 221 336 63 -349 280 74
6450 74 -306 -162 271 438 -149 -436 113 271 -110 -354 64 332 15 -101 191 307 -122 -154 99 392 -184
$$ packed form
6297a66j26J64N17l43m00N67J89m26m83Q65j8m54O1J89J42n12J90J32J35m79J3
6318b43K03J30k39n9O81n60j80J60N00j36k52p5N13l27l09J97L04m44j52RL13
6339C4r0k22L46j3J50n90K94O00m55k12J14J96Q9m68M64J30j33m50K19M05o10
6360b02R5J81L24m47m2K4K78l29j67M7L19l49K5K60L87m52m12L13K64k46k39M20
6382E2J35k89j9K34j51n3k0K44J00j83m34M95pm07R7L11M2l77j06M91j69k18J3
6405b19N63k98q6P8K91k6m19J97M5q0j12o4J18J69m73K74K80l64k67N06J40k35
6427A8k40K49L92m93q8nL21p4o7m2L27k79j05n3O13l49l01L97J15k73m12O29k06
6450G4l80J44M33J67n87k87N49J58l81k44M18K68l17j16K92J16m29l2K53K93n76
$$ plain form
6471 -184 -162 312 377 -45 -173 134 373 -535 -130 217 83 -435 84 311 158 -167 -8 305 -44 -193 9
6492 9 182 151 -167 283 308 314 -275 -66 105 4 -76 -39 412 169 -662 177 282 100 -282 -132 455 196 -385
6515 -385 -24 -53 -266 -53 44 254 53 -430 161 249 -85 -153 138 282 -118 -363 133 180 147 -156 94 262
6537 262 -422 -294 307 220 -97 -242 87 269 -217 -326 340 -67 -199 -114 247 -258 -505 -358 322 267 -67
6558 -67 -309 281 330 -56 -25 144 -64 -282 7 298 237 -192 8 348 -10 -370 -65 329 167 -183 -309
6579 -309 -1 -5 -322 62 44 20 -151 -62 171 -139 -349 56 194 -340 -425 33 183 -139 -263 29 169 118
6601 118 -229 103 210 -103 -216 140 104 -125 -354 149 -123 150 -92 -130 239 -125 -87 153 273 -325 -208
6622 -208 289 219 -119 -92 231 -44 -319 -215 123 88 13 118 297 176 -276 -38 125 190 -262 138 317 193
$$ packed form
6471a84K2M74O5m22j28L07K39r08M05L47j34n18N19K27j53l25J59L13l49j49K02
6492IJ73l1l18M50K5On89K09J71j01q0L7M51k43q31Q39J05j82l82J50N87k59n81
6515c85L61k9k13K13R7K10k01m83N91Q8l34o8K91J44m00k45M96M7l3l03K50J68
6537B62o84J28O01q7l17j45L29J82m86j09O66m07j32Q5L61n05k47J47O80n5l34
6558f7k42N90M9l86L1J69k08k18K89K91o1m29K00L40l58l60L05L94j62l50j26
6579c09L08ml17L84j8k4j71Q9K33l10k10M05J38n34q5M58J50l22j24K92J40n1
6601A18l47L32J07l13j13L56l6k29k29N03k72K73k42l8L69l64L8K40J20n98J17
6622b08M97p0l38K7L23k75k75J04L38l5p5J05J79j21m52K38J63O5m52M00J79j24
$$ plain form
6644 193 -336 -115 315 -22 -201 17 82 155 -184 -365 45 -34 -562 -106 470 278 -370 44 359 -217 -278
6665 -278 226 539 -76 -109 54 383 -84 -15 53 181 -62 -174 -6 168 -82 -281 119 379 -67 -409 -79
6686 -79 269 -161 -176 191 307 -262 -121 226 281 -253 -372 196 260 -299 9 192 111 -104 -265 63 469 -88
6708 -88 -386 224 -132 -94 -381 205 84 -420 62 275 276 -247 -343 333 144 -249 68 291 -8 -124 147 243
6730 243 -29 -230 -148 352 130 -345 -109 268 -120 -139 61 321 -7 -98 212 365 -17 -293 -121 390 -116
6751 -116 -590 192 119 59 -390 258 466 -212 -60 225 179 -141 -287 24 138 -37 -228 50 431 -238 -341
6772 -341 274 263 -285 -286 177 -297 -164 -178 421 16 -355 -166 353 5 -438 -282 301 29 -117 -38 359 162
6794 162 -394 -131 122 0 -85 -148 191 44 -27 -100 184 97 -189 77 300 297 -44 -195 267 35 -186 -139 561
$$ packed form
6644A93n29K21M30l37j79K18O5P3l39j81M10p9n28M56N76j92o48M14L15n76o1
6665b78N04L13o15l3J63L29m67O9O8J28k43j12J68J74k50j99M00K60m46l42L30
6686g9L48m30j5L67J16n69J41L47N5n34j19N68O4n59L08J83q1k15j61L28M06n57
6708h8k98O10l56L8k87N86j21n04M82K13Jn23r6O76j89l93L17K23k99j16K71R6
6730B43k72k01Q2N00k22m75K36L77l88j9K00K60l28r1L10J53l82k76J72N11n06
6751a16m74P82p3o0m49O48K08o78J52K85m6l20j46L11J14j75j91K78L81o69j03
6772c41O15j1n48jM63m74J33j4N99m05l71J89N19l48m43J56N83k72j46P9L97j97
6794A62n56K63K53j22q5o3L39j47p1p3K84q7k86K66K23ll41j51M62k32k21M7P00
$$ plain form
6817 561 198 -314 222 424 121 -236 -33 485 184 -30 -57 454 -71 -65 101 299 266 -309 36 159 -170
6838 -170 -316 243 380 -254 -302 18 244 23 -401 205 551 -249 -141 134 167 -263 5 100 279 -216 -289
6859 -289 105 333 -319 -347 189 151 -220 -90 226 159 -505 -228 380 81 -157 177 76 -93 -207 67 363
6880 363 -212 -434 -241 231 -147 -298 -122 473 4 -244 -44 251 -64 -148 -110 200 -5 -313 -197 279 -212
6901 -212 -287 374 314 271 -502 38 251 147 -290 59 187 -154 -180 390 336 -246 -407 135 318 -84 -405 15
6923 15 329 -222 -196 -124 120 -210 -171 97 310 76 -466 200 130 -352 -298 176 295 -42 -314 53 240 -263
6945 -263 -460 213 174 -422 -183 143 127 -104 -19 567 -76 41 -112 182 43 -201 33 143 -18 -364 -142
6966 -142 276 -182 -243 -217 310 53 -341 -34 406 4 -203 196 142 -281 -354 42 208 144 -174 11 255 31
$$ packed form
6817E61l63n12N36K02l03l57K03N18l01k14k7N11n25OJ66J98l3n75L45J23l29
6838a70j46N59J37o34m8L20K26k21m24O06L46q00J08K75L3m30K68R5J79m95p3
6859b89L94K28o52k8N36l8l71J30L16o7o64K77O08k99k38L34j01j69j14K74K96
6880C63n75k22J93M72l78j51J76N95m69k48K00K95l15q4L8L10k05l08J16M76m91
6901b12p5O61o0m3p73N40K13j04m37L49J28l41k6N70n4n82j61N42J83m02l21M20
6923A5L14n51K6P2K44l30L9K68K13k34n42O66p0m82N4M74J19l37k72L67J87n03
6945b63j97O73l9n96K39L26j6k31Q5N86o43J17j53K94j39k44K34J10j61l46K22
6966a42M18m58o1K6N27k57l94L07M40m02k07L99n4m23p3L96J66o4l18J85K44k24
$$ plain form
6988 31 -206 -4 237 -127 -61 -59 292 -129 -500 174 398 -71 -136 72 256 -143 -188 275 -95 -40 -185 -35
7010 -35 250 -94 -280 111 553 -302 -370 75 113 -360 -114 92 33 -173 -248 298 21 -195 234 39 288 -259
7032 -259 -34 458 84 -108 291 308 4 -256 -109 113 -165 -106 -26 332 245 -178 -47 308 -12 -264 -79
7053 -79 428 86 -301 -20 257 -78 -351 177 301 80 -294 23 241 34 -271 19 257 -143 -292 -160
7073 -160 365 -175 -373 235 350 -115 -21 131 136 -10 -333 478 -73 -304 -207 170 160 -8 56 334 114 -335
7095 -335 -208 326 186 -450 -101 220 -95 -253 -166 296 5 -255 36 -272 184 -346 -119 333 46 -105
7115 -105 -55 246 -50 -260 -49 361 159 -300 103 407 36 52 119 136 33 -498 -41 307 -63 -306 123
7136 123 338 -290 -266 -97 147 -56 -187 -6 282 -5 -194 132 113 -109 -219 69 222 -230 -239 219 37
$$ packed form
6988C1k37K02K41l64O6KL51m21l71O74K24m69o5K08J84l99m5M63l70N5j45J50
7010c5K85l44j86L91M42q55o8M45L8m73K46K06n9k06p5N46k77k16M29j95K49n47
7032b59K25M92l74j92L99J7l04k60J47K22k78N9Q0L58q7m23J31L55l20k52J85
7053g9N07l42l87K81K77l35k73N28J24k21l74L17K18k07l05K90K38m00j49J32
7073a60N25n40j98O08J15m65R4J52Nj46l23Q11n51k31R7L77j0j68O4K78k20m49
7095c35J27N34j40o36L49L21l15j58Q7M62k91k60K91l08M56n30K27M52k87j51
7115a05N0L01k96k10K11M10k02m59M03L04l71J6O7J7j03n31M57L48l70k43M29
7136A23K15o28K4J69K44k03j31J81K88k87j89L26j9k22j10K88J53m52rM58j82
$$ plain form
7157 37 -196 -331 407 117 -193 -243 180 -69 -86 -12 288 228 -358 61 173 135 -259 -115 112 -67 -138 69
7179 69 -1 220 -123 165 156 24 -257 -136 37 273 -24 -179 266 -1 -524 -119 218 -20 -153 100 200
7200 200 205 -200 -87 205 89 -30 35 244 -126 -144 -176 207 104 -386 -398 405 82 -128 138 305 -40 -306
7222 -306 153 300 58 -153 189 119 -268 -213 288 66 131 -109 98 27 -29 -195 -117 40 -391 -481 20 6 -206
7245 -206 -140 294 254 -202 -68 278 58 -239 -9 36 -82 -358 -125 399 149 -254 -105 185 186 -169 -223 272
7267 272 -58 -248 -103 442 204 -168 -290 256 67 -222 106 359 -124 -188 129 205 28 -198 21 295 164
7288 164 98 -108 274 35 -103 -195 224 -125 -463 117 369 -28 -310 5 -115 -146 -298 29 183 -43 -280
7309 -280 312 210 -345 -240 26 354 -68 -103 226 414 -122 -174 143 390 -437 -316 679 -38 -34 -51 167 44
$$ packed form
7157C7k33j35P38k90l10n0M23k49j7P4L00o0n86M19J12l8l94J44K27j79p1K07
7179F9p0K21l43K88rj32k81J21J73K36k97j55M45k67n23M05L37k38j33K53J00
7200B00Nm05J13K92j16j19O5K09l70j8l2L83j03m90j2Q03l23k10K66J67l45k66
7222c06M59J47k42k11L42p0l87N5N01k22O5k40K07p1n6j66P8J57m31r0N01j4k12
7245b06O6M34m0m56J34L46k20k97K30M5j18k76K33N24k50m03J49K90Jl55n4M95
7267B72l30j90J45N45k38l72j22N46j89k89L28K53m83o4L17P6j77k26K19K74j31
7288A64o6k06L82k39j38r2M19l49l38N80K52l97k82L15j20l1j52L27J54k26k37
7309b80N92j02n55J05K66L28m22l5L29J88n36n2L17K47q27J21R95p17Mj7K18j23
$$ plain form
7331 44 -279 -118 227 20 -136 -198 297 -202 -478 -84 24 160 -249 -149 232 202 -169 15 211 14 -253
7352 -253 -62 181 88 -53 230 124 -53 -479 -145 179 -124 -394 157 69 38 -174 285 111 -25 -247 -25
7373 -25 261 42 -7 64 68 -131 -106 42 198 -214 -106 312 57 152 -71 158 304 -53 -369 363 375 -193 -96
7396 -96 404 239 -220 -144 271 144 -120 -18 272 178 89 -155 263 328 -36 -325 100 203 -244 115 307 341
7418 341 -488 -2 447 199 -87 -82 275 -125 -270 -228 123 115 -148 23 239 -70 -22 -89 284 11 -240 327
7440 327 34 -53 -216 141 42 -97 -162 85 64 87 -300 220 351 -99 -392 159 99 -50 -75 31 149 22
7462 22 -40 225 105 -305 67 60 242 -34 -110 98 -8 -198 -37 380 193 -157 142 139 120 -61 -93 236 223
7485 223 -351 -242 298 -74 -310 -145 273 43 -274 -104 38 68 -207 -159 423 20 -274 -59 352 90 -1
$$ packed form
7331D4l23J61L45k07j56o2M95m99k76L94J08J36m09J00L81l0l71J84J96j97k67
7352b53J91K43r3j41K83j06j77m26L34L24l03k70N51q8l1k12M59j74j36k22K22
7373b5K86k19m9P1Mj99K5J48J56m12J08M18k55R5k23K29J46l57l16P32J2n68R7
7396i6N00j65m59P6M15j27k64J02K90r4q9k44M18O5l64k89M25J03m47L59J92L4
7418C41q29M86M49k48k86NL57m00j45M2L51qk63J71K16l09M8o7L73k73k51N67
7440C27k93q7j63L57r9j39o5K47k1K3l87N20J31m50k93N51o0j49k5J06J18j27
7462B2o2K65j20m10L72pJ82k76p6K08j06j90J61M17j87l50K99lj9j81l2L29j3
7485B23n74J09N40l72k36J65M18k30l17J70J42L0k75M8N82m03k94K15M11k62r1
$$ plain form
7506 -1 -130 189 98 -89 -17 201 -115 -202 73 194 -45 -147 29 14 -103 -290 195 30 -219 -74 148 121
7528 121 -190 -418 99 -71 114 -149 103 229 46 -91 284 191 94 0 81 177 -206 -125 429 221 -138 27
7550 27 429 -7 -329 -222 381 -49 -62 -76 238 137 -224 -18 109 172 -62 -73 272 289 -41 -119 168 -158
7572 -158 -268 -36 332 -215 -386 -255 220 71 -82 -29 178 10 -147 41 129 85 -250 -194 48 -138 -393
7593 -393 -13 207 -12 -375 78 0 -54 -105 -4 305 41 -172 27 44 -220 -134 187 164 -230 -59 2 165
7615 165 -275 -219 -92 280 -150 46 402 204 -260 -105 102 90 -69 -141 290 -274 -191 -131 388 179 -172 -84
7637 -84 298 19 -311 -179 353 -84 -93 28 164 -157 59 -82 -69 24 -152 -198 64 168 -311 70 -60 -108
7659 -108 -252 -131 -75 -29 -241 99 128 -90 -165 -86 174 -159 -138 75 252 -23 -173 212 282 41 23 195 319
$$ packed form
7506aj29L19r1j87P2K18l16q7K75J21k39j02J76j5j17j87M85j65k49J45K22k7
7528A21l11k28N17j70J85k63K52J26j83j37L75r3r7r4Q1R6l83Q1N54k08l59J65
7550B7M02m36l22J07O03m30j3j4L14j01l61K06J27O3k34j1L45J7l30p8K87l26
7572a58j10K32L68n47j71J31M75j49j53N3K07j68j57J88Q8m4l35N6K42j86k55
7593c93L80K20k19l63M53p8n4n1J01L09k64k13J99J7k64Q6L21k3l94J71O1J63
7615A65m40N6J27L72m30J96L56j98m64J55K07j2j59p2M31n64Q3O0N19k09l51Q8
7637h4L82k79l30J32N32m37rJ21J36l21K16j41J3R3j76m6K62J04m79L81j30m8
7659a08j44J21N6M6k12L40K9k18p5P9K60l33K1K13J77k75j50L85P0k41j8J72J24
$$ plain form
7682 319 -18 -228 -216 87 287 -74 257 106 -65 -48 77 109 -17 78 215 187 -38 -125 182 374 -63 -98
7704 -98 99 116 -409 -195 77 313 -255 24 124 31 -391 92 146 122 -114 169 112 90 -451 -249 97 -141
7726 -141 -147 -64 91 -169 -233 -365 174 59 -371 86 128 -141 -57 -58 409 38 -148 194 251 -182 -11 230 177
7749 177 106 -13 294 187 103 -114 107 2 -19 -120 175 62 -136 -44 -55 37 155 -62 151 140 8 -138
7771 -138 126 55 -129 -195 179 206 -162 -10 341 124 -232 -18 392 38 -14 -99 98 221 -287 -353 192 172
7793 172 -79 -183 369 -60 -222 -187 357 56 -274 43 131 -220 -33 48 76 407 -161 -270 9 7 -311 -18
7815 -18 102 1 -158 -37 167 -3 -376 51 129 -98 -26 8 51 -116 -30 207 269 -66 -346 248 180 -299 -262
7838 -262 381 -16 131 -172 -134 -176 3 -371 87 244 -202 -168 132 263 -20 -151 -128 -128 -166 -150 145 182 35
$$ packed form
7682C19l37k10J2L03K00l61L31j51j71J7J25L2j26R5J37k8k25q7L07J92m37l5
7704i8J97J7n25K14K72K36n68K79J00r3m22M83N4k4k36K83n7k2n41K02L46k38
7726a41oQ3J55k60o4j32N39j15m30M57M2k69Q4jM67l71j86L42N7m33J71K41n3
7749A77p1j19L07j07q4k17K21j05k1j01K95j13j98R2j1R2J18k17K13j1j32j46
7771a38K64p1j84o6L74K7l68J52L51k17l56K14M10l54n2q5J97J23n08o6N45k0
7793A72k51j04N52m29j62L5N44l01l30L17Q8l51J87Q1K8L31n68j09K79kl18K93
7815a8J20j01j59J21K04j70l73M27P8k27P2L4M3j67Q6K37O2l35k80N94o8m79L7
7838b62O43l97J47l03L8m2J79l74M58J57m46L4L00J31k83j31K3%l8J6K95L7j47
$$ plain form
7861 35 -179 156 158 -177 96 377 -146 168 -3 330 75 -58 -41 236 -105 -16 -80 -55 252 16 -31 96 36
7884 36 -70 143 238 97 -269 -86 227 24 -41 -82 -47 118 36 81 40 28 -108 -11 114 -279 -175 -56 160
7907 160 69 -116 202 213 121 -121 112 281 -210 -249 280 129 -376 7 -4 326 91 -242 45 113 -282 -411
7929 -411 265 -26 -120 -55 511 25 -151 -307 122 543 -213 -173 287 27 59 -162 141 319 -118 -54 213 -186
7951 -186 -109 -127 204 -47 -154 80 279 15 -178 114 -5 13 -108 -16 365 -228 -266 25 210 35 -196 -52
7973 -52 179 -72 -207 -78 59 -9 18 3 278 52 0 15 79 55 -189 69 -11 55 -69 83 1 -230 -322 9
7997 9 115 -139 -96 259 79 -189 54 196 249 -250 -191 91 296 -69 -63 145 -19 -123 129 164 184 -183 224
8020 224 186 -2 -108 130 128 154 -107 -60 279 15 -235 101 164 84 -20 -55 204 -85 -99 -95 240 22 -251 -33
$$ packed form
7861C5k14L35Kl35K73K81n23L14j71L33k55j33J7K77l41Q9o4K5L07k36m7J27o0
7884C6j06K13R5j41l66J83L13k03o5m1L5J65q2M5m1j2j36R7J25l93J04J19K16
7907A60r1j85L18J1r2k42K33J69m91l9N29j51n05L83j1L30k35l33K87O8l95j29
7929d11O76k91r4O5N66m86j76j56M29M21p56M0M60k60L2k21L03J78m37O4K67l99
7951a86P7j8L31k51j07K34J99k64j93K92j19J8j21R2L81n93l8K91J85j75k31J44
7973e2K31k51j35J29J37o8K7j5K75k26n2J5O4k4k44K58q0O6j24J52q2k31r2L31
7997IJ06k54M3L55j80k68K43J42N3m99N9K82K05l65OK08j64j04K52L5K0l67M07
8020B24l8j88j06K38kK6k61M7L39k64k50L36O3q0j04l5K59k89j4ML35k18k73K18
$$ plain form
8044 -33 71 76 -115 -184 189 -146 -144 -30 298 63 -38 -139 -110 -21 -196 68 63 261 -75 121 198 239 -174 -147
8068 -147 17 -94 -229 142 271 -163 -58 132 284 81 -185 61 84 -113 -43 -143 65 -240 -7 -169 -105
8089 -105 -158 -189 184 -96 70 88 201 235 -14 43 287 224 -253 -290 207 278 -109 -29 296 101 252 -45 271
8112 271 137 -26 -28 195 83 -165 130 147 -10 -393 -260 11 -12 83 -76 -26 103 19 177 34 -101 -26 540
8135 540 115 80 -59 -33 -78 -113 -146 -92 270 -21 152 92 47 11 -192 86 -4 65 -223 196 196 -9 -40 77 41
8160 41 66 -304 -172 234 56 30 53 173 -220 -303 159 186 -196 -393 354 7 -126 193 27 1 -46 149 191
8183 191 74 -109 101 209 157 -220 55 315
$$ packed form
8044c3J04Nj91o9L73l35KJ14L28k35j01j01K9Q9j75K64nJ98l36J96P7M1m13K7
8068a47J64j11j35L71J29m34J05J90J52k03k66K46K3j97P0j00K08l05K33j62O4
8089a05n3l1L73k80J66J8J13L4k49N7K44o3m77l7M97P1l87Q0L25j95J51k97L16
8112B71j34j63kK23j12k48K95J7j57l83J33K71k3R5j59N0J29q4J58j43j35P5N66
8135E40m25l5j39K6m5l5l3N4L62k91J73o0m5l6k03K78r0O9k88M19%k05l1J17l6
8160D1K5l70J32M06j78k6K3J20l93q3M62K7l82j97P47l47j33L19j66k6m7J95M2
8183A91j17j83K10J08n2l77K75K60
8191C15
$$ Imaginary data points
##PAGE= N=2
##DATA TABLE= (X++(I..I)), XYDATA
$$ plain form
0 0 0 0 0 0 0 0 0 0 0 0 0 -8 0 -8 8 -8 8 -16 16 -21 24 -30 32 -40 46 -54 63 -71 85 -93 109 -121 141 -157 179
35 179 -199 225 -251 281 -313 346 -384 428 -473 522 -578 637 -703 773 -853 938 -1035 1141
53 1141 -1261 1394 -1545 1715 -1914 2147 -2422 2753 -3166 3692 -4387 5355 -6800 9187 -13835
68 -13835 26253 -130618 -333244 -43785 101248 47216 113742 381657 488581 406728 326649
79 326649 359323 347236 176848 1023 77628 206695 105965 -6285 123470 178040 -29028
90 -29028 -186170 -164595 -224922 -376378 -399511 -289852 -208092 -185688 -156095 -59847 31821 -8130
102 -8130 -89729 -34273 40870 -533 13368 161079 224302 175207 198587 244233 172049 77125
114 77125 47334 18862 -12527 -11225 -2987 5948 6382 -28919 -54766 -58870 -127651 -210368 -171887
$$ packed form
0@%%%%%%%%%%%qQqJ6j6J6k4L2l7M5n4O2p2Q6j00J17j34J56j78K02k30K62k98L36
35A79l78M24m76N32n94O59p30Q12r01R95j100J215j340J476j626J791j973K176
53A141k402K655k939L260l629M061m569N175n919O858q079R742j2155J5987k3022
68a3835M0088j56871k02626K89459J45033n4032O6526K67915J06924q1853q0079
79C26649L2674j2087j70388j75825P6605J29067j00730j12250J29755N4570k07068
90b9028j57142K1575o0327j51456k3133J09659Q1760K2404K9593R6248R1668l9951
102h130q1599N5456P5143m1403J3901J47711O3223m9095K3380M5646p2184r4924
114G7125k9791k8472l1389J302Q238Q935M34l5301k5847m104o8781q2717L8481
$$ plain form
127 -171887 -106618 -134042 -106914 30698 78480 19073 44731 125443 95818 4478 825 73284
139 73284 99168 45964 30669 114922 145285 28179 -37522 45617 45530 -99610 -123567 2379
151 2379 10893 -108085 -117913 -20095 -16445 -114510 -137637 -43592 6690 -57802 -65369 67498 126382
164 126382 14775 -25787 87962 102566 -29085 -50498 65016 86061 755 -1970 82992
175 82992 89444 -9408 -55713 9959 32222 -61085 -94865 10754 57598 -30966 -57650 25763
187 25763 30312 -58511 -65601 12906 34062 -3926 7593 69821 85787 30139 -12268 -832
199 -832 -8956 -68022 -85688 -33525 -9501 -25755 357 41946 17280 -28296 -29113 -34142 -72235
212 -72235 -76284 -32141 -2026 6304 37088 82275 87331 45305 18933 35381 32724 -11706 -9137
$$ packed form
127a71887O5269k7424K7128J37612M7782n9407K5658Q0712k9625r1340l653P2459
139G3284K5884n3204j5295Q4253L0363j17106o5701Q3139q7j45140k3957J25946
151B379Q514j18978r828R7818L650r8065k3127R4045N0282o4492p567J32867N8884
164A26382j11607m0562J13749J4604j31651k1413J15514K1045q5306k725Q4962
175H2992O452r8852m6305O5672K2263r3307l3780J05619M6844q8564k6684Q3413
187B5763M549q8823p090P8507K1156l7988J1519O2228J5966n5648m2407J1436
199h32q124n9066j7666N2163K4024j6254K6112M1589k4666m5576q17n029l8093
212g2235m049M4143L0115Q330L0784M5187N056m2026k6372J6448k657m4430K569
$$ plain form
225 -9137 61273 83671 32951 32636 79624 39183 -61673 -78480 -33791 -53421 -104190 -66035
237 -66035 22801 31238 -25685 -27387 19983 -12763 -111943 -114361 -21807 -8095 -61180 -5554 119234
250 119234 119877 31996 37713 95685 46129 -57311 -50769 34196 42757 -16204 3673 94640 87054
263 87054 -22434 -50492 11972 -10770 -109317 -96762 6056 18671 -37655 -16642 49876 31114
275 31114 -48901 -65537 -17096 -9330 -49745 -30617 55322 82474 34507 32554 75493 43421
287 43421 -35530 -40330 -4041 -16854 -36235 353 45799 42022 18057 14890 15830 -11677 -51962
300 -51962 -53708 -26993 -28151 -36879 -22 32729 12385 -1403 20498 11825 -27463 -22949 10697
313 10697 6431 -6607 18975 45771 29815 -1332 -1314 16454 -2654 -42870 -26730 26337 18409
$$ packed form
225i137P0410K2398n0720l15M6988m0441j00856j6807M4689j9630n0769L8155
237f6035Q8836Q437n6923j702M7370l2746r9180k418R2554J3712n3085N5626J24788
250A19234O43q7881N717N7972m9556j03440O542Q4965Q561n8961J9877R0967p586
263H7054j09488k8058O2464k2742r8547J2555J02818J2615n6326K1013O6518j8762
275C1114q0015j6636M8441P766m0415J9128Q5939K7152m7967j953M2939l2072
287D3421p8951m800L6289j2813j9381L6588M5446l777k3965l167R40k7507m0285
300e1962j746K6715j158q728L6857L2751k0344j3788K1901q673l9288M514L3646
313A0697m266j3038K5582K6796j5956l1147J8J7768j9108m0216J6140N3067p928
$$ plain form
326 18409 -25465 2735 55497 15075 -51455 -26015 18022 -19981 -65132 -25129 33914 16685
338 16685 -27999 -2084 54960 31261 -37107 -19353 47209 21617 -45899 -10963 59027 25203
350 25203 -37491 -4787 49656 16864 -35982 -8976 42849 21085 -34983 -21165 30453 5578
362 5578 -61737 -42837 19266 -3401 -56769 -20240 39566 11855 -35799 -11137 25721 358
374 358 -37401 -18069 25247 20786 -10856 4801 48077 35924 -7950 2287 35314 15199 -14295
387 -14295 10760 36778 17974 2783 14178 11296 -12786 -27287 -25004 -23117 -26807 -23455 -4609
400 -4609 7817 -3654 -7760 7073 -5972 -43147 -38858 -7937 -18648 -34440 5912 45070 26551
413 26551 8263 32222 42293 6989 -22819 -7210 18806 5494 -17455 13479 56032 27616
$$ packed form
326A8409m3874K8200N2762m0422o6530K5440M4037l8003m5151M0003N9043j7229
338A6685m4684K5915N7044k3699o8368J7754O6562k5592o7516L4936O9990l3824
350B5203o2694L2704N4443l2792n2846K7006N1825k1764n6068J3818N1618k4875
362E578o7315J8900O2103k2667n3368L6529N9806k7711m7654K4662L6858k5363
374C58l7759J9332M3316m461l1642J5657M3276j2153m3874J0237L3027k0115k9494
387a4295K5055K6018j8804j5191J1395k882k4082j4501K283J887l690L352J8846
400d609J2426j1471m106J4833j3045l7175M289L0921j0711j5792M0352L9158j8519
413B6551j8288K3959J0071l5304k9808J5609K6016j3312k2949L0934M2553k8416
$$ plain form
425 27616 -19325 4028 30453 -21832 -61960 -15477 21681 -12486 -30151 15333 42732 3957
437 3957 -35809 -15603 12565 -20004 -58007 -12192 48215 19483 -20211 28835 67651 7146
449 7146 -44980 -10608 15019 -25532 -49113 -5805 36630 19770 -11604 9984 43973 5522
461 5522 -53278 -29895 13828 -15977 -45584 2309 41923 13656 -5056 19799 25712 -4617
473 -4617 -24230 -10882 10599 6433 -7694 11810 40067 21320 -7405 6510 11477 -23188 -30205
486 -30205 1531 3754 -11989 4110 23867 13988 868 -2374 -9120 -19319 -27436 -24464 -7568
499 -7568 -1921 -12070 2461 29139 10771 -18919 -737 10629 -24859 -33821 4374 13460 -12356
512 -12356 -5859 28500 34360 6692 -9511 11195 29992 1345 -22770 16455 44675 803
$$ packed form
425B7616m6941K3353K6425n2285m0128M6483L7158l4167j7665M5484K7399l8775
437C957l9766K0206K8168l2569l8003M5815O0407k8732l9694M9046L8816o0505
449G146n2126L4372K5627m0551k3581M3308M2435j6860l1374K1588L3989l8451
461E522n8800K3383M3723k9805k9607M7893L9614k8267j8712K4855N913l0329
473d617j9613J3348K1481m166j4127J9504K8257j8747k8725J3915M967l4665p017
486c0205L1736K223j5743J6099J9757r879j3120l242o746j0199q117K972J6896
499g568N647j0149J4531K6678j8368k9690J8182J1366l5488q962L8195R086k5816
512a2356O497L4359N860k7668j6203K0706J8797k8647k4115L9225K8220m3872
$$ plain form
524 803 -19583 30936 42067 -17792 -34838 9735 18105 -23053 -35227 -1543 17053 -13077 -39318
537 -39318 -9648 14967 -27936 -57509 -7865 21610 -24706 -40139 15030 35404 -2006 -9804
549 -9804 23702 32902 6554 -5255 20676 39127 10319 -13917 19235 44435 5068 -20627
561 -20627 15263 27354 -12558 -22589 3722 434 -27742 -31331 -12984 -7319 -21993 -30413 -10223
574 -10223 9877 -2705 -14409 5906 13686 -6460 -3730 18170 10827 -2904 13587 27410 15846
587 15846 9855 17001 12814 -9 -3599 1288 1374 -11264 -18396 -1019 9652 -15190 -30312 -6230
601 -6230 -6 -29657 -30760 3945 7356 -15637 -3485 30446 29148 -531 -5836 18565 23013
614 23013 -7821 -15097 21046 32572 -6 -1383 36562 30300 -19871 -25002 8204 -916 -41247
$$ packed form
524H03k0386N0519J1131n9859j7046M4573Q370m1158j2174L3684J8596l0130k6241
537c9318K9670K4615m2903k9573M9644K9475m6316j5433N5169K0374l7410p798
549i804L3506R200k6348j1809K5931J8451k8808k4236L3152K5200l9367k5695
561b0627L5890J2091l9912j0031K6311l288k8176l589J8347N665j4674q420K0190
574a0223K0100j2582j1704K0315P780k0146K730K1900p343j3731J6491J3823j1564
587A5846n991P146m187j2823l590M887Q6j2638p132J7377J0671k4842j5122K4082
601f230O224k9651j103L4705L411k2993J2152L3931j298k9679n305K4401M448
614B3013l0834p276L6143J1526l2578j377L7945o262n0171n131L3206r120m0331
$$ plain form
627 -41247 -39657 -206 7609 -21175 -22589 12170 14678 -26482 -32451 9377 14116 -25126 -19837
640 -19837 30870 38215 2128 -13 31022 28109 -8323 -14240 13998 18760 -8159 -9137 24231
653 24231 28685 -6564 -18630 3221 -140 -30811 -33636 -8419 -3669 -15318 -5105 17080 14868
666 14868 -3270 -5133 5363 -486 -15418 -10821 5836 7981 4124 15207 24493 12214 -1494
679 -1494 3342 4554 -11728 -18728 -4565 3155 -5663 -4829 9875 7380 -11997 -12851 1697 -1986
693 -1986 -19018 -11255 13847 15674 -122 5424 24417 14421 -13587 -10371 12909 3582 -22022
706 -22022 -7361 25352 16527 -12599 -3250 20547 3052 -30377 -22848 4514 -3369 -29077 -14799
719 -14799 21949 16618 -16016 -8061 25483 14438 -21291 -10715 23057 13898 -14026 -930 28022
$$ packed form
627d1247J590L9451P815k8784j414L4759K508m1160n969M1828M739l9242N289
640a9837N0707P345l6087k141L1035k913l6432n917K8238M762k6919r78L3368
653B4231M454l5249j2066K1851l361l0671k825K5217M750j1649J0213K2185k212
666A4868j8138j863J0496n849j4932M597J6657K145l857J1083R286j2279j3708
679a494M836J212j6282p000J4163P720q818Q34J4704k495j9377q54J4548l683
693a986j7032P763K5102J827j5796N546J8993r996k8008L216K3280r327k5604
706b2022J4661L2713q825k9126R349K3797j7495l3429P529K7362p883k5708J4278
719a4799L6748n331l2634P955L3544j1045l5729J0576L3772r159k7924J3096K8952
$$ plain form
732 28022 16856 -12179 -7431 16738 9073 -19799 -14376 14286 9042 -19528 -12518 13047 613
745 613 -26530 -15749 6870 -3339 -19592 -5732 14901 10256 -4537 1718 17700 11636 -6459
758 -6459 -1344 15715 8107 -7875 2474 15822 3394 -6786 2895 6429 -4241 -7471 -682
771 -682 -632 -7206 -8619 -4058 -4467 -12163 -12775 -758 1046 -8592 -1555 16776 10230 -5392 4392 17869
787 17869 2576 -13567 -51 14021 2266 -9000 4257 19345 7663 -12163 -3788 13584
799 13584 -1962 -25143 -9309 14640 -1948 -22609 -1867 18145 -3035 -22238 -4028 13356
811 13356 -1418 -16351 2539 25666 12576 -9258 4780 25105 3482 -24013 -5432 18098
823 18098 -1550 -18766 6141 26409 7113 -12144 682 12698 -6958 -28261 -15861 5629
$$ packed form
732B8022j1166k9035M748K4169p665k8872N423K8662n244k8570P010K5565j2434
745F13k7143J0781K2619j0209j6253J3860K0633m645j4793O255J5982o064j8095
758f459N115J7059p608j5982J0349J3348j2428j0180R681L534j0670l230O789
771f82N0o574j413M561m09p696o12J2017J804r638P037J8331o546j5622R784J3477
787A7869j5293j6143J3516J4072j1755j1266J3257J5088j1682j9826Q375J7372
799A3584j5546k3181J5834K3949j6588k0661K0742K0012k1180j9203J8210J7384
811A3356j4774j4933J8890K3127j3090k1834J4038K0325k1623k7495J8581K3530
823A8098j9648j7216K4907K0268j9296j9257J2826J2016j9656k1303J2400K1490
$$ plain form
835 5629 -3871 -20599 -2595 20213 5080 -15090 -1051 11927 -5540 -18362 -1830 11190
847 11190 2554 -2176 8800 16201 6351 -4794 290 7486 -806 -6940 6434 15679 5563 2143
861 2143 13197 8601 -9097 -9989 -2817 -9313 -15806 -6279 4431 1998 -2890 1331 6043 -3028 -16322
876 -16322 -13044 -2636 -10019 -18534 -2066 14708 3348 -5318 11363 18236 -1717 -9856 6578
889 6578 13544 -337 -4845 12406 21787 5054 -8431 6485 15986 -6720 -20746 2503 16117
902 16117 -7120 -16725 8268 15374 -11320 -22627 -3662 3873 -15918 -24385 -1561 15209 -545
915 -545 -12065 10458 24432 -47 -15598 6324 16690 -6536 -13400 9370 17405 -297 -6742
928 -6742 7663 13006 -3588 -13486 -237 9147 -6669 -16856 419 8762 -9887 -16213 1284
$$ packed form
835E629r500j6728J8004K2808j5133k0170J4039J2978j7467j2822J6532J3020
847A1190q636m730J0976P401r850j1145N084P196q292o134J3374R245j0116l420
861B143J1054m596j7698q92P172o496o493R527J0710k433m888M221M712r071j3294
876a6322L278J0408p383q515J6468J6774j1360q666J6681O873j9953q139J6434
889F578O966j3881m508J7251R381j6733j3485J4916R501k2706j4026K3249J3614
902A6117k3237r605K4993P106k6694j1307J8965P535j9791q467K2824J6770j5754
915e45j1520K2523J3974k4479j5551K1922J0366k3226o864K2770Q035j7702o445
928f742J4405N343j6594r898J3249R384j5816j0187J7275Q343j8649o326J7497
$$ plain form
941 1284 3917 -10380 -8201 7629 9560 1242 2493 11271 11803 2248 -2249 5288 7369 -2647 -2337
956 -2337 9409 7039 -4065 774 8629 -2441 -11611 -3682 -932 -10871 -12326 -3418 -2233 -9675
970 -9675 -11513 -2529 2466 -7511 -11425 4590 13905 -563 -4314 14879 17240 -4437 -6124 12210
984 12210 10397 -7625 -5811 13758 16814 365 -4064 11693 14300 -8177 -17167 1939 5408
997 5408 -17561 -17601 8669 10071 -12608 -11731 8992 8016 -12089 -13650 4649 8274 -7736 -9546
1011 -9546 11612 14924 -8544 -12500 9828 10066 -13266 -12431 10937 12497 -4283 -2275 12810 10429
1025 10429 -6826 -10220 2722 3877 -11704 -11651 9045 13525 -1273 -662 13023 8453 -6641 -5509
1039 -5509 2666 -2975 -10695 -3783 5727 3593 -3278 -1240 4918 556 -7898 -4176 2065 -4083 -7397
$$ packed form
941A284K633j4297K179J5830J931q318J251Q778N32r555m497P537K081j0016L10
956b337J1746k370j1104M839P855j1070r170P929K750r939j455Q908J185p442
970i675j838Q984M995r977l914J6015R315j4468l751J9193K361k1677j687J8334
984A2210j813j8022J814J9569L056j6449m429J5757K607k2477q990J9106L469
997E408k2969m0K6270J402k2679Q77K0723r76k0105j561J8299L625j6010j810
1011i546K1158L312k3468l956K2328K38k3332Q35K3368J560j6780K008J5085k381
1025A0429j7255l394J2942J155j5581N3K0696M480j4798O11J3685m570j5094J132
1039e509Q175n641p720O912R510k134o871K038O158m362q454L722O241o148l314
$$ plain form
1054 -7397 3995 9581 -2009 -6003 3976 4786 -6453 -7068 2708 4757 -1881 289 12308 11312 -3506
1069 -3506 -5973 5521 3441 -13659 -12617 4435 4084 -8562 -2449 13002 7488 -9143 -5644 9487
1083 9487 3645 -14591 -9817 10035 8711 -8440 -3624 14832 9121 -10145 -4497 13694 6270
1096 6270 -12600 -5658 14089 8838 -11416 -9058 8462 3619 -16090 -11397 7525 3079 -12891
1109 -12891 -4989 13596 7173 -11107 -6437 8656 3813 -11018 -7064 8353 6387 -5369 882
1122 882 14900 8347 -6119 -36 11868 3530 -8552 -2329 6757 825 -6643 -1969 3652 -2503
1136 -2503 -9231 -2700 5121 -1569 -8471 -33 6486 -2378 -7408 377 1311 -6863 -5345 4229 4434
1151 4434 -2318 87 9115 8398 -852 -2088 5511 3877 -6741 -3472 8387 3553 -8463 -684
$$ packed form
1054g397J1392N586j1590l994R979Q10j1239o15R776K049o638K170J2019r96j4818
1069c506k467J1494k080j7100J042J7052l51j2646O113J5451n514j6631L499J5131
1083I487n842j8236M774J9852j324j7151M816J8456n711j9266N648J8191p424
1096F270j8870O942J9747n251k0254K358J7520m843j9709M693J8922m446j5970
1109a2891P902J8585o423j8280M670J5093m843j4831L954J5417j966j1756O251
1122H82J4018o553j4466O083J1904q338j2082O223R086n932p468M674N621o155
1136b503o728O531P821o690o902Q438O519q864n030P785R34q174J518R574K05
1151D434o752K405R028p17r250j236P599j634j0618L269J1859m834j2016P779
$$ plain form
1165 -684 11970 2794 -10240 -2517 8302 1047 -9559 -2498 8583 1478 -11171 -4839 8598
1178 8598 -596 -17264 -7279 11117 1753 -12281 -24 14060 2399 -10217 -1142 9228 -1095
1191 -1095 -12923 -2971 12279 5883 -7700 2276 18980 8320 -8865 1248 13639 124 -11948
1204 -11948 949 11286 53 -9500 -285 8639 -215 -12680 -6737 4925 -2366 -13917 -3826
1217 -3826 8017 -2246 -12194 -867 6052 -5325 -10854 -311 5425 207 -853 6381 10753 5639
1231 5639 523 4941 7795 -1091 -5735 3669 6435 -2957 -1595 8514 4992 -4370 -1186 4111 -2782
1246 -2782 -9578 -4850 941 -1997 -7641 -3399 5049 1342 -7977 -2756 7778 34 -9096 1826
1260 1826 11748 985 -6385 4628 10369 -1345 -8687 466 6804 -1634 -9288 794 10979 55
$$ packed form
1165f84J2654r176j3034P723J0819p255j0606P061J1081p105j2649O332J3437
1178H598r194j6668R985J8396r364j4034J2257J4084j1661j2616R075J0370j0323
1191a095j1828R952J5250o396j3583R976J6704j0660j7185J0113J2391j3515j2072
1204a1948J2897J0337j1233r553R215Q924q854j2465N943J1662p291j1551J0091
1217c826J1843j0263r948J1327O919j1377n529J0543N736n218j060P234M372n114
1231E639n116M418K854q886m644R404K766r392J362J0109l522r362L184N297o893
1246b782o796M728N791k938n644M242Q448l707r319N221J0534p744r130J0922
1260A826R922j0763p370J1013N741j1714p342R153O338q438p654J0082J0185j0924
$$ plain form
1274 55 -10336 1039 9944 -5160 -14948 -435 7985 -5793 -11408 3699 11175 -401 -7073 4094
1288 4094 11972 767 -8302 3291 13251 860 -9130 4565 12958 -1552 -9451 4151 9189
1301 9189 -3610 -8616 2156 6988 -3463 -9360 -923 4205 -5673 -12036 -2229 4468 -5550 -9800
1315 -9800 2764 6408 -4069 -5344 4778 4465 -4138 -3401 4106 4261 -1369 -572 5688 6469 -189
1330 -189 -655 7011 5806 -2356 -24 8197 3534 -4164 434 5651 -1230 -6787 -370 3128 -3189
1345 -3189 -6515 -165 3737 -2597 -7761 -1270 3344 -5575 -11661 -1418 4793 -5717 -9141 4417
1359 4417 8637 -3149 -5548 6367 8568 -2899 -5342 6213 9983 -609 -4707 6809 11957
1372 11957 -1676 -7485 6160 9239 -5534 -8880 5294 7442 -6352 -8581 3398 4526 -7644
$$ packed form
1274E5j0391J1375Q905j5104r788J4513Q420j3778n615J5107P476j1576o672J1167
1288D094P878j1205r069J1593R960j2391r990J3695Q393j4510p899J3602N038
1301I189j2799n006J0772M832j0451n897Q437N128r878o363R807O697j0018m250
1315i800J2564L644j0477j275J0122l13q603P37P507J55n630P97O260P81o658
1330a89m66P666j205q162K332Q221m663p698M598N217o881n557O417L498o317
1345c189l326O350L902o334n164O491M614q919o086J0243O211j0510l424J3558
1359D417M220j1786k399J1915K201j1467k443J1555L770j0592m098J1516N148
1372A1957j3633n809J3645L079j4773l346J4174K148j3794k229J1979J128j2170
$$ plain form
1385 -7644 -10515 837 4538 -6237 -8853 4698 9041 -3140 -5723 7113 8751 -5181 -5908 6054
1399 6054 6451 -3662 -3158 6748 6939 -2453 -4156 3706 3811 -5826 -8008 1188 1594 -7756 -6489 2836
1415 2836 1040 -6811 -3782 3272 455 -4731 -567 5491 3638 8 3334 7968 4814 -587 2983
1430 2983 7442 1699 -3136 3542 7390 -619 -4043 3048 3713 -5794 -8102 -1189 -1148 -8950 -9671 -1123
1446 -1123 1094 -6855 -7898 2028 4200 -5287 -6132 5151 6529 -3922 -2430 9463 8902 -1825
1460 -1825 -46 10085 8940 -2214 -2197 8185 7125 -4717 -4665 6015 4567 -8497 -7945 3528
1474 3528 1543 -11218 -8944 3411 2096 -8501 -6576 4685 3846 -6649 -4770 6034 4950 -5471
1488 -5471 -3213 8173 6953 -3547 -1212 8351 5721 -3725 -1966 6185 2927 -5345 -2832 4653
$$ packed form
1385g644k871J1352L701j0775k616J3551M343j2181k583J2836J638j3932p27J1962
1399F054L97j0113N04R906J91r392j703P862J05r637k182R196M06r350J267R325
1415B836j796p851L029P054k817n186M164O058j853l630L326M634l154n401L570
1430B983M459n743m835O678L848q009l424P091O65r507k308O913M1p802p21Q548
1446a123K217p949j043R926K172r487q45J1283J378j0451J492J1893n61j0727
1460a825J779J0131j145j1154J7J0382j060j1842N2J0680j448j3064N52J1473
1474C528j985j2761K274J2355j315j0597J925J1261q39j0495J879J0804j084j0421
1488e471K258J1386j220j0500K335R563k630r446J759Q151l258q272K513P485
$$ plain form
1502 4653 1378 -6419 -3532 3254 268 -5952 -2352 3690 283 -4353 -237 4581 1 -4229 652
1517 652 5177 138 -3441 1531 4886 -270 -2386 2792 3169 -2871 -3779 1843 2671 -4069 -4575 2100
1533 2100 2923 -3578 -3602 3420 2658 -4265 -2390 5842 3475 -4702 -1251 6958 3893 -4478 -2077 5567
1549 5567 2384 -5212 -2466 5639 2606 -6807 -3275 6437 2187 -9211 -5235 5274 795 -8192
1563 -8192 -2843 6081 2033 -5259 -486 7300 3333 -5365 -1863 7929 4192 -5418 -1258 8492 3614
1578 3614 -5361 -439 6571 36 -7381 -1864 4581 -737 -7231 -3015 3601 809 -6288 -3586 3629
1593 3629 -494 -6730 -336 6514 640 -3893 3307 7046 1524 -1824 2176 4104 747 -1584 1131
1608 1131 3542 77 -2923 1476 3757 -3130 -6226 -270 601 -5749 -4825 1044 -579 -4928 -1304
$$ packed form
1502D653l275p797K887O786k986o220L600O042l407m636M116M818m580m230M881
1517F52M525n039l579M972L355n156k116N178L77o040r08N622Q28o740n06O675
1533B100Q23o501k4P022p62o923J875Q232k367q177L451Q209l065q371K401P644
1549E567l183p596K746Q105l033r413L532R712m250j1398L976J0509m479q987
1563h192N349Q924m048p292M773P786l967q698L502R792l737r610M160R750m878
1578C614q975M922P010o535p417N517O445n318o494M216O616k792p097K702P215
1593C629m123o236O394O850n874m533P200L739n522l348M000J928l357k331K715
1608A131K411l465l000M399K281o887l096N956Q71o350R24N869j623m349L624
$$ plain form
1623 -1304 3181 833 -3003 -1198 3737 3697 -1496 -313 6353 5085 -2080 1304 7972 2295 -5009
1638 -5009 472 6850 187 -5527 -444 3964 -543 -5844 -3197 1902 -2220 -8575 -3952 4460 -1040
1653 -1040 -8779 -1208 6940 -98 -6298 1450 6720 -177 -3826 2375 6486 1752 -3365 1721 8591
1668 8591 3060 -5208 438 7819 402 -6797 686 5280 -2650 -6114 668 2966 -2738 -5668 -1208
1683 -1208 2504 -612 -5010 -1005 4215 -76 -4699 1185 5123 -1824 -4108 3006 4323 -1595 -2026
1698 -2026 2945 2866 -346 -795 1359 2063 -1223 -2255 1491 2372 -2845 -3266 2549 1757 -4205 -1765 3222
1715 3222 -3 -3566 448 3254 -478 -2910 60 2944 507 -2800 -255 4009 1566 -3358 634
1730 634 5474 -130 -4678 1982 5378 -2110 -5126 1776 4227 -1780 -4252 604 3588 -1764 -5275
$$ packed form
1623a304M485k348l836J805M935m0n193J183O666j268p165L384O668n677p304
1638e009N481O378o663n714N083M408m507n301K647N099m122o355M623Q412n500
1653a040p739P571Q148p038o200P748N270o897l649O201M111m734n117N086O870
1668H591n531q268N646P381p417p199P483M594p930l464O782K298n704k930M460
1683a208L712l116m398M005N220m291m623N884L938o947k284P114J317n918m31
1698b026M971p9l212m49K154P04l286j032L746Q81n217m21N815p92n962K440M987
1715C222l225l563M014K806l732k432K970K884k437l307K545M264k443m924L992
1730F34M840n604m548O660L396p488l016O902K451o007k472M856K984n352l511
$$ plain form
1745 -5275 -170 4231 -2018 -6602 914 5514 -2361 -5930 2080 4814 -2242 -4100 2326 4708 -1208
1760 -1208 -2832 2968 5734 167 -3877 2288 5447 -1428 -4661 2377 5073 -2130 -3744 3077 3728
1775 3728 -2869 -3849 1119 1369 -3509 -4460 -7 1691 -2595 -4057 1321 2859 -2821 -3477 2375 2300
1791 2300 -2945 -1563 3396 1872 -1268 448 3161 1855 -1028 74 2875 1750 -1106 73 3381
1806 3381 1373 -2397 1 2938 -1055 -4359 -258 2000 -2438 -3849 698 2072 -1976 -3169 780
1821 780 2183 -2131 -4046 661 3131 -1942 -3143 2385 4777 -1547 -3049 3528 4159 -2138 -2879 3180
$$ packed form
1745e275N105M401o249m584P516M600p875l569Q010K734p056j858O426K382n916
1760a208j624N800K766n567m044O165L159o875l233P038K696p203j614O821O51
1775C728o597r80M968K50m878r51M453J698m286j462N378J538n680o56N852p5
1791B300n245J382M959j524l140J716K713j306k883J102K801j125k856J179L308
1806C381k008l770K398K937l993l304M101K258m438j411M547J374m048j193L949
1821G80J403m314j915M707K470n073j201N528K392o324j502O577O31o297p41O059
$$ [...]
8191a02
##END NTUPLES=NMR FID
##END=
