##TITLE=1H_Pr 2881
 CDCl3, 8 sc, 
 7.07.2021
##JCAMPDX= 6.0         $$ Bruker NMR JCAMP-DX V2.0
##DATA TYPE= NMR FID
##DATA CLASS= NTUPLES
##ORIGIN= UXNMR, Bruker Analytische Messtechnik GmbH
##OWNER= root
$$ XWIN-NMR		Version 3.5
$$ Wed Jul  7 12:42:00 2021 Russian Standard Time (UT+4h)  she@DPX200
##.OBSERVE FREQUENCY= 200.131506
##.OBSERVE NUCLEUS= ^1H
##.DELAY= (6, 6)
##.ACQUISITION MODE= SIMULTANEOUS
##.ACQUISITION SCHEME= undefined
##.AVERAGES= 8
##.DIGITISER RES= 18
##SPECTROMETER/DATA SYSTEM= spect
##.PULSE SEQUENCE= zg30
##.SOLVENT NAME= DMSO
##.SHIFT REFERENCE= (INTERNAL, DMSO, 0, 15.7039)
##AUDIT TRAIL= $$ (NUMBER, WHEN, WHO, WHERE, WHAT)
$$ ##TITLE= Audit trail, XWIN-NMR		Version 3.5
$$ ##JCAMPDX= 5.01
$$ ##ORIGIN= Bruker BioSpin GmbH
$$ ##OWNER= she
$$ F:/spectra/data/she/nmr/H-F/1/audita.txt
$$ ##AUDIT TRAIL=  $$ (NUMBER, WHEN, WHO, WHERE, WHAT)
(   1,<2021-07-07 12:40:42.43 +0400>,<she>,<DPX200>,
      <created by zg, POWCHK disabled, PULCHK disabled
       configuration hash MD5:
       00 E9 B6 7A A2 85 ED C7 34 08 36 98 17 FE 4E 26
       data hash MD5: 16K
       51 AB 21 B5 43 87 45 F7 E0 C8 B5 3A 36 5A CF A5>)
$$ ##END=
$$ 
$$ hash MD5
$$ 44 83 10 C2 AA AC BA D9 20 69 A7 25 CC D3 A7 07
##$RELAX= 
##$RELAX= 
##$RELAX= 
##$RELAX= 
##$RELAX= 
##$RELAX= 
$$ Bruker specific parameters
$$ --------------------------
##$DU= <F:/spectra>
##$EXPNO= 1
##$NAME= <H-F>
##$PROCNO= 1
##$TYPE= <nmr>
##$USER= <she>
##$AMP= (0..31)
100 100 100 100 100 100 100 100 100 100 100 100 100 100 100 100 100 100 
100 100 100 100 100 100 100 100 100 100 100 100 100 100 
##$AQSEQ= 0
##$AQ_mod= 1
##$AUNM= <au_zg>
##$AUTOPOS= <>
##$BF1= 200.13
##$BF2= 200.13
##$BF3= 200.13
##$BF4= 200.13
##$BF5= 200.13
##$BF6= 200.13
##$BF7= 200.13
##$BF8= 200.13
##$BYTORDA= 1
##$CFDGTYP= 0
##$CFRGTYP= 5
##$CHEMSTR= <none>
##$CNST= (0..31)
1 1 145 1 1 1 1 1 1 1 1 1 1 1 1 1 1 1 1 1 1 1 1 1 1 1 1 1 1 1 1 1 
##$CPDPRG= <>
##$CPDPRG1= <>
##$CPDPRG2= <>
##$CPDPRG3= <>
##$CPDPRG4= <mlev>
##$CPDPRG5= <mlev>
##$CPDPRG6= <mlev>
##$CPDPRG7= <mlev>
##$CPDPRG8= <mlev>
##$CPDPRGB= <>
##$CPDPRGT= <>
##$D= (0..31)
0 1.2 0 0 0 0 0 0 0 0.06 0 0.03 0 0 0 0 0.0002 0 0 0 0 0 0 0 0 0 0 0 0 
0 0 0 
##$DATE= 1625647241
##$DBL= (0..7)
120 120 120 120 120 120 120 120 
##$DBP= (0..7)
150 150 150 150 150 150 150 150 
##$DBP07= 0
##$DBPNAM0= <>
##$DBPNAM1= <>
##$DBPNAM2= <>
##$DBPNAM3= <>
##$DBPNAM4= <>
##$DBPNAM5= <>
##$DBPNAM6= <>
##$DBPNAM7= <>
##$DBPOAL= (0..7)
0.5 0.5 0.5 0.5 0.5 0.5 0.5 0.5 
##$DBPOFFS= (0..7)
0 0 0 0 0 0 0 0 
##$DE= 6
##$DECBNUC= <off>
##$DECIM= 32
##$DECNUC= <off>
##$DECSTAT= 4
##$DIGMOD= 1
##$DIGTYP= 9
##$DL= (0..7)
0 120 120 120 120 120 120 120 
##$DP= (0..7)
150 150 150 150 150 150 150 150 
##$DP07= 0
##$DPNAME0= <>
##$DPNAME1= <>
##$DPNAME2= <>
##$DPNAME3= <>
##$DPNAME4= <>
##$DPNAME5= <>
##$DPNAME6= <>
##$DPNAME7= <>
##$DPOAL= (0..7)
0.5 0.5 0.5 0.5 0.5 0.5 0.5 0.5 
##$DPOFFS= (0..7)
0 0 0 0 0 0 0 0 
##$DQDMODE= 0
##$DR= 18
##$DS= 0
##$DSLIST= <SSSSSSSSSSSSSSS>
$$ [...]
##$SUBNAM2= <"">
##$SUBNAM3= <"">
##$SUBNAM4= <"">
##$SUBNAM5= <"">
##$SUBNAM6= <"">
##$SUBNAM7= <"">
##$SUBNAM8= <"">
##$SUBNAM9= <"">
##$SW= 20.0188882624521
##$SWIBOX= (0..15)
0 0 2 0 0 0 0 0 0 0 0 0 0 0 0 0 
##$SW_h= 4006.41025641026
##$TD= 16384
##$TD0= 1
##$TE= 0
##$TE2= 300
##$TE3= 300
##$TEG= 300
##$TL= (0..7)
0 120 120 120 120 120 120 120 
##$TP= (0..7)
150 150 150 150 150 150 150 150 
##$TP07= 0
##$TPNAME0= <>
##$TPNAME1= <>
##$TPNAME2= <>
##$TPNAME3= <>
##$TPNAME4= <>
##$TPNAME5= <>
##$TPNAME6= <>
##$TPNAME7= <>
##$TPOAL= (0..7)
0.5 0.5 0.5 0.5 0.5 0.5 0.5 0.5 
##$TPOFFS= (0..7)
0 0 0 0 0 0 0 0 
##$TUNHIN= 0
##$TUNHOUT= 0
##$TUNXOUT= 0
##$USERA1= <user>
##$USERA2= <user>
##$USERA3= <user>
##$USERA4= <user>
##$USERA5= <user>
##$V9= 5
##$VALIST= <valist>
##$VCLIST= <CCCCCCCCCCCCCCC>
##$VD= 0
##$VDLIST= <DDDDDDDDDDDDDDD>
##$VPLIST= <PPPPPPPPPPPPPPP>
##$VTLIST= <TTTTTTTTTTTTTTT>
##$WBST= 1024
##$WBSW= 4
##$XGAIN= (0..3)
0 0 0 0 
##$XL= 0
##$YL= 0
##$YMAX_a= 331314
##$YMIN_a= -346862
##$ZGOPTNS= <>
##$ZL1= 120
##$ZL2= 120
##$ZL3= 120
##$ZL4= 120
##$ABSF1= 10
##$ABSF2= 0
##$ABSG= 5
##$ABSL= 3
##$ALPHA= 0
##$AQORDER= 0
##$ASSFAC= 0
##$ASSFACI= 0
##$ASSFACX= 0
##$ASSWID= 0
##$AUNMP= <proc_1d>
##$AZFE= 0.1
##$AZFW= 0.1
##$BCFW= 1
##$BC_mod= 2
##$BYTORDP= 1
##$COROFFS= 0
##$CY= 11.3945322036743
##$DATMOD= 1
##$DC= 2
##$DFILT= <>
##$DTYPP= 0
##$F1P= 15.9154993809931
##$F2P= -4.1035820241983
##$FCOR= 0.5
##$FTSIZE= 0
##$FT_mod= 4
##$GAMMA= 1
##$GB= 0.15
##$INTBC= 1
##$INTSCL= 1
##$ISEN= 128
##$LB= 0.24
##$LEV0= 0
##$LPBIN= 0
##$MAXI= 10000
##$MC2= 0
##$MEAN= 0
##$ME_mod= 0
##$MI= 1.114404
##$NCOEF= 0
##$NC_proc= 0
##$NLEV= 6
##$NOISF1= 3.799351
##$NOISF2= 2.8
##$NSP= 1
##$NTH_PI= 0
##$NZP= 0
##$OFFSET= 15.70392
##$PC= 1
##$PHC0= -12270.63
##$PHC1= 6.601002
##$PH_mod= 1
##$PKNL= yes
##$PPARMOD= 0
##$PSCAL= 0
##$PSIGN= 0
##$REVERSE= no
##$SF= 200.130013532006
##$SI= 16384
##$SIGF1= 3
##$SIGF2= 2
##$SINO= 400
##$SIOLD= 16384
##$SREGLST= <1H.CDCl3>
##$SSB= 0
##$STSI= 0
##$STSR= 0
##$SW_p= 3612.71676300578
##$SYMM= 0
##$S_DEV= 0
##$TDeff= 0
##$TDoff= 0
##$TI= <>
##$TILT= no
##$TM1= 0
##$TM2= 0
##$TOPLEV= 0
##$USERP1= <user>
##$USERP2= <user>
##$USERP3= <user>
##$USERP4= <user>
##$USERP5= <user>
##$WDW= 1
##$XDIM= 8192
##$YMAX_p= 0
##$YMIN_p= 0
$$ End of Bruker specific parameters
$$ ---------------------------------
##NTUPLES= NMR FID
##VAR_NAME=  TIME,          FID/REAL,        FID/IMAG
##SYMBOL=    X,             R,               I
##VAR_TYPE=  INDEPENDENT,   DEPENDENT,       DEPENDENT
##VAR_FORM=  AFFN,          ASDF,            ASDF
##VAR_DIM=   8192,          8192,            8192
##UNITS=     SECONDS,       ARBITRARY UNITS, ARBITRARY UNITS
##FACTOR=    0.0002496,     1,               1
##FIRST=     0,             0,               0
##LAST=      2.0444736,     0,               0
##MIN=       0,             -346862,         0
##MAX=       2.0444736,     331314,          0
$$ Real data points
##PAGE= N=1
##DATA TABLE= (X++(R..R)), XYDATA
$$ [...]
1885H25q46N37l13p2L51j00R6k69k99P78n10K64L94p67K14k79l57O39j04Rj40
$$ 825 -21 516 203 131 482 382 478 209 -90 688 178 442 836 69 283 4 -353 286 182 191 51
1906E1l03K38k94L73K60m34K00j07n07M11L06k09J28l17j37L93j49J58J11m98
$$ 51 -252 -14 -308 65 325 -109 91 -16 -523 -112 194 -15 113 -204 -341 52 -97 61 172 -326
1926c26J39j48Q5J07pN35m36k99L73K02m21N69l80M8j2l86N81M0k87R9j88QK91
$$ -326 -187 -335 -250 -143 -150 385 -51 -350 23 225 -196 373 -7 41 29 -357 224 264 -23 76 -112 -104 187
1949A87M9J60Rl55J55l20L20M94m27J98M5l22J11p5N2O2k47J80o65K42L07j90
$$ 187 236 396 405 50 205 -115 205 699 272 470 515 193 304 229 281 343 96 276 -389 -147 160 -30
1971c0K68J89j031N64K77p60P03J08k43J21n17L20o2J01j04k55L20l49J81J87
$$ -30 238 427 -604 -40 237 -523 180 288 45 166 -351 -31 -93 8 -96 -351 -31 -380 -199 -12
1991a2l70J26N60q62Q8Q00p10O28m14l97N39J8m50N21J20n70K91L6l4q3O01l80
$$ -12 -382 -256 304 -558 -470 330 -380 248 -166 -563 -24 -6 -456 65 185 -385 -94 -58 -92 -175 426 46
2013D6l69Q37n55J8R14p16r4M46r95P93N64j030M14L82o26l4M78J25k14K25j30
$$ 46 -323 514 -41 -23 891 175 81 527 -468 325 889 -141 273 655 29 -5 473 598 384 609 479
2034D79n98N90j18l70P11r7o19Q86q60j18J048p54l72Q45p88O0N58r3l01J1l16
$$ 479 -119 471 353 -17 694 597 -22 864 4 -114 934 180 -192 653 -135 -75 483 390 89 100 -216
2055b16Q1K71o1j66q5L23q54M74l4n38O92k97n55O69k66JK23m27J66J18l73L72
$$ -216 -135 136 75 -91 -176 147 -707 -233 -267 -805 -113 -410 -965 -296 -562 -561 -338 -765 -599 -481 -854 -482
2077d82k69J30J66k15k06m8N8J84k40L44k1k82J64J14o6L08l91L21O3m44M40J41
$$ -482 -751 -621 -455 -670 -876 -924 -866 -682 -922 -578 -599 -881 -717 -603 -669 -361 -752 -431 -368 -812 -372 -231
2099b31k01K91J84m70M46q3J00o1l83L30o5L84M04m15K64k6m86M73j14j73O70
$$ -231 -432 -141 43 -427 19 -64 36 -25 -408 -78 -143 241 645 230 494 468 -18 455 341 168 838
2120H38p85K59P44p74N99r9k08L67m43k8P0J61J79p8J5j96m2J78k78PM98m29l56
$$ 838 53 312 1056 282 881 782 574 941 498 470 540 701 880 802 817 621 579 757 479 486 984 555 199
2143A99Q52q13K52M0l13K39j9n33M81L28o18L2p6K80l89N99j64p02K42J54n58
$$ 199 1051 238 490 530 217 456 437 -96 385 713 95 127 51 331 -58 541 377 -325 -83 71 -487
2164d87M81m23R1N13m45l1K17n50O2L70r3O1j14o3J04L46j26k00k18L93k11K61
$$ -487 -6 -429 -338 175 -270 -301 -84 -634 -572 -202 -295 -234 -348 -411 -307 39 -87 -287 -505 -112 -323 -62
2186f2Jo62N93j20n14M73r9N6K79l39K32l6k66K66n5J49j68l81P11l83n1M60k87
$$ -62 -61 -723 -130 -250 -764 -291 -390 -334 -55 -394 -162 -198 -464 -198 -253 -104 -272 -653 58 -325 -376 84 -203
2209b03p6M61n65K23j21J13J30j89o6K72K02L0q2m28M81k41K0J36j33J1Q5l15
$$ -203 -279 182 -383 -160 -281 -168 -38 -227 -293 -21 181 211 129 -299 182 -59 -39 97 -36 -25 60 -255
2231b55L80j10J25K16n31L66j20J38N1QJ97j40m04M17l35j15P60n31J8K27n64
$$ -255 125 15 140 356 -175 191 71 209 260 268 465 325 -79 338 3 -112 648 117 135 362 -202
2252b02K63L37n33M82k08k99M28L4o7N3j26j67M29k44J71j57J26j76n01P72k33
$$ -202 61 398 -135 347 139 -160 268 302 235 288 162 -5 424 180 351 194 320 144 -357 415 182
2273A82j1L03m11J79L9l87M88k77m4K19l60K7J92l52K54J83k78L43l31k22L38
$$ 182 171 474 63 242 281 -106 382 105 61 280 -80 -53 139 -213 41 224 -54 289 -42 -264 74
2294G4l6j30L24l49q9K6j04N40n77K99l4l20O34o70P1J95j28L01j16k88M50k31
$$ 74 38 -92 232 -117 -206 -180 -284 256 -321 -22 -56 -376 258 -412 -341 -146 -274 27 -89 -377 73 -158
2316a58r6K43rJ8k74K64k06k24L50J95m51L81R1o07M31m9k04M68l25j44L31l99
$$ -158 -254 -11 -20 -2 -276 -12 -218 -442 -92 103 -348 33 124 -483 -52 -101 -305 163 -162 -306 25 -374
2338c74J40J03QK37n14L86k3l85M37j48j61O61l36l61K74j55L41K11m47J23j28
$$ -374 -234 -131 -123 114 -400 -14 -37 -422 15 -133 -294 367 31 -330 -56 -211 130 341 -106 17 -111
2359a11O6L67j88j67L2J52J2o3l7N7oL6K1k08L74n18N22j2n02N34J12m61N70p0
$$ -111 -45 322 134 -33 -1 151 163 100 63 120 114 150 171 -37 337 -181 341 329 -173 361 473 12 582 512
2383E12p59M01j34P8N5J27K4m35N30J06m39L92l87o2L80m29JK30m04K27J28k16
$$ 512 -247 154 20 98 153 280 304 -131 399 505 66 458 71 9 389 -40 -39 191 -213 14 142 -74
2405g4J08n4r8R8J60l3m3j64J02J59n6Q1m62K34r9m29O76k09M2K69n15J83M8l00
$$ -74 34 -20 -118 -20 140 107 64 -100 2 161 105 186 -276 -42 -141 -570 106 -103 -61 208 -307 -124 -76 -376
2429c76J82K95l47K39k81o9N13l24N6J9J73q9k19L79n3k15L86k98N0L17k88k9
$$ -376 -194 101 -246 -7 -288 -357 156 -168 -112 -93 80 -9 -228 151 98 -117 269 -29 21 338 50 21
2451B1K27j65j20J63k03J56j29j45L55l50L63L9l54M94k41q8N4k04N73k93l2N7
$$ 21 248 83 -37 126 -77 79 -50 -195 160 -190 173 212 -142 352 111 23 77 -127 446 153 121 178
2473A78L2L0N3j60jK73m86K76j19j54K35M5k90M70m63J65p6j23J83k04K63j71
$$ 178 210 240 293 133 132 405 -81 195 76 -78 157 202 -88 382 -81 84 8 -115 68 -136 127 -44
2495d4op1N6n7K23m67M41j60j89k02K09o8L57l45J84J91j75L6k20N7J64r1k9j5
$$ -44 -50 -121 -65 -122 101 -366 75 -85 -274 -476 -267 -335 22 -323 -139 52 -123 -87 -307 -250 -86 -177 -206 -221
2519b21k08K30r9OL19l72LP0j68J82O8m5Q6N3j0K65m10J58L6j87L81k22j34N79
$$ -221 -429 -199 -298 -292 27 -345 -342 -272 -440 -258 -190 -235 -149 -96 -106 159 -251 -93 -57 -244 137 -85 -219 360
2543C60n45K50n5j55K10N8k70L59j97P4K76m80J01J59L3l02m2M68p1k38K07k10
$$ 360 -185 65 10 -145 65 123 -147 212 15 89 365 -115 -14 145 178 -124 -166 302 231 -7 200 -10
2565a0L56j41k67K82J0O7R8J5l85K75k06k78L31J34N7m18O0J91j36j38L76k32
$$ -10 346 205 -62 220 230 297 395 410 25 300 94 -184 147 281 338 -80 -20 171 35 -103 273 41
2587D1K48m30K67L72o73K49K34m64M5J22k25L65m47M1P6k00J72J61j19J99r7n1
$$ 41 289 -141 126 498 -175 74 308 -156 -111 11 -214 151 -296 -255 -179 -379 -207 -46 -165 34 -63 -114
2609a14N2m1J4L6k94M69m46O8J12q1K04J49k95M86m06mJ1j35J96nM6K37j49Q7
$$ -114 -62 -103 -89 -53 -347 122 -324 -256 -144 -225 -21 128 -167 319 -87 -91 -80 -215 -19 -24 22 259 110 197
2633A97j07k32K44J7O1j3k99J90O1l06J75J93n12N04j55p9L79l23J40J41j85K1
$$ 197 90 -142 102 119 180 167 -132 58 119 -187 -12 181 -331 173 18 -61 318 -5 135 276 91 112
2655A12k00Q5J64R5j03K01l43o2Q2K54k24k29L32j35j8J71K60n12Q6Ok06J35M2
$$ 112 -88 -3 161 256 153 354 11 -51 31 285 61 -168 164 29 11 182 442 -70 16 22 -184 -49 -7
2678gK09k07j74J94k61J22mJ06L00k00j55l8o8l9K47j98k0L02l80K1Kj62O29k98
$$ -7 202 -5 -179 15 -246 -124 -128 -22 278 78 -77 -115 -183 -222 25 -173 -193 109 -271 -250 -248 -410 219 -79
2702g9j16J36l59M34J7J02k25j91M38k63l13O74m92m1M27l39M16j37k5Nj56Q0
$$ -79 -195 -59 -418 16 33 135 -90 -281 157 -106 -419 255 -237 -278 149 -190 226 89 64 69 -87 -7
2724gO2P0nJ47on4l36N7K26n8J07m6k27J96Q7j35N05p83K17J48J9J96n2l74J35
$$ -7 55 125 120 267 261 207 -129 -72 154 96 203 157 -70 126 213 78 583 -200 17 165 184 380 328 -46 89
2749H9j52L48k60J82O0q7l66J59R1K01k91L0K06k44r4L19k95K38k68Q6K18m03
$$ 89 -63 285 25 207 267 180 -186 -27 64 265 -26 4 210 -34 -128 191 -104 134 -134 -48 170 -233
2771b33K86qm70M67L6m12M54k54l9jJ5mj80OM59n3j10K64l41J32j6r0J65n2j86
$$ -233 53 45 -425 42 78 -334 120 -134 -173 -174 -159 -163 -343 -337 122 69 -41 223 -118 14 -2 -92 73 21 -165
2796a65N62m63J46P5k41R2J88r6J85m53K59L5l32M67k87J23O8k34J26k15K84K7
$$ -165 397 -66 80 155 -86 6 194 98 283 -170 89 124 -208 259 -28 95 163 -71 55 -160 124 151
2818A51K44m01K92j37k85L57l32L87Ln84L32K12k97J48j32j62K80q1K26k09J01
$$ 151 395 -6 286 149 -136 221 -111 276 279 -305 27 239 -58 90 -42 -204 76 -5 221 12 113
2839A13k46m3L28j88m3J66m3j86k49P20l06l8o7j23j97J18L31n56K67L8K15J17
$$ 113 -133 -176 152 -36 -79 87 44 -142 -391 329 23 -15 -82 -205 -402 -284 47 -509 -242 -204 11 128
2861A28m02L2K59k57J33k87L35r7O8j54p9k60M79m4n1R7K1j32L49l76k1O17m54
$$ 128 -274 -242 17 -240 -107 -394 -59 -156 -88 -242 -321 -581 -102 -146 -197 -100 -79 -211 138 -238 -259 358 -96
2884i6J95q0k67J64K8p2J08O2K76l07k6J91l04J38k3j77M93k56j94L88j1l15M63
$$ -96 99 19 -248 -84 -56 -128 -20 42 318 11 -15 176 -128 10 -13 -190 303 47 -147 241 230 -85 378
2907C78l92K49j72lJ24L4k24L30l23J34K25m6j36OP0k8N9j47J01k33J16M46n54
$$ 378 -14 235 63 60 184 218 -6 324 1 135 360 314 178 184 254 226 285 138 239 6 122 568 14
2930A4M01k50J9q9J5K94k54Q5q8j9j51J34j33K57k97J77N3l75J95M6j38P6N0l09
$$ 14 415 165 184 95 110 404 150 235 147 128 -23 111 -22 235 -62 115 168 -207 -12 34 -104 -28 22 -287
2954b87K37j84K98l26Q4M4Q7J47k1m21K35J97m67K97j38J73M5l50K22J19k07J07
$$ -287 -50 -234 64 -262 -178 -134 -47 100 79 -342 -107 90 -377 -80 -218 -45 0 -350 -128 -9 -216 -109
2976a09L9P1j0j24kj81L33j88O7k14L10j04n2K00j28j2r4JJ73j74J0K88j84k33
$$ -109 -70 1 -9 -133 -135 -316 17 -171 -104 -318 -8 -112 -164 36 -92 -104 -198 -197 -24 -198 -188 100 -84 -317
3000c17J49K31K19l49N1M7q9M3j52j4J10L90m97K28n6K84j22k43J03O3j26J71
$$ -317 -168 63 282 -67 -16 31 -58 -15 -167 -181 -71 319 -178 50 -6 278 156 -87 16 79 -47 124
3022A24l29L94R5n29N53j52k27J08R2j16J45j50J35l49N76m42j11j0L86l23J80
$$ 124 -205 189 284 -245 308 156 -71 37 129 13 158 8 143 -206 370 -72 -183 -193 193 -130 50
3043E0k10J08oj43O7K09o3J17l72J02L95k61J35l03R5K68k28j38J84J61J43k16
$$ 50 -160 -52 -58 -201 -134 75 12 129 -243 -141 254 -7 128 -175 -80 188 -40 -178 6 167 310 94
3065I4oP6k25R0N69n12M6k8l06Q9p4NK14r7K42J93m87L70k97j2L18on37L60r5
$$ 94 88 164 -61 29 598 86 132 104 -202 -113 -187 -182 32 -65 177 370 -117 253 -44 -56 262 256 -281 79 -16
3090a6l8L28l54L0j07K3L50l26J82k72K16j04j0j96Q0k9N29l44m9k33j91O52O5
$$ -16 -54 274 -80 -50 -157 -134 216 -110 72 -200 16 -88 -98 -294 -214 -243 286 -58 -107 -340 -531 121 186
3113A86j21o9J83n33J68J38k74M29m9k70K94K7j75M5l1J03k76J26Q3k47J30j5
$$ 186 65 -4 179 -354 -186 -48 -322 107 58 -212 82 109 -66 -21 -52 51 -225 -99 -16 -263 -133 -148
3135a48n4L09k15K27Pk47l6L70m72M11n00J43M7q8J90o4J74K26m51o5J93k28L63
$$ -148 -202 107 -108 119 126 -121 -157 213 -259 152 -348 -205 -158 -246 -56 -120 54 280 -171 -236 -43 -271 92
3158I2o0l27L03j97j08K96o0K75Ol96J55J1n9J16O5j72q2N3L43j68r5J50j46L61
$$ 92 32 -295 8 -189 -297 -1 -61 214 220 -176 -21 -10 -69 47 112 -60 -142 -89 254 86 -9 141 -5 356
3182C56l30k09M00K3j02n8j87J56k8J65kkN8p9Q1k06K53j48j39J33k12K57l07
$$ 356 26 -183 217 240 138 80 -107 49 21 186 184 182 240 161 242 36 289 141 2 135 -77 180 -127
3205a27J22j4k83L81L9k13J56j09L3L15l21K05k60L2J28k03pL24l39K32o3j39
$$ -127 -5 -19 -302 79 118 -95 61 -48 -15 300 -21 184 -76 -44 84 -119 -126 198 -141 91 28 -111
3227a11N12l83J11m2m18M31j13J8N5j71J31j79K31j45j31q0L62n9R9j92j25J91
$$ -111 401 18 129 87 -331 100 -13 5 60 -111 20 -159 72 -73 -204 -284 78 19 118 -74 -199 -8
3249hn1P8J59m17N33k77j86K48j37o8K86k53k55N66m12J0M61k71J43r7P8j30m6
$$ -8 -59 19 178 -239 294 17 -169 79 -58 -126 160 -93 -348 218 -194 -184 277 6 149 52 130 0 -46
3272d6Q5q9L6R8k45L59j40j69l1J26j49J41K75m44M70l01p6J87r4O7q7J35K60
$$ -46 39 -50 -14 84 -161 198 58 -111 -142 -16 -165 -24 251 -193 277 -24 -100 87 -7 60 -27 108 368
3295C68m12n7p2m6M0J57o2J63k54P3M44l32K83q4l22J30Kq9J30m16L61J18k49
$$ 368 -44 -101 -173 -219 -179 -22 -84 79 -175 -102 342 10 293 209 -113 17 19 -70 60 -356 5 123 -126
3318a26K14k42J36L22l78J98j61j64L06n43J86KL3L38k13L06j42k71J52J63j66
$$ -126 88 -154 -18 304 -74 124 -37 -201 105 -438 -252 -250 -217 121 -92 214 72 -199 -47 116 -50
3339e0P3k83K03K6j90N00j43j23N7k07j41L86j62j7K93k90q4L47k38J30k96J69
$$ -50 23 -260 -57 -31 -221 279 136 13 70 -137 -278 108 -54 -71 222 -68 -152 195 -43 87 -209 -40
3361d0J84J24k24N0J0n8j16O2K32n7j6m0j83K62m3J66k72j6K9n1J96Q9k90k36
$$ -40 144 268 44 94 104 46 -70 -8 224 167 151 111 -72 190 147 313 41 25 54 3 199 288 -2 -238
3385b38K78J06j02j12j74O54k21k30K61l86K29J38k74M8k02K03L04l03MQ4k4J7
$$ -238 40 146 44 -68 -242 412 191 -39 222 -164 65 203 -71 -23 -225 -22 282 -21 -17 67 43 60
3407F0Q6j4k55k01J93J85k26J73K0k55%Q8o3j4k0L08k77J29J9P7j84q4K8L62l17
$$ 60 146 132 -123 -324 -131 54 -172 1 21 -234 -234 -146 -209 -223 -243 65 -212 -83 -64 13 -171 -255 -227 135 -182
3432a82J4K39p1Q7J8j10j43J60l27M80j90j2K86j90J48l99J89K62r3K27k47k54
$$ -182 -168 71 0 87 105 -5 -148 12 -315 165 -25 -37 249 59 207 -192 -3 259 166 393 146 -108
3454a08n5L97j09k5j73J32q3j23K06n6J9J54j18K55k23j61M8J32k56N16m59O2
$$ -108 -163 234 125 100 -73 59 -24 -147 59 3 22 176 58 313 90 -71 -23 109 -147 369 -90 -28
3476b8K20k91J97j70j16L37J8n02L02N5j79N39o45K35J03k03P7j42J16J28j09
$$ -28 192 -99 98 -72 -188 149 167 -335 -33 22 -157 382 -263 -28 75 -128 -51 -193 -77 51 -58
3497e8J13k88J79k7l54L41k9p8J41j6J9L77n39M02m19n7K05J0q9L63j86k82L63
$$ -58 55 -233 -54 -81 -435 -94 -123 -201 -60 -76 -57 320 -219 183 -236 -293 -88 -78 -167 196 10 -272 91
3520I1m36M09J74k08M3P8O8M4j36l22J56j74K11J57m02M07j86J12R3k96L67l41
$$ 91 -345 64 238 30 73 151 219 263 127 -195 -39 -213 -2 155 -247 160 -26 86 179 -117 250 -91
3542i1J25K28l14R6k11K01J12j63k67M57j19K8J78j45J40n4J16J4j40J65k38j21
$$ -91 34 262 -52 44 -167 34 146 -17 -284 173 54 82 260 115 255 201 317 331 191 356 118 -3
3564cK39m24K72j54J29K35m07Q4J38J08k79K12j23J95Q3l53K78j17j82J88k30
$$ -3 236 -188 84 -70 59 294 -113 -29 109 217 -62 150 27 222 305 -48 230 113 -69 119 -111
3585a11K77l06J21L35l67P1L84m50L14j51m41L93k50J30N5j8j8lj42J16J06k12
$$ -111 166 -140 -19 316 -51 20 404 -46 268 117 -324 69 -181 -51 4 -14 -32 -35 -177 -61 45 -167
3607a67K14k55L8J64r2R5k73M00j3k01k41J02L0J23pK13l17R4K8J81k45k8J63
$$ -167 47 -208 -170 -6 -98 -3 -276 124 111 -90 -331 -229 -199 -76 -83 130 -187 -93 -65 116 -129 -157 6
3630Fq7J96m0O8Pl38M60l41r6M72k89j58M72l36j1J93j62PN1j97L84l09L74k85
$$ 6 -81 115 75 143 150 -188 272 -69 -165 307 18 -140 332 -4 -15 178 16 23 74 -123 261 -48 326 41
3654D1n4J16q8L45j49k61J33J35n6q5l36L70n3o3p0J09j26J18p8J10O9k70O3K97
$$ 41 -13 103 15 360 211 -50 83 218 162 77 -259 111 58 -5 -75 34 -92 26 -52 58 127 -143 -80 217
3678B17k07J58j44k53K15r9J36k0j79L62k87O2Q7l00K21J87k41K65j44k00R7J54
$$ 217 10 168 24 -229 -14 -113 23 3 -176 186 -101 -39 48 -252 -31 156 -85 180 36 -164 -67 87
3700H7j67J92j14L0l91L54P2k15J8n3l2M7J05NL55k86j90N2L02j35k70K56J64
$$ 87 -80 112 -2 28 -363 -9 63 -152 -134 -187 -219 -172 -67 -62 293 7 -183 -131 171 36 -234 22 186
3723A86k45K13O8K3j78q0Q7J3J8j01K89k50n3J11l8J04k07M5N1k64L29K65n37
$$ 186 -59 154 222 245 67 -13 74 87 105 4 293 43 -10 101 63 167 -40 5 56 -208 121 386 -151
3746a51M07j63J9J68n69M28oQ7Qj25o0K63j10r2Q3m23j5L50mj14j47k9K57j33
$$ -151 256 93 112 280 -289 139 133 220 228 103 43 306 196 104 187 -236 -251 99 95 -19 -166 -195 62 -71
3770g1J67j22J87L9j58k16j00jR3J72R7K31l89k29J77j48J25J5R8K0m9M8m6j06
$$ -71 96 -26 161 200 42 -174 -274 -275 -182 -10 87 318 -71 -300 -123 -271 -146 -131 -33 -13 -62 -14 -60 -166
3794a66M9j69K82J09j90K58l25N09o16L16j68K82j26J12q9j31l02K40Q1L65l82
$$ -166 -117 -286 -4 105 -85 173 -152 357 -259 57 -111 171 45 157 68 -63 -365 -125 -44 321 -61
3815f1J42pj3Jk9q1J97j95p7K53k75M85l97r2K75k10K83r6M1j69M9j74L73k7j61
$$ -61 81 74 61 62 33 -48 149 -46 -123 130 -145 340 -57 -149 126 -84 199 103 144 -25 24 -150 223 196 35
3840C5j55L97l47J41p7j41l5K78L4m25K59j05K11M5j07j11J85l40J84R2p2Q4k07
$$ 35 -120 277 -70 71 -6 -147 -182 96 130 -295 -36 -141 70 115 8 -103 82 -258 -74 18 -54 30 -177
3863a77N7K71l75K02k86K61J46k4j4P8n5j68rj53L38o38N73P9m07M74j22l58O34
$$ -177 -120 151 -224 -22 -308 -47 99 75 61 139 84 -84 -93 -246 92 -546 27 106 -301 173 51 -307 327
3886C27l28q4K91k96j00N2K0P3Q5j15J86l00K32J04k13L37m29P9L55m57Q7K91
$$ 327 -1 -85 206 -90 -190 -138 -118 -45 40 -75 111 -189 43 147 -66 271 -158 -79 276 -181 -94 197
3908A97m22J37M14j45p1L90m54K51l65L61N5k80J58r1J0P6k18k9K39m18K32LQ7
$$ 197 -225 -88 326 181 110 500 46 297 -68 293 348 68 226 135 145 221 3 -26 213 -205 27 30 117
3931A17K3N9k75K72k19M37o62L25r2q3Q6Q6k62L01m46J20K24j88L9K52m30L65
$$ 117 140 199 -76 196 -23 414 -248 77 -15 -98 -12 74 -188 113 -333 -213 11 -177 -138 114 -316 49
3953D9j42J06J49p01M16K25l18L10l41R7J49l04L18j35k69K23M6J5Q8k39Q9M12
$$ 49 -93 13 162 -539 -123 102 -216 94 -247 -150 -1 -305 13 -122 -391 -168 -122 -107 -19 -258 -169 243
3975B43j75j86j8j5L40m75L38q6j80O9J20n7K20m79M77j07j88J20r1O1R0j60K19
$$ 243 68 -118 -136 -151 189 -286 52 -34 -214 -145 -25 -82 138 -341 136 29 -159 -39 -130 -69 21 -139 80
3998H0J0K63k63k60K6J74PK6qj64J16l8J26J45j75K79r3l09L35j71k45L66j90
$$ 80 90 353 90 -170 -144 30 37 63 55 -109 7 -31 95 240 65 344 251 -58 277 106 -139 227 37
4021C7J52j95j05K47q8l8J57O0r8k47K74O2j60j59J13j62K50j53k57N39l56k70
$$ 37 189 -6 -111 136 48 10 167 227 129 -118 156 218 58 -101 12 -150 100 -53 -310 229 -127 -397
4043c97L48j0J08k29L37j09j46J9Q0q8P8j44J03J1P0l12K58m6r3J01O2Q7q2l43
$$ -397 -49 -59 49 -180 157 48 -98 -79 1 -87 -9 -153 -50 -39 31 -281 -23 -69 -162 -61 1 88 6 -337
4067c37K44O0M1q0m2K82k98R9K14k05J28j81J26j6K17m02Q5j24J58j5K0K9o5K84
$$ -337 -93 -33 8 -72 -114 168 -130 -31 183 -22 106 -75 51 35 252 -150 -65 -189 -31 -46 -26 3 -62 222
4091B22j28N2p7J62k26N4J54k44L6J32K4M2oj77L06k25J28j37j31l6K15p3J8j26
$$ 222 94 146 69 231 5 59 213 -31 5 137 161 203 197 20 326 101 229 92 -39 -75 140 67 85 -41
4115d1R3M9k64M45k27p7J23l48L22k66n2M67j90m8O5Pm1j88R1L14l13Q8l4j53
$$ -41 52 101 -163 282 55 -22 101 -247 75 -191 -243 224 34 -14 51 58 17 -171 -80 234 -79 9 -25 -178
4139a78J45j47r7K28n3qJ10k42J07m5P6r0Q7k83K35Q5J11O1k29j42J63r1J81l19
$$ -178 -33 -180 -277 -49 -102 -110 0 -242 -135 -180 -104 -194 -107 -390 -155 -70 41 102 -127 -269 -106 -197 -16 -335
4163c35L77q7R6N6l17J64M3L3k91M90l64L91l83K11j88m8K70o6qK03j95j61M57
$$ -335 42 -45 51 107 -210 -46 -3 30 -261 229 -135 256 -127 84 -104 -152 118 52 44 247 52 -109 348
4186C48l30J28j31P5J7j8p8J17o4j58q8K33J45j86L8K04m55K18mk25L98j85l5
$$ 348 18 146 15 90 107 89 11 128 64 -94 -182 51 196 10 48 252 -203 15 11 -214 184 -1 -36
4209c6K64j39J88l29j18K84k15o1K22J4k51J05k5R1p6J26k79Q1J62k51J73L3j24
$$ -36 228 89 277 -52 -170 114 -101 -162 60 74 -177 -72 -97 -6 -82 44 -235 -154 8 -243 -70 -37 -161
4232a61N6m6k4J72q7J2M5k38q5O22l01j66K96k72J27j3j6K25K9m9J5m67L13P3
$$ -161 -105 -151 -175 -3 -90 -78 -33 -271 -356 266 -35 -201 95 -177 -50 -63 -79 146 175 126 141 -326 -13 60
4256F0j59K67k90L61m47J61L6j6j69R7J2J16J34j26j90O0J06K29j10k54j23O5
$$ 60 -99 168 -122 239 -208 -47 -11 -27 -196 -99 -87 29 163 37 -153 -93 13 242 132 -122 -245 -180
4278a80J94J07k77K65j77J48J69L0k11n6k1J20O5k04K74j39N7j56K96j1k60l07
$$ -180 14 121 -156 109 -68 80 249 279 68 12 -9 111 176 -28 246 107 164 8 304 293 33 -274
4300b74K37K36m2L6l72N78n28j40K79j60L17m89n5K72m4J08O4k20M1j53N8j3J37
$$ -274 -37 199 157 193 -179 399 -129 -269 10 -150 167 -322 -377 -105 -149 -41 23 -197 -156 -309 -251 -264 -127
4323a27rM54n33J92n4N4K20k24k49J91L1J49k95K32J94k74J20N1l33P9L78l19
$$ -127 -136 318 -215 -23 -77 -23 197 -27 -276 -85 -54 95 -200 32 226 -48 72 123 -210 -131 247 -72
4345g2K56n9k70j4K44j16J47N8L6n8l42M35j07Jj57j7j52K23J10j44j91M67j84
$$ -72 184 125 -145 -159 85 -31 116 174 210 152 -190 245 138 139 -18 -35 -187 36 146 2 -189 278 94
4368I4j0j26m4M14k38N3M1K3k38J32J26m08J90J90l25N4K13L0L2j85j39J55K0
$$ 94 84 -42 -86 328 90 143 184 207 -31 101 227 -181 9 199 -126 -72 141 171 203 18 -121 34 54
4391E4j44r1L26m34J82K72q5r6k2K47K15k29n57J21L20j21L76j84n5l1k32J93
$$ 54 -90 -181 145 -289 -107 165 80 -16 -38 209 424 195 -362 -241 79 -42 334 150 95 64 -168 25
4413B5J29l28M41m30M3R4j05M38n06R9J85m74L52mj23L01l6j9j39J38l30M03j43
$$ 25 154 -174 267 -163 -120 -26 -131 307 -199 -100 85 -389 -37 -41 -164 137 101 82 -57 81 -249 154 11
4436A1N1q0q2k6O1j3J86M4l07J23N0J63j03k9j65J03J29n5p2j5N6jj14P1J48N4
$$ 11 62 -18 -100 -126 -65 -78 108 152 -155 -32 18 181 78 49 -116 -13 116 61 -11 -26 30 29 -85 -14 134 188
4462A88m02L21j79k24K82k18L63M9P1j68j74N7K80k01R3N1j82j3n9j24L79k84
$$ 188 -214 107 -72 -296 -14 -232 131 180 251 83 -91 -34 246 45 138 189 7 -6 -65 -189 190 -94
4484i4l3L33m29K33j5L0O6j37j34q8L82J10j79O9n3L0k62K14j14K05l10J28K54
$$ -94 -127 206 -223 10 -5 25 91 -46 -180 -268 114 224 45 114 61 91 -171 43 -71 134 -176 -48 206
4507B06k85p4J70K13k07Q6j43J21j27j01Q6O7k26J42J47l09L61k85r2K66p6L21
$$ 206 -79 -153 17 230 23 109 -34 87 -40 -141 -55 12 -214 -72 75 -234 127 -158 -250 16 -60 261
4529B61j72n7J1j21J12j9J71J5j14J9l78L39j3l9K86K1m23K81k66J15l8j28J43
$$ 261 89 32 43 -78 34 15 186 201 87 106 -272 67 54 15 301 322 -101 180 -86 29 -9 -137 6
4552Fj44K38j73o1K28j24j55J59J17j28J29l11J47J59k8k28L55j43J33l38J0j
$$ 6 -138 100 -73 -134 94 -30 -185 -26 91 -37 92 -219 -72 87 59 -169 186 43 176 -162 -152 -153
4574a53j02K09J56k77M45m95K02jq4K86k79q1R7j03j94M06m0M4m4j16J75k70K1
$$ -153 -255 -46 110 -167 278 -217 -15 -16 -100 186 -93 -174 -77 -180 -374 32 -8 36 -8 -124 51 -219 -198
4597a98J30j4l2J57l02oL69p1j75m2j2M54l55JO5K58k52j49J39L9J07o9K70j1
$$ -198 -68 -82 -114 43 -259 -265 104 33 -142 -184 -196 258 -97 -96 -31 227 -25 -174 -35 4 111 42 312 301
4621C01l56n1K45o8k60J07P3R4J47j61l8JO6J16j82o7M05l48J53P4p3l21K53j18
$$ 301 -55 -106 139 71 -189 -82 -9 85 232 71 33 34 100 216 34 -33 372 24 177 251 178 -143 110 -8
4645hJ45m0J27j4m30L61k66O3n4j0M6J17J10qm47J74rK03j42lJ5K30j93k45L97
$$ -8 137 97 224 210 -220 141 -125 -62 -116 -126 -80 37 147 139 -308 -134 -143 60 -82 -85 -70 160 -33 -278 119
4670A19j24j7j53K38l04m7J82L59l93k06L62k8J98k45k01J55O0L4J22j16p0K9
$$ 119 -5 -22 -175 63 -241 -288 -106 253 -140 -346 16 -12 186 -59 -260 -105 -45 -11 111 -5 -75 -46
4692d6k46L64j52j59R2N11l97N3J79m59L43k81J58j29N8J7n7J90k2j23n1J85K9
$$ -46 -292 72 -80 -239 -147 364 -33 20 199 -260 83 -198 -40 -169 -111 -94 -151 39 17 -106 -157 28 57
4715E7j78L16n1k96J31J08M4q5r3N9J84j78L84k93r2r8K14k94J52K26l60L13j25
$$ 57 -121 195 144 -152 -21 87 131 46 -47 12 196 18 402 109 17 -81 133 -161 -9 217 -143 170 45
4738D5l1J19q9K5P8k50M7o6J53J00l13K28K9p9J83k89q9L18k0L7j82j33kJ96L7
$$ 45 14 133 44 69 147 -103 -56 -122 31 131 -182 46 75 -4 179 -110 -199 119 99 136 -46 -179 -181 15 52
4763E2j32J19j67r4K09J70j98P5q8n9J56Nj63K53k32p9l1K2NK59k18M5M8O3o7
$$ 52 -80 39 -128 -222 -13 157 -41 34 -54 -113 43 48 -115 138 -94 -173 -204 -182 -177 82 -136 -91 -43 20 -47
4788d7m1J45j56j53K64j00QK03j51j1J83r2J89k59J38L6j87Q9m0j33L2j4L29p9
$$ -47 -88 57 -99 -252 12 -88 -80 123 -28 -39 144 52 241 -18 120 156 -31 58 18 -115 -83 -97 232 153
4812A53r1J05J51l95Q1k09J96L9J26J40J6l92K81Rj41J48j98L3k7q3L62k38L26
$$ 153 62 167 318 -77 4 -205 -9 30 156 296 312 -80 201 210 69 217 19 52 25 -58 304 66 392
4835C92l72j00L9K12k79Q2J57j87K69P4m10K49j97J71J11j88n4Kr2L50l65j46
$$ 392 20 -80 -41 171 -108 -26 131 -56 213 287 -123 126 -71 100 211 23 -31 -29 -121 229 -136 -282
4857b82J55j86M78k76n4J95j56j11K20j76J19J05l5M5j52O0j9k03M05q0l76L13
$$ -282 -127 -313 165 -111 -165 30 -126 -237 -17 -193 -74 31 -4 41 -111 -51 -70 -273 132 52 -324 -11
4879a1J59l7j85l9K50j52k17M31j02k78Q1L27k92N7j1L0J62j28Lk38K46J86l39
$$ -11 148 111 -74 -113 137 -15 -232 199 97 -181 -100 227 -65 -8 -19 11 173 45 48 -190 56 242 -97
4902i7L2R5j03n9J21R9j61K10l18J55J07m9j85J37J02j50K35n6j0q5j89J90l4
$$ -97 -65 30 -73 -132 -11 88 -73 137 -181 -26 81 32 -153 -16 86 -64 171 115 105 20 -169 21 -13
4925a3j82K42k34K40O9j68L06R6m36K02p8l78K97jj88K09j04J14j33L56q3k11
$$ -13 -195 47 -187 53 122 -46 260 356 -80 122 44 -334 -37 -38 -226 -17 -121 -7 -140 216 133 -78
4947g8L02l49j06L63p9r0K2J44j08j67qRJ6L48j94p5J46J80k31J18k85L22j34
$$ -78 224 -125 -231 132 53 -37 -15 129 21 -146 -154 -145 -129 219 25 -50 96 276 45 163 -122 200 66
4970F6j03K07P3ql98J58j19L4J7J96j5j23r1M0K52k29j64M11J0m64L58N4n6J12
$$ 66 -37 170 243 235 -163 -5 -124 -90 -73 123 108 -15 -106 -66 186 -43 -207 204 214 -250 108 162 106 218
4994B18n30M57j58J85l43M14k95K29Nk33M06k56o6K37l87JK29K6k2m1J2j31j31
$$ 218 -312 145 -13 172 -171 243 -52 177 182 -51 355 99 33 270 -117 -116 113 139 117 76 88 -43 -174
5017a74K99j33Mk1k25L78k20K20j89Q2k8L14l47JJ75Lk42Q7K4K62m20J3j08K31
$$ -174 125 -8 -4 -25 -250 128 -92 128 -61 21 -7 307 -40 -39 136 139 -103 -16 8 270 -150 -137 -245 -14
5041a4J3j07K7L5J12O6l10J1m6j08K95R5k03L20k31j26K64P8p4p8k5N0J45n9j54
$$ -14 -1 -108 -81 -46 66 132 -178 -167 -213 -321 -26 69 -134 186 -45 -171 93 171 97 19 -6 44 189 130 -24
5066b4q9J92q1K65j2k60n2O7k0j24L82k87j63M32j45K4j66J05L8j4j18L56k38
$$ -24 -113 79 -2 263 251 -9 -61 6 -14 -138 244 -43 -206 226 81 105 -61 44 82 68 -50 306 68
5089F8O0K43j11j8k06K2R6l50N4P1L90l28j36K39J89m55L46q1J2m6o3j84L34j59
$$ 68 128 371 260 242 36 58 154 -196 -142 -71 319 -9 -145 94 283 -172 174 93 105 59 -4 -188 146 -13
5113a3J71r8l27K58n2j3K08k29m4PJ2o2K23j29K4J67k8Nn5j18K16m0j88q1N4k6
$$ -13 158 60 -267 -9 -61 -74 134 -95 -139 -132 -120 -182 41 -88 -64 103 75 80 25 -93 123 83 -105 -186 -132 -158
5139a58R0J52K4j62L9j08K05k51K83p2j55L28j25k4O8m7j7lO4n9j91L0J41k2k8
$$ -158 -68 84 108 -54 -15 -123 82 -169 114 42 -113 215 90 66 134 87 70 67 131 72 -119 -89 52 30 2
5164BJ15j15Q1n3n6K58q2j30J74k4k06L63m88L61j06K9j08N0j12R9l49M35j21
$$ 2 117 2 83 30 -26 232 150 20 194 170 -36 327 -161 200 94 123 15 65 -47 52 -297 138 17
5187A7k43M41m8j56j43K37k47O8M4KJ22o8M4j3K5j36N4J2n6k1L1k2N9j20L21k36
$$ 17 -226 215 167 11 -132 105 -142 -74 -30 -28 94 26 70 57 82 -54 0 12 -44 -65 -34 -56 3 -117 204 -32
5213c2k0J28P4k46O3o3K35k15J12p6K02j91k10M77j78k43j07J07J22q9L69j7m66
$$ -32 -52 76 150 -96 -33 -96 139 -76 36 -40 162 -29 -239 238 60 -183 -290 -183 -61 -150 219 202 -264
5236b64L23l60J71L5J89j13j24K59j08k0p9M8n1L48j46j58K32l16L93j0k39K2
$$ -264 59 -301 -130 -95 94 -19 -143 116 8 -12 -91 -43 -94 254 108 -50 182 -134 259 249 10 32
5258C2k1K58k53kJ34J49m05l5K91k63J93Qq7j01j41L76J30Ll69Q1k00M35j90j9
$$ 32 11 269 16 14 148 297 -108 -143 148 -115 78 86 -1 -102 -243 133 263 266 -103 -22 -222 213 23 4
5282DM9l50K76Kj40N3R5N7J51j64J2J3l52M37l07N0J16J85r4k8k7j54K35k07j5
$$ 4 53 -297 -21 -19 -159 -106 -11 46 197 33 45 58 -294 143 -164 -114 2 187 93 65 38 -116 119 -88 -103
5307a03J02J18o2k0j1r2m4K79m52J88K26k29P4Q9J41k47O9J9k67K53J10kq7k22
$$ -103 -1 117 55 35 24 -68 -112 167 -285 -97 129 -100 -26 63 204 -43 26 45 -222 31 141 139 52 -170
5331a70J41J33k8j17K13P7j74j16K79j40N4j61K03m63M94L5j59k35k7J10R3J12
$$ -170 -29 104 76 -41 172 249 75 -41 238 98 152 -9 194 -269 225 260 101 -134 -161 -51 42 154
5353A54M5k1l66L55M7j8l69J79j79J84j06J44m3K85j91j51K4k19K99m7j51j2L3
$$ 154 199 178 -188 167 214 196 -173 6 -173 11 -95 49 6 291 100 -51 -27 -246 53 6 -145 -157 -124
5376a24q2K34P7k16K96K10l73n3J99j85r3J32j94J11k11J46P5R5l8k69K62j79
$$ -124 -206 28 105 -111 185 395 22 -31 168 -17 -110 22 -172 -61 -272 -126 -51 44 6 -263 -1 -180
5398a80K75l19M52k77m6j56R4J15j41L66k86J14J02l36K60O1l84K99K05k36o1
$$ -180 95 -224 228 -49 -95 -251 -157 -42 -183 183 -103 11 113 -223 37 98 -286 13 218 -18 -79
5419g9P9KJ2n7O5J25k2p6j5R6l8q6J05p1j00K7M5QM5j09L07j21m06M33l12L03
$$ -79 0 2 14 -43 22 147 125 49 34 130 92 6 111 40 -60 -33 12 20 65 -44 263 142 -264 169 -143 160
5445A60j62rJ35J00r6q7rj26K01K31k78K86l8k00k14J41j3M7J9j22o9J74Qj80
$$ 160 -2 -11 124 224 128 41 32 -94 107 338 60 346 308 108 -106 35 22 69 88 -34 -103 71 79 -101
5469a01K63j45k24K13j02P2J34O8j61k1j28L4Q5r8J43J7Q3k21P0o3k18L65j19
$$ -101 162 17 -207 6 -96 -24 110 178 17 -4 -132 -98 -13 -111 32 49 132 -89 -19 -82 -300 65 -54
5492e4P3n5j10P2Q4j60j49N30k19j7k8n9J48p0K47l80q6K07J89j29L97l76j09
$$ -54 19 -36 -146 -74 10 -150 -299 231 12 -5 -33 -92 56 -14 233 -147 -233 -26 163 34 431 55 -54
5515e4Q2J73l45J59K15m17K20n7J02r6K19q9j39J35m3j09J7k32J90k1j22L41R4
$$ -54 28 201 -144 15 230 -187 33 -24 78 -18 201 112 -27 108 65 -44 -27 -259 -69 -90 -212 129 223
5538B23l37J84K44j43O0q2j56j7j4N6m5k83L39p8J22om9j18k29J99K82l9l43K24
$$ 223 -114 70 314 171 231 149 -7 -24 -38 18 -27 -310 29 -49 73 67 18 -100 -329 -130 152 113 -230 -6
5562fp1k02K56j2po6LJ59j98m7J55l40M50Ql01K2N43k23o6j65j06QO0J44o2K09
$$ -6 -77 -279 -23 -35 -42 -108 -105 54 -144 -191 -36 -376 74 82 -219 -197 346 123 57 -108 -214 -206 -146 -2 -64 145
5588A45j74k96K72j8L95l78j55M11j63M4p7R4j10j66L82j80j99J76K13pm13J00
$$ 145 -29 -325 -53 -71 324 -54 -209 202 39 83 6 100 -10 -176 206 26 -173 3 216 209 -204 -104
5610a04K8m9J92N4j30O1P9j85J5R7NK2M3j62n9J68j7J2j59K09K8k15Q6q7M9J83
$$ -104 -76 -125 67 121 -9 52 131 -54 -39 58 63 85 128 -34 -93 75 58 70 -89 120 148 -67 19 -68 -19 164
5636A64n13L23K9R8j02J3j57J22J02l36K68k77L83k00p0Q9N7J20l16R9M1J9q0
$$ 164 -349 -26 3 101 -1 12 -145 -23 79 -257 11 -266 117 -83 -153 -64 -7 113 -203 -104 -63 -44 -124
5659a24J4j4J71l15j00K60J40j66J72k65L35j90M9M4J75p6j0l09O7Mn2J71J02
$$ -124 -110 -124 47 -268 -368 -108 32 -134 38 -227 108 -82 -33 11 186 110 100 -209 -142 -138 -190 -19 83
5682H3k21j24L15j31K08p1nJ43j33J36K0k49l8K6P3o2m03M41L48j63m09K53j01
$$ 83 -138 -262 53 -78 130 59 54 197 64 200 220 -29 -67 -41 32 -30 -433 8 356 193 -216 37 -64
5705f4r1L21j65j07L02J82l15L50m95L35k65J60r9O0p7m3J13J62j68k3r0l3L38
$$ -64 -155 166 1 -106 196 378 63 413 -82 253 -12 148 49 109 32 -11 102 264 96 73 -17 -50 288
5728B88m40K45k53J35L43m22L14l43m7K65l50K25J65qq3R9k01J72J8l27j36K50
$$ 288 -152 93 -160 -25 318 -104 210 -133 -180 85 -265 -40 125 117 34 133 -68 104 122 -205 -341 -91
5750i1J81m44R4K39k0j3Q0J0j74J06O6J28l89LJ35O1p0lJ27k95L96o1j8J62l12
$$ -91 90 -354 -260 -21 -41 -54 26 36 -138 -32 34 162 -227 -224 -89 -28 -98 -101 26 -269 127 66 48 210 -102
5775a02J56n8l4p5J02J98j50Oj54o6L61j22R6k21M13j36j34k38J10j92L64o1j00
$$ -102 54 -4 -38 -113 -11 187 37 43 -111 -177 184 62 158 -63 350 214 80 -158 -48 -240 124 63 -37
5798c7R7O7k49J74k86K75P4k7kj72J56j42K27j81N1j51j13J69J96Q1j69P6J14
$$ -37 60 127 -122 52 -234 41 115 88 86 -86 70 -72 155 -26 25 -126 -239 -70 126 207 38 114 228
5821B28k74O7q7P6L0Nj11m5O6k6l0j31K33k31K62k5K95o23J18L2L22r9l13K30
$$ 228 -46 21 -66 10 40 45 -66 -111 -45 -71 -101 -232 1 -230 32 7 302 -321 -203 -171 151 52 -261 -31
5845c1M4q8J13m8o9K53l72J31q5K22O8l28m4K81m6j7N8n6J26j80K12k78P9Q7k65
$$ -31 13 -75 38 -10 -79 174 -198 -67 -152 70 138 -190 -234 47 1 -16 42 -14 112 -68 144 -134 -55 32 -233
5870b33M07m07M05l5m4q8J17j04k5L02l18P7L17m05L47l14J0L2J28J42m49J96
$$ -233 174 -233 172 137 93 5 122 18 -7 295 -23 54 371 -34 313 -1 9 41 169 311 -138 58
5892E8J14j80J11m3K8l54L68j55J98j67l98L78P8j32oJ22l9O9o0K93j96J23k80
$$ 58 172 -8 103 60 88 -266 102 -53 145 -22 -420 -42 36 -96 -102 20 -19 50 -10 283 87 210 -70
5915g0J62J5l7j94r%q3J47q1j52K47p3J48J7k22L10l56L27j81o2R9j01o5L50j22
$$ -70 92 107 70 -124 -133 -133 -216 -69 -150 -302 -55 -128 20 37 -185 125 -231 96 -85 -147 -48 -149 -214 136 14
5940A4r2J5P7j70M7J63j80J26q4Pj5J68j88P2N5j36J08j06Q0J15j26L00j37j24
$$ 14 -78 -63 14 -156 -109 54 -126 0 -84 -77 -92 76 -112 -40 15 -121 -13 -119 -39 76 -50 250 113 -11
5964a1J58p7k2J24k70J78k39K37K27l65J84j04J43l54M87m41K96J13r1P2j21R5
$$ -11 147 70 48 172 -98 80 -159 78 305 -60 124 20 163 -191 296 -145 151 264 173 245 124 219
5986B19M4O2m33K31q6J02R0lk5M6j62j18N2N5NJ77k69l99P36l95J51p0r1J82m0
$$ 219 263 325 -108 123 37 139 229 226 201 247 85 -33 19 74 79 256 -13 -412 324 -71 80 10 -81 101 61
6011F1R3k44L37l59j3J44j21Q6N7J45j93j96Q1L14l20j82L01L2K9J51r1j25K18
$$ 61 154 -90 247 -112 -125 19 -102 -16 41 186 -7 -203 -122 192 -128 -310 -9 23 52 203 112 -13 205
6034B05k50N8N4k81J86J37N5o3k55N9J11r7j9k3R7J20K95q08J98K36J98l64K43
$$ 205 -45 13 67 -214 -28 109 164 101 -154 -95 16 -81 -100 -123 -26 94 389 -419 -221 15 213 -151 92
6057I2Rk00L5K23j15k59M17k33J13j88J4J55j59J36j77L03k39K50K02j66j39M
$$ 92 101 -99 -64 159 44 -215 202 -31 82 -106 -92 63 -96 40 -137 166 -73 177 379 213 74 78
6079G8j61Q7j57L99j14k48N2M8rO3j55L5K98m97L12J22m4j3j42RP6J16k85k8j17
$$ 78 -83 4 -153 246 132 -116 -64 -16 -25 38 -117 -82 216 -281 31 153 109 96 -46 -37 39 155 -130 -158 -275
6104b75J12K77j6k24N8k8J83j98l1N4j58J23k4kJ31Q9L5j27J76l69L07J97j44
$$ -275 -163 114 98 -126 -68 -96 87 -111 -142 -88 -246 -123 -147 -149 -18 71 106 -21 155 -214 93 290 146
6127A46o8j18P3M0r1J49mm9j8m4N8k0K9j68M7n0J40kKj95O1P0P2j56O8M6mj45
$$ 146 78 -40 33 73 -18 131 127 78 60 16 74 54 83 -85 -38 -88 52 50 52 -143 -82 -12 60 -96 -28 18 14 -131
6155a31J35l8J48k18k5l2P3J8n2J42J73k92L42l49J15R5L0J61l46r1N7J27J82
$$ -131 4 -34 114 -104 -129 -161 -88 -70 -122 20 193 -99 243 -106 9 104 134 295 -51 -142 -85 42 224
6178B24l05J36j87L11m9k48J9rK70k40J70j1k35K64p6N6k0l51Q3L30k49n6P9K76
$$ 224 -81 55 -132 179 130 -118 -99 -108 162 -78 92 81 -154 110 34 90 70 -281 -198 132 -117 -173 -94 182
6202A82O5m31k9L49j76j26J20Q8L3j09J92j80n7J27J65m19L7J78j62L31j54J7
$$ 182 247 -184 -213 136 -40 -166 -46 42 75 -34 158 -22 -79 48 213 -206 -169 9 -153 178 24 41
6224D1p2k90L62J48j19k05R1J56j34j84L75j08J12j4j89j23N8K81k16Pj34J36
$$ 41 -31 -321 41 189 70 -135 -44 112 -22 -206 169 61 173 159 -30 -153 -95 186 -30 -23 -157 -21
6246b1j30K74K13l34L1J97k41N5k03J98KL72l48k09K26m3p5k20J45K49j55M4N6
$$ -21 -151 123 336 2 33 230 -11 44 -159 39 41 413 65 -144 82 39 -36 -256 -111 138 -17 27 83
6269H3j77j25K35J62k45J21p7o8o6J88l53K29M6p5j78Q0K43l5j61K01j02J03R2
$$ 83 -94 -219 16 178 -67 54 -23 -91 -157 31 -322 -93 -47 -122 -300 -220 23 -12 -173 28 -74 29 121
6292A21k7l00K48j40K72k78k4J93j19n1j74J48K59k80K08oQ1n4l59J62J97k14
$$ 121 94 -206 42 -98 174 -104 -128 65 -54 -105 -279 -131 128 -152 56 50 131 77 -282 -120 77 -137
6314a37K11k45J61J21J05j79k87J97K84l6j92P5K1l32J87k3R1m3l02N05j93J46
$$ -137 74 -171 -10 111 216 37 -250 -53 231 195 3 78 99 -233 -46 -69 22 -21 -323 182 -11 135
6336A35%L0m24K16J8K14j13j27m2O2J09k1k92K80k65N39k03k90j4L29l38J96q4
$$ 135 135 165 -259 -43 -25 189 76 -51 -93 -31 78 57 -235 45 -220 319 116 -174 -188 141 -197 -1 -85
6359h5j10L18q0l8l7J7j08L8l1j62o6M22J28k11q4R7O8J31k73J28k06J42J15j11
$$ -85 -195 123 43 5 -32 -15 -123 -85 -116 -278 -344 78 206 -5 -89 8 76 207 -66 62 -144 -2 113 2
6383Bj3P6n9k09K69j09J75l15N6RL0J35l0Lj62J55J14j90K71m20J97%k32L84k57
$$ 2 -11 65 6 -203 66 -43 132 -183 -127 -118 -88 47 17 20 -142 13 127 -63 208 -212 -15 -15 -247 137 -120
6408a20K27k6J55oo2j25o6L5K68k32j9j35P5l8n9L91l70J04L2L17m20J7l60M67
$$ -120 107 81 236 230 168 43 -23 12 280 48 29 -106 -31 -69 -128 263 -107 -3 29 346 -74 -57 -417 50
6432E0J6J40k4j09o2MJ78k26J02M8j42K2N8j04N6j12L9l2j4K06j13K11l17K16
$$ 50 66 206 182 73 11 15 193 -33 69 117 -25 -3 55 -49 7 -105 -66 -98 -112 94 -19 192 -125 91
6456I1l05J45P0L40k48J09k39k8j15J71n3J09J27k14L36l07l45M71m11L07l9l9
$$ 91 -214 -69 1 341 93 202 -37 -65 -180 -9 -62 47 174 -40 296 -11 -356 115 -296 11 -28 -67
6478f7J2J44K9k14j1K62k10L5R6k65K45Q3j95K09l01R4R5k33K01Ok54J50J30K1
$$ -67 -55 89 118 -96 -107 155 -55 -20 76 -189 56 139 -56 153 -148 -54 41 -192 9 15 -239 -89 41 62
6502F2j80RQJ97M0m2R9m23L97k01M9M6k96Q8M60k38J13j54j17rK78q0m3j22k47
$$ 62 -118 -109 -101 96 136 94 193 -230 167 -34 15 61 -235 -147 313 75 188 34 -83 -92 186 106 63 -59 -306
6527c06K84M9k10K60q2R6O5q2L2Q1k64P1p0l6j65L35k31p3K47J24O7j56J26j20
$$ -306 -22 27 -183 77 -5 91 156 74 106 187 -77 -6 -76 -112 -277 58 -173 -246 1 125 192 36 162 42
6551D2j40Q4J31o5J38j71j86K29J58k17k9J08k65m3K05K87k09K4q4l0n4j3j59
$$ 42 -98 -14 117 52 190 19 -167 62 220 3 -26 82 -183 -226 -21 266 57 81 -3 -33 -87 -100 -259
6574b59J52J68l51L93l33J68O4J12O6l87O4L7k33L53Qm1P6m47L68k21L07J14J06
$$ -259 -107 61 -290 103 -230 -62 2 114 180 -207 -143 -106 -339 14 22 -19 57 -390 -22 -243 64 178 284
6597B84k26l46K31q8K3l8M04k15J31J97m87J25J81o3k28J71j08m8Q7Q9N4k07K85
$$ 284 58 -288 -57 -145 -122 -160 244 29 160 357 -130 -5 176 113 -115 56 -52 -100 -13 76 130 -77 208
6620B08l58m8N17n60K74J9r2Q0k8J17j99K40j68J5j85J35l9K63k51J28j90K1P6
$$ 208 -150 -198 319 -241 33 52 -40 40 12 129 -70 170 2 17 -168 -33 -72 191 -60 68 -122 -101 -25
6643b5j6q8P7j24n7L16K2j60j30K28l09R5K2N9K93k98j0k5J25J09k43J63j69K11
$$ -25 -41 -129 -52 -176 -233 83 105 -55 -185 43 -266 -171 -149 -90 203 -95 -105 -130 -5 104 -139 24 -145 66
6667F6k69K97N8O9l00J49J33p0j1Q8j43p2Jj12N66n05o6O2k36K05P3j7K04r8J06
$$ 66 -203 94 152 221 -79 70 203 133 122 210 67 -5 -4 -116 450 -55 -121 -59 -295 -90 -17 -34 170 72 178
6692A78j27k37J69O4j53J99k68O7L33P1j94L1j61J36J32p3k23J84K5k82M7J66
$$ 178 51 -186 -17 47 -106 93 -175 -108 225 296 102 133 -28 108 240 167 -56 128 153 -129 -82 84
6714H4j13J43J03l84kM16k18J52k15o4K19l23J93k0L2K1j83P0J06J17k01r5n0
$$ 84 -29 114 217 -167 -169 247 29 181 -34 -98 121 -202 -9 -29 3 24 -159 -89 17 134 -67 -162 -212
6737b12J46j00j0qr8K38M7J89l34J83j36K67k13J63m05J95J65p1k8RK21j84l3
$$ -212 -66 -166 -176 -184 -282 -44 3 192 -142 41 -95 172 -41 122 -283 -88 77 6 -22 -13 208 24 -9
6760ir1p5l4k9J67k16J26M5j36R4R1m5J5L32j74M0j60l9M9p6J76M3m9R8m17M26
$$ -9 -100 -175 -209 -238 -71 -287 -161 -116 -252 -158 -67 -112 -97 235 61 101 -59 -98 -49 -125 51 94 45 143 -274 152
6786A52k26l0K44k05O8M45n67n2K65k08N3J29J72k78j1O5j06j6J17J42r5k06J24
$$ 152 -74 -104 140 -65 3 448 -119 -171 94 -114 -61 68 240 -38 -49 16 -90 -106 11 153 58 -148 -24
6809b4P4J42j52J75j31j32Q5Q2j72Q8J1j14j46L26k20OJ54m9K0m7p7k71K72m2
$$ -24 50 192 40 215 84 -48 37 119 -53 35 46 -68 -214 112 -108 -102 52 3 23 -24 -101 -372 -100 -142
6833a42K72j05M1l23L24k28q9K26J07n4m1p0P7nj3J28j18K30k43K40j96j60m8
$$ -142 130 25 66 -257 67 -161 -250 -24 83 29 -12 -82 -5 -10 -23 105 -13 217 -26 214 18 -142 -190
6856a90P2R8J53k58R0K53k72p5j30K18j30M58J45o28P7J12K00k88Q0l86L69J45
$$ -190 -118 -20 133 -125 -35 218 -54 -129 -259 -41 -171 287 432 -196 -119 -7 193 -95 -15 -401 -32 113
6878A13j87KJ14R6r2j70%MkO1K25k13K85m6n7j88o4K42L36m11j76L38J33n13J01
$$ 113 -74 -72 42 138 46 -124 -124 -120 -122 -61 164 -49 236 190 133 -55 -119 123 459 48 -128 210 343 -170 -69
6903f9m6K37l52K82J40K6N4l19K12l04P2m3M5R8l04J96j2J72n0l02L47Km0q5K8
$$ -69 -115 122 -230 52 192 218 272 -47 165 -139 -67 -110 -65 33 -271 -75 -87 85 35 -267 80 82 42 -43 -15
6928a5P4m8j48J32k67N25k44Q9r4J23j03k13J76J61k93P0j5m3M39k72J54l19K69
$$ -15 59 11 -137 -5 -272 253 9 98 4 127 24 -189 -13 148 -145 -75 -90 -133 306 34 188 -131 138
6951A38k2n5K2j40J8J46j30K27J3k63J03j75J41LJ10J07l20o7K16j80J86j87P2
$$ 138 116 61 83 -57 -39 107 -23 204 217 -46 57 -118 23 26 136 243 -77 -144 72 -108 78 -109 -37
6974c7J57k48K56j84k3L2l5L17j08j51J15L2O0k38K43j27R8O2j65k74J19m0J02
$$ -37 120 -128 128 -56 -79 -47 -82 235 127 -24 91 123 183 -55 188 61 159 221 56 -218 -99 -139 -37
6997c7l4j43J38Q3K06k57O7q9J35Jr3K79m20J70M6l68K89O8n9j1K69l08k46J90
$$ -37 -71 -214 -76 7 213 -44 23 -66 69 70 -23 256 -164 6 52 -316 -27 41 -18 -29 240 -68 -314 -124
7021a24L49j18L8jN2k88J34M7j3l56L85K20o01K48R1j93l0M17k80J5J83j69l9
$$ -124 225 107 145 144 196 -92 42 89 76 -280 105 325 -276 -28 63 -130 -160 257 -23 -8 175 6 -33
7044c3k82O92m54L0L6q6K58l24J71J18p6j95K35J35k94L04l25O1Q2L2q9j12K70
$$ -33 -315 377 -77 -47 -11 -97 161 -163 8 126 50 -145 90 225 -69 235 -90 -29 53 85 -4 -116 154
7067A54m1J24j30k29L48k06m5K72j56j26j07j74K65j0K6J24L9j34k4j02J25QJ36
$$ 154 113 237 107 -122 226 20 -25 247 91 -35 -142 -316 -51 -61 -35 89 128 -6 -30 -132 -7 1 137
7090A37k38K79k41J40j7J2Q8q5l72K79j00o8j07K15J67l68N10j65j42O4q4LJ71
$$ 137 -101 178 -63 77 60 72 160 75 -297 -18 -118 -186 -293 -78 89 -279 231 66 -76 -12 -96 -93 78
7113G8j38J12j22j13l4J30k19L47J98m44K22N3M0k66K10Nm6J71M3j06j20o5L8
$$ 78 -60 52 -70 -183 -217 -87 -306 41 239 -205 17 70 110 -156 54 59 13 184 227 121 1 -64 -26
7136b6j59K04r3J16k16K32k50J04Q7J47j19O7j38J43j97L7R5K28l06J31k35K35
$$ -26 -185 19 -74 42 -174 58 -192 -88 -1 146 27 94 -44 99 -98 -61 34 262 -44 87 -148 87
7158H7j96J81J5j09J02l04L24p2q2l0Qj5O1J74p9k76K48r5J27L5j23N2j69o8j14
$$ 87 -109 72 87 -22 80 -224 100 28 -54 -84 -76 -91 -30 144 65 -211 37 -58 69 104 -19 33 -136 -204 -318
7183c18J32K32l9j5m1Q7k32K11J4o4J10J2j79o3K01j41R2N5q8j69o0J69j5J71
$$ -318 -186 46 7 -8 -49 38 -194 17 31 -33 77 89 -90 -153 48 -93 -1 54 -34 -203 -263 -94 -109 62
7207F2o0p0j7K19j65J26n3j30J08J73k23%O0q8k29N0J91J46N3P8l95L39k06K22
$$ 62 2 -68 -85 134 -31 95 42 -88 20 193 -30 -30 30 -58 -287 -237 -46 100 153 231 -164 175 -31 191
7231A91k03J5M5k82L97k92L79j16L18o68J92K38l03L8o6n1m7Q5J78J84j90K93
$$ 191 -12 3 48 -234 163 -129 250 134 452 -216 -24 214 -89 -51 -117 -168 -215 -130 48 232 42 335
7253C35k21m9k02P1p9M94k77k78K68n1J8j11Q4l4j10J32k71L41p3rm3o1K58k68
$$ 335 114 65 -137 -66 -145 349 72 -206 62 11 29 -82 2 -32 -142 -10 -281 60 -13 -22 -65 -126 132 -136
7277a36K1q3J76q5n7J07P7l8j51j2J60Kj1j31P8K59j96J27l25J37k16K43l5q9
$$ -136 -115 -198 -22 -107 -164 -57 20 -18 -169 -181 -21 -19 -30 -161 -83 176 -20 107 -218 -81 -297 -54 -89 -178
7301a78K73j12K7J55j5j45nK26k51p1L24m8j89k8L1l8K31j38P3k06K19j45O6j25
$$ -178 95 -17 10 165 150 5 0 226 -25 -96 228 180 -9 -37 -6 -44 187 49 122 -84 135 -10 56 -69
7325f9K39k43Q9K56k53R6j32J66j86O1l7J49K17m14M9n2nJ82l82J38K48J06l74
$$ -69 170 -73 16 272 19 115 -17 149 -37 24 -13 136 353 -61 -12 -64 -69 113 -269 -131 117 223 -151
7348a51O3j23N9K72n8K28n37L42j49J87l8q1o3j62J70Q0J10j36q8M07k90j43L12
$$ -151 -88 -211 -152 120 62 290 -247 95 -54 133 95 14 -49 -211 -41 39 149 13 -75 332 42 -101 211
7371B11m36K79l01M68k17m7K8r5l5J13l1K19j45j45J85r6K35k7l33J58j43j2M1
$$ 211 -225 54 -247 221 4 -43 -15 -110 -145 -32 -63 156 11 -134 51 -45 190 163 -170 -12 -155 -167 -126
7394a26R2R3R2k75K52L13k72k96L01lk5k48j21J45K72k05J90kJ02k00o7J86j94
$$ -126 -34 59 151 -124 128 441 169 -127 174 171 146 -102 -223 -78 194 -11 179 177 279 79 12 198 4
7417Dl1J90J48l4m56K77k23P3kl0K23j21L44n16J92K1k35r5L12J4k61J81J50k79
$$ 4 -27 163 311 277 -179 98 -125 -52 -54 -84 139 18 362 -154 38 59 -176 -271 41 55 -206 -25 125 -154
7441a54Q0K09l76L98k73j3L31J29k00l8R2l04K3M0j23J6L20N5k84j91L48J05j91
$$ -154 -74 135 -241 157 -116 -129 202 331 131 93 185 -119 -96 -56 -179 -163 157 212 -72 -263 85 190 -1
7464aj5q3j3K66o6L8k24N7o6L28l19M4L02j85j41J19J28k66R3J50l96J20N5J64
$$ -1 -16 -99 -112 154 88 126 -98 -41 -107 221 -98 -54 248 63 -78 41 169 -97 -4 146 -250 -130 -75 89
7488H9k8K03j6m05K00q8Q0J48o6r4j44J12J81q9L7L3j73l2l26J98R3J6K57k66
$$ 89 61 264 248 -157 43 -45 35 183 117 23 -121 -9 172 83 120 153 -20 -52 -378 -180 -87 -71 186 -80
7512h0J45LQ9l41J07P8j57J59J58rL20l14l89K97r6J05K78k35j11K04k85K00J18
$$ -80 65 68 157 -184 -77 1 -156 3 161 152 472 158 -231 66 -30 75 353 118 7 211 -74 126 244
7535B44k65k65R6M61j57j5l7j52JJ7J88LQ8k98N5O4j7m8j20j25L61Q0j13j9O1
$$ 244 -21 -286 -190 271 114 99 62 -90 -89 -72 116 119 207 -91 -36 28 11 -37 -157 -282 79 159 46 27 88
7560H8j80o0nL85j72k96K56O4r3K04r0j85P5r3P3j55L5L12j97J31K5k04J59J06
$$ 88 -92 -152 -157 228 56 -240 16 80 -13 191 101 -84 -9 -102 -29 -184 -149 163 -34 97 122 -82 77 183
7584A83k34q4K39k10M2K0J41K09k12k4N9j18K4O5P2j55R9j14N8J27j75j78M3J68
$$ 183 -51 -135 104 -106 -64 -44 97 306 94 70 129 11 35 100 172 17 116 2 60 187 12 -166 -123 45
7608D5r9M4R8k12L49k59qP4p2r5L42j23K06k81j85M7j1r0K75N1j81p5J86j03L31
$$ 45 -54 -10 88 -124 225 -34 -42 32 -40 -135 207 84 290 9 -176 -129 -140 -230 45 96 -85 -160 26 -77 254
7633B54k89L2J05q2K02k00q6J98j43n2j86M88n2k91M16k06m0j76L7m6K75j39K56
$$ 254 -35 -3 102 20 222 22 -64 134 -9 -61 -247 241 189 -102 314 108 68 -108 -71 -117 158 19 275
7656B75j41k8j17K70m93K40r2N3l9q6p9K95N8N4M7l26L66k56j48r1M3J69J70r4
$$ 275 134 106 -11 259 -234 6 -86 -33 -72 -158 -237 58 116 170 217 -109 257 1 -147 -238 -195 -26 144 50
7680E0JJ3l9J5O6j12K6P6N7K9r6J41l06P5m4N8P2m28L09J9L8M4K37m02M3p6J05
$$ 50 51 64 25 40 106 -6 20 96 153 182 86 227 -79 -4 -48 10 82 -346 -37 -18 20 64 301 -101 -58 -134 -29
7707b9M2R0R4k12J04j12K2q6J66P6k81J65RK44k39k06K28N1k84l4K37k39L82j15
$$ -29 13 103 197 -15 89 -23 -1 -87 79 155 -126 39 48 292 53 -153 75 126 -158 -192 45 -194 188 73
7731G3j71L53l85j6K64j1j69O9O0o4J67k24J68m8k37k2O1Q1O8q9k93M66j38N68
$$ 73 -98 255 -130 -146 118 107 -62 7 67 3 170 -54 114 66 -171 -193 -132 -51 17 -72 -365 101 -37 531
7755E31n53O9J2r4mj15J74l64L87l94K66J6K4j32K94L1K8j05L9q4J24k43L15j6
$$ 531 -22 47 59 -35 -39 -154 20 -344 43 -351 -85 -69 -45 -177 117 148 176 71 110 26 150 -93 222 206
7779B06l67J40O2L85k57j61k3OJ57K1j99j38j6K22n0j19R2r0K1q0K98p5J14j46
$$ 206 -161 -21 41 426 169 8 -15 -9 148 169 -30 -168 -184 38 -12 -131 -39 -129 -108 -188 110 35 149 3
7803Cp7j19J61J16p4l0P0k4k23K68k44J78o4K07l7%j36o9P5J30l45J83j38J24
$$ 3 -74 -193 -32 84 10 -20 50 26 -197 71 -173 5 -59 148 111 111 -25 -94 -19 111 -234 -51 -189 -65
7827f5J87r7P4mj65K90m07K91n8k1K02p3j87Q8k52K9R0L16k83J96m06L54p9l3
$$ -65 122 25 99 95 -70 220 -187 104 46 25 227 154 -33 55 -197 -168 -78 238 -45 151 -255 99 20 -13
7851a3K1l39M54o4k44K84p0P8j42j25L90Oj62j66L03k09j9N2jk74L58r3j9P3j38
$$ -13 8 -331 123 59 -185 99 29 107 -35 -160 230 236 74 -92 211 2 -17 35 34 -240 118 25 6 79 -59
7876e9J25k2R3m3k00K76k07K09k69q4L00M2k57J22m2J02K04j50j33m5k03L30k2
$$ -59 66 44 137 94 -106 170 -37 172 -97 -181 119 161 -96 26 -16 86 290 140 7 -38 -241 89 67
7899F7n2k25J70J48m66L49J49j39j55k39K43r1j88N18r2k20M30j08j62L26l21
$$ 67 15 -210 -40 108 -358 -9 140 1 -154 -393 -150 -241 -429 89 -3 -223 207 99 -63 263 -58
7920e8J94m36J25pL47j44l9j54J11K40j04r3M7J93k88k2L36k73o6O8K07L5j45
$$ -58 136 -300 -175 -182 165 21 -18 -172 -61 179 75 -18 29 222 -66 -88 248 -25 -91 -23 184 219 74
7943G4m3M2N7n6k1j45K63k12k03N14j73j72P4J53k48Q9J66k55j65J58J48l25N4
$$ 74 31 73 130 74 53 -92 171 -41 -244 270 97 -75 -1 152 -96 -7 159 -96 -261 -103 45 -280 -226
7966b26Q7L30K0n3k65o7N46o70K69m8J69r2k13L27K9O7k33k9K4j05P8j30K15J21
$$ -226 -139 191 211 158 -107 -174 372 -298 -29 -77 92 0 -213 114 143 210 -23 -52 -28 -133 -55 -185 30 151
7990A51k46R3k4J62n9l7k43M25Om11K92q3J08q7K20l44J37m3k0J21p2j32J92l17
$$ 151 -95 -2 -26 136 77 40 -203 222 228 -183 109 26 134 47 267 -77 60 17 -3 118 46 -86 106 -211
8014b11L07j57J72J5k6j59pJ25K6r4J96o1m83L24k05L27k7q7J55k11k6J40J85
$$ -211 96 -61 111 126 100 -59 -66 59 85 -9 187 126 -357 -33 -238 89 62 -25 130 -81 -107 33 218
8037B18j79l07K92J67j32n7R2p1j5J81k55N1J51k13J76o2J78j33n0r0J26q0J88
$$ 218 39 -268 24 191 59 2 94 23 8 189 -66 -15 136 -77 99 37 215 82 32 -58 68 -12 176
8060A76o0pj08k10K91k07L68k59p6K21mk06j63K05K71j90q8j7P2K23k35m4J08
$$ 176 116 109 1 -209 82 -125 243 -16 -92 129 125 -81 -244 -39 232 42 -46 -63 9 232 -3 -47 61
8083F1M7L5j70O3P6j84J9Q4j66j1J34J6j50J07n4q0M86k20L0k33k64J89N7K2k4
$$ 61 108 143 -27 36 112 -72 -53 31 -135 -146 -12 4 -146 -39 -93 -173 313 93 123 -110 -374 -185 -128 -106 -130
8108a30j33M95K2j77l09Q9Q7M66k16j32mr3M3j16K20k4r3k52M20j45j07L56l52
$$ -130 -263 232 254 77 -232 -143 -56 410 194 62 58 -35 8 -108 112 88 -5 -257 163 18 -89 267 -85
8131h5o6J7K80k51J07j03K62l60J7J43J75m68L80j12k27J23J82q3J41k97K36o5
$$ -85 -151 -134 146 -105 2 -101 161 -199 -182 -39 136 -332 48 -64 -291 -168 14 -69 72 -225 11 -54
8153e4R0k48J5L89l40J40K18j49j8N8Kl1k1Q1k18O0j94L45j12m17N05m1J95j27
$$ -54 36 -212 -197 192 -148 -8 210 61 43 101 103 72 51 132 -86 -26 -220 125 13 -404 101 60 255 128
8177A28l52J52j25k2J23O2J32o5J18m1l38l9K62l03
$$ 128 -224 -72 -197 -219 -96 -34 98 33 151 110 -228 -267 -5 -308
8191c08
$$ Imaginary data points
##PAGE= N=2
##DATA TABLE= (X++(I..I)), XYDATA
0@%%%%%%%%%%%%Qj6J6j6J8k6L2l8M6n6O5p3Q8j04J20j37J60j85K10k38K71l07
$$ 0 0 0 0 0 0 0 0 0 0 0 0 0 8 -8 8 -8 10 -16 16 -22 24 -32 33 -40 48 -56 64 -73 87 -98 112 -126 145 -162
34a62L46l90M37m87N43o06O75p52Q34r23J020j126J241j366J505j659J828k013
$$ -162 184 -206 231 -256 287 -319 356 -396 438 -485 535 -591 650 -716 789 -870 958 -1055
52a055K219k450K710l003L335l718M165m696N336o123P122q435J0241j2886J7125
$$ -1055 1164 -1286 1424 -1579 1756 -1962 2203 -2493 2843 -3280 3842 -4593 5648 -7238 9887
67I887k4961M3975j69585k06178L26517j01504p945J88879k24976j35126J66148
$$ 9887 -15074 28901 -140684 -346862 -20345 -121849 -129794 59085 -165891 -301017 -134869
78a34869r4321L4824J84703j33241j05851N7922r0004O8989J57407j17352l5522
$$ -134869 -229190 -194366 -9663 -142904 -248755 -190833 -280837 -211848 -54441 -171793 -207315
89b07315R9583j38211k8537J68141k3462l942Q1173j39361n6404J46947J788l694
$$ -207315 -107732 -245943 -274480 -106339 -129801 -133743 -52570 -191931 -248335 -101388 -99600 -103294
101a03294J03519o7369r7068O3843J5102K6021J37874m5071j37456N7551L0086
$$ -103294 225 -67144 -164212 -100369 -85267 -59246 78628 33557 -103899 -46348 -16262
112a6262r434J19746n584p9395M2662m3613j9570J31760N175l8209K2449p2227
$$ -16262 -25696 94050 88466 9071 51733 8120 -11450 120310 125485 87276 109725 37498
124C7498J167R1194k4767K418M8808n7128l4420K4162n256L8456L3873m9666k1898
$$ 37498 38665 129859 105092 107510 156318 99190 64770 88932 83676 122132 156005 106339 84441
137H4441k017l0203L3313L4058k7716J2410k5510p6613L5359M5070k0086J6562
$$ 84441 82424 52221 85534 119592 91876 104286 78776 2163 37522 82592 62506 79068
149G9068k5425n7236J2519q72M667M4615k6015m6682k731k2454O060N6429j1124
$$ 79068 53643 -3593 8926 8054 12721 57336 31321 -15361 -18092 -40546 -34486 21943 10819
162A0819n3057R812l711m4356L9362M3328m4251R98M121n7170K6459M7366k5588
$$ 10819 -42238 -32426 -36137 -80493 -41131 2197 -42054 -41056 -36935 -94105 -67646 -20280 -45868
175d5868J1872L659m6594J0424J8991n946L9319Q437n1520p56J8571j2787L8564
$$ -45868 -33996 -30337 -76931 -66507 -47516 -53462 -14143 -5706 -57226 -57982 -39411 -52198 -13634
188a3634L4344m6897p924J6755l2754L6819N5202l8379q853R924l7410K8132M7659
$$ -13634 20710 -26187 -34111 -17356 -50110 -13291 41911 3532 -5321 4603 -32807 -4675 42984
201D2984k1117j074Q977l3303j804M0376O076r256J1878k0535k3635L2065R593
$$ 42984 21867 20793 29770 -3533 -5337 35039 41115 31859 43737 23202 -433 31632 41225
214D1225j3928K1472q082k8789J1190J335k190K2446l973k3598j536L03p676J3711
$$ 41225 27297 48769 40687 11898 23088 24423 22233 44679 40706 17108 15572 15875 8199 21910
228B1910J5741k1986j0377Q028k5416P229L6762k5463j5093J6726k9025l249L3911
$$ 21910 37651 15665 5288 13316 -12100 -4871 31891 6428 -8665 8061 -20964 -24213 9698
241I698j4393j0063J4757k4875j3170L0186n356j6353K4145j6245k5959L6193
$$ 9698 -4695 -14758 -1 -24876 -38046 -7860 -13216 -29569 -5424 -21669 -47628 -11435
253a1435r196k9415M5950q148l9358L9480r025l3077M6357k183l2565L6227p724
$$ -11435 -20631 -50046 -4096 -12244 -51602 -12122 -21147 -54224 -7867 -10050 -42615 -6388 -14112
266a4112l7761L8543J1340k9879L2771K055m9654L4629K4517m1048L4956J7650
$$ -14112 -51873 -13330 -1990 -31869 902 2957 -46697 -12068 12449 -28599 6357 24007
278B4007n6527K6867K4387l9660L4693J9278m6272K1539J3785l4226K9584J8692
$$ 24007 -32520 -5653 18734 -20926 13767 33045 -13227 8312 22097 -12129 17455 36147
290C6147l3686J8903J1155m1116K2220K9987l6290J7724K4134n3671J0383L8384
$$ 36147 2461 21364 32519 -8597 13623 43610 7320 25044 49178 -4493 5890 44274
302D4274l7181J7127L0873n1216r93K8444k5409J5455K4006l2736o916J1021j6959
$$ 44274 7093 24220 55093 3877 2884 31328 5919 21374 45380 12644 5728 16749 -210
315b10J1841K2757k2048p724R572k4650M453K9440j8979k486J2349l3167Q21K6118
$$ -210 11631 34388 12340 4616 14188 -10462 -6009 23431 4452 1966 14315 -18852 -18031 8087
329H087j6437O170J2757l0268k438J2240j1967J2406J5101k0046j0651L200p283
$$ 8087 -8350 -2180 10577 -19691 -22129 -9889 -21856 -9450 5651 -14395 -25046 -21846 -29129
342b9129J0395J6588j0717n601k584j8392J4827J8294j1229J1912p699l2183K4383
$$ -29129 -18734 -2146 -12863 -18464 -21048 -39440 -24613 -6319 -17548 -5636 -13335 -45518 -21135
355b1135J1226j4313K8507q547l1329K1212k561p728L5867q404k3970J8211r675
$$ -21135 -9909 -24222 4285 -4262 -35591 -14379 -16940 -24668 11199 2795 -21175 -2964 -12639
368a2639j1737L4985O16k0627K1519j0137k8042L4853J0317k0489K6807r594l4445
$$ -12639 -24376 10609 11225 -9402 12117 1980 -26062 8791 19108 -1381 25426 15832 -18613
381a8613K9960N562j4857L4381q553l5482K1701J018j3899L7161l41m0028J9594
$$ -18613 11347 16909 2052 36433 27880 -7602 14099 15117 1218 38379 38038 -1990 17604
394A7604M915l0984L8515J7456m8874K1646J1219m9685L7060K6387m9136K6261
$$ 17604 22519 -8465 30050 47506 -1368 20278 31497 -18188 18872 45259 -3877 22384
406B2384J0901n3061K9952J8738l7066L0724O385m6841K0738R605l0094L2641
$$ 22384 33285 -19776 10176 28914 -8152 22572 28957 -17884 2854 12459 -17635 15006
418A5006J0811m3668J3829O803l2330L1455J7826l9104J2897M155l5492K5928
$$ 15006 25817 -17851 -4022 2781 -29549 1906 19732 -19372 -6475 -2320 -37812 -11884
430a1884K0702k8090R846L018k9590J2340J9368j3561K408Q752j8758n335J7047
$$ -11884 8818 -19272 -9426 -6408 -35998 -23658 -4290 -17851 -15443 -6691 -25449 -30784 -13737
443a3737m826m49J6288j5883r515J6169j0760K091K2515j4390m843J0689j7086
$$ -13737 -18563 -19012 -2724 -18607 -28122 -11953 -22713 -20622 1893 -12497 -17340 -6651 -23737
456b3737M741K2497o591k679M820j2267n65J4838L380L06L356q760p158R813P633
$$ -23737 -18996 3501 -3090 -5769 -949 -13216 -13781 1057 4437 4743 8099 -661 -7819 1994 9627
471I627L246J763o371l902J692L631P729n47Q24m14j0928N175Q525o369Q829O11
$$ 9627 12873 14636 8265 4363 6055 9686 17415 16868 17692 17278 6350 11525 20050 13681 22510 23121
487B3121j4831R438p35j0463J5456J922j2189N418n016q700J1300L779o755J256
$$ 23121 8290 17728 16993 6530 21986 23908 11719 17137 12121 3421 14721 18500 11745 13001
501A3001k564j0987L082Q654m388K426q42j6141M211Q246q223N265K575j3634
$$ 13001 10437 -550 2532 11186 6798 9224 8382 -7759 -3548 4698 -3525 1740 4315 -9319
515i319J716K425o255N913M003q377k706L791m394j652P592l182k894P164r141
$$ -9319 -7603 -5178 -11433 -5520 -1517 -9894 -12600 -8809 -13203 -14855 -7263 -10445 -13339 -6175 -15316
530a5316n872J1848j439j063O516p527l092M018p03N138M479k133m341m081N289
$$ -15316 -21188 -9340 -10779 -11842 -5326 -12853 -15945 -11927 -12630 -7492 -3013 -5146 -9487 -13568 -8279
545h279N378P06M373m743m456N105o60J832Q785j325o242K43J963k68N813L525
$$ -8279 -2901 -2195 2178 -2565 -7021 -1916 -2576 -744 8041 6716 474 717 2680 2412 8225 11750
561A1750o509K972K950j2364P287J1029r884O352J537j8354J0016R073j2551J0793
$$ 11750 5241 8213 11163 -1201 6086 17115 7231 13583 15120 -3234 6782 15855 3304 14097
575A4097N693j9494J602O968q942J1852Q952k2396j956J1905j4866O875J8672
$$ 14097 19790 296 1898 8866 -76 11776 20728 -1668 -3624 8281 -6585 290 18962
588A8962k1723k435J1513k3735Q724K4525k3014p77J1939k3730N406J9525j7911
$$ 18962 -2761 -5196 6317 -17418 -8694 15831 -7183 -7960 3979 -19751 -14345 5180 -12731
601a2731M268J4866k5771m513K2222j1800M52J9746k2383q940K1915j6338k91
$$ -12731 -8463 6403 -19368 -23881 -1659 -13459 -13007 6739 -15644 -24584 -2669 -19007 -19298
614a9298K9421j9235j1067J6511j8368M254K9270j6849q041J4361j7407j341K5018
$$ -19298 10123 -9112 -20179 -3668 -22036 -17782 11488 -5361 -13402 959 -16448 -17789 7229
627G229n598n534J1993j7226q871K6509k055o793J6431j5057j2449K0986m776
$$ 7229 1631 -3903 8090 -9136 -18007 8502 6447 -346 16085 1028 -11421 9565 4789
640D789j674K0987j4375j3415J3014m878J264J7875p911r877O885p253l832J8012
$$ 4789 3115 24102 9727 -3688 9326 4448 5712 23587 15676 5799 12684 5431 1599 19611
654A9611K109j0582L538q037q535J6620L963o536N776j0648j0493J1644J112K361
$$ 19611 21720 11138 14676 6639 -1896 14724 18687 12151 17927 7279 -3214 8430 9542 11903
668A1903O815j2646q417L419N7O347N595o962p242l015j236M853O708k294m638
$$ 11903 18718 6072 -2345 1074 1131 7478 13073 6111 -1131 -4146 -5382 -529 6179 3885 -753
683g53k703p307J270R862j250M6o59j1831M65P187k558P006J860j1899k90r9k406
$$ -753 -3456 -10763 -9493 369 -881 -835 -1494 -13325 -12860 -5673 -8231 -1225 635 -11264 -11554 -11653 -14059
700a4059J1264M822r080l032j249l872O885R616m316k173o91j1525N473J4776
$$ -14059 -2795 2027 -7053 -10085 -11334 -15206 -8321 1295 -3021 -5194 -5885 -17410 -11937 2839
714B839n046J180J407j4698M391J0346n460Q125M369j4575j193N808j868P994
$$ 2839 -2207 -1027 380 -14318 -9927 419 -5041 3084 7453 -7122 -8315 -2507 -4375 3619
728C619O959j1040m042O022o018J397J5332n432o698M195j1404J658J7762n218
$$ 3619 10578 -462 -4504 1518 -4500 -3103 12229 6797 99 4294 -7110 -5452 12310 7092
742G092l904N371j2333l017J2544p42J325N898j1944j0003J0395M269j824Q116
$$ 7092 3188 8559 -3774 -6791 5753 5011 6336 12234 290 -9713 682 4951 3127 11243
756A1243n977j2418O193j05j125J4395l259j3373K848l038l38J2931q67p718R13
$$ 11243 5266 -7152 -959 -1064 -2189 12206 8947 -4426 -1578 -4616 -4954 7977 7110 -608 305
771C05l728n777Q186Q816m205k773k033q951N046J1069n270J564K705j3103oQ901
$$ 305 -3423 -9200 -1014 7802 3597 824 -1209 -10160 -5114 5955 685 2249 4954 -8149 -8155 746
787G46j516N728K659j2394l530P479m39K494O806o326p527M675k677J191J2813
$$ 746 -770 4958 7617 -4777 -8307 -828 -1267 1227 8033 1707 -5820 -1145 -3822 -2631 10182
802A0182n236q821M950m407j023J1402k288m150L561o230l697Q205L182k655J024
$$ 10182 4946 -3875 1075 -3332 -4355 7047 4759 609 4170 -2060 -5757 2448 5630 2975 3999
817C999k428o749N157M747m997N654J482j2020L088M216m246P632R35j0374L189
$$ 3999 1571 -5178 -21 4726 -271 5383 6865 -5155 -2067 2149 -2097 5535 6470 -3904 -715
832g15J243m542O303L158n788K03R0n463M326O513o076p48L545p125J232O209
$$ -715 528 -4014 2289 5447 -341 -138 -48 -5511 -1185 5328 -748 -1496 2049 -5076 -3844 2365
848B365m915K933L132q752J275L832l344L672J630m485O0N06k374K045M335j538
$$ 2365 -2550 383 3515 -5237 -3962 -130 -3474 198 1828 -2657 -2597 -2091 -4465 -2420 1915 377
864C77l598Q17j614M79M661k307k67K712n698K13L538p05L229n61n099K056M0
$$ 377 -3221 -2404 -4018 -3539 1122 -1185 -1452 1260 -4438 -4225 -687 -1392 1837 1276 -3823 -1767 -1727
881a727j10L498q63p07N52l167K04L729J224j406k20j083k049L002J139j860M863
$$ -1727 -1837 1661 798 91 643 -2524 -2320 1409 2633 1227 1007 -76 -2125 877 2016 156 5019
898E019j925o836N413k38k382P977m446n131O359l683k285Q111k103l720L585
$$ 5019 3094 -3742 1671 1433 -949 7028 2582 -2549 3810 127 -2158 5953 3850 130 3715
913C715m570k061Q288j149n967N486j036p543P981J58o404R083k911r771R782
$$ 3715 -855 -2916 5372 4223 -1744 3742 2706 -4837 3144 3302 -3102 5981 3070 -6701 3081
928C081j071o606R890k953p650Q541l430o287J0370j96q245N289n12p624Q544
$$ 3081 2010 -4596 5294 2341 -5309 3232 -198 -6485 3885 3689 -4556 733 221 -7403 1141
943A141J922q784O862Q82j1591R011K993q744Q761r42j0967R607J156q394Q647
$$ 1141 3063 -5721 1141 2023 -9568 -557 2436 -6308 2453 1511 -9456 151 1307 -7087 1560
958A560P98q386M883P30n605O493K657p643L403K562p850N074M985p060M212K309
$$ 1560 2358 -6028 -1145 -415 -6020 473 3130 -4513 -1110 1452 -6398 -1324 3661 -3399 813 3122
974C122r437N289M239n779M934J049p041L150K290l191L853K164m939j089K832
$$ 3122 -6315 -1026 3213 -2566 2368 3417 -3624 -474 1816 -1375 2478 4642 -297 -1386 1446
989A446j448J289M239m038j767K817l581J925M533l797N32M04m057K588K436j476
$$ 1446 -2 1287 5526 1488 -279 2538 -1043 882 5415 1618 2150 2554 -1503 1085 3521 2045
1005B045J231j150j924j1J46J873O65m71j065k136M8J272Q55J587j603j488j408
$$ 2045 3276 2126 202 191 337 2210 2875 2404 1339 -797 -749 523 1378 2965 1362 -126 -1534
1022a534m86L491L5j38j15m028J77L046j351K308O12n257J256L50o02L313j66
$$ -1534 -2020 1471 1506 1368 1253 -2775 -2598 448 -903 1405 2017 -3240 -1984 -1634 -2236 1077 911
1039I11k462M71j252j55J830J381o08j410K22j336l88L604m70p87J559l491o16
$$ 911 -1551 -1080 -2332 -2487 -657 724 116 -1294 -1072 -2408 -2796 808 338 -449 1110 -2381 -2997
1056b997L302n36J214J134l419r04J871L48R94Q05p61l080J102J608j098K811
$$ -2997 305 -231 983 2117 -1302 -2206 -335 13 1007 1812 1051 -2029 -927 681 -417 2394
1072B394K01m357K139p2j745M149m45k541J178j244j130K098J017m60q87o5r67
$$ 2394 2595 -1762 377 305 -1440 2709 2264 -277 901 -343 -1473 625 1642 1182 295 230 -737
1089g37j134L220o73j162K144k996j590L422j170L0K228l050j264K008o53l15
$$ -737 -1871 1349 676 -486 1658 -1338 -2928 494 -676 -646 1582 -1468 -2732 -724 -1377 -1692
1105a692K038p83k547J477N49k305L170R50m416L111k73l902M980J09l591L632
$$ -1692 346 -437 -2984 -1507 -958 -3263 -93 857 -3559 -448 -721 -4623 357 466 -3125 507
1121E07j037l532L903Q92k615K231Q04l552J623K286l121J796L515n398J517L606
$$ 507 -530 -4062 -159 733 -1882 349 1153 -2399 -776 1510 -1611 185 3700 -1698 -181 3425
1137C425n575L241L712o049K572K402n119K731L314m151J731K046m112O50L465
$$ 3425 -2150 1091 4803 -1246 1326 3728 -1391 1340 4654 503 2234 4280 168 818 4283
1152D283k631p5L593m205j438N283l689j93N011n518j50M119m448P88L794m301
$$ 4283 1652 1577 5170 965 -473 4810 1121 928 5939 421 271 4390 -58 730 4524 223
1168B23J24K703l788K81L062j951j141K398k316k179L802j502j706L794l047k552
$$ 223 347 3050 -738 -457 2605 654 -487 1911 -405 -2584 1218 -284 -1990 1804 -1243 -3795
1184c795M082k397j032M475l465j765K863k297J8K837j830o91Q45j249l27K144
$$ -3795 287 -2110 -3142 1333 -2132 -3897 -1034 -3331 -3313 -476 -2306 -2997 -2152 -3401 -3728 -1584
1200a584k47j099J027o25j552K531j28j213K548j658j256K165j313J165J913k111
$$ -1584 -1831 -2930 -1903 -2528 -4080 -1549 -1677 -2890 -342 -2000 -3256 -1091 -2404 -1239 674 -1437
1216a437N18O83j902J537J403l15N93o54j147M92J944o1k82J053j884k81K164
$$ -1437 -919 -236 -2138 -601 802 487 1080 426 -721 -229 1715 1654 1372 2425 541 260 2424
1233B424j188J339K044l949L64J897k224K442J070l293J841j15k807K417J147
$$ 2424 1236 2575 4619 670 1034 2931 707 3149 4219 926 2767 2652 -155 2262 3409
1248C409j464M47j54k517P61K635k206K21K429m435k04K921k658J697K466n821
$$ 3409 1945 2392 2238 -279 482 3117 911 1132 3561 -874 -1078 1843 -815 882 3348 -2473
1264b473J248K310l846K433K309m083R93L36l010J769L286k492j431J870k376
$$ -2473 -1225 1085 -2761 -328 1981 -2102 -1109 -773 -3783 -2014 1272 -1220 -2651 -781 -3157
1279c157m71M205k639o24L598m574r94M910k478L05L288m703L81K733k221R74
$$ -3157 -3628 577 -2062 -2686 912 -3662 -4656 254 -2224 -1919 1369 -3334 -2953 -220 -2441 -1467
1295a467K911j978j358J285q91K72L622j169k854K922j519j345M314p19j472K476
$$ -1467 1444 -534 -1892 -607 -1498 -1226 2396 1227 -1627 1295 -224 -1569 2745 2026 554 3030
1311C030l195o86L698m19o18J573j786r85Q75P54K9J024K65k954k69K520j200
$$ 3030 -165 -851 2847 2428 1810 3383 1597 612 1487 2241 2270 3294 3559 605 336 2856 1656
1328A656J616M14l124R17r4j530K360R10j599l45r40p76J033J229m22j595L00
$$ 1656 3272 3686 562 1479 1385 -145 2215 3125 1526 1181 241 -535 498 1727 1305 -290 10
1345A0r79j209K631j06q92R15k916p25K749q46q8R67j780r49L72N55K88K70J73
$$ 10 -969 -2178 453 347 -545 370 -2546 -3271 -522 -1368 -1456 -489 -2269 -3218 -2846 -2291 -2003 -1733 -1560
1364a560j956l79J587q80J479M25k270N17L13j406K744P32j845O34m60j081J907
$$ -1560 -3516 -3895 -2308 -3188 -1709 -1284 -3554 -3037 -2724 -4130 -1386 -654 -2499 -1865 -2325 -3406 -1499
1381a499O99k01K52n61n63k36K074M44j30K21j585K99J604o48J193P50j650K89
$$ -1499 -800 -1001 -749 -1310 -1873 -2109 -35 409 279 500 -1085 -786 818 170 1363 2113 463 752
1399G52j2L45J746n79k29J84r95O08L54K96J012r68k83k60m35R52Q46o86K34j440
$$ 752 740 1085 2831 2252 2023 2207 1212 1820 2174 2470 3482 2514 2231 1971 1536 2488 3334 2648 2882 1442
1419A442K89M24l73J246n23j380M47j005M42J532j566J89Nj680M62Q51n77K72
$$ 1442 1731 2155 1782 3028 2505 1125 1572 567 1009 2541 975 1164 1169 -511 -49 802 225 497
1437D97J32j312r74J278j06m73R18j030j810J764q14j95K534k155j241J861k055
$$ 497 629 -683 -1657 -379 -485 -958 -40 -1070 -2880 -1116 -1930 -2125 409 -1746 -2987 -1126 -3181
1454c181N54K429j777r78J773j757p0J799k74n98J034j015j262K817n15j466L038
$$ -3181 -2627 -198 -1975 -2953 -1180 -2937 -3007 -1208 -1482 -2080 -1046 -2061 -3323 -506 -1021 -2487 551
1471E51j323k430L010o09q90L106j538j658K278r77k85K380n26j615J549M4j494
$$ 551 -772 -3202 -192 -801 -1691 1415 -123 -1781 497 -480 -765 1615 1089 -526 1023 1067 -427
1488d27K292O51k284J815K69k576K980J05k305K884p62k746K848l34j144K142
$$ -427 1865 2516 232 2047 2316 -260 2720 2825 520 3404 2642 -104 2744 2410 1266 3408
1504C408q03j810J770l21j061J090O71j789M07P11k257J537Q84k377J341M57k724
$$ 3408 2605 795 2565 2244 1183 2273 2944 1155 1562 2273 16 1553 2437 60 1401 1858 -866
1521h66J899O05j945J203l19j620R35j88o80P86m26p22K22J97o09L05Q74j143
$$ -866 1033 1638 -307 896 577 -1043 -108 -296 -976 -190 -616 -1338 -1116 -919 -1528 -1223 -349 -1492
1539a492p99R88j452J001N80j155N06j62j400J436j21l84Q91r44Q2K34k56M51
$$ -1492 -2291 -1303 -2755 -1754 -1174 -2329 -1823 -1985 -3385 -1949 -2070 -2454 -1563 -2507 -2425 -2191 -2447 -1996
1557a996R3j35L29l35Q7L10K07L32l21K25L27p46J301J12m65R58p51j00J052o69
$$ -1996 -1903 -2038 -1709 -2044 -1957 -1647 -1440 -1108 -1429 -1204 -877 -1623 -322 -210 -675 283 -468 -568 484 -185
1577a85N79P99r32J5O33l29Q64L56m03j5m55J66M6O30N74n67L82p78m08J660p51
$$ -185 394 1193 261 276 909 580 1444 1800 1397 1382 927 1093 1139 1769 2343 1776 2158 1380 972 2632 1881
1598A881q72J333j130p5R87j222N36Q33j130n39K24K14J92K0J71j017K41J47j269
$$ 1881 1009 2342 1212 1137 2124 902 1438 2271 1141 602 826 1040 1232 1252 1423 406 647 794 -475
1617d75J472J75j383M91k5j222J505n23r04J073j026k30K46J59J02n2J35q35l15
$$ -475 997 1172 -211 280 255 -967 538 15 -889 184 -842 -1072 -826 -667 -565 -617 -482 -1317 -1632
1636a632J343p66k71J294j523J79P13r27R35P95j271L76K50p41N81M25l25p5K09
$$ -1632 -289 -1055 -1326 -32 -1555 -1376 -663 -1590 -655 140 -1131 -755 -505 -1246 -665 -240 -565 -640 -431
1655d31N3n41Q45O22j431J306m13j167J989l44n61J290r25n85R32J18l89R08l33
$$ -431 -378 -919 -74 548 -883 423 10 -1157 832 488 -73 1217 292 -293 639 757 368 1276 943
1674I43n97M76R1o37N42P56j487L34Q78j290P85Q54j855J272O1j609J009N46n91
$$ 943 346 822 913 276 818 1574 87 421 1299 9 794 1648 -207 1065 1126 -483 526 1072 481
1693D81J71k92o05J05O43m11l3L78r75k10P19o87J68J171j332k10P02j158Q00
$$ 481 652 360 -245 -140 503 92 59 437 -538 -748 -29 -716 -548 623 -709 -919 -217 -1375 -575
1712e75O54q82O7K32n14O0M30l83J1K43m16l82J297k35j026J262n15o86J351n40
$$ -575 79 -803 -736 -504 -1018 -958 -528 -911 -900 -657 -1073 -1455 -158 -393 -1419 -157 -672 -1358 -7 -547
1732e47q2R83j216J06M93n46P56J79n08N48l51J30L07J21K41l77K76q7k82Q39
$$ -547 -629 354 -862 -756 -263 -809 -53 126 -382 166 -185 -55 252 373 614 237 513 426 144 983
1752I83kp39P76o58J08O28n70M20M48o89L35J02m10Q29l44n3J7Oj84l5K94k31
$$ 983 981 242 1018 360 468 1096 526 946 1394 705 1040 1142 732 1561 1217 1164 1181 1187 1003 968 1262 1031
1774A031j29K22l03n3Q08r90K89J57j294R07L72j138P73N8j342R88j87p74R02
$$ 1031 902 1124 821 768 1576 586 875 1032 -262 645 1017 -121 652 710 -632 356 169 -605 297
1793B97m12n55O30l64n99N44L48j037L86N49j402L66J130j644O36O31j449J111
$$ 297 -115 -670 -40 -404 -1003 -459 -111 -1148 -762 -213 -1615 -1249 -119 -1763 -1127 -496 -1945 -834
1811h34J74j031Q77K03j272J151k11n34L47N72p30r0P65n67k25J262p83j74J225
$$ -834 -660 -1691 -814 -611 -1883 -732 -943 -1477 -1130 -558 -1288 -1378 -613 -1180 -1405 -143 -926 -1100 125
1830A25j402M48Q15r78M01R87j015JO62m37L29J68l40L92J30m14J27O81j85p14
$$ 125 -1277 -829 -14 -992 -591 396 -619 -618 44 -393 -64 104 -236 156 286 -128 -1 680 495 -219
1850b19J077n95n19J552q26k77J161j139J26M56k72J62M92o34l1J47J88pj06J09
$$ -219 858 263 -256 1296 470 193 1354 215 341 797 525 687 1179 545 514 661 849 842 736 845
1870H45p57O36rl31M06K78o66M00l71o92J039p27Q7M04o60L76j78q2K83j81J3
$$ 845 88 724 715 384 790 1068 402 802 431 -261 778 51 138 542 -118 258 80 -2 281 100 113
1891A13l07j64O12k20n97J004p55n5N05n94L80M4m01L55l07p4M88l84L41j25k08
$$ 113 -194 -358 254 34 -563 441 -314 -369 136 -458 -78 -34 -435 -80 -387 -461 27 -357 -16 -141 -349
1912c49O13o13K11L13n91M08j25j85M90R5j38L59o44pK10k14O96m86K0K14m47
$$ -349 264 -349 -138 175 -416 -8 -133 -318 172 267 129 488 -156 -163 47 -167 529 43 63 277 -170
1933a70M12L14o27M63k24k95N19p13N53K02l31J34k22j2L50l3j64k20j01K54l39
$$ -170 242 556 -71 392 168 -127 392 -321 232 434 103 237 15 3 353 320 156 -64 -165 89 -250
1954b50n9P41l08p3j70l84M90K82k92K09k98Mp0l07P79m19j44J29m04K05M95q17
$$ -250 -309 432 124 51 -119 -503 -13 269 -23 186 -112 -108 -178 -485 294 -125 -269 -140 -544 -339 156 -661
1976f61P87N5j041Q01qk65L32J09l14j01K22k03O8K80n6m60N58l29J32N27m95
$$ -661 126 181 -860 -59 -67 -332 0 109 -205 -306 -84 -287 -219 61 5 -455 103 -226 -94 433 -62
1997f2k2N92p57L73L99n93L85M58p45l26P53j77p6L18j33n08N33j52m63J168m76
$$ -62 -84 508 -249 124 523 -70 315 773 28 -298 455 278 202 520 387 -121 412 260 -203 965 489
2018D89r49Q01k80j04Q75p82jM86q92K03L21J06m20J60k74m7J85j54J19O7J83
$$ 489 -460 341 61 -43 832 50 49 535 -357 -154 167 273 -147 13 -261 -308 -123 -277 -158 -91 92
2039I2r79P04K14q20P80k42l60M85o84j82J016q04K47K03k19p6Q6R7l14K66J54
$$ 92 -887 -183 31 -789 -9 -251 -611 -126 -810 -992 24 -780 -533 -330 -549 -625 -539 -442 -756 -490 -336
2060c36o20K51N75o31N50l8o50O61l07j46O19p4n55P46J04m62L29K01m73m5K90
$$ -336 -956 -705 -130 -761 -211 -249 -899 -238 -545 -691 -72 -146 -701 45 149 -313 16 217 -256 -301 -11
2081a1J62N7J99l12P9L34o20N89rm02Q06m06m10O94o3m56P57m26q5K53m20J63
$$ -11 151 208 407 95 174 508 -112 477 468 66 872 466 56 750 687 231 988 562 477 730 310 473
2103D73M82o4R5l22K35j79oJ45j89P6K12l72J08Q0q14Q72n31k89P18l68k10M15
$$ 473 955 891 986 664 899 720 714 859 670 746 958 586 694 774 -40 832 301 12 730 362 152 567
2125E67n24K92j60j81K32J18k07r3P2K03m70J04r9p5N78m09o22N87r8k79M94n07
$$ 567 43 335 175 -6 226 344 137 44 116 319 -151 -47 -146 -221 357 -52 -674 -87 -185 -464 30 -477
2147d77k00P46o74J84K26k65j05j9L18j47K16k98j89K67J94m62J68K98m36L69
$$ -477 -677 69 -605 -421 -195 -460 -565 -584 -266 -413 -197 -495 -684 -417 -223 -685 -517 -219 -655 -286
2167b86j41m04Q15m01q9K53j93k18N00m43L06k0j9L74m00J76J02m22N27l20L57
$$ -286 -427 -831 -16 -417 -506 -253 -446 -664 -164 -607 -301 -321 -340 34 -366 -190 -88 -510 17 -303 54
2188E4M0n02O68l5m22K73l5n03O00j51j29R4J73m5l17N28j28j18K19j11j75M73
$$ 54 94 -408 260 225 -197 76 41 -462 138 -13 -142 -48 125 80 -237 291 163 45 264 153 -22 451
2210D51k55o9J86l03K46L9k05L64j42j68R2k21K73m55K57L48j83j21L27n05L40
$$ 451 196 127 313 10 256 295 90 454 312 144 236 15 288 -167 90 438 255 134 461 -44 296
2231B96n5M7J15j70j93N99l47J02k59k77O05o14L87o1j70J78r8j81K90l2j81L12
$$ 296 241 288 403 233 40 639 292 394 135 -142 463 -151 236 175 5 183 85 -96 194 162 -19 293
2253B93n15O03l00j89K09R4m39K93jN5j16j15L44n6l24L00m82K73N5l09L13Q6
$$ 293 -222 381 81 -108 101 195 -244 49 48 103 -13 -128 216 160 -164 136 -346 -73 -18 -327 -14 72
2275G2m88J07M2K06L13l09n4K50n50O19l87K27J62o86K12L11k36M0M2k74L10n04
$$ 72 -416 -309 -267 -61 252 -57 -111 139 -411 208 -179 48 210 -476 -264 47 -189 -149 -107 -381 -71 -575
2297e75M85m7M0J35k48nL98m58R3Q7l00M82o20K22L14k88K99J97m20K4L08k97
$$ -575 -90 -137 -97 38 -210 -215 183 -275 -182 -95 -395 87 -533 -311 3 -285 14 211 -209 -185 123 -174
2319a74L66n16M16k87r8L44j79J25J85k27J78o4k49N34j74m23P82l24m09M75k37
$$ -174 192 -324 92 -195 -293 51 -128 -3 182 -45 133 69 -180 354 180 -243 539 215 -194 281 44
2340D4O1j17K67j02K35k14j0K06l17j14K11L68n43Q4N12r97N80K47n64O09J9m53
$$ 44 105 -12 255 153 388 174 164 370 53 -61 150 518 -25 59 571 -426 154 401 -163 446 465 12
2362A2L81m13L05J31l08M9m9M4j40QK31p9m69O52n14J93M52q73O46p0o79O11K0
$$ 12 393 -20 285 416 108 157 108 152 12 20 251 172 -297 355 -159 34 486 -387 259 189 -490 121 141
2385A41l08M31j20n1j23m8j07O1j1J10k08M36l20k04L99k23j92L46k63NL57l34
$$ 141 -167 264 144 93 -30 -78 -185 -124 -135 -25 -233 203 -117 -321 78 -145 -337 9 -254 -249 108 -226
2407b26qK00k05p6r7K73J67o9J24l53R5J34k41K28Q9j69J32R1m18M71l16K55m7
$$ -226 -234 -34 -239 -315 -412 -139 28 -41 83 -270 -175 -41 -282 -54 35 -134 -2 89 -329 142 -174 81 34
2430C4n14M90j49J51J48O4p4J48p50O98l37O2L78l67J40J57l60M56l69j8K88m55
$$ 34 -480 10 -139 12 160 224 150 298 -452 246 -91 -29 349 -18 122 279 -81 375 6 -12 276 -179
2452a79L12J30k41r5L07l05M54m30P9L97m84L74m15j46rQ4J95J20o6K5k11j52
$$ -179 133 263 22 -73 234 -71 383 -47 32 429 -55 319 -96 -242 -251 -167 28 148 82 107 -104 -256
2474b56J95L6j82K46j73p7L07k98J46k75J97l0j31K8K66k58M07n62m5O24l60j25
$$ -256 -61 -25 -207 39 -134 -211 96 -202 -56 -331 -134 -164 -295 -267 -1 -259 148 -414 -459 165 -195 -320
2496c20R9K2M5J29l82K78k83K73l0k83K66p1Q4J19k00o5J38r1L88j1j52J80l77
$$ -320 -221 -199 -154 -25 -407 -129 -412 -139 -169 -452 -186 -257 -173 -54 -254 -319 -181 -272 116 105 -47 133 -244
2519b44L03M2l9J71j66j02L30J54n23M95m89K37J40m55M97j69J4K2k02L46j06
$$ -244 59 101 62 233 67 -35 295 449 -74 421 -68 169 309 -146 351 182 196 218 16 362 256
2540B56j00M50l23l10L44J2k2R3m02K80l39M9J91K40j76k41J51k4L5O2j76j06
$$ 256 156 606 283 -27 317 329 307 400 -2 278 -61 -12 179 419 243 2 153 129 164 226 50 -56
2562e6J96k5m26P42n98q1N72l99k40M85k79M1J40l47J91Lj41R3p9J72J15L6L8
$$ -56 140 115 -311 431 -167 -248 324 -75 -315 170 -109 -68 72 -275 -84 -81 -222 -129 -208 -36 79 115 153
2585A53n20L24J35l14K86l76o2L98l09K47p6K27J4j44j44R5k16M6L23j60J3K25
$$ 153 -367 -43 92 -222 64 -312 -374 24 -285 -38 -114 113 127 -17 -161 -66 -282 -236 87 -73 -60 165
2607A65j71K04k20J00k34p5K85q8j24L49j91k77N07k29J7K49l80K72k99J89J11
$$ 165 -6 198 -22 78 -156 -231 54 -34 -158 191 0 -277 230 1 18 267 -113 159 -140 49 160
2628A60k14j1K76k43K65k26Q8L61m33K07j46l09N14k14qN0j14J72m31J17n2O1
$$ 160 -54 -65 211 -32 233 7 95 456 23 230 84 -225 289 75 67 117 3 175 -256 -139 -191 -130
2650a30K38j31j70K21J12m46K60j69K22l1j91L19j70p5R5n8l04K81l49N25j16
$$ -130 108 -23 -193 28 140 -306 -46 -215 7 -24 -215 104 -66 -141 -46 -104 -408 -127 -476 49 -67
2671f7j78J48N5k2j97K9L3Jo9K36k69M20k53k19J30K94m40M61r7j32M10l21k8
$$ -67 -245 -97 -42 -64 -261 -232 -199 -198 -267 -31 -300 120 -133 -352 -222 72 -368 93 -4 -136 274 -47 -75
2694g5K92k75K23J05l01J34j18J82j1l03L96j11j74L00k81R1p7o9L31j40n9L63
$$ -75 217 -58 165 270 -31 103 -15 167 156 -147 249 138 -36 264 -17 74 -3 -72 259 119 60 423
2716D23m71j0K82k40n5L1O3L38j81J1J8j16k57J05J44K94l72k41R1k03K71J96
$$ 423 -48 -58 224 -16 -71 -40 23 361 180 191 209 93 -164 -59 85 379 7 -234 -143 -346 -75 121
2738A21k39J27j79N2J78j71O7N0l06J92n8M9K37j45j75M00n74L88j89N4J69l73
$$ 121 -118 9 -170 -118 60 -111 -44 6 -300 -108 -166 -117 120 -25 -200 200 -374 14 -175 -121 48 -325
2760c25K69l5O1J22m1j80J58k1p6j96J09J16o7M0K32j66Q0P6m28L98P9j16K46
$$ -325 -56 -91 -30 92 51 -129 29 8 -68 -264 -155 -39 -106 -66 166 0 80 156 -272 126 205 89 335
2783C35m13q7L09j54K42n5j95L5Q1K4k0r9P4J52l42L16k99k6J84j57K29k5m62
$$ 335 -78 -165 144 -10 232 177 -18 17 98 122 102 3 77 229 -113 203 -96 -122 62 -95 134 109 -353
2806c53N53k17l9K8j46J97Q2j62J13j40j05Q3k48J12J72Q4k05K08j95L44o23N04
$$ -353 200 -17 -56 -28 -174 23 105 -57 56 -84 -189 -106 -354 -242 -70 14 -191 17 -178 166 -457 47
2828D7k16J09j53m2n6K40j97L10k14O7Q9q2J87lk55P1r7j83N94m98j9L02k52L32
$$ 47 -169 -60 -213 -255 -311 -71 -268 42 -172 -105 -16 -98 89 86 -169 -98 -195 -378 216 -282 -301 1 -251 81
2852H1k82j45P02n25J64l9J45m20Q4P5K77j5n6K27k51j17L33r3q0j94K84K19k97
$$ 81 -201 -346 356 -169 -5 -44 101 -319 -235 -160 117 102 46 273 22 -95 238 145 65 -129 155 374 77
2875G7J78J15n18M75j77m5K70K3p4j06J23l39K17q0N7r5J60m09J41M91m14rL27
$$ 77 255 370 -148 327 150 105 375 398 324 218 341 2 219 139 196 101 261 -148 -7 484 70 61 388
2898C88l24l7L42l82N08j14l90L59l07P2N5j29M1r8R8K39j95k59K30k36J88K96
$$ 388 64 27 369 -13 495 381 -9 350 43 115 170 41 82 -16 82 321 126 -133 97 -139 49 345
2920C45m50J41q7n9K61j34j72L37j40o9J65l29O4j23O0K04n00L08j5j40L14j56
$$ 345 -105 36 -51 -110 151 17 -155 182 42 -27 138 -191 -127 -250 -190 14 -486 -178 -193 -333 -19 -175
2942a75M3J42q1j64rk75M52l26K47j2J83j11j74j78O11j75j85Q5j43M5J06r7J65
$$ -175 -132 10 -71 -235 -244 -519 -67 -393 -146 -158 25 -86 -260 -438 173 -2 -187 -102 -245 -200 -94 -191 -26
2965b6k44K46J27k97J92l91N32l57J05j81L81l91K20J38r0Q9M4k32J96j00L7O
$$ -26 -270 -24 103 -194 -2 -393 139 -218 -113 -294 87 -304 -84 54 -36 53 97 -135 61 -39 -2 4
2987Dq7L01l11K09J2n1J3l7p5M28k23J15l23N8M9K68m21K43q4l6J48k28K15J06
$$ 4 -83 218 -93 116 128 77 90 53 -22 406 183 298 -25 33 82 350 -71 172 88 52 200 -28 187 293
3011B93l02J44j37J3K28k05J81k22l36O32q5m69O83o54L98P6k68J37n2j51L08
$$ 293 -9 135 -2 11 239 34 215 -7 -343 289 204 -265 418 -236 162 238 -30 107 55 -96 212
3032B12l36Mk7N5J52Rj70K90j48m63N05j47K22k59j23L27l06J17K57o3j30j05
$$ 212 -124 -120 -147 -92 60 69 -101 189 41 -422 83 -64 158 -101 -224 103 -203 -86 171 108 -22 -127
3054a27k9N26m26R5K69k22J98l25L15n9n08K51OP4L2q9l54L05k8J36k1m6j16L92
$$ -127 -156 370 -56 39 308 86 284 -41 274 215 -293 -42 -36 38 70 -19 -373 -68 -96 40 19 -27 -143 249
3078B49m35K31O7l13K81j22M2n4R9k9j17LM4j61K35j38K33p1k51J57J22k34P1
$$ 249 -186 45 112 -201 80 -42 0 -54 45 16 -101 -98 -54 -215 20 -118 115 44 -207 -50 72 -162 -91
3101i1J39k55M72n09J59J04k1K37q6l28L80k92l8L9kL5N6l24M94r1j05J53j54
$$ -91 48 -207 265 -244 -85 19 -2 235 149 -179 201 -91 -129 -90 -92 -57 -1 -325 169 78 -27 126 -28
3124b8l18M87j04j29N8j34J68l6J99o9j92J94m5j77J46j3J35j76r3J25R4l28L99
$$ -28 -346 141 37 -92 -34 -168 0 -36 163 94 -98 96 51 -126 20 7 142 -34 -127 -2 92 -236 163
3147A63KJ49l21K90m69J71j5K20l27L01Q4k79O7k3K40j09j89j83M90l07%L03n58
$$ 163 165 314 -7 283 -186 -15 -30 190 -137 164 248 -31 36 13 253 144 -45 -228 262 -45 -45 258 -300
3170c00O60l28j32M06k31K58q2k45K75j14j43J85o01P27l14J2J98k90Q3N7j35
$$ -300 360 32 -100 306 75 333 251 6 281 167 24 209 -392 335 21 33 231 -59 24 81 -54
3191e4J00K52j82Q9j03p6R2n2j81N9J00r7OK4m1l27K77P5N8k1q3p9P1J32J22k91
$$ -54 46 298 116 205 102 26 118 66 -115 -56 44 -53 -47 -23 -64 -391 -114 -39 19 -2 -85 -164 -93 39 161 -130
3217a30m9K5J43P2R0m80L32J2j35J61r8p3O3M0j58L87o06L97Q9l88M93m14l8K54
$$ -130 -179 -154 -11 61 151 -329 3 15 -120 41 -57 -130 -67 -27 -185 202 -404 -7 82 -306 187 -227 -265 -11
3241a1j72N1j24L73j38O0J43l09P8j1L37l52N1k43K08J05l03M05Q2j50o3K01l18
$$ -11 -183 -132 -256 117 -21 39 182 -127 -49 -60 277 -75 -24 -267 -59 46 -257 148 230 80 17 218 -100
3264a00L18k43K47k53P9J02l18K48J25m01K45k47N3L92o57L10J3J84O4l25K0K
$$ -100 218 -25 222 -31 48 150 -168 80 205 -196 49 -198 -145 247 -410 -100 -87 97 161 -164 -144 -142
3286a42J78n4J18o1j97l6J06K82l41K35k76k03M42j05k43J84J11j4J11l29L23
$$ -142 36 -18 100 39 -158 -194 -88 194 -147 88 -188 -391 51 -54 -297 -113 -2 -16 95 -234 89
3307H9O3j58J11J0j48q8j86M12m0j1J09j19k15L53k99j1O23n53K6L58m71K71l17
$$ 89 152 -6 105 115 -33 -121 -307 105 65 54 163 44 -171 182 -117 -128 495 -58 -32 326 -145 126 -191
3330a91J69J87l27K48M7q8P8k5K06q0j65K1K50n14K79J2j12K18k87pM59l95Q1
$$ -191 -22 165 -162 86 133 45 123 98 304 224 59 80 330 -184 95 107 -5 213 -74 -81 378 -17 64
3353F4q4N3J74l8j64J07j08K62l55M3L79n01L20k21Q4K82j13j09q1J03P3l4j79
$$ 64 -20 33 207 169 5 112 4 266 -89 -46 333 -168 152 -69 15 297 184 75 -6 97 170 136 -43
3376d3K02n6J51j28q7j79M41m49J44J0j1j20k47L57l45L41j66L9K51Q1l72J70
$$ -43 159 103 254 126 39 -140 301 -148 -4 6 -5 -125 -372 -15 -360 -19 -185 -146 105 186 -186 -16
3398a6Q1k88L71k62n1J15o5j4j26L19J5J3l41L7J2L54r3Q5k06K27l23L44k85J8
$$ -16 65 -223 148 -114 -165 -50 -115 -129 -255 64 79 92 -249 -212 -200 154 61 146 -60 167 -156 188 -97 -79
3422g9J60k69K41J80k98k3o8R6M17n10N8J6N6J85Ok17j1N4J44k23NqM04j95L1
$$ -79 81 -188 53 233 -65 -88 -156 -60 357 -153 -95 -79 -23 162 168 -49 -60 -6 138 -85 -80 -88 316 121 152
3447A52l65K14l5L7K44k75R4K74l93J74o7j85P1OJ22kj69r2K45m4q4r6K53J36
$$ 152 -213 1 -34 3 247 -28 66 340 -53 121 54 -131 -60 -54 68 66 -103 -195 50 6 -78 -174 79 215
3471B15n16M95m26P1K14q4k77K67p2j2K30l10K64J4k50j8J33j66J0lL36k84l4
$$ 215 -301 194 -232 -161 53 -31 -308 -41 -113 -125 105 -205 59 73 -177 -195 -62 -228 -218 -221 115 -169 -203
3494b03L34j26O2r4k06K32j90R9K09k53j09O74p34L63J58Ql5k90O4J87k71J09
$$ -203 131 5 67 -27 -233 -1 -191 -92 117 -136 -245 429 -305 58 216 224 189 -101 -37 150 -121 -12
3516a2j59j10N93l44J87j60L37l22L32j68L60n06L3K2KO8j90j06M89j16J06k24
$$ -12 -171 -281 312 -32 155 -5 332 10 342 174 534 28 61 83 85 153 -37 -143 346 230 336 112
3538A12p8J51j13J0Qm4J18j30Q9o5j35J12K37j36J07n9l55L96k26K8R6j94pj11
$$ 112 34 185 72 82 90 46 164 34 123 58 -77 35 272 136 243 184 -171 225 -1 27 123 -71 -78 -189
3562a89N0L19k7m03O72l03j28M7j99J93K18k56M55o57O1J77l28k8L38j70K18j91
$$ -189 -139 180 153 -250 422 119 -9 38 -161 32 250 -6 449 -208 -147 30 -298 -326 12 -158 60 -131
3584a31k17N09o11O19l57K5J73Mj3k04rO4L37k71K4J08l49J90J80j09k78K26K45
$$ -131 -348 161 -450 169 -188 -163 10 14 1 -203 -212 -148 189 -82 -58 50 -299 -109 71 -38 -316 -90 155
3607A55j99l24M51j89L32k65n4L22j70j84J49l26O60k50q1p5Q9o3n0l5P9K26j64
$$ 155 -44 -368 83 -106 226 -39 -93 229 59 -125 24 -302 358 108 27 -48 41 -22 -72 -107 -28 198 34
3630C4K36k21k94N03l30p5K58j58L64k99J96o9k69K51J9N8K0k01m7K14j21J81
$$ 34 270 49 -245 258 -72 -147 111 -47 317 18 214 145 -124 127 146 204 224 23 -24 190 69 250
3652B50q4k48O2p9j06J93M3j26J10k26J45K4J16r3k20L7K19j48m7J31j22L0j87
$$ 250 166 -82 -20 -99 -205 -12 31 -95 15 -211 -66 -42 74 -19 -239 -202 17 -131 -178 -47 -169 -139 -326
3675c26L89l59N3K80K18n59L97j46p8L44l59j10K87j43O0L2k2k5J31j27L41j6
$$ -326 63 -296 -243 37 255 -304 93 -53 -131 213 -146 -256 31 -112 -52 -20 -42 -67 64 -63 278 262
3697B62j83l1l06M50l31Q6J02M9R1l61J27J4mj37K94j38J81j8n05Q60m14k23J82
$$ 262 79 48 -258 192 -139 -53 49 98 189 -172 -45 -31 -35 -172 122 -16 165 147 -358 502 88 -135 47
3720D7l83O44j46j61J76l14L71k7l89N07m23P4J37r0K63l17qK10r7J81j66j09
$$ 47 -336 308 162 1 177 -137 234 207 -182 325 -98 -24 113 23 286 -31 -39 171 74 255 89 -20
3742b0j41K83k66O5L5j14J64q5R9j2j37K30J22k98l48N09j95m0M6P3j13j46J10
$$ -20 -161 122 -144 -79 -44 -158 6 -79 20 8 -129 101 223 -75 -423 86 -109 -149 -103 -30 -143 -289 -179
3765a79L17j21j16j4k42L18k25m6j1L80l16K05L43l36q9J02k78K73l0j68J50R1
$$ -179 138 17 -99 -113 -355 -37 -262 -308 -319 61 -255 -50 293 -43 -132 -30 -308 -35 -65 -233 -83 8
3787Hk03P0k0K46mk5j10K27l32j06J56J90Q0k05M4M5J82J54k67j19oN6J76j07
$$ 8 -195 -125 -145 101 97 72 -38 189 -143 -249 -93 97 177 -28 16 61 243 397 130 11 5 61 237 130
3811A30j72M2l6K23k0k60k5K50j09J21J1j71J05j91K53k09j0N4J29j8L78m07P
$$ 130 -42 0 -36 187 167 -93 -118 132 23 144 155 -16 89 -102 151 -58 -68 -14 115 97 475 68 75
3834G5k44L57o2j72R6K03j86o9j2l91J36L51j70N3P2j62k4K71k09L7j7m4K44o2
$$ 75 -169 188 126 -46 50 253 67 -2 -14 -405 -269 82 -88 -35 37 -125 -149 122 -87 -50 -67 -111 133 71
3858G1nk02K36k36m9Q1J35j69L94p1k5j08k05K93o9j16R1k77L20k83K91j20l9
$$ 71 66 -136 100 -136 -185 -104 31 -138 256 185 160 52 -153 140 71 -45 46 -231 89 -194 97 -23 -62
3881f2M9J44J62k96J78j80L60k08N1J79o93N05Jl93L17Nj38J49k13L11j23m8Q1
$$ -62 -13 131 293 -3 175 -5 355 147 198 377 -316 189 190 -203 114 119 -19 130 -83 228 105 57 138
3904A38l67L58l1j52L21l72N4K07k67J11J92q3N1N5j46P9l52q2N32m00K38q8j41
$$ 138 -229 129 98 -54 267 -105 -51 156 -111 0 192 109 160 215 69 148 -204 -286 246 -154 84 -4 -145
3927a45O07n75M7L17n33K56K18k66L3j47j06L61j50R8k73k01M38j64j5K7L9l4
$$ -145 462 -113 -66 251 -282 -26 192 -74 -41 -188 -294 67 -83 15 -258 -459 -21 -185 -200 -173 -134 -168
3949a68L57j23j23M0o6J6k14K90J8j68J82J04j85J65k79K79k50M1K38Nk48J54
$$ -168 189 66 -57 -17 -83 -67 -281 9 27 -141 41 145 -40 125 -154 125 -125 -84 154 159 -89 65
3971F5j86R4J20K2k0j0k82M07k3o0m7j98L0L22l33L96l05k2J89n6K39l94J16J74
$$ 65 -121 -27 93 115 95 85 -197 210 187 127 80 -118 -88 234 -99 297 -8 -30 159 103 342 -52 64 238
3995B38k71M55j98j25J97O2j90l90J85M8K08n37O07j75m5J12M4k52N1Q0J08j13
$$ 238 -33 422 224 99 296 358 168 -222 -37 11 219 -318 289 114 69 181 225 -27 24 104 212 99
4017I9k57J94J28n24M81p6j4Q7j55M8k00O8K5o2K0K73l72M7M1N6R7n7kLk25N20
$$ 99 -158 36 164 -360 121 45 31 118 -37 11 -189 -121 -96 -158 -138 135 -237 -190 -149 -93 4 -53 -55 -52 -277 243
4043B43l73J77J16j63j15j75L22k81j8K93l8k04L04O5j81j91L40p9k01J42k4K03
$$ 243 -130 47 163 0 -115 -290 32 -249 -267 26 -12 -216 88 153 -28 -219 121 42 -159 -17 -41 162
4065A62p5M0j22j17L06j94j09L23K9R8k14k02J73k25J41M8P8P0l18M2K95k37j49
$$ 162 87 127 5 -112 194 0 -109 214 243 341 127 -75 98 -127 14 62 140 210 -108 -66 229 -8 -157
4088a57J52m7K12o7j24J1m09L86j39K34R4k03P0P9o7k9J11j91lJ3J01Q9n9j11
$$ -157 -5 -52 160 93 -31 -20 -429 -43 -182 52 146 -57 13 92 25 -4 107 -84 -87 -74 27 116 57 -54
4112e4m8j88J62K18l23K87k22Q0k04L4n5L39j33m4j07K64k68J98OJ65l77K59K01
$$ -54 -102 -290 -128 90 -233 54 -168 -88 -292 -258 -313 26 -107 -151 -258 6 -262 -64 -58 107 -270 -11 190
4135A90n35M63m08K46L3j5J29k4m6K48k39K47m00J3K52J31l65L71n39L97J96n62
$$ 190 -345 118 -290 -44 -11 -26 103 79 33 281 42 289 -111 -98 154 285 -80 291 -248 149 345 -217
4157b17L34j37J7j4J09j20M53k67J76l32K17j0m40L26O1LJ30j05l56K8K87k70
$$ -217 117 -20 -3 -17 92 -28 425 158 334 2 219 209 -231 95 156 159 289 184 -172 -144 143 -127
4179a27K68J04q2l10R0J46j10L5j77R9K69kk74J35k28o4N32k98J42k49P3L20k70
$$ -127 141 245 163 -147 -57 89 -21 14 -163 -64 205 203 -71 64 -164 -228 304 6 148 -101 -28 292 22
4202B2j19j26K2L8N2k11J33K17p0k44J35M8L42l76o4L98m41J90M3L1q3r1O1q0
$$ 22 -97 -223 -201 -163 -111 -322 -189 28 -42 -286 -151 -103 239 -137 -201 197 -244 -54 -11 20 -63 -154 -93 -173
4226a73lL51j84l21L17k7R8l14K22J98j34m72M37j18J36P6j46J33K46m32P3O4
$$ -173 -176 175 -9 -330 -13 -40 58 -256 -34 164 30 -442 -5 -123 13 89 -57 76 322 -110 -37 27
4248B7j49j1J64K60k32O5O7k99K12j43k01L96r0J85j66m9r2M6q3J12j0m3R6k63
$$ 27 -122 -133 31 291 59 124 191 -108 104 -39 -240 156 66 251 85 36 -56 -10 -93 19 9 -34 62 -201
4272b01K86j26J53J31k82Q0K05m93L43k79KK18k20J22Kj35K84k7k56L66q2q5p7
$$ -201 85 -41 112 243 -39 41 246 -247 96 -183 -181 37 -183 -61 -59 -194 90 63 -193 173 91 6 -71
4295g1N8m3N9m4j80L81k43K4R0J33l57K24j51j58L55P9j23k0K6j13L0j32J71J87
$$ -71 -13 -56 3 -41 -221 160 -83 -59 31 164 -193 31 -120 -278 77 156 33 13 39 -74 -44 -176 -5 182
4319A82j19Q6o6J05R5l00P0J84l19L60l07J37J17o1l74L60l62K51j1K18l54J45
$$ 182 63 149 83 188 283 -17 53 237 -82 278 -29 108 225 164 -210 150 -212 39 28 246 -108 37
4341C7j02J76j15k02L42j28n6p6Q9J55l24K15L1lnM9l66N70P1m82K12j35K69l69
$$ 37 -65 111 -4 -206 136 8 -48 -124 -35 120 -204 11 42 39 34 83 -283 287 358 -124 88 -47 222 -147
4365a47L7L59l21k70J83j56L88k40J32K49r8R0k48j16O9k17K05l8K39m60M65j61
$$ -147 -110 249 -72 -342 -159 -315 73 -167 -35 214 116 206 -42 -158 -89 -306 -101 -139 100 -360 105 -56
4387e6k30P7N2K42k00J80K60l44K6k2r7N5N4k25J90K7R5Q3l57r6O1k7L28k62p1
$$ -56 -286 -209 -157 85 -115 65 325 -19 7 -15 -112 -57 -3 -228 -38 -11 84 167 -190 -286 -225 -252 76 -186 -257
4412b57J29M0j21J86K9k07N1k4J52J45R8L4n59J78L17l79L67k33K07k45P3J93
$$ -257 -128 -88 -209 -23 6 -201 -150 -174 -22 123 221 255 -304 -126 191 -188 179 -54 153 -92 -19 174
4434A74j09j12J59j73L58l76J11n9P0K59j34OMr5l7J30k86M7M2p1K28j45j23m8
$$ 174 65 -47 112 -61 297 -79 32 -27 43 302 168 174 178 83 46 176 -110 -63 -21 -92 136 -9 -132 -180
4458a80J89Q8n4j66K28J0k20J9J46k34J74j91L80m5o9l36K27O4L66n79L47k20
$$ -180 9 97 43 -123 105 115 -105 -86 60 -174 0 -191 189 144 75 -261 -34 30 396 -183 164 -56
4480e6l68M32p9J32J21o1j14Q6j22k26K66j15L6M9l04N24k63JP1k65L85k65n8
$$ -56 -424 8 -71 61 182 121 7 93 -29 -255 11 -104 -68 -19 -323 201 -62 -61 10 -255 130 -135 -193
4503a93M09l21K54m7l2L3j00m8N2R7k04J19p0J69j13Q7J09l59M91j65j11J31k59
$$ -193 216 -105 149 102 70 103 3 -45 7 104 -100 19 -51 118 5 92 201 -158 333 168 57 188 -71
4526g1L2K26l50M84j06m14J95J3L6J66k37j2p6K25j63k77M12p6q1L3J21k81L11
$$ -71 -39 187 -163 321 215 -199 -4 9 45 211 -26 -38 -114 111 -52 -329 83 7 -74 -41 80 -201 110
4549A10j46J18q5j66L14k89L1K31j0l28J35j22O9K73k48J87j04l02L63j93J87
$$ 110 -36 82 -3 -169 145 -144 -113 118 108 -220 -85 -207 -138 135 -113 74 -30 -332 31 -162 25
4570B5j71J2Qj25P6J84j65K16k7j84L41k65L4j95K77L8K25l76L52m28K31q5J4
$$ 25 -146 -134 -126 -251 -175 9 -156 60 33 -151 190 -75 -41 -236 41 79 304 -72 280 -148 83 -2 12
4593A2n3J63j00J00J3j81K06m2k1j13J47j56J15P5m5K03J22n45j1J44N0K5J86
$$ 12 -41 122 22 122 135 -46 160 118 97 -16 131 -25 90 165 120 323 445 -100 -111 33 83 108 294
4616B94l97K20N4k80L34l65J38j2N5j54J72J20L9j71p6J07j98J62O9m15M07P8
$$ 294 -103 117 171 -109 225 -140 -2 -14 41 -113 59 179 218 47 -29 78 -120 42 111 -304 103 181
4638A81p55O09j56L86k1n33K75k1R1k60J12J90k8O8j14j55J92k69L3K48O5m30
$$ 181 -574 35 -121 265 244 -289 -14 -35 56 -204 -92 98 70 138 24 -131 61 -208 -175 73 138 -292
4660b92N2j9K9O7K22r4P1Q8k04j69K16Q3P4m17K32J06L3L04k80L3j75R9k12Q7
$$ -292 -240 -259 -230 -163 59 -35 36 124 -80 -249 -33 50 124 -293 -61 45 78 382 102 135 -40 59 -153 -66
4684f6L9j90R3J17p9J3J44M9j66J82j70j39J99L9m6k0Q6O0k88L70m89J81J57K1
$$ -66 -27 -217 -124 -7 -86 -73 71 120 -46 136 -34 -173 26 65 19 -1 85 145 -143 227 -262 -81 76 97
4708I7l4l24L6J70K76k42J0k7J74mm0l00J57L7N5J7m69O25r4l12L06j92Q8k9Q2
$$ 97 63 -261 -225 -55 221 -21 -11 -38 136 132 92 -208 -51 -14 41 58 -411 214 120 -192 114 -78 10 -19 63
4733F3Q5k32o5K38N2l09j4L48k87r8M8L37o0k5l19J89n0K6J97j3j60J24j17j31
$$ 63 148 -84 -149 89 141 -168 -182 166 -121 -219 -171 166 106 81 -238 -49 -99 -73 124 111 -49 75 -42 -173
4757a73M0J61j75O0L6k06J94R8j1j25J73J3O8n14J33M85k73k82M74k87L55j05
$$ -173 -133 28 -147 -87 -51 -257 -63 35 24 -101 72 85 153 -361 -228 257 -16 -298 176 -111 244 139
4779A39l10j04L06Q3JJ96k04j80K59n60P03p3n1l28L23r8k88J49J97l05n9J39
$$ 139 -171 -275 31 114 115 311 107 -73 186 -374 329 256 205 -123 200 102 -186 -37 160 -145 -204 -65
4801f5N6O5l2j46J3N7K36r5k36L15n0K5j2J62m60L05j46K1l59O13j82j93J16O9
$$ -65 -9 56 24 -122 -109 -52 184 89 -147 168 118 143 131 293 -167 138 -8 13 -346 267 85 -108 8 77
4825G7j65O3J21p2J42k29K32k63J29m6P2o1L34m73j18M46l54L84m08l7L00n4K2
$$ 77 -88 -25 96 24 166 -63 169 -94 35 -11 61 0 334 -139 -257 189 -165 219 -189 -226 74 20 42
4848D2j60n7K02J1nJ14n71K65Q4J97J99m51k84L78O8k24L59k37L44l39j45L60
$$ 42 -118 -175 27 38 33 147 -424 -159 -75 122 321 -130 -414 -36 32 -192 167 -70 274 -65 -210 150
4870A50j04Mn8j09J10k5R3p7oj27M6J80j06r5R6L3p7J18m7l4j39N47m31K09n1
$$ 150 46 50 -8 -117 -7 -32 61 -16 -22 -149 -103 77 -29 -124 -28 5 -72 46 -1 -35 -174 373 -58 151 100
4895A00j53J67j24j5J60j37N4n4K9K25l37J05j11k53M35l63J8M32l19J15M7l21
$$ 100 -53 114 -10 -25 135 -2 52 -2 27 252 -85 20 -91 -344 91 -272 -254 178 -141 -26 21 -300
4917c00K86q1K91j71j55J99r7p4L94l22j16J65k54R4M7J54K60l50L49p6n23M18
$$ -300 -14 -95 196 25 -130 69 -28 -102 292 -30 -146 19 -235 -141 -94 60 320 -30 319 243 -280 138
4939A38O7k83n4J03J4k2J51j81K67k06L23k83n7j23J83k40K27k5QL10j40k61q
$$ 138 205 -78 -132 -29 -15 -37 114 -67 200 -6 317 34 -23 -146 37 -203 24 -1 7 317 177 -84 -92
4962i2K02O7l06Q1O4n3J37l96K81K25l76K06p1m3K74k16L61l55j0J50n9k23J87
$$ -92 110 177 -129 -48 16 -37 100 -296 -15 210 -166 40 -31 -74 200 -16 345 -10 -20 130 71 -152 35
4985C5L97k76J41m41P4p1J83p0k06N44k70L6N7J9l11K40j67R2n9n8qp0M3K07m9
$$ 35 432 156 297 -144 -70 -141 42 -28 -234 310 40 76 133 152 -159 81 -86 6 -53 -111 -119 -189 -146 61 12
5010A2j68N0j38J13K60k67J54K7qL3j03n1n2Q2R7L5l88M59j20P0p0j05J68P2k44
$$ 12 -156 -106 -244 -131 129 -138 16 43 35 68 -35 -86 -138 -56 41 76 -312 147 27 97 27 -78 90 162 -82
5035h2J18J02j51L41n38L42k08K29q7J42j81J41P4j52j26K2Q9k28J04J79k15k5
$$ -82 36 138 -13 328 -210 132 -76 153 66 208 27 168 242 90 -36 -14 75 -153 -49 130 -85 -110
5057a10K83j80K14j70j93K34j95K08j55K38l7j02mr8J96j2j03j05L95m85K91p3
$$ -110 173 -7 207 37 -156 78 -117 91 -64 174 137 35 31 -67 129 117 14 -91 304 -181 110 37
5079C7j44K28k36M8K05k66J73N2j68K2l6p6J26lj19M8K20j94O6l9J89J1j68J11
$$ 37 -107 121 -115 -67 138 -128 45 97 -71 -49 -85 -161 -35 -38 -157 -109 111 -83 -17 -56 133 144 -24 87
5103H7j17K9Oj27K49k3k93L5MO5j69O6K97r7o2j70pK15j83q4O5M08J16l67j01
$$ 87 -30 -1 5 -122 127 104 -189 -154 -150 -85 -254 -188 109 12 -50 -220 -227 -12 -195 -279 -214 194 310 -57 -158
5128a58R2l8k6M64n98J60K36k36J6j2j45K60L9K4o4P3k18J33n1j50K75k47K85
$$ -158 -66 -104 -130 334 -264 -104 132 -104 -88 -100 -245 15 54 78 14 87 -131 2 -49 -199 76 -171 114
5151A14j88J49j23n0Q9M8k08J82j61J74R4Q3k15r4K45M3k31J64j56k2J40m7K6
$$ 114 -74 75 -48 -98 -9 39 -169 13 -148 26 120 203 -12 -106 139 182 -49 115 -41 -63 77 30 56
5174E6M7j71QJ6M1p4R1R7o8j58J22l27M77k20k5k29L88o2J91m3j68k58K65n5M51
$$ 56 103 -68 -60 -44 -3 -77 14 111 43 -115 7 -320 157 -63 -88 -317 71 9 200 157 -11 -269 -4 -59 392
5199C92l80j31J79j12J62k22jj73L69q5J56k15K06j50R9k5ON5j54J43j83J47l02
$$ 392 12 -119 60 -52 110 -112 -113 -286 83 -2 154 -61 145 -5 94 69 75 130 -24 119 -64 83 -219
5222b19J73K43o5j7K9j05K25l74M98n31L45j42r1J50q4j85K40k83J03L08m28J02
$$ -219 -46 197 132 115 144 39 264 -110 388 -143 202 60 -31 119 35 -150 90 -193 -90 218 -210 -108
5244a08J86JP8J13l55J8o8J62j33J59N1L4j87O3q3j13J69M8J42j14l23J64q1K7
$$ -108 78 79 157 270 -85 -67 -135 27 -106 53 104 138 -49 14 -69 -182 -13 35 177 63 -260 -96 -177 -150
5268a50K35k17m6K16p7q6o6L22O6l77K77K1K1j56j51J32J77k63j16K09J07j28
$$ -150 85 -132 -178 38 -39 -125 -191 131 197 -180 97 118 139 -17 -168 -36 141 -122 -238 -29 78 -50
5290e0o4k9K74n5o1l96L44k2N5J66l65J03L56l4l13M1N8J87k81j92L00L38l99
$$ -50 -114 -143 131 76 15 -381 -37 -59 -4 162 -203 -100 256 222 -91 -50 8 195 -86 -278 22 360 -39
5313c9rK17j10kj39L66j69l66K62l3j09R2j61K55J64k71K14q6L7K8k6r7O1k6J04
$$ -39 -48 169 59 57 -82 284 115 -251 11 -22 -131 -39 -200 55 219 -52 162 76 113 141 115 18 79 53 157
5338A57j59K12j26l56L27j11j02K88j10O5J06j13j13K76m72K83J35m2j07j48Q3
$$ 157 -2 210 84 -272 55 -56 -158 130 20 85 191 78 -35 241 -231 52 187 145 38 -110 -27
5359b7p8oM6J39k79J22K27j12O1l88J45j27J50p8L1J53j63q6K95q1j0J7j80J49
$$ -27 -105 -111 -65 74 -205 -83 144 32 93 -295 -150 -277 -127 -205 -174 -21 -184 -270 25 -56 -66 -49 -229 -80
5383h0K71p7j82J52j44k15L26J01k73J86n5k5j3P5j03n9K75j04J64r0j26K15j98
$$ -80 191 114 -68 84 -60 -275 51 152 -121 65 10 -15 -28 47 -56 -115 160 56 220 130 4 219 21
5406B1j29P9L1q9R6k3M7K07k79R8J17q7L54l37j85k60M92P0k11p2J07J03o8p8
$$ 21 -108 -29 2 -87 9 -14 33 240 -39 59 176 89 443 106 -79 -339 153 223 12 -60 47 150 82 4
5430DpP8o6K97j36l20L96r7rN1k10K06j17MP1r4j47lJ52j76Q5L5L21m56J60j36
$$ 4 -3 75 9 306 170 -150 246 149 140 191 -19 187 70 74 145 51 -96 -99 53 -123 -38 -3 318 -138 22 -114
5456a14R8j56K26j27J67L0J32k38j01J52k84M39l01K69l55K23l78OK6M6J48K0
$$ -114 -16 -172 54 -73 94 124 256 18 -83 69 -215 224 -77 192 -163 60 -318 -312 -286 -240 -92 -72
5478g2j01L37k14J2j07L13j36k42q6L18j80J68K46j37J53l22J64j06l0j6J74k08
$$ -72 -173 164 -50 -38 -145 168 32 -210 -296 22 -158 10 256 119 272 -50 114 8 -22 -38 136 -72
5500g2J11P2n3R2k10J81j36K3M8N0R5l9J49m71L84l57L6M06k0l36Jj22M18k01
$$ -72 39 111 58 150 -60 121 -15 8 56 106 201 162 311 -160 224 -133 -97 309 289 -47 -46 -168 250 49
5524D9J63l73M71j27j04j59L5J35k51P5m7J04J81n7l33k2L72j89PQ9j5k57M13
$$ 49 212 -161 310 183 79 -80 -45 90 -161 -86 -133 -29 152 95 -238 -260 112 -77 -70 19 4 -253 160
5547A60j59R3j08J96k64j52K88j70L91m60J23j20K28k15K03q7P3k3rP1J07k19
$$ 160 1 94 -14 182 -82 -234 54 -116 275 -185 -62 -182 46 -169 34 -53 20 -3 -12 59 166 -53
5569e3Q4q3Jkp2K16l3l9r6J29j6oj77l3j6J58RL3J25J38m80K92Nj1j3N0Q4j11
$$ -53 31 -52 -51 -53 -125 91 58 19 -77 52 36 30 -147 -180 -196 -38 -29 4 129 267 -213 79 84 73 60 110 194 83
5597H3j44J3K42j48L1M3k39J66k0o9J79j08k17J47K0K2j11J10m5O9j56N3j33M88
$$ 83 -61 -48 194 46 77 120 -119 47 27 -42 137 29 -188 -41 -21 1 -110 0 -45 24 -132 -79 -212 276
5621B76l49J46k09K2L73j56K06l54P7K31k93J73j98P1j35Q4K28l15J67j63O5j75
$$ 276 -73 73 -136 -114 259 103 309 -45 32 263 -30 143 -55 16 -119 -35 193 -122 45 -118 -53 -228
5643b28M19j29j58o5J51rj51J79j86J6R3nJ42o5J73j8l06L49k50M8k03O8K26j56
$$ -228 191 62 -96 -161 -10 -19 -170 9 -177 -161 -68 -73 69 4 177 159 -147 202 -48 0 -203 -135 91 -65
5667f5J28J31m53J90k0K06k20K94mK6k08k21M3K43Qk11J39o1P4Lj26J71l11L77
$$ -65 63 194 -259 -69 -89 117 -103 191 187 213 5 -216 -173 70 78 -133 6 -55 19 22 -104 67 -244 133
$$ [...]
8191A03
##END NTUPLES=NMR FID
##END=
