##TITLE=1H_Pr 2869
 CDCl3,8 sc, 
 4.03.2021
##JCAMPDX= 6.0         $$ Bruker NMR JCAMP-DX V2.0
##DATA TYPE= NMR FID
##DATA CLASS= NTUPLES
##ORIGIN= UXNMR, Bruker Analytische Messtechnik GmbH
##OWNER= root
$$ XWIN-NMR		Version 3.5
$$ Thu Mar  4 11:29:25 2021 Russian Standard Time (UT+4h)  she@DPX200
##.OBSERVE FREQUENCY= 200.1315066352
##.OBSERVE NUCLEUS= ^1H
##.DELAY= (6, 6)
##.ACQUISITION MODE= SIMULTANEOUS
##.ACQUISITION SCHEME= undefined
##.AVERAGES= 8
##.DIGITISER RES= 18
##SPECTROMETER/DATA SYSTEM= spect
##.PULSE SEQUENCE= zg30
##.SOLVENT NAME= CDCl3
##.SHIFT REFERENCE= (INTERNAL, CDCl3, 0, 15.7039)
##AUDIT TRAIL= $$ (NUMBER, WHEN, WHO, WHERE, WHAT)
$$ ##TITLE= Audit trail, XWIN-NMR		Version 3.5
$$ ##JCAMPDX= 5.01
$$ ##ORIGIN= Bruker BioSpin GmbH
$$ ##OWNER= she
$$ F:/spectra/data/she/nmr/H-F/1/audita.txt
$$ ##AUDIT TRAIL=  $$ (NUMBER, WHEN, WHO, WHERE, WHAT)
(   1,<2021-03-04 11:27:50.96 +0400>,<she>,<DPX200>,
      <created by zg, POWCHK disabled, PULCHK disabled
       configuration hash MD5:
       00 E9 B6 7A A2 85 ED C7 34 08 36 98 17 FE 4E 26
       data hash MD5: 16K
       BE BD C9 34 C2 85 44 E1 0A E9 35 E7 E5 D7 63 25>)
$$ ##END=
$$ 
$$ hash MD5
$$ 87 17 08 42 11 CB A1 B5 19 19 EB DB 4A CF 13 E4
##$RELAX= 
##$RELAX= 
##$RELAX= 
##$RELAX= 
##$RELAX= 
##$RELAX= 
$$ Bruker specific parameters
$$ --------------------------
##$DU= <F:/spectra>
##$EXPNO= 1
##$NAME= <H-F>
##$PROCNO= 1
##$TYPE= <nmr>
##$USER= <she>
##$AMP= (0..31)
100 100 100 100 100 100 100 100 100 100 100 100 100 100 100 100 100 100 
100 100 100 100 100 100 100 100 100 100 100 100 100 100 
##$AQSEQ= 0
##$AQ_mod= 1
##$AUNM= <au_zg>
##$AUTOPOS= <>
##$BF1= 200.13
##$BF2= 200.13
##$BF3= 200.13
##$BF4= 200.13
##$BF5= 200.13
##$BF6= 200.13
##$BF7= 200.13
##$BF8= 200.13
##$BYTORDA= 1
##$CFDGTYP= 0
##$CFRGTYP= 5
##$CHEMSTR= <none>
##$CNST= (0..31)
1 1 145 1 1 1 1 1 1 1 1 1 1 1 1 1 1 1 1 1 1 1 1 1 1 1 1 1 1 1 1 1 
##$CPDPRG= <>
##$CPDPRG1= <>
##$CPDPRG2= <>
##$CPDPRG3= <>
##$CPDPRG4= <mlev>
##$CPDPRG5= <mlev>
##$CPDPRG6= <mlev>
##$CPDPRG7= <mlev>
##$CPDPRG8= <mlev>
##$CPDPRGB= <>
##$CPDPRGT= <>
##$D= (0..31)
0 1.2 0 0 0 0 0 0 0 0.06 0 0.03 0 0 0 0 0.0002 0 0 0 0 0 0 0 0 0 0 0 0 
0 0 0 
##$DATE= 1614842870
##$DBL= (0..7)
120 120 120 120 120 120 120 120 
##$DBP= (0..7)
150 150 150 150 150 150 150 150 
##$DBP07= 0
##$DBPNAM0= <>
##$DBPNAM1= <>
##$DBPNAM2= <>
##$DBPNAM3= <>
##$DBPNAM4= <>
##$DBPNAM5= <>
##$DBPNAM6= <>
##$DBPNAM7= <>
##$DBPOAL= (0..7)
0.5 0.5 0.5 0.5 0.5 0.5 0.5 0.5 
##$DBPOFFS= (0..7)
0 0 0 0 0 0 0 0 
##$DE= 6
##$DECBNUC= <off>
##$DECIM= 32
##$DECNUC= <off>
##$DECSTAT= 4
##$DIGMOD= 1
##$DIGTYP= 9
##$DL= (0..7)
0 120 120 120 120 120 120 120 
##$DP= (0..7)
150 150 150 150 150 150 150 150 
##$DP07= 0
##$DPNAME0= <>
##$DPNAME1= <>
##$DPNAME2= <>
##$DPNAME3= <>
##$DPNAME4= <>
##$DPNAME5= <>
##$DPNAME6= <>
##$DPNAME7= <>
##$DPOAL= (0..7)
0.5 0.5 0.5 0.5 0.5 0.5 0.5 0.5 
##$DPOFFS= (0..7)
0 0 0 0 0 0 0 0 
##$DQDMODE= 0
##$DR= 18
##$DS= 0
##$DSLIST= <SSSSSSSSSSSSSSS>
$$ [...]
##$SUBNAM2= <"">
##$SUBNAM3= <"">
##$SUBNAM4= <"">
##$SUBNAM5= <"">
##$SUBNAM6= <"">
##$SUBNAM7= <"">
##$SUBNAM8= <"">
##$SUBNAM9= <"">
##$SW= 16.9725356469052
##$SWIBOX= (0..15)
0 0 2 0 0 0 0 0 0 0 0 0 0 0 0 0 
##$SW_h= 3396.73913043478
##$TD= 16384
##$TD0= 1
##$TE= 0
##$TE2= 300
##$TE3= 300
##$TEG= 300
##$TL= (0..7)
0 120 120 120 120 120 120 120 
##$TP= (0..7)
150 150 150 150 150 150 150 150 
##$TP07= 0
##$TPNAME0= <>
##$TPNAME1= <>
##$TPNAME2= <>
##$TPNAME3= <>
##$TPNAME4= <>
##$TPNAME5= <>
##$TPNAME6= <>
##$TPNAME7= <>
##$TPOAL= (0..7)
0.5 0.5 0.5 0.5 0.5 0.5 0.5 0.5 
##$TPOFFS= (0..7)
0 0 0 0 0 0 0 0 
##$TUNHIN= 0
##$TUNHOUT= 0
##$TUNXOUT= 0
##$USERA1= <user>
##$USERA2= <user>
##$USERA3= <user>
##$USERA4= <user>
##$USERA5= <user>
##$V9= 5
##$VALIST= <valist>
##$VCLIST= <CCCCCCCCCCCCCCC>
##$VD= 0
##$VDLIST= <DDDDDDDDDDDDDDD>
##$VPLIST= <PPPPPPPPPPPPPPP>
##$VTLIST= <TTTTTTTTTTTTTTT>
##$WBST= 1024
##$WBSW= 4
##$XGAIN= (0..3)
0 0 0 0 
##$XL= 0
##$YL= 0
##$YMAX_a= 380781
##$YMIN_a= -239911
##$ZGOPTNS= <>
##$ZL1= 120
##$ZL2= 120
##$ZL3= 120
##$ZL4= 120
##$ABSF1= 10
##$ABSF2= 0
##$ABSG= 5
##$ABSL= 3
##$ALPHA= 0
##$AQORDER= 0
##$ASSFAC= 0
##$ASSFACI= 0
##$ASSFACX= 0
##$ASSWID= 0
##$AUNMP= <proc_1d>
##$AZFE= 0.1
##$AZFW= 0.1
##$BCFW= 1
##$BC_mod= 2
##$BYTORDP= 1
##$COROFFS= 0
##$CY= 11.3945322036743
##$DATMOD= 1
##$DC= 2
##$DFILT= <>
##$DTYPP= 0
##$F1P= 15.9154993809931
##$F2P= -4.1035820241983
##$FCOR= 0.5
##$FTSIZE= 0
##$FT_mod= 4
##$GAMMA= 1
##$GB= 0.15
##$INTBC= 1
##$INTSCL= 1
##$ISEN= 128
##$LB= 0.24
##$LEV0= 0
##$LPBIN= 0
##$MAXI= 10000
##$MC2= 0
##$MEAN= 0
##$ME_mod= 0
##$MI= 1.114404
##$NCOEF= 0
##$NC_proc= 0
##$NLEV= 6
##$NOISF1= 3.799351
##$NOISF2= 2.8
##$NSP= 1
##$NTH_PI= 0
##$NZP= 0
##$OFFSET= 15.70392
##$PC= 1
##$PHC0= -10759.48
##$PHC1= 8.200939
##$PH_mod= 1
##$PKNL= yes
##$PPARMOD= 0
##$PSCAL= 0
##$PSIGN= 0
##$REVERSE= no
##$SF= 200.130013532006
##$SI= 16384
##$SIGF1= 3
##$SIGF2= 2
##$SINO= 400
##$SIOLD= 16384
##$SREGLST= <1H.CDCl3>
##$SSB= 0
##$STSI= 0
##$STSR= 0
##$SW_p= 3612.71676300578
##$SYMM= 0
##$S_DEV= 0
##$TDeff= 0
##$TDoff= 0
##$TI= <>
##$TILT= no
##$TM1= 0
##$TM2= 0
##$TOPLEV= 0
##$USERP1= <user>
##$USERP2= <user>
##$USERP3= <user>
##$USERP4= <user>
##$USERP5= <user>
##$WDW= 1
##$XDIM= 8192
##$YMAX_p= 0
##$YMIN_p= 0
$$ End of Bruker specific parameters
$$ ---------------------------------
##NTUPLES= NMR FID
##VAR_NAME=  TIME,          FID/REAL,        FID/IMAG
##SYMBOL=    X,             R,               I
##VAR_TYPE=  INDEPENDENT,   DEPENDENT,       DEPENDENT
##VAR_FORM=  AFFN,          ASDF,            ASDF
##VAR_DIM=   8192,          8192,            8192
##UNITS=     SECONDS,       ARBITRARY UNITS, ARBITRARY UNITS
##FACTOR=    0.0002944,     1,               1
##FIRST=     0,             0,               0
##LAST=      2.4114304,     0,               0
##MIN=       0,             -239911,         0
##MAX=       2.4114304,     380781,          0
$$ Real data points
##PAGE= N=1
##DATA TABLE= (X++(R..R)), XYDATA
0@%%%%%%%%%%oOqJ6j6J6k4L2m0M8n6P2q6J01j19J36j56J81k08K40k75L13l56M03
$$ 0 0 0 0 0 0 0 0 0 0 0 -6 0 -8 8 -8 8 -16 16 -24 24 -32 40 -46 55 -64 72 -84 97 -111 129 -146 167 -189 214
34B14m56N14n77O47p24Q08r00J000j108J227j360J503j657J829k017K220k446
$$ 214 -242 272 -305 342 -382 426 -474 526 -582 645 -715 788 -869 960 -1057 1163 -1283
51a283K697k973L280l624M011m449M951n534O221p042Q046r305J0939j3153J6340
$$ -1283 1414 -1559 1721 -1903 2108 -2341 2610 -2924 3297 -3745 4301 -5004 5935 -7218 9122
66I122k1355L0444n2139K01244K13465k81105n7612J09854J01323k9574p8588
$$ 9122 -12233 18211 -33928 167316 380781 99676 42064 151918 253241 223667 145079
77A45079j26212N3234J82936q023k41840m5990J74723M9414j37365j06739k8518
$$ 145079 18867 72101 255037 247014 5174 -40816 133907 183321 45956 -60783 -89301
88h9301N2842Q5979n3151j90625K509K03728N4229j49271m5862R4500Q0080K6682
$$ -89301 -36459 49520 -3631 -194256 -191747 11981 66210 -83061 -128923 -34423 45657 72339
100G2339n0462j08479J8997J48766q215j80975m7938J17013M7174n9627n4541
$$ 72339 21877 -86602 -67605 81161 72946 -108029 -155967 -38954 8220 -51407 -105948
111a05948k9447M4892J03963j0854j34316j6431J30256L3264r5526m5406L2923
$$ -105948 -135395 -90503 13460 2606 -131710 -148141 -17885 15379 -80147 -125553 -92630
122i2630L7073L9400o462p0155J6038J25571L8101q5205j4257P5667L0228j7453
$$ -92630 -55557 -16157 -22619 -92774 -76736 48835 86936 1731 -12526 63141 93369 75916
134G5916k1724m1711j1966N7131k097r2597k8114O1984J3897m3468j0877N876
$$ 75916 54192 12481 515 57646 55549 -37048 -65162 -3178 10719 -32749 -43626 -37750
146c7750M29K4172R041n0702j8830N3558J2265m8097o611L2928L705P169K6792
$$ -37750 -37321 -13149 -4108 -54810 -73640 -20082 -7817 -55914 -62525 -29597 -25892 -18723 8069
159H069m774o825M2512K7297k7963j862K8867j0404k4223R598j780l0974j760
$$ 8069 3295 -3530 38982 66279 38316 36454 65321 54917 30694 40292 38512 7538 5778
172E778J3886j6482j1955J7944j708j7130J9000J6599k5315j3348K6357O480k1741
$$ 5778 19664 3182 -8773 9171 7463 -9667 9333 25932 617 -12731 13626 20106 -1635
185a635k054M247l884J6516J9441k1837j2305L9467K5451k3884j6367J2795O339
$$ -1635 -3689 558 -3326 13190 32631 10794 -1511 37956 63407 39523 23156 35951 42290
198D2290j05p237l1494k0195K6492J4718m1614l1229K1835K6189n684j7121j4104
$$ 42290 42185 34948 3454 -16741 9751 24469 -17145 -48374 -26539 -350 -6034 -23155 -37259
211c7259L799L2308J3788l7886k8881L3864L4867j7938k9191Q65K3440K6895M105
$$ -37259 -33460 -1152 12636 -25250 -54131 -20267 14600 -3338 -32529 -31664 -8224 18671 22776
224B2776l1961j4102M1919L3707k9322m0622Q066K7695O426k2576l2539o430L3730
$$ 22776 -9185 -23287 18632 52339 23017 -17605 -9539 18156 24582 2006 -30533 -36963 -3233
237c233K0870l4280l4906K2053M1494j008k9011j5194J4044L1429Q717l3031k6336
$$ -3233 17637 -16643 -51549 -29496 11998 10990 -18021 -33215 -19171 12258 20975 -12056 -38392
250c8392K9060M0141j0445l4696k386K9266K4535m586k9514j3618K9518K8593
$$ -38392 -9332 30809 20364 -14332 -16718 12548 37083 32497 2983 -10635 18883 47476
262D7476k2921m1344J095L0566Q975k3205k6852n03K7977J8964k3920l1576J1873
$$ 47476 24555 -16789 -15694 14872 23847 642 -26210 -26713 1264 20228 -3692 -35268 -23395
275b3395L6714L818k8786j6414J3040K4261O234k2478k1760J8316L3945k261k9397
$$ -23395 13319 17137 -11649 -28063 -15023 9238 15472 -7006 -28766 -10450 23495 21234 -8163
288h163p261K3621J9096n934k2588j2261J6525K1998j1460l1340m335K4140J2144
$$ -8163 -15424 8197 27293 21359 -1229 -13490 3035 25033 13573 -17767 -22102 2038 14182
301A4182j5540j8583Q99J8721J4490j1940k2697L468K6921P272k0562j3224J0072
$$ 14182 -1358 -19941 -19042 -321 14169 2229 -20468 -17000 9921 17193 -3369 -16593 -6521
314f521J7799N561j1881j4365Q420K3227K440k0115q772J4239J2114n504j5431
$$ -6521 11278 16839 4958 -9407 -987 22240 24680 4565 -4207 10032 22146 16642 1211
327A211q164P181J2038l794j9480n767J4713R442j0086j0939J269Q293P071l912
$$ 1211 -6953 228 12266 8472 -11008 -16775 -2062 7380 -2706 -13645 -12376 -4083 2988 -924
341i24j1031j626J3261O176j0140o377O246Q232J500l061m621J011Q810L056q429
$$ -924 -11955 -13581 -320 5856 -4284 -10661 -4415 3817 5317 2256 -2365 -1354 7456 10512 2083
356B083n951N279L540m052m085j373r07J101J446l946k779L552K815l459p17L573
$$ 2083 -3868 1411 4951 899 -3186 -4559 -5466 -4365 -2919 -6865 -9644 -6092 -3277 -6736 -7453 -3880
372c880j026p91L378J797k215P91K198O81J911K931k870k717N529N031m072n583
$$ -3880 -4906 -5697 -2319 -522 -2737 -1946 252 933 2844 5775 2905 188 5717 10748 6676 1093
388A093P64L764J257k450o387k381N793M912o534q923L897R123M91p103m591L470
$$ 1093 1857 5621 6878 4428 -1959 -4340 1453 6365 -169 -9092 -5195 3928 4419 -2684 -7275 -3805
404c805R626L925r789q085Q895J3295k686j1234l153Q764R965j913j2609n947
$$ -3805 5821 9746 -43 -8128 767 14062 11376 142 -3011 5753 15718 13805 1196 -4751
418d751J2148J1293q558j6298j3J3931O081r954j3813L47J4193Q277j2855j6070
$$ -4751 7397 18690 10132 -6166 -6179 7752 13833 3879 -9934 -9587 4606 12883 28 -16042
432a6042O186J7647K580j4851r746Q131J5145L065j5772j0933J2081J7402m328
$$ -16042 -9856 7791 10371 -4480 -14226 -6095 9050 12115 -3657 -14590 -2509 14893 10565
445A0565j8542n691J3300J3160o712j7690n654J5276J2920r723j9319k14J8221
$$ 10565 -7977 -13668 -368 12792 6080 -11610 -17264 -1988 10932 1209 -18110 -18324 -103
458a03P959j2821j5415K879J6808P494j3857j5990P838K0201K686j6907r679J1062
$$ -103 7856 -4965 -20380 -17501 -693 6801 -7056 -23046 -15208 4993 7679 -9228 -18907 -7845
472g845J7073P70j6137r549J2600J6636m010j8671m901J4710J1958o968j5645
$$ -7845 9228 9998 -6139 -15688 -3088 13548 9538 -9133 -14034 676 12634 5666 -9979
485i979k511J4451J1427r030j5962P08J7200O789j2183j2490L545J4293N357j0864
$$ -9979 -12490 1961 13388 4358 -11604 -10896 6304 13093 910 -11580 -8035 6258 11615 751
499G51j2246O540J5589J846j3097p192R118J1943p54j2677o484Q736J1631l491
$$ 751 -11495 -4955 10634 12480 -617 -7809 1309 13252 12498 -179 -6663 2073 13704 10213
513A0213j3656l861J0878R030n543j0392j258R985P415n338j0928M08J0948L900
$$ 10213 -3443 -7304 3574 12604 7061 -3331 -4589 5396 12811 7473 -3455 -3047 7901 11801
527A1801q169p355L280Q279K453o381o553L515Q955J339q080m402M544N398j298
$$ 11801 3632 -3723 -443 7836 10289 3908 -2645 870 9825 11164 3084 -1318 3226 8624 7326
542G326o591l914L333M432j485o459k322M640L753l313m114K7K744J861k015m049
$$ 7326 735 -3179 154 4586 3101 -3358 -5680 -1040 2713 -600 -4714 -4687 -1943 -82 -2097 -6146
558f146o89L104J394l221j944J126K114N51n67r71P29J549O54j626k30P53j94
$$ -6146 -6835 -3731 -2337 -5558 -7502 -6376 -4262 -3711 -4278 -5249 -4520 -2971 -2317 -3943 -4173 -3420 -3614
575c614k14l20P15m94r4R05J389O44j84j33N86K154R81k219k072J676K428o98
$$ -3614 -3828 -4148 -3433 -3927 -4021 -3116 -1727 -1083 -1267 -1400 -814 1340 2321 102 -1970 -294 2134 1436
593A436k435j221K152K839K19l370j161L575L443j992m681o03L847K564k819n054
$$ 1436 -999 -2220 -68 2771 2990 -380 -1541 2034 5477 3485 -1196 -1799 2048 4612 1793 -3261
609c261o44N214L568l646m967J510O467K112m528m520J910O206J291o099n459
$$ -3261 -3905 1309 4877 1231 -3736 -2226 4241 6353 1825 -2695 -785 5421 6712 613 -4846
624d846L664O742m23o469l549M757P142q20p605k911O032O578l222q262j785P082
$$ -4846 -1182 5560 5137 -1332 -4881 -124 7018 6198 -1407 -4318 1714 8292 5070 -3192 -4977 2105
640B105M820m379p822M6Q233N340n815p593J712R086K852p693o708K345Q370J086
$$ 2105 6925 2546 -5276 -5230 3003 8343 2528 -5065 -3353 5733 8585 892 -5816 -3471 4899 5985
656E985q521o699M911Q675J1q993m462O700P929j885r086l113P330P130m147r146
$$ 5985 -2536 -9235 -4324 4351 4362 -4631 -9093 -2393 5536 3651 -5435 -8548 -1218 5912 1765 -7381
672g381j302Q795N967n200p919J243Q939M874o101p517K321R102J950p694o738
$$ -7381 -8683 112 6079 879 -7040 -5797 3142 8016 1915 -5602 -3281 5821 7771 77 -6661
687f661L459Q018N50p793n546N067Q410n02q497l250O392O433k560p599j695O215
$$ -6661 -3202 4816 5366 -2427 -7973 -2906 5504 5002 -3495 -6745 -353 6080 3520 -4079 -5774 441
703D41N397l516p462P7P256M307m824n802J504P013K742n372n895J943O492K72
$$ 441 5838 2322 -5140 -5063 2193 6500 1676 -4126 -2622 4391 7133 1761 -4134 -2191 4301 4573
719D573n907m363L077N106j84n405l089L976N379r75n097j816M734L605k096m422
$$ 4573 -1334 -5697 -2620 2486 2302 -3103 -6192 -2216 3163 2188 -2909 -4725 9 3614 1518 -2904
735b904o83M240K839k079l955O03M163J894k645k378J070K830P56l093k607Q26
$$ -2904 -3587 653 3492 1413 -2542 -1939 2224 4118 1473 -905 165 2995 3751 658 -1949 -1123
751a123K567l96k590j744J585K280l17j755n74J565J863k46j182k65J138Q38k80
$$ -1123 1444 1048 -1542 -3286 -1701 579 262 -1493 -2067 -502 1361 1115 -67 -332 806 1644 1364
768A364p10j04N12O06j68m39o2L67J71m79k91m96n23j65J59m54r31r18K48N34
$$ 1364 654 550 1062 1668 1500 1061 999 1366 1537 1058 767 271 -252 -417 -258 -712 -1643 -2561 -2313 -1779
788a779L45q01l90P22J486L19j044m60J553J106l91r96l95J191J567o44k116j69
$$ -1779 -1434 -2235 -2625 -1903 -417 -98 -1142 -1602 -49 1057 666 -330 -725 466 2033 1389 -727 -896
806h96K208J112j111k448k30K234R61k225k203L64K332O88k524j519J491K537
$$ -896 1312 2424 1313 -1135 -1365 869 1830 -395 -2598 -2234 98 786 -1738 -3257 -1766 771
822G71M03k482j268K269K788l33k638j152K475K403j131k991p75K778J647j597
$$ 771 1174 -1308 -2576 -307 2481 2148 -490 -1642 833 3236 2105 -886 -1661 1117 2764 1167
838A167l066J14K885J083k536k511Q53K831R80l142j987J481L170M64l217j249
$$ 1167 -1899 -1785 1100 2183 -353 -2864 -2011 820 1800 -1342 -3329 -1848 1322 1786 -1431 -2680
854b680K268L286l32l178k11K277K651j094l013m59K836J516k046k776q7K997
$$ -2680 -412 2874 2542 -636 -847 1430 4081 2987 -26 -485 2351 3867 1821 -955 -1042 1955
870A955Q94k483k895R26K808J71k350k317J515K541p6k571j212K137K057k88k418
$$ 1955 2849 366 -2529 -1603 1205 1376 -974 -3291 -1776 765 689 -1882 -3094 -957 1100 812 -1606
887a606n44K240J678j080j807j33J986J298j269j780m8J709N53j405j619K03J966
$$ -1606 -2150 90 1768 688 -1119 -1252 734 2032 763 -1017 -1065 644 1197 -208 -1827 -1624 342
904C42K88j476j330R66J903k23j481p45J366J721q03j122l59J556Q86l63r34m15
$$ 342 630 -846 -2176 -1210 693 470 -1011 -1756 -390 1331 528 -594 -953 603 1489 1126 192 -223
922b23J410M14o21j263N32M71Q78j442r65M49J021j94j085m05O23M68l6q21j98
$$ -223 1187 1601 980 -283 249 720 1598 156 -809 -360 661 467 -618 -1023 -400 68 32 -789 -987
941i87M66N05J62o91R9M79L86j92l30K56K91K9j03k72n3M16Mk00m12j82M39jl04
$$ -987 -521 -16 146 -545 -446 33 419 227 -103 153 444 473 370 98 45 461 465 265 -147 -329 110 109 -195
964a95j98r8K18Mj94J76Pk6J56K15m24K64K2k9N20j62p6J0J9J48J40k83j24K02
$$ -195 -393 -491 -273 -269 -463 -287 -280 -306 -150 65 -359 -95 -73 -102 418 256 180 190 209 357 497 214 90 292
988B92N6k06j35K50p3j8j8n73L95j27Q6j30l41R1K12K37k61K2K95O2J52k15j79
$$ 292 348 142 7 257 184 166 148 -425 -30 -157 -71 -201 -542 -451 -239 -2 -263 -241 54 116 268 53 -126
1011a26J67N31m27k44p7J24J83J45m27j66M49J32l46j60j78L06K66l67l61l24
$$ -126 41 572 145 -99 -176 -52 131 276 -151 -317 132 264 -82 -242 -420 -114 152 -215 -576 -900
1031i00R05J10m24n9j44O33J93j53l42K75P13J09o15k44K08N51R5p28k95L64M74
$$ -900 5 115 -309 -368 -512 121 314 161 -181 94 807 916 301 57 265 816 911 183 -112 252 726
1052G26N0r17l98N30M86k62q88R7N91O22q71o55K27P00M41o55p92M39Q83K33m65
$$ 726 776 -141 -539 -9 477 215 -673 -576 15 637 -234 -889 -662 38 479 -176 -968 -529 354 587 122
1073A22o15L01R89M7j153k65M07Q81l01r47l17N95O78m1j302n7P48O22l40j304
$$ 122 -493 -192 797 844 -309 -574 -167 714 413 -534 -851 -256 422 381 -921 -978 -230 392 52 -1252
1093a252K98R51N64o31p67K92J147L97o72q57M46J406Qj027m21N54J013j77r83
$$ -1252 -954 -3 561 -70 -837 -545 602 999 327 -530 -84 1322 1330 303 -118 436 1449 1272 289
1112B89o66O94N11k45j089n66R18M26k23j167q3Q24N23o63n98P8J218K47n95p04
$$ 289 -377 317 828 583 -506 -1072 -154 272 49 -1118 -1201 -377 146 -517 -1115 -1037 181 428 -167 -871
1132h71P15Q88j9o09l59N31P63p0j065o06O12O86k14r59l33Q13K69j79p97n8O19
$$ -871 -156 732 713 104 -255 276 1039 969 -96 -702 -90 596 382 -577 -910 -97 172 -7 -804 -862 -243
1153b43K57k20o21J98P05N36l08m40M11L46M19l62l06m4Q06o0n77k68J90J26k23
$$ -243 14 -206 -827 -629 76 612 304 -136 275 621 1040 678 372 328 1134 1074 497 229 419 545 322
1174C22j64l91j34K0j7j74j41n9J17R8L1j60p9k1K86J37J47l13K99J52P5J06j74
$$ 322 158 -233 -367 -347 -364 -538 -679 -738 -621 -523 -492 -652 -731 -752 -466 -329 -182 -495 -196 -44 31 137 -37
1197c7K84L58J9k83l48J50L67j90n46k46K48N12M4j146p4M87O40oq88m2P92O41
$$ -37 247 605 624 341 -7 143 510 320 -226 -472 -224 288 332 -814 -888 -401 239 233 -655 -697 95 736
1219G36j84r12R3J146J24l09o79J61J187K51q29r68L78N98K72j063q11O41Q91
$$ 736 552 -360 -267 879 1003 694 15 176 1363 1614 785 -183 195 793 1065 2 -809 -168 723
1238G23l53j096o17O54P94l15j004k77J178N55n4j377K07J087P27q83q10J26J363
$$ 723 370 -726 -1343 -689 105 -210 -1214 -1491 -313 242 188 -1189 -982 105 832 -51 -861 -735 628
1257F28L91r05j061P43J043Q6q86j000O18J256o4j206n71M33J124q2j268m16Q76
$$ 628 1019 114 -947 -204 839 925 39 -961 -343 913 849 -357 -928 -495 629 547 -721 -1137 -261
1276b61J219k84j455k7J175Q20o25j080J12J211O75r79j028M22J224M52j073j145
$$ -261 958 674 -781 -808 367 1187 562 -518 -406 805 1480 501 -527 -105 1119 1571 498 -647
1294f47K00J457m4p89j036M39R45J04j013o56O19R59m28m34n48N19J161n94q58
$$ -647 -447 1010 966 177 -859 -420 525 629 -384 -1040 -421 538 110 -324 -872 -353 808 214 -644
1313f44l15J179L46j77q39k5P75L25k27q35P4Q17L01n50m76j34P33J16o61n02
$$ -644 -959 220 566 389 -450 -475 300 625 398 -437 -363 454 755 205 -271 -405 328 444 -217 -719
1333g19K92M03J80l80m50J24N97O26p15l20M95J97J02n35j83L51L68k67j94j31
$$ -719 -427 -24 156 -224 -674 -550 47 673 -42 -362 133 330 432 -103 -286 65 433 166 -28 -159
1353a59K43K97r9k03j30K25R2q9l77l04M39o0L4j71M3l4L56j55k64J27J8J79Q3
$$ -159 84 381 282 79 -51 174 266 177 -200 -504 -65 -125 -91 -262 -219 -253 103 -52 -316 -189 -171 8 91
1376I1j65k8J4J67p3j43K92o4P0j01K11m65J52J63J12j88r2k3M2J06k07J07m65
$$ 91 -74 -102 -88 79 6 -137 155 91 161 60 271 -194 -42 121 233 45 -47 -70 -28 78 -129 -22 -487
1399d87N18J99j03j00j2L31k7j49k95L4K69O3R9l85j85M19J15P9m46J33L18L06
$$ -487 31 230 127 27 15 346 319 170 -125 -91 178 241 340 -45 -230 189 304 383 -63 70 388 694
1421F94m22m27J34J12L55p10m51K86K67L83m62p93P63N98J29n98o44N95N00K47
$$ 694 272 -155 -21 91 446 -264 -715 -429 -162 221 -241 -1034 -271 327 456 -142 -786 -191 309 556
1441E56q89j21L11P37k65p97q8Q18O15n83r44J30O19M90m43j044j57J241L13o73
$$ 556 -333 -454 -143 594 329 -468 -556 262 877 294 -650 -520 99 589 146 -898 -1055 186 499 -174
1461a74o83L27Q03K60p95p37N62Q81K78j152m17N00J030j54q16r00J034Q85n03
$$ -174 -857 -530 273 533 -262 -999 -437 444 722 -430 -847 -347 683 529 -287 -1187 -153 732 229
1480B29r58k75J182L51k79j066k08J000Q04o04j145J7J154N27p86q03M33R92L42
$$ 229 -729 -1004 178 529 250 -816 -1024 -24 780 176 -969 -952 202 729 -57 -860 -427 565 907
1499I07q41n28K14J342k69q26n10K70J395m63p37p21R30P98n66n85k74P09N82
$$ 907 66 -462 -248 1094 825 -1 -511 -241 1154 691 -46 -767 163 961 395 -190 -464 245 827
1518H27l89j003k9Q84N25p14o89Q9Q84K74m87o79K04R20M44q56o86M23O95j05
$$ 827 438 -565 -594 290 815 101 -588 -499 385 659 172 -507 -303 617 1061 205 -481 -58 637 532
1538E32p06m08L93N25j69j52q02N84O03r2p24p6L64L10k11k84k55N26J93O3o25
$$ 532 -174 -582 -189 336 167 15 -787 -203 400 308 -416 -492 -128 182 -29 -313 -568 -42 151 214 -411
1559d11L65K03J02Ln06J12M49o5k22k58M39J42l1m20l4p4L97k0k71j95j14K95
$$ -411 -46 157 259 262 -244 -132 317 252 30 -228 211 353 322 -98 -132 -206 191 171 -100 -295 -409 -114
1581a14J80l3k83R3J27L0j60J0J3K98j16J10M4j33K51l00J93k33l2J90r9j88J24
$$ -114 66 33 -250 -157 -30 0 -160 -150 -137 161 45 155 199 66 317 17 210 -23 -55 135 36 -152 -28
1604b8k97J60n7O02p31K0J07O05l39k1k38K02J60O6l91j55N36K36q5k89j26K34
$$ -28 -325 -165 -222 380 -351 -331 -224 381 42 21 -217 -15 145 211 -180 -335 201 437 352 63 -63 171
1626A71L92Q5o55j89M98L71k77p41N0M59J34j94o20J6O88N0l33m65N0N04N13p21
$$ 171 563 648 -7 -196 302 673 396 -345 -295 164 298 104 -516 -500 188 238 -95 -560 -510 -6 507 -214
1648b14l08J19R79j07n15l65O5Q50O6p50k59J75P30n5m25q36Q25N99k29r57k42
$$ -214 -522 -403 576 469 -46 -411 -346 504 570 -180 -439 -264 466 411 -14 -850 -25 574 345 -612 -854
1669h54O37N48k50r00J3Q73L62m03r07K59O72N03l92n44N2P50J24k1q84K76O17
$$ -854 -217 331 81 -819 -806 67 429 26 -881 -622 50 553 161 -383 -331 419 543 522 -362 -86 531
1690E31N38p03q51L25O43L89j121k60K55P77J33q24p85N94P15K10j191l93Q17
$$ 531 1069 366 -485 -160 483 872 -249 -509 -254 523 656 -168 -953 -359 356 566 -625 -1018 -201
1709b01O92j36q90n9P19N22p5o78k54O78N84n45q00N9P77R1k52j023K79Q65K14
$$ -201 491 355 -535 -594 125 647 572 -106 -360 318 902 357 -443 -384 393 484 232 -791 -512 353 567
1730E67o75q06N15N70J8n00m85N28N64Po13j56L94R51l62m55L4L22P58j87o75
$$ 567 -108 -914 -399 171 189 -311 -796 -268 296 303 -310 -466 -72 879 517 62 96 418 1176 989 314
1751C14k21L50M94m21k96l91M33L08m89l21j25L88J03l25k33m8K58K94n37j69
$$ 314 93 443 937 516 220 -171 262 570 81 -240 -365 23 126 -199 -432 -480 -222 72 -465 -634
1771f34J41M71R5R6m09J11L14J22k51m58L19K28J54m16m69K44R2M1k30j59k84
$$ -634 -493 -22 73 169 -240 -129 185 307 56 -402 -83 145 299 -117 -586 -342 -250 -209 -439 -598 -882
1792h82K77K6j9k21j90K23J58j0j17l2L98M64l08j75J20M22K83j77k37j17M39
$$ -882 -605 -579 -598 -819 -1009 -786 -628 -638 -755 -787 -389 75 -233 -408 -288 134 417 240 3 -114 325
1813C25J12l95l45L49K52j53k20k16j73L36K99l46n36j3O47M9k69l96M74K75N24
$$ 325 437 42 -303 46 298 145 -75 -291 -464 -128 171 -175 -711 -724 -77 -28 -297 -693 -219 56 580
1834E80l25o62N56P83n9o27l21M48Q44k85o09m29P51N32l77r51k34O32K14O9o00
$$ 580 255 -407 149 932 873 246 -75 373 1217 932 323 -106 645 1177 800 -151 -385 247 461 530 -70
1855g0o38P57K31k73m31M5M30O41n99l59K17P28K69p24k66L73O61N3p35n81O46
$$ -70 -708 49 280 7 -424 -379 51 692 93 -266 -49 679 948 224 -42 331 992 1045 310 -271 375
1876C75N20j09q09o06K81J160n98r27K05M9M73J16j027k6Q68M33m18n59j35Q16
$$ 375 895 786 -23 -629 -348 812 214 -713 -508 -459 14 130 -897 -923 -55 378 -40 -599 -734 82
1896H2M32l13q45M60O35k7%q41M52N79l6p00k48L45O25l08p00k72L68K79r3m85
$$ 82 514 201 -644 -184 451 424 424 -417 35 614 578 -122 -370 -25 600 292 -408 -680 -312 -33 -126 -611
1918f11m87O93L22Pm80k14M60O21m28k83J7M68L27o7m85LL20M01k50p49K71N85
$$ -611 -1098 -405 -83 -76 -556 -770 -310 311 -117 -400 -383 85 412 345 -140 -137 183 584 334 -415 -144 441
1940D41q8m50O6k22L92pj01m89L56oJ48m07O1J55J03K8j23j32J06M81k16J11j90
$$ 441 353 -97 -31 -253 139 132 31 -458 -102 -108 40 -367 -306 -151 -48 -20 -143 -275 -169 312 96 207 17
1963A7J85K71L2j62k55J42M20q3n33J51N8K3j26j11l3M2kl1k55j33K74j26J79
$$ 17 202 473 505 343 88 230 650 567 34 185 243 266 140 29 -4 38 36 5 -250 -383 -109 -235 -56
1986e6j90k07M75P0n7j60L16l6L16l08J08l7J54%p5l17oR0K16O0m32J8J32j86
$$ -56 -246 -453 22 92 35 -125 191 155 471 163 271 234 388 388 313 -4 -10 80 296 356 -76 -58 74 -112
2010a12Q6j27k29r7K97j50Q8n0j18K33R9o0K5O6L46P4l83j06K74K86o9j69r0j98
$$ -112 -26 -153 -382 -479 -182 -332 -244 -294 -412 -179 -80 -140 -115 -49 297 371 -12 -118 156 442 373 204 114 -84
2034h4P20k79l52j74K65K68Pp98JK14R3J12l70k64L10K28j51M8m18P28O3R9m98
$$ -84 636 357 5 -169 96 364 371 -427 -426 -212 -119 -7 -377 -641 -331 -103 -254 -206 -624 104 167 266 -232
2057b32J00O49k9n07j9n5O26j31l52l23L75K14K93p02l52K31K19K5l71k73K73
$$ -232 -132 517 488 -19 -38 -93 533 402 50 -273 102 316 609 -93 -445 -214 5 30 -341 -614 -341
2078c41N81l28l96k41N79K09n1k06j0M05N40m42k41j18M37L96k64n82N2M74qk65
$$ -341 240 -88 -484 -725 -146 63 12 -194 -204 201 741 299 58 -60 377 773 509 -73 -21 453 445 180
2100A80n10mN88N4l19o02J50N77j82k14k60L10J78j7l87j37M27L77J47n07j37
$$ 180 -330 -334 254 308 -11 -613 -463 114 -68 -282 -542 -232 -54 -71 -458 -595 -168 209 356 -151 -288
2121b88L81L75k81k55q2J49M47l74j36k78L67j3l9o42N31j23N08m22k46J32K08
$$ -288 93 468 187 -68 -150 -1 446 72 -64 -342 25 12 -27 -669 -138 -261 247 -175 -421 -289 -81
2142h1L32l47m61K72M60j32l04L78L8K67K9k30j71J99L50l11j09j72L75J58k48
$$ -81 251 -96 -557 -285 175 43 -261 117 155 422 451 221 50 249 599 288 179 7 382 540 292
2163B92k54l61M87J0J89n98N0J24J67O0l62j11L45J69k65l99M05L60k1o9j60p4
$$ 292 38 -323 164 174 363 -235 -185 -61 106 166 -196 -307 38 207 -58 -457 -52 308 287 218 58 -16
2185a6K93K59j79m05j3r3K56j38k36k03K35K29N8l09J4l1k1K52p5m86L73K92N0
$$ -16 277 536 357 -48 -61 -154 102 -36 -272 -475 -240 -11 47 -262 -248 -279 -300 -48 -123 -609 -236 56 106
2208A06j03j18mO4K97k74j38L22L93p2l88J30J54q0K3n43J13J08K29j49l33J40
$$ 106 3 -115 -119 -55 242 -32 -170 152 545 473 85 215 369 289 312 -231 -118 -10 219 70 -263 -123
2230a23K07J87m64j44J60J54j48N6j95j8K64K36l61j18l1M86k6k45l09J54M43
$$ -123 84 271 -193 -337 -177 -23 -171 -115 -310 -328 -64 172 -189 -307 -338 148 122 -123 -432 -278 165
2251A65R8p35l5J48pJ70k58k99M23M2r1j33m1K98L35j27m48L15q4M84j38k72r3
$$ 165 263 -472 -507 -359 -366 -196 -454 -753 -330 -288 -379 -512 -553 -255 80 -47 -495 -180 -264 220 82 -190 -283
2274b83M91J76k57j11k25O41K73n91j14M11J53k0n28j90L76n3J68j98k33L15K29
$$ -283 208 384 127 16 -209 432 705 114 0 411 564 544 16 -174 202 149 317 119 -114 201 430
2295D30K6n78j21L32K97j25n21J48K91J19N6m09k81M27K63j57l05J89J68Rm21
$$ 430 456 -122 -243 89 386 261 -260 -112 179 298 354 -55 -336 91 354 197 -108 81 249 258 -163
2316a63k02R5N35N5n24k17K04N89k11j65j85R6K98J95m60J32j6J86j64k83J03
$$ -163 -365 -270 265 320 -204 -421 -217 372 161 -4 -189 -93 205 400 -60 72 56 242 78 -205 -102
2337a02Q4L04o0j71l46L28K02L5l24k17M85n4j60k16R8J1J91pm76J68K4L43k63
$$ -102 -18 286 226 55 -291 37 239 274 -50 -267 218 164 4 -212 -114 -103 88 81 -395 -227 -203 140 -123
2360a23j8k26K65Jn1l34K28L14j02j45j67K47K18k19k87%M73j42L43p02N8K11
$$ -123 -141 -367 -102 -101 -152 -486 -258 56 -46 -191 -358 -111 107 -112 -399 -399 74 -68 275 -427 -369 -158
2382a58J53Q1k45Q9N1J81P2l72M28p5Rj96J87j84Q0J22M9k17q5K97j04q5Pj59
$$ -158 -5 76 -169 -80 -29 152 224 -148 280 205 214 18 205 21 101 223 272 55 -30 267 163 78 85 -74
2406g4J61k3k4m0l00L25j54K98l24L12k61K7K90k40j58L73q1j41J6k65K71K04
$$ -74 87 64 40 0 -300 25 -129 169 -155 157 -104 -77 213 -27 -185 188 107 -34 -18 -283 -12 192
2428A92l03r5m4K78j89J72j28l28K35M62m41K00l79N39j58l1k13K53K94j83j5
$$ 192 -111 -206 -250 28 -161 11 -117 -445 -210 252 -189 11 -368 171 13 -18 -231 22 316 133 118
2449A18R0K9P3M7k27j34P4J55K09m04q9J78K32k02j2n62L71K47j06l72J03K79
$$ 118 208 237 310 357 130 -4 70 225 434 30 -59 119 351 149 137 -425 -54 193 87 -285 -182 97
2471I7j01J27k81k0K49K03j94l36K70l7N04l50l70K80P5J04k00l61J40M07j41
$$ 97 -4 123 -158 -178 71 274 80 -256 14 -23 481 131 -239 41 116 220 20 -341 -201 206 65
2492F5j32p7Q4J30M1j19k44J06K31R0l54K1Q4K56J17m17L1L19L6j67j60J87J80
$$ 65 -67 -144 -60 70 111 -8 -252 -146 85 175 -179 -158 -74 182 299 -118 -87 232 268 101 -59 128 308
2515C08q6Ql10R0K48R0l59k98K51P2M3j22n4P1O4j27K31k00R0K53k05j87J41J36
$$ 308 222 230 -80 10 258 348 -11 -309 -58 14 57 -65 -119 -48 16 -111 120 -80 10 263 58 -129 12 148
2539A48j06N5k39L52j60K49j68l68L08n8KK26m14j24K97L9j64r7o8M16o2k11J22
$$ 148 42 97 -142 210 50 299 131 -237 71 13 15 241 -173 -297 0 39 -125 -222 -290 126 64 -147 -25
2562b5j77L6J97Or7M8K64qj33k94K35J11K69l98k1j44L24k7r6l66K39L1Jj5k11
$$ -25 -202 -166 31 37 -60 -12 252 244 111 -183 52 163 432 34 13 -131 193 166 70 -296 -57 -26 -25 -40 -251
2587b51K07j05J44j1j28r9J54R0k05J14M0L74l14J76J70k51mQ4J7j42rJ10j99
$$ -251 -44 -149 -5 -16 -144 -243 -89 1 -204 -90 -50 324 10 186 356 105 101 185 202 60 51 161 -38
2610c8L99k11m3p9k16M7R0J93l62J43J5J4J37P3n8q0K2j93j1J48J3K4J56n4mj7
$$ -38 361 150 107 28 -188 -141 -51 142 -220 -77 -62 -48 89 162 104 24 46 -147 -158 -10 3 27 183 129 125 108
2636A08Q3k09K68Pk99J43o3J31k65JK5J01j63j41%R9Q4R0n6j47N1L41j51l3j23
$$ 108 191 -18 250 257 -42 101 38 169 -96 -95 -70 31 -132 -273 -273 -174 -90 0 -56 -203 -152 189 38 5 -118
2661a18J21J19J77j19k89J59L05M1k47j13J21O7j7n8o0J14N1l15k34K54l4L60
$$ -118 3 122 299 180 -109 50 355 396 149 36 157 224 207 149 89 203 254 -61 -295 -41 -75 285
2683B85k75J20j82J19j77J10j8J47k7J04J43l88K33k10K43k76J73P6N1n1k71J12
$$ 285 10 130 -52 67 -110 0 -18 129 102 206 349 -39 194 -16 227 -49 124 200 251 200 -71 41
2705D1l04M92k86j16j26o7J73Q0k40K6N4N1J16j9k17K3K84k5O9m2OK47j99L3J02
$$ 41 -263 229 -57 -173 -299 -366 -193 -113 -353 -327 -273 -222 -106 -125 -342 -319 -35 -60 9 -33 -27 220 21 54 156
2730A56J35M1k21j10J36q6K24k77j55O8K13k72O3M2M4l3j08K1m7L3k01J62K65
$$ 156 291 332 111 1 137 51 275 -2 -157 -89 124 -148 -85 -43 1 -32 -140 -119 -166 -133 -334 -172 93
2753I3j63N2J73j34J36l5j04K26q6N4j99J73j73N0j78o5J41J50k65o9p5J21j2
$$ 93 -70 -18 155 21 157 122 18 244 158 212 13 186 13 63 -115 -180 -39 111 -154 -223 -298 -177 -189
2776a89M2k41J56L7J02Q9j67J24K33j97l9K23r1J7j76K26J5m2J25j73jPQ5O4k15
$$ -189 -147 -388 -232 -195 -93 -4 -171 -47 186 -11 -50 173 82 99 -77 149 164 122 247 74 73 80 165 229 14
2801A4L5j36j09J08O6P9n9l34L04j55n0J03M0L01j55J26q5l5L9J0p6K44j39p3
$$ 14 49 -87 -196 -88 -22 57 -2 -336 -32 -187 -237 -134 -94 207 52 178 93 58 97 107 31 275 136 63
2825F3O7j16r0qM7P4K3k86J09k4J19k48j88L56p4J1jo0K65q3O9q6J69L2L7L37
$$ 63 130 14 -76 -84 -37 37 60 -226 -117 -141 -22 -270 -458 -102 -176 -165 -166 -226 39 -44 25 -61 108 140 177 514
2851E14k50k3N6J5J42j05j44o1l3j57J57l21L60n4l87L26j84K22m34J95L1j63
$$ 514 264 241 297 312 454 349 205 144 111 -46 111 -210 150 96 -291 35 -149 73 -361 -166 -135 -298
2873b98J75j81M98k73J69q0mQ4J08j02K8r7K55k90N7J0J90k08l04N42m67K30l20
$$ -298 -123 -304 194 -79 90 10 6 90 198 96 124 27 282 -8 49 59 249 41 -263 279 -188 42 -278
2896b78K32o5P6k27J15J8P0M6r3P7l1M86k47k00J89J97j24j33k7K85m1o7J7j03
$$ -278 -46 -111 -35 -262 -147 -129 -59 -13 -106 -29 -60 426 179 -21 168 365 241 108 81 366 325 258 275 172
2920A72K8K56l59J59m04O0l6j58J42R6M3p2p3J8N4l5J04r9L2J07K94j81j4J3J
$$ 172 200 456 97 256 -148 -88 -124 -282 -140 -44 -1 -73 -146 -128 -74 -109 -5 -104 -72 35 329 148 134 147 148
2945A48L6m3o0j56L7k5K4j12K90l36m3K76m61J40K66m70L27K29j39J4o6M75m92
$$ 148 184 141 81 -75 -38 -63 -39 -151 139 -197 -240 36 -425 -285 -19 -489 -162 67 -72 -58 -124 351 -141
2968a41O3K03Q0p2O0J08j59J69M8k14K7J3q7J0K30l20j34K45J07j50k91j13K72
$$ -141 -78 125 205 133 193 301 142 311 359 145 172 185 98 108 338 18 -116 129 236 86 -205 -318 -46
2991d6J3p5J8J61j70j14R2K7J51k5j90M83k66j8J55J8O1p8j96K88o8j7j70K6K6
$$ -46 -33 -108 -90 71 -99 -213 -121 -94 57 32 -158 325 59 41 196 214 275 197 1 289 221 204 34 60 86
3016H6l07j03P7M5L36l67n7J05K06p6k71J36O0J11J31J96l40K06j32J21k22K20
$$ 86 -221 -324 -247 -202 134 -233 -290 -185 21 -55 -326 -190 -130 -19 112 308 -32 174 42 163 -59 161
3038A61Jj43j17M4J64J93j99k90J84j1l9r6K59J53l86J42j25K15r7J13l62k8J78
$$ 161 162 19 -98 -54 110 303 104 -186 -2 -13 -52 -148 111 264 -122 20 -105 110 13 126 -236 -264 -86
3061h6K14O8k75J54K43k25KR2k11M59n39K57m3j00J14R8l21K52k53K18o1j5j06
$$ -86 128 196 -79 75 318 93 95 187 -24 435 -104 153 110 10 124 222 -99 153 -100 118 57 42 -64
3084f4j63L74k62J8n2P0k93O03n4l6j86lK19k46K27j32r6K64j5m52M3L80k16J18
$$ -64 -227 147 -115 -97 -149 -79 -372 231 177 141 -45 -48 171 -75 152 20 -76 188 173 -279 -236 144 -72 46
3108D6j98K55k11R2p8J66m0j4R8k79NN4o3OL09J86j61k19J49k8j56K12o3j49L49
$$ 46 -152 103 -108 -16 -94 72 32 18 116 -163 -158 -104 -167 -161 148 334 173 -46 103 75 -81 131 68 -81 268
3133B68l61J09J87l1k82K41k3l85J67L12j23n2j02J19j98k8K55k06j39L3Q2nJ52
$$ 268 -93 16 203 172 -110 131 108 -277 -110 202 79 27 -75 44 -154 -182 73 -133 -272 -239 -157 -162 -10
3156a0J1k34K68P6k0n3r2K0j70L16l62K38oP6q1N0l3k07K99O5M1j53j9j5Q5q7
$$ -10 1 -233 35 111 91 38 -54 -34 -204 112 -250 -12 -18 58 -23 27 -6 -213 86 151 192 39 20 5 90 3
3182Cj79ML72k33K21Q8j87J60J05l18J59k13J10j04K17r1j13K25P9j41m7l2K84
$$ 3 -176 -172 200 -33 188 276 89 249 354 36 195 -18 92 -12 205 114 1 226 305 164 117 85 369
3205C69l65J4j5j7K03k3j51j93K05J66k12l2J81j20J18j76J44j30l6j14j14J01
$$ 369 4 18 3 -14 189 166 15 -178 27 193 -19 -51 130 10 128 -48 96 -34 -70 -184 -298 -197
3227a97J44j3r1k3m4J05J50r6R9M6n1O2q2L2j97J09p6J52Po1%J20M2m15rJ49K08
$$ -197 -53 -66 -157 -180 -224 -119 31 -65 34 80 29 91 9 41 -156 -47 -123 29 36 -25 -25 95 137 -278 -287 -138 70
3254G0J02j53R4k31J54K31j27k80q7L40k8l6j39K66j85P1m06K70J5j22L8j88J28
$$ 70 172 19 113 -118 36 267 140 -140 -227 113 85 49 -90 176 -9 62 -344 -74 -59 -181 -143 -331 -203
3277b03R0K26m5j33J15K15k88m6K9j22J37P1O1k13k56L28m4J01j57Q8K12L0j8
$$ -203 -113 113 68 -65 50 265 -23 -69 -40 -162 -25 46 107 -106 -362 -34 -78 23 -134 -46 166 196 178
3300A78j48J09Q9l1l32n0R0K28j41J70n9O2j81J35J02k99K17q4M2l43K03n6n6
$$ 178 30 139 228 197 -135 -185 -95 133 -8 162 103 165 -16 119 221 -78 139 55 97 -246 -43 -99 -155
3323a55K58j56k4K31qk06QJ48M1j66J26N1l36p6L00k32L7j93L67j41J0J13l80
$$ -155 103 -53 -77 154 146 -60 -52 96 137 -29 97 148 -188 -264 36 -196 -159 -352 15 -126 -116 -3 -383
3346c83K86j14J33m6q8J3J10q2K03J65j09k12Q1J70j41R9J11p1R5j43K87j73r7
$$ -383 -97 -211 -78 -124 -212 -199 -89 -171 32 197 88 -124 -43 127 -14 85 196 125 220 77 364 191 94
3369I4K32j66n7J20l03N9M5J40k18j24L71j87J2J44k18k0K99l23L5q2K18l5R2
$$ 94 326 160 103 223 -80 -21 24 164 -54 -178 193 6 18 162 -56 -76 223 -100 -65 -147 71 36 128
3392A28k14J64k47J53J1n5J0q0J50L7k92j11J79k54K27k14Q1L84j96J39k67M2
$$ 128 -86 78 -169 -16 -5 -60 -50 -130 20 57 -235 -346 -167 -421 -194 -408 -327 57 -139 0 -267 -225
3414b25Q8N5J72l38J39J0J01K13k15J1J89j42R8N4l93M46k07K50k80J25j56j40
$$ -225 -137 -82 90 -248 -109 -99 2 215 0 11 200 58 156 210 -183 263 56 306 26 151 -5 -145
3436a45K59j12l54K22L58l39O1j8K9O8o9k7l2k8L38k34jL55l73K04k36q4J53L10
$$ -145 114 2 -352 -130 228 -111 -50 -68 -39 29 -40 -67 -99 -127 211 -23 -24 331 -42 162 -74 -158 -5 305
3460C05m1j34M3k34M5m1j28j03J04P9J62k44L6N2O5m2l9Q4Q6P0q6r1j43K01N3
$$ 305 264 130 173 -61 -16 -57 -185 -288 -184 -105 57 -187 -151 -99 -34 -76 -115 -31 55 125 39 -52 -195 6 59
3485E9K84k16Q2p4K77l10q8K5k0J07j64k13J99J76l72J97p6j00j03M09j40k17
$$ 59 343 127 209 135 412 102 14 39 19 126 -38 -251 -52 124 -248 -51 -127 -227 -330 79 -61 -278
3507b78R7L33m9r6l7J49J15k86J83k7J25o6J98m35J59J36P0q3l9j76n4J57j04
$$ -278 -181 152 103 7 -30 119 234 -52 131 104 229 163 361 -74 85 221 291 208 169 -7 -61 96 -8
3530hk5j93N2Q0j34J09K01Q6J09l35L3K96k20jM3N4q6J21k3j2k1K04k80J84o9
$$ -8 -33 -226 -174 -94 -228 -119 82 168 277 -58 -25 271 51 50 93 147 61 182 159 147 126 330 50 234 165
3555A65l1j42J96k27M6Lk63K61j53J76m6k02J25J06l7j28J60K33r5n9j28J27K07
$$ 165 134 -8 188 -39 7 10 -253 8 -145 31 -15 -217 -92 14 -23 -151 9 242 147 88 -40 87 294
3578B94j56m9j74R8K72j38k20J27J62k44r7O0L8j29p4o0m2M9J00J21K66j88l4
$$ 294 138 89 -85 13 285 147 -73 54 216 -28 -125 -65 -27 -156 -230 -290 -332 -283 -183 -62 204 16 -18
3601a8k75K66J54pM1j7j0k0q4O5K90k63q6j99j1k3K05l51j17L37k20K00o2m09
$$ -18 -293 -27 127 120 161 144 134 114 30 95 385 122 36 -163 -174 -197 8 -343 -460 -123 -343 -143 -205 -614
3625f14N58j53P7j34J67l17J68K60Q0j31J0J25K4l2K7J2K8K3m8l4k9j05K24k42
$$ -614 -56 -209 -132 -266 -99 -416 -248 12 92 -39 -29 96 120 88 115 127 155 178 130 96 67 -38 186 -56
3649e6p0L50j23q0j49R7J10r5q7l42N02j40J39J33n13O12j85J84k91M3m8K75l36
$$ -56 -126 224 101 21 -128 -31 79 -16 -103 -445 57 -83 56 189 -324 288 103 287 -4 39 -9 266 -70
3672g0K93j15j0j14K24l91l2K37o6M8j22q7J93J3q1o3J8J30M2j60L4K8JK12p8
$$ -70 223 108 98 -16 208 -183 -215 22 -44 4 -118 -205 -12 1 -80 -143 -125 5 47 -113 -79 -51 -50 162 84
3697H4n4O5M9K07j47n5m9L5J77l53J63j89N6M7j46L9p1K68r8j52nJ12J32l55J30
$$ 84 30 95 144 351 204 149 100 135 312 -41 122 -67 -11 36 -110 -71 -142 126 28 -124 -129 -17 115 -240 -110
3722a10j5j1J26j16J42l86J86L51m3j05j65J09K03l4n2j94J71K75k80q3k4N7j11
$$ -110 -125 -136 -10 -126 16 -370 -184 167 124 19 -146 -37 166 132 80 -114 57 332 52 -31 -55 2 -109
3745a09m5O6j10J13MR7l3j05K56k22J33k14J16K13l8J32l31K64J0J99L1j96j27
$$ -109 -154 -88 -198 -85 -81 16 -17 -122 134 -88 45 -169 -53 160 122 254 -77 187 197 396 427 231 104
3768A04K29Q0k95l8N8j2k88n7L4J38p1QLlj32K26k7k91oR0K11L4J50k56K00J37
$$ 104 333 413 118 80 138 126 -162 -219 -185 -47 -118 -110 -107 -110 -242 -16 -43 -334 -340 -250 -39 -5 145 -111 89 226
3794B26k62P5L5j23K09q6p5J54l74J81j81K83l36J16J11k83K60K4oj62O4j8j5
$$ 226 -36 39 74 -49 160 74 -1 153 -221 -40 -221 62 -274 -158 -47 -330 -70 -46 -52 -214 -150 -168 -183
3817a83K87q1n2K14n7lJ90j40j42L73j88PK4k60L89m9n4j86k00K73n0Q0j41k01
$$ -183 104 23 -29 185 128 125 315 175 33 406 218 225 249 -11 378 329 275 89 -111 162 112 192 51 -150
3841a50J6o4M5j97K34Jk6J45j0j90q6K59r6k30K68PK76j90o0LJ90J51l02j35j1
$$ -150 -134 -198 -153 -350 -116 -115 -141 4 -6 -196 -282 -23 -119 -349 -81 -74 202 12 -48 -45 145 296 -6 -141 -152
3866a52K6K38l03k48L59k84M31j79J8N1J40j73M4K7K52j42P5k37P5L24l59N16
$$ -152 -126 112 -191 -439 -80 -364 67 -112 -94 -43 97 -76 -32 -5 247 105 180 -57 18 342 -17 499
3888D99m31j39J81J26j79l4l0M4o4j10J26Qj22O4j80m4J53J05M1k66k14L85K7
$$ 499 68 -71 110 236 57 23 -7 37 -27 -137 -11 -3 -125 -61 -241 -285 -132 -27 14 -252 -466 -81 -54
3911e4J15n1l08K55p1L07k26k23P4J55O5r0R8j90R3J27k89J08k3J48p5Q7k29J37
$$ -54 61 10 -298 -43 -114 193 -33 -256 -182 -27 38 -52 46 -144 -51 76 -213 -105 -128 20 -55 32 -197 -60
3935f0M2l6k1j72M41Ql34R3j1K41j10L9o1J06ko6K54k17j23O0p8K3p1m2L12j07
$$ -60 -18 -54 -75 -247 194 202 -132 -39 -50 191 81 120 59 165 163 97 351 134 11 71 -7 16 -55 -97 215 108
3961A08n1j82oR6J16k18O2p1L40j89Mn7K03j39K51j93k56R6K11J10l90J46M1o0
$$ 108 57 -125 -131 -35 81 -137 -75 -146 194 5 9 -48 155 16 267 74 -182 -86 125 235 -155 -9 32 -28
3985b8K59j01o1j90K57r4J22k21j25J21J41l94j2M34k13J2J37j11pJ10j46J54
$$ -28 231 130 69 -121 136 42 164 -57 -182 -61 80 -314 -326 108 -105 -93 44 -67 -74 36 -110 44
4007D4o2R0L05k36m6m6L5Q2L9P3r8j95L36l89k22K55J27p1j10R1n1O3J90k31j19
$$ 44 -18 72 377 141 95 49 84 166 205 278 180 -15 321 -68 -290 -35 92 21 -89 2 -49 14 204 -27 -146
4032a46l6L97q0k89k3L77m8N6o1j88j1J71k08M4j00j15M87Q9m22M32m32P5L7j04
$$ -146 -182 215 135 -154 -177 200 152 208 147 -41 -52 119 -89 -45 -145 -260 227 316 -106 326 -106 -31 6 -98
4056i8L5o9K02O1j0l03J99P4l43R5N7N5r7P4K8k9K08o8j54o2J43j31L46j92l05
$$ -98 -63 -132 70 131 121 -182 17 91 -252 -157 -100 -45 -142 -68 -40 -69 139 71 -83 -145 -2 -133 213 21 -284
4081b84K50K57q3l03O9K31n0j32j74K70j96o5K27L8j72j09K70M6j89J7j03J9K33
$$ -284 -34 223 140 -163 -94 137 87 -45 -219 51 -145 -210 17 55 -117 -226 44 90 -99 -82 -185 -166 67
4104F7j39K46m83M85R2l39K8q8L81j69j28R2j91J74P4o5J31l16J69L8j97J07K7
$$ 67 -72 174 -309 176 268 -71 -43 -131 250 81 -47 45 -146 28 102 37 168 -148 21 59 -138 -31 -4
4127dL3l00L74k0j76N05m86K8j4J69n2J14j60k8J15K8j90n1K97j85J56l72R3J43
$$ -4 29 -271 103 83 -93 412 -74 -46 -60 109 57 171 11 -17 98 126 -64 -115 182 -3 153 -219 -126 17
4151A7J2o9r2K13j20L3j8J43j68J7J34k33P1J01J2J14P8k98N7%jJ09k10M9J56
$$ 17 29 -40 -132 81 -39 -6 -24 119 -49 -32 102 -131 -60 41 53 167 245 -53 4 4 3 112 -98 -49 107
4176A07K82k01m72J27L55J1j44l20J73K77l30Q2k01K12K47q4k22q9nJ18K27n7
$$ 107 389 188 -284 -157 198 209 65 -255 -82 195 -135 -53 -254 -42 205 121 -101 -190 -195 -77 150 93
4198I3k29M5L19j20J19m58L27M5k43j30M25j75R5j53Qj80L23K4l03k5N0K14j38
$$ 93 -136 -91 228 108 227 -231 96 141 -102 -232 193 18 113 -40 -32 -212 111 135 -168 -193 -143 71 -67
4221f7J76k16O8m2J95k2l07J95J39m2p1j83J78Q1kJ07l90K10J15j14K2m3k0j05
$$ -67 109 -107 -39 -81 114 92 -215 -20 119 77 6 -177 1 82 80 187 -203 7 122 8 30 -13 -33 -138
4245a38L50m44J63j1J75j34j12J27ROj78k1j20K68R5j15N0l6J99o9L3M4k61K07
$$ -138 212 -232 -69 -80 95 -39 -151 -24 -15 -9 -187 -208 -328 -60 35 -80 -30 -66 133 64 97 141 -120 87
4269H7N0k00J02L4J1Nk35Q7k1K78j29K65k33l7k13J73J56j60L7J13q0j71j04K49
$$ 87 137 -63 39 73 84 89 -146 -59 -80 198 69 334 101 64 -149 24 180 20 57 170 90 -81 -185 64
4293F4J29l31n8j16K50L23q8p2J10p1j1J20k50k06J33j18J06jj6L4K22L8k03j88
$$ 64 193 -138 -196 -312 -62 261 173 101 211 140 129 249 -1 -207 -74 -192 -86 -87 -103 -69 153 191 -12 -200
4317b00m5M02k02l31J81J62m6l6J07k3L7O9O6j08J55k31J05o3j67J90K22j42j61
$$ -200 -245 157 -45 -376 -195 -33 -79 -115 -8 -31 6 75 141 33 188 -43 62 -1 -168 22 244 102 -59
4340e9J06p3J15K28l37L7q0J2l5j12L31j34J01R6j40J18j62J17p8l5j7r0R9q7
$$ -59 47 -26 89 317 -20 17 -63 -51 -86 -198 133 -1 100 196 56 174 12 129 51 16 -1 -91 8 -79
4364g9%L00j93R2J5k46n7L47q1n1k34K53m0K82k28j53K3%J11q5J91l18K33R6k09
$$ -79 -79 221 28 120 135 -111 -168 179 98 47 -187 66 26 308 80 -73 -50 -50 61 -24 167 -151 82 178 -31
4389c1Pk15K83R6l34J32J42k62L48k22p5J18P1n9q8J13J09j49K02l09J41p7J30
$$ -31 -24 -239 44 140 -194 -62 80 -182 166 -56 -131 -13 58 -1 -89 24 133 -16 186 -123 18 -59 71
4412G1qM1k7l06J31J66j42j54J62K06p8J03j99Q6N2k19N9Jp7P9N2P7j18J20J61
$$ 71 63 104 77 -229 -98 68 -74 -228 -66 140 62 165 -34 52 104 -115 -56 -55 -132 -53 -1 76 -42 78 239
4437B39j97j07o3kJ28L5k0J65l56J39K6j37k5K07L3Q5k61O9K61Qo7o3q5J35L0
$$ 239 42 -65 -128 -130 -2 33 13 178 -178 -39 -13 -150 -175 32 65 150 -111 -42 219 227 160 97 12 147 177
4462A77o3m8k01Q7J08J14j40p2R6m5J41k40J31j64J39j72q3K41j34J50Q9j12j74
$$ 177 114 66 -135 -48 60 174 34 -38 58 13 154 -86 45 -119 20 -152 -235 6 -128 22 111 -1 -175
4485a75M23j01j7k72K11j73K53k26J78K7K7m1K4j33L9J95j57j19j27K02L5l7j5
$$ -175 248 147 130 -142 69 -104 149 -77 101 128 155 114 138 5 44 239 82 -37 -164 38 73 36 21
4508B1j84j3K41j42J6j20J88k1k66K31J00k16J77K41m09K1M29k02j49J39l19L98
$$ 21 -163 -176 65 -77 -61 -181 7 -14 -280 -49 51 -165 12 253 -156 -135 294 92 -57 82 -237 161
4530A61OQ6k77j16K45j73Q5k90L86o1l05J91j6K4j19K31j94j93R7M29l23J17J73
$$ 161 167 253 -24 -140 105 -68 17 -273 113 52 -253 -62 -78 -54 -173 58 -136 -329 -232 197 -126 -9 164
4553A64m37N84m1k96J10j37k1NO9l1j27J95j15nJ40L8n5O1r7QL0O4k68L23k48
$$ 164 -273 311 270 -26 84 -53 -74 -69 0 -31 -158 37 -78 -83 57 95 40 101 4 12 42 106 -162 161 -87
4578h7K8J6k5J42j58j01R5n3K36j79J63M1j18K41n30M93k50K69l41J46R1j95K2
$$ -87 -59 -43 -68 74 -84 -185 -90 -143 93 -86 77 118 0 241 -289 204 -46 223 -118 28 119 -76 -54
4601e4J35j93J99M0m1p4j11K15k7j73O0j08K84r1j25K11q7K35N0m60L10N9j89
$$ -54 81 -112 87 127 86 12 -99 116 89 -84 -24 -132 152 61 -64 147 60 295 345 -115 195 254 65
4624F5q5N8l1k39L51q6k8j00JN1l7j14J26j72K32l7j21K56l37M72k08j01MK64
$$ 65 -20 38 7 -232 119 33 5 -95 -94 -43 -80 -194 -68 -240 -8 -45 -166 90 -247 225 17 -84 -80 184
4648A84j71j21j02J59J64M4r3k53L07j17J86l51j4J72k09K40o8M2n3K86n88K46
$$ 184 13 -108 -210 -51 113 157 64 -189 118 1 187 -164 -178 -6 -215 25 -43 -1 -54 232 -356 -110
4670a10N3j70L70j8l36M8p8J29L52j47r0MJJ53l03J1p7J96L1J7j14j7P3M6k4J41
$$ -110 -57 -227 143 125 -211 -163 -241 -112 240 93 3 7 8 161 -142 -131 -208 -12 19 36 -78 -95 -22 24 0 141
4696A41l97L81j28k63K51j89J22J75j52k18J54O3J81p0j32J09L1j57OK38k90K30
$$ 141 -256 125 -3 -266 -15 -204 -82 93 -59 -277 -123 -60 121 51 -81 28 59 -98 -92 146 -144 86
4718H6j68J21j29J24o2L1M3j49k8J2R6Kl24M10q4k58P6O0K89k13K18K4j91J31
$$ 86 -82 39 -90 34 -28 3 46 -103 -131 -119 -23 -21 -345 65 -19 -277 -201 -141 148 -65 153 177 -14 117
4742A17j64K2k3M3O9J04m09M23k47J58r9N2L6k12J99n2Q8r5N3NQ8k66N7M8j28
$$ 117 -47 -25 -48 -5 64 168 -241 182 -65 93 -6 46 82 -130 69 17 105 10 63 68 156 -110 -53 -5 -133
4767a33kL38k26kK1K7j48K00M4k9j16j03l6J47J07L6k69n3J77k1l2j86m9J09J24
$$ -133 -135 203 -23 -25 -4 23 -125 75 119 90 -26 -129 -165 -18 89 125 -144 -197 -20 -41 -73 -259 -308 -199 -75
4792g5l1J60j22J31j43o0J48k76J74J50J11j87J2J97o8R8j41j12K9J52j80l0K70
$$ -75 -106 54 -68 63 -80 -140 8 -268 -94 56 167 -20 -8 189 121 219 78 -34 -5 147 -33 -63 207
4815B07k57K70k89k71M52j80j16J6K7L91k75r6R0m0K19j87p4Q6l5PJ79P9l51L45
$$ 207 -50 220 -69 -340 112 -68 -184 -168 -141 250 -25 -121 -31 -71 148 -39 -113 -27 -62 -55 124 203 -148 197
4839A97p8m68M82k25Kk2R1l0J62k85J13J70k15j05R8J92Nl6p8J86k65j66J44J84
$$ 197 119 -349 133 -92 -90 -112 -21 -51 111 -174 -61 109 -106 -211 -113 79 84 48 -30 156 -109 -275 -131 53
4863E3J09j38O4m1n7j0J32j14j8j19K79Q1k64O9j36L35j99j85J52Q9k24K72j76
$$ 53 162 24 88 47 -10 -20 112 -2 -20 -139 140 221 -43 26 -110 225 26 -159 -7 82 -142 130 -46
4886d6k7N3J8j75J99j38K15r5J26j90j07J76K72j93q3J04k36Q8K76l54j01K69
$$ -46 -73 -20 -2 -177 22 -116 99 4 130 -60 -167 9 281 88 5 109 -127 -39 237 -117 -218 51
4908E1l37L23ok7p3j12L98l56L0P5N3k37K69j35K41k29K72q7k21L30j14o9k63
$$ 51 -286 37 31 4 -69 -181 217 -139 -109 -34 19 -218 51 -84 157 -72 200 113 -108 222 108 39 -224
4931b24K67K79l67J39j37L1P1J67k63q5J51n9L05m01Q5o1N5j5Q5o2p6J64j59J18
$$ -224 43 322 -45 94 -43 -12 59 226 -37 -122 29 -30 275 -126 -41 -102 -47 -62 23 -39 -115 49 -110 8
4955Hm6j03R3j13K33k38J69J72j63o3j70K07J74k66o2J47K19l75K33j36j23J91
$$ 8 -38 -141 -48 -161 72 -166 3 175 12 -51 -221 -14 160 -106 -168 -21 198 -177 56 -80 -203 -12
4977a2k01J96j2j90l2J16K07j03N8j00r3L03l45K41R8O5j26nQ3k76M50l29P2r5
$$ -12 -213 -17 -29 -219 -251 -135 72 -31 27 -73 -166 137 -208 33 131 196 70 65 148 -128 322 -7 65 -30
5001c0R7P2l9kr2j03K19j32l9k39K79o7o9K76m54L79p9R5k11j1J15n4N9j84R1
$$ -30 67 139 100 98 6 -97 122 -10 -49 -288 -9 -76 -145 131 -323 56 -23 72 -139 -150 -35 -89 -30 -214 -123
5026a23N5j81N0J95j4M8M0j59K8M2mj53L57j16o9j16opJ53j88M54l54M0K03r9
$$ -123 -68 -249 -199 -4 -18 30 70 -89 -61 -19 -23 -176 181 65 -4 -120 -126 -133 20 -168 286 -68 -28 175 76
5051G6j76J37n7J89m5m4M4k84k0J46n7P0Rk9k3K14k90J14R1K5O9j47o2j50L34
$$ 76 -100 37 -20 169 124 80 124 -160 -180 -34 -91 -21 -12 -41 -64 150 -140 -26 65 90 159 12 -50 -200 134
5076A34l9k09JM9N5K22k46J93k10J6M0M7l12K43K5L7R6j93J77P2n6o9k78J93J76
$$ 134 95 -114 -113 -64 -9 213 -33 160 -50 -34 6 53 -259 -16 9 46 142 -51 126 198 142 73 -205 -12 164
5101A64l65R1N7Q7O3k20Q7lj5J17l0k6K2R2j77m3J73nqj5m4k4q8J71J68l62L9
$$ 164 -201 -110 -53 34 97 -123 -36 -39 -54 63 33 7 29 121 -56 -99 74 69 61 46 2 -22 -110 61 229 -133 -94
5128i4L10k72J71k14J01R9k49p2J49j59J05K55%k77l2K32k40J02K92k44K24j90
$$ -94 216 -56 115 -99 2 101 -148 -220 -71 -230 -125 130 130 -147 -179 53 -187 -85 207 -37 187 -3
5150cl84M44k36J88l9K51j47Rl0Q1k0m8l8M1k8j07J23l58L42pk06J1J11o8K95
$$ -3 -387 57 -179 9 -30 221 74 83 53 134 114 66 28 69 41 -66 57 -301 41 34 -172 -161 -50 -118 177
5175A77j36J4N4j56m8oj39L34n6L0p0l3PJn2l8N6o6J13N4l2j50L29k57K84k62
$$ 177 41 55 109 -47 -95 -101 -240 94 38 68 -2 -35 -28 -27 -79 -117 -61 -127 -14 40 8 -142 187 -70 214 -48
5201d8j6M2l0r1K40j21mK97k74l85M07n2J91j73R5l14J82L70l74k4n5K44nk17
$$ -48 -64 -22 -52 -143 97 -24 -28 269 -5 -390 17 -35 156 -17 78 -236 -54 316 -58 -82 -137 107 102 -115
5225a15J16m2K20j10l18N14k34j82K27j52n3K7P7J41p4N5k04J49j32P9P0q3R7
$$ -115 1 -41 179 69 -249 265 31 -151 76 -76 -129 -102 -25 116 42 97 -107 42 -90 -11 59 -24 73
5248G3J2q0J27J6j33J49j27k53J01mL11j49k21J79P6j95J08j41k9K46Q6l19J84
$$ 73 85 5 132 148 15 164 37 -216 -115 -119 192 43 -178 1 77 -118 -10 -151 -180 66 152 -167 17
5271A7J0M1J50l76J19m7R5j7Mm0j9J66j35j18J91J44q0J24l57K03J36k11K7k0
$$ 17 27 68 218 -158 -39 -86 9 -8 -4 -44 -63 103 -32 -150 41 185 105 229 -128 75 211 0 27 7
5295Gm8K3Q5Lk15L13k82J33j33J42q9m2P1j51J5K49M4l3L3k7j26K93m7j13k34
$$ 7 -41 -18 67 70 -145 168 -114 19 -114 28 -61 -103 -32 -183 -168 81 125 92 125 98 -28 265 218 105 -129
5320a29j1J67k25K91j10J77k67J15MJo9j7J9K51j69j56J90k28J93%j65J31j92
$$ -129 -140 27 -198 93 -17 160 -107 8 12 13 -56 -73 -54 197 28 -128 62 -166 27 27 -138 -7 -199
5343a99J69J65r2o6Q4j07r4K55O5j20%m3J30j20j63K02k46L22o2o0k01J54P4Q
$$ -199 -30 135 43 -23 61 -46 -140 115 180 60 60 17 147 27 -136 66 -180 142 80 20 -181 -27 47 55
5367E5k7j7P6k08K5Q8l1J00l26M61k92r2J87M3m2L0M6j52J33j45l1J09j80Q2K09
$$ 55 28 11 87 -121 -96 -8 -39 61 -265 196 -96 -188 -1 42 0 30 76 -76 57 -88 -119 -10 -190 -108 101
5392A01q1k59M75k90n1O9K36j31q1l1ko9K79k45k19M9K02J03O5l4l12K04j2J74
$$ 101 20 -239 236 -54 -105 -36 200 69 -12 -43 -45 -114 165 -80 -299 -250 -48 55 120 86 -226 -22 -34 140
5416A40k47R9j9J03J8k08L73m35J18J13j02l2O0l5J05M8q6j31J12j42J19J85j97
$$ 140 -107 -8 -27 76 94 -114 259 -176 -58 55 -47 -79 -19 -54 51 99 13 -118 -6 -148 -29 156 -41
5439d1J70k12N5K44k62M8qK73k57k2o8Q5J1L0lKn0n7J05N4n5k42J92l4L7O2l05
$$ -41 129 -83 -28 216 -46 2 -6 267 10 -12 -80 5 16 46 43 45 -5 -62 43 97 42 -200 -8 -42 -5 57 -248
5466b48K23R0l07K04q2M63l04q3%J78K49k90J55j74n0j59k1K24j51J7K69q0p3
$$ -248 -25 65 -242 -38 -120 343 39 -44 -44 134 383 93 248 74 24 -135 -156 68 -83 -66 203 123 50
5489E0k55J76l5j8J01O2j35J17J83k14o7L7L5J7L9j04%M4J44l51L12P2l01L4L9
$$ 50 -205 -29 -64 -82 19 81 -54 63 246 32 -35 2 37 54 93 -11 -11 33 177 -174 138 210 -91 -57 -18
5514a8m2J01J24j46r3j51K35j10J34j41M0K08q4n9K09k72j92J39o3K84j30K08
$$ -18 -60 41 165 19 -74 -225 10 -100 34 -107 -67 141 57 -2 207 -65 -257 -118 -181 103 -27 181
5536A81q3k24J37k1K3p4k13J83J65l1K09j18j25k2P6l37K67k3M7J57j56Q1l4M9
$$ 181 98 -126 11 -10 13 -61 -274 -91 74 43 252 134 9 -13 63 -274 -7 -30 17 174 18 99 65 114
5560A14Mp1k59P7J11o4K51j97l0j08J50J64j93K6k3j07K68l12L14j55J10j06q6
$$ 114 118 47 -212 -135 -24 -88 163 -34 -64 -172 -22 142 -51 -25 -48 -155 113 -199 115 -40 70 -36 -122
5583a22L2P1r4L3J92R5k37P8O6j82n1J6J82j01J24j29K45j95j34J11P0K12j68
$$ -122 -90 -19 -113 -80 112 207 -30 48 114 -68 -119 -103 79 -22 102 -27 218 23 -111 0 70 282 114
5606A14m5l2N9j01k0%j39Q4K80j47J09k40r8O0o2K14Jk76K17P1k01k22M48j29
$$ 114 69 37 96 -5 -25 -25 -164 -80 200 53 162 -78 -176 -116 -178 36 37 -239 -22 49 -152 -374 74 -55
5630e5k37L28k1NL4q1J57k2q2J44k54J38O7k58K01j66J51j6lJ29k20J82k22J84
$$ -55 -292 36 15 20 54 -27 130 108 26 170 -84 54 121 -137 64 -102 49 33 30 159 -61 121 -101 83
5654H3l16N34l61p2K80l03L74m27J56P7K18l72K28n1q8kj10K80P5N3m99K60R5
$$ 83 -233 301 -60 -132 148 -155 219 -208 -52 25 243 -129 99 48 -40 -42 -152 128 203 256 -243 17 112
5677A12j54rJ46k94J86N3K17j40om5O2j58j2J02l9j59J62J51k17j8L16j84ll17
$$ 112 -42 -51 95 -199 -13 40 257 117 111 66 128 -30 -42 60 21 -138 24 175 -42 -60 256 72 69 -248
5701b48Q4R9P4L7k0Ro3K06k95K09k67L66j29j06j2R9P3n1n2L7J3J46j74o6j55
$$ -248 -164 -65 9 46 26 35 -28 178 -117 92 -175 191 62 -44 -56 43 116 65 13 50 63 209 35 -31 -186
5726a86K06J10j95J56j95J37q0J37j26l2Q9l4j0J79j6j63n5O1J71k14Q0o6j16
$$ -186 20 130 -65 91 -104 33 -47 90 -36 -68 21 -13 -23 156 140 -23 -78 -17 154 -60 20 -46 -162
5749a62M00k26j75J54J17j79j6K81j61j17N8j02K32n7r4K04k00K54l85j57J68
$$ -162 238 12 -163 -9 108 -71 -87 194 33 -84 -26 -128 104 47 -47 157 -43 211 -174 -331 -163
5770a63K58j74k7o0K47M9j03K20l34J52k3J39k61k2K03J24k60J49k03m2K86k76
$$ -163 95 -79 -106 -166 81 130 27 247 -87 65 42 181 -80 -102 101 225 -35 114 -89 -131 155 -121
5792a21L90k30n2j04K41q0k1mL72k98Nj92j83L62R1l51K03%J0J59l08J69k41M09
$$ -121 269 39 -13 -117 124 44 23 19 391 93 98 -94 -277 85 176 -175 28 28 38 197 -111 58 -183 226
5816B26j31j13J29m04L90k73L82l39K36j02k23N11n66N03j95R2j00J33l18K02
$$ 226 95 -18 111 -293 97 -176 206 -133 103 1 -222 289 -277 226 31 123 23 156 -162 40
5836D0p8J57l60J74J96j72p1J40K3J51k49J31k1k66L45j99k0M4M9p9J0m7J43j60
$$ 40 -38 119 -241 -67 129 -43 -114 26 49 200 -49 82 61 -205 140 -59 -79 -35 14 -65 -55 -102 41 -119
5860a19L1m7n6l1M14K3k68l1O6J17k96K6m4N7L43k37K17k96P4N4%j5k8J4J51K0
$$ -119 -88 -135 -191 -222 192 215 -53 -84 -18 99 -197 -171 -215 -158 185 -52 165 -131 -57 -3 -3 -18 -46 -32 119 139
5886A39k72q2J70R4r5L7L5k3J19l2j38j27K99J07k22l6J4J74k73J60qM4j01J77
$$ 139 -133 -215 -45 49 -46 -9 26 3 122 90 -48 -175 124 231 9 -27 -13 161 -112 48 40 84 -17 160
5910A60o3j76nK33J6k02J28m48O60n05K45P7J51q5j92J37l16K39k52M4J67r9O4
$$ 160 97 -79 -84 149 165 -37 91 -357 303 -202 43 120 271 186 -6 131 -185 54 -198 -154 13 -86 -22
5933b2rK11j96j40J19P0R5k41K11j99M8O8o6m8o7L02j51R5j84J6L8n6J29rJ17
$$ -22 -31 180 -16 -156 -37 33 128 -113 98 -101 -53 15 -51 -99 -166 136 -15 80 -104 -88 -50 -106 23 14 131
5958A31j37j7J06j55j43M04j47o7r3M91j12k09J1K4J89j05l08N6O6J83k3j32j49
$$ 131 -6 -23 83 -72 -215 189 42 -25 -118 373 261 52 63 87 276 171 -137 -81 -15 168 145 13 -136
5981a36%R6L78l76j12K98k68J42k42q0L97j30k0P3k98K47l3M3J02O2k74PR7n8
$$ -136 -136 -40 338 -38 -150 148 -120 22 -220 -300 97 -33 -53 20 -278 -31 -64 -21 81 143 -131 -124 -27 -85
6005h5J6j5r1K95r5k55J48N7J66j29j57M56l63J02K0J24n8m6j73QK59k98l0J39
$$ -85 -69 -84 -175 120 25 -230 -82 -25 141 12 -145 311 -52 50 70 194 136 90 -83 -75 184 -114 -144 -5
6029ej7j0L4m2Q1k07K83J29j92j49J22L1J56j66k42J83n9J32R2j84k19K35R9j
$$ -5 -22 -32 2 -40 41 -166 117 246 54 -95 27 58 214 48 -194 -11 -70 62 154 -30 -249 -14 85 84
6053H4q9r7J64j18J42k71M4J24n1K37k40j66J73K06l05R9Q8j14J69J69l37Q4N4
$$ 84 -5 -102 62 -56 86 -185 -141 -17 -68 169 -71 -237 -64 142 -163 -64 24 -90 79 248 -89 -5 49
6076D9L4o1J36j30j08J87J06j93J55k05j15J57o5K13M7k6j82j7n2L5J61j92r0
$$ 49 83 22 158 28 -80 107 213 20 175 -30 -145 12 -53 160 207 181 -1 -18 -70 -35 126 -66 -156
6099a56R3L60m99K48l0K0J41k98j26K30p9M77k91j7k91K23J60j90q0Q9K9k04r7
$$ -156 -63 297 -202 46 16 36 177 -121 -247 -17 -96 381 90 73 -218 5 165 -25 -105 -16 13 -191 -288
6122b88K55L4m2J62j77K5%n1J74O1k21k8K50r2J40m19J73J80J39k13P3p2j45L4
$$ -288 -33 1 -41 121 -56 -31 -31 -82 92 153 -68 -96 154 62 202 -217 -44 136 275 62 135 63 -82 -48
6146d8p9rJ16Q5l2M3k91K48q2k3J9R5j87K0K02k21J01K46j24j05q2j0J78N9n1
$$ -48 -127 -136 -20 65 33 76 -215 33 -49 -72 -53 42 -145 -125 77 -144 -43 203 79 -26 -108 -118 60 119 68
6171F8j57j04J50lp3Q3j21R4K15l73K05r4J27J06k11k5kj9J17K26k69Q6k9J55
$$ 68 -89 -193 -43 -46 -119 -36 -157 -63 152 -221 -16 -110 17 123 -88 -113 -115 -134 -17 209 -60 26 -3 152
6195A52j19j86K93j42N7j63K94J13j35q4j85j5j6L4K11k45O4P2J58j21p5k59J20
$$ 152 33 -153 140 -2 55 -108 186 299 164 80 -105 -120 -136 -102 109 -136 -72 0 158 37 -38 -297 -177
6218a77J06MJ66j78J89j8k4r7r7K30ko5J8k81L98k19J42k4l4J1j29J50k04j09
$$ -177 -71 -67 99 -79 110 92 68 -29 -126 104 102 37 55 -226 172 -47 95 71 37 48 -81 69 -135 -244
6242b44J77j47Q6K02j27q0q3M35k70j28J98O5k15P7j68K27M4O9j78L3J33k04J44
$$ -244 -67 -214 -128 74 -53 -133 -216 219 -51 -179 19 84 -131 -54 -222 5 49 118 -60 -27 106 -98 46
6265D6j48K56l25J96n3n0Q8J82m2l16K70O5J35m31o8j7K57l0j94M7J75J34j9k24
$$ 46 -102 154 -171 25 -28 -78 10 192 150 -166 104 169 304 -127 -195 -212 45 15 -179 -132 43 177 158 -66
6289f6L6P0j67J14K54n20K63J27N5j70j39Q4J08M8k8l20L13K81k45j56o8J4J74
$$ -66 -30 40 -127 -13 241 -279 -16 111 166 -4 -143 -59 49 97 69 -251 62 343 98 -58 -126 -112 62
6312F2J27k14J15j8j46K35r4Lj5k06L97k89r0J88K2j41L88k02l1R7k70m5K24j7
$$ 62 189 -25 90 72 -74 161 67 70 55 -151 246 -43 -133 55 77 -64 324 122 91 188 -82 -127 97 80
6336H0Ql58K59r5J1k61L80L2j13r5N1K21r7j15J92j26J62k08K87k02j75J44R8
$$ 80 88 -270 -11 -106 -95 -356 24 56 -57 -152 -101 120 23 -92 100 -26 136 -72 215 13 -162 -18 80
6359H0L4j14K43k43k36M5J86J69k80K4l9R2J31m16K86q7J59k14M03l85K7R3J52
$$ 80 114 0 243 0 -236 -191 -5 164 -116 -92 -131 -39 92 -324 -38 -125 34 -180 223 -162 -135 -42 110
6382A10n9j34Q1J0K98l71J71k24L47j64j25p3J38k06K35j7j01j78L68k46j85R5
$$ 110 51 -83 -2 8 306 -65 106 -118 229 65 -60 -133 5 -201 34 17 -84 -262 106 -140 -325 -230
6404b30J30J65Lm3j40Mj97K94L3n0K31j50j44J15K07k33Q7K08p3k78K3R1j24n9
$$ -230 -100 65 68 25 -115 -111 -308 -14 19 -31 200 50 -94 21 228 -5 82 290 217 -61 -38 53 -71 -130
6428a30J80O7j58P4J11q3%n7Jj39J25L9j5r7nL4o5L14l60J85Ln4m4K56k70J61
$$ -130 50 117 -41 33 144 61 61 4 5 -134 -9 30 15 -82 -87 -53 -118 196 -164 21 24 -30 -74 182 -88 73
6454G3l45J97J70N1k46L3j45K2j4L29k13L5m5O2M0J28j33K1R3p7j12n0n3L04q2
$$ 73 -272 -75 95 146 -100 -67 -212 -190 -204 125 -88 -53 -98 -36 4 132 -1 20 113 36 -76 -126 -179 125 43
6479D3m98O01j38P2M3n6k38Q6l7K85j34n3J04K2m8Mo0O5j77J42j52q6J13n2J47
$$ 43 -455 146 8 80 123 67 -171 -85 -122 163 29 -24 80 102 54 58 -2 63 -114 28 -124 -210 -97 -149 -2
6504bL9p0r1L08k76J18Q2L2l03M20m3j32l6J5p0lp7k76M66k40K10k52K3R2J25
$$ -2 37 -33 -124 184 -92 26 108 140 -163 257 214 82 46 61 -9 -12 -89 -365 101 -139 71 -181 -158 -66 59
6529E9N5j97Q9L65l09J12l52l9L16j84J01P8j02J19J43k08K21m06L25k26j04J36
$$ 59 114 -83 6 371 62 174 -178 -217 99 -85 16 94 -8 111 254 46 267 -139 186 -40 -144 -8
6551hK6j38J89J48l19MJ80q4N2QL4l2p1J79l7l39L23k7j7k44L48k24J40l10L30
$$ -8 18 -120 69 217 -102 -98 82 -2 50 58 92 60 -11 168 131 -208 115 88 71 -173 175 -49 91 -219 111
6576A11M5k25K68j87J08l11K55j09J96k15J5N7l12M7L20J70l76J30k6j15K66j16
$$ 111 156 -69 199 12 120 -191 64 -45 151 -64 -49 8 -304 -257 63 233 -143 -13 -39 -154 112 -4
6598dM0%KJ57m42K21l5m5M14q0j13J40j49Ok19k18L36k27L56o6j43J49NR6k31
$$ -4 36 36 38 195 -247 -26 -61 -106 308 228 115 255 106 112 -107 -325 11 -216 140 74 -69 80 85 181 -50
6623e0J4j37J11k6K25k51K57k51J37J79J08k75l4N0j26L45k26K3n4l7J84q2J23
$$ -50 -36 -173 -62 -88 137 -114 143 -108 29 208 316 41 7 57 -69 276 50 73 19 -18 166 84 207
6646B07m4k1k74J85m8K13k24k3M5L7j17j07K43J3l54L34r9l7J15k37K25j3r7R1
$$ 207 163 142 -132 53 5 218 -6 -29 16 53 -64 -171 72 85 -269 65 -34 -71 44 -193 32 19 -78 13
6670A3n3NJ7J06j95R6M8J81k64R6j85q5K20p7OO9O8o8J43j91O2j90K34J2QK12
$$ 13 -40 -35 -18 88 -107 -11 37 218 -46 50 -135 -220 0 -77 -71 -2 66 -2 141 -50 12 -178 56 68 76 288
6696B88l45k2J17l6o9J96r6J07j81J32j39J41j48K86m26K42No8n9K85LPj00j20
$$ 288 -57 -79 38 2 -67 129 33 140 -41 91 -48 93 -55 231 -195 47 52 -16 -75 210 213 220 120 0
6720@j55J01J78L8j32j46J06P4M6Q9k78K82l77q1J28L1O3k11L03p7p5j4R6J33
$$ 0 -155 -54 124 162 30 -116 -10 64 110 199 -79 203 -174 -255 -127 -96 -33 -244 59 -18 -93 -107 -11 122
6744A22k49K34l20J68J09j46O7p8N8J00k65J24J48j59R1j66J1J00Q6J9K0pj28
$$ 122 -127 107 -213 -45 64 -82 -15 -93 -35 65 -200 -76 72 -87 4 -162 -151 -51 35 54 74 67 -61
6767f1J45J1j19k76J99K08j0j03k15J5k2J77l57K82J22lK9j27J31k38N61j93j53
$$ -61 84 95 -24 -300 -101 107 97 -6 -221 -206 -228 -51 -408 -126 -4 -7 22 -105 26 -212 349 156 3
6790CJ2R4M0J59j56k18M6J82k58J32J3K61k11lj48n5Q3j21K69k46J77j34L35k55
$$ 3 15 109 149 308 152 -66 -20 162 -96 36 49 310 99 96 -52 -107 -24 -145 124 -122 55 -79 256 1
6814AOO6l3J21k57N9l6n2J42P9j75J41m1o1L37l42K83l46j60K15R3L6k60J99M9
$$ 1 7 73 40 161 -96 -37 -73 -125 17 96 -79 62 21 -40 297 -45 238 -108 -268 -53 40 76 -184 15 64
6839F4l54K00N5j9O9k82J89r1L34k18pJ72j17Ok36j3K0L56l28L27j82QK93j77
$$ 64 -290 -90 -35 -54 15 -267 -78 -169 165 -53 -60 112 -5 1 -235 -248 -228 128 -200 127 -55 -47 246 69
6863F9p0O6j06K7L3j34J88p0l2k6j0j04J77J37l05J95J17k26K17r2O3m6L9l8l6
$$ 69 -1 65 -41 -14 19 -115 73 3 -29 -55 -65 -169 8 145 -160 35 152 -74 143 51 114 68 107 69 33
6888C3Rm1K20j66j24K41k48K4K33k84K67r4j08N6J36k58j46K85p1J95k39m3o3
$$ 33 42 1 221 55 -69 172 -76 -52 181 -103 164 70 -38 18 154 -104 -250 35 -36 159 -80 -123 -186
6911a86Q0M4J11K03n49K73O9k7M4J1q4j32K65N9k00j09K98k3L8k99L28k31K05
$$ -186 -106 -62 49 252 -297 -24 45 18 62 73 -11 -143 122 181 -19 -128 170 147 185 -114 214 -17 188
6934A88k57K53o9l22j30O90l26o5L0J85m1j73j3k17L75j60J71k88K08J08l67M61
$$ 188 -69 184 115 -207 -337 353 27 -38 -8 177 136 -37 -50 -267 108 -52 119 -169 39 147 -220 241
6956B41j68k57M43r1r5r6o3M4K6LrJ65l14K25k2O3n4k45J03Q5J53K6j57k05J16
$$ 241 73 -184 259 168 73 -23 -86 -42 -16 -13 -22 143 -171 54 32 95 41 -204 -101 -16 137 163 6 -199 -83
6981h3R2j62oL3K01n2j83R2p5J79k03J73L6l31J70J15j47L63j51Ro4Lm9j04O4
$$ -83 9 -153 -159 -126 75 23 -160 -68 -143 36 -167 6 42 -289 -119 -4 -151 212 61 70 6 9 -40 -144 -80
7006h0j75J30J30R7N2o2j76J04r0K27m03L01L1R1k77L48o3l63J76K4k07J16J75
$$ -80 -255 -125 5 102 154 92 -84 20 -70 157 -246 55 86 177 -100 248 185 -178 -2 22 -185 -69 106
7029A06p0m3l8M5q4K27m3j65R0j43K54r4M3Q3m1k60J21K13l73J29N5k1j86L58
$$ 106 36 -7 -45 0 -84 143 100 -65 25 -118 136 42 85 168 127 -133 -12 201 -172 -43 12 -9 -195 163
7053A63j2k52J9l1J61mk69J62J45J0M3j65m2K26j14j40J75j4m3Q5k1l9K01j70
$$ 163 151 -101 -82 -113 48 44 -225 -63 82 92 135 -30 -72 154 40 -100 75 61 18 103 82 43 244 74
7077G4k05K7J94Q9j97J06j21J2o8K5R4j39j85K10O6K26k26j20K29j07k5J50r0
$$ 74 -131 -104 90 179 -18 88 -33 -21 -89 -64 30 -109 -294 -84 -18 208 -18 -138 91 -16 -41 109 19
7100A9J24j06K3K9n8l0j67N8J07j45J76l5O4o5K3p3J23l5L1m19K71N1J45j75q6
$$ 19 143 37 60 89 31 1 -166 -108 -1 -146 30 -5 59 -6 17 -56 67 32 63 -356 -85 -34 111 -64 -150
7125a50J17k7P4J83k66K54j38j74K52r2k67L63L0l9k1j02j92R9j09K52J23k35
$$ -150 -33 -60 14 197 -69 185 47 -127 125 33 -234 129 159 120 99 -3 -195 -96 -205 47 170 -65
7147f5mJ28l9m8q1K03l2n0Pl9P6k39J79k8J38l74M95m2j23j41J01j44M06m00J77
$$ -65 -69 59 20 -28 -109 94 62 12 19 -20 56 -183 -4 -32 106 -268 227 185 62 -79 22 -122 284 -116 61
7172F1k94J33L25k03m2J20Q9Q1j81j49J62j43k1J1J04M0m3j09N9L1qo2O0M4k03
$$ 61 -233 -100 225 22 -20 100 189 270 89 -60 102 -41 -62 -51 53 93 50 -59 0 31 23 -39 21 65 -138
7197a38N2J25P8j62Q6j67m5K01j28j14K18k8Q2qk72K91j74j23m1J87J84j60J22
$$ -138 -86 39 117 -45 41 -126 -171 30 -98 -212 6 -22 60 52 -220 71 -103 -226 -267 -80 104 -56 66
7220F6j14P6k64K68l6m6N4J65l49pK16q1j1J89l4j01R0M9J3k11j9J16l49L77n0
$$ 66 -48 28 -236 32 -4 -50 4 169 -180 -187 29 -52 -63 126 92 -9 81 130 143 -68 -87 29 -320 57 7
7245Gj43j02K2P7J77J76j44j22J18J4r4J47m44K17K60j75j11J69J00L5k38m7J24
$$ 7 -136 -238 -216 -139 38 214 70 -52 66 80 -14 133 -311 -94 166 -9 -120 49 149 184 -54 -101 23
7268B3n7K8P2J4P9m8j48J38j17r9J77J16j59RJ12k12N1O7j8N0J62o9j72q6K07
$$ 23 -34 -6 66 80 159 111 -37 101 -16 -115 62 178 19 28 140 -72 -21 46 28 78 240 171 -1 -87 120
7293A20j9j20N5N6p1j26K08j95P8Q0m1m7j52K19n6k9K4O0j03K73j90K54l70J74
$$ 120 101 -19 36 92 21 -105 103 -92 -14 66 25 -22 -174 45 -11 -40 -16 44 -59 214 24 278 -92 82
7317H2N5Q8j58n1k42K87Q0j28J92l22K38J47j03j6k52N3P1j32L68j96j50M1J22
$$ 82 137 225 67 16 -226 61 141 13 205 -117 121 268 165 149 -103 -50 21 -111 257 61 -89 -48 74
7340G4j44J10j78M4J34R8j63j31m0O9J53P9Q2k62K58k11N4K1j91m4J3R3m4P9j73
$$ 74 -70 40 -138 -94 40 138 -25 -156 -196 -127 26 105 187 -75 183 -28 26 47 -144 -188 -175 -82 -126 -47 -220
7365b20K78l5P4O8l14K11k47N4K99k16M7R0k22q1K10j07K22opr5j78R1R6N2Q8
$$ -220 58 23 97 165 -149 62 -185 -131 168 -48 -1 89 -133 -214 -4 -111 111 105 98 3 -175 -84 12 64 152
7390A52O6l41k1nN90l96q3j09J42Nk78L33p4M4O9j81N4J56j61JMK37k76L3J32
$$ 152 218 -123 -144 -149 441 45 -38 -147 -5 0 -278 55 -19 25 94 -87 -33 123 -38 -37 -33 204 -72 -39 93
7415I3k66l9J72QN3L9K23k72J6l60L80j18Q7k0K6J29l82L70k08q0J34j09J93k3
$$ 93 -173 -212 -40 -32 21 60 283 11 27 -333 47 -71 16 -4 22 151 -231 139 -69 -149 -15 -124 69 46
7439D6R3L7j93J14jj26QJ14P5j22r9J51j23l3k5j9P3Rmo4K29l9k26j04J21J49
$$ 46 139 176 -17 97 96 -30 -22 92 167 45 -54 97 -26 -59 -84 -103 -30 -21 -25 -89 140 101 -125 -229 -108 41
7465D1L8k02L65k45L7j86p9J46L34m77K20J4k90J83J43j9L72j66n79K29K03k72
$$ 41 79 -123 242 -3 34 -152 -231 -85 249 -228 -8 6 -284 -101 42 23 395 229 -350 -121 82 -190
7487a90J48l7KJ59j16K5J30k72M8J82O3k65K77j97M0o5p3L9K43l15K84M4j86k59
$$ -190 -42 -79 -77 82 -34 -9 121 -151 -103 79 142 -123 154 -43 -3 -68 -141 -102 141 -174 110 154 -32 -291
7511b91N54k71lO6j45K82l98J31o1K24k7k3q6Kl1l2n6K3r0L81j78J42j59O5n1
$$ -291 263 -8 -11 55 -90 192 -206 -75 -136 88 61 38 -48 -46 -77 -109 -165 -142 -232 149 -29 113 -46 19 -32
7536c2l2K96k76n5m2K1Q1J9O8k0K0k13K39K07k71J09m4j66j51K33o6O1j49K26
$$ -32 -64 232 -44 -99 -141 -120 -39 -20 48 28 48 -165 74 281 10 119 75 -91 -242 -9 -75 -14 -163 63
7560F3j36N6J05k7k09R2j52K18j72J10J61j85J05O1j91J52j5PKj00K06n7ok7r6
$$ 63 -73 -17 88 61 -148 -56 -208 10 -162 -52 109 -76 29 90 -101 51 36 43 45 -55 151 94 88 61 -35
7585c5l0J21j47j53L12j30j34L42j18rM2o8k26J93J99J13l73K06k46J10P4q2Q7
$$ -35 -65 56 -91 -244 68 -62 -196 146 28 19 61 -7 -233 -40 159 272 -101 105 -141 -31 43 -39 48
7608D8m5l4j11K11O2j46o9J40j63kK78k48J08J56r3j46j42J32j36J79j55K72J45
$$ 48 3 -31 -142 69 131 -15 -84 56 -107 -109 169 -79 29 185 92 -54 -196 -64 -200 -21 -176 96 241
7631B41l39L01k9j73j23L04k31M8L16j79KO9k99J43k17k25L40K19k01N4j11j5
$$ 241 -98 203 174 1 -122 182 -49 -1 315 136 138 207 -92 51 -166 -391 -51 168 -33 21 -90 -105
7653a05J6J45k07R7Q7l11M93l99O0N7J09J16Jl42J53K21j53Q7k36K92n25L10J10
$$ -105 -89 56 -151 -54 33 -278 215 -184 -124 -67 42 158 159 -183 -30 191 38 125 -111 181 -344 -34 76
7676G6m5R8k29m2l6M19n17K55N3k8L0Kj37Q1k3J37j08J19j13L4k08J52O5j23L5
$$ 76 31 129 -100 -142 -178 241 -276 -21 32 4 34 36 -101 -20 -43 94 -14 105 -8 26 -182 -30 35 -88 -53
7701e3K10o9n82M89J3r0L8J46k08J11q3p3K09j65J57j83N5K0K58l30K00r7J40
$$ -53 157 88 -494 -5 8 -82 -44 102 -106 5 -78 -151 58 -107 50 -133 -78 -58 200 -130 70 -27 113
7724A13j64L95k35m28K24Q4J51P6l57J69l8q0kJ51k5r7j54K96J20Ml20L4r5P7
$$ 113 -51 344 109 -319 -95 -11 140 216 -141 28 -10 -90 -92 59 34 -63 -217 79 199 203 -117 -83 -178 -101
7748a01K44k27J37Nq0N4K5k26J21J1qJ71j5k13J90m3r9N2J85o1j28K80k68j86
$$ -101 143 -84 53 58 -22 32 57 -169 -48 -37 -45 126 111 -102 88 45 -54 -2 183 122 -6 274 6 -180
7772a80L6k3j25J72J25N8r9Mr1k18L11J6K4J63m01K11j40K56q8M4K01j75rj9j88
$$ -180 -144 -167 -292 -120 5 63 -36 -32 -123 -341 -30 -14 10 173 -228 -17 -157 99 11 55 256 81 72 53 -135
7797a35L4j96L95m0j45K5N4L6M2n3Nm0p0J42J61l47K48J65j53l48N62k56l21K07
$$ -135 -101 -297 98 58 -87 -62 -8 28 70 17 22 -18 -88 54 215 -132 116 281 128 -220 342 86 -235 -28
7821b8J41n7K0r2l4L6R6j95N2o8M5L05l88R3J11J2L9j67o4J47m6J05k55K4O2K6
$$ -28 113 56 76 -16 -50 -14 82 -113 -61 -129 -84 221 -167 -74 37 49 88 -79 -143 4 -42 63 -192 -168 -106 -80
7847h0R9K7qn3J14n8j37R9J1j21m3J96L9j02j72J64j47n3K30J45j65k7K6l1n5
$$ -80 19 46 38 -15 99 41 -96 3 14 -107 -150 46 85 -17 -189 -25 -172 -225 5 150 -15 -42 -16 -47 -102
7872a02L36l92K36M8j00j07L8K12j87l9j3J66k90K30K37k57q4j4j8J62l1k24L6
$$ -102 234 -158 78 126 26 -81 -43 169 -18 -57 -70 96 -194 36 273 16 -68 -82 -100 62 31 -193 -157
7895a57N5j69K23Q1j61j19J8L23J32k31J70k46L0j25M26k82K5qq4J78n8Q7j96
$$ -157 -102 -271 -48 33 -128 -247 -229 94 226 -5 165 -81 -51 -176 250 -32 -7 -15 -99 79 21 108 -88
7918h8p0J38n1n4L96l96N9N4j82R5j05K33j76J72k1kj05J77K4n0j58j08k7K98
$$ -88 -158 -20 -71 -125 271 -125 -66 -12 -194 -99 -204 29 -147 25 4 2 -103 74 98 48 -110 -218 -245 53
7942E3n5j84o9J04R3J40rj02p5J31R5J0m23M34qj21NNj28J32J50k77m6J56j13
$$ 53 -2 -186 -255 -151 -58 82 73 -29 -104 27 122 132 -291 143 135 14 19 24 -104 28 178 -99 -145 11 -102
7967a02J79L0J08q0j10J05j61j16k33M56J29o1k29K18j65j15p5K98j13L08k20
$$ -102 77 107 215 135 25 130 -31 -147 -380 76 205 144 -85 133 -32 -147 -222 76 -37 271 51
7988E1j6R1L8K3k89o3M1K74O3k89n8L2L4K01j44m2K17j38j9J04j8J7k06R0J01
$$ 51 35 126 164 187 -102 -165 -124 150 213 -76 -134 -102 -68 133 -11 -53 164 26 7 111 93 110 -96 -6 95
8013I5o4J53j29j63r9P5J0K43rj99J48R9m80M01J01m5M8n6o9J17m6j75J04k36
$$ 95 31 184 55 -108 -207 -132 -122 121 112 -87 61 160 -320 81 182 137 185 129 60 177 131 -44 60 -176
8037a76O9K46k30j33R7K74j19q3Q3N0J12j81J35m29J26K95p1K4j22M89o17J99
$$ -176 -107 139 -91 -224 -127 147 28 -55 28 78 190 9 144 -285 -159 136 65 89 -33 456 -161 38
8059C8j28m5O8J85j75J23N9j35r3J68J66m8j40r9J80o3j69K85k16Q3j47P4n0K5
$$ 38 -90 -135 -67 118 -57 66 125 -10 -103 65 231 183 43 -56 124 61 -108 177 -39 44 -103 -29 -79 -54
8083e4J61j33J00L0j82J4J51j83K11j96P3J26N1m44P4J57J24j72K50j69j9N1J1
$$ -54 107 -26 74 104 -78 -64 87 -96 115 -81 -8 118 169 -275 -201 -44 80 -92 158 -11 -30 21 32
8106C2K9j8j13P6J42j10n1j29n2J43Q7k15j55K54J98k31M9J28N8k19K87j77p5
$$ 32 61 43 -70 6 148 38 -13 -142 -194 -51 36 -179 -334 -80 118 -113 -64 64 122 -97 190 13 -62
8129f2O6j76J62J9N3k7j33J44O1J6k16K03o5j59R0nl4L56l99K9j39M65k83P0j59
$$ -62 4 -172 -10 9 62 35 -98 46 107 123 -93 110 45 -114 -24 -29 -63 293 -106 -77 -216 249 -34 36 -123
8154a23K3L59k67J50L6l16J91J63j87K1rq2n7l1J18K5K15j89k29R6K55P9l64Q0
$$ -123 -100 259 -8 142 178 -138 53 216 29 50 41 -41 -98 -129 -11 14 229 40 -189 -93 162 241 -123 -43
8178d3m5J28p9q2R1l5r0J5N8lR8J6j38
$$ -43 -88 40 -39 -121 -30 -65 -155 -140 -82 -85 13 29 -109
8191a09
$$ Imaginary data points
##PAGE= N=2
##DATA TABLE= (X++(I..I)), XYDATA
0@%%%%%%%%%%jRj6J6j6K3l1L3m1N2o0P2q8J04j21J44j68J94k26K59k97L40l86
$$ 0 0 0 0 0 0 0 0 0 0 0 -1 8 -8 8 -8 15 -16 17 -24 28 -32 40 -48 56 -65 79 -89 105 -121 138 -159 181 -205
33b05M37m94N59o30P06p93Q85r85J098j218J349j494J653j824K012k217K442k693
$$ -205 232 -262 297 -333 373 -420 465 -520 578 -640 709 -785 868 -956 1056 -1161 1281 -1412
51a412K966l267L604l980M401m878N423o050O784p659Q717j0030J1711j3951J7109
$$ -1412 1554 -1713 1891 -2089 2312 -2566 2857 -3193 3591 -4068 4649 -5381 6330 -7621 9488
66I488k1934L0318m9070J71989k0450j38776J98869L2722r3142j45152p8594K4596
$$ 9488 -12446 17872 -31198 140791 120341 -18435 180434 213156 120014 -25138 -103732 -79136
78g9136J42020n7187k20728k4880K30901N9770j39024o6199P4590R1423O8074
$$ -79136 62884 5697 -215031 -239911 -9010 50760 -88264 -154463 -79873 11550 79624
89G9624n6512j46499J9014J97088J7345j87177n5996J31065P1129k1525n6017
$$ 79624 23112 -123387 -104373 92715 110060 -77117 -133113 -2048 69081 47556 -8461
100h461n7195M4962J40518j3416j75528l1028J40177L3431j07891o6155O404M8024
$$ -8461 -65656 -20694 119824 106408 -69120 -100148 40029 73460 -34431 -100586 -94182 -46158
112d6158P3834j9645j08354J4434J57800M5427r9573l0134P2047M3379j775l1116
$$ -46158 27676 8031 -100323 -85889 71911 117338 17765 -12369 59678 103057 101282 70166
124G0166o9167p37R0186K754j15483l0834Q3369K4514m4677k5741j3487J100M5067
$$ 70166 999 262 90448 93202 -22281 -53115 30254 54768 10091 -15650 -29137 -28037 17030
137A7030m275r0255k6935O6421J1380o2284j5213K7334J3187K2548J9745k1615
$$ 17030 12755 -77500 -104435 -38014 -26634 -88918 -104131 -76797 -63610 -41062 -21317 -42932
149d2932J375O9262K7707m4282o307M0695K202j9091N669j2603k2305K1946J7533
$$ -42932 -41557 27705 55412 11130 4823 45518 47720 28629 34298 21695 -610 21336 38869
162C8869l4500j2738L3576j362k5164R730Q986k6638o705J5441j6159k0368J2400
$$ 38869 4369 -8369 25207 23845 -1319 8411 17397 -9241 -15946 -505 -16664 -37032 -24632
175b4632M273j7305J5134K3977j3567m265L6334J8856j9612j084J3320l087P96
$$ -24632 -20359 -37664 -22530 1447 -12120 -16385 19949 38805 19193 18109 31429 28342 29138
188B9138N320k7079k3624K6846J5398l4932k2195K0430J3191n355o057j6680p912
$$ 29138 34458 7379 -16245 10601 25999 -8933 -31128 -10698 2493 -2862 -8919 -25599 -33511
201c3511K7120J3845m0095k7961L0026K7392j3678k0563Q02J6785L1327J3289
$$ -33511 -6391 7454 -32641 -60602 -30576 -3184 -16862 -37425 -36623 -19838 11489 24778
213B4778k8864j5795M2100L6054k7075l4481O061K3200Q983j4543l3738j1770
$$ 24778 -4086 -19881 22219 58273 31198 -3283 2778 25978 34961 20418 -13320 -25090
225b5090L7372K4283l6253l7093K1099L6155l80k6880k2402O785L1733J1666l7561
$$ -25090 12282 36565 312 -36781 -15682 20473 20093 -6787 -29189 -22404 9329 20995 -16566
238a6566k9702L0031M1318q644l2719k762K7202K8661K20l0922j7173L1478L3179
$$ -16566 -46268 -16237 25081 16437 -16282 -19044 8158 36819 37039 6117 -11056 20422 53601
251E3601k3565m2575O61L0071J0939j9348k9301n529L1232K2146k7165l6293J2215
$$ 53601 30036 -12539 -11878 18193 29132 9784 -19517 -25046 6186 28332 1167 -35126 -22911
264b2911L6274K724k9855k0830J0435K7250R888k6679k4691K0784L8322m04l1167
$$ -22911 13363 16087 -13768 -34598 -24163 3087 12975 -13704 -38395 -17611 20711 20307 -10860
277a0860p366K3877K3191l202k4642j5529J9297K7502j2494l4928l531K6719J3359
$$ -10860 -18226 5651 28842 25640 998 -14531 4766 32268 19774 -15154 -18685 8034 21393
290B1393j5245k1470l114K1178J7822j4966k8262K563K8126P349k1214j6808Q796
$$ 21393 6148 -15322 -18436 2742 20564 5598 -22664 -20101 8025 15374 -5840 -22648 -13852
303a3852K0004Q594j4237j7177J0266K7918L784k3504j0026J5473J5797l456j7190
$$ -13852 6152 14746 509 -16668 -6402 21516 25300 1796 -8230 7243 23040 19584 2394
316B394j1767Q339J8169m361k3480o639J7538J0363j0493j4171j939J1125R504
$$ 2394 -9373 -1034 17135 12774 -10706 -17345 193 10556 63 -14108 -16047 -4922 4582
329D582o585j7243j759J7002P985j2307j0317P002J1960M725m690p656K014J3924
$$ 4582 -2003 -19246 -21005 -4003 3982 -8325 -18642 -11640 320 5045 355 -7301 -5287 8637
343H637M822j1989o938P607O838l202o848m158J097O901O98r028m907O640N021
$$ 8637 13459 1470 -5468 2139 8977 5775 -1073 -5231 -4134 2767 3465 -5563 -10470 -3830 1191
358A191m959m127R62J041J289J373l008j970M483L862k121r98N220Q23q37K926
$$ 1191 -3768 -7895 -6933 -5892 -4603 -3230 -6238 -8208 -3725 137 -1984 -2982 2238 3061 2224 5150
374E150K001k282q90K599p60m92K47l091l301L809L234n469n614K409M588j50
$$ 5150 7151 4869 3979 6578 5818 5326 5573 2482 -819 2990 6224 755 -4859 -2450 2138 1988
390A988l501l703k18O045L987o084p181O571R851j147p628j875O252P991J183
$$ 1988 -1513 -5216 -5434 611 4598 -1486 -8667 -2096 7755 6608 -1020 -2895 3357 11348 12531
405A2531r368n978R505J1138n951j3272o87R973O079o274j1887k669J1769Q302
$$ 12531 3163 -2815 6690 17828 11877 -1395 -2082 7891 13970 7696 -4191 -6860 4909 13211
419A3211j1072j4454L685J5432K855j2636j0245N548J4698M617j3783j2336J0276
$$ 13211 2139 -12315 -8630 6802 9657 -2979 -13224 -7676 7022 11639 -2144 -14480 -4204
432d204J7915j758j6804o315J1885J2829k610j6377p336J3952J4460q702j9416
$$ -4204 13711 11953 -4851 -11166 719 13548 10938 -5439 -12775 1177 15637 6935 -12481
445a2481j031J6438Q948j1030j6469j79J6509R433j3441j6864N192J9865M431
$$ -12481 -13512 2926 11874 844 -15625 -15804 705 10138 -3303 -20167 -14975 4890 9321
458I321j5257j1499R024J7210K752j5535j1700J1533J8607k752j9296o528J4767
$$ 9321 -5936 -17435 -8411 8799 11551 -3984 -15684 -4151 14456 11704 -7592 -14120 647
471F47J3630n360j7044n484J5028J3675q712j8681p90J6715Q693j2282j4766K072
$$ 647 14277 8917 -8127 -13611 1417 15092 6380 -12301 -13091 3624 12317 35 -14731 -12659
485a2659J5258P332j1972j4168N378J8144L715j4536r585Q770J4078J034j3186
$$ -12659 2599 9931 -2041 -16209 -10831 7313 11028 -3508 -13093 -4323 9755 10789 -2397
498b397r362R005J3990k383j4908m678J1518J0259m398j2320k793J1418R550o410
$$ -2397 -11759 -2754 11236 8853 -6055 -10733 785 11044 6646 -5674 -8467 2951 12501 6091
512F091j3320l31J2317O473r162j0030K638J0488M854p413q764L502J1692K388
$$ 6091 -7229 -7560 4757 11230 2068 -7962 -5324 5164 10018 2605 -6159 -2657 9035 11423
526A1423r647o261N624P911j087q291n241M541P721j436q739l202O595N358k972
$$ 11423 1776 -4485 1139 9050 7963 -328 -5569 -1028 6693 5257 -3482 -6684 -89 5269 2297
541B297o139j777M701M014l150o127q35M992L052m106l822J495M505J684j993
$$ 2297 -3842 -5619 -918 3096 -54 -6181 -7016 -2024 1028 -3078 -6900 -5405 -900 784 -1209
556a209k644J064M163J287l219j943J882J386n09j035q80J114J463L99p91r5J608
$$ -1209 -3853 -2789 1374 2661 -558 -2501 -619 767 258 -777 -1657 -543 920 1319 528 433 2041
573B041N80p04J23K97p49n40J89L40m31r95p8K34J918O63j958j416K155K380j631
$$ 2041 2621 1917 2040 2337 1588 1048 1237 1577 1146 151 73 307 2225 2888 930 -486 1669 4049 2418
592B418k929q53J764J467j492l742r31L954K496k306l808R68M789J815l211m024
$$ 2418 -511 -1364 400 1867 375 -3367 -4298 -344 2152 -154 -3962 -2994 1795 3610 399 -3625
608c625J196M727J715n116m903L082O026L36n526k942L957N795K37o294l460N023
$$ -3625 -2429 2298 4013 -1103 -6006 -2924 3102 3438 -2088 -5030 -1073 4722 4959 -1335 -4795 228
624B28O025k858p551j979N769N581l226p185j334P717N510m543p313Q18Q110L497
$$ 228 6253 3395 -4156 -6135 -366 5215 1989 -5196 -6530 1187 6697 2154 -5159 -4341 3769 7266
640G266o338p331K166P646K239p239p017M033R099O76q479m454N529P985r33q896
$$ 7266 928 -6403 -4237 3409 5648 -1591 -8608 -4575 4524 5200 -3279 -7733 -2204 5781 4848 -4048
656d048m361O600P482l219r040k246Q335O681l892q257J04R261N455n252q667
$$ -4048 -8409 -1809 5673 2454 -6586 -8832 -497 6184 2292 -5965 -5861 3400 8855 3603 -5064
671e064J547R224L472p702p559L003Q314K341q051o316M644Q908r2q648m406N872
$$ -5064 -3517 5707 9179 1477 -6082 -3079 5235 7576 -475 -6791 -2147 6761 6669 -1979 -6385 -513
687e13P140j748q780l364O500O609l031q356j313Q130N318l847p230N67P772L912
$$ -513 6627 4879 -3901 -7265 -765 5844 2813 -5543 -6856 1274 6592 2745 -4485 -3918 3854 7766
703G766n196o945J390P309J847o799n580L088O560P71o076m336L903O702o63o854
$$ 7766 2570 -4375 -2985 4324 6171 -628 -6208 -3120 3440 4211 -1865 -6201 -2298 4404 3741 -3113
719c113k613M646M912j871n952j453N064M302k681m800K24N502L317l063l775
$$ -3113 -5726 -1080 3832 1961 -3991 -5444 -380 3922 1241 -3559 -3335 2167 5484 2421 -1354
734a354M95M620J500l631l794Q25L869K56l619k575K176K620J81l117j185J914
$$ -1354 -859 3761 5261 1630 -2164 -1339 2530 2786 -833 -3408 -1232 1388 1569 -1548 -2733 -819
750h19K672p12k688o29J575K290j081k071j61K299J103l43j629K86J728Q07j095
$$ -819 1853 1141 -1547 -2176 -601 1689 608 -1463 -1624 675 1778 1435 -194 92 1820 2627 1532
767A532j044lM30M0j103r61m37M15q5m60k47p3k2L66M71J26n03l8O44O28K15n43
$$ 1532 488 485 915 955 -148 -1109 -1546 -1131 -1216 -1676 -1923 -1996 -2018 -1652 -1181 -1055 -1558 -1596 -952 -324 -109 -652
789f52m29R75J544Oj321J15J187J310o13j631k02J395P12j438k175k51K033O69
$$ -652 -1081 -106 1438 1444 123 238 1425 2735 2122 491 289 1684 2396 958 -1217 -1468 565 1234
807A234k055j887P67K306N63j951j690J689K295K17k547p13J794K439m92k922
$$ 1234 -821 -2708 -1941 365 928 -1023 -2713 -1024 1271 1488 -1059 -1772 22 2461 1969 -953
823i53n49K384K340j414k871k62K726J886k052l219K27K690J033k435k952O93
$$ -953 -1502 882 3222 1808 -1063 -1325 1401 3287 1235 -1984 -1757 933 1966 -469 -3421 -2728
839b728L400N19k647k065K124L082l3k439j349K366K903o16l010j140K770K497
$$ -2728 672 1191 -1456 -3521 -1397 1685 1652 -787 -2136 230 3133 2517 -493 -1633 1137 3634
855C634j637l066O9K318J856k191l157N77K504R41k604k473Q35K583L07k623j697
$$ 3634 1997 -1069 -1000 1318 3174 983 -2174 -1597 907 1848 -756 -3229 -2394 189 496 -2127 -3824
872c824J611K552K7k524q67K299K468o20k432o13K608J793j111k380NK218J378
$$ -3824 -2213 339 366 -2158 -3025 -726 1742 1122 -1310 -1923 685 2478 1367 -1013 -1008 1210 2588
889B588j833j906L67J939Q62j833j976J028J913lj695j189J225J660r0j595p67
$$ 2588 755 -1151 -784 1155 2017 184 -1792 -764 1149 1146 -549 -1738 -513 1147 1057 -538 -1305
906a305J546J752q62j478k85J769R67p51j693M32J110N93r22j322J94J094J94
$$ -1305 241 1993 1131 -347 -632 1137 2104 1353 -340 92 1202 1795 873 -449 -255 839 1033
923A033j113r03L69R74j7j217m83O15Q55m7j008j82O94P22q9q11KN97N20j05o43
$$ 1033 -80 -983 -614 360 343 -874 -1357 -742 113 66 -942 -1124 -430 292 203 -608 -606 -9 511 406 -237
944b37R0O07J29k17m42k80O80k8k24l76J03L47l28j55l00J40J83l6J24k42L29
$$ -237 -147 460 589 372 -70 -350 330 302 78 -298 -195 152 -176 -331 -631 -491 -308 -344 -220 -462 -133
965a33K41j13j08L08k67L55n0j1N6J12j20j0P0o7Q0r0N5l5K4n48L65j72K25k96
$$ -133 108 -5 -113 195 -72 283 233 222 278 390 270 260 330 263 343 253 308 273 297 -251 114 -58 167 -129
989a29k3k43K63N4j30j51M1P6J94J27K7k85K45K5j5l06M27K26kk73l52N12J95
$$ -129 -152 -395 -132 -78 -208 -359 -318 -242 -48 79 106 -179 66 91 76 -230 197 423 421 148 -204 308 503
1012E03k72n46K76J78J20m59n5k56N08K4j91j14j67L11L45k80k14K94L34N8k26
$$ 503 231 -315 -39 139 259 -200 -255 -511 -3 21 -170 -284 -451 -140 205 -75 -289 5 339 397 171
1033A71l04O58O0J65l14n46K35N42j19l18n21L49L27k48n81r9L91N19m20p39n4
$$ 171 -133 525 585 750 436 -110 125 667 548 230 -291 58 385 137 -444 -543 -152 367 -53 -792 -846
1054h46P57K25n74m57O1O38O58n90o01L17Q55L21p96n74N88P33j2r92k35Q45M38
$$ -846 -89 136 -438 -895 -834 -196 462 -128 -729 -412 443 764 -32 -606 -18 715 703 -289 -524 321 759
1075G59k47q28m60P78P83n76r96k52J154L93n90p96n9J238L96m33q99L31J172
$$ 759 512 -316 -776 2 785 209 -787 -1039 115 508 -82 -878 -937 301 697 264 -635 -304 868
1094H68L83q07o77O95O74J57q87r07P32J226m70j322m38P59N60k10j399l79J215
$$ 868 1251 444 -233 462 1136 1293 406 -501 231 1457 987 -335 -773 -14 546 336 -1063 -1442 -227
1113b27M51n20r63J80R67M60n88r25K22R66P17q32n65M77J069K51j054n09O23
$$ -227 224 -296 -1259 -1079 -112 348 -240 -1165 -943 23 740 -92 -657 -180 889 1140 86 -423 200
1132B00J080k43r97n97M98J057n80j149j86P70M17l65o49N7P81K83q32r9J31R27
$$ 200 1280 1037 40 -557 -59 998 418 -731 -917 -147 270 -95 -744 -687 94 377 -455 -554 -423 504
1152E04P5j95o53L24Q81J00l91l88Q1N23j33n44m21K00M84l17l75l60J19K72l74
$$ 504 579 384 -269 55 936 1036 645 257 338 861 728 184 -237 -37 447 130 -245 -605 -486 -214 -588
1173e88l28o7jL47J24m99j3P38p0K26O1J10N2Q3K97O3j49P4j12K33J16k88j41
$$ -588 -916 -983 -984 -637 -513 -1012 -1025 -287 -357 -131 -70 40 92 175 472 535 386 460 348 581 697 409 268
1196B68k75L93Q7n87l83N65J99k09m99k05O29K45o0o16R5N13P32p43m42K88N64
$$ 268 -7 386 473 -114 -497 68 267 58 -441 -646 -17 228 168 -448 -353 160 892 149 -293 -5 559
1217E59P34p44p83L82Q39K71j038p51L15R92j17j287m45M25Q27j07j052n10Q71
$$ 559 1293 549 -234 148 987 1258 220 -531 -216 776 659 -628 -1073 -648 179 72 -980 -1490 -619
1236f19Q29k08j168k11Q88R98n46r43j3J317Q17q46j136L88J297L67o38j278M43
$$ -619 210 2 -1166 -1377 -489 509 -37 -980 -993 324 1141 295 -841 -453 844 1211 573 -705 -262
1255b62J390nj246r53R33J271m54j221n30Q08J185m27j152m11P97J159o15j147
$$ -262 1128 1123 -123 -1076 -143 1128 674 -547 -1077 -269 916 489 -663 -1074 -277 882 267 -880
1273h80j0J025J011p91j009J59J348O09j276r37M83J297K06j017j000L28Q73K02
$$ -880 -890 135 1146 355 -654 -495 853 1462 186 -751 -268 1029 1235 218 -782 -454 419 621
1291F21j136q35M30J417l05j019n30N70J200k61r84l72R11Q78j79j314K23R76
$$ 621 -515 -1350 -920 497 192 -827 -1357 -787 413 152 -832 -1204 -293 585 406 -908 -685 291
1309B91N31k62p83l0O60O77o19q30J70Q59J24o30n86J37O92J95n04n84J17Q36
$$ 291 822 560 -223 -253 407 1084 465 -365 -195 664 788 158 -428 -291 401 596 92 -492 -375 461
1329D61J69n58m50K17P03j06n32l57O33L61j61l66q0K58N00J2o91k30N70L57j35
$$ 461 630 72 -378 -161 542 436 -96 -453 180 541 380 14 -66 192 692 704 13 -217 353 710 575
1350E75p79J03J56K25l96m1l07O00O8l72j17n0K85j12J85k75k13K48K47k81l0
$$ 575 -204 -101 55 280 -116 -157 -464 136 204 -168 -285 -335 -50 -162 23 -252 -465 -217 30 -251 -281
1371b81P1P2K83j14k55J44J28P4k32o8R9J8K6M1l99J19ML1J82j32o8r2M63l61
$$ -281 -210 -138 145 31 -224 -80 48 122 -110 -178 -79 -61 -35 6 -393 -274 -270 -239 -57 -189 -257 -349 114 -247
1395b47J56j28J20N4L63j89n78K99L89J42m2m16J67K55K29l23q5j96L91ln49j50
$$ -247 -91 -219 -99 -45 318 129 -449 -150 239 381 339 -77 90 345 574 251 166 -30 361 358 -191 -341
1417c41L24L35J5m39l74M88L04N8m87J51L3N38j47m64m36N00O37J46q57k27N70
$$ -341 -17 318 333 -106 -480 8 312 370 -117 34 67 605 458 -6 -442 58 695 841 -16 -243 327
1438C27O13k34p78R9K57O38k26p85j40N84L90q60o72K01J050L23r41n14J38R15
$$ 327 940 706 -72 27 284 922 696 -89 -229 355 745 -115 -787 -586 464 787 -154 -668 -530 385
1458C85K65r89o49N87R83l6r65n16O52R58N2j315l80R81Q42m75j080k97Q19J045
$$ 385 650 -339 -988 -401 582 546 -419 -935 -283 675 727 -588 -968 13 855 380 -700 -997 -178 867
1478H67q26j099n8J209O30o00j386N65R46K77o39o23L72Q79J39p63p05O51J005
$$ 867 41 -1058 -1116 93 723 123 -1263 -698 248 525 -114 -737 -365 514 653 -110 -815 -164 841
1497H41k16p54n21L62J281k99j179k33N80J069n88j006l22J126N75q18p37OR61
$$ 841 625 -129 -650 -288 993 694 -485 -718 -138 931 343 -663 -985 141 716 -102 -839 -833 128
1516A28N11n08j104L35J060L47p60o74L62O85P7m89m70K99P25m1p75m33M39P43
$$ 128 639 131 -973 -638 422 769 9 -665 -303 382 459 -30 -500 -201 524 483 -292 -725 -286 457
1536D57n4r19k66Q23M79l92n69k75Q19N20m18p26q4Q71L11l30l21j01O23N33o99
$$ 457 403 -516 -782 41 520 128 -441 -716 103 623 205 -521 -605 266 577 247 -74 -175 448 981 282
1557B82o07K42L96Q3m58LJ70J69O8k46l29J92K23k60J26j23j3j69L08p3j80l2
$$ 282 -325 -83 313 396 -62 -59 111 280 348 102 -227 -35 188 -72 54 -69 -82 -251 57 -16 -196 -228
1579b28M88j55J24k27j09K44K60l41j61j1K67n3O9j82lJ22m2j57k05J70P1K88
$$ -228 260 105 229 2 -107 137 397 56 -105 -116 151 98 167 -15 -18 104 62 -95 -300 -130 -59 229
1601B29k55j18M1j46M61r2l41J02J91L31j40q8r3K31J83o9p03J92L65Q4l01j15
$$ 229 -26 -144 -103 -249 212 120 -221 -119 72 403 263 175 82 313 496 427 -276 -84 281 365 64 -51
1623e1j04M57J20k21n58J31K83M44n40m99O9O95j68N3o73k7P41j04j27l50L16
$$ -51 -155 302 422 201 -357 -226 57 501 -39 -538 -469 226 58 111 -562 -589 152 48 -79 -429 -113
1644a13N09M6k77n49M73M15k81l78k38N25L16m4o37l04N41M08k59n25m32Q81K59
$$ -113 396 442 165 -384 89 504 223 -155 -393 132 448 404 -233 -537 4 412 153 -372 -804 77 336
1665C36j08o82j71P11L43j99q34K06Q30L83n83p14K73R16K41p06n67L60N88jn00
$$ 336 228 -454 -625 86 429 230 -604 -398 432 815 232 -482 -209 707 948 242 -325 35 623 622 122
1686A22p29N45M02K83r06m86M52O09p0r69k45P06O14j50r67l99P93P87k82o98
$$ 122 -607 -62 340 623 -283 -769 -317 292 222 -747 -992 -286 328 178 -789 -1188 -395 392 110 -588
1706e88k83R92L43m14o42N2R25M60p94r06M13O92M28p86r53N24M91L50q16n92
$$ -588 -871 121 464 50 -592 -540 385 845 51 -855 -442 250 678 -108 -1061 -537 -46 304 -512 -1104
1726a104O82O07j8q48l6L62R40q3k84n66N91N66k15l77l62N32O47l13r97K40N85
$$ -1104 -422 185 167 -681 -717 -355 585 502 218 -348 243 809 594 217 -145 387 1034 721 -276 -36 549
1747E49O30r70j16k48M37O4l21k55k86O08J64n00j84p4O34K17l48l12L49L21K62
$$ 549 1179 209 93 -155 282 346 25 -230 -516 92 256 -244 -428 -502 132 349 1 -311 38 359 621
1768F21m45j38K37L45K8j73k58K7L03J74m97l57P6J12L4l48j51J79J49j14L5k31
$$ 621 176 38 275 620 648 475 217 244 547 721 224 -133 -57 55 89 -259 -410 -231 -82 -196 -161 -392
1790c92K52R0K52l74o5J08K42K23q4L7k2M33k26k59J85k69N17l12j26k16j84L4
$$ -392 -140 -50 202 -172 -237 -129 113 336 252 289 267 700 474 215 400 131 648 336 210 -6 -190 -156
1812a56L27k87o72M18K15l56J8p41M27O15j25m78k1L01N17Rn39J12K23Q72l48
$$ -156 171 -116 -788 -370 -155 -511 -493 -1234 -807 -192 -317 -795 -816 -515 2 11 -528 -416 -193 679 331
1833C31n43l60N79N58j47p64j71K56N14m37n34j80N35L98l77p40J91N86K94l81
$$ 331 -212 -572 7 565 418 -346 -517 -261 253 -184 -718 -898 -363 35 -342 -1082 -891 -305 -11 -392
1853c92n83K96J064n5k53p78O71P34Q8m66m71L40Q64k33p52j57M85O69m14p84
$$ -392 -975 -679 385 330 77 -701 -30 704 792 326 -145 195 1059 826 74 -83 402 1071 657 -127
1873a27m21Q47M80l50r10L4K83L98k67n40J23P61K66l42m71PR53K52o01k38K9
$$ -127 -548 299 779 429 -481 -447 -164 234 -33 -573 -450 311 577 235 -236 -229 724 976 375 137 166
1894A66Q81K45q18l53q0J022j95n46n35K17O71k29o50n58M50M01o5o78j76N87
$$ 166 1047 1292 474 121 41 1063 868 322 -213 4 675 446 -204 -762 -312 89 24 -654 -830 -243
1914b43N83n73l88N9L68O70l73l48j95P14K44k28l92J02M85l42J62l37j62L01
$$ -243 340 -233 -621 -562 -194 476 103 -245 -440 274 518 290 -102 0 485 143 305 -32 -194 107
1934A07J19m57k96P0N78j50m88K7j86M38K3k08l01L88L0L22j34p87Q61o2K09j
$$ 107 226 -231 -527 -457 121 -29 -517 -490 -676 -238 -215 -423 -724 -336 -306 16 -118 -905 -44 -106 103 102
1956A02k12L80K91k92j20k95O22R7l06j31k24K20Jk83j66m8K91J21j49k55J15
$$ 102 -110 270 561 269 149 -146 476 573 267 136 -88 132 133 -150 -316 -364 -73 48 -101 -356 -241
1977b41M9o0R0j83J90K46K20l18K2O1L5L34j17l35J54oK70j0l50r5K90k7Qj87
$$ -241 -192 -252 -162 -345 -155 91 311 -7 15 76 111 445 328 -7 147 141 411 401 51 -44 246 219 227 40
2001D0j88p6K03j02m24R1J97J03o6j03j16J50M46J07l48J6P6K13N4j29M1J29L38
$$ 40 -148 -224 -21 -123 -547 -456 -259 -156 -222 -325 -441 -291 155 262 -86 -70 6 219 273 144 185 314 652
2024F52m22J3l1j14N13n01m4k38J29J72O6p44K61L36j61P1m40J38L88J09k54j32
$$ 652 230 243 212 98 611 110 66 -172 -43 129 195 -549 -288 48 -113 -42 -482 -344 44 153 -101 -233
2046b33o5O61J23l09m35J22M66J51j12m27L14K72j42l03k93J75N28k79n12n7K50
$$ -233 -298 363 486 177 -258 -136 330 481 369 -58 256 528 386 83 -210 -35 493 214 -298 -355 -105
2067a05J40p4n29k15O64J89k52p5j42J83O72l19l32O3N35K81m99l60K70L02K44
$$ -105 35 -39 -568 -783 -119 70 -182 -257 -399 -216 456 137 -195 -132 403 684 185 -175 95 397 641
2088F41n04m0l25N46O6l17m86J93N00l47k48m14K53L40J76m67m43O56K00J4l41
$$ 641 137 97 -228 318 384 67 -419 -226 274 -73 -321 -735 -482 -142 34 -433 -876 -220 -20 -6 -347
2109c47lL38K47M0m60n6K67N08k77m46k57P44R9j13n50R1K23J85l08k32j78M68
$$ -347 -350 -12 235 275 -185 -241 26 534 257 -189 -446 298 397 284 -266 -175 48 233 -75 -307 -485 -17
2131a7O9k30m10K06O60j13k7n40M99M34mm04p5K08K64n6j98j26J77J72j96m40
$$ -17 52 -178 -588 -382 278 165 138 -402 97 531 527 123 48 256 520 464 266 140 317 489 293 -147
2153a47J04L47j22k67l40JK46K09k79k89j43M11J28k67l34K05L84k2j27p1o0N18
$$ -147 -43 304 182 -85 -425 -424 -178 31 -248 -537 -680 -269 -141 -408 -742 -537 -153 -175 -302 -373 -433 85
2175H5P9n4k01J8K1J95j11p4J22j12K43k45p7Q5O7j05RNJ50j34k02k3j60M15J40
$$ 85 164 110 -91 -73 -52 143 32 -42 80 -32 211 -34 -111 -26 41 -64 -55 -50 100 -34 -236 -259 -419 -4 136
2200A36r2kM8L01r8P9P1k02l8N17k59l31J23K26j40r4J84l11J93M2j04o9on1l6
$$ 136 44 42 90 391 293 372 443 241 203 720 461 130 253 479 339 245 429 118 311 353 249 180 174 123 87
2225H7Mj38k19l0M90R5k56r0q0O20l07l29j24K30J65K87l75l32J30K45j03j50
$$ 87 91 -47 -266 -296 194 289 33 -57 -137 483 176 -153 -277 -47 118 405 30 -302 -172 73 -30 -180
2247a80l10L29K88k27l05l0K86L54j05l72p3J10J97p8j89n3L86P8M5l46O6M83
$$ -180 -490 -161 127 -100 -405 -435 -149 205 100 -272 -345 -235 -38 -116 -305 -358 28 106 151 -195 -129 354
2269C54J70m01k81J2N22k16q4m04K52M62j74n68P8j44O13m78j73L6K0L40Nm25
$$ 354 524 123 -158 -146 376 160 76 -328 -76 386 212 -356 -278 -422 191 -287 -460 -424 -404 -64 -59 -484
2291d84N2M4M89m47k0J80J18J86q0k54k76M96K82m70j63J56N16k95P0m07K50L55
$$ -484 -432 -388 101 -346 -366 -186 -68 118 38 -216 -492 4 286 -184 -347 -191 325 30 100 -307 -57 298
2313B98m9k89k66K17N21k29r1j19L12J5kj79j84L82K25k06l91Q2L20K84k47j61
$$ 298 249 -40 -306 -89 432 203 112 -7 305 320 318 139 -45 337 562 356 -35 47 367 651 404 243
2335B43k42M00j1k7m40j3p9K51O0l75M28j00J56l40q8L34J53j06m5o9j98K88j03
$$ 243 1 401 390 363 -77 -90 -169 82 142 -233 195 95 251 -89 -177 157 310 204 159 90 -108 180 77
2358G7L3k63M9J48R9l80J44J51O7L0l96j81L25L00r9k92j62N14j77L79l69K11
$$ 77 110 -153 -104 44 143 -237 -93 58 125 155 -241 -422 -97 203 104 -188 -350 164 -13 366 -3 208
2380B08k34K8K54o9L9j87J91k11M5O2j24j82K11n3M1J73m04Q4j57J45j29J21M0
$$ 208 -26 2 256 187 226 39 230 19 64 126 2 -180 31 -22 19 192 -212 -128 -285 -140 -269 -148 -108
2403a08k48J04J94o7j9j45k7M03j61K1J65m82K70J1M8J5mL5p4R2j85p2P8J66R8
$$ -108 -356 -252 -58 -125 -144 -289 -316 87 -74 -53 112 -370 -100 -89 -41 -26 -30 5 -69 23 -162 -234 -156 10 108
2428A08n20K31j7M98j93k64J08K72l2k20jJ59j9O1j27j82K99K47K0m90J30K8K31
$$ 108 -412 -181 -198 300 107 -157 -49 223 191 -29 -30 129 110 171 44 -138 161 408 428 -62 68 96 327
2451C27k15j70k29L40r1R6l77J1N7K89k57p2J2J58J92l56J29J08J05K86mm17j41
$$ 327 112 -58 -287 53 -38 58 -319 -308 -251 38 -219 -291 -279 -121 71 -285 -156 -48 57 343 339 -78 -219
2474b19M70j13nP2n36M14J55l82j32O3M36j67j62j37P8K85Jl02k9P3L50j49k14
$$ -219 251 138 133 205 -331 83 238 -144 -276 -213 223 56 -106 -243 -165 120 121 -181 -210 -137 213 64 -150
2497a50j1K63L06m10K6k15M22J71m68J71j37J63K50k58j45l6L53j01j76J1j0l10
$$ -150 -161 102 408 -2 24 -191 231 402 -66 105 -32 131 381 123 -22 -58 295 194 18 29 19 -291
2519b91K58k02J7J61j90L62k40O1J29L9j38L04k28J29K17k6n83LL95O8j64J25
$$ -291 -33 -235 -218 -57 -247 115 -125 -64 65 104 -34 270 42 171 388 362 -221 -218 177 245 81 206
2541B06m04J20J68j57j62j42K00K43o1j65j7J26m9K31k91K41m1J94m28K34L10
$$ 206 -198 -78 90 -67 -229 -371 -171 72 11 -154 -171 -45 -94 137 -154 87 46 240 -188 46 356
2562C56j46q4%j09j10J13K09j10j33K45K7J8l56j14J08p1J02m5q5O0K79j18j92
$$ 356 210 126 126 17 -93 20 229 119 -14 231 258 276 -80 -194 -86 -157 -55 -100 -185 -125 154 36 -156
2585a56M3N6Kj32J66j01K35P3j91K28O8J54k06q6k%Q7l21m1J91j63J20k2O4l29
$$ -156 -113 -57 -55 -187 -21 -122 113 186 -5 223 291 445 239 153 151 151 238 -83 -124 67 -96 24 2 66 -263
2610b63K92k23L6q3L7J32j08K71j17j95J11P9Qm1mP4P4r4K65j86l15L57j04j10
$$ -263 29 -194 -158 -241 -204 -72 -180 91 -26 -221 -110 -31 -23 -64 -68 6 80 -14 251 65 -250 107 3 -107
2634a07K3N3L5L4k15p6K81J32j03k35L46k72j16K44m3O1m68K56L10n5L6R2L7J62
$$ -107 -84 -31 4 38 -177 -253 28 160 57 -178 168 -104 -220 24 -19 42 -426 -170 140 85 121 213 250 412
2658D12r7P8o8k99L39l41J57m1O5k6k10J57k52K22j97k4j75L47J00k69K14j79
$$ 412 315 393 325 26 365 24 181 140 205 179 -31 126 -126 96 -101 -125 -300 47 147 -122 92 -87
2680h7N6K39J05k10j90p4O0J79J22r4k6J88q8k19K87j36j06j81M3j07J81k01r5
$$ -87 -31 208 313 103 -87 -161 -101 78 200 106 80 268 180 -39 248 112 6 -175 -132 -239 -58 -259 -354
2703c54J38J41j27R6j21M1o5J05qmJ51J27O3k04P7k1K07J4O2j70m2J93j35m2j97
$$ -354 -216 -75 -202 -106 -227 -186 -251 -146 -154 -158 -7 120 183 -21 56 35 242 256 318 148 106 299 164 122 -75
2728g5l7K38l3L7o4j50J89k76J25P8j78o1K50l03K37M1n3R4j35J63j70K03l27
$$ -75 -112 126 93 130 66 -84 105 -171 -46 32 -146 -207 43 -260 -23 18 -35 59 -76 87 -83 120 -207
2751b07J58L8J11J40l98J69k22J23J12M1k73j02L25k79J43n5O7K6j05r7L3J47
$$ -207 -49 -11 100 240 -158 11 -211 -88 24 65 -208 -310 15 -264 -121 -176 -109 -83 -188 -285 -252 -105
2773a05JR9k60M59k53J62Kj86K97J7m4J25m4j39J71m7k74M2m8J81j93K20r0l94
$$ -105 -104 -5 -265 194 -59 103 105 -81 216 233 189 314 270 131 302 255 -19 23 -25 156 -37 183 93 -301
2797c01L2p3L91j45j36J49K30j85J19l49O4M18j17l49n2L28k0K37j70j04J72k40
$$ -301 -269 -342 49 -96 -232 -83 147 -38 81 -268 -204 214 97 -252 -304 24 4 241 71 -33 139 -101
2819a01K92j58j1N9Kj25j24P0p1p8K22j98L46k18j35L56j26l7J79O5j9k2R1K3
$$ -101 191 33 22 81 83 -42 -166 -96 -167 -245 -23 -221 125 -93 -228 128 2 -35 144 209 190 168 259 282
2843B82KQ1p3o2k9j72L2J79k61k8L58l00mj49j44lJ01K4k88J21J69k29P9J06K14
$$ 282 284 365 292 230 201 29 61 240 -21 -49 309 9 5 -144 -288 -291 -190 -166 -454 -333 -164 -393 -314 -208 6
2868Fj79O2k4o5K88j26J39J56l05L04j49k2p6j5Q5J44k68k4K3r5o2K13k08J59
$$ 6 -173 -111 -135 -200 88 -38 101 257 -48 256 107 85 9 -6 79 223 -45 -69 -46 -141 -203 10 -198 -39
2892c9n4L5L2q4j62L49pk54L68N5q4Q8j67J44J78l04r6J75K48M4j30l59J37J93
$$ -39 -93 -58 -26 -110 -272 77 70 -184 184 239 155 243 76 220 398 94 -2 173 421 465 335 -24 113 306
2916C06l89j22m0l2kR4P9J72k67n9P8K14q3r4J41r5J63p4r4L33j89J47j90P9O
$$ 306 -83 -205 -245 -277 -279 -185 -106 66 -201 -260 -182 32 -51 -145 -4 -99 64 -10 -104 229 40 187 -3 76 82
2941H2k27M38l56L11m12J34l0R2j17P4K8k80K17q5J34j57J39J58j52j00K39o3
$$ 82 -145 293 -63 248 -164 -30 -60 32 -85 -11 17 -263 -46 -131 3 -154 -15 143 -9 -109 130 67
2963F7N2o3J76j71K73j59P5l29L80j19k36K82k45L3N2Q2l53n1p2j10J60P7k00
$$ 67 119 56 232 61 334 175 250 -79 301 182 -54 228 -17 16 68 150 -203 -254 -326 -436 -276 -199 -399
2986c99L19O2p1j58nP7J80J04k89J64J38rJ53Pn4j57O0k1J71m05K87k07J52j02
$$ -399 -80 -18 -89 -247 -252 -175 5 109 -180 -16 122 113 266 273 219 62 122 101 272 -133 154 -53 99 -3
3010cn2O2j83J29q4N8m5k9P1j01J08N2P3R6JnJ55k17L75m88K73j63j51J84j81
$$ -3 -55 7 -176 -47 -131 -73 -118 -147 -76 -177 -69 -17 56 152 153 148 303 86 461 -27 246 83 -68 116 -65
3035f5K82P3k38k54K16k49J82O4K08n40J20J61k5L0k66L74K0%k10L23%j43J11
$$ -65 217 290 52 -202 14 -235 -53 11 219 -321 -201 -40 -65 -35 -301 73 93 93 -117 206 206 63 174
3058A74k74J29J27k06J89j18J69k48P3l3J18J32k40q6j99J4K36k01N2R0L0r9K19
$$ 174 -100 29 156 -50 139 21 190 -58 15 -18 100 232 -8 -94 -293 -279 -43 -244 -192 -102 -72 -171 48
3081D8q6M4q2J24k58M16k76L05L5l63J93r5L43j13j31k33K13J2k72K60O8k04J21
$$ 48 -38 6 -76 48 -210 206 -70 235 270 -93 100 5 348 235 104 -129 84 96 -176 84 152 -52 69
3104F9l35J98J35j06J06j06L00j02k52M8K67Q4j28l52K54L35l72J30o1j44J46
$$ 69 -266 -68 67 -39 67 -39 261 159 -93 -45 222 306 178 -174 80 415 43 173 112 -32 114
3125A14q7M9O0J36l79J70J49k02L6%n4n4j08q2J28o2P1j16j3M8j26K48Q9k31L69
$$ 114 27 76 136 272 -107 63 212 10 46 46 -8 -62 -170 -252 -124 -186 -115 -231 -244 -196 -322 -74 15 -216 153
3150A53n9l05M56l84L1J52j28K44l77J28J98K7j25k32K89J31m82K46j23L6K30
$$ 153 94 -211 245 -139 -108 44 -84 160 -217 -89 109 136 11 -221 68 199 -283 -37 -160 -124 106
3171A06j41J48k54j9J49j15J12J05nm0j36K5K32o1Q3k50L5l1J28r2J13J23j56
$$ 106 -35 113 -141 -160 -11 -126 -14 91 86 46 -90 -65 167 106 189 -61 -26 -57 71 -21 92 215 59
3194E9l0q9k16J77L58k23o3P5P8m1l10L27j47p7K53k35J0J29m5m3n7j9MK78j02
$$ 59 29 -60 -276 -99 259 36 -27 48 126 85 -225 102 -45 -122 131 -104 -94 35 -10 -53 -110 -129 -125 153 51
3219E1j2N4j35j30L30K5l36K06O7l8l1Q2j33Q7o3R3r4J64j39K20j10k67j4R0J03
$$ 51 39 93 -42 -172 158 183 -153 53 120 82 51 133 0 87 24 117 23 187 48 268 158 -109 -123 -33 70
3244G0j14P1j73M00m85K11j6k7j67M46k06Kn5J34j32j8O8PL8k05J57o8J38Q8j56
$$ 70 -44 27 -146 254 -231 -20 -36 -63 -230 216 10 12 -43 91 -41 -59 9 16 54 -151 6 -62 76 164 8
3269Hl9k12J90oj56J56J32j84R1j6k93K95mk2j12J97j28M47l12L06j06j44R2L8
$$ 8 -31 -243 -53 -59 -215 -59 73 -111 -20 -36 -329 -34 -38 -60 -172 25 -103 344 32 338 232 88 180 218
3293B18j58J25r6q8L64m44L30o4j16J49l66M6L8J41j90K3J30j97Q2j41K23k31
$$ 218 60 185 89 1 365 -79 251 187 71 220 -146 -100 -62 79 -111 -88 42 -155 -73 -214 9 -222
3315b22J19P5R2o9m6L6j14K66j56L8m7m2j2l1L14p6qk68J89M9q4p2j30r4L30O4
$$ -222 -103 -28 64 -5 -51 -15 -129 137 -19 19 -28 -70 -82 -113 201 125 117 -151 38 87 3 -69 -199 -293 37 101
3341A01o4M4k20K26j01O5J54j97j52J98J11K25k28jr5J28k0K4k28K79j25J7k98
$$ 101 37 81 -139 87 -14 51 205 8 -144 54 165 390 162 161 66 194 174 198 -30 249 124 141 -157
3364a57n0K15o5J13j00l10K02J04j9J33k16J42j34J99j01Q8j12j60J78K30j39
$$ -157 -207 8 -57 56 -44 -354 -152 -48 -67 66 -150 -8 -142 57 -44 44 -68 -228 -50 180 41
3385D1K61l51j06K40k22L71l62P1l40K68J90k38Q3j1oj12L40k26k7Q9O2lk25J38
$$ 41 302 -49 -155 85 -137 234 -128 -57 -397 -129 61 -177 -94 -105 -111 -223 117 -109 -136 -47 15 12 -213 -75
3409g5J41j87R1J88L2J1L9n2o2N4q0R8l11J8K19O8j37n0k75M50j18o9j84J33O8
$$ -75 66 -121 -30 158 190 201 240 188 126 180 100 198 -113 -95 124 192 55 5 -270 180 62 -7 -191 -58 10
3434A0q9L9j85J25j01N6J23K1J17J42j32j46N6K4K08j86O5j15j4J22j01p3k29
$$ 10 -79 -40 -225 -100 -201 -145 -22 -1 116 258 126 -20 36 60 268 82 147 32 18 140 39 -34 -263
3457b63K62j54J54J25m29K0L25k7k4r2j2J69k49O5K79j8k64Q8P1r0L32p2nJ73
$$ -263 -1 -155 -1 124 -305 -285 40 13 -11 -103 -115 54 -195 -130 149 131 -133 -45 26 -64 268 196 191 364
3481C64k92K14k48R4m6P7l67J04Q8k2Rj41L6J5q9J67j00J34k97K04l3J61Ro7j12
$$ 364 72 286 38 132 86 163 -204 -100 -12 -34 -25 -166 -130 -115 -204 -37 -137 -3 -300 -96 -129 32 41 -26 -138
3506a38L0J86j84K73M3J16m57L89m12J04J08j20J38l86n4N3J70Q3j37k63K04K54
$$ -138 -108 78 -106 167 210 326 -131 258 -154 -50 58 -62 76 -310 -364 -311 -141 -58 -195 -458 -254 0
3528@j44J15j60J67J42r8n1j09r6N68l2l88J24J75J21r3k71M6J68Lk13R5l67M33
$$ 0 -144 -29 -189 -22 120 22 -29 -138 -234 334 302 -86 38 213 334 241 -30 16 184 187 -26 69 -298 135
3552A35j46k23j19R5K49l1l1o1O7j6K45k42O5J0l9K41J34k62K39j13J81j34k11
$$ 135 -11 -234 -353 -258 -9 -40 -71 -132 -65 -81 164 -78 -13 -3 -42 199 333 71 310 197 378 244 33
3575C3M33r3j22J6l22L17k27j6kM7j6J69k76j08J10l1J88k31Q7k2K53K83l74J5
$$ 33 466 373 251 267 -55 262 35 19 17 64 48 217 -59 -167 -57 -88 100 -131 -44 -66 187 470 96 111
3599A11j68K82o7k4r8j79L39j53K30k41j17K54m01J02l09J88Q6j4j45J3n6N51
$$ 111 -57 225 158 134 36 -143 196 43 273 32 -85 169 -232 -130 -439 -251 -165 -179 -324 -311 -367 184
$$ [...]
8191a16
##END NTUPLES=NMR FID
##END=
