##TITLE=1H_Pr 2842
 CDCl3
 8 sc, 
 9.2.2023
##JCAMPDX= 6.0         $$ Bruker NMR JCAMP-DX V2.0
##DATA TYPE= NMR FID
##DATA CLASS= NTUPLES
##ORIGIN= UXNMR, Bruker Analytische Messtechnik GmbH
##OWNER= root
$$ XWIN-NMR		Version 3.5
$$ Thu Feb  9 16:35:10 2023 Russian Standard Time (UT+4h)  she@DPX200
##.OBSERVE FREQUENCY= 200.13135
##.OBSERVE NUCLEUS= ^1H
##.DELAY= (6, 6)
##.ACQUISITION MODE= SIMULTANEOUS
##.ACQUISITION SCHEME= undefined
##.AVERAGES= 8
##.DIGITISER RES= 18
##SPECTROMETER/DATA SYSTEM= spect
##.PULSE SEQUENCE= zg30
##.SOLVENT NAME= DMSO
##.SHIFT REFERENCE= (INTERNAL, DMSO, 0, 15.7039)
##AUDIT TRAIL= $$ (NUMBER, WHEN, WHO, WHERE, WHAT)
$$ ##TITLE= Audit trail, XWIN-NMR		Version 3.5
$$ ##JCAMPDX= 5.01
$$ ##ORIGIN= Bruker BioSpin GmbH
$$ ##OWNER= she
$$ F:/spectra/data/she/nmr/H-F/1/audita.txt
$$ ##AUDIT TRAIL=  $$ (NUMBER, WHEN, WHO, WHERE, WHAT)
(   1,<2023-02-09 16:34:13.43 +0400>,<she>,<DPX200>,
      <created by zg, POWCHK disabled, PULCHK disabled
       configuration hash MD5:
       00 E9 B6 7A A2 85 ED C7 34 08 36 98 17 FE 4E 26
       data hash MD5: 16K
       6C 43 44 6A 55 67 A0 69 47 3A 5C 86 5C 15 F8 D1>)
$$ ##END=
$$ 
$$ hash MD5
$$ 44 50 93 5A 3B C6 81 5D CD B9 8F 73 8B 44 BC 3F
##$RELAX= 
##$RELAX= 
##$RELAX= 
##$RELAX= 
##$RELAX= 
##$RELAX= 
$$ Bruker specific parameters
$$ --------------------------
##$DU= <F:/spectra>
##$EXPNO= 1
##$NAME= <H-F>
##$PROCNO= 1
##$TYPE= <nmr>
##$USER= <she>
##$AMP= (0..31)
100 100 100 100 100 100 100 100 100 100 100 100 100 100 100 100 100 100 
100 100 100 100 100 100 100 100 100 100 100 100 100 100 
##$AQSEQ= 0
##$AQ_mod= 1
##$AUNM= <au_zg>
##$AUTOPOS= <>
##$BF1= 200.13
##$BF2= 200.13
##$BF3= 200.13
##$BF4= 200.13
##$BF5= 200.13
##$BF6= 200.13
##$BF7= 200.13
##$BF8= 200.13
##$BYTORDA= 1
##$CFDGTYP= 0
##$CFRGTYP= 5
##$CHEMSTR= <none>
##$CNST= (0..31)
1 1 145 1 1 1 1 1 1 1 1 1 1 1 1 1 1 1 1 1 1 1 1 1 1 1 1 1 1 1 1 1 
##$CPDPRG= <>
##$CPDPRG1= <>
##$CPDPRG2= <>
##$CPDPRG3= <>
##$CPDPRG4= <mlev>
##$CPDPRG5= <mlev>
##$CPDPRG6= <mlev>
##$CPDPRG7= <mlev>
##$CPDPRG8= <mlev>
##$CPDPRGB= <>
##$CPDPRGT= <>
##$D= (0..31)
0 1.2 0 0 0 0 0 0 0 0.06 0 0.03 0 0 0 0 0.0002 0 0 0 0 0 0 0 0 0 0 0 0 
0 0 0 
##$DATE= 1675946053
##$DBL= (0..7)
120 120 120 120 120 120 120 120 
##$DBP= (0..7)
150 150 150 150 150 150 150 150 
##$DBP07= 0
##$DBPNAM0= <>
##$DBPNAM1= <>
##$DBPNAM2= <>
##$DBPNAM3= <>
##$DBPNAM4= <>
##$DBPNAM5= <>
##$DBPNAM6= <>
##$DBPNAM7= <>
##$DBPOAL= (0..7)
0.5 0.5 0.5 0.5 0.5 0.5 0.5 0.5 
##$DBPOFFS= (0..7)
0 0 0 0 0 0 0 0 
##$DE= 6
##$DECBNUC= <off>
##$DECIM= 32
##$DECNUC= <off>
##$DECSTAT= 4
##$DIGMOD= 1
##$DIGTYP= 9
##$DL= (0..7)
0 120 120 120 120 120 120 120 
##$DP= (0..7)
150 150 150 150 150 150 150 150 
##$DP07= 0
##$DPNAME0= <>
##$DPNAME1= <>
##$DPNAME2= <>
##$DPNAME3= <>
##$DPNAME4= <>
##$DPNAME5= <>
##$DPNAME6= <>
##$DPNAME7= <>
##$DPOAL= (0..7)
0.5 0.5 0.5 0.5 0.5 0.5 0.5 0.5 
##$DPOFFS= (0..7)
0 0 0 0 0 0 0 0 
##$DQDMODE= 0
##$DR= 18
##$DS= 0
##$DSLIST= <SSSSSSSSSSSSSSS>
$$ [...]
##$SUBNAM2= <"">
##$SUBNAM3= <"">
##$SUBNAM4= <"">
##$SUBNAM5= <"">
##$SUBNAM6= <"">
##$SUBNAM7= <"">
##$SUBNAM8= <"">
##$SUBNAM9= <"">
##$SW= 18.05172834244
##$SWIBOX= (0..15)
0 0 2 0 0 0 0 0 0 0 0 0 0 0 0 0 
##$SW_h= 3612.71676300578
##$TD= 16384
##$TD0= 1
##$TE= 0
##$TE2= 300
##$TE3= 300
##$TEG= 300
##$TL= (0..7)
0 120 120 120 120 120 120 120 
##$TP= (0..7)
150 150 150 150 150 150 150 150 
##$TP07= 0
##$TPNAME0= <>
##$TPNAME1= <>
##$TPNAME2= <>
##$TPNAME3= <>
##$TPNAME4= <>
##$TPNAME5= <>
##$TPNAME6= <>
##$TPNAME7= <>
##$TPOAL= (0..7)
0.5 0.5 0.5 0.5 0.5 0.5 0.5 0.5 
##$TPOFFS= (0..7)
0 0 0 0 0 0 0 0 
##$TUNHIN= 0
##$TUNHOUT= 0
##$TUNXOUT= 0
##$USERA1= <user>
##$USERA2= <user>
##$USERA3= <user>
##$USERA4= <user>
##$USERA5= <user>
##$V9= 5
##$VALIST= <valist>
##$VCLIST= <CCCCCCCCCCCCCCC>
##$VD= 0
##$VDLIST= <DDDDDDDDDDDDDDD>
##$VPLIST= <PPPPPPPPPPPPPPP>
##$VTLIST= <TTTTTTTTTTTTTTT>
##$WBST= 1024
##$WBSW= 4
##$XGAIN= (0..3)
0 0 0 0 
##$XL= 0
##$YL= 0
##$YMAX_a= 152268
##$YMIN_a= -133862
##$ZGOPTNS= <>
##$ZL1= 120
##$ZL2= 120
##$ZL3= 120
##$ZL4= 120
##$ABSF1= 10
##$ABSF2= 0
##$ABSG= 5
##$ABSL= 3
##$ALPHA= 0
##$AQORDER= 0
##$ASSFAC= 0
##$ASSFACI= 0
##$ASSFACX= 0
##$ASSWID= 0
##$AUNMP= <proc_1d>
##$AZFE= 0.1
##$AZFW= 0.1
##$BCFW= 1
##$BC_mod= 2
##$BYTORDP= 1
##$COROFFS= 0
##$CY= 11.3945322036743
##$DATMOD= 1
##$DC= 2
##$DFILT= <>
##$DTYPP= 0
##$F1P= 2.36226072786647
##$F2P= -0.459571619588291
##$FCOR= 0.5
##$FTSIZE= 0
##$FT_mod= 4
##$GAMMA= 1
##$GB= 0.15
##$INTBC= 1
##$INTSCL= 1
##$ISEN= 128
##$LB= 0.24
##$LEV0= 0
##$LPBIN= 0
##$MAXI= 10000
##$MC2= 0
##$MEAN= 0
##$ME_mod= 0
##$MI= 1.114404
##$NCOEF= 0
##$NC_proc= 0
##$NLEV= 6
##$NOISF1= 3.799351
##$NOISF2= 2.8
##$NSP= 1
##$NTH_PI= 0
##$NZP= 0
##$OFFSET= 15.70392
##$PC= 1
##$PHC0= -19116.72
##$PHC1= 20.20078
##$PH_mod= 1
##$PKNL= yes
##$PPARMOD= 0
##$PSCAL= 0
##$PSIGN= 0
##$REVERSE= no
##$SF= 200.130013532006
##$SI= 16384
##$SIGF1= 3
##$SIGF2= 2
##$SINO= 400
##$SIOLD= 16384
##$SREGLST= <1H.CDCl3>
##$SSB= 0
##$STSI= 0
##$STSR= 0
##$SW_p= 3612.71676300578
##$SYMM= 0
##$S_DEV= 0
##$TDeff= 0
##$TDoff= 0
##$TI= <>
##$TILT= no
##$TM1= 0
##$TM2= 0
##$TOPLEV= 0
##$USERP1= <user>
##$USERP2= <user>
##$USERP3= <user>
##$USERP4= <user>
##$USERP5= <user>
##$WDW= 1
##$XDIM= 8192
##$YMAX_p= 0
##$YMIN_p= 0
$$ End of Bruker specific parameters
$$ ---------------------------------
##NTUPLES= NMR FID
##VAR_NAME=  TIME,          FID/REAL,        FID/IMAG
##SYMBOL=    X,             R,               I
##VAR_TYPE=  INDEPENDENT,   DEPENDENT,       DEPENDENT
##VAR_FORM=  AFFN,          ASDF,            ASDF
##VAR_DIM=   8192,          8192,            8192
##UNITS=     SECONDS,       ARBITRARY UNITS, ARBITRARY UNITS
##FACTOR=    0.0002768,     1,               1
##FIRST=     0,             0,               0
##LAST=      2.2672688,     0,               0
##MIN=       0,             -133862,         0
##MAX=       2.2672688,     152268,          0
$$ Real data points
##PAGE= N=1
##DATA TABLE= (X++(R..R)), XYDATA
0 0 0 0 0 0 0 0 0 0 0 0 0 0 -1 8 -8 8 -8 9 -16 16 -24 24 -32 33 -40 48 -56 64 -73 87 -97 112 -128 144 -164
35 -164 183 -206 231 -259 288 -322 355 -395 437 -483 536 -591 650 -717 791 -871 960 -1058
53 -1058 1167 -1288 1429 -1583 1764 -1975 2221 -2515 2878 -3336 3931 -4745 5927 -7811 11314
68 11314 -20085 94444 120268 35550 123331 102790 20075 -15944 70092 82375 4878 -1578
80 -1578 61873 22113 -59027 -85066 -54429 -74242 -124750 -91498 -23319 -27890 -24719 10752 32243
93 32243 15365 -7576 4766 9282 -17498 4354 37496 32534 34581 51375 50640 11065 -28470
106 -28470 -19072 -36280 -91664 -86140 -43855 -38985 -59883 -45919 7600 -3190 -62756 -42396 3560
119 3560 -19978 -48326 -5061 64702 57767 25195 75805 113139 58937 14668 32173 48608
131 48608 5912 -29910 14891 40999 -549 -13819 9089 6986 -34178 -64562 -43763 -37572
143 -37572 -60827 -44050 -10117 4280 10279 14396 26884 24828 10834 14069 9379 6493 25664
156 25664 29997 28327 36657 39622 32927 4849 -12949 -5337 -24053 -48977 -38801 -18800 -12929
169 -12929 -24617 -17112 12156 -377 -28709 -18424 -1707 -4373 -16377 -1892 36772 37166 19498
182 19498 34531 45511 30340 2539 -7035 8887 -417 -23235 -12069 3781 1313 -13937 -22582
195 -22582 -9178 -16315 -41917 -39771 -25605 -16119 -15133 -14756 11861 27691 12469 8733 19290 24364
209 24364 11512 -4665 14261 30674 12953 7907 22698 25895 6706 -17041 -9047 -3617 -29586
222 -29586 -35731 -18875 -11226 -15596 -20328 -5436 3728 -12802 -13811 -3455 -4014 -1369 1772 9617
236 9617 19233 19435 23873 20370 11400 18013 10550 -7460 -4404 3466 1691 -11571 -12928 8190 -7
251 -7 -25750 -16897 -200 -9659 -28368 -17775 15525 8208 -14360 10601 35184 18117 -2191
264 -2191 12555 37969 17621 -7939 19430 37009 10741 -4906 11377 22470 -5529 -27651
276 -27651 -4192 1606 -26048 -28549 -9162 -4337 -21478 -24841 -2086 -4895 -22559 -9876 2229
289 2229 -2511 -3567 6768 16102 6295 3088 19311 10260 -5986 4586 11451 -1357 -12896 -340
303 -340 12520 -11794 -25305 457 1063 -26276 -27950 -816 6777 -21776 -18749 21033 15836 -14197
317 -14197 -2435 26238 18701 -10333 1741 37208 20809 -6268 13675 32941 13124 -12790
329 -12790 -727 18133 -7232 -26781 -2688 7803 -10933 -18565 -2968 5146 -15582 -20382 -119
342 -119 -3497 -14845 -4488 7505 7571 2477 10494 18712 3290 -975 12065 4071 -7768 -1243
356 -1243 10855 5995 -10013 1586 16127 -6824 -21480 -4215 2331 -15348 -23825 2157 17253
369 17253 -7450 -8703 20579 19731 -4650 -7714 14959 17650 -9213 -3263 26209 19612 -1116
382 -1116 2899 18453 9744 -17666 -14580 2821 -10846 -23637 -11332 687 -3404 -14776 -8376
395 -8376 270 -12957 -18091 -10113 -8707 -7192 -4692 2154 8807 6346 8814 9100 -1146 -493 1377
410 1377 -4802 -6208 -2070 6484 4499 -4863 4989 9890 -5909 -12648 -5816 -406 -7153 -12356 6702
425 6702 18155 6286 6908 18255 20099 8057 -1516 10476 15846 2673 4312 17505 19760 11241
439 11241 2392 7427 6319 -11207 -16183 -11588 -11020 -12314 -15406 -7640 1366 -6226 -11211 -8572 -7173
454 -7173 -8328 -15907 -10682 3580 3057 1392 8677 15400 14827 2153 -1051 6841 -871 -9735 -5063
469 -5063 2336 4411 -3456 -2470 6536 -1699 -12507 -11000 -9501 -9349 -12148 -7589 4610 5859 6211
484 6211 11022 9658 9814 7401 2137 3773 5267 7337 9090 6549 12429 15234 3258 -2720 -1809
499 -1809 -3849 -13077 -21650 -10188 -1647 -13124 -12728 2270 4770 -7704 -14431 172 4257 -13428
513 -13428 -9739 11441 14161 4248 5858 22735 21141 -1498 -844 12494 2942 -10824 -5539 8276
527 8276 5017 -9409 -1639 8129 -5943 -15386 -10183 -7008 -11843 -15325 -3136 4564 -1605 3667
541 3667 11460 6064 2008 3138 5456 981 -3193 8302 11537 1452 5404 13425 6650 -6407
555 -6407 -7057 2888 -5683 -20974 -7526 5818 -4320 -10885 1628 12833 -1270 -14322 2833
568 2833 10642 -6927 -9226 9829 17969 3350 -1741 18020 17578 -5996 -6799 6172 2156 -13353
582 -13353 -11681 5205 1634 -13540 -5624 3379 -6658 -15107 -11146 -3507 -9077 -13652 -277 4606
596 4606 -1587 2331 8414 6290 -238 864 7295 786 -4918 7021 9389 624 987 8941 8389
611 8389 -5787 -7661 5713 -244 -13270 -4160 8192 4344 -6135 1698 16159 4947 -8224
624 -8224 3976 12333 1681 -5567 6225 17131 4530 -4297 9843 11532 -3970 -8650 -714
637 -714 2070 -10227 -12737 319 -465 -9789 -7457 -1998 -2861 -9660 -9583 -2140 -4258 -6789 -29 2414
653 2414 1650 2850 4086 4983 874 1582 4993 -871 -1643 4618 3444 -498 -922 3033 3620 -5944 -5638
670 -5638 2524 -1958 -7549 -4092 3373 3393 -4832 -548 9055 2901 -3375 1768 6894 4555 -2432 1854
686 1854 10293 3686 -1252 2833 4946 1474 -4545 -3621 1948 -3078 -6818 -3493 -1583 -1445 -5227 -5587
702 -5587 73 -1701 -4887 -2813 -790 1913 -150 -1985 4331 4903 1155 1438 3174 5762 2302 -1690
718 -1690 3522 4315 -504 -591 914 2623 -472 -4122 281 1528 -2936 -1906 -1152 133 -182 -2527
734 -2527 531 1651 -443 1165 192 664 3027 637 -13 915 1351 2087 -2238 -1786 3883 14 -4396
751 -4396 -1352 1530 -135 -6632 -4079 3458 -2322 -7925 -1359 3397 -290 -6502 -1284 6552 -1192
766 -1192 -7043 1569 5059 -997 -4594 2302 7926 -1039 -4330 4956 4634 -2424 -3250 2402 4063 -2941
782 -2941 -2657 5677 2572 -2298 918 3035 1035 -3005 -383 3275 -1512 -1939 4294 2016 -1397 600
798 600 3264 743 -5087 -505 4081 -3738 -5015 2925 3809 -2471 -4521 3493 4464 -6946 -5716 4863
814 4863 1438 -6475 -3128 6847 4441 -6664 -1304 8577 26 -7569 -1346 6005 215 -7367 1385
829 1385 8942 -950 -5100 2963 4707 -2649 -6501 1470 4279 -4578 -2789 5136 2812 -1566 -721
844 -721 3397 915 -5000 -408 3306 -2488 -1863 3596 3316 -609 -1472 3592 1424 -6338 -1228 3379
860 3379 -2395 -4805 992 5212 -490 -5395 3235 5042 -5502 -6004 2159 2526 -4492 -4519 6087 5813
876 5813 -4840 -1336 6127 1945 -5276 -3282 4979 2078 -5660 1321 7136 1513 -2752 471 4363
891 4363 -582 -6213 -196 2460 -3025 -2198 1852 2408 -727 -2134 1418 27 -4482 -1106 276 -1738
907 -1738 -194 1648 3073 928 163 4352 1432 -2629 1093 2774 425 -919 1760 5844 1449
922 1449 -2247 2813 2981 -2791 -4158 -948 1222 -3093 -4605 2309 2154 -3081 -2506 576 957 -3386
938 -3386 -4995 1116 993 -2687 43 2787 2933 147 -1403 1996 698 -2902 -1690 -682 110 -405
954 -405 -1977 679 892 -1607 -2128 -2514 -1644 -1560 -3711 -1306 1437 451 1085 1273 2947 3348 28 1181
972 1181 3729 1796 1910 2439 3867 4918 1717 2206 3402 513 -580 -1253 -1396 -766 -2187 -1849 -374
989 -374 -1150 -988 -1708 -3185 -990 -1636 -3271 -1887 -624 1227 -44 -666 3288 3185 -969 -817 1259
1006 1259 1923 -1845 -2960 2399 2114 -3235 -1416 2131 775 -4048 -4373 1245 -445 -6016 -1709 2689
1022 2689 872 -1621 17 5205 1670 -2786 1994 4151 785 -296 2460 4809 1767 -410 3488
1037 3488 2735 -2030 -606 475 -831 -2813 -2274 768 -1515 -3767 715 -35 -3422 -2624 161 126
1053 126 -3103 -1496 4005 1239 -2599 2233 4462 701 -2540 473 4802 -1391 -4217 2765 3307
1068 3307 -2150 -3512 1567 3218 -4093 -5233 2878 850 -4850 -2472 2977 2382 -2759 -490 5771
1083 5771 1827 -2732 1480 4244 1178 -1842 1451 4914 -103 -1737 3067 1207 -2200 -2174 13
1098 13 50 -3945 -2551 1666 -2026 -3261 409 1160 -1546 -2466 1046 2714 -2411 -1063 4476 1961
1114 1961 -1529 753 4329 2728 -3249 94 4488 -1035 -4319 301 2443 -1739 -5318 -160 2816
1129 2816 -4029 -4681 797 1012 -2904 -3117 1933 3141 -2518 -479 4642 2573 -505 799 3823 2950
1145 2950 -1300 1072 4160 -21 -820 1060 920 -1000 -2609 -821 -446 -3606 -1990 -240 -2525 -2201
1161 -2201 -945 433 -539 -2014 1290 2541 -1164 642 3211 2495 873 818 3956 3088 -1416 985
1177 985 2994 -80 -1673 -1098 926 -800 -4454 -1243 282 -2829 -3577 -1644 35 -1347 -3448 132
1193 132 1711 -1136 -335 1676 2091 1772 357 2457 3345 878 1132 1606 990 1047 -536 -57 404 -1082
1211 -1082 -1009 -1595 -1858 -1005 -2318 -2337 -742 -1611 -1055 -820 -624 1307 294 -78 2044 1372 1385 1562 1358
1230 1358 2780 1681 743 1868 783 315 45 -1103 -458 -1155 -1944 -1289 -1959 -1355 -1055 -2694 -1062
1247 -1062 -211 -1423 -1037 -617 620 788 -833 1588 3117 694 758 1810 2561 1257 -1336 1384 2400
1264 2400 -1101 -1158 784 1026 -785 -2714 -81 793 -2963 -2069 849 410 -1131 -1555 1841 2086 -1192
1281 -1192 697 2887 529 -177 752 2024 1281 -1011 1422 1557 -843 -764 30 -710 -2027 -2297 -438
1298 -438 -1124 -3324 -766 249 -2001 -1896 58 805 -1167 -2112 2158 2133 -1488 327 2961 1963 -726
1315 -726 -379 3426 955 -2918 139 2247 -920 -2230 20 2473 -575 -3612 970 1944 -2180 -2069
1331 -2069 1101 2532 -648 -984 3687 2861 -767 1231 2947 1504 -493 164 2836 682 -2215 1055
1347 1055 1470 -1553 -1839 -881 -252 -3124 -3537 -34 -960 -3762 -961 773 -635 -1839 -103 2506
1363 2506 -365 -1880 2561 2768 -99 378 2682 3464 -654 -1099 3194 956 -2928 -937 1149 -150
1379 -150 -3318 -1624 1860 -954 -3326 -174 1080 -1216 -2306 105 2640 -387 -967 3149 2864 353
1395 353 596 2544 2581 -330 -268 2508 631 -1251 293 432 -834 -2059 -1407 -313 -3020 -2931 -484
1412 -484 -1720 -2189 -1159 170 416 -1254 176 2300 106 -629 1537 2358 1137 -79 1950 2752
1428 2752 -82 -516 1700 388 -1693 -1588 -245 67 -2438 -2007 513 -911 -2133 -917 232 -257
1444 -257 -1619 -506 1726 223 202 1316 1575 1672 577 1117 1893 367 92 710 315 246 -115 -378 -187
1463 -187 -1296 -724 -594 -1570 -769 -561 -1075 -362 -315 71 534 42 1025 1095 120 820 619 569 1091 210 741
1484 741 932 -719 -45 -557 -746 -732 -1740 -1087 -672 -1221 -790 -970 -500 159 -924 -417 560 -72 321
1503 321 389 787 1846 220 600 1885 1000 -4 410 894 595 -885 -606 823 -492 -1577 -230
1520 -230 -180 -249 -1716 -668 987 -460 -981 914 983 231 -291 947 2051 29 123 1842 908 -185
1538 -185 257 786 202 -1171 -503 116 -1256 -1660 -599 -945 -1628 -1749 -350 -134 -1773 -813 1240 -83
1556 -83 -506 467 1584 996 -335 1556 2831 178 106 1653 1483 -210 -1182 892 1023 -1697 -1505 721
1574 721 -612 -2194 -1560 311 -79 -2482 -820 1388 -429 -1290 768 1797 882 -665 1554 2390
1590 2390 -36 133 1942 1532 -124 -129 773 736 -1752 -458 608 -1266 -2090 -1001 -46 -1359 -2321 -107
1608 -107 429 -1780 -911 733 397 -528 -301 1993 1350 -691 1023 2540 788 93 828 2048 241
1625 241 -1104 900 1461 -1190 -1148 395 296 -1490 -2028 502 296 -1958 -664 699 227 -1045 -275
1642 -275 1754 521 -795 1189 1596 265 135 930 1216 -137 -903 884 254 -1229 -268 -25 -703
1659 -703 -1333 -1089 427 -759 -1923 -66 122 -850 -593 192 968 -312 -533 1676 865 -421 589
1676 589 1434 392 -21 80 1397 152 -1132 293 617 -289 -618 -341 645 -745 -1252 300 309 -471
1694 -471 -269 534 806 -111 -171 1062 480 -261 829 584 374 179 -350 375 -278 -902 195 -573 -802
1713 -802 -405 -676 -215 -761 -815 -174 -465 -225 355 -176 272 184 124 1087 91 124 1009 96 404 485 46 469
1735 469 -211 6 493 -132 -298 51 -332 -100 -463 -779 163 -303 -115 38 -127 468 333 -50 895 827
1755 827 137 455 265 869 436 -246 718 528 -225 -96 -334 203 -847 -1052 124 -163 -1326 -361 -393
1774 -393 -311 -746 -557 908 172 -576 371 649 171 267 425 1040 218 -147 821 407 -475 250 128 296
1794 296 -705 -587 502 -527 -1091 -93 30 -673 -751 -230 359 -329 -651 718 460 -396 165 758 1123
1813 1123 -42 393 1662 371 -384 619 975 102 -577 14 1017 -768 -1308 311 52 -902 -889 24
1831 24 298 -962 -896 741 -215 -958 -44 571 412 -735 -107 1119 -93 -457 787 486 -211 -655 298
1850 298 677 -894 -653 758 -206 -966 -497 275 -449 -1307 -193 793 -392 -670 437 606 27 -424
1868 -424 969 973 -508 95 1210 399 -494 -67 1006 592 -923 -125 1251 -271 -748 64 544 -47
1886 -47 -1101 534 804 -990 -674 711 -77 -469 -365 603 512 -511 71 795 -140 -503 -5 398 -159
1905 -159 -830 282 643 -799 -616 179 180 -465 -592 545 369 -747 -33 750 -2 -208 94 570 296
1924 296 -564 492 590 -462 -16 385 237 44 -170 374 -83 -986 -96 247 -78 -444 -716 481 -42
1943 -42 -889 118 481 -232 48 429 489 412 -47 621 727 -271 414 248 109 -156 -489 50 -8 -819 -171
1964 -171 -48 -552 -193 -335 -363 -116 -695 -76 169 -333 118 318 561 477 132 572 422 -32 299 197 179
1985 179 273 6 403 -16 -313 110 -268 -423 -182 -542 -120 -339 -465 58 -161 -141 256 -32 411 32 -112
2006 -112 765 298 193 45 393 633 365 -164 524 204 -269 -215 -73 -66 -404 -872 -500 -150 -844 -331 -53
2027 -53 -246 -71 -410 474 36 -234 435 622 349 -105 23 529 414 -16 334 406 -226 -189 170 71 -51
2048 -51 -383 248 -4 -665 -145 99 -206 -648 -359 270 328 -575 338 569 -271 -9 64 519 94 -433 699
2069 699 542 -445 115 312 79 -419 -289 621 165 -1010 -49 230 -325 -407 -6 311 -105 -482 769 181
2089 181 -334 -191 68 396 -305 59 613 49 -526 201 209 7 -442 -132 582 -253 -716 501 162 -262
2109 -262 -79 227 341 -337 -541 756 90 -531 373 262 124 -599 -152 642 -366 -616 237 394 -492
2128 -492 -292 191 193 -644 -485 848 280 -619 -177 284 59 -393 -22 625 51 -380 661 698 15 -233
2148 -233 382 424 -518 -287 382 -13 -744 -214 154 -124 -587 24 339 -257 -354 267 90 -172 -278 223 448
2169 448 -46 -72 780 448 -81 204 249 243 -385 78 649 -236 -523 141 207 -32 -511 -250 183 -637 -561 -63
2191 -63 63 -273 -294 45 182 -235 -162 332 232 114 201 38 299 -158 -47 498 -344 -152 -16 217 -313
2212 -313 -396 8 214 -415 -232 144 -350 -293 -248 -41 246 -493 -36 378 -6 26 -9 172 59 18 285 273
2234 273 158 31 99 -36 206 -165 -242 188 -397 25 119 -271 -235 -207 35 110 -162 -214 274 31 -133 -205 199
2257 199 303 -106 -154 232 -284 -47 -244 -103 87 -171 -108 256 -151 -265 -30 -30 4 -321 141 -59 -66 21 -154
2280 -154 -167 30 -38 134 423 -293 44 307 -142 35 186 88 227 -301 230 544 -172 -112 317 275 5 -98
2302 -98 422 499 -228 -148 166 98 15 -77 248 336 -278 -45 372 -306 65 -30 26 69 -447 -16 155 -388 -193
2325 -193 123 93 115 -344 282 481 -322 139 575 163 -40 204 530 21 -87 16 371 -238 -51 56 211
2346 211 -224 -489 -83 123 -430 -127 299 -196 1 -154 184 -79 -348 235 402 -131 -175 385 207 96
2366 96 -261 450 389 -323 6 411 221 -43 -135 242 24 -411 61 75 -228 -336 -145 126 -293 -384 65 247
2388 247 -287 114 188 247 165 -156 633 157 -397 46 221 97 -322 101 477 -157 -664 324 120 -223 -296
2409 -296 -97 224 -156 -171 223 257 -577 24 65 160 -315 -14 386 -105 -220 348 374 -60 -96 136 259 -127
2431 -127 -118 328 48 -212 163 138 83 -388 -60 155 -41 -448 4 81 41 -14 124 401 -55 -240 423 42
2453 42 37 16 -53 165 -129 -115 482 79 -145 264 169 -118 -54 -243 235 90 -36 114 -93 148 263 18 627
2476 627 -81 -158 34 34 -181 -204 83 -91 -250 179 -23 -272 -70 143 156 84 -246 -137 184 -80 -2 98
2498 98 58 14 127 61 -115 -26 -136 -29 -196 7 62 -227 121 -338 -353 -181 -235 -157 218 -84 44 -227 158
2521 158 53 208 89 336 -88 178 223 -53 429 -13 -116 50 23 -123 -6 -79 4 -18 -282 115 -107 -175
2543 -175 -76 -200 250 -129 -155 353 222 -260 27 115 1 85 13 371 -113 -62 550 117 3 396 -230 277
2565 277 -123 -315 92 -21 -221 -110 -94 -226 -339 0 201 -1 -36 160 257 59 38 108 95 -96 -67 294
2587 294 183 86 80 275 123 -67 -16 94 -213 -324 -16 91 -146 -382 -130 91 -152 -282 49 6 -212 -114
2609 -114 13 120 -168 -67 554 -321 13 156 233 163 -426 93 245 -206 -84 116 195 -187 -135 219 396
2630 396 -239 131 335 -219 44 147 211 141 -120 -180 661 -305 -191 -106 84 -166 -52 35 -69 -195 147 93
2652 93 -22 11 137 250 157 -422 83 576 147 -42 -30 306 -40 -233 75 154 -73 6 141 -27 -209 -174
2674 -174 243 -66 -392 -92 233 147 -35 153 -38 121 -225 274 221 -100 244 343 62 -2 -181 245 -99
2695 -99 -86 25 -74 215 25 -106 109 164 -84 151 -45 -186 -247 -20 -57 55 -196 85 72 -116 141 -108
2717 -108 132 69 -186 259 250 -79 2 -50 24 156 -50 270 -38 -156 27 172 -4 -31 -384 49 -290 -404
2739 -404 281 -125 -17 183 126 -1 -134 -212 101 -23 -312 64 35 -95 65 65 -219 228 -12 -93 176 -19
2761 -19 -30 -13 26 45 -286 -106 -272 -516 -105 -46 159 43 77 44 -83 -87 -75 -134 116 125 -247 163 223 -157 -82
2786 -82 -55 173 48 -6 25 -200 -198 110 -96 56 115 5 -32 -152 -315 241 19 -42 -64 46 215 67 -199
2809 -199 131 71 -55 268 -33 88 -157 -99 171 -35 -155 58 -116 -23 -231 104 271 93 0 18 38 -232
2831 -232 -63 -19 2 70 -242 43 -69 -9 33 241 -70 -183 -19 167 123 221 207 9 -147 -84 217 -166 -4
2854 -4 -155 38 -9 -346 210 12 -192 -115 -90 371 93 -316 141 55 -263 -89 108 337 40 -94 418 -7
2876 -7 -43 86 -116 -139 3 53 185 95 184 104 -141 -220 -93 56 102 -48 90 209 52 -174 -106 -48 6 3 -120
2901 -120 -112 -148 249 -12 -148 -133 19 -313 -195 -95 -151 160 14 17 301 -65 128 -52 22 139 125 101 173 3
2925 3 148 -114 -144 180 -275 -227 81 -57 -44 -13 -113 -50 -192 -125 76 40 54 -16 -48 131 134 24 142 24 78
2950 78 336 -127 -122 -90 280 207 -157 -214 53 -215 -366 238 -118 -199 -52 113 -133 -269 -38 236 -254 -150
2972 -150 -28 -130 186 -168 -74 165 -40 -36 86 218 61 -300 168 -32 -326 30 -18 39 34 -99 -24 248 -26
2995 -26 35 114 132 50 -278 -10 191 -94 117 208 -30 190 -46 -143 166 -422 36 95 -30 55 -110 215 -200
3018 -200 -141 64 -83 70 72 121 -49 10 -176 -57 -124 -55 -271 108 0 287 -240 -126 -83 126 107 9 -64 -48
3042 -48 -258 -147 255 14 -24 -182 167 -173 78 15 8 32 67 234 11 -243 -6 37 138 9 153 34 -196
3065 -196 81 -244 -43 -47 113 20 45 -168 135 133 22 248 -151 71 -29 -118 47 118 -349 231 8 -139 169
3088 169 13 61 211 -457 70 -11 -107 13 -277 7 -28 -138 67 314 -168 98 -128 204 111 -172 -20 -279
3110 -279 3 -94 157 4 60 -268 203 119 -258 74 -45 83 -150 -70 26 -71 -163 183 223 -109 9 21 -107
3133 -107 181 -101 150 127 -207 -228 359 98 -87 -172 156 41 -86 -94 3 134 -37 216 65 -74 -36 56 -264
3156 -264 -11 -31 -98 48 285 147 75 81 100 58 177 20 -45 78 311 -72 17 39 65 -62 -101 -97 -138 190 -63
3181 -63 -111 130 -217 2 -69 -133 -35 -53 97 152 -226 53 0 98 308 93 264 179 59 307 124 -67 -25 59
3205 59 -82 164 -107 107 229 -34 77 -81 137 11 -115 178 -17 -76 399 -35 -25 -51 97 138 -87 -37
3227 -37 98 -22 176 50 28 -7 -93 -215 78 -116 -236 133 179 5 172 37 16 31 18 22 -183 -89 121 121
3251 121 249 163 36 91 0 -60 172 -90 -25 -24 -113 220 69 81 171 114 139 -109 -107 0 -96 182 -53 134 70
3276 70 150 -175 39 -49 133 83 -187 163 108 32 -200 131 -200 77 -291 -163 162 -2 125 359 -125 -95
3298 -95 -25 -62 201 -202 -202 79 -44 273 121 -1 126 88 -57 131 82 75 -280 97 -117 -261 -197 7 -10 -42
3322 -42 154 -25 -191 -30 106 91 124 -360 -14 87 6 -240 -20 -153 152 163 89 66 -196 -251 -76 -234 -322
3345 -322 71 133 -106 -68 54 -232 6 -211 -51 -14 -100 112 59 167 -90 184 4 111 88 -41 24 -61 280
3368 280 111 97 -46 -62 -85 139 24 -161 -302 4 -231 100 -435 -136 -160 204 116 -78 83 54 -70 100
3390 100 -112 0 245 151 220 79 111 200 159 -173 -69 -76 -53 281 -143 -26 -71 -226 -52 -149 -11 127 -58
3413 -58 -13 -83 120 289 -37 -246 159 -141 -46 289 176 224 -103 60 64 -36 156 -117 -2 -14 110 295 -124
3436 -124 67 187 -46 49 45 96 -255 -8 54 -10 -235 -78 61 64 8 68 13 237 27 -256 73 -106 -291 124
3460 124 -52 249 43 -77 74 108 -16 -77 87 162 149 -189 -259 159 -27 197 -27 -17 0 -164 88 175 -122
3483 -122 178 100 -175 8 -34 180 74 -125 -48 289 31 -132 14 -112 52 53 245 97 -31 247 63 -109
3505 -109 127 70 163 136 -183 74 -24 -162 -56 75 169 -31 -112 137 -56 -216 -69 144 301 78 -13 142
3527 142 164 100 -45 141 -105 4 -9 14 216 -29 216 7 -63 -20 -313 -42 40 47 21 134 -158 -1 -45 120
3551 120 -112 -22 -199 141 16 -46 35 -77 215 -15 161 18 52 -29 -92 140 194 -172 -147 137 -374 114 486
3574 486 2 -128 146 83 251 -169 193 205 -131 -133 -207 -134 173 -32 204 -198 211 27 188 -94 -192 11
3596 11 59 -41 -82 -14 -214 -154 207 27 -323 -124 -60 59 -36 -39 -220 -105 -87 16 -129 -93 65 -223 -48 56
3620 56 82 38 146 158 66 -388 199 82 -229 -103 -134 -52 98 -64 -297 111 25 84 -137 71 -53 -106 -117 -108
3644 -108 -64 12 324 87 187 -180 120 -245 5 138 -98 133 19 59 -244 231 16 117 96 -256 -32
3665 -32 230 -3 -103 -175 87 120 17 71 -50 -90 128 33 210 -158 -1 102 -235 145 151 -120 243 69 52
3688 52 -228 86 26 66 -83 34 75 -14 58 113 -16 189 -220 -78 -278 -143 124 -170 -164 -37 21 -97 7
3711 7 -169 61 -109 221 -76 -213 -173 111 -101 -10 -63 -35 76 -64 -110 -104 -311 -151 148 146 -307 195 -164 -2
3735 -2 -85 -34 -6 -96 -33 68 -21 -79 -20 -211 -54 145 -224 -85 -79 9 -19 49 58 76 13 183 -48 110 -36 -285
3761 -285 -93 -10 65 -87 206 132 -94 164 96 26 207 -95 -86 48 198 -28 -25 89 193 123 29 233 -10 294
3785 294 -54 -221 37 105 -153 -114 -48 27 46 -82 10 -92 -97 -35 40 182 -155 74 34 -197 -90 -140 -29 27
3809 27 -36 -93 33 135 -196 89 -61 -377 -105 -26 -127 170 -5 160 -58 -109 -238 139 21 -114 -91 -29
3831 -29 250 -186 88 143 -85 169 21 -61 -99 -344 -94 -85 65 6 0 121 -83 162 -43 -7 -108 -210 131
3854 131 -24 126 -245 -248 -79 -223 6 197 104 15 73 -27 -132 25 -247 -3 -75 47 129 155 -53 -95 -48
3877 -48 36 34 452 -77 198 21 -110 70 -123 -10 -215 85 -109 -36 54 10 -165 -130 38 182 -118 -35 333
3900 333 328 128 92 -32 91 16 71 145 -93 -64 -90 -105 60 -27 90 98 77 68 -64 -184 -38 80 39 -249 223
3925 223 272 -84 140 216 5 -53 20 -140 -65 -22 139 -82 -34 -1 27 11 45 61 82 -122 -41 -206 114 -220 380
3950 380 79 160 266 101 -50 58 -85 -104 -389 227 -175 -72 -33 92 -47 -69 -295 -189 15 1 25 15
3972 15 -126 -95 133 -172 39 -107 138 -236 186 36 -61 5 260 73 265 -2 -108 202 -214 183 -22
3993 -22 -4 247 208 47 10 91 -236 64 67 68 35 -124 -68 -160 -35 -81 82 119 60 -90 100 80 271 -10 43 78
4019 78 75 -139 224 -92 -10 74 18 110 -191 74 180 -293 158 10 81 -123 -17 -146 133 83 270 -28 -137
4042 -137 -33 151 -180 -100 190 11 -40 -73 -246 -76 126 -50 13 132 116 -78 -135 -150 -133 -183 7 -5 -33 135
4066 135 75 -113 212 -98 87 145 24 -47 -88 14 -119 -106 -51 130 -11 -6 -111 -154 -156 -75 -201 -168 -107 -113 -22 -77
4092 -77 65 179 105 -63 -198 29 346 87 -3 306 -12 -6 -53 142 -183 -94 -141 118 32 162 -80 -100 -132 -150
4116 -150 -259 115 52 -275 -55 70 50 -45 -15 -82 47 1 -25 -4 214 134 101 -166 46 -106 -283 53 -90
4139 -90 73 -106 -9 -37 39 76 112 154 -73 15 137 19 30 143 -367 -27 -17 55 191 -91 -62 -145 18 276
4163 276 34 -142 234 160 3 74 0 -142 14 -65 12 -288 135 30 -279 -51 105 58 -120 33 -38 -349
4185 -349 -41 -193 39 21 17 40 81 -232 -12 86 340 196 235 -60 150 -179 -64 172 -20 42 -30 78 176
4208 176 -45 112 207 0 8 60 105 -31 127 -196 -143 -171 150 208 -14 -218 -197 -139 -200 124 -161 -132 54 55 208
4233 208 -125 -56 165 -193 12 111 38 -47 162 -26 -35 109 24 -276 -126 -65 -170 -31 122 81 87 -23 170 11
4257 11 -32 22 130 125 11 276 -126 -69 -170 -123 -141 -348 -361 91 38 -9 -88 -99 2 -3 81 -18 74 -84 132 120
4283 120 -249 168 78 117 -168 13 -93 205 83 105 169 -149 30 224 -200 -19 -172 -140 59 -125 -92 -119
4305 -119 51 28 285 -220 203 203 81 -84 -64 178 119 -352 23 42 -21 -107 -142 2 68 -147 274 -59 -163
4328 -163 -191 50 -107 -71 99 104 -61 159 -49 86 -238 -18 195 31 219 17 28 121 166 -88 19 127
4350 127 110 176 272 279 36 154 -73 -140 160 226 -87 67 -61 42 140 44 101 110 -143 128 -61 5 104 -96 130
4375 130 -189 -114 -116 -105 -317 -101 -179 84 181 378 -390 58 -25 -68 -87 183 64 -84 153 87 -100 14 -24 -107
4399 -107 76 -118 59 113 -200 215 235 131 -151 30 145 -235 -83 -48 125 -8 -149 -111 -18 -118 -179 -153
4421 -153 95 -39 -54 126 185 -104 134 56 -35 -159 -106 -77 130 -208 42 -196 46 -145 -51 -32 -162 -192 61
4444 61 161 55 -34 175 279 -48 -103 -329 -50 262 -216 -103 123 -135 11 70 111 -134 85 371 243 73
4466 73 -56 228 65 -102 -76 -49 54 -164 -318 -19 75 -283 -36 -113 -59 70 14 196 -135 -54 71 -73 147
4489 147 -247 2 197 203 -120 -155 167 -200 -39 122 78 42 -321 -78 89 -87 -39 -82 80 94 97 175 -58 -5
4513 -5 79 -127 74 -230 16 -5 162 -14 9 -87 79 -200 6 -11 -63 8 75 6 -241 14 -10 -29 11 -93 -13
4538 -13 50 -64 86 -47 -160 34 133 87 60 145 106 -34 -20 61 79 -213 14 147 132 -33 -110 -42 6 -92 18
4563 18 -92 5 68 -205 43 53 -223 195 226 112 2 139 191 -74 44 69 69 -133 -4 19 37 44 183 99 -28
4588 -28 116 -83 22 181 -135 -35 294 -66 26 -68 140 27 -88 19 -89 32 46 167 201 81 -55 -70
4610 -70 50 -48 45 -241 -164 49 -177 66 18 129 -27 -115 89 115 -127 93 148 63 -118 180 39 43 46 37 45 -68
4636 -68 37 -102 33 152 48 -78 40 -52 145 -93 -64 175 -92 135 -196 63 15 -29 124 -90 -122 54
4658 54 -168 34 -103 60 -94 -146 -196 -66 68 -72 25 121 -95 -283 -13 -332 -11 -221 -149 -40 -46 -23 23
4681 23 220 47 79 -156 -115 95 -240 -176 222 -76 -4 -62 30 -27 -153 219 183 53 -97 11 112 15 -27 54
4705 54 -37 -132 -111 -199 42 -76 89 11 203 84 -104 -5 215 -211 -75 -38 -23 62 3 -33 -120 -79 -221 -68 63
4730 63 36 -97 -6 -65 -167 -37 -242 10 -29 18 130 -35 -91 213 -181 115 -278 352 68 -44 62 212
4752 212 249 34 66 34 -250 271 -17 -223 -137 -217 -9 60 54 56 -73 -268 21 142 -38 257 115 14 77 -59
4776 -59 -15 169 306 -57 143 -53 203 10 -180 -114 -30 -223 187 75 -80 -130 31 97 -37 -149 44 15
4798 15 -101 97 -23 -66 -9 121 -77 189 -42 8 87 -39 -139 -168 245 -66 66 -175 185 128 17 -348
4820 -348 -179 35 -102 -45 -126 -33 -49 -48 -51 149 -115 121 -18 -11 -138 -46 -336 -12 95 -136 5 27 -75 61
4844 61 102 132 218 150 141 174 49 -28 -69 66 121 -207 -191 -121 -22 -17 245 1 -24 152 2 -33 -142 -98 -122 276 149
4871 149 -69 -63 69 97 -193 62 76 -265 -167 35 -4 -111 -24 102 92 -27 21 33 -194 37 40 55 -136 -85 -189
4896 -189 4 -51 -93 -155 -22 147 128 199 -138 115 -70 86 74 -240 77 92 -128 -126 104 0 -21 187 -32
4919 -32 144 -192 -163 168 7 198 103 -154 127 140 -28 96 104 64 25 22 133 -257 0 -231 -317 146 11 -66
4943 -66 -76 -188 -30 -158 90 201 133 -247 -128 21 -200 -37 -60 -198 82 19 -32 74 22 232 69 -175
4965 -175 -230 43 93 3 223 -15 -264 220 94 181 -186 37 204 -141 166 71 5 193 -76 -213 287 -70
4987 -70 20 -32 -73 -90 -131 -206 12 143 -25 70 -6 125 156 -12 -60 -76 19 127 -70 -33 133 -119 -37 68 -193
5012 -193 -68 89 -154 70 -109 -102 -168 -60 95 -355 83 -251 -257 51 -75 -177 -16 -217 -80 -27 -62 47
5034 47 143 -38 -75 -147 236 -246 93 -111 -135 183 152 276 -16 189 -11 51 0 -100 -109 -219 4 22 293 31
5058 31 2 -112 -19 212 157 230 -192 90 163 394 -49 275 -35 116 136 144 -78 -33 78 -40 -125 126 -92 -72
5082 -72 38 -128 -27 -208 15 -90 -106 -88 -44 135 -179 142 -60 9 119 95 130 -193 178 -57 -19 70 43
5105 43 28 -190 63 -100 -257 -143 -42 -190 -284 -131 -169 -197 39 226 117 47 -92 -81 -98 -82 -67 0 127 138
5129 138 -7 97 -86 19 -3 -274 -134 -53 56 100 -6 -121 13 -106 3 12 156 -190 69 -280 -170 120
5151 120 -131 16 -131 51 -336 -32 57 154 -64 -1 -259 7 3 34 -105 -90 196 155 -183 38 241 -83 45
5174 45 -93 -11 -71 138 -224 52 191 46 144 -11 -166 27 -71 293 45 -145 164 -96 324 -115 -123 257
5196 257 -384 -95 68 77 16 -26 -81 70 235 -28 46 -12 122 53 -102 -83 269 47 220 10 -137 -3 -105
5219 -105 11 -74 36 122 -58 -131 228 14 37 79 36 120 -193 6 145 -289 100 15 -218 5 -292 88 59
5242 59 -25 142 162 -48 63 38 132 22 -45 -17 -119 -187 -113 -155 -247 62 -341 124 165 -246 48 153 -21 32
5266 32 12 259 68 33 -40 177 99 -50 -149 47 -167 -200 294 -122 194 112 114 -19 -107 -208 -199 207 -72 -200
5290 -200 288 -110 -80 108 33 -23 185 -11 -235 -314 -8 33 -26 -88 -103 164 -28 -175 16 192 22 -45 -73
5313 -73 -63 -59 70 107 -132 -3 -66 103 29 212 -37 -56 100 61 74 -57 82 221 -84 33 1 21 3 -190
5337 -190 -97 -79 -193 -170 8 83 188 176 -21 -4 -111 -124 29 -275 4 -123 167 158 -269 -49 116 202 239 -180
5361 -180 -53 -178 197 179 281 -34 -66 132 24 55 -112 2 -23 -26 127 35 268 -64 54 -112 335 -342
5383 -342 -137 260 124 -6 -144 -47 -28 166 250 342 -220 98 55 -174 115 9 -22 234 90 -156 -9 -178
5405 -178 77 -81 -101 58 -190 4 -89 54 -33 -116 50 -43 157 98 391 209 -83 260 313 -64 266 80
5427 80 71 -166 17 -197 -19 -274 -137 -8 61 144 6 141 -346 -7 9 128 -175 -14 3 155 -208 -11
5449 -11 -29 -252 -24 -105 -86 -159 144 -176 -28 86 229 21 44 16 88 47 86 -95 33 -74 -63 -95 -85 -107 -63
5474 -63 -243 -4 -112 37 141 -113 8 56 -72 259 -86 124 68 228 135 -39 123 -97 131 -54 132
5495 132 -70 104 57 -121 100 -117 126 -92 -104 -153 41 -12 -40 115 44 -380 154 -74 86 188 61 -233
5517 -233 87 -12 -187 -126 -1 -112 10 172 -121 -21 -2 79 127 -42 201 -89 243 12 -108 -228 -104 -123
5539 -123 -120 210 155 223 -174 -78 66 150 112 290 32 52 -57 18 -327 -124 -65 166 58 -16 20 -274 9 -87
5563 -87 6 -121 122 -186 5 291 57 -101 -120 132 -124 26 -89 -361 85 -6 -210 -4 -178 -14 -44 -54
5585 -54 48 301 -85 110 -111 -22 -46 108 -261 97 45 -70 -77 193 264 77 14 2 -112 -19 -9 40 0 123
5609 123 16 -317 131 -141 138 200 -67 188 144 27 -8 151 83 86 229 232 2 337 -160 114 24 -193 -76
5632 -76 -170 129 17 -115 -5 139 -69 -55 -189 -13 -27 29 -262 -51 -50 61 141 -69 76 -223 2 210 -101
5655 -101 52 153 -131 144 295 -185 -55 -46 47 -29 -54 50 -8 128 -73 -289 -212 -236 40 -85 -121 77 -96
5678 -96 -344 -111 146 -131 107 -236 121 94 111 5 -68 23 224 47 -137 179 -149 142 87 55 2 -101 -125
5701 -125 47 18 83 -262 119 -58 -139 109 19 33 -31 39 71 1 -63 -65 61 -116 79 -15 0 19 118 35 39 19 76
5728 76 40 0 24 148 -28 3 27 101 115 -127 -9 108 24 -86 151 236 27 -8 106 -7 -65 96 4 103 -5
5753 -5 -43 -78 -134 248 -26 -23 169 -323 163 164 32 -169 352 -84 -52 58 65 -68 -110 -96 -123 -159 63 122 -76 162
5779 162 97 61 12 122 26 -309 104 234 -1 -27 -44 454 -115 70 -90 85 -22 112 -63 5 -115 80
5801 80 149 -364 38 14 26 92 -187 -69 169 122 -163 161 -4 25 116 -220 2 165 49 -21 163 29 42
5824 42 -1 77 155 -323 -193 190 -84 -90 26 -11 -31 -7 -131 118 11 223 233 -19 -158 119 -96 58 -30 17
5848 17 55 -207 80 -23 34 115 158 205 -40 37 -7 168 -75 -179 -135 -5 114 -85 16 -67 -43 21 -23 68 119
5873 119 -193 154 0 300 9 159 62 260 -57 18 78 -76 -74 -11 -132 109 -216 155 -32 -287 -112 -50
5895 -50 34 29 -29 -149 -75 306 3 -135 14 220 47 -18 131 -234 83 -78 20 -246 310 -186 55 125 57
5918 57 -221 -113 117 -200 259 -29 -57 83 -24 -309 -113 -2 -44 -102 -185 -11 -138 -16 -234 -204 -68 -178
5940 -178 143 -20 -183 132 -221 64 51 -226 -253 -86 87 106 -116 -15 -56 -88 81 0 -75 22 94 -103 -6
5963 -6 -53 43 -58 -14 100 -58 -261 76 47 -5 -153 -55 123 211 312 39 -30 167 -38 223 61 -73 -164 28
5987 28 -87 65 -37 -308 -96 -40 -198 -82 32 92 317 -101 -87 101 27 207 156 -134 -99 -101 -252 17 119
6010 119 40 -112 167 -177 -76 57 2 -1 -138 -42 24 -17 42 -14 -250 185 87 83 44 -189 -76 55 146 -67 -16
6035 -16 159 -64 262 73 -108 -143 37 260 -94 18 -217 197 -120 -8 -94 -129 -25 -27 -10 194 -64 59
6057 59 -19 77 -185 -103 220 102 75 -6 52 168 62 -86 -156 -192 97 11 -20 -129 102 -109 109 -61 -117 219
6081 219 168 113 225 -74 -58 63 204 -136 74 60 -32 -193 117 62 134 -76 -14 -103 124 94 165 319 163 41
6105 41 -24 334 218 -58 127 102 124 -330 -78 -36 -172 54 -196 -42 110 -26 84 188 -75 78 172 -14
6127 -14 -283 117 421 -14 -244 -78 23 109 42 -13 -69 225 271 -79 -74 -128 -116 94 61 -201 -55 -35 29 42 -136
6152 -136 -136 50 -48 96 226 -65 -57 23 83 -131 10 40 -117 39 -100 -18 55 -34 -88 -16 142 52 -78 29 4
6177 4 -100 -41 -12 28 153 226 172 -1 -97 -132 -153 -188 -34 271 50 -201 50 290 75 -117 -412 64 -177 -17
6201 -17 -109 154 -269 -140 197 -28 -303 52 86 -93 76 -32 -90 188 -91 -19 -295 10 64 -143 -44 -54 131
6224 131 200 60 -123 48 95 48 175 -86 266 -158 240 -53 -39 132 52 62 -79 73 -18 -62 -6 74 -108
6247 -108 29 28 -6 59 132 -90 201 90 208 -147 44 -51 136 148 -26 -162 -5 -207 139 32 -19 99 -3
6270 -3 -210 36 29 -212 -52 -68 124 -87 125 -141 52 41 -6 55 43 -22 96 -133 123 339 -126 39 40 121
6294 121 -121 -170 202 10 40 -30 125 40 71 48 203 -55 131 -220 152 60 131 34 -137 74 -258 15 -204
6317 -204 68 -193 -65 108 -57 -255 -5 12 148 -182 105 116 223 -109 -22 -33 75 89 -160 178 -75 42
6339 42 -37 305 28 -38 -3 216 263 194 -18 -180 -48 -349 87 210 44 83 -10 186 86 -130 -36 -168 -8
6362 -8 -50 -42 -78 24 23 -128 -55 -53 -102 102 -122 10 115 -105 -132 -30 106 -123 3 -112 5 91 35 -13 47 -201
6388 -201 84 -130 134 110 117 -44 -152 -74 -9 86 1 -30 36 60 251 74 45 144 -74 -10 70 8 134 126 179 174 156
6415 156 79 -146 -73 137 34 -124 -19 126 -40 -234 103 61 102 23 7 36 -1 263 -139 56 -19 -58 33 -137
6439 -137 -352 -260 139 298 109 -194 -119 36 123 -115 133 106 243 -169 -149 133 -694 129 76 112 7 -3 -180
6462 -180 86 71 -129 44 -120 -28 -120 29 7 -137 105 106 -91 100 120 139 -139 48 -30 285 79 139 76 -149
6486 -149 -143 31 -110 -28 -11 168 39 -56 157 51 246 115 -36 206 46 199 171 170 39 -7 21 83 28 -29
6510 -29 -83 -79 -89 52 -80 -118 -240 -286 0 -5 80 -90 -220 1 228 125 -186 23 89 -76 -50 209 163 147 128
6535 128 -19 114 115 -65 -29 -14 149 -24 -329 -222 59 69 -111 -210 -49 -216 -28 -119 -12 114 -67 73
6557 73 9 -29 -50 -290 -147 -110 -153 191 240 93 -52 -164 -219 150 -156 93 -127 -185 -320 160 47 124 71 -231
6581 -231 34 241 -28 44 -52 -27 -163 -50 92 -9 33 -99 -38 -159 19 108 -347 -171 72 -269 43 79
6603 79 8 -49 -236 -203 0 -3 -310 164 60 262 361 120 -49 18 75 -62 46 126 -2 -100 191 -175 45 197
6627 197 292 -237 -43 -9 -178 -81 -180 -24 -84 -18 139 146 109 28 164 -100 -130 -180 135 88 0 -103 -96 30 -147
6652 -147 75 -93 -7 245 8 197 -67 -208 75 12 86 -109 -122 -114 39 199 66 147 93 62 266 94 -3
6675 -3 86 -54 -114 -211 -5 70 73 -28 18 81 -159 72 -90 37 -135 -205 -15 -53 63 51 -53 49 103 -157 -101
6700 -101 13 -66 -61 -46 -101 85 -199 -125 64 71 -30 -14 56 -48 100 34 -162 197 -96 -210 16 -26 -227 109
6724 109 163 281 -163 -31 96 -54 -213 -175 -45 -147 -134 -174 127 -241 -71 -249 32 182 99 -155 178 -150
6746 -150 192 244 152 -36 -21 75 -122 -49 -149 -156 12 -7 -97 209 158 28 272 -69 -15 173 -102 -34 -61 391
6770 391 64 -191 -154 -51 39 127 64 92 29 -86 217 66 110 52 56 -352 64 131 22 -23 -65 -101 -9 42 102 -88
6796 -88 249 190 108 -102 -65 41 -105 89 6 51 -120 124 175 26 67 31 -133 165 -226 -50 222 -34 -137
6819 -137 -23 -104 -134 -57 64 67 -63 -138 105 -68 -7 -60 207 127 -113 149 -25 45 31 22 -75 -124 -106 -80 -99 -34
6845 -34 5 121 92 -27 70 92 -305 -102 20 -155 -195 151 -127 -183 30 -33 -185 211 -48 22 45 91 -75 -51
6869 -51 -242 -60 198 73 248 -188 201 316 266 -9 -52 39 76 171 -46 -85 100 324 98 93 -57 111 135
6892 135 81 -72 -91 -179 -127 62 -11 -148 220 244 34 142 -89 -24 83 92 -106 92 16 111 276 -188 -68 219
6916 219 -141 83 -238 28 -96 -39 -165 -222 -15 77 -36 -14 144 -43 44 -117 -313 60 128 120 219 40 2
6939 2 176 -28 136 79 329 13 48 139 -35 67 -46 17 225 -69 -65 64 0 30 94 -227 -114 -187 -121 -173 -155
6964 -155 -84 -113 43 -263 -12 5 -170 309 -89 -113 -58 11 19 148 72 -10 -135 -49 97 -305 85 -79 8 -132
6988 -132 115 -236 162 -50 -55 146 117 80 147 16 14 87 -166 -3 -282 106 -116 29 -227 -29 271 -113 157
7011 157 61 23 12 47 111 -190 -41 102 24 58 -182 -14 -64 222 26 83 -70 -192 -122 85 38 82 175 42
7035 42 -8 -163 -100 -19 -31 -21 198 -60 162 23 -450 -187 111 -214 118 -159 42 -301 -81 -218 52 -141
7057 -141 119 101 9 319 -208 -262 35 192 63 181 213 114 139 102 -20 55 9 -132 -121 -116 117 64 -33 145 -375
7082 -375 -10 -251 243 37 -135 82 -202 -95 179 -71 -62 101 34 13 -67 217 -33 116 -35 86 -25 -72
7104 -72 57 -104 114 121 -48 124 -65 81 79 -41 -174 9 -63 -101 -161 -32 67 -144 156 -179 116 -361 110
7127 110 200 38 -88 -40 -66 305 -112 106 -86 -108 59 59 -21 -90 172 -126 -119 223 -79 89 -30 -257 -7
7150 -7 -159 -187 61 -155 18 53 16 -15 -8 7 178 -51 79 -123 -197 242 -13 40 14 52 0 -59 -12 -21 -155 121
7176 121 95 83 64 41 27 -82 -167 189 -137 -148 150 -270 -219 321 157 -53 79 -92 198 277 284 -245 46 -29
7200 -29 -205 192 182 105 98 -3 -10 151 86 -100 -139 -247 -103 26 -208 -69 3 -141 22 -143 -60 -135 -88 -32 -135
7225 -135 59 35 185 -310 -70 -5 81 308 -24 8 277 -236 82 161 90 -243 -225 -241 -29 204 -104 48 -126
7248 -126 41 -64 147 258 100 18 -86 -102 43 262 138 -62 191 -33 120 57 -69 162 194 175 203 -5
7270 -5 41 72 -75 -243 63 244 -191 46 251 22 55 -7 -99 67 -127 -253 -12 -68 -203 76 84 206 155 -290
7294 -290 -117 111 -156 -147 -59 217 164 133 -160 110 73 -176 109 -175 -97 120 -47 210 -74 272 135 -272
7316 -272 -208 174 -267 28 -144 -60 74 157 62 -75 140 13 9 66 170 -51 109 83 -154 -114 -71 11 -104 25
7340 25 238 -12 54 143 -66 -49 -32 -202 4 141 -89 -45 19 52 -156 -73 93 168 -63 -197 -339 -187 -66
7363 -66 -126 -114 13 -76 125 90 -152 -199 -90 -163 -279 -168 -97 182 102 148 -86 52 -90 -153 -69 -18 -441 -87
7387 -87 -156 -40 38 64 -116 -128 -19 174 205 -43 91 105 111 87 -45 7 -296 -105 -40 107 -122 -126 70 -27 14
7412 14 72 109 5 112 -85 136 71 49 -178 -148 155 -7 103 -117 102 130 -9 174 -50 53 115 186 -107
7435 -107 46 -17 -243 78 156 303 -175 -221 56 -130 -37 -132 36 -3 -61 14 233 2 20 410 -121 14 40
7458 40 -72 -107 -84 -64 -118 -66 8 -103 -321 -115 125 12 -54 68 100 70 286 -98 251 43 155 -32 -178
7481 -178 162 85 -90 -138 108 -65 117 82 -95 -39 -138 -197 36 16 -33 -306 -79 -68 -229 164 -95 150 163
7504 163 -82 65 -122 90 -162 -72 4 1 -64 -109 -80 103 -96 -103 69 151 77 109 65 -140 -100 193 7 -231 -58
7529 -58 59 -32 109 110 34 -117 -27 -134 -165 -140 -20 -140 91 17 155 -99 17 -94 -75 -140 -207 -12 167 -87
7553 -87 -51 231 -103 73 -299 -64 86 -209 -76 -180 143 319 -100 208 -92 70 15 -122 -144 66 -46
7574 -46 -45 90 225 0 -127 -163 -72 138 -47 168 -46 -150 214 -156 163 59 -137 97 7 -239 235 -190
7596 -190 -20 1 -102 104 -91 149 60 -188 -229 167 69 -29 63 -78 -29 76 -62 119 -40 -46 55 -42 -176
7619 -176 -5 -70 -61 -33 36 -33 78 113 -276 201 -26 4 62 -62 -75 -20 232 -199 125 138 -69 -124 -10 22 -86
7644 -86 132 -16 157 202 49 20 123 25 33 42 -256 113 -177 -60 -2 100 -217 -58 -60 -71 47 -172 66 -249
7668 -249 4 -141 206 -196 127 -112 14 -164 135 137 -25 -261 86 -53 -11 271 10 89 14 20 -175 27
7690 27 80 355 227 138 -113 -37 -93 -62 58 271 -53 59 -23 94 -105 145 -117 12 93 -135 -28 -85 -70
7713 -70 -317 -1 197 109 -51 -194 -60 145 -144 217 231 264 118 38 -70 -20 -224 -70 -75 50 12 128 203
7736 203 -10 -19 125 117 74 107 -153 -89 -188 145 52 112 133 -9 -406 230 -3 -201 -7 -47 -100 53 -148 -12
7760 -12 -119 -123 -283 95 77 -304 -19 23 107 -134 131 -55 169 -74 -47 -52 14 107 -69 -42 166 -29 -121 -114 173
7785 173 10 7 -32 27 40 -42 -30 4 54 -72 -141 161 200 -272 10 53 -18 47 -4 4 -110 210 149 177 145 -94 -104
7812 -104 276 -7 7 -90 -51 -1 -191 -134 -75 -48 -149 -22 -245 35 57 64 128 -21 -69 -260 -165 187 -309 -87
7836 -87 249 312 81 -23 -60 115 63 93 -243 77 92 -89 38 -264 50 58 -10 -181 194 -115 -294 170 -13
7859 -13 145 53 -113 -64 218 202 26 14 8 131 86 -18 -48 74 21 -11 -40 -78 177 -4 159 -87 194 26
7883 26 -245 85 -228 28 98 8 100 25 -24 -25 32 -216 -105 166 132 18 -40 -53 -284 227 -196 120 83 81 43
7908 43 184 69 -151 52 120 159 42 93 4 287 -18 202 -109 -183 95 -49 162 69 30 55 -245 -173 273
7931 273 -143 -231 11 -90 364 -49 0 96 -145 -14 -186 110 -27 99 -42 51 116 -8 55 -175 -70 -88
7953 -88 65 161 66 129 -22 48 0 214 27 25 -1 10 165 24 6 -50 -53 -245 8 55 -83 110 129 -160 48
7978 48 178 207 153 146 59 24 -60 -60 103 25 -5 214 122 90 189 -7 182 -32 -266 -5 66 27 -52 112 81 -216
8004 -216 1 49 -47 6 -76 -94 -90 -196 24 -37 -28 -105 -26 -249 -35 132 -27 -4 -23 -21 167 13 -89 -4 -43 -29
8030 -29 -138 144 129 -164 -180 140 -257 106 107 -146 -66 64 -74 -92 225 -95 -214 -70 -219 -187 106 -20 -73
8053 -73 -111 27 -251 122 177 -31 -20 113 -171 -172 -246 -81 -229 -367 115 -62 289 -49 -147 -33 158 66 -36
8076 -36 266 158 49 -163 -116 -45 -152 -207 122 207 -164 -48 -222 63 167 -39 -6 -19 -118 -156 -193 -111 21 -151
8100 -151 -45 8 -19 84 22 -242 55 41 -22 -118 -154 -42 -7 -275 148 -170 136 123 -309 -75 223 -31 13
8123 13 115 120 121 -185 -12 -199 -60 37 -16 173 55 -163 -14 -90 117 -276 -3 6 20 -20 98 311 -54 95
8147 95 -92 -61 -78 -202 -79 -31 -37 78 114 -61 15 39 10 83 -71 31 -190 -127 -291 23 -17 -94 124 300 167
8172 167 103 -150 -119 -67 -279 -262 51 -75 -41 107 15 -189 -432 -59 -295 -276 101 151 31
8191C1
$$ Imaginary data points
##PAGE= N=2
##DATA TABLE= (X++(I..I)), XYDATA
0 0 0 0 0 0 0 0 0 0 0 0 0 0 0 0 0 -5 8 -8 8 -8 8 -8 16 -16 16 -24 24 -32 32 -40 45 -49 56 -64 72 -81 91 -103
38 -103 115 -128 141 -158 174 -193 213 -235 259 -285 315 -348 383 -421 465 -513 567 -629 699 -781
58 -781 874 -988 1124 -1294 1512 -1798 2200 -2799 3795 -5731 10901 -53658 -133862 -8853
72 -8853 28276 -17117 -2159 111509 152268 80495 65926 131682 94111 6042 -6848 32181
84 32181 24306 -24786 -7708 46331 13561 -30045 -22895 -28613 -64009 -89932 -74098 -46881 -51660
97 -51660 -22804 28232 30558 28610 46978 46164 19603 -3248 19694 33056 -975 11434 59350
110 59350 51067 10922 -1053 16560 -13252 -89214 -85735 -38592 -62672 -93184 -51023 7262
122 7262 -6081 -50502 -14268 27986 -19827 -50019 -3206 39280 26095 12843 67645 106203
134 106203 61450 38081 60780 52432 9088 -17365 4101 17043 -11053 -9105 15542 6498
146 6498 -12526 -25271 -28862 -34214 -48540 -40433 -26038 -19264 7122 22391 20208 30158 33657 26289
160 26289 9674 869 18362 17289 -452 14824 33813 26846 4527 -6490 4285 -16620 -55697
173 -55697 -48059 -27626 -33020 -41514 -28009 4184 3077 -22321 -10120 6871 -6135 -19524 -11586
186 -11586 17088 25062 10110 24793 44672 33739 14315 2316 8109 2332 -25058 -24368 -6948
199 -6948 -6448 -12604 -19430 -8920 -1737 -25691 -35267 -20062 -13345 -17638 -21108 3033 29415 17134
213 17134 12006 32150 35805 19699 5032 16107 30616 11336 4235 24423 26963 12448 373
226 373 2687 4504 -17858 -27076 -14644 -15649 -16861 -11728 -6811 1233 19 -200 1509 -3874 4009
241 4009 8195 -1793 7664 22589 21184 11519 8630 22808 15408 -14732 -10536 6086 -7895 -27504
255 -27504 -20640 3204 -5638 -35931 -20357 3651 -17948 -37442 -19131 7817 -3817 -24826
267 -24826 4999 32074 7973 -4398 18038 31494 10837 -7125 18241 31558 3077 -2431
279 -2431 17232 16392 -5437 -14985 853 -1799 -26050 -18706 -4316 -13139 -17270 -8864 -1640 -8579
293 -8579 -13506 3046 3539 -10369 3755 18016 8612 2354 14790 27348 7949 -8949 14426
306 14426 18868 -11108 -13987 9769 12472 -17223 -22836 10454 4455 -32580 -22897 6638 -906
319 -906 -26498 -14062 23205 12731 -16156 6213 30687 12109 -8205 7537 31456 13255
331 13255 -6744 18714 31906 7474 -3636 8801 12856 -8918 -19831 -467 -1310 -17942 -10130
344 -10130 835 -3366 -11206 -8152 -65 -11359 -16676 732 1079 -8695 1931 14787 10559 -3200
358 -3200 2849 17044 -2922 -20166 -951 7519 -10488 -18458 2102 13791 -13345 -23231 3176
371 3176 1559 -25247 -24901 80 7214 -14174 -9422 23423 19393 -4133 2942 20357 14444 -6641
385 -6641 -783 23145 14920 136 13212 22880 12941 -2413 -2236 5492 -7720 -16723 -6115 -3149
399 -3149 -5199 -3502 -451 2712 -2401 -5081 -2832 -9628 -8151 316 -1432 316 7304 13301 10939
414 10939 -317 3370 8084 -8103 -15490 -5834 -721 -6605 -11913 914 9826 -7568 -13764 -2860
428 -2860 -3555 -13875 -17915 -3244 8876 -293 2203 19007 20224 11022 5622 10909 14848 2217
442 2217 339 12125 14433 11226 7590 9407 12211 -226 -11591 -10142 -10227 -13088 -17576 -14130 -765
457 -765 -2332 -9469 -3977 -47 -3658 -12339 -13325 -150 -144 -6158 4236 13685 13365 5968 2812 9231
473 9231 1703 -11561 -8300 -4290 -5507 -6840 -5081 2266 362 -7526 -6158 -8369 -10780 -9651 -11001
488 -11001 -4900 2551 6447 11174 10809 14338 18282 8317 3284 9135 9884 5464 1531 11145 19554
503 19554 5970 -777 9159 5340 -11283 -19034 -8294 -2261 -18230 -17228 4706 5502 -8389 -7551
517 -7551 6311 5974 -13154 -10463 10101 6959 -3750 6024 20948 17571 2249 5253 14954 657
531 657 -11521 -3972 187 -5639 -9369 -1573 3796 -6864 -9455 -3316 -9897 -15339 -11605 -7029 -6409
546 -6409 -6856 3882 10839 1179 2592 12213 5678 -5158 -3095 7888 4319 -8776 2414 16625
560 16625 2945 -7959 641 7180 -7970 -22399 -6871 5097 -11832 -14316 6183 12759 -1429
573 -1429 -7571 10262 13888 -7500 -6024 13356 12955 512 4293 20456 17851 -487 3228 12915
587 12915 742 -9551 -4861 2061 -3232 -10140 -689 4268 -7164 -7410 -1846 -5596 -10933 -8922
601 -8922 -1240 -2504 -7214 4612 10015 -43 -126 7250 6156 -5513 -7624 5971 4372 -9791
615 -9791 -2174 10077 2724 -9145 -5147 6399 -3426 -17736 -5126 6621 -3714 -9217 3398
628 3398 14075 3502 -6028 8338 13299 -1375 -3520 7753 11913 2513 -1010 11339 11610 -1875
642 -1875 -1656 3228 -151 -7643 -8704 -1961 -3203 -8712 -3278 -1032 -4994 -4642 -4026 -3832 -5393 -5081
658 -5081 548 -1587 -2846 5085 5627 1337 1458 4660 5219 -2631 -3977 5523 1843 -5387 -1435 4110
674 4110 2274 -5709 -4476 4246 -1327 -9374 -3020 3244 874 -3918 -41 9216 4354 -1839 4293
689 4293 7738 4310 318 2119 8339 5047 -285 3742 5032 2609 -878 -2855 864 -543 -6242
704 -6242 -4161 -2112 -1926 -3592 -6343 -1578 220 -4779 -4195 -1085 470 -905 -3644 1221 4575 -647
720 -647 -769 2734 3457 1205 -2341 1547 3371 -1941 -1839 414 -14 -490 -2989 -1294 667 -2205 -1786
737 -1786 -755 -2102 852 -419 -1617 589 1291 2070 167 -605 5319 3243 -1731 1475 4353 2243
753 2243 -2831 -1411 6057 1427 -5819 375 4875 -185 -5743 -2381 4982 -1736 -8738 391 4776
768 4776 -2825 -5532 897 6261 -1769 -6838 3538 4519 -3945 -3159 2743 4217 -1797 -3013 5602
783 5602 3381 -3466 -195 2489 318 -2786 -780 3976 376 -1864 4210 2665 -2076 167 2523
798 2523 562 -3670 -443 5489 -671 -3587 4404 4926 -2091 -3868 2627 4113 -6344 -6376 5415
813 5415 2638 -6474 -2511 5669 3378 -7577 -4666 6426 -937 -9419 -1570 5845 787 -6552 305
828 305 8365 -1508 -7325 1946 3821 -3448 -6052 1521 5221 -2745 -3219 5476 2773 -3409 -2020 1930
844 1930 376 -4450 -1124 4887 -451 -1587 4176 3359 -912 -1359 2369 1701 -4815 -1138 5949 546
860 546 -2669 3184 6003 587 -4984 1640 5144 -4763 -5947 3516 3948 -3032 -3434 5327 5214 -5936
876 -5936 -4039 4804 485 -6508 -3213 4788 3059 -5114 364 7467 487 -4431 -102 2945 -635
891 -635 -4956 801 5644 -687 -1412 3398 2484 -1310 -3130 -227 -265 -4548 -1710 1024 -1716 -1367 689
908 689 382 -1739 -3510 -208 -1120 -5439 -1346 2243 29 -696 1428 4865 1520 -2874 2193 3807
924 3807 -1710 -1769 2509 4457 1043 -1680 4557 4535 -2500 -2407 982 267 -2937 -4245 1516 2408 -2780
941 -2780 -520 2409 1360 -1464 -2647 644 1307 -2376 -135 2603 2177 1905 555 1726 2543 -1130
957 -1130 -1738 -1155 -1248 -569 -2599 -1906 1117 -1411 -2672 -1682 -2088 -1998 -4815 -3460 229 -1005 -1289 891
975 891 2209 3119 569 747 3718 1605 736 2480 2498 3445 2753 1923 3648 1851 873 453 -1858 -494
993 -494 -810 -3013 -1653 -466 -71 -1010 -2851 239 755 -3697 -2671 377 618 -1408 -1853 3513 4234
1010 4234 -1420 -270 3477 1210 -2712 -3107 1759 1367 -4960 -1883 2992 -554 -4088 -2511 1014
1025 1014 -1474 -6550 -2059 1717 -1886 -2276 1351 3236 1514 -1075 2861 3777 -774 1067 3324
1040 3324 2222 1215 1634 3891 2249 -1406 1906 1868 -2925 -1897 278 -187 -2829 -2492 2472 517
1056 517 -4489 -152 2515 -1343 -3732 -139 4211 -161 -3549 3633 5395 -1201 -2243 2288 3920
1071 3920 -2645 -4357 2960 2050 -4707 -2868 2422 1083 -4433 -3643 2762 -167 -6191 -1076 2437
1086 2437 -238 -2399 630 4651 647 -2087 3295 3532 -1008 -200 2353 1896 -768 -345 3473 349
1102 349 -3037 599 887 -2772 -3426 -412 1044 -3433 -3424 2724 768 -3606 -544 2686 1248 -2878
1118 -2878 -71 5373 1145 -2584 3146 5068 909 -2226 1695 4714 -2014 -4395 1875 1961 -3701
1133 -3701 -3977 533 1656 -4100 -4143 1871 159 -4085 -1479 1716 1309 -1747 314 4296 1185 -287
1149 -287 2946 3285 1329 334 1749 2714 -551 -515 1973 -660 -1844 -610 -692 -1665 -3395 -1685 -125
1166 -125 -3692 -2878 459 -390 -1850 -1025 1680 2137 -1230 609 4194 1377 -264 1858 3747 2551
1182 2551 -984 1438 3519 -493 -2197 261 537 -1642 -3507 -1763 149 -2997 -3242 -700 -959 -1697
1198 -1697 -2168 -356 999 -970 -358 1814 1410 1900 1727 1718 3135 1427 1196 1756 610 1081 318 -847
1216 -847 467 -471 -1537 -1230 -1728 -919 -1532 -3028 -946 -871 -1648 -669 -381 965 1219 100 1925 1820
1234 1820 1242 1736 1196 1743 2265 762 1575 1322 389 733 -988 -855 -98 -1899 -1897 -1466 -1309 -1070 -2866
1253 -2866 -1514 848 -1552 -2170 171 954 376 -1228 974 3087 -9 -413 2413 2139 369 -1059
1269 -1059 1153 1999 -1636 -1944 1493 198 -1905 -1749 43 257 -2944 -1827 1345 -701 -1964 159
1285 159 1445 1269 -185 1364 3436 613 443 2548 1306 462 211 1816 1489 -1179 155 1605
1301 1605 -1482 -2050 -698 -242 -2102 -3297 -158 713 -3003 -1363 1581 571 -1926 -910 2185 1300
1317 1300 -2679 542 3472 389 -1436 976 2947 -281 -3203 144 2335 -2489 -3149 558 892
1332 892 -2264 -2575 1021 1346 -2903 -1251 2012 647 -1135 163 3202 2364 -517 2283 3733 926
1348 926 385 1868 2030 -28 -856 1745 1040 -2279 -780 771 -1469 -3223 -1815 217 -2113 -4274
1364 -4274 135 1071 -2203 -1726 1210 1764 -1157 -1302 2789 2185 -1521 525 3209 1660 -1031 68
1380 68 2989 357 -3245 -404 1352 -1698 -3193 -1411 761 -1655 -3175 408 626 -1845 -866 897
1396 897 1336 -225 -248 3022 2276 375 2249 2717 1438 559 1153 1822 198 -939 1260 173 -1872
1413 -1872 -909 -395 -1094 -2609 -1978 -194 -1725 -2755 -336 273 -821 -931 713 2210 -181 -668 2651
1430 2651 2230 -168 668 2178 2237 -124 -493 1928 239 -1746 -772 -95 -642 -2332 -1805 186 -979
1447 -979 -2123 -604 -277 -767 -773 -460 1023 371 -75 1713 1323 1091 1211 994 1286 662 121 776 -33
1466 -33 -124 267 -837 -511 -567 -1160 -1001 -1040 -1000 -295 -1402 -263 219 -132 639 368 723 1254 302 968 1202
1487 1202 492 852 519 277 1226 33 -292 -26 -648 -462 -1214 -1671 -498 -1040 -1606 -1007 -632 -111 -725
1506 -725 -1082 851 306 -538 576 991 1261 233 69 1933 957 -772 514 789 -191 -971 -806 848
1524 848 -794 -2010 -164 83 -1142 -1296 -345 477 -644 -916 1284 747 21 1118 1317 1434 423
1541 423 739 2166 444 -304 1140 817 -540 -463 -11 31 -1753 -1636 -140 -1433 -2242 -1079 -263 -646
1559 -646 -1897 -578 1374 -598 -1194 1473 1397 161 -229 1417 2593 -539 -195 2179 1196 -702 -503
1576 -503 1019 237 -2286 -1218 956 -848 -2468 -327 13 -750 -2013 -216 1314 -924 -969 1524
1592 1524 1074 168 464 1914 1993 -248 749 2433 816 -433 603 1024 148 -1480 -145 553 -2128
1609 -2128 -1798 -41 -597 -2007 -1638 -71 -183 -2245 -669 1351 -369 -1115 631 1689 429 -670
1625 -670 1134 2555 -414 -301 1478 1446 -546 -1057 803 827 -1572 -1015 707 -496 -1564 -682 -104
1642 -104 -200 -1658 -38 1083 -737 -523 730 960 218 -360 1272 1684 -597 383 1610 666 -76 152
1660 152 980 93 -1524 69 476 -1285 -1209 -421 -380 -1180 -1481 242 116 -1689 -553 418 141 -388 -45
1679 -45 1335 824 -876 621 1404 -33 -170 588 835 -4 -773 487 643 -750 -625 66 104 -626 -672
1698 -672 743 153 -823 143 619 237 404 210 948 572 28 824 359 153 381 318 68 -336 -686 -8
1718 -8 -452 -584 -115 -511 -716 -529 -549 -181 -401 -396 310 -198 -171 432 -134 475 522 188 845 84 91 403 -245
1741 -245 219 7 -540 -1 -238 -578 -326 -410 -274 -298 -570 -69 -123 -462 235 54 280 409 -167 812 935
1762 935 260 604 705 743 438 -253 614 580 -493 -85 186 -500 -421 -902 12 -281 -1300 -293 211 -532
1782 -532 -534 -280 405 56 -665 551 785 105 325 723 604 172 71 1046 301 -540 303 511 -675 -718
1802 -718 -375 259 -511 -1366 246 -255 -1243 -550 -76 -227 -808 -620 991 7 -643 629 1234 178 -99
1821 -99 349 1712 103 -349 1142 1106 -326 -330 372 538 -531 -1188 1002 -91 -1125 -331 421 -120 -1023
1840 -1023 -692 888 -80 -1140 551 555 -381 -225 461 1031 -79 -359 892 563 -495 83 618 121
1858 121 -1029 -535 797 -491 -1326 40 -1 -853 -1057 -33 601 -893 -906 1080 333 -814 -82 664
1876 664 767 -830 -188 1676 43 -726 884 591 -153 -657 107 1119 -665 -855 564 467 -407 -183
1894 -183 324 508 -629 -480 1077 104 -637 187 667 240 -489 217 1046 -477 -588 591 581 -349 -451
1913 -451 149 0 -743 -556 555 -447 -591 -221 188 62 -870 40 643 -152 -326 732 659 28 -119
1932 -119 416 846 -360 -22 712 82 -320 -372 59 48 -719 -220 181 -518 -503 142 -13 52 -321 232 608
1953 608 -277 124 471 195 176 -18 256 512 -297 130 500 -250 -154 -302 -247 -101 -926 -160 -302 -1028 -562
1974 -562 -306 -558 -323 -317 43 355 -404 185 210 91 227 187 222 784 23 366 589 34 157 -15 5 235
1996 235 -554 -56 296 -529 -333 -361 -314 -211 -622 -206 194 -67 60 -69 7 242 1 197 687 226 234 608
2018 608 425 372 -223 -9 645 -220 -309 206 -66 -622 -393 -184 108 -512 -673 324 -73 250 -190 -185 193
2039 193 -468 -13 610 -217 30 387 400 578 -156 244 559 -538 -90 427 -94 -84 -7 211 -139 -820 -35
2060 -35 478 -534 -481 263 74 -317 -576 467 516 -380 -61 649 209 -105 -227 534 537 -792 121 600 -115
2081 -115 -294 100 247 -175 -676 303 538 -356 -89 66 42 -436 -528 430 278 -583 105 541 78 157 62
2102 62 462 -9 -792 531 840 -486 -311 130 232 -239 -416 476 140 -410 155 559 -203 -421 91 731
2122 731 196 -297 440 519 -474 -54 185 603 -383 -355 397 381 -865 -86 355 -281 -419 -125 229 -151 -814
2143 -814 423 516 -236 -115 188 577 -251 -310 366 278 -492 -105 197 148 -297 -134 382 -134 -835 210 205
2164 205 -306 -379 51 50 -362 -428 232 -115 -533 218 393 215 -104 -111 762 203 -63 417 602 -88 -333 62
2186 62 575 -260 -474 234 55 -515 -49 -55 91 -293 -312 101 -182 -136 21 65 219 -141 67 625 21 -209
2208 -209 452 373 259 -26 116 287 -84 -101 519 -13 -179 123 -170 44 -120 -191 561 -218 -321 64 -263
2229 -263 51 -44 211 367 -24 -4 201 -249 131 220 117 -118 -77 -31 422 -31 -126 149 -265 430 -36 -78
2251 -78 171 -244 -114 -133 -35 128 -24 -120 401 -140 -221 -121 -303 59 -150 -253 115 -134 -103 216 -67 0
2273 0 -346 -180 263 -175 -201 113 128 194 -67 -130 406 -28 -199 284 -139 -237 43 120 388 -139 -206 95 -133
2296 -133 -230 -67 155 -129 -206 -78 210 -484 -287 259 86 34 10 30 58 -36 -30 391 8 -388 213 331 80
2319 80 -166 -207 315 -376 -170 115 -36 -148 -364 -4 171 -477 -167 125 -204 -190 42 338 -19 -323 -24
2340 -24 494 -310 -364 491 145 141 -366 -43 334 -400 -137 171 -70 -105 -78 269 37 -326 -20 288 -335 -224
2362 -224 141 -9 -40 -349 335 411 -227 54 554 265 35 121 169 219 -252 219 367 -326 -290 90 355 99
2384 99 -761 329 231 -464 -297 573 -105 -309 -293 269 -176 -282 100 390 -294 11 220 420 84 -403 455
2405 455 317 -382 -123 276 14 195 -202 164 49 -391 236 -95 -87 -202 89 148 -43 -518 -47 277 -328
2426 -328 -141 -35 139 -94 -207 430 280 -242 -6 230 113 -116 -166 362 -11 -300 372 340 -121 -74 91
2447 91 108 -86 -326 194 69 -191 4 -35 -200 -259 -245 113 67 -235 224 -87 59 -23 -141 50 190 -204
2469 -204 155 81 -2 133 151 86 108 -162 320 -140 -127 273 -10 21 -252 -147 120 -7 -15 213 -262 -256 -99 -67
2493 -67 -108 -76 -127 52 248 192 318 50 99 122 -47 253 181 -32 94 -108 226 -30 -177 -70 -148 -158 -236 97
2517 97 -134 21 -357 -26 -140 -233 -201 -148 130 -97 -382 224 164 -56 146 333 74 60 129 146 -8 -228 54
2540 54 143 14 -100 -94 30 -100 -241 -15 -133 -466 147 -188 115 -307 -71 266 92 87 269 99 -48 322
2562 322 58 108 128 -283 395 159 -288 -64 174 171 -162 -186 90 -148 -565 -62 -316 -78 -102 -26 232 -33
2584 -33 -405 270 -240 -160 -49 76 141 -54 26 404 -7 -281 302 265 58 71 -174 638 1 -350 154 176
2606 176 -217 68 -424 -161 -350 -269 57 -21 -274 -297 247 315 -132 -78 303 -159 -256 -11 -58 -21 10 167 253
2629 253 -377 46 214 115 -124 275 17 22 -117 -128 186 -108 -54 160 147 -144 -483 110 492 -156 -125 41
2651 41 -45 -274 -95 -159 94 -204 -344 185 -235 -227 93 15 91 -242 190 358 -185 -17 310 179 -16 26 108
2674 108 236 -225 -63 126 -321 -266 -78 -91 96 -379 -117 19 -171 -297 -47 -148 307 42 -191 112 -221
2695 -221 177 107 66 127 357 231 197 -180 116 -97 -292 -64 212 148 -167 -296 106 -237 -258 -122 182 -236
2717 -236 -74 -47 123 102 -126 140 138 -84 123 108 -92 51 -133 317 318 -68 -61 -41 -53 -37 69 25 162 -309
2741 -309 132 55 -186 -10 -174 -241 -174 -134 94 165 31 -8 -272 -179 288 24 181 137 15 157 213 118 44 -159
2765 -159 159 -132 154 -45 18 -113 -94 -112 -254 -114 -249 7 -124 -133 172 -282 101 117 -213 -319 -39 13
2787 13 92 137 103 170 -33 -18 141 -257 214 -97 -117 114 33 -41 -77 70 40 -32 172 -12 -213 149 122 -216
2811 -216 202 -36 -230 -385 -170 210 389 -231 -46 148 -69 47 -171 285 -310 191 304 196 -90 77
2831 77 293 60 125 -80 90 147 155 120 215 120 -408 38 53 103 -31 -91 321 -149 110 115 242 -61 -261 365
2855 365 179 91 273 63 87 -62 2 218 -255 -108 140 136 -3 66 -33 -257 -257 -281 105 -196 -38 189 76
2878 76 -134 139 -219 -62 150 -146 204 158 -272 -48 246 -88 54 15 39 -131 -473 178 132 163 51 -43
2900 -43 91 -98 18 -18 -25 24 61 156 -15 -228 -278 146 35 -47 -99 47 108 -13 -76 61 -71 -242 161 270
2924 270 76 89 249 255 -131 3 257 -140 98 139 223 17 -163 40 -54 -60 84 46 -8 -178 92 -20 -9 -48
2948 -48 13 164 31 -136 157 98 391 56 -120 105 344 -65 38 135 200 136 -29 210 -246 -126 -62 -217
2970 -217 -441 -144 -214 65 9 -75 227 -199 -31 21 97 66 -373 -161 183 43 -5 235 146 65 -232 -109 111
2993 111 -70 -180 256 273 198 -93 -165 60 -75 17 -40 104 93 49 -77 154 -31 30 103 59 238 294 198 58
3017 58 71 -5 84 -52 -5 103 -100 -14 -95 -156 -137 -4 -126 -502 -72 -183 275 -169 -105 -102 49 2 -54 -20 92
3042 92 -173 4 -4 -61 40 -107 98 275 3 -23 178 26 -18 -194 42 210 -118 115 -1 -191 370 -238
3064 -238 -76 -101 33 14 -200 67 -253 -201 -16 -3 -131 -192 10 17 -83 71 -52 71 -36 152 110 117 -81
3087 -81 149 -68 -48 -61 157 260 -154 -138 -44 72 -15 169 -142 24 -249 -120 274 -307 -155 20 -104 -128
3109 -128 62 -57 165 15 -102 -44 334 -241 -45 30 203 -37 -6 -135 -132 132 8 204 -51 180 60 -5
3131 -5 -13 215 0 165 42 -92 -162 100 -261 -47 130 169 66 102 75 -55 -29 -68 68 42 -18 49 -252 145
3155 145 -133 15 -43 -97 26 -76 -142 189 -181 130 82 -158 -148 -19 172 31 -99 80 88 -369 88 -6 136
3178 136 90 -110 326 150 -50 -20 179 192 38 -39 -12 -16 -254 -23 56 -68 -307 132 -108 67 -152 19 366
3201 366 -78 -26 51 -183 -208 17 -97 -76 -82 447 15 -151 75 16 -16 106 -161 36 -44 -13 213 41 -168
3224 -168 -103 125 -137 117 -103 135 42 -67 -9 20 245 130 -119 183 175 -15 -15 51 102 -295 9 47 231 36
3248 36 -45 -82 196 70 -105 90 295 6 161 -119 -18 137 144 218 -29 -162 19 -76 -292 -23 -203 11
3270 11 -73 169 89 98 -151 -51 58 -44 342 6 123 -4 -231 108 -23 -49 63 -54 -20 -31 -215 84 -235
3293 -235 42 444 -7 -259 51 -187 195 -45 -88 157 -36 -47 164 10 134 145 -48 233 137 -89 91
3314 91 -151 -24 -6 -148 -235 -10 44 -52 -318 217 6 -231 123 160 191 19 -178 -133 251 -106 140 -81 -125
3337 -125 -210 123 -185 -216 -17 125 239 -147 -148 -43 6 321 131 254 -40 5 52 -36 -99 -43 -162 71 -79
3360 -79 45 147 -146 -110 165 271 -61 -149 -111 50 187 -91 -45 -64 183 91 -29 38 59 293 -87 -17 152
3383 152 -57 -296 -117 -109 -1 -97 -139 -18 21 78 -26 53 100 -16 8 111 -215 -15 -187 227 196 340 -349
3406 -349 142 -30 -120 1 19 -242 82 114 34 77 23 283 204 -40 39 212 -54 -39 -119 152 322 78 -135
3429 -135 7 9 190 48 -90 26 262 62 -61 -4 -286 191 227 260 11 124 4 -256 -342 95 -113 92
3451 92 -322 -156 -298 65 197 126 -188 -33 18 -139 91 16 6 156 -40 -91 -65 94 -35 47 178 63 388
3474 388 -59 158 7 37 -96 -75 87 264 8 54 -117 -72 -11 -18 51 78 -88 -253 -278 -161 -353 -198 99
3497 99 -87 -291 -114 -338 8 -9 -36 38 -349 15 241 -166 162 356 172 -7 -37 61 -181 338 -144 83
3519 83 -9 -84 -109 -188 36 24 -313 56 -64 -382 21 -75 -24 -106 -90 10 11 -13 -58 -24 -36 -133 -140 -120 85 125 -45
3546 -45 -36 -281 14 88 1 83 19 110 5 -127 -74 -77 159 160 110 -13 49 62 78 36 -18 48 -181 87 -52 5 217
3573 217 -303 80 -177 31 127 60 -104 -97 -290 -274 -30 -80 -197 -194 -43 -160 -156 -163 127 96 118 157 121 231 10
3598 10 351 82 -256 110 -178 -33 -51 -140 31 103 72 -26 -123 82 -16 -126 -87 109 -13 193 30 -125 -85
3621 -85 63 -200 -57 -17 -205 -11 -13 149 21 31 36 -13 255 -9 -37 136 81 -156 92 -88 -124 378 -158 33
3645 33 -154 -64 -128 268 -145 -182 81 147 -33 31 222 196 -6 57 -138 -258 11 -84 117 81 133 -18 287 -18
3669 -18 -196 38 23 169 -325 -8 -8 -282 -199 22 4 62 -17 22 -193 227 -58 63 68 -254 -142 206 31 -159
3693 -159 -61 -6 -44 99 -170 136 -66 48 4 -63 202 -6 10 77 -197 -185 -171 58 -33 -117 -129 -104 -16 -33 -142
3718 -142 -143 -54 98 46 159 108 224 92 37 152 199 8 356 77 57 -28 115 -16 -22 118 48 15 152 -319
3742 -319 -5 -191 -101 153 -10 -384 -24 78 -300 107 -79 101 -264 44 -98 186 -19 -197 45 73 -150
3763 -150 -102 152 -107 -88 -52 154 49 -362 -92 62 -130 6 92 184 33 -132 -294 87 -119 -111 -69 -224 7
3786 7 134 12 -44 47 74 -3 54 -108 -5 89 47 -133 132 56 -214 255 -313 -10 128 -26 -44 -75 -60 -14 311
3811 311 -57 19 19 61 -173 84 -131 -9 -160 243 -48 215 -56 135 27 159 -185 -59 -289 153 -43
3832 -43 -113 77 -201 -180 133 -45 -64 62 12 -136 23 -157 166 21 37 0 -86 118 -76 63 161 83 185
3855 185 101 -162 -158 286 -206 -65 128 -61 355 198 52 121 98 -26 148 -164 -246 -16 133 50 269 -106
3877 -106 -115 -69 227 40 -22 -76 88 -43 -60 -165 -5 -141 29 -14 100 327 -49 -146 -334 262 55 180 -120
3900 -120 -80 144 66 84 -41 -75 -160 50 279 -213 -135 83 40 -76 -105 -52 -12 6 153 -116 103 -91 -72 271
3924 271 20 294 -115 36 23 -52 54 225 -19 -292 -36 -103 -63 -52 53 -289 -144 -126 58 -126 150 67
3946 67 192 -51 -168 126 -42 -63 427 159 -134 316 -51 25 -14 -40 -111 -195 -120 -142 -132 59 134 -215 -68 99
3970 99 1 227 -117 -101 20 -144 106 -62 -53 88 -122 -96 149 53 26 -207 -48 9 -120 -77 204 49 23 36
3994 36 -70 -160 -61 -101 37 -98 29 -54 -227 16 97 242 97 -93 167 45 15 130 -51 125 256 115
4016 115 24 253 161 -159 -58 -91 5 -155 59 4 -110 9 -76 188 -14 -50 -189 -169 -197 71 13 -118 -5
4039 -5 63 116 37 -61 163 104 -13 222 174 55 170 -19 159 107 -93 341 -50 -72 143 -165 16 129 -103
4062 -103 -44 178 112 -41 -169 -70 -87 -44 102 -16 -99 56 141 59 -44 141 -51 -35 20 63 -206 22 245 -60
4086 -60 -191 -87 31 6 -215 -237 88 -175 123 -131 -185 180 -88 116 -29 27 -94 172 56 104 29 95 231
4109 231 188 -219 -90 -57 -34 -50 13 195 -361 -6 74 -18 -241 29 3 92 -54 -142 -139 137 -121 -110 -33 70 15
4134 15 -106 182 -79 -66 124 -146 -228 158 -59 -118 -168 -188 62 21 199 -22 236 182 58 -188 -140 121 20
4157 20 115 -278 -58 176 -53 202 315 162 94 94 -153 80 72 -74 -45 -25 -64 137 86 -167 -65 98 129 -130
4181 -130 -93 -90 3 208 -142 239 155 -185 62 -16 135 -200 -38 117 -89 14 -174 -186 151 -102 92 -45
4203 -45 -107 -102 173 -103 124 -30 53 42 0 33 33 -101 -5 -145 -8 -6 78 -7 -118 51 52 45 -132 -167 140 -195 146
4230 146 173 -294 103 -96 -78 290 -2 -190 185 4 333 49 139 76 -40 137 -90 24 -8 -71 111 221
4252 221 -56 -104 -152 -14 -130 -31 -219 -39 93 -229 268 -106 -184 60 -93 76 -286 -2 -112 41 -33 44
4274 44 155 -84 -198 -112 -114 292 -84 238 -344 -142 259 125 60 60 126 -178 -262 49 -57 -14 42 -42 31 -137
4298 -137 -34 -47 -75 180 225 -118 20 -185 -19 -70 -60 -118 54 30 -125 -224 -135 2 -300 124 -47 127 46
4321 46 -23 -364 -60 91 -117 91 32 -82 -151 -26 122 317 -52 177 -234 35 -5 -1 -55 4 32 -142 -87 172
4345 172 -200 -379 219 -26 132 -26 -114 -64 106 -68 -251 43 -50 -226 257 62 143 85 77 6 43 37 32 -70
4369 -70 -93 -224 -4 -145 11 198 88 181 -136 -75 -81 26 -104 -126 7 321 -218 89 -284 41 53 171 -46
4392 -46 -263 77 40 -37 141 63 -34 133 -3 109 223 16 -104 44 -280 160 201 -128 35 -69 -37 -42 157
4415 157 28 87 136 62 -236 -36 11 -48 -63 121 -89 226 93 70 56 -73 -111 -32 156 372 -9 61 135 159
4439 159 36 21 99 -36 43 -68 -52 184 201 -81 -402 137 -17 -44 -13 -345 74 6 -30 -138 -66 120 284
4462 284 22 -140 290 -8 71 -63 65 202 92 -21 92 16 -24 199 -11 74 -26 37 -73 -209 -167 -35
4484 -35 -277 8 -101 -37 93 -119 258 60 26 -44 -19 -16 95 127 -85 -74 65 187 144 11 -6 138 55 1
4508 1 -65 155 -97 -49 -145 -33 -43 -78 -251 -55 -231 -160 293 214 -18 62 -60 180 148 55 50 123 153 -1 14 94
4534 94 289 194 90 150 170 -72 144 -172 -1 -4 104 169 69 148 -40 -332 190 -70 -4 215 -172 18 1
4557 1 -99 -51 -213 -54 34 35 -12 151 152 38 96 -30 88 -94 117 197 78 -83 -159 -121 -301 -255 -10 44 -96
4582 -96 183 26 222 136 -161 -150 80 -79 -3 24 68 129 -40 -59 52 -244 173 100 -325 53 -51 166 220
4605 220 -321 39 -7 -184 -31 16 203 219 299 -115 23 -22 45 9 -249 -110 -137 -52 277 -232 36 -24 23 85
4629 85 282 -72 -56 87 172 -36 -214 158 -45 161 -143 -79 248 35 -231 70 83 71 288 -30 24 142
4651 142 144 -80 -129 -149 179 105 16 237 -139 37 3 61 -51 56 74 96 -76 -26 94 -25 -124 -162 -34 -158
4675 -158 -96 -62 65 -107 -80 10 -67 108 -77 -21 142 132 -86 -80 103 -229 -76 73 -75 -21 56 -232 3 392
4699 392 224 -12 -263 123 -87 56 -127 -8 -47 -25 93 -190 -97 15 144 138 -291 -12 88 -38 32 -23
4721 -23 117 130 -181 80 30 -140 75 -67 252 142 228 -119 223 -156 -50 -39 311 15 -136 99 23 44
4743 44 -49 193 18 -64 -132 -62 -69 -208 32 -94 -111 -143 116 49 -117 236 -252 -84 210 245 -110 -84 169 94
4767 94 84 -43 -112 62 194 165 -180 80 -41 -267 61 -35 240 -45 37 -43 -117 201 76 -71 80 349 -227
4790 -227 197 -388 68 33 -309 -26 -30 73 288 -49 95 85 -165 -36 -181 -205 3 -27 -186 -177 34 -132 129
4813 129 -4 -197 118 108 32 115 -30 128 -178 185 -100 -40 196 -71 -87 -137 -309 41 -87 -147 -89 158 123
4836 123 -100 -128 177 -178 -154 -67 -106 -51 -46 73 -59 183 -144 -50 10 53 -56 62 -161 -57 110 -379 216
4859 216 -199 65 100 290 16 5 -20 -86 66 -368 -179 51 -164 16 69 -31 110 44 -211 3 -4 128 48
4882 48 73 149 -113 145 -42 119 -212 -15 -92 52 -62 116 -194 98 -23 -81 175 120 43 -187 -103 -18 -154
4905 -154 -94 -266 15 69 -36 40 4 143 -276 10 -27 -178 29 -246 267 22 -42 -45 -27 -25 85 158 16 -7
4929 -7 97 109 -34 133 -96 -99 -16 -63 -79 265 -90 -223 -69 -178 8 112 92 27 -140 51 28 -222 -69 -22
4953 -22 -166 4 18 33 -277 89 13 -65 0 -226 -87 146 320 174 82 273 -97 66 -41 -64 -39 253 -161
4976 -161 -83 118 -95 78 -85 -78 38 47 27 19 -26 -5 50 98 -320 -8 140 -112 23 147 -53 128 85 142 -88
5001 -88 -108 -60 47 142 -66 -55 35 316 78 -68 130 49 0 -6 -78 -138 -202 51 46 162 -39 -161 65 -170 42
5026 42 -131 -7 142 93 -192 261 -13 -1 38 -75 -151 157 -155 102 76 -54 28 11 -131 -128 -15 54 41 130
5050 130 281 -129 -65 67 -99 -76 -96 31 37 116 -47 -173 17 -28 -53 137 116 147 137 -5 130 213 62 59 -302
5075 -302 124 49 -53 -111 162 121 -84 11 -105 -24 -109 86 228 -215 99 233 -68 -207 44 184 129 61 38
5098 38 -245 45 55 83 130 -271 -93 205 -148 85 200 97 -62 -146 -114 21 23 41 150 219 12 26 -133 24
5122 24 143 -260 -48 -124 55 120 -68 -68 183 44 167 -66 216 -56 23 -124 122 0 107 236 -143 123
5144 123 -74 -39 268 -5 146 -59 -124 43 -13 88 95 -91 -122 -97 -36 -228 24 294 -14 74 76 -191 -150 92
5168 92 106 170 28 153 -98 -66 88 8 39 99 101 126 20 314 -183 -131 -85 364 -6 116 -127 128 -130 -31
5192 -31 120 -204 61 52 -43 -63 -178 88 -101 -76 -197 -118 -74 34 -9 -89 103 -96 -180 90 124 -21 80 132
5216 132 105 6 95 242 -130 206 0 169 -77 59 -97 -77 242 -20 -121 19 194 -34 19 -95 -63 179
5238 179 -8 -245 -204 -94 95 -6 -8 -94 -168 76 -282 -250 -59 -161 64 -160 -88 55 -266 -24 62 -146 -170
5261 -170 -10 10 -151 280 199 -59 -90 -83 -51 -54 -11 57 109 -72 -60 -247 -227 118 -70 22 -87 -29 1 -39 151 -22
5287 -22 -210 1 -275 132 -70 167 97 183 265 47 32 147 287 11 -120 -51 -104 -151 118 193 179 -281 1
5310 1 31 -11 -99 221 -19 -212 -112 184 -183 -66 52 59 28 173 57 32 52 303 9 -227 -191 214 -128 -256
5334 -256 465 -87 49 206 192 -166 155 194 22 -3 9 -137 -212 6 -19 129 -71 -125 224 11 -67 -16 -27
5357 -27 -86 -165 77 201 101 -18 224 182 -282 -266 25 -108 -6 74 -95 25 109 -35 128 48 -229 -22 9
5380 9 -15 -158 53 89 -45 9 -161 -103 -20 138 125 194 248 79 66 141 56 73 -133 -59 -214 -11 43 22 -2 -43
5406 -43 96 225 49 146 163 -306 -45 69 -5 -178 84 18 -213 -20 -15 84 27 -73 66 162 125 -35 143 -92
5430 -92 -84 173 136 83 -88 56 -33 144 153 -112 -2 -168 206 -180 -2 -146 39 105 2 -160 -68 -8 119 32
5454 32 -23 70 -237 -9 -18 -31 -282 26 -28 -122 -26 104 -124 -73 137 201 75 163 41 -113 -46 21 32 12 -84 -212
5480 -212 -183 -46 167 -196 -69 16 -98 47 59 15 -3 18 -202 -110 -143 180 211 262 -33 3 -283 89 -155 -199
5504 -199 260 271 -266 -9 -103 -34 59 99 37 -305 240 74 -227 -121 -81 137 234 171 259 22 149 -139 27
5527 27 -50 96 -23 -213 193 -50 -139 -41 67 -87 -97 -14 -10 -9 71 40 83 10 -242 86 1 -126 -192 5 -62 13
5553 13 69 256 95 -176 -74 77 -128 -47 -64 -136 -11 5 88 34 66 175 128 -52 -205 -124 -125 -132 -163 -25 362
5578 362 46 -17 211 170 -35 159 59 -3 122 35 12 8 -83 9 62 -18 155 16 133 111 265 -68 120 -29
5602 -29 -59 -32 -69 -61 -62 -84 17 -7 -163 -102 -111 -255 -355 80 -182 154 23 -183 -227 251 -120 65 -179 -37 267
5627 267 -143 139 2 83 -167 -6 1 69 -236 193 -312 -20 24 -286 -57 105 159 38 -194 -186 159 182 -25
5650 -25 134 -65 126 211 80 -85 14 8 83 347 -117 -198 99 143 -184 -8 146 -266 -18 -48 283 -181 -139
5673 -139 84 88 -76 -103 -3 -167 59 -39 25 -175 -178 18 102 -45 -55 287 -53 73 121 62 -170 62 -106 160
5697 160 55 44 -52 173 -58 55 262 -31 -131 -93 45 -149 88 -157 -19 -3 178 -21 228 -24 -93 89
5719 89 202 159 3 -29 73 -325 127 224 -192 -193 149 -258 190 189 -2 -82 50 173 146 103 24 -77 -36 -122 -185
5744 -185 3 -170 -3 -63 -109 -266 196 322 -38 -97 -145 -183 -39 198 -24 -20 43 212 -90 80 -140 -37 -177
5767 -177 45 46 -71 -197 380 90 53 53 -67 189 203 165 -31 -252 -30 218 -334 -128 -163 159 187 107 -83
5790 -83 -241 -154 172 9 50 118 -107 30 -98 -5 -81 162 56 148 -117 -2 -126 -87 333 252 -74 -8 -205
5813 -205 209 -33 -211 -61 198 89 167 -116 -116 61 64 -10 -133 70 126 83 101 -157 34 -178 71 20 31 -26
5837 -26 -79 56 -49 -41 -96 -188 -103 24 -143 -2 -62 -185 -80 -207 -136 63 -219 58 175 -251 302 -234 60
5860 60 113 -19 -60 -44 31 161 -31 -82 103 -327 -88 108 -221 -46 32 -225 37 -99 -37 15 -133 19 -381
5883 -381 -223 -116 -1 190 85 -86 135 -238 -47 23 61 114 85 206 172 -109 -175 -116 233 -46 160 270
5905 270 -114 70 -197 82 -266 34 -274 -159 28 -203 -231 41 154 -186 -46 -41 373 71 -85 -90 -90 -185 39
5928 39 260 111 48 72 285 40 -184 23 43 19 337 -94 -134 -45 116 -40 142 -128 64 61 272 56 -118
5951 -118 -86 98 39 -47 204 227 53 -93 -333 -287 55 53 -171 -219 32 -67 -186 -41 26 214 -102 115 -33
5974 -33 -67 -3 77 140 -34 -35 -36 161 -111 -109 325 -125 151 -68 37 -40 116 -315 73 440 -80 242 0 -12
5998 -12 -129 211 -6 218 -4 -1 25 -239 -205 -110 -44 122 69 145 -257 -71 -80 -96 324 10 -5 -3 136 -8 149
6023 149 -12 -70 112 5 202 28 -165 -206 -122 76 164 -272 68 32 16 293 120 -41 54 79 175 -149 59
6046 59 -118 54 56 37 36 139 -101 -66 -84 89 -162 20 -8 190 -98 48 -88 -187 -5 153 -81 45 131 33
6070 33 -216 -324 20 312 87 81 28 -54 192 -20 -296 51 24 -31 -253 52 259 -28 170 -95 46 -79
6092 -79 -66 -305 -93 53 19 112 234 8 65 -60 62 -64 -140 155 89 137 -246 -109 -117 -101 -65 99 266 316
6116 316 10 45 96 91 57 -28 -57 112 127 -137 -145 184 106 -25 25 42 -42 -47 -2 64 100 -47 -232 -4 216 -157
6142 -157 93 -68 -251 -117 -22 -85 6 -25 -385 -118 223 117 -14 -36 -165 -14 133 0 14 -129 230 70
6164 70 97 -36 293 119 -81 -19 34 -28 105 -306 -224 -61 32 13 75 -107 -129 19 -203 41 -96 75 77 -234
6188 -234 117 -41 -56 157 174 -208 -82 -29 -35 -43 81 10 128 -41 60 -86 -155 -14 -230 144 171 213 27 81
6212 81 38 46 -110 68 -164 -130 -158 15 -7 77 -30 -25 131 27 77 33 276 154 98 -103 -41 -53 11 32 -26 193
6238 193 4 -122 100 -255 21 -10 183 -16 -121 257 -112 -238 241 175 99 165 23 -208 -108 -260 -95
6259 -95 -82 10 -53 122 -21 154 -193 -93 4 -73 -270 -86 44 -58 221 -164 123 -53 -157 113 4 -195
6281 -195 -79 26 57 -192 -3 123 -258 -97 68 -264 -280 190 -256 -66 -78 -264 -21 100 205 -191 -291
6302 -291 26 105 -250 87 52 -70 -213 60 365 97 173 -86 -282 172 -148 -76 10 2 18 119 -101 -107 -70 195
6326 195 -87 -130 0 -141 290 -31 -6 -132 75 -28 -40 174 -150 143 238 -174 -60 -222 -130 -162 -125 188
6348 188 84 64 -141 -85 2 -91 -296 -59 -66 -70 149 0 -196 160 -75 18 64 -204 -18 71 -33 -284 -177 65
6372 65 232 13 -373 159 -19 10 -276 -150 74 -29 1 27 -215 -94 -104 136 -22 84 136 -42 -75 -164 -238
6395 -238 96 100 74 -36 240 -188 -37 104 -64 90 8 188 22 -26 -51 78 -184 -92 -19 -223 10 243 -53
6418 -53 -87 -42 -177 -53 -105 333 28 -29 -166 -104 200 88 -173 5 -36 -68 -42 -41 113 240 34 51 207 55
6442 55 -89 48 -64 -108 61 106 -16 -28 -168 -116 -61 47 -29 -29 28 92 22 -189 -165 -8 97 -203 146 196 -56
6467 -56 -30 -66 -113 137 -5 -151 36 114 99 6 56 -33 154 -83 -59 76 161 -12 218 70 158 118 130 144 84
6492 84 84 -40 209 -150 -187 -19 34 -59 -134 13 134 5 50 31 127 -120 -180 -7 -194 -203 177 -83 -14 -92 -56
6517 -56 189 137 80 436 -87 -77 -97 45 208 70 -54 -110 113 319 170 -49 -33 -106 47 171 -198 -33 64
6540 64 100 -133 -163 -82 -146 -302 -111 -207 80 174 -91 -131 199 106 163 -44 -211 23 115 -150 4 174 -70 -144
6564 -144 11 -136 125 -6 -15 25 68 246 84 -110 -76 -139 146 104 -121 50 43 -119 63 98 60 2 7 -45 184
6589 184 -28 79 -245 36 121 -98 -27 -76 -89 230 88 48 -169 63 -108 -40 -156 -20 -37 -258 -145 -393
6611 -393 278 -150 166 44 296 10 -72 -209 23 -114 -45 38 102 99 -66 -20 -77 175 57 -82 -135 93 102 56
6635 56 20 -130 119 -159 40 126 186 -39 37 -42 7 32 282 -76 -109 199 44 -16 28 314 152 -175 2 -105
6659 -105 71 -94 -119 -141 140 -64 198 102 -50 -67 133 -2 -165 26 179 2 -101 -250 -47 -119 -81 96
6681 96 -137 -93 22 -33 155 76 8 -63 -17 162 -32 34 30 -50 82 389 166 186 71 -28 121 57 -21 -1 -41 33
6707 33 47 3 -6 84 -206 -89 34 -1 -61 -277 247 38 -49 242 90 244 -105 178 198 132 85 -61 2 266
6731 266 14 -161 11 -367 -5 266 -41 -66 -274 -113 -166 -7 234 66 260 -44 79 -41 -7 96 1
6752 1 -264 54 179 142 -99 -18 77 -88 161 -117 -178 48 -209 113 179 -57 250 -153 9 -42 -126 -87 51
6775 51 -207 -99 -15 63 16 124 -23 70 -38 -144 -244 -27 -36 79 221 24 153 29 -98 -45 37 170 -132
6798 -132 -24 128 -76 -84 262 -25 157 88 12 109 113 150 -227 -171 -48 -78 -76 212 -103 205 250 -36 84 25 -18
6823 -18 74 216 57 110 -127 26 -121 100 -96 -142 108 88 116 114 -96 -21 50 -12 174 154 -157 41 -345 103
6847 103 -236 -77 -34 -41 -266 -28 97 -43 -86 -312 -280 -186 -126 -104 -58 -27 -38 -135 82 -43 68 -112 -31 -100 -134
6872 -134 -183 50 -16 115 -119 -58 -56 -84 132 111 125 113 -99 69 167 61 124 141 96 75 233 -212 -72 2 -476
6897 -476 -73 -206 -102 178 296 152 -133 1 162 124 90 69 -79 146 46 -117 -99 -37 -88 9 -69 177 -162
6920 -162 17 -131 297 45 -57 93 229 198 84 -55 -19 -307 102 -180 -71 172 -209 -7 -105 -24 145
6941 145 57 7 100 -182 20 -163 51 263 39 123 -137 -261 -42 -88 -21 243 6 -154 176 -86 35 142
6963 142 -9 85 177 53 296 -298 301 293 -109 81 49 -118 18 23 137 88 -163 -122 -146 -5 23 61 146 226 -278
6988 -278 226 -63 -38 -21 -38 -10 89 145 -199 43 -104 167 -37 86 63 2 -48 221 -58 -199 110 -130 200
7011 200 60 41 146 111 -74 111 -144 51 -15 -180 86 150 -27 95 168 -28 60 -8 19 -1 124 167 127 49
7035 49 105 108 -363 65 -33 -149 -15 -113 61 66 -223 146 -21 221 123 -14 270 145 133 -21 162 105 -92 -29
7059 -29 -102 -128 66 118 132 -12 -75 -146 50 130 -246 212 149 -49 68 -73 108 202 121 54 109 110 60 -11 -162 -122
7085 -122 -56 -19 -46 -249 -13 -108 -75 26 -350 -33 -7 -36 21 -50 33 316 4 67 -28 -47 18 -29 53 343 -28
7110 -28 -265 71 -19 -72 -56 56 263 -136 -53 -68 45 -8 180 -178 -72 -183 -79 73 125 63 138 -300 -162
7133 -162 -18 -30 -170 195 60 123 -29 92 -180 91 223 -113 118 47 55 322 20 -126 45 -127 -274 224
7155 224 78 107 128 293 -65 10 -101 -147 -94 -12 -31 37 76 -94 -61 89 60 -273 -268 -43 5 -85 24 -92 -99 107
7181 107 128 106 -73 50 155 -76 -66 -1 21 -27 -54 -87 8 107 -99 -171 -129 40 33 -25 230 -142 266 -48 -31
7206 -31 -239 -15 125 -157 -260 45 -54 -335 -18 148 180 17 -99 -26 143 23 -58 125 98 -139 166 6
7228 6 -9 -122 -219 70 12 -176 108 -77 116 -211 -60 -138 -81 -145 -165 -7 34 -297 -39 32 -136 100 -158 255
7252 255 -233 169 -134 -122 3 -22 268 -136 -134 135 305 52 101 16 -20 -19 -205 67 -132 -148 -163 -205 -115 227
7276 227 164 195 45 124 84 -77 188 55 150 97 -249 70 253 -167 70 134 -122 38 -15 112 58 138 65 -128
7300 -128 -32 99 105 103 -46 -21 -41 26 -30 86 -82 -61 -64 127 -241 -70 -25 25 -383 289 -9 72 -161 7 -52
7325 -52 28 -80 41 228 -30 -106 -41 -160 -49 -21 -172 148 31 93 -72 50 28 28 111 135 490 354 26 6
7349 6 37 93 103 -89 68 -200 58 -22 -114 -28 136 8 237 -135 -203 42 -86 -32 -265 -6 -259 -339 -384 -43
7373 -43 127 126 217 -11 -255 90 -95 -9 -33 117 5 19 -148 -100 -40 -6 129 204 119 -58 109 -37 10 -48 37
7398 37 202 215 67 -226 23 -71 -70 -115 29 30 106 -53 15 99 -68 4 -125 81 23 84 -97 -164 -178 -29 -104 -158
7424 -158 -16 32 -100 -244 138 54 240 -46 174 94 34 -247 54 269 -64 28 23 -197 -33 -175 -95 223 -87
7447 -87 60 -43 -5 -223 -314 -35 170 -248 67 -79 56 89 25 -15 309 -61 163 163 -101 185 -143 -103 31
7470 31 183 47 -36 80 -205 -122 3 -72 -144 -29 -84 145 -70 82 61 -97 103 -215 15 -10 -257 22 131
7493 131 169 -84 22 -30 -117 98 35 -192 -62 -208 -82 -168 13 -23 -133 -41 -45 -129 -2 71 -7 351 219 64
7517 64 68 49 -88 -117 -50 168 -158 121 -66 116 -30 78 4 43 -152 -205 -207 71 -25 -85 10 25 18 -222 10 20
7543 20 33 -36 -1 -315 137 16 54 21 -16 213 -300 -26 7 -184 143 66 -259 -193 -67 60 205 48 -56
7566 -56 109 -111 -10 -214 300 50 -190 84 -189 92 -30 138 -163 -119 96 -67 -122 -69 43 14 201 -46
7588 -46 -232 159 -25 17 -233 -91 -152 -67 81 78 -109 73 -154 60 47 239 95 -74 -31 -142 230 -74 -58
7611 -58 142 -44 6 53 104 -45 -98 -26 82 111 111 -9 -57 7 234 167 -292 153 362 -53 115 114 35 46 -140
7636 -140 -199 23 -5 206 153 114 -12 8 -2 175 266 -48 -124 -67 77 109 5 20 -11 -39 68 71 3 302 63
7661 63 -15 86 -75 2 -43 226 -54 69 -206 -170 -165 132 254 -20 23 45 -40 64 -13 -152 3 -15 -14 -54 168
7686 168 -7 65 -43 -70 -33 -24 65 -9 -27 147 3 -167 216 -127 -132 -102 0 113 -8 144 -97 153 5 133
7710 133 124 -85 -16 -8 77 -24 -109 -112 -151 -130 16 -18 155 29 48 148 223 79 6 51 -236 200 -61 -76 -261 24
7736 24 238 -22 -172 -120 -121 35 274 86 -192 -159 -29 -15 224 62 -128 203 54 -257 80 -114 -58 194
7758 194 106 -167 219 49 -66 14 -5 144 -103 -93 6 94 -121 -135 -38 -275 -100 103 -62 218 -231 -149 163
7781 163 216 -79 73 63 30 37 -144 -191 -100 31 63 42 99 -46 272 -109 67 -162 -105 -36 189 183 207 58 77
7806 77 -140 155 6 3 360 119 10 13 106 52 21 -144 -88 48 -95 73 133 -90 21 171 -77 -49 143 -134
7830 -134 282 170 112 -85 -369 84 -259 -90 -63 -152 -26 -187 -207 -147 -47 -165 -29 -190 133 -109 32 -298
7852 -298 115 -157 -43 101 133 47 -77 109 62 203 -2 -47 -40 4 253 178 -95 -126 -144 -173 124 -91 -104 43
7876 43 -128 11 -83 226 38 64 45 112 77 -224 -48 134 -146 172 148 0 144 41 -99 74 -31 17 -37
7899 -37 25 332 207 121 8 -273 -50 -50 -50 10 330 -6 114 145 96 98 88 81 52 38 -24 -179 -113 -84 232 -157 94
7926 94 207 -80 -195 -50 -30 -4 -32 -55 -69 20 -38 -45 233 192 35 -87 102 8 27 -170 -29 23 44 275 49
7951 49 -145 113 -33 171 26 -95 -160 -137 92 36 -6 163 72 -103 100 -168 -14 16 -121 -172 140 81 221
7974 221 43 139 -61 70 -159 -120 143 91 86 -185 113 4 304 115 -110 -45 -10 93 212 -111 -118 226 126
7997 126 -92 281 42 30 51 55 116 -293 106 -9 -162 52 182 -65 -107 151 123 -129 -110 12 110 147 -163
8020 -163 129 -148 108 -33 184 -207 77 -67 -114 22 96 84 -437 35 -32 8 -26 -15 59 -114 -53 41 122 -28
8044 -28 102 -242 22 164 25 -285 35 95 -77 -23 15 75 74 -128 -11 -56 10 41 -191 -77 -19 -189 106 41
8068 41 268 185 211 -79 -95 177 23 -22 128 152 41 -123 -315 69 149 -48 -17 71 128 -174 135 0 162
8091 162 -17 -34 62 -26 -189 154 -57 -282 49 -141 1 228 32 1 270 22 -57 34 127 -220 125 175 -50
8114 -50 -231 59 -287 -70 428 155 -62 292 110 45 92 13 -49 148 -98 9 232 -123 63 9 180 -296
8136 -296 45 -70 141 -82 93 -7 167 230 122 -80 -46 42 170 -274 -47 -53 181 -391 104 -21 -22 -305
8158 -305 73 157 -19 44 -253 60 -80 103 -232 186 -261 73 127 -43 74 176 60 -84 136 -177 13
8179 13 52 -85 -1 122 120 -245 247 -184 -36 51 154 -24
8191b4
##END NTUPLES=NMR FID
##END=
