##TITLE=1H_Pr 2838
 CDCl3,8 sc, 
 4.03.2021
##JCAMPDX= 6.0         $$ Bruker NMR JCAMP-DX V2.0
##DATA TYPE= NMR FID
##DATA CLASS= NTUPLES
##ORIGIN= UXNMR, Bruker Analytische Messtechnik GmbH
##OWNER= root
$$ XWIN-NMR		Version 3.5
$$ Thu Mar  4 10:06:09 2021 Russian Standard Time (UT+4h)  she@DPX200
##.OBSERVE FREQUENCY= 200.1315066352
##.OBSERVE NUCLEUS= ^1H
##.DELAY= (6, 6)
##.ACQUISITION MODE= SIMULTANEOUS
##.ACQUISITION SCHEME= undefined
##.AVERAGES= 8
##.DIGITISER RES= 18
##SPECTROMETER/DATA SYSTEM= spect
##.PULSE SEQUENCE= zg30
##.SOLVENT NAME= CDCl3
##.SHIFT REFERENCE= (INTERNAL, CDCl3, 0, 15.7039)
##AUDIT TRAIL= $$ (NUMBER, WHEN, WHO, WHERE, WHAT)
$$ ##TITLE= Audit trail, XWIN-NMR		Version 3.5
$$ ##JCAMPDX= 5.01
$$ ##ORIGIN= Bruker BioSpin GmbH
$$ ##OWNER= she
$$ F:/spectra/data/she/nmr/H-F/1/audita.txt
$$ ##AUDIT TRAIL=  $$ (NUMBER, WHEN, WHO, WHERE, WHAT)
(   1,<2021-03-04 10:04:17.42 +0400>,<she>,<DPX200>,
      <created by zg, POWCHK disabled, PULCHK disabled
       configuration hash MD5:
       00 E9 B6 7A A2 85 ED C7 34 08 36 98 17 FE 4E 26
       data hash MD5: 16K
       6B 38 CC 8B 43 85 3C F6 0D 58 C2 0E 6A 16 CF 9F>)
$$ ##END=
$$ 
$$ hash MD5
$$ 0C EF 15 4A C4 70 68 86 20 CC A4 25 1C DA 9D 76
##$RELAX= 
##$RELAX= 
##$RELAX= 
##$RELAX= 
##$RELAX= 
##$RELAX= 
$$ Bruker specific parameters
$$ --------------------------
##$DU= <F:/spectra>
##$EXPNO= 1
##$NAME= <H-F>
##$PROCNO= 1
##$TYPE= <nmr>
##$USER= <she>
##$AMP= (0..31)
100 100 100 100 100 100 100 100 100 100 100 100 100 100 100 100 100 100 
100 100 100 100 100 100 100 100 100 100 100 100 100 100 
##$AQSEQ= 0
##$AQ_mod= 1
##$AUNM= <au_zg>
##$AUTOPOS= <>
##$BF1= 200.13
##$BF2= 200.13
##$BF3= 200.13
##$BF4= 200.13
##$BF5= 200.13
##$BF6= 200.13
##$BF7= 200.13
##$BF8= 200.13
##$BYTORDA= 1
##$CFDGTYP= 0
##$CFRGTYP= 5
##$CHEMSTR= <none>
##$CNST= (0..31)
1 1 145 1 1 1 1 1 1 1 1 1 1 1 1 1 1 1 1 1 1 1 1 1 1 1 1 1 1 1 1 1 
##$CPDPRG= <>
##$CPDPRG1= <>
##$CPDPRG2= <>
##$CPDPRG3= <>
##$CPDPRG4= <mlev>
##$CPDPRG5= <mlev>
##$CPDPRG6= <mlev>
##$CPDPRG7= <mlev>
##$CPDPRG8= <mlev>
##$CPDPRGB= <>
##$CPDPRGT= <>
##$D= (0..31)
0 1.2 0 0 0 0 0 0 0 0.06 0 0.03 0 0 0 0 0.0002 0 0 0 0 0 0 0 0 0 0 0 0 
0 0 0 
##$DATE= 1614837857
##$DBL= (0..7)
120 120 120 120 120 120 120 120 
##$DBP= (0..7)
150 150 150 150 150 150 150 150 
##$DBP07= 0
##$DBPNAM0= <>
##$DBPNAM1= <>
##$DBPNAM2= <>
##$DBPNAM3= <>
##$DBPNAM4= <>
##$DBPNAM5= <>
##$DBPNAM6= <>
##$DBPNAM7= <>
##$DBPOAL= (0..7)
0.5 0.5 0.5 0.5 0.5 0.5 0.5 0.5 
##$DBPOFFS= (0..7)
0 0 0 0 0 0 0 0 
##$DE= 6
##$DECBNUC= <off>
##$DECIM= 32
##$DECNUC= <off>
##$DECSTAT= 4
##$DIGMOD= 1
##$DIGTYP= 9
##$DL= (0..7)
0 120 120 120 120 120 120 120 
##$DP= (0..7)
150 150 150 150 150 150 150 150 
##$DP07= 0
##$DPNAME0= <>
##$DPNAME1= <>
##$DPNAME2= <>
##$DPNAME3= <>
##$DPNAME4= <>
##$DPNAME5= <>
##$DPNAME6= <>
##$DPNAME7= <>
##$DPOAL= (0..7)
0.5 0.5 0.5 0.5 0.5 0.5 0.5 0.5 
##$DPOFFS= (0..7)
0 0 0 0 0 0 0 0 
##$DQDMODE= 0
##$DR= 18
##$DS= 0
##$DSLIST= <SSSSSSSSSSSSSSS>
$$ [...]
##$SUBNAM2= <"">
##$SUBNAM3= <"">
##$SUBNAM4= <"">
##$SUBNAM5= <"">
##$SUBNAM6= <"">
##$SUBNAM7= <"">
##$SUBNAM8= <"">
##$SUBNAM9= <"">
##$SW= 16.9725356469052
##$SWIBOX= (0..15)
0 0 2 0 0 0 0 0 0 0 0 0 0 0 0 0 
##$SW_h= 3396.73913043478
##$TD= 16384
##$TD0= 1
##$TE= 0
##$TE2= 300
##$TE3= 300
##$TEG= 300
##$TL= (0..7)
0 120 120 120 120 120 120 120 
##$TP= (0..7)
150 150 150 150 150 150 150 150 
##$TP07= 0
##$TPNAME0= <>
##$TPNAME1= <>
##$TPNAME2= <>
##$TPNAME3= <>
##$TPNAME4= <>
##$TPNAME5= <>
##$TPNAME6= <>
##$TPNAME7= <>
##$TPOAL= (0..7)
0.5 0.5 0.5 0.5 0.5 0.5 0.5 0.5 
##$TPOFFS= (0..7)
0 0 0 0 0 0 0 0 
##$TUNHIN= 0
##$TUNHOUT= 0
##$TUNXOUT= 0
##$USERA1= <user>
##$USERA2= <user>
##$USERA3= <user>
##$USERA4= <user>
##$USERA5= <user>
##$V9= 5
##$VALIST= <valist>
##$VCLIST= <CCCCCCCCCCCCCCC>
##$VD= 0
##$VDLIST= <DDDDDDDDDDDDDDD>
##$VPLIST= <PPPPPPPPPPPPPPP>
##$VTLIST= <TTTTTTTTTTTTTTT>
##$WBST= 1024
##$WBSW= 4
##$XGAIN= (0..3)
0 0 0 0 
##$XL= 0
##$YL= 0
##$YMAX_a= 548851
##$YMIN_a= -302555
##$ZGOPTNS= <>
##$ZL1= 120
##$ZL2= 120
##$ZL3= 120
##$ZL4= 120
##$ABSF1= 10
##$ABSF2= 0
##$ABSG= 5
##$ABSL= 3
##$ALPHA= 0
##$AQORDER= 0
##$ASSFAC= 0
##$ASSFACI= 0
##$ASSFACX= 0
##$ASSWID= 0
##$AUNMP= <proc_1d>
##$AZFE= 0.1
##$AZFW= 0.1
##$BCFW= 1
##$BC_mod= 2
##$BYTORDP= 1
##$COROFFS= 0
##$CY= 11.3945322036743
##$DATMOD= 1
##$DC= 2
##$DFILT= <>
##$DTYPP= 0
##$F1P= 15.9154993809931
##$F2P= -4.1035820241983
##$FCOR= 0.5
##$FTSIZE= 0
##$FT_mod= 4
##$GAMMA= 1
##$GB= 0.15
##$INTBC= 1
##$INTSCL= 1
##$ISEN= 128
##$LB= 0.24
##$LEV0= 0
##$LPBIN= 0
##$MAXI= 10000
##$MC2= 0
##$MEAN= 0
##$ME_mod= 0
##$MI= 1.114404
##$NCOEF= 0
##$NC_proc= 0
##$NLEV= 6
##$NOISF1= 3.799351
##$NOISF2= 2.8
##$NSP= 1
##$NTH_PI= 0
##$NZP= 0
##$OFFSET= 15.70392
##$PC= 1
##$PHC0= -10760.11
##$PHC1= 9.20094
##$PH_mod= 1
##$PKNL= yes
##$PPARMOD= 0
##$PSCAL= 0
##$PSIGN= 0
##$REVERSE= no
##$SF= 200.130013532006
##$SI= 16384
##$SIGF1= 3
##$SIGF2= 2
##$SINO= 400
##$SIOLD= 16384
##$SREGLST= <1H.CDCl3>
##$SSB= 0
##$STSI= 0
##$STSR= 0
##$SW_p= 3612.71676300578
##$SYMM= 0
##$S_DEV= 0
##$TDeff= 0
##$TDoff= 0
##$TI= <>
##$TILT= no
##$TM1= 0
##$TM2= 0
##$TOPLEV= 0
##$USERP1= <user>
##$USERP2= <user>
##$USERP3= <user>
##$USERP4= <user>
##$USERP5= <user>
##$WDW= 1
##$XDIM= 8192
##$YMAX_p= 0
##$YMIN_p= 0
$$ End of Bruker specific parameters
$$ ---------------------------------
##NTUPLES= NMR FID
##VAR_NAME=  TIME,          FID/REAL,        FID/IMAG
##SYMBOL=    X,             R,               I
##VAR_TYPE=  INDEPENDENT,   DEPENDENT,       DEPENDENT
##VAR_FORM=  AFFN,          ASDF,            ASDF
##VAR_DIM=   8192,          8192,            8192
##UNITS=     SECONDS,       ARBITRARY UNITS, ARBITRARY UNITS
##FACTOR=    0.0002944,     1,               1
##FIRST=     0,             0,               0
##LAST=      2.4114304,     0,               0
##MIN=       0,             -302555,         0
##MAX=       2.4114304,     548851,          0
$$ Real data points
##PAGE= N=1
##DATA TABLE= (X++(R..R)), XYDATA
0@%%%%%%%%%%qJ6j6J6k4L2m0M8n6P2q8J04j20J41j67J94k26K63l03L48l99M54
32B41n15N85o62P45q37R39j049J170j304J451j609J781j971K178k403K652k925
49a533L220l547L910m309M752n248N808o444P172q019R014j0201J1653j3474J5833
64H587j9031K3635l0869M3969p5199K89516L08243l86517q0357J52305J68951
75D03233n0433j41183j21855J43491K28050l9384k92692j4439K57163O3048k19326
86B15673j55135J7780J12604M1049j55997k17475O7064K36812j4346k50389n1523
97a53883J77748J06383p4811j45720o8058J10457J35289j06060k31318J6461K20176
108a3336M1369j67035p4013R5079J43113N2814j09530j19520J00492J92738m4711
$$ plain form
0 0 0 0 0 0 0 0 0 0 0 0 -8 8 -8 8 -16 16 -24 24 -32 40 -48 56 -64 77 -90 104 -122 141 -162 186 -213 241
32 241 -274 311 -351 394 -443 496 -553 617 -687 764 -845 936 -1035 1143 -1260 1392 -1533
49 -1533 1687 -1860 2050 -2259 2493 -2755 3053 -3391 3781 -4238 4776 -5425 6228 -7246 8587
64 8587 -10444 13191 -17678 26291 -48908 240608 548851 162334 81977 234282 403233
75 403233 352800 211617 89762 233253 461303 421919 129227 114788 371951 434999 215673
86 215673 60538 78318 190922 231971 75974 -141501 -74437 162375 148029 -102360 -153883
97 -153883 23865 130248 55437 -90283 -158341 -47884 87405 -18655 -249973 -233512 -13336
108 -13336 28033 -139002 -213015 -117936 25177 77991 -31539 -151059 -50567 142171 97460
119I7460k08198l0132J55794P1291q0669j09335j2929J31809J19920q5531j58660
130a09180N8884J86588L564j58453p1274O7660Q2390n283j25403r8783R4640J44543
142F9893n6032j53619J5206J44041N4537p7432q8287J466J01369O3274j08570
153c4154j30916O0870J44275j2512j23533k9414R3534R6000j172r2546m6034J04801
165B9199J07518o8918j32371J6781J17931K5586q2571o9394K8599J00680M7726
176A20766q4374q1951P6830J20160k6091j14598k3669P3910N2156l6624r2089
187a5574l2843Q5086P6759o7748r8699L8104J06051J3460p5393n1197K8895P2783
199G9684J1320r3035p0501O4476Q5355m2528r3454k101P6959M7472l3001o9132
$$ plain form
119 97460 -110738 -140870 14924 86215 5546 -103789 -116718 15091 135011 49480 -109180
130 -109180 -50296 136292 139856 -18597 -89871 -22211 60179 54896 -70507 -169290 -74650 69893
142 69893 13861 -139758 -124552 19489 74026 -3406 -91693 -90227 11142 74416 -34154
153 -34154 -165070 -104200 40075 27563 -95970 -125384 -31850 64150 62978 -29568 -75602 29199
165 29199 136717 67799 -64572 -47791 70140 95726 13155 -56239 -27640 73040 120766
176 120766 36392 -45559 31271 151431 125340 10742 -12927 60983 113139 76515 -15574
187 -15574 -48417 36669 113428 45680 -53019 -14915 91136 104596 29203 -21994 6901 79684
199 79684 91004 -2031 -72532 -8056 77299 34771 -58683 -60784 16175 63647 30646 -38486
211c8486p677Q1811M7697p5051q3815L6146P8477q285p5232l9312M1018O6642
223B3933J855p3343l4272P2771O8200m3024p7984O467O3049K4574m6702n9012
235g3488M815O8127K9777o2323n2350M7946P3082r629n8790j8586M1552M7582
247C7715j2963o4885k4827N9748M6325m5110n9993J9638O1301J7598l6665l9673
259d1791J6735O0417J4569o1093m2136M4032N1049k3207n6563j0865M1321L9006
271C1474j6289n3103n590O0260L4090m5323m7389K1556M8412M349m2693l3991
283d4237J9764M8996K280n2147k2934M5619M3564k1624m3623q70L9453K5774k3696
296A6319m4952l12M7484J8476m1819l5554K4949M3290Q8l5732j9890K4429L9004
$$ plain form
211 -38486 -46163 35648 83345 8294 -75521 -39375 39102 30817 -44415 -83727 -42709 23933
223 23933 25788 -47555 -81827 -9056 59144 16120 -61864 -55397 7652 32226 -14476 -73488
235 -73488 -68673 -546 29231 -33092 -85442 -37496 35586 25957 -32833 -51419 -9867 37715
247 37715 24752 -40133 -64960 -5212 41113 -3997 -63990 -44352 16949 34547 -2118 -41791
259 -41791 -25056 35361 49930 -11163 -53299 -9267 41782 18575 -37988 -48853 -7532 31474
271 31474 15185 -37918 -43508 16752 50842 5519 -41870 -20314 28098 32447 -10246 -44237
283 -44237 -24473 24523 26803 -25344 -48278 -2659 40905 19281 -24342 -25212 14241 40015 16319
296 16319 -28633 -28945 18539 37015 -4804 -40358 -15409 27881 27969 -7763 -27653 -3224 35780
309C5780l275m6563j6933L9720K9452k6919m0189M377L5372J8181k3068l4083
321b8148P472M4456J2541l9863k5864K6126L3776p927l3923j5802K3067L1645
333B7556r243l9515p295L8908K3029k4864k9536Q080L1449J1488k4672k8288R969
346a2934L5645L938l5375j8944K5388K7726q317k9377p628K4494K4037j2883l2834
359a7064k355L2110J5232k5928k5124J0341K7436O019k3670k0133J3889K9794
371B0547j19l0903j2722K4243K1662j2847k5340m211K1169J7218j3331k6635Q97
384b0372K8934J0232k2907j9494J1627K1744K824k0259j6596J2103K3540j899
396I477k7025q925K1054J7069j0720k1035k528J9394J4978j3119k2751K928K4758
$$ plain form
309 35780 32505 -14058 -30991 8729 38181 11262 -28927 -24550 10822 29003 5935 -28148
321 -28148 -20676 23780 36321 -3542 -29406 -3280 30496 22569 -11354 -27156 -4089 27556
333 27556 18313 -21202 -28497 10411 33440 8576 -20960 -12880 18569 30057 5385 -22903 -12934
346 -12934 22711 26649 -8726 -27670 -2282 25444 17127 -12250 -19878 4616 28653 15770 -17064
359 -17064 -19419 12691 27923 1995 -23129 -12788 14648 20667 -3003 -23136 -9247 20547
371 20547 20428 -10475 -23197 1046 22708 9861 -15479 -19690 1479 18697 5366 -21269 -20372
384 -20372 8562 18794 -4113 -23607 -11980 9764 12588 -7671 -24267 -12164 11376 9477
396 9477 -17548 -26473 -5419 11650 930 -20105 -22633 -3239 11739 -1380 -24131 -21203 3555
409C555P687k0539j5823J0653K0900J554j9247j2806J3585K1644l763k3246o177
422b2023K0477J5680j1050j9443L08J9609J1490j2700j9201M901K2379N968j9003
435b608j3600J2204J8415k76j7634r269J3516J8243m530k0531l819J8789J1948
448B0848j1460j6291J702J6548Q520j2548j6056N620K0200K748j8035j0221J1666
461C241J5181k527j6669p787J2811J4108o726j9315j813J7007Q797j1288j4910
474i890K803J5587N928j3240j4623O769J6286J9j6754q934J0722J2696l204j5340
488a1175n025J2039J2056o393j6419n65J4952P430j1824j2799L149J3983L887
501C296j2072j0981O640J5552M77j4681o886J1436J1509m348j3498m041J1416
$$ plain form
409 3555 11242 -9297 -25120 -14467 6433 7987 -11260 -24066 -10481 11163 7400 -15846 -22023
422 -22023 -1546 14134 3084 -16359 -16051 3558 15048 2348 -16853 -11952 10427 16395 -2608
435 -2608 -16208 -4004 14411 14135 -3499 -12768 748 18991 14461 -6070 -9889 8900 20848
448 20848 9388 -6903 -5201 11347 19867 7319 -8737 -3117 17083 19831 1796 -8425 3241
461 3241 18422 15895 -774 -8561 4250 18358 11632 -7683 -9496 7511 16308 5020 -9890
474 -9890 -7087 8500 14428 1188 -13435 -6666 9620 9639 -7115 -16049 -5327 7369 4165 -11175
488 -11175 -16200 -4161 7895 1502 -14917 -15482 -530 6900 -4924 -17723 -14574 -591 3296
501 3296 -8776 -19757 -13117 2435 2912 -11769 -18655 -7219 4290 -58 -13556 -17597 -6181
514f181J0184p094j4498L93J5218O206j0786r915N196J2881L511j1362r236P296
528h187J3620j301j3982n011J1172J0206m110j1480j669J2301R618p124j1650
541g597K019J3397M767j0417r308M587J2211J840j0650p320P821J2558j308j2393
555B07l598J0284R365n675j2027j459J0658O518q205j1258K471J2284L413j0255
569B723q004N922J1182M01j1170o617P127J0240l661j2557k909J0139P773o070
583D519r655K52J0864O227p631r512L523J1490J388j0318o607N450R756q10r910
598i74m893Q157R677l455j0367j416R307O225o469j0270M72R275L584q844q925
613h916L909J0157P82r955n791O690R079k023j0678l911P485P658m938j1170r19
$$ plain form
514 -6181 4003 -3091 -17589 -17196 -1978 4228 -6558 -16473 -11277 1604 5115 -6247 -15483 -8187
528 -8187 5433 4132 -9850 -14861 -3689 6517 2407 -9073 -10742 1559 11177 4053 -7597
541 -7597 -5578 7819 12586 2169 -7139 -2552 9659 11499 849 -6471 1350 13908 12600 207
555 207 -3391 6893 16258 10583 -1444 -2903 7755 14273 6068 -5190 -2719 9565 12978 2723
569 2723 -5281 641 11823 12224 1054 -5563 1564 11804 8143 -4414 -7323 2816 10589 4519
583 4519 -5136 -4884 5980 12207 4576 -4936 -1413 10077 11465 1147 -5460 -10 9746 8936 -974
598 -974 -5867 2290 11967 8512 -1855 -3271 6036 12261 5792 -4478 -4006 5269 8853 9 -8916
613 -8916 -5007 5150 5932 -4023 -9814 -3124 5955 3932 -6746 -10657 -3172 4486 -452 -11622 -12541
628a2541R425N430o751q076K591J0172L505p769o939N118R950m26r695m308P120
643c194P854k258q746j968Q941P530m071r307J803R814L889o944p485K793Q637
658G288J377q547o106N474R093j335q965k665P214P040l562q982j607P958M755
673H430o274q536R67Q839K494p599o131M453Q778N77q278m341O213P060k111r195
689d654k365P468N027m191p889P27Q148M304n744o683L408Q495J153p452n022
704e270M175P175j399p854l154O347O344l306p583m40Q079M242n196o668J192
719c316P721J868p151n993L792P375o43o865l703N939O115j749p108j480O679
734A481M725m462o903M32O646K685n617n412K240P294J292o010l943L999O523
$$ plain form
628 -12541 -3116 2314 -4437 -12513 -9922 250 3755 -4014 -10953 -5835 4115 3689 -6006 -10314 -3194
643 -3194 4660 2402 -6344 -8312 629 8159 4088 -5219 -3416 6398 10287 3343 -4142 -1349 7288
658 7288 8665 118 -5988 -514 8579 7244 -1721 -4386 2828 9868 6306 -2676 -4283 3675 8430
673 8430 2156 -6380 -5413 3426 5920 -1679 -7810 -3357 5421 5998 -2280 -6621 -408 6652 4541 -4654
689 -4654 -7019 449 5476 1285 -6604 -5877 2271 6575 831 -5852 -2444 6051 7204 -248 -5270
704 -5270 -1095 6080 4681 -3173 -6327 20 6364 3058 -4525 -4965 3114 7356 2160 -4508 -3316
719 -3316 4405 6273 -878 -6871 -3079 4296 3653 -3212 -6915 -976 5139 3390 -3718 -5198 1481
734 1481 6206 1744 -5159 -4727 1919 4604 -1013 -6425 -4185 3109 4401 -1609 -5552 -1553 4970
749D970p87o673k354N035M623k487o549j051N961M203m016o049J572O970K008
764E376m838n021K850O195K22o362l854M641N532k125o049j359N791M195k790
779B404n973J59O571K544m949n658K272N691P63n827l845L151N945k73o078k161
795e264N038M879k599n681q51N486L185l954n681J547N745J803m820m169L175
810b161O226L5n296k951M373N033j732n718j474N306L920l262n578P03O092K231
826E747m153m343K089N576P88n412l695L452N161j422n365k187M343M264k429
841B414n290l87N585K419l896m790J743M687J301m580m057K858N030l93n120j950
857d426L998M079j611m785r24M926L225l306m753Q36M656J881l954m333K416M987
$$ plain form
749 4970 4183 -2490 -4844 191 4814 2327 -4222 -5273 688 4891 875 -5174 -3602 3368 5376
764 5376 538 -4483 -1633 4562 4784 -1578 -5432 -791 4741 2616 -3433 -4792 999 5194 2404
779 2404 -3569 -3410 3161 5705 756 -4902 -2630 3061 3824 -2003 -5848 -2697 3248 2975 -3103 -5264
795 -5264 -226 4653 2054 -3627 -4478 1008 4193 239 -5442 -3895 1850 3653 -1167 -5336 -2161
810 -2161 4065 4100 -1196 -4147 226 5259 3527 -2191 -3665 1641 5561 2299 -3279 -2576 3516 5747
826 5747 1594 -2749 -660 4916 5704 292 -3403 49 5210 3788 -1577 -3764 579 4843 2414
841 2414 -2876 -3263 2322 4741 845 -3945 -2202 2485 3786 -794 -4851 -1993 3037 2644 -2476 -4426
857 -4426 -428 3651 2040 -2745 -3669 1257 4482 1176 -3577 -2741 1915 3796 -158 -4491 -2075 2912
873B912M64m729k752L545M015j063m701j600L596L567k554m912k38M958J770l403
889a125l738J092M769J166m323l231K541M535l73m444j860L505L653j658m438
904c929l79M455K717k741l797Q46M649J648l515l321K028M441O3l896k303L228
920A94L941r09m214j292L891L170k288m020M96L968J595k966l642J248M209O89
936D070l791k911K615L871o80l803j677L064L070j848m065l21L685J946k426l544
952b745R60L775J119l374k617J935L280L4l402k027K527L238j181l691q71L219
968A79K397k130l015J46L528J451k845k785J290L486L56l171j777J994L249n99
984A754l574r48K949K649j826k949j50L021K008k237l004J061L434P59k936k006
$$ plain form
873 2912 3376 -1353 -4105 -560 3455 2392 -2309 -3909 -313 3254 700 -4212 -4450 508 2278 -1125
889 -1125 -4863 -3771 998 2164 -2159 -5390 -2849 1686 1313 -3131 -4991 -1486 2167 509 -3929
904 -3929 -4308 147 2864 123 -3674 -2828 1821 3469 -46 -3367 -1339 3102 3165 -731 -3034 194
920 194 4135 3226 -988 -2280 1611 4781 2493 -1527 -1031 2937 4532 1566 -2076 -828 3381 4070
936 4070 279 -2632 -17 3854 3174 -629 -2306 758 3828 1980 -2085 -2406 1279 3225 799 -2745
952 -2745 -1785 1990 3109 -265 -2882 -947 2333 2367 -1035 -3062 -535 2703 1522 -2169 -3040 179
968 179 2576 446 -2569 -2423 1105 2556 -289 -3074 -1784 1702 2058 -1113 -2890 -896 2353 1754
984 1754 -1820 -2768 181 2830 1004 -1945 -2095 926 2934 697 -2307 -1246 2188 2947 11 -1995
1000a995K004K577J70l144j538K620K646j466k615m39K442K019j811k866N0L226
1016A880P76k235k040R34K905J77k721j484J652K557o63k726o34K525J226j047
1032A082k430n6K192J537j943k226P37K521O02k042j465J423K077l4k278j173
1048a476K028J861p21k435m51K116J636j603k334M67K420P75k202j681Q77K333
1064A610J30k314j509J591J965p52k442m69J947J544j113k404Q2K330Q14j791
1080g81j595Q20J598O74j906j538J510J971j47k434m54J802J522r74k092JK100
1097G7J246j686j388O07J886O53j722j262R98J920J04k022p59J347J579m56k003
1114h81n29J892J441j364j577L4J895N46j548j406R53J810o3j493j024J100J509
$$ plain form
1000 -1995 9 2586 2756 -388 -1926 694 3340 1874 -741 -1180 1262 3281 1470 -1396 -1346 1880
1016 1880 2656 421 -1619 -685 2220 2397 -324 -1808 -156 2401 1738 -988 -1622 903 2129 1082
1032 1082 -1348 -1404 788 2325 382 -1844 -1107 1414 2016 -26 -1491 -68 2009 1975 -303 -1476
1048 -1476 552 2413 1692 -743 -1194 922 2558 955 -1379 -912 1508 2283 81 -1600 -723 1610
1064 1610 1740 -574 -2083 -492 1473 721 -1721 -2190 -243 1301 188 -2216 -2134 196 1010 -781
1080 -781 -2376 -1556 42 716 -1190 -2728 -1218 753 606 -1828 -2282 -480 1042 68 -2024 -2023 77
1097 77 1323 -363 -1751 -1144 742 1395 -327 -1589 -591 1329 1433 -589 -1348 -1 1578 1122 -881
1114 -881 -1410 482 1923 559 -1018 -984 911 1457 -91 -1497 -544 1266 1203 -290 -1314 -214 1295
1131A295n40j832k11J402J166q44j812l69K101M68j049j133M12J470K48j546j087
1148a861J074J553j05j794o43J433J073k31j866k49J609Q48j231j114M06J550
1164D52L78j337j336Q97J469P6j409p18J097J179m72j425m61J497R65p59j623
1181a530L07J429K61r33r37J13J651K21j501p39R95J075j64j485l93J522P54n35
1199A11j345J91J357L07n56j080M44J103K80p90j198R83J184rj277m25R78R93
1217A251j72j526p7J534N42p48j103n1J235O65r52j028O58J152n6j225l58N82
1235C23R27n13q13m61R07L57m43q46k8J159L82r23q57K23R91M9j080l64M32R90
1255D12j92j094l12R05P35o67j028L86P00O10o21n51qJ083K54r37p11N40J138
$$ plain form
1131 1295 755 -1077 -1288 114 1280 436 -1376 -1745 356 824 -225 -1358 -946 524 772 -774 -1861
1148 -1861 -787 766 661 -1133 -1776 -343 730 499 -1367 -1616 -7 841 -390 -1504 -1098 452
1164 452 830 -507 -1843 -946 523 599 -810 -1528 -431 748 276 -1149 -1610 -113 852 93 -1530
1181 -1530 -1223 206 467 -466 -1403 -1290 361 582 -919 -1658 -663 412 248 -1237 -1630 -108 646 111
1199 111 -1234 -1043 314 621 65 -1015 -571 532 812 22 -1176 -193 991 982 -295 -720 258 1251
1217 1251 1079 -447 -524 1010 1552 804 -299 -350 885 1550 598 -430 228 1380 1324 99 -259 323
1235 323 1250 737 -76 -537 370 727 284 -562 -590 569 951 28 -829 -606 385 434 -646 -1010 -578 412
1255 412 220 -874 -1186 -281 454 -213 -1241 -855 -155 455 -166 -717 -725 358 612 -325 -1036 -496 642
1274F42k65q93k2R41M33j69j093K2J148M36p43p12N4R50L78p09o57L93Q90j91
1294H33o77l76Q65N35k89r02j03N53O83o39p85J49N62L81n01o40L21P09qp69m12
1315e10N04P37l59p99j89K23R23m88p35K94N42K38m45n40M22O92j68n30m98O14
1335g2M07k24p73MM62O74m94o40K20M44N11o53l79j1M20L36p89k37M14L41o8n92
1357f99q6N88K09j61o41j63P35K89l23p63L02O04K44o11nJ37M75P9m64k27M97
1378A6N84m62k95RO56m3l26r2K23M45K33l89l89L31N40j1o35j10L99L14j76m52
1400C70j38K57M44n33M2l78L83L24m36k45J2L84K8m65l68N8N33j07k24l18KM90
1422A15k48k3k85O92k12k4l83j16N00M81q28j58L01K58J67k19m9K04L54k98L3
$$ plain form
1274 642 377 -516 -538 403 836 667 -426 -404 744 1180 437 -275 -221 729 1107 398 -259 134 1024 833
1294 833 156 -220 645 1180 891 -11 -114 439 1122 483 -302 -153 409 790 289 -351 -30 679 671 -98 -510
1315 -510 -6 731 372 -427 -616 -393 530 42 -693 -399 143 381 -64 -604 -182 510 342 -188 -686 -72
1335 -72 335 111 -662 -658 -196 478 -16 -656 -436 8 519 -134 -513 -524 -104 232 -557 -794 -380 -39 -107 -699
1357 -699 -785 -197 12 -149 -790 -953 -218 71 -252 -1015 -713 -109 135 -476 -481 -344 131 210 -254 -481 16
1378 16 600 138 -157 -148 508 465 139 47 270 715 948 559 170 501 1041 1030 395 285 684 998 822 370
1400 370 232 489 933 400 442 64 447 771 335 90 102 486 514 49 -319 -261 272 165 -59 -377 -375 115
1422 115 -133 -156 -441 251 39 15 -368 -484 16 497 -331 -489 -188 70 237 18 -31 173 527 229 262
1443B62j30K15J86l09j90K49L20l7K1l35J05M74o1l86j70P9J60Kk88j40p2L44
1465B99k96j00l7J7OJ47m94PK42K20k51m51J92L15J33m04k06J47L27j36r7j10
1487e30Q0N41l52q1M1K03L32l55R8Q3Q7K77m16j83K46L47K6Qm19M93K14j30j94
1510D16k31L1L29m9k94l24K82J11j29k07j13L50J6k19k34L19n0j06k06j7j79J96
1532c08o3j12j50J86l0P4k13m5M12l07J88m4j16J97K07n34M0M23M9K5k83j84M38
1555a50J72m8k09j60L92K29J3l44m4K41K46k89M6M8M39l24k95J91o7J93k61J62
1577A81j57K3J68m66K82j61K53O5l74RK54K82m51j51q0K40P7j25L4q1J73J85j70
1600A0l37J02K11N3lr2k9J99J26j80k51K30J21j12j77k7J5K77o2km3M9J19n9L3
$$ plain form
1443 262 132 347 533 224 34 283 603 566 587 252 357 831 770 384 214 293 453 455 167 27 -45 299
1465 299 3 -97 -134 -117 -111 36 -458 -451 -209 11 -240 -691 -499 -184 -51 -455 -661 -514 -187 -323 -420 -530
1487 -530 -450 91 -261 -342 -301 -98 234 -121 -23 60 147 424 8 -175 71 418 444 452 33 526 740 610 416
1510 416 185 216 545 496 202 -122 160 271 142 -65 -178 172 188 -31 -265 54 4 -102 -308 -325 -504 -308
1532 -308 -371 -483 -633 -447 -477 -403 -616 -661 -249 -556 -368 -412 -528 -331 -124 -658 -618 -195 -146 -121 -404 -588 -150
1555 -150 22 -26 -235 -395 -3 226 239 -105 -149 92 338 49 95 143 582 258 -37 154 87 280 19 181
1577 181 24 47 215 -251 31 -130 123 188 -186 -177 77 359 -92 -243 -323 -83 -6 -131 -97 -178 -5 180 10
1600 10 -327 -225 -14 39 36 -56 -85 114 240 60 -191 39 160 48 -129 -156 -141 136 74 72 29 78 197 138 171
1625A71q9J18k5m9M6k08L05n9l79J6J86j5J45r7l03K76j54l9m7o5J98m5l00J56
1649b57J71o4K10j99j67o2R5L99l92Q2j0J6J0j53j71P90o0m55J07Q1L9K05k95
1672h0l8K8P7r0Q3r0J07j51K59m5m0J30K20m1l17L15j87k1l8M2K58j68j04L11
1696D20l08L2j54L14j51k04K4K18M9k24j06K18J7j10j66l36N31j46k54J17J64
1717e5L7R2k40J63p8J92j53l10K10R8j38N4J97k16q9J40J04j79j54K2L28l6p6
1740h7O6lk6j01p0Q6L39k90R5l87K26K08Lk57J08P1n0J2j31p1Q2J29J77k00Q4
1765A3p5J32q3L4J64M2k07l41N17p7k32L84pk40O4q1J46j05kn2J71Q8q5k19J55
1790A04k4j7K5K2j28Q3j54O6mK61M4j26J7j21n5K57j64j13J36K8K01j24RJ99k13
$$ plain form
1625 171 82 200 175 126 172 -36 269 210 -169 -153 33 18 163 66 -237 39 -115 -154 -201 -266 -68 -113 -413 -257
1649 -257 -86 -150 60 -139 -306 -368 -273 126 -266 -184 -194 -178 -168 -321 -492 298 238 -217 -110 -29 10 215 -80
1672 -80 -118 -90 -13 -103 -20 -110 -3 -154 105 60 20 150 370 329 12 327 140 119 81 123 381 213 109 420
1696 420 112 144 -10 304 153 -51 -27 191 240 16 -90 128 145 35 -131 -467 64 -82 -336 -219 -55
1717 -55 -18 74 -166 -3 -81 111 -42 -352 -142 -44 -182 -128 69 -147 -236 -96 8 -171 -325 -303 25 -11 -87
1740 -87 -21 -24 -50 -151 -221 -135 204 -86 9 -378 -152 56 59 -198 -90 -19 -69 -57 -188 -259 -177 -48 129 -71 13
1765 13 -62 70 -13 21 185 227 20 -321 196 119 -113 271 264 24 88 7 153 48 46 -6 165 253 168 -51 104
1790 104 80 63 88 110 -18 65 -89 -23 -27 234 278 152 169 48 -7 250 86 -27 109 137 338 214 223 422 209
1815B09K8J31j61K40j03K40l07j05L18o8m0j64j71J69Q5J8J4k71k5j36J25jJ18
1838A43Q0j95r8j80R7J44j44l7J9K0K13k13j0j59J51j56J22j2m9N7k12L2J01M6
1862b40J4j46NJ25j38K82j98j31M62j99Kj10K7K35J3j18K1L01j80q7J40l33K70
1885A7R5l4J68k8k07K68j19Pq6R1K31k28J51j57k07N12m64L17m3j94J04P1k81
1908a6R1K31j37j30o2j44K18N8n8l27J95J36p7J12k08J49Oj84J32j61J99j09J75
1931H9j44j48P8M21l19J46R0k49K3o2Q4j39J46R9j67J07Q2pk78K62j12J14k3L5
1955A28L1n8J14j75J05r5r9Q2j18L16j99N7N2m1K39l76L3K06J7j94M8P1J47j60
1979A31k8j48K26j66R5L0m1j17J64P5k11M3Q5j47p7l1J77j0j63o6K88j63K26j50
$$ plain form
1815 209 237 368 207 447 344 584 277 172 490 422 382 218 47 216 301 319 333 62 37 -99 26 25 143
1838 143 223 28 -70 -250 -153 -9 -153 -190 -171 -151 62 -151 -161 -320 -169 -325 -203 -215 -264 -207 -419 -387 -286 -240
1862 -240 -226 -372 -367 -242 -380 -98 -296 -427 35 -164 -162 -272 -245 -10 3 -115 -94 207 27 -60 80 -253 17
1885 17 112 78 246 218 11 279 160 167 81 172 403 175 326 169 -38 474 10 327 284 90 194 265 -16
1908 -16 75 306 169 39 -23 -167 51 109 51 -276 -81 55 -22 90 -118 31 37 -147 -15 -176 23 -86 89
1931 89 -55 -203 -125 296 -23 123 213 -36 -13 -75 9 -130 16 115 -52 55 137 130 -148 114 2 116 93 128
1955 128 159 101 215 40 145 50 -49 33 -85 231 32 89 141 100 339 -37 -4 202 219 25 73 144 291 131
1979 131 103 -45 181 15 110 140 99 -18 146 221 10 53 138 -9 -86 -117 60 50 -113 -179 109 -54 172 22
2003B2j45k8M4J64l79L19j96K24k31L64k47j2J42J67j9K9j95Jlq8j36J32Q1p1
2027f1J53j18K13O7k99m7J9J27j22K12k38j38L79l6k03j12J85K12j82k30J05j57
2049b71K4PO8J4L9J74m22J45K27j06j2l0r8K69j64K63k57nk4O8L40m93L37P7k87
2074a17L39n45L74j30J51M2j25K62l4q2m1j06m9J4J28p9J98k00P3j1Jk08K36Q0
2098A71k41M3L5J49j35k64K28N9k81K75j01o7J05k0m00M57o2J32J17j71J11j62
2120b2J02j11l5pL05k28Mm2P2M5j17P5j60J02j5K16J42l27K64j18q9J55j96J51
2144A66l6r1j50J37P1j9L4Q8j67K56j87j84J06l8j66J8j6K40j85j65K15m2K52
2167A37n7k33J93j82L2m7O7l2p5J83n2P7j12M2j0K97j81J71k22K89k26k84J80
$$ plain form
2003 22 -123 -151 -107 57 -322 -3 -199 25 -206 158 -89 -101 41 208 189 218 23 24 21 -67 -203 -71 10 -61
2027 -61 92 -26 187 254 -45 -92 -73 54 -68 144 -94 -232 147 111 -92 -204 -19 193 11 -219 -114 -271
2049 -271 -247 -240 -172 -158 -119 55 -367 -222 5 -101 -113 -143 -241 28 -136 127 -130 -135 -159 -91 249 -244 93 170 -117
2074 -117 222 -323 51 -79 72 114 -11 251 217 135 94 -12 -61 -47 81 2 200 0 73 62 63 -145 91 171
2098 171 -70 -27 8 157 22 -242 -14 45 -236 39 -62 -129 -24 -44 -444 13 -49 83 200 29 140 -22
2120 -22 80 -31 -66 -73 232 4 8 -34 38 83 -34 41 -119 -17 -32 184 326 -1 263 145 56 211 15 166
2144 166 130 39 -111 26 97 78 112 200 33 289 102 -82 24 -14 -180 -162 -178 62 -123 -288 -73 -115 137
2167 137 80 -153 40 -142 -110 -157 -90 -122 -197 -14 -66 11 -101 -59 -69 228 47 218 -4 285 59 -225 -45
2190d5L1J66p3k75J81q3%K39J10j21Kj8Q5j23k49M50j34J83m34K02J6J49j49o3
2214D7k38J78L27k23k34J04J20n1j41J30O9j65J9J55J74q6l01K26k88J38j1R6
2236D5mL5ll7l9k89N24l5j88J67p9j34n2K2K14k29K9O0J42j17M5Kj12j86J57q6
2262a48J89n5O2j25L9M3J07j99p3N9N9L08l25nj08pK25N9k30k29O07l53N9k07
2286b48J93L1N9j12j02j8KJ59j24J65P8J69l73Q9kj24j78j5K02J88k19n2l8L14
2310D4J60j82j6R9k31J06K48j86M1j55LN9p9n0L50j68l4L1j03K36k85J34K05j75
2334E2n5R6M3R3j17k07J95m7o5P7J83j92O2l6j22j61K16N5LP0p2j3LQ5j31M0o4
2361iL6n7R0Q1j10j3j21J34N0j1k84K91q4J09k66L13j82J77k37k2K32k60Rok8
$$ plain form
2190 -45 -14 152 79 -196 -15 -98 -98 141 251 130 132 114 199 76 -173 277 143 326 -108 94 110 259 110 47
2214 47 -191 -13 314 91 -143 -39 81 30 -111 19 88 -77 -58 97 271 185 -116 110 -178 -40 -51 45
2236 45 41 76 73 36 -3 -292 232 197 9 176 97 -37 -89 -67 147 -82 -53 7 149 32 77 79 -33 -219 -62 -148
2262 -148 41 -14 48 -77 -38 5 112 -87 -160 -101 -42 266 -59 -64 -172 -179 46 105 -125 -354 253 -100 -41 -248
2286 -248 -55 -24 35 -77 -179 -197 -195 -36 -160 5 83 252 -121 -32 -34 -158 -336 -351 -149 39 -180 -232 -270 44
2310 44 204 22 6 105 -126 -20 228 42 83 -72 -69 -10 -89 -139 211 43 9 40 -63 173 -112 22 227 52
2334 52 -3 93 136 229 112 -95 100 53 -12 65 248 56 118 82 -40 -201 15 70 73 143 71 58 61 146 15 55 -9
2361 -9 27 -30 60 141 31 18 -103 31 81 70 -214 77 -7 102 -164 149 -33 144 -93 -115 117 -143 -134 -140 -168
2386a68q4J74J38n9n6J37j87J61r7oj33K90k62n5K14J83j29o7j9p3J33J40r0n3
2410C2p2K09j70k7P0p7J16M6j11p5J19o5j66J86N4J4k30K03k67N7L8K72j73K6
2434IM8M1j40j09J19Q6o5j7K63k00L9k00K26k2j41j1J00o8j0o7P9R2j78J84L1
2459H9o1O6r1j03k17M75j95Q9l1j17j48K53P4j34R1j49m8J60m2j05L6L14k13n4
2483f1J5j48J11L3K16l05J90l17M20j20J26j8k44J71J91l34J34mj58K90j00p7
2505A1l4N1k69J79M84j99m23K69q0qN5m6j0R8n8L0L9j68K15o3k96J99j74J62J36
2530A00P9j31j4q6J29k29o6L19m6%Nj07j8J02j05P8k23L4J12L1L2K6k26L98j5
2555A79k24P4jr9L01k60kJJ34l8j51J63j11J31l1m8m7l9L5L1P6j81K17J11n7M1
$$ plain form
2386 -168 -252 -78 60 1 -55 82 -105 56 -41 -47 -180 110 -152 -207 7 190 61 -6 -25 -98 35 175 85 32
2410 32 -40 169 -1 -28 42 -35 81 127 16 -59 60 -5 -171 15 69 83 -147 56 -211 -154 -116 156 -17 9
2434 9 57 98 -42 -151 -32 54 -11 -28 235 35 74 -126 100 78 -63 -74 26 -42 -52 -119 -40 52 -126 58 89
2459 89 28 94 3 -100 -317 158 -37 52 21 -96 -244 9 83 -51 40 -109 -157 3 -39 -144 -108 206 -7 -61
2483 -61 -46 -194 -83 -50 166 -139 51 -266 154 34 160 142 -102 69 260 -74 60 56 -102 188 88 11
2505 11 -23 28 -241 -62 422 223 -200 69 -11 -19 36 -10 -20 78 20 50 89 -79 136 73 -223 -24 -198 -36 100
2530 100 179 48 34 -52 77 -152 -218 101 55 55 60 -47 -65 37 -68 10 -213 -179 -67 -36 -4 22 -204 194 179
2555 179 -45 29 28 -71 230 -30 -32 -31 103 65 -86 77 -34 97 66 18 -29 -68 -33 -2 74 -107 110 221 164 205
2581B05l49J22J2J7j70L34L7l9o5r3J23j14j11M37Jk46R4j11J14L1j13j01K16
2604B31l23J46J2j94O5j41M03k93K67lN1r2k30J33q0n5J15J83j89M9m3p4R7J68
2628B03j50P1R5j03j19O0o6J34j20k29J52P4Jk58M31j72q3K61k3L4R4l71O1j4
2652c7n2M2j91k16N45j3j35J40k08K01r5J20k83R1j19Q4J31j50J94j66L45l16
2674h8P5M40n13k28K98N0j74K98k68mq3O8j81M17l21J23Q1J36l35L7L27j78J12
2697H9p6p6L9L2J40j38l9r3R1K12j46K01j03k62K67%l14J04P5O0NK75k00j29l04
2722b90K63J84j82n4K37j37k2l8O4J10k18j69K65p1K0J12Q4l32J80R3k20q0lK17
2746A3j17J39k89N1M38k77j56N8P4P4k3N1r8K40l31J32q8j35K41P5r6J11k4Q0
$$ plain form
2581 205 -144 -22 -10 7 -163 171 208 169 104 11 134 20 -91 346 347 101 195 84 198 229 116 15 231
2604 231 -92 54 66 -128 -63 -204 199 -94 173 170 221 129 -101 32 -48 -103 12 195 6 55 12 -62 35 203
2628 203 53 124 219 116 -3 57 -9 125 5 -224 -72 2 3 -255 176 4 -79 182 159 193 287 -84 -23 -37
2652 -37 -89 -47 -238 -454 91 78 -57 83 -125 76 -19 101 -182 -91 -210 -126 5 -145 49 -117 228 -88
2674 -88 -13 427 -86 -314 -16 34 -140 158 -110 -114 -197 -129 -310 107 -214 -91 -10 126 -209 -172 155 -23 89
2697 89 13 -63 -24 8 148 10 -29 -122 -31 181 35 236 133 -129 138 138 -176 -72 3 63 68 343 143 14 -290
2722 -290 -27 157 -25 -79 158 21 -1 -39 25 135 -83 -252 13 -58 -38 74 158 -174 6 99 -121 -201 -204 13
2746 13 -104 35 -254 -203 235 -42 -198 -140 -66 8 -15 36 -62 178 -153 -21 -109 -244 -3 72 -24 87 63 143
2770A43J57k17P8j61J65J54k83n2J72l85L28K4j42J64J6J1j20j1q2K38o6k41m8
2793a58M4L14l48q6J81j9J99j92lK09k07j55K22J17J6k06L02k45K92l87p7J39
2815d8J95j34p9J16l5j10K53n3m9P7j38L2O0j28J56j39J04K2j11M09l16j84J04
2838Dj5J61k59N14m84k7j28O7J91J8l72J88J12R2j05k6k72L95r9q9J1J44L5r1
2862c5p9J89k78J48L48l59J86Lk05Ql5L36k30J06p9j18J54m3K03n4o6k12J59M3
2886I0k4Q1J55o5k91K19J38j48k81K85k4k19J57q1M4j61p2J00J67j48l7K1K38
2909A44j10l3j35N0K02j73K27m10L6K27l05K96j2N8O8o7M2j35K77l81L20k12J83
2932A57J01l66J37J62l4j95L8pJ43M1j7k64l4o4J15r1K66n6o2q6J07J33j76j59
$$ plain form
2770 143 300 83 161 0 165 319 36 -16 156 -229 99 123 -19 145 161 172 52 41 -41 197 131 -110 -158
2793 -158 -114 200 -148 -234 -53 -72 127 -65 -68 141 -66 -221 1 118 134 -72 230 -15 277 -110 -187 -48
2815 -48 147 13 -66 50 15 -95 158 105 56 133 -5 27 87 -41 115 -24 80 102 -9 400 84 -100 4
2838 4 -11 150 -109 405 -79 -106 -234 -167 24 42 -330 -142 -30 62 -43 -69 -341 54 -45 -134 -123 21 56 -35
2862 -35 -114 75 -203 -55 293 -66 120 123 -82 -74 -109 227 -3 103 24 -94 60 17 220 166 100 -112 47 90
2886 90 66 147 302 237 -54 165 303 155 -126 159 135 -84 73 -8 36 -125 -197 -97 70 -78 -115 -94 144
2909 144 34 1 -134 -84 118 -55 172 -238 -202 25 -280 16 4 62 130 63 105 -30 247 -134 186 -26 157
2932 157 258 -108 29 191 157 -38 0 -7 136 177 160 -104 -138 -202 -87 -178 88 32 -30 -116 -9 124 -52 -211
2956b11J56R3j86Rr6Q3L97m05K15J96j45j88P7l6m0R2k11K23L2j27M7K02k11J5
2980a9J49j11r7Qj44K29L0j47K05r1m9J57K7J37k28K5r1j85O7J51O2m5%k42K42
3005D0r6K12j47j4m8N1J30k56Q5L15l09r2R1R5J56j65J0j28J31j06J7k1k35K68
3029a6k8jP7K3o0K2j96J31K37k2j87J06k25R5O8j0o2J36j33K02k14N3n8J46J6
3054A00O1j80J72k80p5M60n40L14J4KL5jL8o3j14Q5P5n9j25O6j11Q7Q6J53k48
3079d8RK5K3J96l48j5J46j03K20J05j82J50o0j03P4J0P2Q8n0k34R3N5p9J47R6
3104B87n47K80O6J21n6l9k47N1J50p1J48l25J81p5N3J51l4O0k85k64L61j36J58
3127a2K5j03Q8j70K29L1j31R7p1o8O2j66N7J14k49J53n4J15K6K10m13QL10j94
$$ plain form
2956 -211 -55 38 -148 -139 -235 -152 245 -160 55 251 106 -82 -5 -41 -81 11 -200 23 55 -72 -25 177 -34 -19
2980 -19 130 19 -78 -70 -214 15 45 -102 103 12 -37 120 147 284 56 81 -10 -195 -128 23 85 40 40 -202 40
3005 40 -56 156 9 -5 -53 -2 128 -128 -43 272 -37 -129 -38 57 213 48 58 -70 61 -45 -28 -49 -284 -16
3029 -16 -44 -45 32 55 -5 17 -179 -48 189 167 -20 86 -139 -44 24 14 -48 88 -45 157 -57 -4 -62 84 100
3054 100 161 -19 153 -127 -202 258 -282 32 46 48 83 82 120 57 -57 28 103 44 -81 -15 -126 -39 47 200 -48
3079 -48 -39 -14 9 205 -143 -158 -12 -115 105 210 28 178 118 15 89 99 171 259 209 -25 68 123 44 191 287
3104 287 -260 20 86 207 151 112 -135 -84 66 -5 143 -182 -1 -76 -23 128 94 154 -131 -395 -34 -170 -12
3127 -12 13 -90 -2 -172 57 88 -43 54 -17 -85 -23 -189 -132 -18 -267 -114 -168 -53 -27 183 -230 -222 88 -106
3151a06J70p0J17j88J24j5j23K00j65J0J27k84J93j10J3j44J56K6L8n9oJ41JM1
3175H7k93J90j69K63K3k90J87J8P8m0J27k95P1J13M6k17K73k42J3nQJ46k84L62
3199A70m2j03o4J07k35L91k27M0j68j37K18N7L04k58n8J60j74J11l6j14J6k31
3221b73L00l0J68j27J6l0j85o7K14%J9r5O2P0r2O3J44j72J64j02k03K74q8J66
3245A96R2m27L24j87L0k2Qj01lJ89q1RR6j61j33J99j90M58l81j08J56o8pR5M1
3270B4j32J67L6k02l0R4m8J4K06m81M05j23QMj3J75j89M7N0l2j3o1K05j6P6k49
3296g8N7k8j58J79J77k03N2L11k9j57J37k69M5Q4j97Q8k55K95k11q5L72R9l07
3319h1N0mKJ71M6j96r3q9M3M02j23j37K4J95l30J00L13l78J8L05l84J84j06L12
$$ plain form
3151 -106 64 -6 111 -77 47 32 -91 109 -56 -46 81 -203 -10 -120 -107 -251 -95 -69 -31 -90 -96 45 46 87
3175 87 -206 -16 -185 78 101 -189 -2 16 94 54 181 -114 -43 70 116 -101 172 -70 -57 -62 -54 92 -192 170
3199 170 128 25 -39 68 -167 224 -3 37 -131 -268 -50 7 311 53 -5 155 -19 92 56 -58 -42 -273
3221 -273 27 -3 165 38 54 24 -161 -228 -14 -14 5 -90 -28 42 -50 13 157 -15 149 47 -156 118 30 196
3245 196 288 -139 185 -2 28 6 14 -87 -90 99 18 27 123 -38 -171 28 -162 296 -85 -193 -37 -105 -112 -17 24
3270 24 -108 59 95 -107 -137 -43 -91 -77 129 -352 53 -70 -62 -58 -71 104 -85 -38 12 -20 -33 -94 111 95 171 -78
3296 -78 -21 -49 -207 -28 149 -54 -2 309 280 123 260 -9 36 120 -77 11 -244 51 -160 -245 127 226 -81
3319 -81 -31 -35 -33 138 184 -12 -105 -194 -151 251 128 -9 15 210 -120 -20 293 -85 -67 238 -146 38 -68 244
3343B44l46j13K56j35K30j65J47k40J68r6J30j28N6q0R0L3j82K08j8N1N6j39n3
3366b6l4J01J92j68P5j86j17k8L7L31n9j19l19K23K25r5K9n8o7J32q1q9N5k07
3390b53J56O1M8j87K18M5k52J19L0lJ59m49K61J57O7j31J77l01K44j32l6l2J91
3413A57j34J72r6q6j4QK3K1Jj82L07j09k67K57p7p7J04J71j45Q2N7l82L42k81
3437a48K96j67o8N2J32k63J51J0nJn9k02K92J22j79J38k30L67j27k54Q0J9J52
3460A10j78J71k27R6k61M72k61J93k73J74KJ00k07J36j39J2J07l6L3m4Q0q8Q3
3483E5PO9m24K19l8K2K08J0k46J21J84k29K44j68J74p0j86J93P3j16K8l09J35
3506d4n7Q8L3j35J13N7LRJ87k06N3k40J83m2k72L17R7j85j24K00j67Q2J69j31
$$ plain form
3343 244 -102 -215 41 -94 136 -29 118 -122 46 -50 80 -48 8 -72 18 51 -131 77 59 110 166 27 -26
3366 -26 -60 41 233 65 140 -46 -163 -191 -154 177 118 -1 -320 -97 128 33 62 4 -63 69 -12 -101 -46 -253
3390 -253 -97 -36 12 -175 43 88 -164 -45 -15 -18 141 -308 -47 110 177 46 223 -78 166 34 -2 -34 157
3413 157 23 195 99 13 -1 7 30 51 52 -130 177 68 -199 58 -19 -96 8 179 34 116 173 -209 133 -148
3437 -148 148 -19 -87 -35 97 -166 -15 -5 -10 -9 -68 -270 22 144 -35 103 -127 240 113 -141 -61 -42 110
3460 110 -68 103 -124 -28 -289 183 -78 115 -158 16 18 118 -89 47 -92 -80 27 -9 24 -20 60 -28 55
3483 55 62 131 -293 -74 -112 -90 118 128 -118 3 187 -42 202 34 208 138 -48 145 218 102 130 -179 -44
3506 -44 -101 -13 20 -115 -2 55 58 67 254 48 101 -139 44 2 -270 47 144 -41 -165 35 -132 -50 119 -12
3530a2L7j26J65r2Q6J73l05R5r9P9j00j89K1L96l50J58m0J25k29K02r4J32O6k19
3554a20J78j31N9J31q2J89j89N4j62J32k17K84m8P1j27k1Qk97K88l3L0k1J04p0
3578A0J6P8j57J4R2l9k3j18K87k35J69j61LJ43k11J02J01l32L52j10J0J48k57
3601a18K13j50J57k67J05j00K67r8o3P1j35L65l13m6J69j11%J12j75N1J43nr3
3624b1K09j9q6l3K22m15J26m3J9p9J43l1k1J84j53J6N5O2k60P4M2j05J27O5k26
3649a48Q9l7J01J55l3q1k0J5K27k33J16j30K0J5kj24J67j80j62K03n5J1R3L8k74
3674b29M00l15J58J02j15J94m06O0K34k7j36J21o9j39M8j11K06K6L7j06O0K48
3696B41k32j1J74l57K55k7j09N4P5j21J04p9K4l9J28Oj00O7R0l14J73L7q4J57
$$ plain form
3530 -12 25 -101 64 -28 58 231 -74 21 -78 1 -99 -288 -267 129 -221 -63 -103 22 -207 -5 -99 33 99 -120
3554 -120 58 -73 -14 117 35 224 35 89 -73 59 -158 126 78 149 22 1 9 -288 0 -33 -3 -24 80 10
3578 10 26 104 -53 -39 53 14 -9 -127 160 -75 94 -67 -64 79 -132 -30 71 -261 91 -19 -9 139 -118
3601 -118 95 -55 102 -165 -60 -160 107 9 -54 17 -118 247 -66 -112 57 -54 -54 58 -117 -66 77 72 -21
3624 -21 188 169 83 50 272 -143 -17 -60 -41 -120 23 -8 -29 155 2 18 73 135 -125 -51 -9 -114 13 78 -148
3649 -148 -59 -96 5 160 127 46 26 41 268 35 151 21 41 56 54 -70 97 -83 -245 -42 -97 -86 7 45 -229
3674 -229 171 -144 14 116 1 195 -211 -151 83 56 -80 41 -28 -167 -119 -230 -24 2 39 -67 -7 241
3696 241 9 -2 172 -185 70 43 -66 -12 63 -58 46 -33 -9 -48 80 86 -14 53 143 -171 2 39 -45 112
3720A12l6k3m2m9j4j88qM49q0J7j11l5l2j11J94K8pk3R3j52r7J71j73J33N6k11
3746a39J60j00l8K23j10J52k21K28j80K81M5m29J66l3J01j75K0l2J14J12p2j38
3768f5J7J08j26J81J47m56J47J02l6k15o6J36K45k57N6nL7K9l4J55k04K05j71
3791g0j26J4J80o3J89j05O7j47J73r3R3p7L8j92L94l98J66m4k95J69R1j1k54M16
3815A15j15k11J56j00J04J9M8P8l4J2q3J18k28R0rl0J27mk93O8N8K89n2r8j5m14
3841d04N36k23J31k90K75O4K2K68n06J17K10k69K19K5j0k3j7n3o7K41j73j62J22
3864C3l8j63Q7O7nj56J11Q6r0J93l21J81R0k0k4j22L4O0J48k40k4L63l05J83j80
3889e2n8J0K59K5j15K33m26Q1J65k11K02N1l21M17l78j11L98j87k37K42J29j39
$$ plain form
3720 112 76 53 11 -38 -52 -240 -248 201 121 138 27 -8 -40 -151 43 71 64 41 134 -18 -115 56 -117 16 72 -139
3746 -139 21 -79 -117 106 -4 148 -73 155 -25 256 301 -128 38 5 106 -69 -49 -81 33 145 73 -65
3768 -65 -48 60 -66 115 262 -194 -47 55 19 -196 -262 -126 119 -138 -82 -87 -50 -21 -55 100 -104 101 -70
3791 -70 -196 -182 -2 -65 124 19 86 -61 112 19 112 35 73 -119 275 -123 43 -1 -296 -127 -36 -47 -301 115
3815 115 0 -211 -55 -155 -51 -32 16 94 60 72 -11 107 -121 -31 -40 -70 57 53 -240 -172 -114 175 123 25 10 -404
3841 -404 132 -91 40 -250 25 89 111 379 -127 -10 200 -69 150 175 165 142 125 72 5 246 73 -89 33
3864 33 -5 -168 -81 -14 -19 -175 -64 22 -68 125 -196 -15 75 55 31 -91 -57 3 151 -89 -113 250 -55 128 -52
3889 -52 -110 -100 159 184 69 302 -124 -43 122 -89 113 164 -157 260 -118 -229 169 -18 -255 -13 116 -23
3911b3j19Q4J40j48J61j37k24K21K03l7j21p0P6j4j51K64k6j04j8J47j88N8K81
3934B55k42Q0k57J46n6NJ25J80k09Q8j19j2p8K04j34n8j23k53N61k14J08K00k94
3957i7J16n7K58j30j82J39n1J34j46K7L0j5Nj53K36j28j63J62K7qJ9N3r2r9J14
3982aj84K12j1J7n6J02q3m7O0L54j86j38j17J08L1r6j75J74Qj05k2K68K1k19Q8
4007CP9j51p9K28J10l36J13K72j70j23k3Q0R8mo4j1kl2J64j95J63j21j74K36N8
4032A19O7r8j44L4J80j51l2J34j39l3m9O0j19K40l1k2J22m89K79o8K62q2j31J19
4056B8l1j8j08P2m5K86j08l38L0L89j42k91K59N8J82k53J66q1N7k40L55l44J94
4079G7n5j92L36k78J12j36M01k92J12j29L3o4J60rk51N32k67q5Q7j80J83k26K74
$$ plain form
3911 -23 -142 -58 82 -66 95 -42 -266 -45 158 121 0 -70 6 -8 -159 105 79 -25 -43 104 -84 -26 255
3934 255 13 93 -164 -18 -74 -69 56 236 27 115 -4 -16 -94 110 -24 -82 -205 -458 103 -111 -3 197 -97
3957 -97 19 -38 220 90 -92 47 -4 130 -16 11 41 26 31 -122 114 -14 -177 -15 12 4 23 76 -16 -115 -1
3982 -1 -185 27 16 33 -23 79 -4 -51 9 363 177 39 -78 30 61 -35 -210 -36 -28 -133 -155 113 134 -85 3
4007 3 82 -69 -148 80 190 -146 -33 239 69 -54 -77 3 101 97 33 22 20 -12 152 -43 120 -1 -175 61 119
4032 119 186 88 -56 -22 158 7 -25 109 -30 -63 -112 -52 -171 69 38 16 138 -351 -72 -140 122 40 -91 28
4056 28 -3 -21 -129 -57 -102 184 76 -262 -232 157 15 -276 -17 41 223 -30 136 55 112 -128 227 -117 77
4079 77 22 -170 166 -112 0 -136 265 -27 85 -44 -11 -75 85 76 -175 357 90 5 92 -88 95 -131 143
4102A43M0j35OL45n00J32j10L6J23o7j3J6p7K52j38r4p2J61m3N4k28K18n9j91
4126b01M59k8j36k48J20Q1k70K94Q2j37K02l53K0J50k00J18r4J28J94l19K52m8
4148F6J46k12J89p3j98O9J16J0k61K07m0m5n3j03J20m7J48O6O7j79j53J30P6m5
4172An0l7R2k6j28R9J92J2p4J33k52J31j07J19r9K4o5k3q9J77l34J32L29J06l59
4197i6L36j81k00J85j68J12J82m96J76M12k06J56k00M4J80j68R7j40k25K16K7
4218D3r3K70l58L77m24L49k97J05K6n8K09k66J35j56p0J92p4J05j04J81k23J80
4240D9k18J03J05o7M8k24K75J1k35n3J19o0q5K18pr6KK1M6K24m1k26L9l5j20L60
4266A53J3k87k6K54l03J54J47k53K86l00L44l41K24R9p2N0p6r8j29J61K7K29o6
$$ plain form
4102 143 183 48 54 399 -101 31 -79 -43 80 13 0 16 -61 191 53 -41 -113 48 5 59 -169 49 -10 -201
4126 -201 258 230 94 -154 -34 47 -223 71 153 16 218 -135 -115 35 -165 -47 -141 -13 181 -138 114 66
4148 66 212 0 189 116 -82 -13 103 113 -148 59 19 -26 -79 -182 -62 -109 39 105 172 -7 -160 -30 46 1
4172 1 -49 -86 6 -20 -148 -49 143 155 81 214 -38 93 -14 105 6 30 -35 -58 -147 30 -304 -172 157 263 -96
4197 -96 240 59 -141 44 -124 -12 170 -326 -150 262 56 212 12 56 236 68 165 25 -200 16 43
4218 43 -50 220 -138 239 -185 164 -133 -28 -2 -60 149 -117 18 -138 -208 -16 -90 15 -89 92 -131 49
4240 49 -169 -66 39 -28 20 -204 71 82 -153 -206 -87 -147 -232 -14 -21 -117 -115 -94 -48 176 135 -91 -52 -87 -207 153
4266 153 166 -121 -147 107 -196 -42 105 -148 138 -162 182 -159 65 164 92 142 66 -32 -161 0 27 256 190
4289A90k07olR0j03J37j38R9j19J74k0j37N7l2Q8j65J56R0j65K46q2j70j17KR
4314a26J06R4n6n4j56J85L06k13j71L5j32J39O3k48Q1K70j86K38j78j9rk7J08
4337E0o2N3n2j07J40j17J82j5k48Q6R3O5J12j68J94l65KJ49J22k62J14o1n2J62
4361A5J08n8N7k72NJ85L3K1K6Q5j55n7J79k37L35k63j77P7J39p5J93k15o7K40
4385A22j47r3M28l30n9L27j71J40j71m7r5J10J12q9n7J03L5l3J26l60j1J14L2
4408a4K54k59L13j59k8j12j5K3J14j6j08p5j3K28l24R1N2j90K22R3Q1l02J11k
4432c5K05k43J36J03l42L26j15j38j07Q8K48j15M9J1J02p7jK9j51j3PK47l15J66
4456F5j4J44k14R5j23J16J55k42o0L2q5J13J00j59m6p0L42l21K84k07K38K49q6
$$ plain form
4289 190 -17 -23 -26 64 -39 98 -40 59 -60 114 94 -43 14 -18 70 -95 61 151 -14 232 150 -20 -137 -135 -126
4314 -126 -20 74 18 -36 -192 -7 299 86 -85 -50 -182 -43 20 -228 -147 123 -63 175 -3 -22 -31 -58 50
4337 50 -12 41 -11 -118 22 -95 87 72 -176 -90 3 68 180 12 206 -159 -157 -8 114 -148 -34 -95 -147 15
4361 15 123 65 122 -150 -145 40 73 94 120 205 50 -7 172 -65 270 7 -170 -93 46 -29 164 -51 -118 122
4385 122 -25 -118 310 -20 -79 248 77 217 46 -1 -96 14 126 37 -20 83 118 85 211 -149 -160 -46 -14
4408 -14 240 -19 294 135 107 -5 -20 3 117 101 -7 -82 -95 133 -191 -100 -48 -238 -16 77 158 -144 -33 -35
4432 -35 170 -73 63 166 -176 150 35 -103 -210 -122 126 11 60 71 173 96 95 124 -27 -40 -33 214 -101 65
4456 65 51 195 -19 76 -47 69 224 -18 -78 -46 -131 -18 82 -77 -123 -193 149 -172 112 -95 143 392 306
4479C06k41J86j69k10J92j80O4Q9k9M0J30n1j59j29K25j47j7K6J86R2j24K0o2
4502C8J68ok52j38J90JK86l58Q0K6P0n6n1j25P8J92j71J53j10r1K27l16K59N8
4526A52Jl5k18NL0N6k96N84l61J35j49N9K46j48K00j88P0q1j29M6r6K55N4k56
4550f4J64l21k7J80J44R3k08Q4N0o4j42M7m4j7J48l0J76j81j4r1J40k8O3r8q3
4575a23K29j96o9L7Q6J7l03K75K41j60M2k68K47j78J55k0Q1K48j97p1k93K30l24
4598c14M09j08R1p4k14L34l37L17M1m6n8J8p2J15m6r2n7K9n9N3pj2J81P4j91j91
4624b16K52R6j27J21k14J71j70J15M4q5L4j26p9L12k48Ml7K30k89K76N7J01k01
4647B1j6R7j02K98l78J51M3No9m0j09PJ50j68L2J21r5O1r0k2K69k04m9L09m01
$$ plain form
4479 306 65 251 82 -128 64 -116 -52 37 8 48 178 127 -32 -161 64 -83 -100 -74 112 204 80 100 38
4502 38 206 200 -52 -190 0 1 287 -71 9 35 105 49 -2 -127 -49 143 -28 125 15 -76 151 -165 94 152
4526 152 153 118 -100 -95 -65 -9 -305 279 -82 53 -96 -37 209 61 261 73 143 62 -67 -21 -117 138 192 -64
4550 -64 100 -221 -248 -68 76 169 -39 45 95 31 -111 -64 -108 -125 23 -7 169 -12 -26 -117 23 -5 58 -40 -123
4575 -123 106 -90 -159 -122 -36 -19 -322 -47 194 34 76 -192 55 -123 32 12 93 341 144 73 -220 10 -314
4598 -314 95 -13 78 4 -210 124 -213 104 145 99 41 59 -13 102 56 -36 -93 -64 -123 -70 -77 -89 92 166 -25 -216
4624 -216 36 132 5 126 -88 83 -87 28 72 -13 21 -105 -184 128 -120 -116 -153 77 -212 64 121 222 21
4647 21 5 102 0 298 -80 71 114 119 50 10 -99 -92 58 -110 -78 43 -52 9 -81 -103 166 -38 -87 222 -179
4672a79K22j15O4O6L4j04J44M3k09J3m7J20j28P2MK00m19K10J79k71K03Q1r5k33
4696a45J37%p6k2K33J7k2n8Jk33M07k20k4J96j27l60N25k24L5LR4k62J85k41k2
4721b03K56j88K05j42L88n74J31J22p6P6K04j69p8Q9j17J20L8j54K21k19R6l6
4743a0j6K35k91J90k83K69r5K19m80M20l99J87L9mr3J50m5M4J21k09K49k82J22
4766C8O1j47J92o9J79j84j70N0j60L87m81M85j92p2J50L1j71R5K04k05O4N3j74
4789c6M4K1r1O5q8J13M8k59K23p0m3K8j30K39k13j5K87k5j84R4l09L26K07l77
4813a45p2nK95k6j68K08j61j23J46j27J88l0L2J43k53r9J11j3K30j99J05P4k7
4836H4k39Q5L6J45j60O8p2J09J42j16L9J40m00Q1J72J9k11O9J60q0l20J01J57
$$ plain form
4672 -179 43 -72 -8 58 92 -12 132 175 -34 -21 -68 52 -76 -4 0 200 -219 -9 170 -101 102 183 88 -145
4696 -145 -8 -8 -84 -106 127 144 122 64 65 -168 239 19 -5 191 64 -296 229 5 40 43 137 -125 60 -181 -203
4721 -203 53 -135 70 -72 316 -258 -127 -5 -81 -5 199 30 -48 41 -76 44 82 -72 149 -70 26 -10
4743 -10 -26 209 -82 108 -175 94 -1 218 -262 158 -241 -54 -15 -19 -112 38 -7 37 158 -51 198 -84 38
4766 38 99 -48 144 75 254 70 -100 -50 -210 177 -304 181 -11 -83 67 98 -73 22 226 21 85 138 -36
4789 -36 8 29 -62 3 -85 28 76 -183 40 -30 -73 -45 -175 64 -149 -164 123 98 -86 8 -301 25 232 -145
4813 -145 -217 -222 73 47 -121 87 -74 -197 -51 -178 10 -20 12 155 -98 -197 -86 -99 131 -68 37 111 84
4836 84 -155 -70 -34 111 -49 19 -53 56 198 82 121 261 -139 -58 114 133 -78 -9 151 71 -249 -148 9
4859Ij88K87M0n6j19N0k9M1k3M9K2j51L3J8Q0l0J01l64J63L2j1q8J56K0O4P7K1
4886B04j18k80Q8K1K05kj10r3K85k83R4K28k58J23Oo0k16L18P2l55M41l44l9J48
4910G5O1j76o3K24p7Lk04K32%O4l42K50J2j24Q1J4K3p1K30l12J22J57k70K9J06
4935D4K03l13K67j62J3l2p0j22J86J52m8k51o4L03p2j46J6Q5K64k57j14N1L1j08
4959a44q1J86l1R2Mo7l7R4j02J62K7J53j87j45J54l03L25l3j6k01K84k36J92n0
4983D0Q6j16n3m1k29M35k22N9q7P7m9j74M30k42K80o7k73J6K38j18j12Q4J99j69
5007hJ53k10O8r3K02N4q7j14J7P6M9KJ26j48j33J30k0J6l9j91J09mo3N0P2lj81
5034a70M02k78k5M0m5K45l27R7K85l38J05k63L26l4N8k3o7P8l04L65k3j66J88
$$ plain form
4859 9 -179 108 148 92 -27 23 -6 35 12 61 83 -68 -35 -17 63 33 134 -230 -67 -35 -46 -134 22 42 106 183 204
4886 204 86 -194 -106 -85 120 118 8 -85 200 -83 11 239 -19 104 110 50 -166 152 224 -131 310 -34 -73 75
4910 75 136 -40 -103 121 44 47 -157 75 75 139 -203 47 59 -65 16 30 53 -18 212 -100 22 179 -91 -62 44
4935 44 247 -66 201 39 52 20 -50 -172 14 166 118 -133 -197 106 34 -112 -96 -11 253 -4 -118 -67 -36 -144
4959 -144 -225 -39 -70 22 26 -41 -78 16 -86 76 103 256 69 -76 78 -225 100 67 51 -150 134 -102 90 40
4983 40 126 10 -43 -84 -313 122 -100 -41 -128 -51 -100 -274 156 -86 194 127 -146 -130 108 -10 -122 -38 161 -8
5007 -8 145 -65 3 -90 112 166 79 -35 -18 58 107 109 235 87 -46 84 64 80 41 -150 -41 -45 -108 -58 14 11 -170
5034 -170 232 -46 -71 -31 -76 169 -158 -61 224 -114 -9 -272 54 20 78 55 -12 66 -238 127 104 -62 126
5057A26j90K68j4M0j90Pl71K86K9J76q1M8j21o5J7O6k4j7QJ4%q3K44l22J87k27
5083a89J82K9Q0j42J27j42Q1oo6m2K82J90n01K45j2k2L3j27r1m4J61J73k62L2
5107c1K8J34j07pP0j21rQ1J19k41K5L6J40O7k63k1J13j86K64j60J24j62M8O2r2
5132h9l1J28pq5J57K3l2q3o1K70l46j6j19L32o2o3J37o3P9j5j43J48j21k8O4m3
5158f9K1j6J75j97J51J82j82J98l65j6O2J04Oj39j9K1N9J14j07l3K7J17j41J4
5182c3J84p7k08oJ77r5J87j71R1j45K7L4J72p6j23J52j76M4J07l39J65J14m7O9
5206B7j39O8l1L07k77J24j88J50J00k3j16rJ38k81M3n7K09N2L4k70K14j14P1P3
5230A05q9j57K63j94M5Q5J47qJ20l61J06J59r5k70K05J34k60R2P1l1J80q5p8k43
$$ plain form
5057 126 -64 204 190 230 40 47 -324 -38 -9 167 86 134 13 -52 -35 31 7 -10 -2 12 12 -71 173 -149 38 -189
5083 -189 -7 22 102 -40 87 -55 26 20 -46 -88 194 384 -117 128 116 94 127 0 -91 -135 26 199 -63 -31
5107 -31 -3 131 24 17 87 -34 -43 38 157 -84 -59 -23 117 184 -79 -100 13 -173 91 -69 55 -107 -59 3 -89
5132 -89 -120 8 1 -84 73 96 64 -19 -80 190 -156 -172 -291 41 -21 -84 53 -10 69 54 -89 59 -62 -90 -26 -69
5158 -69 -48 -64 111 -86 65 247 65 263 -102 -118 -56 48 54 -85 -104 -83 -24 90 -17 -50 -23 94 -47 -33
5182 -33 151 74 -134 -140 37 -58 129 -42 49 -96 -69 -35 137 61 -62 90 -86 -42 65 -274 -109 5 -42 27
5206 27 -112 -44 -75 232 -45 79 -109 41 141 118 2 -7 131 -150 -107 -164 45 97 131 -139 75 -39 32 105
5230 105 16 -141 122 -72 -27 58 205 197 317 -44 62 221 126 -144 61 195 -65 27 98 67 247 162 84 -159
5254a59O6J41p2j50K29J79j18k91K14r1j29K66j47q9J21n7j78L80j79O5n2j15
5276a66O7P1J95l25l2l8R6P1k30L74k04K90k89K54n2Nn0K9K8j11L8J19k6k31J81
5301F4K4j74J72LJk78P6Q5k18J99J36l5p4P4m4j7M1J1q5L6j45K51p0Nj30m9QJ88
5329E5n8r4j51M86j73j49r6K26j88K9J54j11k3j1J07q0J35j55K07n0l74L02r1
5352a03J04j1j40M86k27k19k7lJ75P9j76K54j13j51r7R4R8l01N09k37J5j4J93
5375A88k59M6j6j69M51r1j56J39o6o7j28N6M2M6K04l98RJ22M1J46k3q6l58L98
5399G1o2L2o0O3n23O36K3k19K63l01K63J9j35j99L12q0j11O1P0k46K47j9r0J92
5423B07j02l9j21J81j95J62j59K30N9k63Q4l13K73Q8l83J70q9K70K50l71k01J99
$$ plain form
5254 -159 -93 48 -24 -174 55 234 116 -175 39 -52 -181 85 -62 -151 -30 -87 -265 115 -64 1 -51 -166
5276 -166 -99 -28 167 -158 -190 -228 -132 -61 -291 83 -121 169 -120 134 82 87 37 66 94 -17 21 140 114 -117 64
5301 64 88 -86 86 89 90 -188 -112 -27 -245 -46 90 55 -19 55 11 -6 35 46 -39 -3 -148 103 33 38 -92 -141 -133 55
5329 55 -3 -97 -248 238 65 -84 -180 46 -142 -113 41 -70 -93 -104 3 -77 58 -97 110 60 -314 -12 -103
5352 -103 1 -10 -150 336 109 -110 -137 -140 35 114 -62 192 79 -72 -169 -75 23 -278 231 -6 9 -5 188
5375 188 -71 -25 -41 -210 241 150 -6 133 67 0 -128 -72 -30 16 220 -178 -169 -47 -6 140 117 31 -327 71
5399 71 9 41 -19 44 -479 157 180 -39 224 -77 186 205 70 -129 183 103 -8 53 123 -123 124 105 15 207
5423 207 105 66 -55 126 -69 93 -66 164 223 -40 44 -269 4 92 -291 -121 -210 60 310 -61 -262 -63
5445f3J83k18K53j57j40J15k25K09J45k11J1Q8J44q9j16J39j0p8K5J79r7k50M4
5468a19L6j45M0L88n1k53l0K60j98K59k85K59j59j57K1J20k31K43J13q7l9J6J59
5491A60k71J23k29J36Q8j83P7J08j6O2l6J30K8j09j44k5J19J8j13r9OR3O2N0M3
5516G8k8L42m21K9k3j91J50M6J00qK3p6j11K15j11j08j36L78j71J25j10L9j20
5539h9M7Q5K70j79j81J10j51lp1K72l0j79R8j3Q8m5j37K5J26j43pQ6M0j5J36l11
5565a71L27j84K4k3J8M8r6N9m0J15j21R0Q4j36J4j19N06l67k1Q5qp2k27MK22l6
5591b5J22k48L2Q0K52j83j1j2R3j91j98M50Lo6q7o3K18j40J49o0K60l87l6m9J59
5616F2j42j28K56N7j61r7K05j10OJ58k18L8J10j78rJ61j27J67j26J67o4j02J24
$$ plain form
5445 -63 120 -98 155 -2 -142 -27 -252 -43 102 -109 -98 -10 134 45 -71 68 58 -20 5 184 87 -163 -119
5468 -119 -83 -228 -188 200 149 -104 -134 126 -72 187 -98 161 2 -155 -134 -14 -245 -2 111 24 -15 1 160
5491 160 -111 12 -217 -81 7 -176 -99 9 -7 55 19 149 177 68 -76 -101 18 36 -77 -176 -170 -77 -15 35 78
5516 78 50 392 -29 0 -23 -214 -64 -18 82 74 97 21 -90 125 14 -94 -230 148 -23 102 -8 31 -89
5539 -89 -42 43 313 134 -47 63 -88 -91 -162 110 80 -99 -1 -14 74 29 -108 -83 43 -100 -107 -21 19 4 140 -171
5565 -171 156 -28 -4 -27 -9 39 -57 2 -38 77 -44 46 130 -6 8 -111 395 28 7 92 84 12 -215 -211 11 -25
5591 -25 97 -151 -119 -39 213 30 19 7 100 -91 -289 161 164 98 11 -52 166 26 175 115 375 -12 -48 -97 62
5616 62 -80 -208 48 105 -56 -153 52 -58 -52 106 -112 -74 36 -142 -151 10 -117 50 -76 91 27 -75 49
5639D9l3K9k30K70j65R8J52j62n5J7k7J98j73Q9k86J90r4R1L6j07n1p6K55O8k73
5664a90K27m6j09J36o6jn4Q4o9O6J71l07j4L58k99J49j3j19oJ40k5N1N3J70l44
5689e7m6J26q7L0J46k74P5J15J51J3l73L80k85J31j95R2M6l8M2r1J00o1N5J1k2
5714a6P8k85M07k86N6J84o4o4J7OO7K6l09J1L75p1r8K1j06j2J55j00L6Oj16p5
5740a57J94R9k81q9r2K40K15q5j8J04l81K48l5k0L5lJ19j53J69k87K5M4J50j61
5764a20l8J76l6K2k42J66Jp8K01O3j10O2j02J32p6m1L5O0k31m6L43l3Q2r6j05
5789a1K0L39m18k03P5jK75m6j10L48k38j54L62j92J8o2k46K36l7R2m1J48j72j10
5813a28J86j72R1j39O5J30r9R0O8J66l10J48jk12J01R5j26P3j29k4K44k44OL45
$$ plain form
5639 49 16 45 -185 85 -80 18 170 8 -47 -30 -57 141 -32 57 -229 -39 -133 -42 -6 -113 -164 -240 15 83 -190
5664 -190 37 -9 -118 18 -48 -49 -103 -19 -88 -22 149 -158 -172 186 -113 36 23 -96 -102 38 13 64 117 287 -57
5689 -57 -103 23 -64 -34 112 -162 -87 28 179 192 -181 199 -86 45 -150 -58 -12 -50 -8 -99 1 -60 -5 6 -16
5714 -16 62 -223 184 -102 -46 138 74 10 27 33 100 126 -183 -172 203 132 34 55 -51 -63 92 -8 28 34 -82 -157
5740 -157 37 136 -145 -234 -326 -86 129 44 26 130 -251 -3 -38 -58 -23 -26 93 -60 109 -178 -153 -109 41 -120
5764 -120 -158 18 -18 4 -238 -72 -71 -149 52 115 5 67 -35 97 21 -20 15 75 -156 -202 141 108 190 94 -11
5789 -11 9 348 -70 -273 -198 -199 76 30 -80 268 30 -124 238 46 64 2 -244 -8 -45 47 6 154 -18 -128
5813 -128 58 -114 -23 -162 -97 33 -66 24 92 258 -52 96 95 -117 -16 79 -47 26 -103 -127 117 -127 -121 224
5837B24k26k28J90N5Qk65K42k0J14j06J5M8j46k6K79n1K3k63K99k81J57l3Q0k6
5861F3r0j9%p5K14j03Q4j36R3m9K3j18Q8J30k17J76p5P7M3j29l4Q0L2k12J76m9
5887b7o2J23K39j43j71m0K36j53L1R6p7j04P5j22K14m2k80N5K29j57p5R3p3N2
5911h3K51j54l29L42j57o1J91j56J54J52o5m1j0K2r7l01L61O6q5K94l91K13k33
5934a17O7p0M7Q9j85J04J48Q4j85j09J98l8k05M60m16K08n9j42q8L30j11P9N9
5957A48k31L19j20l2k25J47M0j83K26Qn6j60J80j37Q4J09j30R0k13J99J3j54J29
5980E1N1j10N0q6M7K64l62PJ48K71l90K46k87K39p8N3k12J61M3j30p4J02j07J63
6004F0J21j14J15j10J37p6k79N46l09j96O7M8j31n1J49l1P0KJ12l13J73l2K64
$$ plain form
5837 224 -2 -230 -40 15 23 -242 0 -20 94 -12 3 51 -95 -121 158 107 130 -133 166 -115 42 9 89 63
5861 63 -27 -46 -46 -121 93 -10 74 -62 31 -18 5 -113 -25 105 -112 64 -11 66 109 -20 -54 26 58 -154 22 -27
5887 -27 -89 34 273 130 -41 -81 155 2 33 129 52 -52 23 -99 115 73 -207 -152 77 -80 -155 -62 -135 -83
5911 -83 168 14 -315 27 -130 -191 0 -156 -2 150 85 44 34 56 -41 -342 19 85 0 294 -97 116 -117
5934 -117 -50 -120 -73 16 -169 -65 83 167 -18 -127 71 33 -172 288 -128 80 21 -121 -209 121 10 89 148
5957 148 -83 236 116 84 -141 6 46 -137 89 97 41 -119 61 -76 8 117 -13 77 -136 63 76 -78 51
5980 51 102 -8 42 -44 3 267 -95 -88 60 331 -59 187 -100 139 61 114 -98 63 106 -24 -98 4 -103 60
6004 60 181 67 182 72 209 133 -146 400 91 -105 -38 10 -121 -172 -23 -54 16 18 130 -183 -10 -42 222
6027B22j41L8j27K51l21m9L95n74L72k19J17qj18K7J71k07J68q6K24j82Q3p8k4
6050f6K66j19j08O5M6j59J89j39lK14l67K55KQ4k19J00j19L2J52k00N7J10N1j45
6074b1N5q2J58k99J46r2j64J15L34m8m19L14K07j38q5r0O1J2n3J51J0p3N0%k8
6099B1KJp3J95q7r0mmJ29j20N7l10K95k28J62K40j46o2J9O4m3p8J04K0pj62k8
6126a33K00j37K14j58O1l9r0J44k58L53j14j70j%L11k46O0k40K46J97k69o4J55
6149B2j17J7N8R2l20J88J2K02k63K9K94l24K65k11R6k42L21j91K12k55J77p8K0
6172Dj03J29l7QN3j49N0k2J32r0j2n7J61j23K0j11L86k27J82j95J20NQ8l24J05
6197gO7P4j86m3J02n6n6q1J64k10Q7r0K27r2J92J31k42Q4j88R6p9K4M2J37k17
$$ plain form
6027 222 81 119 -8 243 -78 -127 268 -306 66 -153 -36 -44 -162 -135 36 -171 -3 -89 135 -47 36 -42 -66
6050 -66 200 81 -27 38 84 -75 114 -25 -28 186 -181 74 76 160 -59 41 -78 -46 106 -94 -37 73 124 -21
6074 -21 34 -48 110 -189 -43 -135 -299 -184 150 102 -317 -3 204 66 -19 -109 -48 -36 -89 62 72 -1 49 49 21
6099 21 23 24 -49 146 59 -31 -35 -39 90 -30 27 -283 12 -216 -54 186 40 -22 -3 61 18 -60 44 64 57 -105 -133
6126 -133 67 -70 144 -14 47 8 -82 62 -196 157 43 -127 -128 -128 183 -63 -3 -243 3 200 -69 -133 22
6149 22 -95 -78 -20 72 -248 -60 -48 154 -109 -80 214 -110 155 -56 40 -202 119 -72 140 -115 62 -16 4
6172 4 -99 30 -7 1 54 -95 -45 -67 65 -25 -37 -94 67 -56 -36 -147 239 12 194 -1 119 124 212 -112 -7
6197 -7 60 134 -52 -95 7 -49 -105 -186 -22 -232 -145 -235 -8 -100 92 223 -19 65 -123 -27 -106 -82 -40 97 -120
6222a20J29J02j41K05l26K1J03J15K5k84K26p6pn6m7n0J87q1J14o7J19k6r3L59
6246C31l55j54L62N0k80L2j89K08L23k40Q0P4j49K9OJ24m22K33k03N0K73o8l45
6269b30O3l3M40m01L9L32q0j74j8K24k91k15K85j13L5J3K09j86J55M2J36j20m2
6292G0n7Q7k3k02O2J07j30j5L8j25M93l11j05k09L95Q0j77J53j18R5q4k43M39
6315B20j29j81J28K20j21j12k8P0j63L11k33J53L7k02m2j55L20j22K40k10Qj68
6337a59K50k57K46l46J38Q5K8k30J61K0K61k18j47K35k90J71m7M7j88J65O8m1
6359d8J58j04Q3j4O7k3j12K6j18O6J54r5r6K5L7j53K26r4j9M8j0N2n3j25J81k9
6385C0J4m2K7o3k7N1O3j93P8N6J65n0k31N4l0K20j67J85j71O9l6n9J25q2j62L42
$$ plain form
6222 -120 9 111 -30 175 -151 -130 -27 88 113 -171 55 -21 -28 -84 -131 -181 6 -75 39 -28 91 65 -28 331
6246 331 -24 -178 184 234 -46 -14 -203 5 328 88 168 242 93 122 128 252 -170 63 -140 -90 183 115 -230
6269 -230 -167 -200 240 -161 -122 210 130 -44 -62 162 -129 -344 -59 -172 -137 -124 85 -101 54 96 232 112 70
6292 70 13 100 77 -125 -63 44 -86 -101 -63 -188 305 -6 -111 -320 75 155 -22 131 13 108 24 -219 220
6315 220 91 -90 38 258 137 25 -3 67 -96 215 -18 135 172 -30 -72 -227 93 -29 211 1 9 -159
6337 -159 91 -166 80 -266 -128 -43 -15 -245 -84 -64 197 -21 -168 67 -223 -52 -99 -52 -240 -75 -7 -48
6359 -48 110 6 89 75 142 119 7 33 -85 -19 135 40 -56 -31 6 -147 79 -15 -34 14 4 56 3 -122 59 30
6385 30 44 2 29 -34 -61 -10 53 -140 -62 -6 159 109 -122 -68 -98 122 -45 140 -31 38 2 -57 68 -14 -176 166
6411A66j19j09nK19k61O8pl6J58np5N0k24QR3J4JO4J20K5k26O6J21o6J4Nj8j21
6439h0J49j42J75k06J12m1P7n7l03K09L14j44j36J99m7n2o8m8N0j1J69j5k01R3
6463dqk95J15J16p3L75k07R2j45J57J1l33M43l36j7M2L6L3L3j01J10Kl36K58m
6488c6K27N7k95j18J76N1k12J62j85J15M2j7J59p7j97J36m1j5K22j48Q2j27K40
6511B01j78k6J1j48L69j9k44J03k56J6L66l74K51k4j78J13P8J1J83k64r6O7j53
6534a91Q5J37l6k40K68J30j39k8N2r4o9K97M3l36j3J42J04n7k16J14K9R1Mk40
6558a63J63j00J63k06K21j28n9K12j81K27k65J45j43K84j79j84K01Q0rj59K07
6579A27j31r0J28m1k1J42j25J73k4k00R8j56J26l18K74R6p4k1j58M7K51l45L92
$$ plain form
6411 166 47 -62 -67 152 -109 -41 -48 -84 74 69 -6 44 -180 -172 -79 -65 -64 0 120 145 -81 -15 106 40 54 59 41 -80
6439 -80 69 -73 102 -104 8 -33 44 -13 -316 -107 207 63 -73 126 79 27 -41 -89 -39 -50 119 104 -97 -4
6463 -4 -12 -307 -192 -76 -149 226 19 111 -34 123 134 -199 244 -92 -109 -67 -31 2 35 -66 44 46 -290 -32 -36
6488 -36 191 248 -47 -165 11 62 -150 12 -173 -58 -16 -33 126 49 -148 -12 -53 -68 154 6 88 -39 201
6511 201 23 -3 8 -140 229 210 -34 69 -187 -171 195 -179 72 48 -130 -17 61 72 255 -9 -105 -38 -191
6534 -191 -106 31 -5 -245 23 153 14 -14 38 -56 -125 172 215 -121 -134 8 112 55 -161 -47 -18 73 77 -163
6558 -163 0 -100 63 -143 78 -50 -109 103 -78 149 -116 29 -114 170 -9 -193 8 88 79 -80 127
6579 127 -4 -94 34 -7 -28 114 -11 162 138 -62 36 -120 6 -312 -38 58 -16 -37 -195 -148 103 -242 150
6602A50r3j10M9q9J57K9k14J43p0R0K33n5K0k30j40M12j28j82K05j73J4L2K8k9
6626D9J25r8l04J71J2l0k39L34j73R5P6k72J73p4J84j37J80K84n04J73R1k60n0
6649a94J84K39m94O4M04j74N6k12J68j58K18J76j89k78K35P4q3j12L40r4k90J95
6671G5j91K5J43J59l01Q4j08j08K86N1j39K44l37J1J02Q0j22j4P3j13K46k37j9
6694a10O8O2j19J89m5q7NN1M3j90L48k42M4J24k17M6R3j5J2q2J23J9j27L47m98
6719a58J49P4p2J19QN2j0j25j86K21j77L17k12r1K27l70J88P2k30L11k0j60N5
6742a8J67k01Km3L31l07K52j40j46L2J75o9j37K53k87M6J13J41j04K2p3j71K45
6765H3o7o1p7K27j08r0J17P8k40Q3J41j50J20j59M12j38k12K45j38J44j34j36
$$ plain form
6602 150 57 -53 -4 -93 64 93 -121 22 -48 42 275 220 240 10 -130 282 154 -28 177 4 18 50 78 49
6626 49 174 76 -228 -57 -45 -75 -314 20 -153 -58 18 -254 -81 -155 29 -108 72 356 -148 25 116 -144 -194
6649 -194 -10 229 -265 -201 203 29 85 -127 41 -117 101 277 88 -190 45 119 36 -76 264 170 -120 75
6671 75 -116 -91 52 211 -90 -6 -114 -222 64 115 -24 220 -117 -106 -4 76 -46 -60 13 -100 146 -91 -110
6694 -110 -42 20 -99 90 45 -42 -37 14 57 -133 215 -27 17 141 -76 -30 63 48 60 -22 101 120 -7 340 -158
6719 -158 -9 65 -7 112 120 172 162 37 -149 72 -105 212 0 -91 136 -234 -46 26 -204 107 87 -73 -18
6742 -18 149 -52 -50 -93 238 -69 183 43 -103 -71 104 35 -102 151 -136 -90 23 164 60 82 9 -162 83
6765 83 16 -45 -122 105 -3 -93 24 102 -138 -55 86 -64 56 -103 309 171 -41 204 66 210 76 -60
6787f0q0K43n0J61m30J67L02l10K6J38Kj30k3r5m8K03j20J23j30J06n9lR2R9l85
6812b61J91J3p7K31J9J11l4k37k36L48O0l77L9L71k92J30O0m6q5k0J73k62J81
6835@l8j0L1j69Q0m5J71m1L56l70km4j79K11J95q2p9p6N44l62j19q0NK2m2oJ41
6862A2J35k61J15J58j82j59J51n8K59j40j42J04J26l6j77R6p6J2J59n4k47J25
6884h0K03n0j72m4M0K21o9J6O9k64J46j00L3J9R3j51l31M16K27k31n5%P1j16J81
6909G2J20p3j40K60l10M5j45K46J37J3J15l11O0k73J42j47K94j01J8j68L08j46
6931A6r0N6J24l07Q1L9M9J09J07k67p3K3J0p1K50J58l52K17r8j07K28K1j46r2
6955a15J62j94K13p4k2k9OK19k03p7%J59o9J94j59K40m31L94k45j4j05J06j26
$$ plain form
6787 -60 -140 103 53 214 -216 -49 253 -57 -31 107 109 -21 -44 -139 -187 16 -104 19 -111 -5 -64 -67 25 124 -261
6812 -261 -70 -57 -134 97 116 227 193 -44 -280 68 128 -249 -210 161 -131 -1 59 13 -72 -92 81 -181 0
6835 0 -38 -48 -17 -186 -106 -151 20 -21 335 -35 -37 -81 -260 -49 146 64 -15 -91 453 91 -28 -108 -103 -81 -123 -129 12
6862 12 147 -114 1 159 -23 -182 -31 -89 170 30 -112 -8 118 82 -95 1 -75 -63 96 42 -205 -80
6884 -80 123 73 -99 -143 -103 118 49 65 134 -130 16 -84 -51 -32 61 -90 -421 -5 222 -9 -64 -64 7 -109 72
6909 72 192 119 -21 239 -71 -26 -171 75 212 225 340 29 89 -184 -42 -189 105 4 22 -146 162 16
6931 16 -74 -18 106 -201 -120 -81 -32 77 184 -83 -156 -133 -123 -194 56 214 -138 79 -19 -126 102 123 -23 -115
6955 -115 47 -147 66 -8 -30 -59 -53 166 -37 -114 -114 45 -24 170 11 251 -180 214 -31 -45 -150 -44 -170
6978a70k27M63j1O9k07K99l18j22L28k68MJ55P4k15O5J53O0p4j99J94P1j04N0
7001G0j23K55Jj91J14l06L31l43P2n5N7K8m2q1K41k0l4k27K36j78L44p1k12K35
7025A01j76J63O2j24J93l15k00L16J60n1j26J30m2r8KL03n62K92K9J80j26q1P5
7048A05j02k7K44k16r9m7J94o8j84K66Ok31Q5JJ28j83R1P6l63M50j07j0J55j05
7072E9rn4j92K58l48M36o1J03j53K72k07p6j28J73m2o5J43k04K2O2O0j68jM21
7096C01k08l73K18j3N2j60J85J04l13K46M1q0j98N0q1K61R8k10J83j98K25l3j
7119I6l8M0n4L9R9j1Ok88J62J5k09K46j82J43J8n2j51K50J88o5k57J4J3Q4n8l9
7145IJ04j86J54p6j58Q3N3K93m41O8L1J56J38o4k00P9j69L09k86K56p1j56L1O1
$$ plain form
6978 -170 -397 66 55 124 -83 216 -102 -224 104 -164 -160 -5 69 -146 -81 72 132 58 -141 53 124 20 70
7001 70 -53 202 203 12 126 -180 151 -192 -120 -175 -118 -90 -132 -213 28 8 -26 -253 -17 -195 149 78 -134 101
7025 101 -75 88 150 26 219 -96 -296 20 180 129 3 133 91 -7 -5 298 -264 28 57 237 111 30 105
7048 105 3 -24 220 4 -95 -142 52 -16 -200 66 72 -159 -74 -73 55 -128 -37 39 -324 126 19 9 164 59
7072 59 50 -4 -196 62 -286 150 89 192 39 311 104 28 -100 73 31 -34 109 -95 -73 -11 49 -119 -120 301
7096 301 93 -280 -62 -75 -23 -183 2 106 -207 39 80 0 -198 -148 -229 32 130 -80 103 -95 130 97 96
7119 96 58 98 44 83 182 171 177 -111 51 66 -143 103 -79 64 82 30 -121 129 317 252 -5 9 22 106 48 9
7145 9 113 -73 81 5 -153 -70 -17 276 -165 -97 -66 90 228 164 -36 43 -126 183 -103 153 82 -74 -43 18
7169A8J69j70J40j91J60l55L95Jk81K43L4k28Q1K10k89l7K21J38m8j5k59N7J8
7192A2O5O6k40J23j39J51j94N2l8o0J86J63j50k1r7J56J4n3LJ76j62J20J78j8
7216B93k85K6J4k7J46l54L7M9M6l1L06j91j9R4p2k79N05n5k91L95l75K7J42j58
7240e7J86j41J83o6j15O0M3J3j99J42K35J23n70J62K17j97N2q4J31j63K40j50
7262D5J6j14L43l26L9r4K17l61J40O2J91q9L6j89N0k9l1K09k84K24m3l18J27K84
7286A05Jk50L24j59k98L63j56j17J54j27J56J10J53j85j32K75k65k0J23J50k14
7307ik3J11k9J1L3j33N1J9r0K5j04O4j6R7J56j54j13r6K00q1r0K99k98P1pJ33
7333B7k1j8K6j42K25K7j2m3j25k5K06J6k1j80J59j59M7J57k62K29j22P1l4J31
$$ plain form
7169 18 187 17 157 -34 126 -229 166 167 -114 129 163 -65 16 226 -63 -100 121 259 211 196 -63 -6 12
7192 12 77 143 -97 26 -113 38 -156 -104 -142 -202 -16 147 -3 -24 -121 35 49 -4 -1 175 13 133 311 293
7216 293 8 34 48 21 167 -187 -150 -101 -55 -86 220 29 10 104 32 -247 258 203 -88 307 -68 -41 101 -57
7240 -57 129 -12 171 105 -10 50 93 106 -93 49 284 407 -163 -1 216 19 71 -13 118 -45 195 45
7262 45 61 -53 290 -36 3 -91 126 -235 -95 -33 158 69 105 -84 -34 -63 -94 115 -169 55 12 -306 -179 105
7286 105 106 -144 180 21 -277 86 -70 -187 -33 -160 -4 106 259 74 -58 217 -48 -68 55 205 -9
7307 -9 -32 79 50 61 94 -39 12 31 -59 -34 -138 -74 -90 7 163 9 -104 -200 0 -81 -171 128 -170 -99 -106 27
7333 27 6 -12 14 -128 97 124 112 69 -56 -81 125 141 120 -60 99 -60 -13 144 -118 111 -11 60 26 157
7357A57k17J66j6J3m7j89K49j56j89J29J12j3O3k55J65J21k57J56k6kn9L3j17
7380a79R9q8K00ol6K1o9J39K67k38j85J01J19l50K5J31M7L8p0Jl3K64m13M83l04
7405c6O6j66k01O01k85O4j84J49l9N7l3l3n9K50k21Q8J14o0j48J9J35j01J3J35
7429A25o1L5k91J63J78j7n5p2O3M9J14j61K21n59L14jr2R4j38J52j69M46k90j97
7453a49J48m5n7k7j22J80O1J14j72Lj55J47n1K07j64J65J17k39NJ58Q6k74j14
7476a78L50j33n6K77k70j4r7J86R9l09J1p7K76N6k35J30O2j15L02j77PK6j89K25
7500A57J13j36j75L3o8J42j07K09j13Lj4o4K8J1L8k4J4k76L47l15M2K28o4K07
7524B16r1j67m9J04j40J46k18L90k63O3j72P9N1K4J28q3K4k49J58o8O5N7L1lk10
$$ plain form
7357 157 -60 106 90 103 56 -133 116 -40 -229 -100 12 -1 62 -193 -28 93 -164 -8 -34 -36 -95 -62 -179
7380 -179 -80 -168 32 26 -10 11 -58 81 348 110 -75 26 145 -205 -180 -49 -2 36 -34 -33 -66 198 -215 268 -36
7405 -36 30 -136 -337 264 -21 43 -141 8 -31 26 -7 -40 -99 151 -70 18 132 72 -76 -57 78 -23 -10 125
7429 125 64 99 -192 -29 149 132 77 5 68 117 231 70 291 -268 46 45 -47 47 -91 61 -108 338 48 -149
7453 -149 -1 -46 -103 -130 -252 -72 -11 103 -69 -66 -221 -74 -125 82 -82 83 200 -39 -34 124 210 -64 -178
7476 -178 172 39 -17 260 -10 -24 -121 65 164 -145 -134 -211 65 121 -114 16 78 -37 265 88 95 121 -68 157
7500 157 270 134 -41 -8 -76 66 -41 168 55 58 44 -20 8 19 57 33 47 -229 118 -197 -155 73 9 216
7524 216 125 -42 -91 13 -127 19 -199 191 -72 -9 -181 -102 -51 -27 101 18 42 -207 -49 -117 -52 5 36 33 -177
7549a77J91j52J87l3p7K13l8Q6l71R9J82j01J23q5p0k6J74j58J8j3o7Q5O5k19
7573a64K31R9O1k61J9J97o9o9K1j2j37K57k66l2K8J59k75N53j42l10L6P1M9j06
7597f2j62j03L28K9q6J23m6J69k39p2K03j93K19k90Jn8M00j40j93J75J90j40j59
7620a06M8o6J01K1K5m8KJ20r3q6K02k02K8J21n6j0R7J25k57J99o1j50j48L82j04
7645H4j40N0Q8q8K37j89MK00j47k35J12j1J78n6k55M7K82k51Q3J84k38J23j59
7668i7J1O2J39j37p0J59n6k65L60O1j67J55n35L62k16J80LpL2K76l45m5J69jQ5
7693A13l45K88M1k21J82j55N8K9J85m4K9J5j38R8k56K46l5j43N3k07L41R1j80
7716D5K04k10J73J5l69L15o5O3l89K00J54l27K82j97L15j87q3Nj23M28j04k67
$$ plain form
7549 -177 14 -138 49 16 -61 152 114 200 -171 -72 110 9 132 47 -23 -49 125 -33 -15 -28 -95 -10 55 -164
7573 -164 67 166 227 -34 -15 182 113 44 65 53 -84 173 -93 -125 -97 62 -213 340 198 -112 -76 -5 44 -62
7597 -62 -224 -327 1 30 -56 67 21 190 -49 -121 82 -111 108 -182 -181 -239 161 21 -172 3 193 53 -106
7620 -106 -58 -124 -23 -2 23 -25 -23 97 4 -82 120 -82 -54 67 11 1 98 223 -34 165 104 -46 -194 188 84
7645 84 -56 -6 82 -6 231 42 46 246 99 -136 -24 -35 143 87 -168 -121 161 -90 -7 177 -61 62 -97
7668 -97 -86 -24 115 -22 -92 67 11 -254 106 167 0 155 -380 -18 -234 -54 -51 -58 -26 250 -95 -140 29 28 113
7693 113 -232 56 97 -124 58 -97 -39 -10 175 131 160 175 37 135 -121 125 90 -53 0 -207 134 225 45
7716 45 249 39 212 227 -142 173 108 171 -218 -18 136 -191 91 -106 209 22 -61 -56 -179 249 145 -122
7738a22K29j87j39K25j30o0J23J87k54K41l19J14J69j06J13l15L12p3nj42K90
7759A51R0j01k70K5K52k44K29j25K37l17K80l41K25J11j78N1p3j46J85j00R1J42
7781A74j64R1J22p0R7l69J95n4l7J31p5J57l41L92j34l1n5J38j81k80L84p7K9
7804D2j45J03Q4p0R8R0l28J03ll9K20k74K34k23J63n7j05K90j64o9m7J28j48J55
7828C8p9K71q5O3l59K48l0l1pq9M8J76l26J97p8m9N6jN1N0j35Q0J1r8J45j61o2
7855a56L66j71R3l8J06k2j03j62k1L09k62Q6J50l30Q8J42M5k55j9K40q2P8r9K49
7879B32l92L23k56r6J01M1J68j27Q1j01k1P4q3j55K37M0k41m2K35K55k76J52l01
7902a52J99j50q7K42p7M0q4J74R6j85P8k45J67%K28j87J11j66P3k5k71K47l4p0
$$ plain form
7738 -122 107 -80 -219 6 -124 -184 -61 126 -128 113 -206 -92 77 -29 84 -231 81 8 3 -139 151
7759 151 241 140 -130 -105 147 -97 132 7 244 -73 207 -134 91 202 24 75 2 -144 41 -59 32 174
7781 174 10 101 223 153 250 -119 76 22 -15 116 41 198 -143 249 115 84 29 167 -14 -294 90 13 42
7804 42 -103 0 84 14 112 202 -126 -23 -26 -65 155 -119 115 -108 55 -2 -107 183 19 -50 -97 31 -117 38
7828 38 -41 230 145 208 -151 97 67 36 29 -60 -12 164 -162 35 -43 -92 -36 -37 14 64 -71 9 20 -78 67 -94 -156
7855 -156 210 39 132 94 200 178 75 -87 -108 201 -61 25 175 -155 -67 75 120 -135 -154 86 4 82 -17 232
7879 232 -160 163 -93 -189 -88 -47 121 -6 75 -26 -47 27 -56 -211 26 66 -175 -217 18 273 -3 149 -152
7902 -152 47 -103 -190 52 -25 15 -69 105 201 16 94 -151 16 16 244 57 168 2 75 50 -221 26 -8 -78
7926g8J64l29L55R8k11O3k92M03l60K93j44M4j4J4j73j25L49j16J48k03R3M6n3
7949b8m7PK23p1q6r8J80K00j61j19m1O0p7J32j71J71k48K76k0Pj1j62J66j24j48
7974a90K91j01K5l31M05j77M06l04j40K15k5n1L2on8J7k8J18k30MJ47J40k16K19
7998A62l88K25M5k71J32L45k12K26k05j71K95k40nj3j2J48J7j46m4J45j66n9K6
8021a66J09J16J31L5k65N1r9K58j94j4%n6J35j42L92j56k42K50k38o4J42l3J16
8044F6j56J27K18j93K94j62j02M0K0j30O8o4q6J27j45P1j44K49j11J25j34p5J76
8067G9L8j61j15L55m07L57j84R6J00j52n5K63k66K2K0K49n06K5L35J38r0k18m3
8090a20J94P9j57Mj06J74m17J60K49R3k82J40Q1j0l07M06l40J48r1L6p6J72K64
$$ plain form
7926 -78 86 -243 112 210 -1 62 -230 173 -187 106 -38 6 -8 6 -167 -292 57 -59 89 -114 -21 25 -28
7949 -28 -75 -68 155 84 -2 -100 80 280 119 0 -41 19 -58 74 -97 74 -174 102 82 89 78 -84 82 -42 -190
7974 -190 101 0 25 -306 99 -78 328 24 -116 99 74 23 55 49 -9 8 -20 98 -132 -128 19 159 -57 162
7998 162 -226 -1 44 -227 -95 250 38 264 59 -112 183 -57 -62 -75 -87 61 78 -68 -112 33 -133 -192 -166
8021 -166 -57 59 190 225 -40 11 -88 170 -24 -38 -38 -94 41 -101 291 135 -107 143 -95 -159 -17 -50 66
8044 66 -90 37 255 62 356 194 92 132 152 22 90 26 -60 67 -78 -7 -151 98 -13 112 -22 -97 79
8067 79 117 -44 -159 196 -211 146 -38 58 158 6 -49 214 -52 -30 -10 239 -267 -242 93 231 141 -77 -120
8090 -120 74 153 -4 0 -106 68 -349 -189 60 153 -129 11 92 82 -225 181 -159 -11 -102 -66 -142 30 294
8113B94n36L95r7j48J78k6O3k17J87lLK07k85k59J07K01r5K48k82J45j08rk44
8136b81K47M3J7m5k1j35L22j00q8l4O5J60j51N3K7J40k50Q2K8k05k1L83j35j24
8160b3J41j71L32k86j04O3M6R1mj77J74J91j85K2k79K28q2J87l71L29l38L20O
8183A10k49L39l26M73k02j53J09j32
$$ plain form
8113 294 -242 153 56 -92 86 60 123 -94 93 90 93 300 15 -244 -137 64 -31 217 -65 80 -28 -37 -281
8136 -281 -34 9 26 -19 -40 -175 147 47 -41 -75 -10 150 -1 52 79 219 -31 51 79 -126 -147 236 101 -23
8160 -23 118 -53 279 -7 -111 -48 -2 89 85 -92 82 273 88 110 -169 59 -23 164 -207 122 -216 104 110
8183 110 -139 200 -126 347 145 -8 101 -31
8191c1
$$ Imaginary data points
##PAGE= N=2
##DATA TABLE= (X++(I..I)), XYDATA
0@%%%%%%%%%%qJ6j6J6k4L2m0N3o1P2q8J05j27J51j77K08k41K82l26L73m28M90
32B62n57O29p14Q08r08J018j141J274j417J578j754J943k150K378k626K895l193
49a675L520l877M272m708N190n729O336p024P807q712R773j1032J2557j4454J6885
64I129k0126K4702l1709M3924p1420K53121J1532j81852K82077O5376j25169k26119
76C3466p1673Q9671J56159j31054k75242k669K95112M0493k30813j09297J28979
87g6868J30559N528j59324j54114Q7799K13842o3000k61749k5228K30401R5025
98B2871j05072j04004L2840J57800J28430r7659j82537O1300K24768Q85k14313
109g4691p2093J27109J08791j6121j20875p3328J26442J80053n9287j97024J0589
$$ plain form
0 0 0 0 0 0 0 0 0 0 0 0 -8 8 -8 8 -16 16 -24 29 -32 40 -48 57 -70 81 -96 112 -129 153 -173 200 -228 262
32 262 -295 334 -380 428 -480 538 -603 671 -746 832 -922 1021 -1129 1249 -1377 1518 -1675
49 -1675 1845 -2032 2240 -2468 2722 -3007 3329 -3695 4112 -4600 5173 -5859 6698 -7756 9129
64 9129 -10997 13705 -18004 25920 -45500 207621 219153 37301 319378 384754 259585 33466
76 33466 -38207 51464 207623 76569 -198673 -201342 93770 134263 -96550 -205847 -76868
87 -76868 53691 59219 -100105 -254219 -166420 47422 -15578 -277327 -302555 -72154 22871
98 22871 -82201 -186205 -153365 4435 132865 35206 -147331 -86031 138737 139622 -74691
109 -74691 -146784 -19675 89116 72995 -47880 -121208 5234 185287 126000 -71024 -60435
120f0435J84238M1653j39322j13787J0970J03864N2042j24063j49286P5126J86068
131F7068j8142j65448k7735J25798Q3003l8243j14161o0461J00193J10940r0253
142b7441j64091L2257J55086K8716j01392n7860N9490J14471M7345r8148r5262
153a06829Q7519J37627m5029j47832j7366J04830O2815m7834r1378j4345J13326
164C5504R2884p8163j14328M9368J30104J093j11274o0143M4945P5913m52j02395
176c6944p0918Q3740J08674m6314j13363Q782J03320M2182n7041p8937n486Q1490
188A9185M6336q8681r9640M9369J03099j1200q9061k6212O1868P1627k180q1218
200d6708m1117P8971P6569o2489r9482J3453Q1106K2063n7987n8268J6785Q5291
$$ plain form
120 -60435 123803 165456 26134 -87653 -76683 27181 79223 -44840 -194126 -119000 67068
131 67068 48926 -116522 -144257 -18459 64544 26301 -87860 -148321 -48128 62812 -27441
142 -27441 -191532 -159275 -4189 24527 -76865 -134725 -75235 39236 86581 -11567 -106829
153 -106829 -19310 118317 73288 -74544 -91910 12920 75735 27901 -63477 -77822 35504
164 35504 128388 50225 -64103 -14735 115369 116462 5188 -54955 -10010 65903 65451 -36944
176 -36944 -107862 -24122 84552 38238 -75125 -66343 36977 79159 22118 -56819 -62305 19185
188 19185 65521 -23160 -122800 -73431 29668 18468 -70593 -96805 -34937 36690 34510 -46708
200 -46708 -87825 -8854 67715 5226 -94256 -80803 303 22366 -35621 -93889 -77104 8187
212H187L6315p3194o1318O1628Q6540k3608q1903k0943N3795M8850k4580p4977
224f5208j9941P7985N6848n3416o9198L3140P9154J3964n3630m3266K4483O2201
236D3116Q844p2301m6309N4512O4040k8370o5150L2N6900L9892k3720n4651m597
249b7762O3533L4807n8212n9149K8562N8249l812n1923k9579K9180N5088K314
261D1296n8544k6305N6821M9309l5193n7467L328M6985K1585l2606n0275M178
273c6888N8995K2127n1591l9151L8302N2250n904m5533j9324L0434M0562j1302
285C2977n5258j5563M8039L3410l4893m3525J2571M5146J6571l0355l4349J2783
297a2446M7660Q438m7949l0346L1921L8356j5512m1457j0803L1942L1514j2585
$$ plain form
212 8187 44502 -28692 -90010 -28382 58158 34550 -47353 -68296 -14501 34349 9769 -65208
224 -65208 -85149 -7164 49684 -3732 -72930 -39790 39364 53328 -302 -43568 -19085 43116
236 43116 51960 -20341 -66650 -12138 51902 23532 -41618 -41586 15314 55206 31486 -23165 -27762
249 -27762 35771 70578 12366 -46783 -18221 40028 36216 -15707 -45286 -16106 38982 41296
261 41296 -17248 -43553 13268 62577 27384 -30083 -26755 20230 41815 9209 -41066 -36888
273 -36888 22107 44234 -7357 -46508 -8206 44044 38140 -7393 -26717 3717 44279 32977
285 32977 -22281 -37844 10195 43605 8712 -34813 -22242 22904 39475 9120 -25229 -12446
297 -12446 35214 43652 -4297 -34643 -2722 35634 20122 -21335 -32138 -196 31318 18733
309A8733m2326n139M5870K4562l4070l7085J5266L6863N462l1753k8630J5049
321a7198M0560L299m2376j8307L5225L2461j5978l4581l644K8615K3694j7850
333A3920l8050n95L9582J4860l2824k6906J7479L2807K725k7748j9867J8265L3171
346B6819l739l7387j2772K9844K2825j8190k9928J1K7984J6496j8171k8986O075
359a9119L4142R174l0198k1007J8369K5884k868k7376j4096J8831K5244o680l1509
372b1209o084K8299J8154j8494k4265M127K3460J0906j8611k3374O621K8554M376
385A2460k6999j5370J7514K1904m353k1446r818J7061K0734p166k6242l745K4970
398d96J3079j6202j9710M358K1146R359j6445j8922Q746K5175K952k3149j2117
$$ plain form
309 18733 -23593 -28732 17138 41700 7630 -29455 -14189 22674 28136 -3617 -32247 -17198
321 -17198 23362 26661 -15715 -34022 1203 33664 17686 -16895 -20539 8076 31770 13920
333 13920 -24130 -24725 14857 29717 -3107 -30013 -12534 20273 22998 -4750 -24617 -6352 26819
346 26819 23080 -14307 -27079 2765 25590 7400 -22528 -22517 5467 21963 3792 -25194 -19119
359 -19119 15023 24197 -6001 -27008 -8639 17245 14377 -12999 -27095 -8264 16980 10300 -21209
372 -21209 -27293 1006 19160 666 -23599 -19472 3988 14894 -3717 -27091 -20470 8084 12460
385 12460 -14539 -29909 -12395 9509 5156 -16290 -26108 -9047 11687 4521 -21721 -25466 -496
398 -496 12583 -3619 -23329 -18971 2175 11534 -4911 -23833 -15087 10088 13040 -10109 -22226
411b2226J6791J9220m519k0387o874J7179J8205q577k2697q15K2620J1912j5954
424C878j7643N922K0567O131j6137j5634R681K1663O02k1082j0036J6341J6530
437B0783o530j8313m689J5879J4119r270j9769P72K0176Q616j5673j4614O771
450a742J6537L703j5657j3331R218J8245k137j9641o986J5320J2890p325j6207
463g113k628J4937J1407j0740j7459J772J7849N255j5136j2521O589J5887J910
476A0009j4567j0670J0305J6067k977j7226n078J3564J0893p578j4974j350J4235
489F53R101r758j4213L591J6186N311j3770j0407P554J3863K83j4318p973R824
503d073J3287l539j5573l478J3780J0082p416j2559N03J3406P381r787j2643L339
$$ plain form
411 -22226 -5435 13785 9266 -11121 -17995 -816 17389 8812 -13885 -14700 7920 19832 3878
424 3878 -13765 -7843 12724 18855 2718 -12916 -3235 18428 19030 -2052 -12088 4253 20783
437 20783 14253 -4060 -8749 7130 21249 11979 -7790 -7018 13158 21774 6101 -8513 -1742
450 -1742 14795 18498 2841 -10490 -1272 16973 14836 -4805 -11791 3529 16419 9094 -7113
463 -7113 -9741 5196 16603 5863 -11596 -9824 8025 13280 -1856 -14377 -7788 8099 10009
476 10009 -4558 -15228 -4923 11144 8167 -9059 -14137 -573 10320 2742 -12232 -13582 653
489 653 9754 -4 -14217 -10626 5560 10871 -2899 -13306 -5752 8111 8394 -5924 -13897 -4073
503 -4073 9214 5675 -9898 -13376 404 10486 3070 -9489 -8986 4420 11801 2014 -10629 -7290
517g290J4842K435j3220q322Q318J2465o46j1876o020J0672J2117m015j3781j941
531f262J2573P799q066j2148J026J2127O177r740j0693N247J3871J700j2044o908
545e341P460J0611j544j2788n214R076R464n168j2600j189J1789P050p991j0127
559f512K131J1730L660r809r858M877J1650J01j2326o299Q531J0541k404j1008
573d995k772J0175R037m854j2139O78J1458M608q674r505L148J0770K976r384
587E27p600O332J1663o74j0740m581P829Q393l859j0934l432Q803O667o473j0418
602h497Q57J0435M045p708q565L969J0000J165r931p120N819R063j697j1153l693
617a3011Q351Q271l585r474m45R875O729o378q956J916J0504L301q990p232N072
$$ plain form
517 -7290 7552 9987 -3233 -11555 -3237 9228 8582 -3294 -9314 1358 13475 9460 -4321 -6262
531 -6262 6311 14110 6044 -6104 -5078 7049 13226 3486 -7207 -1960 11911 13611 1567 -5341
545 -5341 2119 12730 11186 -1602 -6816 2260 11724 6556 -6044 -7233 4556 11606 3615 -6512
559 -6512 -4381 7349 11009 1200 -8658 -3781 7869 7970 -4356 -10655 -2124 8417 6013 -4995
573 -4995 -7767 2408 11445 6591 -5548 -4870 6588 11196 2522 -6983 -3835 6935 9911 527
587 527 -7073 -741 10922 10248 -492 -5073 2756 11149 7290 -3644 -7076 1727 8394 1921 -8497
602 -8497 -7640 2795 6840 -868 -9433 -5464 4536 5701 -4230 -11350 -5531 3532 1835 -9318 -13011
617 -13011 -4660 3611 26 -9448 -9893 -18 6711 333 -8623 -6707 3797 7098 -1892 -9124 -4052
632d052R650Q57q647m754P164R858j982r267k144Q818O291n220r194p40Q893M357
648I888p062q406L302R682J474q566n356N051Q593r57r419m941O708P126m275
663B842r807j193P835N615n340q255J772R086L819p729o300L429Q566L50q822
678d132m837N690P865k092q332k245Q039P048l863q045K64Q595L705o357p355
693f052K267P975J472p208n868M673Q479p36p906l127O986O363k860q110j436
708e088O961M779n956q174J996P977K406o551n336L581P914J022p757l954N306
723h74O743k854p683j923O172N220l759p225N21P766L357n026n604K838O926J002
739E597o653m242L735O299j138o978k796N943N307k533o237o05O661L986m077
$$ plain form
632 -4052 5598 6455 -2192 -6946 218 10076 8094 -1173 -3317 5501 11792 6572 -2622 -3362 5531 9888
648 9888 2826 -5580 -2278 7404 8878 312 -5044 7 8600 7643 -1776 -6717 -9 7117 2842
663 2842 -6965 -8158 -323 5292 -48 -8303 -6531 2555 6374 -1355 -7655 -4226 4340 4690 -4132
678 -4132 -8969 -3279 4586 2494 -5838 -8083 -44 7004 3141 -4904 -4640 3955 7660 1303 -6052
693 -6052 -3785 4190 5662 -1546 -7414 -2741 5738 5002 -2904 -6031 955 7318 4458 -3652 -5088
708 -5088 1873 6652 696 -7478 -5482 2495 4901 -1650 -6986 -3405 4509 5531 -2226 -6180 -874
723 -874 5869 3015 -4668 -6591 -419 4801 1042 -6183 -5662 2104 5461 435 -5169 -2331 4595 5597
739 5597 -1056 -5298 -1563 4736 3598 -3380 -6176 -233 5074 2541 -3696 -4301 2360 6346 2269
754B269o214R39O225K031n442n112K538O636L88o070l481M538N815j045o076k259
770d320N552M353l596o337k57O209K478m609n038J993O320J505n527m136M058
785a352N720m82o386k612M706M389k046o254j055N974M065l835n233J578N874
800C051K441m796m237K497N907K0o039k989M179N211j685n619j366N276M199l016
816C034n345J92N704K441m371n069J579N698L30m963l739L049N193l44n754j915
832d280M468M418k513n528m00N005K669l573n187J096N310K024m846l717K930
847b124N300j04m842k424L788M753j914n588r27M729L348k851m889O06N029K178
863D068l497m298J993N170L55m945l070K762M699j072n171j820M553L429k334
$$ plain form
754 2269 -3945 -3006 3219 5250 -192 -5304 -2766 3870 4258 -1812 -5293 -755 5060 4015 -2061 -4320
770 -4320 1232 5585 1989 -4348 -4605 1604 4082 -527 -5565 -3572 2748 4253 -1274 -5410 -1352
785 -1352 4368 3886 -2500 -5112 -406 3983 1937 -4317 -5372 602 4667 832 -4401 -2823 3051
800 3051 5492 696 -3541 -1044 4863 4883 -1156 -4145 34 5245 3560 -2059 -3425 1851 6050 3034
816 3034 -2311 -2119 3585 6026 1655 -3414 -1835 3863 4193 -770 -4509 -1460 3733 3389 -2365 -4280
832 -4280 188 4606 2093 -3435 -3835 1170 3839 266 -4921 -3825 1485 3509 -1337 -5054 -2124
847 -2124 3176 3072 -1770 -4194 -406 4347 2433 -3155 -4082 647 3995 1144 -3745 -3139 1890 4068
863 4068 571 -3727 -1734 3436 3791 -1154 -4224 -1462 3237 2165 -3006 -4826 -273 3156 822
878H22m614n75M927K784l311m320J154M685J155m100l033K137M661j22m364k052
894d166L698M338j662m235p51M408L097k897m152J51M951J791l920l227J878M689
910C991M14l907k685K802L948q51m501j158L536K896k259m401k2M200J958l294
926F67l535J370L928R12m022k571K073L847n39m302j572L198L169j617l878p87
942c659L945K389k544l462O94M149Q93l052l094J755L863J71l746j853K747L232
958B428j043l489r07L186K534j720l565J62L502J942l362k497J452L507K70l088
974f88k025K195L286n40l615q90K690K632j299l404l44L455J652k047l017M74
990a485L576Q91k717k189J573K932o1l080j465K137K427q76k910q40K795J790
$$ plain form
878 822 -3792 -4367 560 3344 33 -4287 -3133 1552 2707 -1393 -4426 -2289 2372 2250 -2114 -4166
894 -4166 -468 3870 2208 -2027 -2778 1630 4727 1830 -2322 -2171 2780 4571 651 -2576 -698 3991
910 3991 4405 498 -2187 615 4563 3712 -789 -1947 1589 4485 2226 -2175 -2197 2003 3961 667
926 667 -2868 -1498 2430 3342 -680 -3251 -1178 2669 2130 -2172 -3744 -546 2623 1006 -2872 -3659
942 -3659 286 2675 131 -3331 -2637 1512 2405 -647 -3741 -1986 1877 2048 -1698 -3551 -804 2428
958 2428 1385 -2104 -3011 175 2709 989 -2576 -2414 1088 3030 -332 -2829 -1377 2130 2400 -688
974 -688 -2713 -518 2768 2228 -1387 -2277 413 3045 1746 -1658 -2002 1453 3105 1058 -1959 -1485
990 -1485 2091 2982 265 -1924 -351 2581 2520 -560 -2025 112 2539 1663 -1247 -2087 708 2498
1006B498j706k998L59L013Q24k217k344R94K862N57l076j455J798K574l61k928
1022a606r43K274K072j146k974J70K577J485j776k245M01K701P02j980k017J202
1038a103K773j95k723r74J518K150n08k518l28K096J451j481k273L80K148Q92
1054A305j586k379Q80K589K96k437j236J126K193l48k495o58J975J953j241k339
1070b402L06J911J082j557j809N41K361M36j762j482J426J981k00j744j066J929
1086d9J699p24k334R3J851J470j412j818M11J832R52j784j502Q91J962Rk108p87
1104a348J358J753l34k182m52J686J463j237k013J34K186N66j587j966R98K036
1120A061K06j724j141R84J496j68k128k45J550J238p71j806j51J712R53j187j618
$$ plain form
1006 2498 792 -2206 -1847 1166 1990 -227 -2571 -1577 1285 1842 -1234 -2689 -891 1683 1322 -1606
1022 -1606 -2549 -275 1797 651 -2323 -2153 424 1909 133 -2112 -1711 990 1692 -288 -2305 -1103
1038 -1103 1670 1475 -1248 -2222 -704 1446 938 -1580 -1908 188 1639 158 -2115 -1735 413 1305
1054 1305 -281 -2660 -1780 809 1105 -1332 -2568 -1442 751 403 -2092 -2750 -775 1178 -63 -2402
1070 -2402 -2096 -185 897 -660 -2469 -1928 433 869 -893 -2375 -949 1032 832 -912 -1978 -49
1086 -49 1650 926 -1408 -1315 536 2006 594 -1224 -813 1019 1971 187 -1315 -424 1538 1547 -561 -1348
1104 -1348 10 1763 1429 -753 -1205 481 1944 707 -1306 -1172 1014 1580 -7 -1973 -975 1061
1120 1061 1267 -457 -1598 -614 882 714 -1414 -1659 -109 1129 358 -1448 -1599 113 1066 -121 -1739
1137a739L90J851N19j580j257J163J442K20j849p96J124J624o29j752JJ353J075
1154A160j021j287K92J626M10j149j355P79J498J91j348j046J091J560o51j548
1170g98n60J654Q63n81j491j09J421R02j369r65O62J486J10j581o12P18J370L03
1188A423j708o13J400Q73n33j376P2J315O06q81j179K56J536L94j224n76K36J502
1206A523k15j088n76R71J117m04j604k60J454N29n67j358L43R29L49o83j150M15
1224b75J187m7j215o22O83J220n46j150j74P45Q76n38j205m1J266M07j020p68
1242a217J19J186K55j254n72P74J296n11p74l00R58M76k22j129J83O33Q09o86
1260B4q73L50R57N09j232k48L31J203k7j030l34N77J086l47j124pQ51P41p40r43
$$ plain form
1137 -1739 -1349 502 1021 -559 -1816 -653 789 1009 -840 -1636 -512 1112 483 -1269 -1268 85 1160
1154 1160 139 -1148 -856 770 1180 31 -1324 -545 953 1144 -204 -1250 -159 1401 750 -798
1170 -798 -1358 296 1159 578 -913 -1022 399 1301 -68 -1033 -371 1115 1225 -356 -968 -250 1120 1423
1188 1423 -285 -898 502 1375 842 -534 -462 853 1459 578 -601 -345 1191 1585 361 -215 21 1523
1206 1523 1308 220 -356 615 1732 1328 -276 -536 918 1447 880 -478 -135 794 1143 460 -690 -275
1224 -275 912 865 -350 -972 -289 931 385 -765 -939 -194 682 144 -1061 -1102 164 571 -449 -1217
1242 -1217 -1098 88 343 -911 -1483 -709 587 76 -698 -998 -40 436 214 -915 -732 -99 710 24
1260 24 -849 -499 458 967 -265 -513 -182 1021 994 -36 -370 207 1293 946 -178 -185 666 1407 667 -276
1280b76p8J534J00q79q20N83R13%j136l54O40P66m33j167J19R33L74m16r25q2
1300f04J166K16o79q42K13Q34J07p13o02Q16N15k29n80k72J184K70n03n95Q9O20
1320D11K57o82l80K49Q14j36n68n13N57P74k91n81j89M17O28m53o23R9N89J44
1340E23n74o71M69O39k8m43n17M93N91j96n06oM41J47j32n35k07O36M46m63m23
1361c16oR60l88l27j19L74N74j19n89l45N08L27Q9n46k37L58L24J38q57K97M85
1382E85J79k68m30l9L60k85k72k44L15L90K4o42l49M92J74k77n65K71N2L23l40
1403e46o29K04N01J00p08P1J44K42J80l68k10M61K57k44l7j25M93P9l8k81k17
1424f71O06J94l09j22J03M34L14k88k93M26N3Ql27m9L88L68m74j18P8M63l30J42
$$ plain form
1280 -276 -354 1180 1280 401 -419 164 1077 1077 -59 -413 227 993 560 -607 -488 445 819 403 -522 -604
1300 -604 562 778 99 -743 -530 304 411 -302 -904 -88 427 198 -382 -654 530 800 297 -298 -209 411
1320 411 668 -14 -394 -145 669 533 -35 -548 9 783 492 -89 -278 139 767 314 -309 -210 379 523
1340 523 -51 -722 -253 386 358 -85 -602 -109 482 286 -220 -226 215 362 230 -305 -512 124 570 107 -316
1361 -316 -322 638 250 -77 -196 178 752 633 44 -301 207 534 623 77 -160 198 522 660 -197 100 585
1382 585 764 496 66 27 387 102 -170 -414 -99 291 315 -327 -676 -184 -10 -287 -852 -581 -529 -206 -546
1403 -546 -1175 -971 -470 -370 -1078 -1007 -863 -621 -441 -809 -1019 -558 -301 -545 -582 -707 -214 -135 -173 -454 -671
1424 -671 -65 129 -180 -302 -199 235 549 261 -32 394 447 455 128 79 467 835 361 243 321 784 454 596
1446E96k88r5K24Q1k70m47K5L37l8m25j56L19L56k91l23O6L13J71k74k26j36M63
1468a8J79m46k43L15K4K24p5k90M78N6K3l66K35O6P2J5l26J80J41L1j45q9J15
1491A56K16J39l7j91R2L04j92k15j91J90N0P1l23k2n5K41o2o92K97J96K7l81k01
1514e83k37L90j74k66M1n4L48l7j54k02J73J73J29j70k17K96J70l04n1J64J68
1535c97K19j39j86K65J60O4P5j53K3L38k72l04L25J28K52k28j6j97M88K1j69j23
1557A74q3L07O4j97k72L26J35k77k24K4L5K74j6k31j44O5J80l06J61L9L05k45
1579I4k00kJ09p9K17k38K0n1k3J96j25N7K25k02j10j4o4J99J1j6k76R9J93Qq8
1604f0o9L43j00J41k08J6k08K52j46K3o4P0J84k44%M10l07k18O2J75j69J4l8K24
$$ plain form
1446 596 308 213 437 518 248 -199 -174 163 125 -300 -456 -137 219 -72 -395 -329 -16 155 -119 -345 -481 -18
1468 -18 161 -285 -528 -213 -189 35 -40 -330 148 204 227 -139 96 162 234 249 -77 103 244 275 130 41 156
1491 156 372 511 474 283 375 679 487 272 81 271 321 392 69 47 -8 233 171 -521 -224 -28 -1 -382 -583
1514 -583 -820 -430 -604 -870 -829 -883 -535 -572 -726 -928 -755 -582 -453 -623 -840 -544 -374 -678 -729 -565 -397
1535 -397 -178 -317 -503 -238 -78 -14 61 -92 -69 269 -3 -307 18 146 398 170 154 -43 445 466 297 174
1557 174 91 398 462 265 -7 319 454 177 -47 -23 12 286 270 39 -105 -40 140 -166 -5 34 339 94
1579 94 -106 -108 1 -78 139 -99 -79 -130 -153 43 -82 -25 200 -2 -112 -126 -190 9 20 4 -272 -173 20 28 -60
1604 -60 -129 214 114 255 47 63 -145 107 -39 -16 -80 -10 174 -70 -70 340 33 -185 -123 52 -117 -103 -141 83
1628H3P5j55j60j30K95k60J22K01o2k77J17J00QJ08k21J4n6J23lq6oM72k51j09
1652e8j57Q6M53o1k67M46o66M50j1j26K63O2k13k5q8m7R3L58m04N6n4K46l9J00
1676C97k03K9m9K48l41k38M07j29O0k72K61j50K32j04Pk68J34P3j15j04L86l24
1698f3l7o7j01L52q6p4N3KQ2k27k6K00j97K51j52J25q2o8Q9j40J64o5J51k7J30
1723A87j47k41J26K74j04r7J34N0j70j22J32j07J08K75l60R4j8QK03j45r0K56
1745B46j87K9Q2j37M4J2J15L8k43O3L4k50J80k10K15j10J60m24K21J33q6k51L25
1768aq5r5k1K06l79K86K2J30l86J02N4j24J65P3K03l40J53k40k0J26O5j0j01L7
1792a80K62k39J2j24J30J00J08j36j20R1K17q1o7M5l9K35l2n3qm4P6P1k8k49O8
$$ plain form
1628 83 158 3 -157 -287 8 -252 -130 71 9 -268 -151 -51 -43 65 -156 -142 -198 -75 -78 -164 -170 302 51 -58
1652 -58 -215 -129 324 263 -4 442 -224 226 215 89 352 414 201 176 88 41 134 492 88 144 90 336 297 397
1676 397 194 223 174 422 81 -157 250 121 181 -91 170 20 252 148 155 -113 21 94 -21 -125 261 -63
1698 -63 -100 -167 -268 84 -2 -76 -23 -21 61 -166 -192 8 -189 62 -90 35 -47 -115 -26 -166 -2 -67 84 57 187
1723 187 40 -201 -75 199 95 -2 132 182 12 -110 22 -85 23 298 -62 32 14 22 225 80 -10 246
1745 246 59 88 170 33 77 89 204 242 -1 62 96 -154 26 -184 31 -79 81 -343 -122 11 -75 -326 -1
1768 -1 -86 -181 -202 4 -375 -89 -67 63 -323 -221 -167 -291 -126 -53 150 -190 -37 -277 -297 -171 -106 -116 -217 -180
1792 -180 82 -157 -145 -269 -139 -39 69 -67 -187 -96 121 40 -27 18 -21 214 182 129 121 77 153 224 196 -53 15
1817A5K08n4m2n2p5P6J86k06RK2J58K7j18o5K00j53j63K25k06J8K73k26M2j69
1841g0J62PJ73K4j84J17m7j43L93j24j27J92l7n1j32L00j20j46j74M43j22l2K01
1864E03j68L4N6j67J76L5n4k57J03L22l96J33Q0j54P2kk52L50j70j89K4j05R4
1887F8L6o9j53J89j86O2j30j64J16j08L19j93k06K11l7j49K0r5J94j49p1m0J17
1910d18q9j62J93M29l01R5n1j55J93r8K1j49J53K30q3k54j0J51j32K60j49r6M41
1933A9k65J48k11M43j29L3N9k87M7N5K00r4k21K93Rj3j06m4Q0J53j3J7j12J46
1957B07j31Q0O6k45L21m8j35P1R8m3Rl51J22J86j20p8m0O7M8R4j58m1N7n8p5M4
1983e3k08K58J01j40qL5j16J28M9k47K06J84k27N3Pj22O2M1M0l40L46n4J44q9
$$ plain form
1817 15 223 169 127 75 0 76 262 56 65 87 245 272 154 89 289 136 -27 198 -8 10 283 57 99 -70
1841 -70 92 99 272 296 112 229 182 39 432 308 181 373 336 285 153 453 333 187 13 456 334 302 503
1864 503 335 369 425 258 434 469 415 158 261 583 187 320 400 246 318 316 64 414 244 55 79 -26 68
1887 68 104 35 -118 71 -115 -53 -183 -347 -231 -339 -20 -213 -419 -208 -245 -394 -374 -469 -275 -424 -495 -535 -418
1910 -418 -507 -669 -476 -47 -348 -253 -304 -459 -266 -364 -343 -492 -339 -109 -192 -446 -456 -305 -437 -177 -326 -422 19
1933 19 -246 -98 -309 134 5 38 97 -190 -143 -88 112 18 -203 90 99 86 -20 -64 16 169 156 173 61 207
1957 207 76 156 222 -23 298 250 115 186 284 241 250 -101 21 207 87 9 -31 36 84 178 20 -21 36 -22 -97 -53
1983 -53 -261 -3 98 -42 -50 -15 -131 -3 46 -201 5 189 -38 15 22 -100 -38 3 43 -297 49 -5 139 50
2007E0k9K69k85K32k04l3J72j65J6q9J38j69J95K1k62J46Kj55R1M4k4K6P8l3K2
2032E4J20k15N7M7l06J18J59j88o9J09K39j55Qj37K38k44J91l37N1L15p7o3K39
2055A54j82nJ02J22r4j45L04l20K26k61K30J27j90J09L9k89K15P3k51L70l92M40
2077C82k54j87J42M2j44L41k67o2K23k08j68J58J32k7j22J82l96K23j09R9j8j98
2099b36L06Q9j0l66M49j95j55M12j60j67L40k46k54N5L4R0K03j67L7KL6j67M4
2122b6L1Q7r9O0j85Q3J05k2j47J66j13K10m8k08R1j26J36k65P9p8M30k55J03J
2146A0j66L32R4l59m8J16J01l98K26O1r3p2m3J10l75M62R2p2j81N6j9R0K39m68
2170c05K77Rn1R0k58L91k36J36JN6r9j77J60j78J16J20N6q6q9J18J3J88j90k59
$$ plain form
2007 50 21 290 5 237 33 0 172 7 23 -66 72 -97 98 119 -143 3 5 -150 -59 -15 -39 -13 65 32 54
2032 54 174 -41 16 63 -243 -125 34 -154 -223 -114 125 -30 -22 -159 79 -165 26 -311 -260 55 -22 -85 154
2055 154 -28 -33 69 191 97 -48 256 -64 162 -99 131 258 68 177 216 -73 142 215 -36 334 -58 382
2077 382 128 -59 83 125 -19 322 55 -7 216 8 -160 -2 130 103 -19 163 -233 -10 -119 -20 -38 -236
2099 -236 70 159 149 -217 232 37 -118 294 134 -33 307 61 -193 -138 -104 -14 189 22 59 61 97 -70 -26
2122 -26 5 92 -7 53 -132 -49 56 34 -113 53 -60 150 102 -106 -15 -141 -5 -270 -191 -269 161 -94 9 10
2146 10 -156 176 270 -89 -137 -21 80 -318 -92 -31 -124 -196 -239 -129 -504 -42 50 -22 -203 -147 -166 -76 163 -305
2170 -305 -28 -19 -70 20 -238 153 -83 53 54 110 11 -166 -6 -184 -68 52 108 22 -67 51 64 252 62 -197
2194a97J78j15J84K7j29J30j39r7K62j35J13j93L91l87K55m15L22o9r1mJ03n7
2216f3Q6M3k65J74k9j75J39J69k05J15j20K82j97J55k36K34m40L76R2q3N7J68
2238B77k16J14p7m0r9K49k4J90m10J60nJ04j00n4L8O2j70L9M4Qp3K55k15J42j89
2263A0M0O2l5K14l43J91j16J31j29lj41K03j12l4J63j70j51P5L64l40J09J19M8
2286A55k19n1Q5J17n0j13n0q0J90n9O9r0N19m97m1J88k05J14n6k09L3J64q0J4
2310a52K53j29J23L7o9Jq7Q7J49l39J9J05P8m3m4l7L01l27J9J59l86K95J39p8
2334G4j10J75j88j01J69oM7l2j23N7J01K8Nr0J33j20j9j71J84Nj9l8k34J12O7
2359i4K25j30J34o7k40n5J19j42J88q7L08j48k17N4Q5K26j21j20N8R2l0j29L29
$$ plain form
2194 -197 -19 -134 50 77 -52 78 -61 -158 104 -31 82 -111 280 -107 148 -267 55 -14 -105 -109 -6 -63
2216 -63 23 66 -199 -25 -54 -229 -90 79 -126 -11 -131 151 -46 109 -127 107 -333 43 135 52 109 277
2238 277 61 175 98 58 -41 208 184 374 -36 124 119 223 123 69 107 169 -1 38 82 90 17 272 57 199 10
2263 10 50 112 77 291 -52 139 23 154 25 22 -119 84 -28 -62 101 -69 -220 -145 219 -121 -12 107 155
2286 155 -64 -115 -30 87 37 -76 -126 -206 -16 -75 -6 -96 423 -74 -115 73 -132 -18 -74 -283 -250 -86 -166 -152
2310 -152 101 -28 95 132 63 64 -23 64 213 -126 -107 -2 76 33 -11 -48 253 -74 -55 104 -282 13 152 74
2334 74 -36 139 -49 -150 19 13 60 28 -95 -38 63 91 96 6 139 19 0 -171 13 18 -1 -39 -273 -161 -94
2359 -94 131 1 135 68 -172 -227 -108 -250 -62 -149 159 11 -206 -152 -67 159 38 -82 -24 68 38 -91 238
2382B38k9k06r4K77p5j11N1q5J38J30j96j42J42kK9j62O1J67k10L6KJ69m12N58
2406B74j59j90qj6K25j14K0Jj4j04M9j99J15J80J48j90l75K58J2J7R6k30J25N6
2430b3k1J61J0l02l0K00j07J26r6P1J51j71J6k72L99k23L5K53l04J72Pj57J3J32
2454D0J6o5L3J1k1L2l85L51O5L6q8pr7K00j07j05J38j0R4J5m98M05j08J49m7j06
2480e9J42n9p2k91M26j65l0M8k07K06K14j6k39j13Q1J12l8k5M1J69n5o6l2o6K72
2505A78o4L9k06J39j30Lj89J23J26P8Q2kk16J32j7j32p7L6J05Mmj08l6K09q5q4
2531i6j13J19K78j83j22KQMq3Q4L90l70r5M31n38J69J73k01K06J23j04j73J33
2554D2j69j0L3J87l3k27L11k95O4K73Rl04j37K85k7J47J8k87J73o6P2n9Mp2L35
$$ plain form
2382 238 209 3 -91 186 111 0 51 -34 104 234 38 -104 38 36 65 -97 -36 131 -79 -43 -41 128 -284 274
2406 274 115 -75 -83 -99 126 12 32 33 19 -85 -36 -235 -120 60 208 18 -357 -99 -87 -70 26 -204 -79 -23
2430 -23 -44 117 127 -175 -205 -5 -112 14 -82 -11 140 -31 -15 -287 112 -111 -76 177 -127 45 52 -105 -92 40
2454 40 56 -9 24 35 14 46 -339 12 77 113 25 18 -79 121 14 -91 47 37 131 146 -352 53 -55 94 47 -59
2480 -59 83 24 -48 -339 87 -78 -108 -60 -267 -61 153 137 -102 -215 -134 -22 -60 -85 -44 125 70 4 -28 -94 178
2505 178 114 153 -53 86 -44 -41 -230 -107 19 97 179 177 -39 93 76 -56 -133 -97 8 12 8 -100 -136 73 -12 -96
2531 -96 -209 -90 188 5 -117 -115 -107 -103 -186 -102 288 -82 -177 254 -284 -115 58 -143 63 186 82 -91 42
2554 42 -127 -137 -104 83 50 -177 134 -161 -97 176 185 -119 -256 29 2 149 167 -120 53 -13 59 0 4 -68 267
2579B67k93K81k14M4r1L21R9l17j8o6j98J16m1L80l71m2K60m9l0j68J25nM8M7
2603H5j46ml4p1J60K1j34K97k54l91L51J08l18L47j42J45k3n1O4J7j27J16p3J59
2627A02j71n3J34K53m89K44k7r1N2O8J29l6j13R1k41J8K77j59K02m29K91K3j7
2650E8j87P4J20K38m70J37J8J06j27j27J2J47L26n03J47n0n5K60m20L55r5P5J76
2673B15j95J25j8j40l4L6J58r8J7P1j87p1K04N4jJ89k93K2J75l88J83j04o7R8
2697d9L8k4r6L06k77L28j15J47l25R5K86k66Rn9Rj68J93J09j3J17k36j11p5K41
2721F4M1k08N9q8J32j56M39j72M2k19R2j73J18P7l46R4K99k90K68oj54J95k26
2744a18K70k21J26r4J55j14L48j06j00k22K67j39J69l11L78K4l32l3K9L9K9k26
$$ plain form
2579 267 -26 255 41 85 -6 315 414 97 79 13 -185 -69 -110 270 -101 -143 117 68 38 -130 -5 -10 38 85
2603 85 -61 -65 -99 -170 -10 11 -123 174 -80 -471 -120 -12 -330 17 -125 20 -3 -54 10 27 -100 16 -57 102
2627 102 -69 -122 12 265 -224 20 -7 -98 -46 22 151 115 2 93 -148 -130 147 -12 190 -239 52 75 58
2650 58 -129 -55 65 303 -167 -30 -12 94 -33 -160 -148 -1 325 -178 -31 -81 -136 124 -296 59 -36 39 215
2673 215 20 145 127 -13 -47 -11 147 49 66 137 -50 -121 83 137 136 325 32 54 229 -159 24 -80 -147 -49
2697 -49 -11 -35 -131 175 -102 226 111 258 -67 28 314 48 57 -2 7 -161 32 141 128 245 9 -102 -177 64
2721 64 105 -103 -44 -132 0 -156 283 111 153 -66 26 -147 -29 48 -298 -204 95 -195 73 67 -87 108 -118
2744 -118 152 -69 57 -37 118 4 352 246 146 -76 191 52 221 -90 288 312 -20 -53 -24 15 44 -182
2766a82M22q9k23J39k66K59k36L05k33J79j21J07J20K6l18R0Pj3N3j00Q0l4L23
2789B95l20R1J3j66J89j88K83L6l01K5l9J82r8J45j78j55K00j07J26k1J22l4L
2812A03j10r7L0P7M0p4QR8l51L95p3J4k09J30p2j55L04M4j41j72K72j22m3j90
2836b94Q9k6L24k88K69K6Q6l60J26J13j79K57j98R7k05J29r5J27K19m04M03N0
2858B66m34L19Rn3j49J7l4L37j78O2m2j13M2J34j17K79l19Rj00J08p7K14k5r5
2882F0k69J27J01j81J9J53k47K99k7k49k1J97k65J49J62j7J44k35J33q4J21j30
2904f0J87l9j2j22r2P1N5O7K72m41J75j61P2J35K4j19L6O4k27J49j21OJ55L10
2928C84n03R0J37o9m2O6q2K49l10kJJ65j41R0J58k59J16o9j11J97L4j89K05n9
$$ plain form
2766 -182 240 151 -72 67 -199 60 -176 129 -104 75 -46 61 181 207 -111 -21 -14 -27 26 -74 6 -28 295
2789 295 -25 66 79 -87 102 -86 197 233 -68 -43 -82 100 2 147 -31 -186 14 -93 33 12 134 100 103
2812 103 -7 -104 -74 3 43 -31 -23 75 -276 119 46 60 -149 -19 -91 -246 58 102 -39 -211 61 -61 -104 -294
2836 -294 -205 -231 93 -195 74 100 186 -174 -48 65 -114 143 -55 42 -163 -34 -129 -2 217 -187 216 266
2858 266 -168 151 160 107 -42 -25 -59 278 100 162 120 7 49 183 66 345 26 35 -65 43 -34 180 155 60
2882 60 -209 -82 19 -162 -143 10 -237 62 35 -214 -235 -38 -303 -154 8 -9 135 -100 33 -51 70 -60
2904 -60 127 88 76 -46 -138 -67 -12 55 327 -114 61 -100 -28 107 131 12 48 112 -115 34 -87 -81 74 384
2928 384 -119 -29 108 39 -3 63 -19 230 -80 -82 -81 84 -57 33 191 -68 48 -21 -132 65 99 -90 115 56
2952E6j15j02L8Q7O0r6L9N2j01p0J61J68o8k45K52j75N3K7K4k34K6P4J14j4k7
2977a6J2O9l4J64j11k26J57r6J9J62j81J16J54j63k32J69j27L85m62J02N2K60
2999A73p7k35l7O8K02j92L31l07P4j13J00N7j57J74m8j42Q7KL01l32J44m7k9J36
3023A33j98j24J63K73l8j65o7j77J69J0j0l43L66K9P9p9j61J99j05M7J7K08j89
3046C7pJ55l52J82J60l36L07j57r5J8L4MNJ63j25l7O3k6j23J38j19N9k61K98M4
3071B9O5l9j00J96qJ79n18l4L40q1J13k71R6K37j77Q6j53J7M1j94J03R2k74J52
3095a03J16J37j8M7M5L2k04j67p5P7K14J1k25K42k3j69N3P0j06O7j77K10mL29
3119C79l85r7J81M8q0q9m6K22j17k51P3m3J69k75L95l59J93j52L63k35N1K71j46
$$ plain form
2952 56 -59 -161 -123 -36 24 -72 -33 19 -82 -152 9 177 109 -136 116 -59 -6 21 45 -189 -163 -89 25 11 -16
2977 -16 -4 65 31 195 84 -142 15 -81 -62 100 -81 35 189 26 -206 -37 -164 221 -241 -139 -87 173
2999 173 96 -139 -176 -108 94 -98 233 -74 0 -113 -13 44 -113 61 13 -129 -42 -40 261 -71 73 26 -3 133
3023 133 -65 -189 -26 247 209 44 -23 -200 -31 -21 -31 -374 -8 21 100 21 -140 59 -46 1 18 226 37
3046 37 30 185 -167 15 175 -161 146 -11 -106 -88 -54 -50 -45 118 -7 -44 19 -7 -130 8 -111 -52 -313 -15 29
3071 29 94 55 -45 151 143 322 -196 -230 110 29 142 -129 -33 204 27 113 -40 -23 18 -176 -73 19 -255 -103
3095 -103 13 150 132 179 224 256 52 -115 -190 -113 101 112 -113 129 106 -63 -10 60 -46 21 -156 54 50 379
3119 379 -6 -103 78 126 46 -43 -89 133 16 -235 -162 -205 -36 -311 84 -275 -82 -234 129 -106 -55 216 70
3142G0j23k49K91k6o1K79k48J14j48Q3O8p5J87r4L0j42j39N2K23J0j07l1J69j04
3166B9K2Kn2J4k0j6O4k8j22K18k32K48k9r3k62J36N1o7N5K12j36l0ok27L22j91
3192a38P4J47j89P4%j7K72j63J1l81L09P5j31RMM7n8l9j1J5K24k43n4N08l25L1
3218E1r3j30L94k04N3p8K15l7k40L07j46l9J32J2n1p3l06J51K51k16K32k37p6
3241a28L75j22j54J18j9j47J10j01Q1LJ22l5k41Q1j25M6J0J58l44N39m34L14Q0
3264A87k38RQJ71k84J84k83M71l10M2Q2J02n1k18r7L05M6n1L8l89R2M8Q0r7J85
3289C2j22l1O9j0K80j04J64j90k33NL21j96j09J88j51J58j42J24r0J46o4q8r0
3312a33m1K43k39K37j54P3j95k9p0J87M3J98j86K0p1J00J28r9J17j67j25j0K45
$$ plain form
3142 70 -53 -302 -11 -37 -98 181 -67 47 -101 -18 50 -25 162 68 98 -44 -183 -131 92 102 -5 -36 133 29
3166 29 51 53 1 15 -5 -21 43 15 -107 111 -121 127 98 5 -257 -121 -70 -137 -82 130 -6 -36 -42 -269 53 -138
3192 -138 -64 83 -106 -32 -32 -49 223 60 71 -310 -1 74 -57 -48 -44 3 -55 -94 -105 -90 134 -109 -163 345 20 51
3218 51 -42 -172 222 18 71 -7 208 171 -69 238 92 53 185 197 146 73 -233 -82 169 -47 185 -52 -128
3241 -128 247 125 -29 89 70 -77 33 -68 13 16 138 103 -138 -57 -182 -136 -126 32 -312 227 -207 107 187
3264 187 -51 -42 -34 137 -147 37 -246 225 -85 -43 39 141 90 -128 -225 80 126 75 113 -276 -184 -136 -56 -153 32
3289 32 -90 -121 -52 -62 218 114 278 88 -145 -140 181 -15 -124 64 -87 71 -71 53 -37 109 45 -43 -133
3312 -133 -174 69 -170 67 -87 -14 -209 -238 -308 -121 -78 120 -66 -46 -117 -17 111 12 129 -38 -163 -173 72
3335G2j53L03rl49K03J02j44j1Pk47L09l49K69k22J91j4kJ65m0O1j66N3K61l40
3359e0o1J30r3k40K23J94k12k49L19J52l70J32J19Q0p3K19k56J4l0L0J36k45Q4
3382d7p0L08l71J38PN0O3J77l07K12N2q3j84J32j78J88r8q2r1K13O3j28j41J28
3406d9J76k9l27J02J02J4K07l78J48j2k1q0O1O8J84k2k14o6n9K24j1j04J65n6
3430B3P4k1q3M3L0j84J36N1k25J39K51k09j56K86j38O1q6k23K98p2k01J22Pm9
3454a26j8R2N2J30j19J88k02kp4L03k85Q4K9j70j16J59K38j55j37K14M8k22J21
3477C2K00j51l84K54N5j30J80j65L15l35M0J72l52J45K23j39P8LM7M2j35j55K42
3500H2m0l08J98O5J99j05k38R6Q1q0K84k45L5m0L7O6j34j29K87N6k82K15m9k64
$$ plain form
3335 72 -81 222 213 -136 67 169 25 14 21 -226 83 -266 3 -219 -28 -42 -44 121 81 142 -24 29 290 -50
3359 -50 -111 19 -74 -314 -91 103 -109 -358 -39 113 -257 -125 -6 74 1 220 -36 -22 -52 -22 114 -131 -47
3382 -47 -117 191 -180 -42 -35 15 78 255 -52 160 212 129 -55 77 -101 87 -11 -93 -184 29 92 -36 -177 -49
3406 -49 127 98 -229 -127 -25 -11 196 -182 -34 -46 -67 -147 -86 -18 166 144 -70 -136 -195 29 18 -86 79 23
3430 23 97 76 -7 36 66 -118 18 69 -156 -17 234 25 -131 155 17 78 -8 -231 67 -5 -206 -84 -77 -126
3454 -126 -144 -52 0 130 11 199 -3 -5 -79 224 -61 23 52 -118 -234 -75 163 8 -129 85 133 -89 32
3477 32 232 81 -303 -49 6 -124 56 -109 206 -129 -89 83 -269 -124 99 -40 38 41 88 130 -5 -160 82
3500 82 42 -266 -68 -3 196 91 -147 -51 30 -50 234 -11 24 -16 21 87 -47 -176 111 167 -115 100 51 -213
3524b13J11N8m0j55lK28RL9k04K22j34O7r4K92q4rq0o9o2Q7J88R3J3m30L0K04
3550F4j54K43q3rJ20q1o2j84O9J4J85j51K0P6r1k8J87l83J03K23k75L31j39q5
3574i0Q9k53J40p7K16n3L8r1R3J5N3k03l0K14pp5NN2J08k93Q3P5q3m7J17J03m6
$$ plain form
3524 -213 -102 -44 -84 -239 -242 -14 -5 34 -170 52 -82 -15 -109 183 99 90 10 -59 -121 -34 154 247 260 -170 -140 64
3550 64 -90 153 70 61 181 100 38 -146 -77 -63 122 -29 -9 67 -24 -52 135 -248 -145 78 -197 134 -5 -90
3574 -90 -1 -254 -114 -191 25 -28 10 -81 12 27 80 -123 -153 61 54 -21 -16 36 144 -149 -66 9 -74 -121 -4 99 53
$$ [...]
8191A27
##END NTUPLES=NMR FID
##END=
