##TITLE=1H_Pr 2837
 CDCl3,8 sc, 
 4.03.2021
##JCAMPDX= 6.0         $$ Bruker NMR JCAMP-DX V2.0
##DATA TYPE= NMR FID
##DATA CLASS= NTUPLES
##ORIGIN= UXNMR, Bruker Analytische Messtechnik GmbH
##OWNER= root
$$ XWIN-NMR		Version 3.5
$$ Thu Mar  4 10:10:50 2021 Russian Standard Time (UT+4h)  she@DPX200
##.OBSERVE FREQUENCY= 200.1315066352
##.OBSERVE NUCLEUS= ^1H
##.DELAY= (6, 6)
##.ACQUISITION MODE= SIMULTANEOUS
##.ACQUISITION SCHEME= undefined
##.AVERAGES= 8
##.DIGITISER RES= 18
##SPECTROMETER/DATA SYSTEM= spect
##.PULSE SEQUENCE= zg30
##.SOLVENT NAME= CDCl3
##.SHIFT REFERENCE= (INTERNAL, CDCl3, 0, 15.7039)
##AUDIT TRAIL= $$ (NUMBER, WHEN, WHO, WHERE, WHAT)
$$ ##TITLE= Audit trail, XWIN-NMR		Version 3.5
$$ ##JCAMPDX= 5.01
$$ ##ORIGIN= Bruker BioSpin GmbH
$$ ##OWNER= she
$$ F:/spectra/data/she/nmr/H-F/1/audita.txt
$$ ##AUDIT TRAIL=  $$ (NUMBER, WHEN, WHO, WHERE, WHAT)
(   1,<2021-03-04 10:09:53.71 +0400>,<she>,<DPX200>,
      <created by zg, POWCHK disabled, PULCHK disabled
       configuration hash MD5:
       00 E9 B6 7A A2 85 ED C7 34 08 36 98 17 FE 4E 26
       data hash MD5: 16K
       59 5D D6 58 1A 6C EB AE A1 A5 5B 16 2D B1 09 71>)
$$ ##END=
$$ 
$$ hash MD5
$$ 32 5F 8F 94 24 27 52 F7 EB 7D EC 42 BD 8A 49 21
##$RELAX= 
##$RELAX= 
##$RELAX= 
##$RELAX= 
##$RELAX= 
##$RELAX= 
$$ Bruker specific parameters
$$ --------------------------
##$DU= <F:/spectra>
##$EXPNO= 1
##$NAME= <H-F>
##$PROCNO= 1
##$TYPE= <nmr>
##$USER= <she>
##$AMP= (0..31)
100 100 100 100 100 100 100 100 100 100 100 100 100 100 100 100 100 100 
100 100 100 100 100 100 100 100 100 100 100 100 100 100 
##$AQSEQ= 0
##$AQ_mod= 1
##$AUNM= <au_zg>
##$AUTOPOS= <>
##$BF1= 200.13
##$BF2= 200.13
##$BF3= 200.13
##$BF4= 200.13
##$BF5= 200.13
##$BF6= 200.13
##$BF7= 200.13
##$BF8= 200.13
##$BYTORDA= 1
##$CFDGTYP= 0
##$CFRGTYP= 5
##$CHEMSTR= <none>
##$CNST= (0..31)
1 1 145 1 1 1 1 1 1 1 1 1 1 1 1 1 1 1 1 1 1 1 1 1 1 1 1 1 1 1 1 1 
##$CPDPRG= <>
##$CPDPRG1= <>
##$CPDPRG2= <>
##$CPDPRG3= <>
##$CPDPRG4= <mlev>
##$CPDPRG5= <mlev>
##$CPDPRG6= <mlev>
##$CPDPRG7= <mlev>
##$CPDPRG8= <mlev>
##$CPDPRGB= <>
##$CPDPRGT= <>
##$D= (0..31)
0 1.2 0 0 0 0 0 0 0 0.06 0 0.03 0 0 0 0 0.0002 0 0 0 0 0 0 0 0 0 0 0 0 
0 0 0 
##$DATE= 1614838193
##$DBL= (0..7)
120 120 120 120 120 120 120 120 
##$DBP= (0..7)
150 150 150 150 150 150 150 150 
##$DBP07= 0
##$DBPNAM0= <>
##$DBPNAM1= <>
##$DBPNAM2= <>
##$DBPNAM3= <>
##$DBPNAM4= <>
##$DBPNAM5= <>
##$DBPNAM6= <>
##$DBPNAM7= <>
##$DBPOAL= (0..7)
0.5 0.5 0.5 0.5 0.5 0.5 0.5 0.5 
##$DBPOFFS= (0..7)
0 0 0 0 0 0 0 0 
##$DE= 6
##$DECBNUC= <off>
##$DECIM= 32
##$DECNUC= <off>
##$DECSTAT= 4
##$DIGMOD= 1
##$DIGTYP= 9
##$DL= (0..7)
0 120 120 120 120 120 120 120 
##$DP= (0..7)
150 150 150 150 150 150 150 150 
##$DP07= 0
##$DPNAME0= <>
##$DPNAME1= <>
##$DPNAME2= <>
##$DPNAME3= <>
##$DPNAME4= <>
##$DPNAME5= <>
##$DPNAME6= <>
##$DPNAME7= <>
##$DPOAL= (0..7)
0.5 0.5 0.5 0.5 0.5 0.5 0.5 0.5 
##$DPOFFS= (0..7)
0 0 0 0 0 0 0 0 
##$DQDMODE= 0
##$DR= 18
##$DS= 0
##$DSLIST= <SSSSSSSSSSSSSSS>
$$ [...]
##$SUBNAM2= <"">
##$SUBNAM3= <"">
##$SUBNAM4= <"">
##$SUBNAM5= <"">
##$SUBNAM6= <"">
##$SUBNAM7= <"">
##$SUBNAM8= <"">
##$SUBNAM9= <"">
##$SW= 16.9725356469052
##$SWIBOX= (0..15)
0 0 2 0 0 0 0 0 0 0 0 0 0 0 0 0 
##$SW_h= 3396.73913043478
##$TD= 16384
##$TD0= 1
##$TE= 0
##$TE2= 300
##$TE3= 300
##$TEG= 300
##$TL= (0..7)
0 120 120 120 120 120 120 120 
##$TP= (0..7)
150 150 150 150 150 150 150 150 
##$TP07= 0
##$TPNAME0= <>
##$TPNAME1= <>
##$TPNAME2= <>
##$TPNAME3= <>
##$TPNAME4= <>
##$TPNAME5= <>
##$TPNAME6= <>
##$TPNAME7= <>
##$TPOAL= (0..7)
0.5 0.5 0.5 0.5 0.5 0.5 0.5 0.5 
##$TPOFFS= (0..7)
0 0 0 0 0 0 0 0 
##$TUNHIN= 0
##$TUNHOUT= 0
##$TUNXOUT= 0
##$USERA1= <user>
##$USERA2= <user>
##$USERA3= <user>
##$USERA4= <user>
##$USERA5= <user>
##$V9= 5
##$VALIST= <valist>
##$VCLIST= <CCCCCCCCCCCCCCC>
##$VD= 0
##$VDLIST= <DDDDDDDDDDDDDDD>
##$VPLIST= <PPPPPPPPPPPPPPP>
##$VTLIST= <TTTTTTTTTTTTTTT>
##$WBST= 1024
##$WBSW= 4
##$XGAIN= (0..3)
0 0 0 0 
##$XL= 0
##$YL= 0
##$YMAX_a= 567560
##$YMIN_a= -306390
##$ZGOPTNS= <>
##$ZL1= 120
##$ZL2= 120
##$ZL3= 120
##$ZL4= 120
##$ABSF1= 10
##$ABSF2= 0
##$ABSG= 5
##$ABSL= 3
##$ALPHA= 0
##$AQORDER= 0
##$ASSFAC= 0
##$ASSFACI= 0
##$ASSFACX= 0
##$ASSWID= 0
##$AUNMP= <proc_1d>
##$AZFE= 0.1
##$AZFW= 0.1
##$BCFW= 1
##$BC_mod= 2
##$BYTORDP= 1
##$COROFFS= 0
##$CY= 11.3945322036743
##$DATMOD= 1
##$DC= 2
##$DFILT= <>
##$DTYPP= 0
##$F1P= 15.9154993809931
##$F2P= -4.1035820241983
##$FCOR= 0.5
##$FTSIZE= 0
##$FT_mod= 4
##$GAMMA= 1
##$GB= 0.15
##$INTBC= 1
##$INTSCL= 1
##$ISEN= 128
##$LB= 0.24
##$LEV0= 0
##$LPBIN= 0
##$MAXI= 10000
##$MC2= 0
##$MEAN= 0
##$ME_mod= 0
##$MI= 1.114404
##$NCOEF= 0
##$NC_proc= 0
##$NLEV= 6
##$NOISF1= 3.799351
##$NOISF2= 2.8
##$NSP= 1
##$NTH_PI= 0
##$NZP= 0
##$OFFSET= 15.70392
##$PC= 1
##$PHC0= -10755.38
##$PHC1= 0.6009378
##$PH_mod= 1
##$PKNL= yes
##$PPARMOD= 0
##$PSCAL= 0
##$PSIGN= 0
##$REVERSE= no
##$SF= 200.130013532006
##$SI= 16384
##$SIGF1= 3
##$SIGF2= 2
##$SINO= 400
##$SIOLD= 16384
##$SREGLST= <1H.CDCl3>
##$SSB= 0
##$STSI= 0
##$STSR= 0
##$SW_p= 3612.71676300578
##$SYMM= 0
##$S_DEV= 0
##$TDeff= 0
##$TDoff= 0
##$TI= <>
##$TILT= no
##$TM1= 0
##$TM2= 0
##$TOPLEV= 0
##$USERP1= <user>
##$USERP2= <user>
##$USERP3= <user>
##$USERP4= <user>
##$USERP5= <user>
##$WDW= 1
##$XDIM= 8192
##$YMAX_p= 0
##$YMIN_p= 0
$$ End of Bruker specific parameters
$$ ---------------------------------
##NTUPLES= NMR FID
##VAR_NAME=  TIME,          FID/REAL,        FID/IMAG
##SYMBOL=    X,             R,               I
##VAR_TYPE=  INDEPENDENT,   DEPENDENT,       DEPENDENT
##VAR_FORM=  AFFN,          ASDF,            ASDF
##VAR_DIM=   8192,          8192,            8192
##UNITS=     SECONDS,       ARBITRARY UNITS, ARBITRARY UNITS
##FACTOR=    0.0002944,     1,               1
##FIRST=     0,             0,               0
##LAST=      2.4114304,     0,               0
##MIN=       0,             -306390,         0
##MAX=       2.4114304,     567560,          0
$$ Real data points
##PAGE= N=1
##DATA TABLE= (X++(R..R)), XYDATA
0@%%%%%%%%%%qJ6j6J6k4L2m0M8n6P2q8J04j21J45j72J99k31K69l10L54m07M65
32B47n25N96o76P63q58R61j077J202j336J484j647J824k019K232k463K716k992
49a568L298l634M001m411M867n377N952o602P349q215R232j0448J1936j3803J6219
64H796j9495K4212l1625M5056p7104K98114L19606m01535q9190J83329J86465
75D46629r5805j63412q6341J45607J85181m4925k90446m7116K64464R0736k82348
86A22224k04843R5668J41547o1846j74973j25542O5629J79490J7872k28524q4542
97b57840K33833J73491j57193j84088P5966J65749J4647j15150j15165J9422J72330
108B6002P5307j77255j21763J73677K00378p8474j72273K0803J41186N5690p7973
$$ plain form
0 0 0 0 0 0 0 0 0 0 0 0 -8 8 -8 8 -16 16 -24 24 -32 40 -48 56 -65 80 -92 107 -124 145 -165 189 -218 247
32 247 -278 318 -358 405 -453 508 -569 633 -703 781 -866 958 -1061 1171 -1292 1424 -1568
49 -1568 1730 -1904 2097 -2314 2553 -2824 3128 -3474 3875 -4340 4892 -5556 6380 -7423 8796
64 8796 -10699 13513 -18112 26944 -50160 247954 567560 166025 76835 260164 446629
75 446629 350824 187412 101071 246678 431859 386934 96488 49372 313836 404572 122224
86 122224 -82619 13049 154596 92750 -82223 -207765 -142136 37354 55226 -173298 -257840
97 -257840 -24007 149484 -7709 -191797 -115831 49918 64565 -50585 -165750 -146328 26002
108 26002 101309 -75946 -197709 -24032 176346 97872 -74401 -53598 87588 143278 65305
119F5305j35080m1671J29450R0585j44865j72128Q7887J92200k4316j60183k6712
130a39528J19606Q9112l2094j15357o0028R8665J12658q6412j78119K4584J73577
141F664K3594j33768n3483Q9267J00825J4115q4158p3270P1607J31799l7216j69420
153a13444j9473J44477N0972j08594p7861N0231R8038L9446o0376p7514M4846
164b9252J35116R378j39682n3310J11213P3342p9464r4204J1693P8100M5837m0103
176B8664q2324Q979J20124M5179j08922p5233Q1540Q1620n0456r0187j5341M9198
188g159M6313j7293q0590k0469R7132O7687p1919p7363N4631Q7264j2318p2943
200g027l0550L1608N0692j197p4329m2345O8041P6215m4304q1164K6252Q4924
$$ plain form
119 65305 -69775 -111446 18004 108589 -36276 -208404 -120517 71683 47367 -112816 -139528
130 -139528 -19922 69190 37096 -78261 -138289 -39624 73034 -13378 -191497 -166913 6664
141 6664 30258 -103510 -156993 -67726 33099 47214 -36944 -110214 -38607 93192 55976 -113444
153 -113444 -132917 11560 62532 -46062 -123923 -73692 24346 63792 3416 -74098 -29252
164 -29252 105864 115242 -24440 -77750 33463 106805 27341 -66863 -55170 22930 68767 28664
176 28664 -53660 -44681 75443 120622 11700 -63533 18007 99627 49171 -41016 -56357 -7159
188 -7159 39154 21861 -58729 -79198 17934 85621 13702 -63661 -9030 78234 65916 -7027
200 -7027 -37577 -5969 44723 43526 -30803 -73148 -5107 71108 26804 -54360 -28108 56816
212E6816J1999n7584l5626J6039M3935J2748n7850o1212L5812P5801k1784q0476
224f1382R74P2898K8227l4840l4385L453M1915L0725l7185o5286J5280O9377k446
237B7325p0646j8325N4092L5071j7602l1927l378L3822L8708j5181n7431m820
249c0292N8442J6390n8377l5426L3782L6259q562k8603j2586K0670M3158L011
261C7866m9677j7361N1224K9352m5726m0083J9161L1130k592k2708k0075P665
273b1824L8360J4379l6905k4747L8443L6297k5450l7800N886K6092M580j6795
285E16k2646l319K7134K0870k3866k9686K4199L9025r401l3050J707K1196O562
298A9241r001j6821j1713J4435K3890j4186l1446J1457L6102o0k4576k214J5125
$$ plain form
212 56816 68815 11231 -24395 -8356 35579 48327 -9523 -70735 -34923 40878 19094 -61382
224 -61382 -60408 12490 40717 5877 -28508 -25055 16860 47585 10400 -54886 -39606 29771 27325
237 27325 -43321 -61646 -7554 27517 9915 -22012 -25390 8432 47140 31959 -25472 -30292
249 -30292 28150 44540 -13837 -49263 -15481 20778 12216 -16387 -28973 -8303 34855 37866
261 37866 -11811 -29172 22052 51404 5678 -34405 -15244 15886 13294 -9414 -29489 -21824
273 -21824 16536 30915 -5990 -30737 7706 44003 18553 -19247 -13361 12731 17311 516
285 516 -22130 -25449 1685 22555 -1311 -30997 -6798 32227 22826 -10224 -8517 12679 19241
298 19241 10240 -6581 -18294 -3859 20031 5845 -25601 -14144 21958 21898 -2678 -4892 10233
311A0233R838r31j2328j4749P040K1683p483k8529m36K7092M444j8887n343J0581
325B225Q131J257m862j2870r33J6398J321k3612q168J9005O644j4414n178R016
339f040L253K973L438p320m606J2839O658j5019p297J2057L362j0078j818N600
353a998k947k36O281k431p523M233P836p146p763L840K037p672j025M169n349
368a5694m824O880M859p483q45Q736O04l416M129K307n845M424Q587n256q140
383a0977Q218R661o074m172N376K872o38L275j198p124K991R458m139j2419K195
398b695Q913j130p052j466J595K156N111k002r242J272J4642K361j4212k700J3368
413H919O147o568m403N15M634Q113r52j3860k536J6874N187j5993r883J0228R025
$$ plain form
311 10233 20071 19140 6812 -7937 -897 20786 13303 -15226 -15662 11430 15874 -3013 -8356 2225
325 2225 10356 11613 6751 -6119 -7052 9346 10667 -12945 -21113 -2108 4536 -9878 -15056 -6040
339 -6040 -2787 186 3624 -3696 -8302 4537 11195 -3824 -11121 936 4298 -5780 -7598 -1998
353 -1998 -4945 -5181 1100 -1331 -8854 -4621 3215 -3931 -11694 -7854 -5817 -13489 -14514 -10345 -15694
368 -15694 -20518 -13638 -8779 -16262 -17107 -8371 -7767 -11183 -7054 -4747 -10592 -6168 2419 -2837 -10977
383 -10977 -2759 6902 828 -3344 2032 4904 4266 7541 6343 -781 2210 11668 7529 -4890 -2695
398 -2695 6218 5088 -1964 -3430 -1835 321 5432 3430 -5812 -4540 10102 12463 -1749 -4449 8919
413 8919 15066 8498 4095 4610 9244 17357 16405 2545 9 16883 22070 6077 -3806 6422 15447
428A5447m588r602o226M808J0997j299j7425o348J7047J0335j4323j4492Q195
441g474J5167J439j0540o432O369J5195M578j5940r532J6118J7137j0648j9152
454c715L286J6038M611j1662j2434O72J5338O582j7916j6641J1483J8961q229
467F374k1933l769J4570Q774r125j5409k224J7405J2043j1981j7495Q820K4363
480A0413L079j8616p728J5334J5950k996j5386n918J4487J6790p088k2043J229
493b493K2896P733j9061j4435Q523J4551l12j7703j4630P565J7669m804k4733
506a9234p566J9657J3296j4060j8299L831J8378P618j3966j6369O111K2277L152
519D826k1192j2002J7966K0129p158j9144k01J9384J2888q474j7795M03K1065
$$ plain form
428 15447 10859 1257 -4969 -161 10836 9537 -7888 -14236 2811 13146 -1177 -15669 -7474
441 -7474 7693 9132 -1408 -7840 -1471 13724 18302 2362 -7170 8948 26085 15437 -3715
454 -3715 -429 15609 20220 8558 -3876 -3204 12134 18716 800 -15841 -4358 14603 6374
467 6374 -15559 -19328 -4758 4016 -5109 -20518 -22742 -5337 6706 -5275 -22770 -13950 10413
480 10413 13492 -5124 -12852 2482 18432 15436 50 -5868 8619 25409 18321 -3722 -2493
493 -2493 20403 28136 9075 -5360 3163 17714 17402 -301 -14931 -7366 10303 5499 -19234
506 -19234 -26800 -7143 6153 -7907 -26206 -22375 -3997 3621 -10345 -26714 -20603 1674 4826
519 4826 -16366 -28368 -10402 9727 2569 -16575 -16776 2608 15496 7022 -10773 -10370 10695
532A0695R759j9242j8807J0691K0341k729k1038q231J3737J5728m403k0296o369
545b0164J9059J5003j5163k2449M097K0894L451j8885j3736R264J8655R70j8355
558a7359r999J5807K0369o410k2082j720K1627J1105j4924j6886M740J9632P037
571A0937j5326j4767J1531K3584M54k1178o280J9058J4951q980j8559j586J6824
584A0663J1127j2322j8867M196K1554N887j8252j2358J2957J8146k494j8590p008
597e361J3425J4442p480k0410l350J9145J1421j4854j6674P461J9939L289j5779
610E214j0992R031J7256j270k0026r934J5545J5041j0826j9867O20J8134Q200
623A6126j2794j5065M533J8753M052j8020j3833J1006J7127m807j9946n743J5779
$$ plain form
532 10695 20454 1212 -17595 -6904 13437 10708 -10330 -18561 -4824 10904 6501 -13795 -20164
545 -20164 -1105 13898 -1265 -23714 -19617 1277 4728 -14157 -27893 -18629 26 996 -17359
558 -17359 -27358 -11551 8818 2408 -19674 -21394 233 11338 -3586 -20472 -15732 3900 10937
571 10937 -4389 -19156 -7625 15959 16413 -4765 -11045 8013 22964 13984 -4575 -6161 10663
584 10663 21790 9468 -9399 -5203 16351 22238 3986 -8372 4585 22731 20237 1647 -5361
597 -5361 8064 22506 15026 -5384 -8734 10411 21832 6978 -9696 -2235 17704 20993 5214
610 5214 -5778 3253 20509 19239 -787 -10721 4824 19865 9039 -10828 -10208 7926 16126
623 16126 3332 -11733 -7200 11553 15605 -2415 -16248 -5242 11885 7078 -12868 -18611 -2832
636b832J2231q011j6132N66J7474R934j2019j5398O253J8904J987j8134j0086
649a5263J1308J4604l959j6056m970J4056J3637p240j7439P96J8149O398j4492
662d71j3347N650J4726J172j5359j0063R792J5596k719j6365m537J5849J1917
675A1841q640j5340J996J4878N892j1666j2568N000J5571K916j4724q349J1768
688a425J4316l643j4330k048J2106R309o956j4333o27J3950O288j2082j1982O232
702e225J4407L31j2705o328R016J1576l094j3615l991J1240Q583q207j3422J110
716a0324J3584M249j0159r128O385J2091J378j0781o934Q468J0887l084j3415
729f783k825J1385P187o938j0490K032J0981M941q239q774N121J1581M16j1577
$$ plain form
636 -2832 9399 1388 -14744 -14178 3296 13230 1211 -14187 -7934 10970 12957 -5177 -15263
649 -15263 -3955 10649 6690 -9366 -14336 -280 13357 6117 -11322 -10526 7623 14021 -471
662 -471 -13818 -8168 6558 7730 -7629 -17692 -7900 7696 4977 -11388 -15925 -76 11841
675 11841 3201 -12139 -10143 4735 10627 -1039 -13607 -8607 6964 9880 -4844 -13193 -1425
688 -1425 12891 9248 -5082 -7130 4976 14285 7329 -7004 -7631 6319 12607 525 -11457 -5225
702 -5225 9182 9513 -3192 -9520 -504 11072 7978 -5637 -9628 1612 10195 1988 -11434 -10324
716 -10324 3260 7509 -2650 -11778 -5393 6698 8076 -2705 -9639 -1171 9716 6632 -6783
729 -6783 -9608 1777 8964 2026 -8464 -6432 4549 9490 1251 -7523 -2402 9179 9595 -1982
743a982n649P496Q482l777j0371k371Q850O861n312r398R78J1107M005q524p426
758g031M806R360o23r687m083O045P835k368r132j971R040O587n994q408K444
773c180Q418J911p058o644L259P648k34q555m239N974P026k931q028p11P279M487
789D422m564o669J225P155K294o474n167L308P275J76o767k420O043N396k066
804C167n281j239N891L979l811o392J055O579J360o073m088L541N561m00n585
819a736k416L842M734j962n814j237N138L016l751m902J323M973J591l812l386
834d399K646N032N37m564k282L856L828j789m598j03L645K386k231l711N08M471
850C232J450l281k933J979L843j65l700j957K222K897r77l607j477L332K493j936
$$ plain form
743 -1982 -7631 -135 8347 4570 -5801 -8172 678 7539 2227 -7171 -6193 4914 8919 395 -7031
758 -7031 -2225 7135 6512 -3175 -7258 -1213 6622 4254 -4878 -6849 2191 8778 2784 -5624 -3180
773 -3180 5238 7149 91 -6553 -3294 4354 4120 -4435 -8674 -2700 4326 1395 -6633 -7344 -65 4422
789 4422 -142 -6811 -5586 1569 3863 -2611 -7778 -4470 2805 2981 -3786 -6206 -163 5233 3167
804 3167 -2114 -3353 2538 6517 2706 -3686 -2631 3948 5308 -765 -4853 -1312 4249 3849 -1736
819 -1736 -4152 -310 4424 2462 -3352 -4589 549 3565 -186 -5088 -3765 1208 2799 -1013 -4399
834 -4399 -1753 3279 3816 -748 -3030 826 4654 2865 -1733 -1836 1809 4195 1964 -1747 -1239 3232
850 3232 4682 1401 -1532 447 4290 4125 425 -1532 690 3587 2610 -997 -2474 858 3351 1415
866A415l745N59L545Q77k717k541J022K745J41l038j820J453K921n84l533o08
882c908K706J869j239k236JK414J365j694k430Q85L016N44k337j345J746K331
898A688k6k115p20J701K129p90k130k90K225J039j672j718M54J840L52j769r76
915g78P53J276J67j868j049J049J769r64j586k06J168Q24p60j104m08J445J211
932I39j006j125L13J682M03j195q38N77J399k1r22p40R39J121k65j267k66J315
950A043N70n68r96j72Q55P53q93j132J07J114J92j120r27N87O58N1j117k16K09
969a002J137k17j243j60P55N48o25o15k70J050N46p12m12M7R84P54p47o90N19
988c53J079k6q25m32P98Q90j81p12l82P00Q25m85j145q1R44M56o41p42p8O24N29
$$ plain form
866 1415 -2330 -1771 1774 2651 -66 -2607 -1585 1160 1301 -1737 -3557 -2104 817 233 -3300 -3908
882 -3908 -1202 667 -572 -2808 -2807 -393 972 -722 -3152 -2267 749 1293 -1044 -2389 -643 1688
898 1688 1662 -453 -1173 528 2657 1867 -263 -553 1672 2711 1039 -679 -225 1615 1967 198 -778
915 -778 -25 1251 1418 -450 -1499 -450 1319 355 -1231 -1437 -269 555 -205 -1309 -1717 -272 939
932 939 -67 -1192 -879 803 1206 11 -827 -250 1149 1128 206 -534 405 1526 1261 -6 -272 1043
950 1043 1613 1045 49 -123 732 1485 592 -540 -433 681 873 -247 -1174 -587 71 122 -995 -1211 -1002
969 -1002 135 -82 -1325 -1485 -730 -182 -807 -1422 -1692 -642 -96 -808 -1220 -1173 -189 565 -182 -872 -353
988 -353 726 700 -125 -557 241 1131 950 238 -144 556 1381 896 -249 -330 614 1070 429 -313 -391 233 762
1009G62q40p15K3R42P5p66o21P29N42j54o63o59J270Q95p01q43l7J095Q24r17
1029B41r36P06J293k2p56j067P31J256M6j040o85Q57Q04j34j515k29J078Q47j013
1048D62j029N6J004M53r53r48L91J318k20r07q48J038Q92m86q36k99J012P01o47
1067A54p72k44J565N27j316o93L77J018K30j033p78R31R33l68j059k78R85J007
1085A186j022j167L13R56O37r64j093O09J155J4j217n29R27R82o06p95k16N40
1103b90Q69k27j136m3J078L55p45o43K21J473k33p30j040R33J128l45j279j54
1121h08R28R83p69j076J31J072N60r70r07L62J112J10j057p31R75Q28j14j213
1139e84k27Q27P87m66j101J28J012N79j016p81M41R85J10j040m63O52J045m60
$$ plain form
1009 762 -78 -793 -770 172 247 -519 -1140 -411 131 -23 -686 -1345 -75 820 119 -724 -761 334 1158 241
1029 241 -695 11 1304 1282 526 -541 190 1446 1492 452 -233 624 1428 1294 -221 -450 628 1475 462
1048 462 -567 -511 493 946 -7 -955 -564 754 534 -373 -1221 -183 709 223 -613 -912 100 801 154
1067 154 -618 -862 703 1230 -86 -779 -402 616 846 -187 -965 -34 899 531 -528 -806 179 1186
1085 1186 164 -1003 -690 266 903 -61 -1154 -545 610 624 -593 -1122 -195 787 181 -614 -830 -290
1103 -290 579 352 -784 -827 251 606 -139 -782 -561 912 679 -51 -1091 -158 970 625 -654 -808
1121 -808 120 1103 334 -742 -611 461 1021 51 -856 -494 618 728 -329 -1060 -85 743 629 -584
1139 -584 -811 16 803 337 -764 -636 376 955 -61 -842 -401 584 694 -346 -809 -157 888 428
1157D28o69m67R43O71l37j187M9J187L22p03j152M18P57M58r58m80M44Q86k28
1176C82p54k42L21R44l85r35J08R75K78p47o68K94P12L51o12p80N59Q32k8r27
1196c22k78O22O73l68q31pP21N65m49q94J75R25K75p66o87P02L87J84q31m09N19
1217i4N28M7r92j43P30M70j82p82K5O81K92l57r00M22O65j23k95n58L97Q13l42
1238C02o55k0M74M41n10j90k52M33K49k01o17J37P12Q3o27m35M32M54M19j086
1258d57J08K42N10m0j097K77L90M30k66p05L86N39Q4n14k37K71L06K14o04l88
1278e51O67L85l17k78j97M59L96k41m76p0N54L12m61q01N91M73q9l19m25L50L76
1299C38J05p59P7K35O30m10m88o2N12L48k69n35j11N03j56R1n81j5O01J75n73
$$ plain form
1157 428 -241 -708 235 906 569 -618 -569 618 940 237 -915 -497 260 718 -240 -720 -276 610 382
1176 382 -372 -614 -293 651 266 -669 -561 414 692 -55 -723 -429 283 634 22 -758 -199 633 605 -322
1196 -322 -600 22 695 327 -504 -511 210 775 326 -568 -393 532 807 41 -646 56 443 627 -204 -613 -94
1217 -94 434 481 -511 -654 76 546 364 -418 -393 288 580 223 -677 -255 410 287 -8 -566 -169 644 302
1238 302 -353 -373 101 542 32 -158 -410 23 272 71 -546 -409 303 386 -241 -676 -244 210 629 -457
1258 -457 -349 -107 403 363 -734 -457 -67 363 97 -608 -222 317 401 -113 -350 -79 227 441 -163 -551
1278 -551 116 501 184 -94 -291 168 564 323 -153 -223 331 643 182 -619 -28 445 356 37 -388 -38 338
1299 338 443 -316 -239 -4 626 216 -272 -334 178 526 257 -278 -389 114 -42 49 -532 -547 54 229 -344
1320c44j76N23K45k36j84l34L79L57l33k04m4N55j03l26M6M7L60J70k88j41j13
1341a44M80K0l92m65R40J13k65o00L3O02Q8j80m44L26j7L83l19n30N39q9K07n31
1363b45OR1M52J30o67K23M0L53j84m33mM8K62l49j41Q1L07qk40j4J04Q9K4l45
1387d20L1J62K80J60p32L54Q0J75p8n02M10J82J35jm04L25J3K48l68r6J76J1L36
1410D77n53R4j58K61J58k53R8J36l4P9m79J65L36k51j06k80L22O6K9o8k51L71
1432A59oj83j13Q9L66K5k48l46m0O03r7o4l10j23M66M5n6k28K52K32m8k15k08
1455d8J29n0j35Q4j23K84m4k15k0J82L2K02l36R5j1K53k66k66J11J89J49N4q8
1478A62l61K81J37J69o00Q2L77j47o0l5l55N05j54j78r8L52q5J34k20P4k14L41
$$ plain form
1320 -344 -520 3 248 12 -172 -506 -127 230 -103 -307 -351 204 101 -225 -179 -132 228 398 110 -31 -144
1341 -144 336 356 -36 -501 439 552 287 -313 -280 322 410 230 -214 112 95 478 159 -371 168 79 286 -245
1363 -245 -239 -148 304 434 -233 -10 30 383 199 -234 -238 -190 72 -277 -418 -337 -30 -38 -278 -292 -188 -99 -75 -420
1387 -420 -389 -227 53 213 -519 -165 -85 90 12 -490 -80 102 237 236 -168 157 170 418 50 -46 130 141 477
1410 477 -76 18 -140 121 279 26 124 260 226 305 -174 -9 327 76 -30 -310 12 78 107 39 -212 159
1432 159 153 -30 -143 -54 312 337 89 -257 -297 306 209 145 -165 -288 178 223 167 -61 191 423 375 160 -48
1455 -48 81 31 -104 -20 -143 141 97 -118 -138 44 76 278 -58 37 26 279 13 -253 -142 47 196 250 162
1478 162 -199 82 219 388 -212 -130 247 100 40 5 -350 155 1 -177 -275 77 -8 126 -94 -20 -234 107
1500A07j77l48n1J74K28p5m43K74J56J82k84l2q4K05L99n75J50o3J97l4j97J6
1522b75K7M99l0m70n9L10J93J26n88L73k8j6j06j19J01K81L1j43m22L72K90j40
1544B07l23P1K09k7j22m27L06j24M08k49M2o6R0O8Rk65K79M8j13Pm55M07J22p9
1568B3j29J23j93N98m50QJ65J39k42L3l07K62K79l16j41k03L44K04p7n57K16M04
1590A83j6p4m02K89K13P6n32J08j3L18j00l14K20J35K28k50j98oL31j33j06j19
1612a62rL18J07l83k10L43K20k46KM8J66N5J98m04r4J91N5M3l69J9K36J06m91
1635b61K39J43J29M0l59L2R6R4J2k32P4m5L30l29j17M9K9K99l52p4j03N30r9l43
1659b18J47J68L6M5j25l16J47K89p8l10O2J95K48l19l71L81n8K83m05QK77J09
$$ plain form
1500 107 -70 -418 -469 -295 -67 -142 -585 -311 -155 27 -257 -289 -373 -168 231 -344 -194 -257 -60 -94 -291 -275
1522 -275 -248 251 221 -249 -308 2 195 321 -267 106 78 62 -44 -163 -62 219 250 107 -315 57 347 207
1544 207 -116 -45 164 137 15 -412 -106 -230 178 -71 -29 -95 -5 63 72 -193 86 134 21 28 -427 -20 102 23
1568 23 -106 17 -176 422 -28 -20 145 284 42 75 -232 30 309 -7 -148 -351 -7 197 120 -437 -221 183
1590 183 167 93 -309 -20 193 269 -263 -155 -168 150 50 -264 -44 91 319 69 -129 -135 196 63 -43 -162
1612 -162 -171 147 254 -129 -339 4 224 -22 -20 28 194 249 447 43 -51 140 195 238 -131 -112 124 230 -261
1635 -261 -22 121 250 290 -69 -37 59 153 165 -67 7 -38 292 -37 -154 -105 -76 223 -129 -203 -306 224 125 -218
1659 -218 -71 97 133 178 53 -263 -116 173 95 -215 -153 42 290 -29 -400 -19 -77 206 -199 -191 86 195
1681A95j04l0j94L2J74P9j08j65K89l1j13O7K14N4j37j69j37J24J77J18m99K39
1703G5jK17k47k90K28J4J44j89j18N3J49q6n4Q7j48J86K86k99Kr2L84r7l89L78
1727A93j2J96j71l72L30N2j14j8Q0K6k62N34o64J08o8J85o4j30k9q5K01k88J20
1750b52J69P7j67j2mK24M7rk69n4J38J78L8j92J1J55J39j84K24k41N4L27k57l35
1774a95M32j99J43k31j47n1O4J09j75nJ91L5k21j09o7M22om06Q5KJ74l2o9p3R4
1799b35P9O8m1J65r2J09P3k64l2J68O4k23k6K85p9Q8rj93L74k25j9k1J42r4J91
1824B53n4L4l0J43L45l58Q3k9K9l5l48J1J81K52k08r0l58L46l1J36j08k84L7R8
1848A5j35p6J08J02K07k63o7L02K0n1l00L53k0r2R8j71OJ83J23j02J23j77J34
$$ plain form
1681 195 91 61 -133 -101 73 152 44 -121 168 137 24 91 305 359 222 53 -84 40 217 335 -164 75
1703 75 74 291 44 -246 -18 -4 140 -49 -167 -114 35 -51 -105 -18 -166 20 306 7 9 -83 301 204 -185 193
1727 193 181 377 206 -166 164 216 102 84 164 190 -72 462 -202 -94 -162 23 -41 -171 -200 -285 -84 -372 -252
1750 -252 -83 -6 -173 -185 -189 35 82 73 -196 -250 -112 66 104 -88 -77 78 217 33 257 16 70 397 140 -195
1774 -195 237 38 181 -50 -197 -248 -184 -75 -250 -255 -64 -29 -250 -359 -426 -4 -10 -416 -331 -329 -155 -187 -256 -329 -235
1799 -235 -156 -88 -129 36 -56 53 126 -138 -170 -2 62 -161 -187 98 19 107 98 -95 279 54 35 14 156 62 253
1824 253 199 233 203 346 691 333 416 387 416 381 33 44 225 477 269 179 -179 167 136 272 164 -120 -83 15
1848 15 -120 -196 -88 14 221 -42 -109 193 213 162 -138 215 195 103 201 30 36 219 342 240 363 186 320
1871C20K66l88kQ4k87K55o6j24j94M73l35k34K62k83K13m2r3J2o3K91k0k67K07
1894a5k33J43J0q2J5J21K2l4p7Okoj3K13k15J31K49k29J2j98m7oL80l98L01k52
1920b04k9n0j30K26R4l6k20j5L25J40k57j54J88J12k17J35J0K0K83k05N0K22n9
1943B29J50k38l5q2j1k6K97j63l4R9R3l44J93O8m0M9k67q4K10J35j63k15j7P9
1967a17O7j44j34M19k98J83j07j91K19K30jk89j41L81K6Q2o9j85Q4M75l70L6J23
1990B79k5o2j71k4L63j80J81m17r8J40J02j48n7J55j01J12l92J88N3J75Nk33o2
2013b17L50q8j44l22N50j10k01K10l79M29n0o3j78J02r6J44L42r1l12K69j34P2
2035H3J96k92R3J1q7N5L13k64Q7j78P3j68K12k4j40j72M34j97p4j74K3J18r0o6
$$ plain form
1871 320 586 198 196 280 -7 248 182 58 -136 337 2 -232 30 -253 -40 -82 -175 -163 -226 65 45 -222 -15
1894 -15 -248 -105 -95 -177 -162 -41 -19 -53 -130 -124 -126 -132 -145 68 -147 -16 233 4 16 -182 -229 -235 145 -253 48 -204
1920 -204 -233 -283 -413 -187 -93 -129 -349 -364 -39 101 -156 -310 -122 -10 -227 -92 -82 -62 221 16 66 288 229
1943 229 379 141 106 24 13 -13 284 121 87 186 279 -65 128 196 156 205 -62 -146 64 199 36 -179 -196 -117
1967 -117 -50 -194 -328 91 -207 -24 -131 -322 -103 127 126 -163 -304 77 103 185 116 -69 15 490 120 156 279
1990 279 254 192 21 -3 360 180 361 -56 -154 -14 88 -60 -117 38 -63 49 -343 -155 -102 73 78 -155 -217
2013 -217 133 45 -99 -421 129 19 -182 28 -351 78 28 -35 -213 -111 -207 -63 279 188 -124 145 11 83
2035 83 279 -13 80 91 4 59 372 108 195 17 90 -78 134 110 -30 -202 232 35 -39 -213 -190 -72 -162 -228
2059b28p0L44J17j84k51Q6L01k6k05L9r0M3N24l55J93j35J94j00k65M13j49J37
2081C33K00k16j88r6J99k04LQ3J18o9l33N1J33L4J67m70l6K70J30N3k93m4K09
2104C4J4p3k69K18J34J48l47K32l7k9k34Q2J07r9J55J09j89LL8N2k29m9qM45O7
2129B75l85J17K5m6Q2l07j2L23l5K32l62l2L43j35J96j74J14Q5R4l39lP8J5J22
2153B71k56J22l54J07K3j02Q3O3J95k67J36N4Oj27k6n2j04N6J81j77J5J62p6j75
2177b42R9Q2J74K23l20o6J76Q3j96K8m3K7J00m0m61K01L33k55J91J5l42J94j02
2200a41nM9K3j6j80L16m14J65R0k1j89M0M89l43j30j47L34j42K25p6o6k4N7J40
2224C4k82J99J13LJ24j03k35R1J97j33L2Q7j37P9k1N1k5K60k31K9Nj29P5l0j86
$$ plain form
2059 -228 -298 46 163 -21 -272 -186 115 89 -116 -77 -167 -124 400 45 238 103 297 197 -68 345 196 333
2081 333 533 317 129 33 232 28 31 114 232 163 -170 -119 14 48 215 -255 -291 -21 109 162 -131 -175 34
2104 34 48 -25 -294 -76 58 206 -141 91 54 25 -209 -127 -20 -119 36 145 -44 -41 -3 49 -180 -229 -237 208 275
2129 275 -110 7 32 -14 68 -239 -251 72 37 269 -93 -125 218 83 279 105 219 304 398 59 56 134 149 271
2153 271 15 137 -217 -110 -87 -189 -106 -43 152 -115 21 75 81 -46 -72 -124 -228 -172 9 -168 -153 9 -67 -242
2177 -242 -143 -61 113 336 16 -50 126 209 13 41 -2 25 125 85 -376 -175 158 -97 94 109 -233 -39 -141
2200 -141 -146 -97 -74 -90 -270 46 -368 -203 -113 -134 -323 -283 206 -137 -267 -414 -80 -222 3 -73 -139 -163 -106 34
2224 34 -248 -49 64 67 191 88 -147 -56 141 8 40 127 -10 69 48 99 74 334 103 132 137 8 83 53 -133
2249a33L82k7n4k47j54K96K90k38J60m17j1J51J50k82R8j23J72J96k56j21K30
2270F2J7O5l4K34N8o9l53J45J71ol24J10J28j28J12j53Q6M6J47j39j1j41j60K23
2294H6m9j71K13k39J41J64j38k34K31n5J34M8J79k35M9N0j72M7M3%q2k57J80J90
2318A23Qp1j20K81j79%m22L87j39K83k02q0J15L5l60N5N3K92l77J51R6j09p1P7
2342a74p8J64j60K01q7P7k28R1nJ56j42L20j67o4J52j65J31jJ31j20j11L47k33
2365C5m8R1n6K05j38K9j70J11p4j10K6n4K12k21k1K49l46J97O6n6j0k9L4j5M2
2390e1l2l2K06j84k8J02J04J14k38M0kK34j07j15K52m40K04j41L81l39k1J89K
2413I8O8o7L1j56Qq5J7j84L97k31Q3k4J75j11m8P1l3M8J5J10j69j19L61j6L9l0
$$ plain form
2249 -133 249 222 168 -79 -233 63 353 115 275 -142 -153 -2 148 -134 -36 -159 13 209 -47 -168 62
2270 62 79 144 110 344 402 333 -20 125 296 290 -34 76 204 76 188 35 121 167 314 175 164 23 -137 86
2294 86 37 -134 79 -160 -19 145 7 -227 4 -51 83 131 310 75 124 174 2 49 92 92 10 -247 -67 123
2318 123 131 60 -60 221 42 42 -380 7 -132 151 -51 -131 -16 19 -341 -286 -233 59 -318 -167 -71 -180 -251 -174
2342 -174 -252 -88 -248 -47 -134 -57 -285 -194 -199 -43 -185 135 -32 -96 56 -109 22 21 152 32 -79 268 35
2365 35 -13 78 22 227 89 118 -52 59 -15 -125 -99 -153 59 -162 -183 66 -280 -83 -17 -73 -83 -112 -78 -93 -51
2390 -51 -83 -115 91 -93 -121 -19 85 199 -39 1 -1 233 126 11 263 -177 27 -114 267 -72 -93 96 98
2413 98 166 99 130 -26 -18 -103 -86 -270 127 -104 -21 -45 130 19 -29 42 9 57 72 182 13 -106 255 239 278 248
2439B48K7k29R8J02k53K32N2q0k5j96J41k83J81N9r9J05K00l92J94k21J94oj85
2462a36OL10k90L2p7J50k39R0J18K2l47L65J5o4J06j41L5M0J04j82L09j87J48
2485A87j98K38r7j92J22K47l66J12P6k08J27r9l9q3J81J15m6n2k31L64j75k33
2507b50J96n5J86l36J79Jo3J68l51K62K23Nk08J01J29j32j47J71O7j13k3o8J56
2530I8Kj36j1J50j41J64R3n8j27j76n8K23N1pmj72J92m2k0j49N3j36j19lJ25L84
2556A76k08N1j08J02J01q8j4k7K3n4J33m5l1Q5j60L79k68K67n46L68N4l65K93
2579A18j76K02j14J6j41J75j7l8r3J90o0j76J54k1j12K46o3j38L46j72k45J10
2601iqJ24q7M2k1k24J57k23K83Qk42M4P6N2qJ22k45M5Q6N5O7k78N2P4R3j22J08
$$ plain form
2439 248 275 46 144 246 -7 225 277 197 172 -24 117 -166 15 74 -25 80 280 -112 82 -139 55 49 -136
2462 -136 -130 180 -110 -78 -155 -5 -244 -154 -36 -14 -361 4 19 -45 61 -80 -45 -5 99 -83 226 39 187
2485 187 -11 227 130 -62 60 307 -59 53 129 -79 48 -51 -90 -173 8 123 77 25 -206 158 -17 -250
2507 -250 -54 -109 77 -259 -80 -79 -142 26 -325 -63 160 165 -43 58 187 55 -92 79 146 33 10 -58 98
2530 98 100 -36 -47 103 -38 126 219 161 34 -142 -200 23 74 67 63 -109 83 41 21 -128 -75 -211 -330 -333 -208 176
2556 176 -32 19 -89 13 114 26 12 -15 8 -46 87 42 11 96 -64 315 47 314 -232 136 190 -175 118
2579 118 -58 144 30 46 -95 80 63 25 -68 122 62 -114 40 19 -93 153 90 -48 298 126 -119 -9
2601 -9 -17 107 20 62 41 -183 -26 -249 34 42 -200 -156 -80 -28 -36 86 -159 -114 -28 27 94 -184 -132 -58 35 -87 21
2628B1r9j11l0J89l7L9j00j75K86oj50J44Q1p3M9n1pK57k69J41j03R7P1p0J0q1
2654B3K98m02J28j02jk9J50J95m4n1l14J29K11l9k95J75lK00j45K0q9J5J10K2
2678A62p2R5k00J83j20K30k21Q1m6n8L5ok9j13Q1j52J83q8J29l45M04k26K19k28
2702a02kl8r4K73j71J02J3Lm7k4j67L51j20k29K27o3J9L21l42J3K37j12Q1JQ2
2727B12O0J02k27l55J36L10j36l6J26q5k28J07j98L00M4m2k95K02j14L9N7J35
2749A14j39J33l89K61j56O2M5o4J47O5j25K68j41lK47l15l2k12M02j80qK45k76
2772e1P4O4n4j98K50J6N2j30n7M8jk0k30L01k68K10j27J16Q8j29j26N6n0K1J02
2797d3J16k2k18J23L05p1n71L92R6k83L10j98R5j27K00J5j67J39LP0pq2K9J7J9
$$ plain form
2628 21 -78 -189 -219 -30 -67 -28 -128 -303 -17 -23 -173 -29 52 -21 28 -23 -30 227 -42 99 -4 93 164 94 104 23
2654 23 321 -81 47 -55 -56 -85 65 260 216 165 -149 -20 191 152 -143 32 29 229 84 104 15 30 140 162
2678 162 90 185 -15 168 48 278 57 138 92 34 69 63 34 -79 2 -150 33 -55 74 -271 133 -93 126 -102
2702 -102 -104 -142 -236 37 -134 -32 -19 -16 -63 -87 -254 97 -23 -252 -25 -88 -69 252 -90 -77 160 48 129 130 212
2727 212 272 374 147 -208 -72 238 102 66 192 107 -121 -14 -212 88 132 90 -205 -3 -117 -78 -21 114
2749 114 -25 108 -281 -20 -176 -114 -69 -133 14 79 -46 222 81 78 325 10 -22 -234 168 -12 -20 225 -51
2772 -51 23 87 33 -165 85 101 153 23 -34 14 13 -7 -237 64 -204 6 -121 -5 83 -46 -172 -116 -166 -145 -43
2797 -43 73 51 -167 -44 261 190 -381 11 107 -176 134 -64 31 -96 104 119 -48 91 94 164 157 75 104 121 140
2822A40m5Q0j61J62n0q5L5k66O9J63q2K2o5K6n7j7o6J4L12j98Q7j17j21L75j79
2847b4n8K9M9m1j74J12q9K63j80N42l26j08J41j61J46M1j27l4J18l3o7m3J13p0
2871A9k91K17Lj24O3k10L55Kq1j1j46J75k3k2j43R3Q2J45J8j7K4N5M9j31L3mj09
2898B1K46j2pl33J0oJ3p9J52N3q0m2K50j50n7M2m5J00J11j64k21M25m01k7lK28
2924B4j04j06J37K2K6PJ12n1N1j87n6K05J56r0Q1k70k0L0J65k02P9J55K4r9o2
2949B7j40N1K40k56J03r2l9Q6N6J46j99m4J43P1n6r7j07J16OJ15j20pJ46j85L63
2974C27n18K23j69J02K04j42j35K32k70J03Q4m5J39J89j62l23J00J56j56K5j25
2995a61J34J46J99l98J23j21J27N8k77J51J42j09p1j80J31K9l01L16L7j52K60
$$ plain form
2822 140 95 175 14 176 126 41 76 -190 -121 42 -40 -18 -83 -57 -114 -131 -197 -183 129 -69 18 -99 -220 155 -24
2847 -24 -82 -53 -4 -45 -219 -107 -196 67 -113 429 103 -5 136 -25 121 162 35 1 119 86 19 -24 89 19
2871 19 -272 -55 -52 -176 -113 -323 32 34 -47 -58 -204 -29 -52 -74 -217 -124 -42 103 121 104 128 183 232 101 134 130 21
2898 21 267 255 248 -85 -75 -81 -68 -147 5 58 -22 -64 186 36 -21 21 -24 76 187 23 -198 227 -174 -201 -204 24
2924 24 -80 -186 -49 -27 -1 6 118 67 118 -69 -125 80 236 146 227 -43 -63 -33 132 -70 9 164 188 89 27
2949 27 -113 -62 178 -78 25 -67 -106 -20 36 182 -17 -61 82 153 97 0 -107 9 15 130 10 3 149 -36 327
2974 327 -191 32 -137 -35 169 27 -108 124 -146 -43 41 -4 135 324 162 -161 -61 95 -61 -36 -161
2995 -161 -27 119 318 -80 43 -78 49 107 -170 -19 123 14 -57 -237 -106 -77 -378 -62 -25 -177 83
3016H3n7k46L34j31p8J66J47k58N0O5j76O7K58j28R5j10K2Jmk3k6O1M5J2l05K96
3042A60Pk33j55M27k42O1QK04k12l25L01J99q4J14k24j80J72J52l55J06j69L08
3064D0p2j9m7J06J53m2p4j5q1J53l06L64q6J2j42j23M21j48j03Q6k74j0K22p3
3088e8J31j26k62L11k2O7k06RM8J99Q0j74PN6J7P8k74K0K2J55j10J71j30k19K14
3113DO1j69K30j63j16K73k22m2K23r4K7K96l59N2j67%L46k65J4QQO4l40L60j6
3138A3o6O1J94k95M1j2j93N98m28J16M7p1j06L01q2l7o8j42K0J34J43k28l4J46
3162E2k7r9L17l15J47j79K38l7l16J23J64L6j08l4K61k63M6K36k16J53j61P0j92
3185a04J85j08J19K41j17j24l6J10j63J50j61R2j11N7J28M3k93R9J4Q3l55K25
$$ plain form
3016 83 26 -220 114 -17 -95 71 218 -40 10 75 -101 -34 224 96 191 81 103 104 100 77 51 112 157 169 -136 160
3042 160 167 -66 -221 206 -36 25 33 237 25 -300 1 200 116 230 6 -174 -2 150 -205 -99 -268 40
3064 40 -32 -51 -98 8 161 119 45 30 -51 102 -204 160 74 86 -56 -179 242 94 -9 77 -197 -207 15 -58
3088 -58 73 -53 -315 -4 -26 41 -165 -156 -108 91 171 -3 4 60 77 155 -119 -99 -77 78 -32 139 9 -210 4
3113 4 65 -104 126 -37 -153 120 -102 -144 79 -15 12 308 -51 1 -166 -166 180 -85 -71 -63 -55 9 -331 29 13
3138 13 -53 8 202 -93 -52 -64 -257 341 -87 29 76 5 -101 200 118 81 13 -129 -109 25 168 -60 -94 52
3162 52 25 -74 243 -72 75 -104 134 97 -219 -96 68 104 -4 -38 223 -40 6 242 26 179 18 88 -104
3185 -104 81 -27 92 333 216 92 56 166 3 153 -8 84 -27 30 158 201 -92 7 21 104 -251 -26
3207b6N3k72L03R0m08M97j68k20J19J14j55m4J65M8J00j22k69K18J55m18J49J55
3229F4P1R1l14j56J33J56O0Rk57m8J37K3K27l44K03j81N5KQ1qP5l43M07j12J1
3254D2j98j7N8J81L5k48K40R2j95K09k51O5J06kk21K3K17k28J27j17J23m1Q9m1
3278D8Mj91K35j12J46rq8l9%q6K38m84L62R9N9k00N0j02J23o3j23J54J25j59O1
3303D8k35P1N3j5j25J74n2J59K38n99L66l74M02k0o8J48l57K66ok83O6J89K61
3326C07j85J6j54m0q7J72j70j94LN44rn2j02l04M48l00P2mK99p8j96J5K57j99
3350E9L5j36J1J23p9p1O8KNj15R6r5K1K91k06K02l72K28l00J92j03K77Q8m88K28
3375c9K40k75pR0k07J87L9O7k19J28J1J49k24J69l27J96Q8L3n3l39J70J53j62
$$ plain form
3207 -26 27 -245 58 148 -260 237 69 -151 -32 82 -73 -117 48 96 196 74 -195 23 178 -240 -91 64
3229 64 135 226 -88 -244 -111 45 105 114 -143 -191 -54 -31 196 -148 55 -126 -71 -69 12 4 79 -264 143 31 42
3254 42 -156 -173 -115 66 101 -147 93 185 -10 199 -52 13 119 117 -104 -81 136 -92 35 -82 41 0 89 48
3278 48 52 -139 96 -16 130 121 33 -6 -6 -92 146 -338 24 123 182 -18 32 -70 53 -10 -133 21 146 -13 48
3303 48 -187 -116 -63 -78 -203 -29 -81 78 316 -283 83 -291 111 91 23 171 -186 80 74 -209 -143 46 307
3326 307 122 138 -16 -56 -143 29 -141 -335 -332 212 203 151 49 -255 193 -107 -35 -39 260 182 -14 1 258 59
3350 59 94 -42 -31 92 13 -58 10 12 17 -98 -2 -97 -76 215 9 211 -161 67 -233 -41 -144 133 221 -267 -39
3375 -39 201 -74 -81 9 -198 -11 28 95 -124 4 15 164 -60 109 -218 -22 66 99 46 -293 -123 30 -132
3398a32K1R4R5l9q3J31k6o4p1L7L32j64j05j55J84J79k19p2J38q5L5%N3j77R1
3423bJ30j45J57l35L58k39P5R5R3j34R2j85L5K26j07Q9l19K20P1j66J31j30j22
3446a12J4K77j85O4j5j62K45j54N3l3K30j32k6r1j15O1M4j13K8J02m7J23q2J73
3470A47k9k04k4K17l48J27j07J78r1R9J38k33J67j58L4J45O8j51K61l98K53L4
3492A25j25j49m5K69J90l65K32j20J03j18J91k34p9R0pk00L77k48R5K53J9J06
3514C60m92J68J51k13Oj05R1n5K2K65k32j90J67j14J5M0J6Q1l4Q7K5j07q0j7K44
3539I9k26J94j72J16J26k17k8J7J13Jj88R7j8K18k5j26N0m2J53k70J91j35J4Q5
3563B7J78j39o8QR6L3j73j12J90j25p3K49o6n7l6J8mJ03J5j90k6L56m09K58j34
$$ plain form
3398 -132 -111 -17 78 39 -44 87 61 -3 -74 -37 295 131 26 -129 55 234 15 -57 81 -4 31 31 84 -93 -2
3423 -2 128 -17 140 -195 163 -76 -1 94 187 53 145 -40 -5 221 114 203 -116 104 175 9 140 10 -112
3446 -112 -98 179 -6 58 43 -119 126 -28 25 -8 222 90 64 -27 -142 -81 -37 -150 -122 -20 -67 56 -26 147
3470 147 118 -86 -110 107 -241 -114 -221 -43 -134 -35 103 -130 37 -121 -87 58 126 -25 236 -162 91 125
3492 125 0 -149 -194 75 265 -100 132 12 115 -3 188 -46 -125 -35 -42 -242 135 -113 -18 235 254 360
3514 360 -132 36 187 -26 -20 -125 -34 -89 -67 198 -34 -224 -57 -171 -156 -116 -100 -19 -53 34 59 -48 -128 -145 99
3539 99 -127 67 -105 11 137 -80 -108 -91 22 23 -165 -68 -86 132 107 -19 31 -11 142 -128 63 -72 -58 27
3563 27 205 66 -2 6 102 135 -38 -150 40 -85 -158 91 25 -32 -68 -50 -54 49 64 -126 -152 204 -205 53 -81
3588h1Q1j8j34R0m0J08O8o2o0P9j2N6k9qm4l18J67J83rK12j73r6J17k79mK11m87
3615d82L88J82P4j53j30Q7n1J25R0j5J03l84J16o2q6M14rl03R5M1L0j13k0J70
3639A07m6K09k83j01J46J16p9p1M0n8p7J35o9m0J75j27j27o0L62l5k41L06o3j8
3663A01q3L5K7o6p3L9j87Q5L30k47J59m3j26J92j47J21R6k56k99J79K48R7j08
3686G4k8K3R8p1k2o5j73J52m8M3k33K95j13K05k6l49K59j0J18j38Q0l98K54k4
3710i7K83j64J33k25N1J6N4q6j55M74l70K02R0j53j14K43j76PM7k15R8J47p5M7
3734F2J20l04L48k30m9J53n1Q5k73J12j14K41K8k07j97J33j70J49J23j5k51J35
3756a72J45o9K9K30r6j68J20r2K67k80r2K4L30j30M7l7J17k41J6k01K38J03k08
$$ plain form
3588 -81 0 -18 -152 -62 -102 6 74 12 -48 31 19 75 46 38 -6 -324 -157 26 17 229 56 -40 77 -202 -206 5 -482
3615 -482 -94 88 162 9 -121 -34 -85 40 130 115 218 -166 -50 -112 -198 216 207 -96 -1 40 70 -43 -63 107
3639 107 61 270 -13 -114 32 148 69 -2 38 -20 -97 38 -31 -71 104 -23 -150 -210 152 117 -124 182 119 101
3663 101 18 53 80 14 -59 -20 -207 -122 208 -39 120 77 -49 143 -4 117 213 -43 -342 -163 85 182 74
3686 74 46 69 167 96 74 9 -164 -12 -60 -17 -250 45 -68 137 111 -238 21 11 129 -9 71 -327 -73 -97
3710 -97 186 22 155 -70 -19 -3 51 -35 -190 284 -86 116 206 53 -61 182 6 13 60 -155 -57 90 15 62
3734 62 182 -122 226 -4 -53 100 49 134 -139 -27 -141 100 128 -79 -276 -143 -313 -164 -41 -56 -307 -172
3756 -172 -27 -96 -67 163 67 -101 19 -73 194 -86 -178 -154 176 46 93 56 173 -68 -52 -253 -15 88 -120
3779a20L19k07m3K21k12j29pK32l96K29K55r9j44O3K02k31J10k09K23Q2k54L42
3801B27k81m0MJ19q3l4K74k57P2J3J37o2j87K17j41l6K28k54J30n7n4j83L10o1
3825Ak10K13r6R9r1N3K1R4M5j97j33L05P4r3j05N2o9J31j36R7q6J5K0p7K5P3K66
3852B91m64k4K79j34J16j07J31P1l00J89jm3J20n2j50J55J23l25J90m2m1J40j57
3875c5P1nK94k72r7k9J3m6K02j86P4m1J17l1k07M1K68k80J21j44J84OK3n1j92
3900b02R7k2n8Q6n5J31J28j99J36k50J99R9j8k29K91j96P5Opj59L63r5k28R4j36
3925a49K36j43j9N5k05L33l61M75k50J99j1r6q9PJ5j22j5J37J33j42r9J25NK4
3949D3q1j94L46k72J51pK0j91j2L51o8j36pj18K58k72O3K99k34J44j7o1R9p3k61
$$ plain form
3779 -120 199 -8 -51 170 -42 -171 -178 54 -342 -113 142 43 -101 -38 164 -67 43 -166 57 139 -115 227
3801 227 -54 -94 -90 29 -54 -88 186 -71 1 14 151 89 -98 119 -22 -58 170 -84 46 -11 -65 -248 62 1
3825 1 -209 4 -92 7 -84 -31 -10 84 129 -68 -201 104 178 85 -20 32 -37 94 -42 55 -31 -16 4 -73 -48 25 291
3852 291 -173 -197 82 -52 64 -43 88 159 -141 48 47 4 124 72 -78 77 200 -125 65 23 -18 122 -35
3875 -35 36 31 325 53 -44 -73 -60 -106 96 -90 -16 -57 60 29 -178 -137 131 -149 -28 -172 12 18 41 -10 -202
3900 -202 -105 -127 -185 -99 -154 -23 105 -94 42 -208 -9 90 72 -157 134 -62 13 19 12 -147 216 121 -107 -13 -149
3925 -149 87 -56 -75 -20 -225 108 -253 222 -28 171 160 64 -25 -18 -3 -125 -140 -3 130 -12 -111 14 19 43
3949 43 -38 -232 114 -158 -7 -14 6 -185 -197 154 86 -50 -57 -175 83 -189 -126 173 -61 83 66 5 104 31 -230
3974b30J36P2L0K17k81J15M8k21J3K82p9N4j04l29N48l99K02j45J22j07Q9k55
3996b22L49n5j65J70j24l6J54k7Pr0J01l5J18j97P4k74J10L3J88k17o5L12Pj71
4020e5L6j3r4J13l18m0K97J30o2J64j14j9J64j77j98L77L0l83j17M69k75R1K20
4043B26r9j18j08N7J58j12O9o8J18K5j25j23J09r2J1l3L44l27K48j0m9k14K03
4066I0j48M7N4r4J55O9j88Q4jo8jJ77k33j66k2K89J11K9J18k93K5L2l2J61k47
4091e2P2J76k44J83j40n3J64J3k74J00K39n2j56Q6k0n0j6n0n4J4p5N0n5K16L5
4116E7Jq1L44l16q8J07q5J6K0qMJ5k26K30j04J76mr4Q5n3q5r2M99m58K57j38R
4143a2m54L51O0R1k75K07R2r6O0k17N35j81q6jP0K55m97M6O6R5j46q9o4O5P1M55
$$ plain form
3974 -230 -94 -22 8 225 -56 59 107 -114 -101 181 102 156 52 -277 271 -128 74 -71 51 -56 33 -222
3996 -222 127 72 -93 77 -47 -83 71 44 51 -39 62 27 145 -52 22 -252 -142 -109 79 -138 -203 109 116 -55
4020 -55 -19 -32 -126 -13 -331 -371 -74 56 -6 158 44 25 189 12 -186 191 221 -162 -279 190 -85 6 226
4043 226 127 9 -99 -42 116 4 73 5 123 148 23 -100 9 -83 -72 -105 239 -88 160 150 101 -113 90
4066 90 -58 -11 43 -51 104 173 -15 69 68 0 -1 176 -57 -223 -245 44 155 184 302 9 34 66 34 195 -52
4091 -52 20 196 -48 135 -5 -58 106 119 -155 -55 184 132 -24 62 42 -8 -24 -74 -128 -114 -189 -139 -194 22 57
4116 57 58 -23 321 5 -83 24 -61 -45 -25 -33 -29 -14 -240 -10 -114 62 58 -36 49 -4 -89 -181 318 -140 117 -21 -12
4143 -12 -466 -115 -55 36 -239 -32 60 -36 24 -193 342 161 75 74 144 399 -98 -52 14 109 -37 -126 -190 -125 -54 401
4169D01k69k46l2N5J55j54P5J52k45Rm7j42K91O0J72j76j07J5J63r9lj41M5R1
4193B3Q4j60L6j32N8J15M5m8Q2j50K6j14K5K02J9j17J01Ml8k42M28o8k10J03j82
4218a10k1L28J20m16J43O1j46L8J56l02L02nk22K31j59J03J47l42m2Q4j9K74R3
4241B96k52P6j45n1K57j15k62K54j34L18m9j22k34K8L1J18J55l51K54Lj36N8J43
4264A40%p6J25j60j65J24L2m0J16QJ19k46L54j11j92N3j6j70L78m17L14m31R9
4287a62R3Q4J09k2l2L41m60K59k41J25p0J49j33k21J88LL3K85k95o9M4n8K21j81
4311a0n6k26K42P9K9n6J98j65K34q0j91l4N5j91K17J33k98J98N4j97k9O1q3j73
4335b89L57O3l1j62PQ5J43l72L95k88J83P3j37J97l11K01q6M8p7J52j70l42N55
$$ plain form
4169 401 132 -114 -146 -91 64 -90 -15 137 -108 -99 -146 -288 3 63 235 59 -48 -33 130 31 28 -113 -68 23
4193 23 107 -53 -17 -149 -91 24 69 21 103 -47 -21 -135 -110 92 111 -6 95 99 61 -181 247 179 -31 72 -110
4218 -110 -131 197 317 -99 44 105 -41 -3 153 -149 153 148 -74 157 -2 101 248 -94 -136 -52 -71 203 296
4241 296 44 120 -25 -76 181 66 -196 58 -76 242 193 71 -163 -135 -104 14 169 -182 72 75 -61 -3 140
4264 140 140 64 189 29 -136 -12 20 -20 96 104 223 -23 331 220 28 81 65 -105 273 -144 170 -261 -162
4287 -162 -69 15 124 102 70 411 -49 210 -31 94 24 173 40 -181 7 10 43 328 33 -36 8 -50 171 -10
4311 -10 -66 -292 -50 29 58 2 200 35 269 189 -2 -36 19 -172 45 178 -120 78 132 -65 -94 -33 -116 -289
4335 -289 68 131 100 -62 -55 30 173 -199 196 -92 91 164 27 224 -87 114 28 76 -1 151 -19 -361 194
4358A94j32J28j28k23J56R3k0r6m2J63p7l3R6J7n3p0J73k23j05J10J01K74l80
4381g7J39j04J10o1K13k42p2k1J98J93n20m6L31J59l86P6o9J85J16J43j89k84
4403b08J45O3J4KL3n2J96qj96J82L6j10j52j26J42k21L76k14J11p9j5J07J14r7
4427D3k51p1L70r4J44j40PJJ3J06q6J3r1k64%L10k6q8K97k12J06j07J71j2j15
4452B4R1j18J58n29L66J0o9m5J94J31l95K42r2J34l55K21L0l4J19J15mk19J0R1
4476G6j33j1P9K6jM8n5P9PJ37l39K78l34L2J97L7q0O4J79j86k92K79P4l6j3j85
4502g3Q5k00L38n4j38K7j94J58k5n0J15n7K92k36J66k66nK79J3r7p9K53k41j60
4526a49J64j1j7p4J27J09r6j01J34j72L10k03P7j73K6K91j76j0M0j31j16R0J69
$$ plain form
4358 194 62 190 62 -161 -5 88 68 -28 -70 93 16 -17 79 96 43 -27 146 -77 -182 -72 29 303 -77
4381 -77 62 -42 68 7 220 -22 -94 -115 83 276 -244 -290 41 200 -186 -110 -179 6 122 265 76 -208
4403 -208 -63 0 14 16 49 -3 193 185 -11 171 207 97 -55 -181 -39 -260 116 -98 13 -66 -81 26 140 43
4427 43 -208 -279 91 -3 141 1 8 9 22 128 42 55 -36 -300 -300 10 -16 -104 193 -19 87 -20 151 139 24
4452 24 115 -3 155 -374 -8 2 -67 -112 82 213 -182 60 -32 102 -253 -32 -2 -36 83 198 194 -25 -15 76
4476 76 -57 -68 11 37 36 84 29 108 115 252 -87 191 -143 -111 86 123 43 107 286 100 -192 87 161 125 112 -73
4502 -73 12 -188 150 96 -42 -15 -209 -51 -76 -126 -11 -68 224 -12 154 -112 -117 162 175 78 -1 252 11 -149
4526 -149 15 4 -13 -87 40 149 53 -48 86 -86 224 21 98 -75 -49 242 66 56 96 -35 -151 -61 108
4549A08j33O6r4L6Q3k41K69j23o4L13j76N4j30m8J11L0k33K99j03N6j94K30j09
4572GN9j48Mm2j11L64k09P4m3K17J3L05m79k04JK50q5L8J43j77L7M5k5j08k0J63
4598F9R7j62Pk71K10n4q1Q3j04K88j5j80J55J0jk8k1j6n8N0Q1o5M0P1J75k54j3
4625A3J5N7j15k35L05N2K6j40K48k72J76k89J48k89J84L34p6j33p3K09j05mP5
4648A11m0J15k38L21l02j46N0J17M2r7k06L58j43J06j25K33j63l7p3K56n6r5J80
4671A68k31J07J7p8o9J34m83L97N5k64K91j30J94l6l13J86K42r3k93O9K74o8k11
4694a35K90j61q9J65j03O4k4m4j85J09J54L33k57k95R8K1j65Q6P6K50m40M29r4
4717H3L8k71J36P0j77L26k81j20J62R1r3J30j02J37j43j17J13J71k38k06K08J48
$$ plain form
4549 108 -25 41 -53 -17 66 -175 94 -29 -93 220 44 98 -32 -80 31 61 -172 127 24 80 -114 116 7
4572 7 66 -82 -78 -120 -231 133 -76 -2 -45 172 185 490 11 -193 -192 58 -27 11 154 -23 14 59 34 -74 -94 69
4598 69 166 4 11 -260 -50 -104 -185 -102 -206 82 67 -113 42 52 51 23 2 -14 -72 -22 59 -6 34 105 280 26 13
4625 13 28 85 -30 -265 40 92 118 -22 226 -46 130 -159 -11 -300 -116 218 142 9 -64 145 40 36 111
4648 111 71 186 -52 269 -33 -179 -129 -12 30 -67 -273 85 -58 48 -77 156 -7 -44 -117 139 83 -12 168
4671 168 -63 44 61 -17 -86 48 -435 -38 17 -247 44 -86 108 72 -241 -55 187 94 -199 -130 144 76 -135
4694 -135 155 -6 -95 70 -33 31 7 -37 -222 -113 41 374 117 -178 -80 -59 -224 -138 -62 188 -252 177 83
4717 83 121 -150 -14 56 -121 205 -76 -196 -34 57 -36 94 -8 129 -14 -131 -18 153 -85 -291 -83 65
4739F5m7J1L4j46J11K2k4J62l75J11J49p7J25J4l7k17M2N5k61K10o0O1q7J61O9
4764G1o8j15J40j24Q5qJ09l91M02n7j32j78K81n9J17k7KK45l63qJ35n2J03j90
4788h2m0J74n5J03k66J21L79k47j83j39J03QJ70J31k87R8kOj01R2j36J75j1k12
4812b01M7J81j8m5j08O7Q8mQ3r8J32l9k13O0J5K65j82J56k95L33k70J86J03k88
4836d5J79j3p4j23K59r0j39N7J86l03K82l30P4J89l6K3r6K8j26K03o4P2k8K9K1
4861A35j80k32K88j56kL82k46J95j41j55J23j0J40L8l7q4p7o3P8J50j86L2m2J99
4885A49k51J33l1j54M4q5m7J33R6k8K4R7j38K53k35J57k85K19m1J25jj41J99q1
4909A11lj93J54j02J64m2K8J10j73k13M9K8n4J29MQ8q2J85k75r2L52j18j57J20
$$ plain form
4739 65 18 29 63 -83 28 50 26 188 -187 -76 73 -4 121 135 98 -119 -77 -22 -283 -73 -133 -72 -159 2 71
4764 71 3 -112 28 -96 -11 -19 90 -301 101 44 -88 -266 15 -44 73 46 48 293 -70 -78 57 5 108 -82
4788 -82 -122 52 -3 100 -166 -45 334 87 -96 -235 -132 -124 46 177 -110 -12 -14 -8 -109 -17 -153 22 11 -201
4812 -201 -154 27 9 -36 -144 -77 11 7 90 -8 124 85 -128 -68 -53 212 30 186 -109 224 -46 140 243 -45
4836 -45 134 121 47 -76 183 93 -46 11 197 -106 176 -154 -80 109 73 96 0 28 -98 105 41 113 85 114 135
4861 135 -45 -277 11 -145 -147 235 -11 184 43 -112 11 1 141 179 142 58 -19 -82 -4 146 -40 -8 -50 149
4885 149 -102 31 0 -154 -110 -195 -242 -109 -13 -41 -17 80 -58 195 -40 117 -168 51 10 135 134 -7 192 111
4909 111 108 -85 69 -33 131 89 117 227 54 -159 -110 -82 -136 -7 -3 85 3 188 -87 -179 173 55 -102 18
4933A8k86%L54q2Q6J05o5m23J50J11ml9O5K0p3O2j43K70j12j37J38J85j30j76
4957a06J29j52J60J17j2k81J04k16M59k12J42r3n4R1L1j9j85O8K2j69LL51l32
4980a54J19n2J28Qj57L11l14J61k49K87j31J28k41Q2M3j82Q9%K20k82L85l12L7
5003g6l7M6R1K8K6j46Nj29j43L11j03J67j30L3L45j54j19q7K91j19N9j55j7q2
5027i5M0J04j1n5K84l23J90m2qR4j75K55k44r3K14j69j47J48pm2L53j85k8j18
5051f0K0J73j71k08L27j51p3J68l9K5j27Q0q5J43M1n4O6J03N7JRl59K76l60K64
5076F6J4k5j92J34j44O8J08J40M5k84J13j02n0j1J01L3q3j20K55r7r3J48J4Nj81
5101a38n2L83l17J43k37K78K7N9j24N0j55K86K0k42Q9o6o1O5n8J45k2n3j49j14
$$ plain form
4933 18 -268 -268 86 4 90 195 130 -293 -143 -32 -36 -75 -10 10 -63 -1 -144 126 14 -123 15 200 70 -106
4957 -106 23 -129 31 148 136 -145 -41 -257 202 -10 132 39 -15 76 107 88 -97 -29 -7 -176 -173 178 -154
4980 -154 -35 -87 41 49 -108 203 -111 50 -199 88 -43 85 -156 -74 -31 -213 -124 -124 96 -186 199 -113 -76
5003 -76 -113 -67 24 52 78 -68 -63 -192 -335 -24 -127 40 -90 -57 288 134 15 -72 219 100 159 4 -13 -95
5027 -95 -55 49 38 -17 267 -56 134 92 84 178 3 258 14 -79 135 -34 -181 -33 -40 -82 271 86 58 -60
5051 -60 -40 133 -38 -246 81 -70 -143 25 -14 11 -116 -36 -121 22 63 9 75 178 235 236 245 -114 162 -198 66
5076 66 80 55 -137 -3 -147 -79 29 169 214 -70 43 -59 -109 -120 -19 14 -69 -189 66 -31 -124 24 38 43 -138
5101 -138 -190 193 -124 19 -218 60 87 146 22 72 -83 203 223 -19 70 4 -57 8 -50 95 73 20 -129 -243
5125b43J69J23J03j36J11j16l3N5j41K08M7j2j66O4N4j90M8J02M0k1m0K4K69l48
5149b9l4M2j58J90J15P0j62j98R9O7J49k96J78pk99L18oJ13K3j16j9J0j33K56
5173A73j75q5J46L7o3r7%OJ11r2j1qO0j05L7j31L26r7k36P6J59j11K01k15o5J10
5199d9q7K86j13k4k19K64m4n4n3M46l04m0j78K67j91J65o0l2K55m70J51J70k07
5222a21K75j72N2P5k08J43j03J03J10j76J4m8K53No3l40J20L3Q6J00L2k77j99
5245c06M66M2n2l03K77j60p0K63l0l4m4l0j65OJ56N1M3j66Q4j52K2J37k50k2K40
5270CQ8j36K63j10j66K54m10O3R0J23oj72K48j76J02m5m0J93j77m6J06j46J31
5293C4J73l71O4K16j55r1j05M07m08M70l19j67J71K34P3j96J40j25Kl05M99m81
$$ plain form
5125 -243 -74 49 152 16 127 11 -22 33 -108 100 147 135 -31 33 87 -103 -55 47 87 66 26 50 319 -29
5149 -29 -63 -21 -179 11 126 196 34 -164 -65 2 151 -145 33 26 -273 45 39 152 175 59 40 50 -83 173
5173 173 -2 -87 59 96 33 -64 -64 -58 53 -39 -50 -58 2 -103 -66 -197 129 32 -204 -128 31 -80 121 -94 -159 -49
5199 -49 -136 150 37 13 -206 58 14 -40 -93 353 49 9 -169 98 -93 72 12 -20 235 -235 -84 86 -121
5222 -121 154 -18 34 109 -99 44 -59 44 154 -22 -8 -56 197 202 139 -201 -81 -48 38 138 170 -107 -306
5245 -306 160 202 150 -153 124 -36 -106 157 127 93 49 19 -146 -140 16 67 110 -56 28 -124 -102 35 -215 -237 3
5270 3 91 -45 218 108 -58 196 -214 -151 -61 62 56 -116 132 -44 58 13 -27 166 -11 -57 49 -97 34
5293 34 207 -164 -100 116 -39 -130 -235 172 -236 234 -85 -252 -81 153 226 30 170 45 47 -258 241 -240
5315b40R5L10j95j4J71o8j15m0J7K57j08k00L1K78j60r3n7P9oP3J20j94pl0J32
5340C6J1k20K03l9q6J86l00L40J0J29k64l4N9p5M1n0m4q6K78M7k62K01p7N2nl5
5366A6o6J6O3o0O5j75K93j98j15L92k75o6K72n0l80J76J38lr2J68n0p9M3j08N7
5391a8o6J68j41j53J50J8O4K56k90p2j1J50L3k9k00J50J95n4q0j45L1K05j13q1
5415c3M1q8J37m08L39K8j29R1O3k40J15K31j97l6N3J59L8l59J16R7k38L63l02
5438a59M07m34J74K87l38J47j83M7j70Q0Q3QRj3N8n6L4N7j11O2q6K2K68k0j17
5463E6j91K09j15j1K23j86M2L9J6k55L01R3l25K59j22j59K68j98J01r2K14j92
5485b5Q9j49m6J34n8o5k0J15J10j14L53m78J64P4q9P7J39k09k4Q9Mr6J9J69j53
$$ plain form
5315 -240 -145 165 -30 -44 127 59 -56 -96 -79 178 70 -130 -99 179 19 -74 -131 -52 -58 15 135 -59 -66 -96 36
5340 36 47 -173 30 -9 -95 91 -209 131 141 270 6 -28 31 -44 -3 -53 -97 -183 95 142 -120 81 4 56 51 16
5366 16 -50 -34 29 -31 34 -141 152 -46 -161 231 -44 -110 162 112 -268 -92 46 43 -49 119 69 -10 33 -75 -18
5391 -18 -84 84 -57 -210 -60 -42 22 278 -12 -84 -95 55 88 59 -141 9 204 150 70 -75 -44 161 48 -33
5415 -33 8 -80 57 -351 -12 16 -113 -22 41 -199 -84 147 -50 -86 -33 126 164 -195 -79 18 -220 143 -159
5438 -159 248 -186 -12 275 -63 84 -99 -52 -222 -142 -59 -51 -42 -55 3 -53 -19 38 -73 -11 -97 -75 193 173 56
5463 56 -135 74 -41 -52 171 -15 27 66 82 -173 128 221 -104 155 33 -126 142 -56 45 -47 167 -25
5485 -25 64 -85 -131 3 -55 -120 -140 -25 85 -29 324 -154 10 84 -5 72 211 2 -22 67 71 -25 -6 163 10
5510A0%o2P1J0o4J71k82R3LK22l3k84K78k63O1N8M6j17M4j48K67r0M51o51J00
5535a09N1k5Q0R0k37K03k6J4j5K5lJ31jj99N3O9k16qJ74j00P0Q4J32k10J7R1k62
5562a27O5K22l27J05J41k33J69j8N9L7k60L13p9k24K09Q6j43j89K84k14J50m3
5584a7J59j21k0K4j4N2q6J78P9l40M4N6P1mj47K24p3R4n9m2k80L01k01N3j57K37
5610A1M9j94R0L5%N9Kj1Q8J4o8j5K33l21p2n6J64j36J62q6K7n8K48k17j22J31
5636d3r4j8J61Q5r4R0n8mJ32l60K08m5j6R6L5J4j91p0J89Q6j98j1L36l56K16Q9
5662A79k45j65L44j15j77K10p3J17L6j38%l7K28j7r7N7l02J55k1J0j57J18j22
5685b12L30l29J55O2j0J3q3J12J80j29q8l50K90O0m6J61n9j02p2J83l24L33o8
$$ plain form
5510 10 10 -52 19 29 -35 136 -146 -53 -50 172 139 -145 133 -130 -69 -11 35 -82 -38 -186 81 -9 442 -209 -109
5535 -109 -58 -83 -3 87 -150 53 27 41 26 51 48 179 178 -21 32 101 -115 -123 51 -49 21 105 237 27 44 135 -127
5562 -127 -62 160 -167 -62 79 -154 15 -3 56 93 -167 146 67 -157 52 138 -5 -194 90 -124 26 -17
5584 -17 142 21 1 25 11 63 -23 155 234 -106 -62 -6 65 61 -86 138 65 159 100 58 -222 79 -122 -69 -226 11
5610 11 60 -134 -44 -9 -9 50 52 41 129 143 75 60 293 -28 -100 -156 8 -128 34 -52 -25 -83 165 -52 -174 -43
5636 -43 -137 -155 6 91 -3 87 29 25 157 -203 5 -40 -56 40 75 89 -102 -172 17 103 -95 -106 230 -126 90 179
5662 179 -66 -231 113 -2 -179 31 -42 75 111 -27 -27 -64 164 147 50 107 -195 -40 -61 -51 -208 -90 -212
5685 -212 118 -211 -56 6 -4 9 -74 38 218 89 1 -349 -59 1 -45 116 57 -45 -117 66 -258 75 7
5708Gj76K45K9j54J17j68J59j72J57P9j19P7m12M82l13K13J46j77j93J96R8j6
5730A05p2k81L38J34n79N01n9k25K35n2L1N2j75J74L8j74j09L13k32J55k19L1
5752g0j5o9J09R1k12K40M1l62K63j97lK44j08P7qj30K14j10j08J82L1J87k22O
5776G1j99J83J8q3j39N9J74l4J07m9k39L18j67r8K8K38q6k3M2r1j1l4J23j02K29
5801B35l35J43Q1p1j93J46N4j19n4J87k48K2J24K1J31j68J38j77m0M2K73k23J39
5824A08m1n1N3j91J95q4o7M1N5k1k12M17j61l24M20j01j45n3L16N2j92Q0l11K24
5848GJ6L5R4j46l4M2J35l82J62L5J26j02k03L38j65qp6mK16j15J15j24l7K15k31
5873i1j04K18j47p8K90k43K09m18L96J34r9k46K38L8Rq6J73j48k37L77j63j77
$$ plain form
5708 7 -169 76 105 -49 68 -100 59 -113 44 123 4 81 -331 151 -162 51 197 20 -173 23 121 105
5730 105 33 -248 90 224 -355 146 87 -138 97 45 76 128 -47 127 165 -9 -118 195 -37 118 -101 -70
5752 -70 -85 -154 -45 46 -166 74 115 -247 16 -181 -184 60 -48 29 21 -109 105 -5 -113 69 100 287 65 71
5776 71 -128 55 73 -10 -149 -90 84 50 157 108 -131 187 20 -78 -50 188 102 79 121 30 19 -15 108 6 235
5801 235 -100 43 124 53 -140 6 60 -59 -113 74 -174 -152 -28 -7 124 -44 94 -83 -123 -81 192 -31 108
5824 108 67 16 69 -122 73 -11 -78 -37 18 -3 -215 202 41 -283 137 36 -109 -162 154 206 14 94 -217 7
5848 7 23 58 152 6 -28 14 149 -233 -71 -36 90 -12 -215 123 -42 -50 -126 -130 86 -29 86 -38 -75 140 -91
5873 -91 -195 23 -124 -202 88 -155 54 -364 32 166 67 -179 59 97 106 20 193 45 -192 185 22 -155
5895a55J83O6j46n8L90o48M06r9L4QK23l08J85Kk22K88k2l8R8k59J73J67l77N5
5919e4j18K51j78K61l00J45o5P9O7k09J92j07J14j34Q1n6j11J40j4pj52K66r2
5942aq2N5j19J79r2j0K6J6J06N4k00j0N9r8J68o7J29r9j29j20K79O0j89Pk3K4
5968g7R9J6k2q3qN0K42J1k26N5l1j44J04j21Q2L26j65J59j07k63J01KJ79J82j02
5993B59l55K62j23Rkjj74Q4j26J88J8J41o6m1q7j06Q4KJ09Q3m5k54J15J4K37l33
6019a08j18J13L6J71k44K31k35J36O0l36L29Q1j79l2L37k78mj1K91j09Nj38M1
6042C9J94j28k44l2J76j13K31l19K42J14k61J48q5r4J52J9j16K99o3j74l0J60
6064A15Q5k69Q2K48l23L55J7l57J57k02J80n5N9j18k4m9K87lj51j07J46O8m8L0
$$ plain form
5895 -155 28 94 -52 -110 280 -368 38 -61 -27 -19 204 -104 81 83 -139 149 127 89 187 -72 101 268 -109 -54
5919 -54 -172 79 -99 162 -138 7 -58 21 88 -121 71 -36 78 -56 25 -31 -142 -2 -16 -23 -175 91 -1
5942 -1 -83 -28 -147 32 -60 -70 -44 -28 78 132 -68 -78 -19 -117 51 -16 113 14 -115 -235 44 104 -85 -78 -101 -77
5968 -77 22 38 16 -67 -75 -25 217 228 2 57 26 -118 -14 -135 -53 273 108 267 160 -103 -2 0 179 361 259
5993 259 -96 166 43 52 50 49 -125 -41 -167 21 39 180 114 73 -14 -120 -36 -34 75 158 113 -141 -26 -12 225 -108
6019 -108 -226 -113 -77 94 -150 81 -154 -18 42 -294 35 116 -63 -95 242 -36 -40 -51 240 131 136 -2 39
6042 39 233 105 -139 -171 5 -108 123 -196 46 160 -101 47 -38 -132 20 39 -77 222 159 -15 -45 115
6064 115 200 -69 13 261 -62 293 310 -47 110 -92 88 33 92 -26 -50 -99 188 185 34 -73 73 141 93 123
6088A23k4M5j80P4k61L63l79J40o1J16l2o4J71k44L66j24K0n4N1m0l2j19K53l22
6112b14L27j90J51j48L8J47n8l0P2k96J25J28j83O3J44M6j29p8J36l4m1J44j63
6135d3k08J58K52k38Q4J17k55J16J16j24J44k18J02J11kj07k00J20P7j8l5J63
6157A12J1jk54J22N5J7m1J06j37J56l92J92j67J15K8P8m7J3O0O8L8O6j74k2n2
6182e0JP3o1j56Q4K20J08j46J24k97O4p8J8m7J30J00rQ2m4k89L12J57m94K53J3
6207F8k05J45R8j98LL10p8j03j4j50K57l62L26k7J27l58L7K05j6n6J24j26k20
6230b13K42M3o5j63j8J02r9R4m5m9J43J78j29R2Pj20j35J22J72R1j87o5j53OJ7
6255a32K09ln2J04l9l50K83n3J55J82l34O7o5K07j74nj23K83j02J3K4J03l02K
$$ plain form
6088 123 99 144 -36 38 -223 140 -239 -99 -160 -44 -76 -140 31 -213 153 29 49 -5 46 6 -26 -145 108 -214
6112 -214 113 -77 74 -74 -36 111 53 23 95 -201 -76 52 -131 -68 76 122 -7 -85 51 17 -24 120 -43
6135 -43 -251 -93 159 -79 5 122 -133 -17 99 -25 119 -99 3 114 112 5 -195 -75 2 -16 -51 112
6157 112 123 122 -132 -10 45 62 21 127 -10 146 -246 -54 -221 -106 -78 0 -47 -34 26 94 132 198 24 2 -50
6182 -50 -49 24 -37 -193 -109 111 219 73 197 -100 -36 -114 -96 -143 -13 87 78 160 116 -173 139 296 -198 55 68
6207 68 -137 8 106 -92 -89 221 143 40 26 -124 133 -229 97 70 197 -161 -124 81 65 9 133 7 -213
6230 -213 29 72 7 -156 -174 -72 -171 -77 -122 -171 -28 150 21 113 120 0 -135 -13 159 250 63 -2 -155 -149 -132
6255 -132 77 74 22 126 87 -263 20 -33 122 304 -30 37 -28 179 5 0 -123 160 58 71 95 198 -104 -102
6279a02K4J41q3j12l1Q0l0K47j50j68J64P4l9J4Q9J53l06K55l07K70r5K8l73L32
6303G5j03j04J39JQ6m7k9mq4J16J47k36N3J04k9J61k78M8J1o5j22O0J73O6k8j05
6329FO4q4J67j68j41j6K83L3l15J48M3m0o2J65J26M9j70k4n8K33n06M99k08r1
6353f7J31Q0l15L04j46J89k20L0J41PL5k50K2O5j91N7J59k50K56j48J34pL0j47
6377a01OM7K7J27j60p9J91j61J6K84k11N9K7M6k6K1Q0l78J14K70j64j12P0j93
6401b00L92r4j09j50J86M1j11J10k20L07j18L0O7j15J56j67l0n9J76j45l0O3J3
6424gR4l21M44j24j87R2n2P1k62L97m9p0R4k32J67l0m31K82R9k3K80m23O7J83
6448E9j00R3J37j95r6J88j59J73j64j95J81j3L5J38j83K13%j36j57K04J01j94
$$ plain form
6279 -102 -78 63 -20 -132 -163 -83 -113 134 -16 -184 -20 54 15 29 118 271 -35 220 -87 183 88 116 -257 75
6303 75 -28 -132 7 8 94 47 18 14 -70 46 193 -43 10 114 85 246 -32 16 27 -38 -160 -100 73 139 111 6
6329 6 70 -14 153 -15 -156 -172 111 144 -171 -23 20 -20 -82 83 209 258 88 64 6 239 -267 232 24 -67
6353 -67 64 144 -171 133 -13 176 -44 -14 127 134 169 -81 -59 6 -185 -128 31 -219 37 -111 23 16 46 -101
6377 -101 -95 -48 -21 106 -54 -133 58 -103 -87 197 -14 45 72 118 92 113 193 -185 -71 199 35 -77 -7 -200
6401 -200 192 98 -11 -161 25 66 -45 65 -155 152 34 64 131 16 172 5 -25 -84 92 -53 -83 -20 -7
6424 -7 87 -234 210 86 -101 -9 -61 10 -252 145 96 26 120 -112 55 25 -406 -124 -25 -48 232 -191 -124 59
6448 59 -41 52 189 -6 -102 86 -73 100 -64 -259 -78 -91 -56 82 -101 112 112 -24 -181 23 124 -70
6470g0JJ07p6j66L51j21R0j9j23j29K87l19K21k9q0Q3J3O7r4q0J66k82M3J35P0
6495D6k73K22j03J43K12j18k23P7N8o0M0m9j34L11j16J43q9Q0j60j07rj65K63
6518a1J84l5k29m2J46P1k89R0R2j61K52l15J78J16j36K92k36J34j25Q8M3j35m0
6541f8Q9j95J80n2J4L5J39r3J53l07K32j11m4q8K72k42J3RJ25l08J87K2j52R0
6565a00p9K90R6l8M8j60j67J29j11J89q1k0k48K70J08O1q2N5k0j55M7l8K30k19
6589Ej36K17q9k05J46KJ43J18j69QQ8j16j4p0K59r5k3j30l7JP0J32j10J38k09
6614g6J71j79L5L2Q8k38K83K4l3J66l44J61J9jj50n1L7M6R5j18K3%J25k70N6L49
6640B50l51J06j9q5K86j68J49j77J15k60l8K66KK6p5l3k7K25k46j10K80l10J31
$$ plain form
6470 -70 -69 38 -38 -204 147 26 116 97 -26 -155 132 -187 34 5 -75 8 21 88 -6 -86 80 -202 -159 -24 46
6495 46 -227 -5 -108 35 247 129 -94 -17 41 -19 21 -28 -162 149 33 176 87 167 7 -100 -109 -274 -11
6518 -11 173 138 -91 -133 13 84 -205 -115 -23 -184 68 -247 -69 47 -89 203 -33 101 -24 64 107 -28 -68
6541 -68 21 -174 6 -46 -32 3 142 49 202 -105 127 16 -28 -116 156 -86 -73 -64 61 -247 -60 -38 -190 -100
6565 -100 -179 111 207 169 217 57 -110 19 -92 97 16 -4 -252 18 126 187 105 160 140 -15 32 -6 224 5
6589 5 -131 86 -3 -208 -62 -60 83 201 32 40 128 12 -2 -72 187 92 69 -61 -98 -97 -27 105 -5 133 -76
6614 -76 95 -84 -49 -17 71 -167 116 140 107 273 -71 90 109 108 -42 -93 -56 -10 85 -33 -10 -10 115 -155 -99 250
6640 250 -101 5 -14 -99 187 19 168 -9 106 -154 -192 74 76 102 27 -6 -33 192 -54 -164 116 -194 -63
6663f3P0J78j82J57j87P0M7r7M4j95K94k68J54lK05k61L1m0J24p1n0L3L1J52k15
6688d2j42J82o9J05j72j49K24O2J33q2R6R0k62p8J26q7O1j93K91K9k99M10k73
6711c9O8l8L9J3J11k19J79j0r1m0j9M9n7P0m0j64m7L22j57P4j08O2K56j87L2J
6737F0j29K17j98L04j94k9J35j72j48K9q1M11k85N8J05l3n2j05o0L33j87j91Q4
6760a28M9M0l0J55n8m0j6J20j91n8Q7N1j88K03m5q4j5J12N9o8O8j16J88j85J08
6785A8j54M08k88J61R3k08N9k6m4N0J96p7j46p5mJ03o5k1M9J98m56L94k99K29
6809I5j53r7K67k14J07o1P9M9q6p5Q5k13K68k7o5J55k02Q5p7K8L8j95L25k48J8
6834a14j2K35j97K11j47j31K10k32K06r1j8J56l4r4L9M6J70o4j41J1r4J48k43
$$ plain form
6663 -63 7 185 3 160 -27 43 90 -7 37 -158 136 -132 22 19 224 -37 -6 -46 78 7 -43 -10 21 173 -42
6688 -42 -184 -2 -71 34 -138 -287 -63 -1 132 50 146 236 -26 -104 22 -65 -4 -197 94 123 -176 234 -39
6711 -39 29 -9 30 43 154 -65 114 104 13 -27 -46 3 -54 16 -24 -188 -235 87 -70 4 -104 -42 214 27 59 60
6737 60 -69 148 -50 254 60 31 166 -6 -154 -125 -206 205 -80 -22 83 50 -2 -107 -167 166 -21 -212 -128
6760 -128 -79 -39 -69 86 28 -12 -28 92 -99 -157 -70 -19 -207 -4 -49 -133 -148 -36 23 -45 23 -93 95 -90 18
6785 18 -136 272 -16 145 238 30 89 63 19 69 265 188 42 -33 -37 66 1 -20 29 227 -229 165 -134 95
6809 95 -58 -155 112 -102 5 -56 23 72 -14 -89 -4 -217 51 24 -41 114 -88 -3 -80 -52 -14 -209 116 -132 -114
6834 -114 -126 109 -88 123 -24 -155 55 -177 29 -62 -80 76 42 -52 -13 33 203 139 -2 9 -85 63 -180
6857a80L02k61K05j95p2L13J19j01n8j72J70j42MR0l5j35J46K4k35J25L25l85
6879a48K14l4j6p7P0K6R5l76L59q3K19k60k00L33j47k23L94p6j07j00J5K16q8
6902FK51j45r8K65q8l15K56j6k41Q4j15K15J36l4k02J95j22J00k16k0K15j77K65
6925A99k47m0K73j7p0j6r6j82Q8L46r5k44K02m0MN3l1j34J69r6j16J02n0J90l20
6950a68J81J83j54j41K82k50j12J61J12k94K93j34j00j55M2L53r8P4p6k1Q6J1
6972G5j74J35J08J5m94K63l5r5J26J00k44J95J15o2r7J60N9k19J68j16J0O2q6
6995c1J39k18K17j65J52k6k8j7j15K74Q4j81m0k00J28J35j33K75m9l0k40M9L2
7018A2O4j52R9o0k2K05k57J22p8J36j58J54o3J6p3q4q0K54J40k49J27R4m9j20
$$ plain form
6857 -180 122 -139 66 -129 -201 112 231 130 72 -100 70 -72 -68 22 -13 -148 -2 22 -213 -88 237 -148
6879 -148 66 32 16 -61 9 35 130 -246 113 30 249 -11 -211 122 -25 -248 146 70 -37 -137 -122 94 6
6902 6 257 112 14 279 191 -124 132 116 -125 -41 -156 59 195 161 -41 154 32 132 -84 -104 111 -66 199
6925 199 -48 -88 185 168 98 82 -14 -196 -108 238 143 -101 101 61 65 118 87 -47 122 26 -90 12 -38 152 -168
6950 -168 13 196 42 -99 183 -67 -179 -18 94 -200 93 -41 -141 -296 -254 99 1 75 -1 -22 64 75
6972 75 -99 36 144 159 -335 -72 -107 -202 -76 24 -220 -25 90 28 -69 91 150 -69 99 -17 -7 55 -31
6995 -31 108 -110 107 -58 94 68 40 23 -92 182 266 85 45 -155 -27 108 -25 250 201 171 -69 -20 12
7018 12 76 -76 23 -37 -59 146 -111 11 -67 69 -89 65 2 18 -55 -139 -219 35 175 -74 53 147 98 -22
7042b2J70j34j2J4j12J80j38p5K21n3j96K29r0l8K44j95j30K76n9r9J08j71J92
7065A10Ol88L74K0j44j51K71r4m9Q3j12k2J86N9j75J33m5O2K9k46J5N8Kj25P6
7090f7%L8K14j77K9k70L68j84j16J97r2J08k8j96R2r9P5O9J03k21J30J97n8Q7
7114A99k82J92m0P0j09j03M6O2L3j92L55l05k4K57n2M6o2J15l1r8k08K04j1k26
7138a64K73k23J80j04J53O0l11L12k3k53J09R3j84p0J66j49K7K14J18m48J74n4
7160a04r2J35K14K0j55K29j65k9J8J57j05j82J62j65k7L39k41j2k4n0nQ8P6k02
7184a20L0L6J92j7j20O7m61L03K3K4K6l8J11p5k13J48K36o6j96J22r2r6J65J80
7208A69j09n2L8k09L18j77nJ97L4p7J7j22k38J67J78k43J67j99K20k15j11R0L09
$$ plain form
7042 -22 148 14 2 16 -96 84 -54 -129 92 39 -157 72 -18 -56 188 -7 -137 139 80 -19 89 -82 110
7065 110 116 -272 102 122 -22 -173 98 4 -45 38 -74 -96 90 149 -26 107 62 124 153 -93 -78 -20 -18 -143 -67
7090 -67 -67 -29 185 8 37 -233 135 -49 -165 32 -60 48 20 -176 -84 -183 -108 -39 64 -157 -27 170 112 199
7114 199 -83 109 69 139 30 -73 -27 35 68 -124 231 -74 -98 159 107 153 91 206 175 77 -131 73 62 -164
7138 -164 109 -114 66 -38 115 175 -136 176 153 -100 9 102 -82 -152 14 -135 -108 106 224 -224 -50 -104
7160 -104 -196 -61 153 173 18 247 82 53 71 228 123 -59 103 -62 -89 250 9 -3 -27 -77 -82 6 82 -120
7184 -120 -90 -54 138 121 1 68 -393 -90 -67 -43 -17 -55 56 -19 -232 -84 152 86 -110 12 -80 -176 -11 169
7208 169 60 8 46 -163 155 -22 -27 170 204 127 144 22 -216 -49 129 -114 53 -146 74 -141 -252 -162 147
7231A47j98Q2k6q3R7j44K74j84J96k71J57n5J44J4k46k5p3N0j17J26K28J95k02
7254H6l54J66%K5O1j45K51jN2j75p5J91j30j8p9p0K40l1J00n0K8oJ47k3j62J57
7280A85l94K47J01j19j6j04K05k16L93k89jK1n8l00L75j5j59J25n4J60j48J51
7302I0k06J68k20o4L09J36n02M27j7j85K32j66Q1M4o1J05o5j74J61k4k69K41j87
7325a46p8K75j23j6J43j7J51q9j16r0K19o5J10j68Q3N7j62j8k0Q7j36K71p7k45
7349a70J26q5Q4J75j11J59k02J30k00J10m6P0J4P6Q7j36l4j50k2J94J64j57j25
7372d9J21j29L52k66O1k53J03J76l26M10j95o7m8K37j59p0m6ML31Q0j02k51J68
7395H2k7Q4k36j12L32k01J84jl02K79j10J00J5j67M7K33l41J24K11l05J62o3J15
$$ plain form
7231 147 -51 31 5 -78 19 -125 149 -35 161 -110 47 -8 136 150 -96 -121 -194 -144 -261 -135 93 288 86
7254 86 -268 -102 -102 -77 -16 -161 90 89 141 -34 -109 82 -48 -66 -145 -215 25 -6 94 44 72 66 213 190 28 185
7280 185 -209 38 139 20 4 -100 105 -111 282 -7 -8 13 -45 -345 30 15 -144 -19 -73 87 -61 90
7302 90 -116 52 -168 -232 77 213 -289 138 121 -64 168 2 83 127 66 171 106 -68 93 69 -200 41 -146
7325 -146 -224 51 -72 -88 55 38 189 100 -16 -106 113 48 158 -10 73 130 -32 -50 -70 17 -119 152 75 -170
7349 -170 -44 -129 -45 130 19 178 -24 106 -94 16 -30 40 54 130 217 81 47 -103 -125 69 233 76 -49
7372 -49 72 -57 295 29 90 -163 -60 116 -210 200 5 -62 -110 127 -32 -102 -148 -144 187 267 165 -86 82
7395 82 55 139 -97 -209 123 -78 106 105 -197 82 -28 72 87 -80 -33 200 -141 -17 194 -111 51 -12 103
7418A03j65K10J8K2k76J32K69n48L28Q1Lo3k8m6J85m63J65J21l5k1J48m16M78
7441B02l64j75N54k28K4k19P1K5K65j09j30M9O2NJ98l03r4J25N4K17k86J87j04
7464B6j00rK26j41o3qj37K63j3J22J98l02l7K10o3j74J01l39J98kLJ27Q2o6r7
7489EK1r1J7o5K03k08J05N4j10jK08l54L35j86j7K71l16L39l82J19q2O5%J08J89
7514B27l55K41J60k94J75r1J2j76R9J79m23J63L75k71J3j5L0k0J45k69N1J19r0
7537a5N3K8P2p0Q6k51L7M5J69n9j06L9j38K36j78M2r6L90j00k62P2R5K27l39Q
7562a5K9j68J09R7J05O5l14N6N1J17K6j52M0k75K32J60J75j94j49n5j15L78j76
7585B7q5N5P8l9R5j12k22P7J24j61L51l44J8Q2K75n2Qj34m1j32Q5Q7j70J97j62
$$ plain form
7418 103 -62 148 166 188 -88 44 313 -235 93 174 177 114 86 40 225 -238 -73 48 13 -8 140 -276 202
7441 202 -162 -337 217 -11 13 -206 -135 -110 155 46 -84 -35 27 32 230 -73 -167 -42 12 229 -57 130 26
7464 26 -74 -83 143 2 -61 -69 -206 57 44 166 364 62 25 235 172 -2 99 -240 -42 -44 -41 86 168 102 5
7489 5 26 -65 -48 -113 90 -118 -13 41 -69 -70 138 -216 119 -67 -84 187 -129 210 -172 -53 -135 -70 -70 38 227
7514 227 -128 113 273 -21 154 63 75 -101 -2 177 -246 -83 292 21 34 19 49 29 174 -95 -44 75 -15
7537 -15 38 66 138 68 154 -97 -60 -15 154 95 -11 28 -110 126 -52 -10 -106 284 184 -78 -6 89 316 -23 -15
7562 -15 14 -154 -45 52 157 222 -92 -36 15 132 158 6 46 -229 3 163 338 144 -5 -60 -175 203 27
7585 27 -58 -3 75 36 131 19 -203 -126 -2 -163 188 -156 -138 -56 219 167 175 41 0 -132 -47 40 -130 67 -95
7610i5M3N3K96j47m2j20o2J23n5L5J64k01K22l82J51m0Qp1J67O7j33K34j35k9
7634E1N2k49K18rk84N65m89P5m2K64l15K71j76N1j59J38pj30J64P8L9q3k2J8n4
7659c5N7rN6Kj76M7J4K59j00j20n3J2j50K17OQ0j07j89J61kj1J22j33O1N8K05
7685B72l05L03m62K31k52K12O6k03K21J04j64o9q4J4p4J61j46K70K08j91k68J01
7707e5L48k09j49j56K08K9oj74L55k36p7K48n5J18k69p4J34J07q1l03R9K60j87
7730a25K19N0k19J36J09o0m85J33L13n6N6jN2k06J84j36O8j41q4K63M9o6m8o8
7754f3q1J6R7j39P6J66K9kk49K10l18K06l6J67L4k02K8J89p1l17K08J1K42l46
7778a45J70j70O2J41M7l71M69k90J90n0j55J59J50j93j07K64mj99J85n8J5k37
$$ plain form
7610 -95 -52 1 297 150 108 -12 -74 49 -6 29 193 -8 214 -168 -17 -57 -49 -120 47 114 -19 215 80 51
7634 51 103 -146 72 63 -221 344 -145 -70 -112 152 -163 108 -68 -17 -176 -38 -45 -175 -11 67 106 23 1 19 -35
7659 -35 22 13 69 71 -105 -58 -44 215 115 -5 -58 -46 -196 21 27 107 0 -189 -28 -30 -41 81 -52 9 67 272
7685 272 -33 270 -192 39 -213 -1 65 -138 83 187 23 -46 -130 -116 -190 -29 -175 95 303 112 -156 -55
7707 -55 293 84 -65 -221 -13 16 10 -164 191 -45 -122 126 71 189 -80 -154 -20 87 6 -297 -198 62 -125
7730 -125 94 144 -75 61 170 110 -375 -242 71 15 71 70 122 -84 100 -36 32 -109 -193 70 119 53 5 -63
7754 -63 -144 -128 -31 -170 -94 72 101 99 -150 60 -258 -52 -88 79 113 -89 -61 128 57 -260 -52 -41 201 -145
7778 -145 25 -145 -83 58 105 -266 203 -87 103 53 -102 57 207 14 -93 171 167 -32 153 95 110 -127
7800a27J77p6o5J27p7R0k65M29k61QP9j53J80K18k37K10k21Q8j01J37j06m6n9
7823e1j6J35pJ3J1j5J63k03p7J93j24L06l03j53L5J22J62j38o3j21J46Qk34J85
7847b6K06k4K6k65J49l2k48J63L03l92K12j06J00J70n1Po9r1j98L08k14l1J05
7870Bj15K80j20j19K84j96j11J44p6J98k90o0K17k32N0L33q9l4n1m8J50k11R5
7893AO3j87N6K02j37k1J07p7K2Q4J19j08k16K58l02j3J31O3J03p3j82O0MJ28r5
7918a0o2N1o4J44J4O8l77J74M7R8j92J61J06k67J06r7J43m9J69l82K73J03k28
7941g1L38Mk66N0q7n0Q0l8K82l71J63j97K21l3j60K6J03j80L08m8l8j29J73r6
7965a6N2l1k55J75O5L17j83J04j89l7j9j23j1M97m92J35j26J29K51k80o4J04P5
$$ plain form
7800 -127 50 -26 -91 36 -41 49 -216 213 -48 -40 39 -114 66 284 47 257 36 124 23 160 54 8 -51
7823 -51 -67 68 61 74 85 70 233 30 -47 146 22 328 25 -128 -93 29 191 53 -10 -131 15 23 -211 -26
7847 -26 180 156 182 -83 66 34 -214 -51 252 -140 72 -34 66 236 185 192 123 32 -166 142 -72 -103 2
7870 2 -113 167 47 -72 212 16 -95 49 -27 171 -119 -179 38 -194 -144 189 100 66 15 -33 117 -94 1
7893 1 64 -123 -67 135 -2 -23 84 7 29 113 232 124 -92 166 -136 -149 -18 45 148 75 -107 -47 -43 85 -10
7918 -10 -72 -21 -85 59 73 141 -236 -62 -15 83 -109 52 158 -109 -3 -100 43 -6 163 -219 54 157 -71
7941 -71 267 271 5 55 -32 -82 -2 -40 242 -129 34 -163 58 25 -135 -109 -6 -186 122 74 36 -93 80 -16
7965 -16 36 5 -250 -75 -10 307 124 228 39 2 -17 -140 -151 346 -146 -11 -137 -8 243 -37 -101 3 78
7988G8j37P6J92o46L00J49o5L06k60r0j06L23j11M7K10k91j77J18O2k19L6K04
8010amK31k85m4J75m2K9j25L49j84M3j18M4j67kL92n60J59J56j08n5lJ57l5P0
8035G2on4L1j86N3K40p8q9m1Q6J94j62J9J00l55P5J54j36j90K84J92j6l51J28
8059c6R0j0k2j86P3o4ML0k8L8k6J43Q8j66J85o1j28J48J9N2Pq6k19K08n4J9qR0
8087A00q7J26k37K11j98KM13j10j55k1L01l56j03K34j80j35K49q5M2J41k7j63
8109c8Qj67K69j09Q0r6j78L27j21l8J36k40K42p3R1j03k05L04j5p3j85J05J71
8132I2Rk04Q5J9J99k81O5k05K6J98J60j01p7j24JK75k68P8K49l30J16m5L2J78
8156A47l90L05j95M3K7N2l16L31K4j06J20k18J80kQ9J43q4j48O3K1j21qjO0j40
$$ plain form
7988 78 -59 17 209 -437 -137 12 -53 253 -7 -97 -203 120 9 56 266 -25 -202 -84 -22 -241 -205 -1
8010 -1 -5 226 -59 -103 72 30 59 -66 283 99 142 24 68 -99 -101 291 -269 -110 46 -62 -117 -120 37 2 72
8035 72 66 12 43 -143 -90 150 72 -17 -58 28 222 60 79 179 -176 -101 53 -83 -273 11 203 187 -164 -36
8059 -36 54 44 22 -164 -91 -155 -151 -121 -149 -111 -137 6 94 -72 113 52 -76 72 91 143 150 64 -155 53 -1 18 10 100
8087 100 13 139 -98 113 -85 -83 330 220 65 44 345 -11 -114 120 -60 -195 54 -31 11 152 125 -38
8109 -38 -30 -197 72 -37 43 -53 -231 96 -25 -63 73 -167 75 2 93 -10 -215 89 74 1 -184 -79 92
8132 92 101 -103 -18 1 200 -81 -16 -221 -195 3 163 62 -15 -139 -138 137 -131 -53 196 -134 -18 -63 -31 147
8156 147 -243 62 -133 -90 -63 -11 -327 4 28 -78 42 -176 4 2 91 234 150 2 65 86 -35 -43 -44 16 -124
8181a24K1R4J32l66J59J01J36n2m44L48
$$ plain form
8181 -124 -103 -9 123 -243 -84 17 153 101 -343 5
8191E
$$ Imaginary data points
##PAGE= N=2
##DATA TABLE= (X++(I..I)), XYDATA
0@%%%%%%%%%%qJ6j6J6k4L2m0N6o4P2q8J08j32J54j79K11k46K86l31L80m34M96
32B65n66O42p27Q20r21J032j158J293j439J601j776J970k183K414k664K937l239
49a699L569l929M328m771N263n811O428p123P916q835R910j1188J2737j4658J7122
64I259k0414K5054l2158M4536p2356K54851r32j98485K98625P1684j70499k53987
76d4822l5656R7719J11308j38278k51770j6426K98694P5398k60136j42421K08949
87i7441J81033p6315j73454m2415J08079J47191l6415k11417n0832K53518J51295
98A52827j71338j55546J50281K06552q687j33525o4226O2190J33693Q412k04687
109b4054j24393J61325J50535j35945j93551N6408J70951L1155j01916r0940K1211
$$ plain form
0 0 0 0 0 0 0 0 0 0 0 0 -8 8 -8 8 -16 16 -24 32 -32 40 -48 60 -72 82 -97 114 -132 154 -177 203 -231 265
32 265 -301 341 -386 434 -487 545 -613 680 -759 842 -934 1036 -1147 1267 -1397 1540 -1699
49 -1699 1870 -2059 2269 -2502 2761 -3050 3378 -3745 4171 -4664 5246 -5942 6795 -7863 9259
64 9259 -11155 13899 -18259 26277 -46079 208772 207840 9355 307980 379664 209165 -44822
76 -44822 -80478 17241 128549 -9729 -261499 -277925 20769 96167 -163969 -306390 -97441
87 -97441 83592 7277 -166177 -208592 -100513 46678 10263 -201154 -251986 1532 152827
98 152827 -18511 -174057 -23776 182776 174089 40564 -23662 38528 172221 180633 -24054
109 -24054 -148447 12878 163413 27468 -166083 -109675 61276 92431 -9485 -100425 -79214
120g9214J33634N9088j56571j52478R9891J70181p1806j90062l883J48129P1881
131B8790o2732q7844K581J26040J00232r0080j50257M9975J70697j3314j70995
142i6907n1572J08238P7323l4714q6558l2754R6446J20922m1975j45600J4440
153g2711J61346L1255j38544p8332O9471P9956j1783q5872n9215N9802J18818
164G4191o675j30305k1067J35648O9005r9099r1558L7010P6866O114p2592p5515
176i7977J9699J03847K1822j10947n2357J08535R1544n9599q2899J8916P0057
187C0641K6753m1545p4231r930Q6162M1765q6111p1242P2098R3939k4367p3120
199b9188k377N8998M3366j8541p0603k8409O4488N2114o5335q6379L4232Q5586
$$ plain form
120 -79214 54420 113508 -43063 -195541 -95650 74531 2725 -187337 -191220 -43091 28790
131 28790 -33942 -121786 -119205 6835 107067 16987 -133270 -83295 87402 74088 -96907
142 -96907 -148479 -40241 37082 2368 -84190 -116944 -20498 100424 58449 -87151 -72711
153 -72711 88635 119890 -18654 -96986 -27515 52441 40658 -45214 -104429 -44627 74191
164 74191 67516 -62789 -83856 51792 120797 21698 -69860 -32850 44016 50130 -22462 -97977
176 -97977 -78278 25569 47391 -63556 -115913 -7378 84166 24567 -58332 -39416 30641
187 30641 57394 15849 -58382 -68312 17850 59615 -26496 -97738 -25640 68299 43932 -29188
199 -29188 -31565 27433 70799 52258 -18345 -46754 17734 69848 4513 -81866 -47634 37952
211C7952k708o7567j7186M5469M7387K739n0870l8673M4818O5030l6740q7031
223e7380N328P4581J3638n4201k8439K5506M7219K1813l4123m4757K9722O9914
235F8821j2159p5794j4896N7976K1975m1116l7194O645L6110K5782j9820m4009
247b7679J0688O3554J3147o0134k9237M3685L1497k7545l9506o494K2734K7693
259B2403p350m5143n904N6690K9152m6281l3292L3580L5678j4061l2570j3369
271b0467J0573K6482P84l9655j9151M1080L5237k8400l3676J8901L6325P2k2659
284E446j5981L534K2087Q262k9682k8189K3859L5575j5272l4181Q947L1597N733
297B1735j2743j1171j666J4786J5714j7836l2263J0317L2304p412l1438N1K2214
$$ plain form
211 37952 35244 -32323 -49509 -4040 43347 46086 -4784 -43457 1361 66391 29651 -57380
223 -57380 -52052 22529 36167 -18034 -46473 -20967 26252 48065 13942 -30815 -1093 68821
235 68821 56662 -19132 -34028 23948 45923 4807 -32387 -25742 10368 36150 16330 -27679
247 -27679 -16991 46563 59710 -424 -29661 14024 45521 17976 -21530 -28024 -5290 22403
259 22403 15053 -30090 -35994 20696 49848 3567 -29725 3855 39533 25472 -7098 -20467
271 -20467 -9894 16588 17372 -22283 -41434 -354 34883 6483 -27193 -8292 28033 28105 5446
284 5446 -10535 -7001 15086 23348 -6334 -34523 -10664 24911 9639 -24542 -15595 16002 21735
297 21735 8992 -2179 -3845 10941 26655 8819 -23444 -13127 19177 11765 -19673 -19622 2592
310B592Q754n571r654n188J0434J8873r290k8185Q65K5260k25k5756o825J4361
324i555Q005l589m514m785M563J7063K578j9824m916K0985O146j8469p739J0303
338c748M126k628R19l895k244J2160P883j2492o534J4337M754j1780m766O269
352B361k456m502L516j875o947L862R295m851o191P033O372m827r75O511k399
367C927m232N981M995o947k002R458K167m290L298M422l815J973P971m900r000
382I006O104Q161q869q214M494K610m483n39q61n868K084P642l943j1472K674
397a474J0548k605q780p56M144J652J822k518p187K135J2383O12j5078k465J3765
412F198L883j0770o152K746L548L045m293j2260k031J4509K799j8221q435J2533
$$ plain form
310 2592 11346 5775 -3879 -9067 1367 20240 10950 -17235 -16370 8890 8665 -17091 -23916 -9555
324 -9555 -1550 -5139 -9653 -14438 -9875 7188 9766 -10058 -14974 6011 12157 -6312 -14051 -3748
338 -3748 378 -2250 -1331 -5226 -7470 4690 12573 81 -6453 7884 12638 858 -3908 2361
352 2361 -95 -4597 -1081 -2956 -9903 -6041 3254 -1597 -7788 -755 5617 790 -185 6326 3927
367 3927 -305 5676 10671 3724 1722 11180 13347 9057 12355 16777 12962 14935 22906 18006 9006
382 9006 15110 23271 14402 6188 10682 13292 8809 8270 7409 1541 3625 11267 7324 -4148 -1474
397 -1474 9074 6469 -2311 -3067 1077 2729 4551 2033 -5154 -3019 9364 9976 -5102 -7567 6198
412 6198 10081 -689 -6841 -4095 -547 2498 -1795 -14055 -16086 -1577 1222 -16999 -25434 -12901
426a2901R058q430j0173r71P649R076k759j4203j768J8894R294j5146j2035J2293
440a2122J5970l320j2755l548R121J1461l70j5728o925J6796J3301j3527j9606
453b1252O706J7183o42j5266r710N560J2962K912j6998j1835J5984J9514q600
466c482j9400L739K0701Q198j1053j0583M676J7880Q737j4195j3853J1998K3399
479B6762j742k0205m348J8753J2695r425j5953k506J4151R991j3249k1839K077
492d838K1144J785k2600j2485J3688J4594m740j6426p401J2812J6334o505k2466
505a7104j907K2523J0745j7137j5407J0281K0103M119j5036j0230J2363K1029
517B4342m00k1925p858J9431J6291j4482k1011K123J8753O385j4799j6196M510
$$ plain form
426 -12901 -3843 -12273 -22446 -23417 -15768 -6692 -9451 -23654 -25422 -6528 2766 -12380 -24415 -12122
440 -12122 3848 528 -12227 -15775 -6654 4807 4437 -11291 -18216 -1420 11881 -1646 -21252
453 -21252 -14546 2637 1995 -13271 -22981 -17421 -4459 -1547 -18545 -30380 -14396 5118 -3482
466 -3482 -22882 -19143 1558 9756 -1297 -11880 -7204 10676 19413 5218 -8635 3363 26762
479 26762 25020 4815 467 19220 31915 22490 6537 4031 18182 28173 14924 -6915 -4838
492 -4838 16306 18091 -4509 -16994 -3306 11288 6548 -9878 -17279 -4467 11867 5362 -17104
505 -17104 -19011 3512 14257 -2880 -18287 -8006 12097 16216 1180 -9050 3313 24342
517 24342 23942 2017 -5841 13590 29881 15399 -5612 -3489 15264 21649 6850 -9346 -4836
530d836K0206M507k0592j5834J4427J8852q645k3190m813J6177J1100j0307j9104
543b2052j133K0915J1617j6497j7714J0830K2942K2j9939r180J4351J6175m396
556E941j9716n385J8278J6269j0232k0248M179K4218Q062j7595j3871J0610J8430
569A8940M86j8904j2098J2744J9625o317k3134l038K1267J2084j3703j6378L929
582d497J8380N908j5741j6605O979J9706n35k1646j0122J6151J5952p365j8058
595a1493j774J7636J1697j0420j7961J934J9356O590j8584j5659J0649J8354k568
608G757j8489o350J3443J5363m595j8866l985J8160J2307j4222j8937M491J8439
621D516L183j6444j2459R116J8526O62j7679q196J6237J6932p735j8658o90J7892
$$ plain form
530 -4836 15370 19877 -715 -16549 -2122 16730 8085 -15105 -19918 -3741 7359 -2948 -22052
543 -22052 -23185 -2270 9347 -7150 -24864 -14034 8908 8930 -11009 -20189 -5838 10337 5941
556 5941 -13775 -19160 -882 15387 5155 -15093 -10914 13304 21366 3771 -10100 510 18940
569 18940 19426 522 -11576 1168 20793 14476 -8658 -11696 9571 21655 7952 -8426 -4497
582 -4497 13883 19791 4050 -12555 -5576 14130 13595 -8051 -18173 -2022 13930 6565 -11493
595 -11493 -13267 4369 16066 5646 -12315 -10381 8975 15565 -3019 -18678 -8029 10325 7757
608 7757 -10732 -17082 -3639 11724 7129 -11737 -15722 2438 14745 523 -18414 -13923 4516
621 4516 7699 -8745 -21204 -12088 6438 7100 -10579 -18775 -2538 14394 6659 -11999 -12689 5203
635E203Q712j2788j5422M470J7462M931j4349j2312J0324J8788j150j8426n973
648a0530J4932J1793q258j7118j985J4451R115j1710j6177M688J8640L794j5857
661d222r591J1109J4959k603j5744o241J2307J2559p036j6907p62J6697R106j1958
675A673j2806O276J6616L054j3725q900Q273J3868k050j6071p029J3042J1295
688A3516q393j4858J376J4118O576r650j1343L486J3901L031j4066j0073Q616
701c763J2648l707j4310l880J1697R663o083j2064o2J3647P231r995j1175M533
715e620J3316J153j3050p134Q339J1115k276j1584l466J0746R908n386j2457Q35
729e561J2500M623r843r722L806J0568J188j0118p402P091J0615j921j1083k875
$$ plain form
635 5203 13915 1127 -14295 -9825 7637 12568 -1781 -14093 -3769 15019 13869 -4557 -10530
648 -10530 4402 16195 7937 -9181 -11166 3285 12400 690 -15487 -10799 7841 11635 -4222
661 -4222 -13813 -2704 12255 9652 -6092 -12333 -26 12533 5497 -11410 -12172 4525 13631 1673
675 1673 -11133 -4857 11759 14813 1088 -7812 461 14329 12279 -3792 -10821 2221 13516
688 13516 5123 -9735 -8359 5759 12335 2685 -8658 -5172 8729 11760 -2306 -12379 -3763
701 -3763 8885 5178 -9132 -13012 -1315 8348 2265 -9799 -9861 3786 11017 1022 -10153 -5620
715 -5620 7696 8849 -4201 -11335 -2996 8119 5843 -5741 -9207 1539 11447 6061 -6396 -5561
729 -5561 6939 11562 1719 -8003 -4197 6371 7559 -2559 -9961 -2870 7745 5824 -5259 -8134
743h134J0174P062n355j0383N02R281M214p799q654L030J0481K085r751n357P277
758a327R063k222r348k139P787N944m768r164m33Q928L905p677p597L918R675
773D545j88p758m208N587P399j917q680k730P544N437m547q097J406Q469K529
788D791n337n353L813P615Q85o310m017M806O339j909p695j376O499L735m063
803B423n593N23O300K550m861n348K438O408m13o295l349L974M590k228n383j375
819e639N083M031k581n224O06O004J970m055m179K513N034M6m894k688L490M209
835C726o60m953j067M395L358k434m683J118L580J284l213l450J121L780N94m342
851a846k446K590L795r28l812q72L119K265j728l499k58L363J532k780l050J120
$$ plain form
743 -8134 2040 9102 3747 -6636 -6134 3147 7361 -438 -9092 -6062 4419 6504 -3247 -8604 -1327
758 -1327 7736 5514 -3834 -5973 1814 7758 2990 -6174 -6607 2321 6226 -1451 -9048 -5130 4545
773 4545 4357 -3401 -7609 -2022 5377 3460 -5220 -7950 -406 5031 484 -7613 -6207 2262 4791
788 4791 -546 -5899 -2086 5529 6414 104 -3913 893 7232 5323 -2372 -3748 2751 6486 2423
803 2423 -3170 -2647 3653 6203 1342 -4006 -1568 4840 4427 -1868 -5217 -1243 3347 1119 -4264 -5639
819 -5639 -556 3475 894 -4330 -3724 2280 4250 195 -3984 -1471 3563 3609 -1285 -3973 -483 3726
835 3726 3066 -1887 -2954 1441 4799 2365 -2318 -1200 2380 3664 451 -2999 -1878 1902 2496 -1846
851 -1846 -4292 -1702 2093 1165 -2647 -3519 -400 1865 137 -3362 -3620 -257 1275 -1505 -4555 -3435
867c435L649K95k797j877K184K964l33k827j309K614K799j052l361j99L338J584
883B237k085k145J344K590J199k046j991J809K715j69k967p61K290J229q06k187
899B56k98K041J017j276k005K70J947N66j785j714Q27J631k10k091j034J570J178
916H90l30j674n10J172J418n39j981M27J766M95j036j014M08J415O79j235j138
933g87R63J165N4j004q90J184O60k15j166o56R33Q09p12j405o0J025R35j128j160
952a455L26J024J16r45p99J92J104K97j158m53N65J025j72j165k33R45P61j16
970a41q91n2J083O97p76p85L12J220K31o84m04L77J099J75q10o36L94J058k24
989A243q64k57P49M61o82q84o7N76N66m60j197L3J150J48r78n59J98P76N99j355
$$ plain form
867 -3435 214 509 -2288 -4165 -1981 983 650 -2177 -3486 -872 1927 875 -2486 -2685 653 2237
883 2237 152 -1993 -649 1941 3140 1094 -897 912 3627 3458 491 -270 2020 3249 2443 256
899 256 -42 1999 3016 1740 -265 5 1952 2518 733 -981 -154 1477 1267 -824 -1858 -288 890
916 890 560 -1114 -1624 -452 966 427 -1554 -1127 639 1134 98 -916 -508 907 1586 351 -787
933 -787 176 1341 1395 391 -499 685 1345 1130 -36 -692 241 1050 338 -1067 -1127 -102 833 -295 -1455
952 -1455 -1129 -105 11 -934 -1733 -1541 -437 -140 -1298 -1751 -1186 -161 -333 -1498 -1731 -786 -25 -141
970 -141 -1032 -1084 -1 696 -80 -865 -553 667 898 214 -190 187 1286 1461 651 15 409 1467 1243
989 1243 379 122 871 1332 650 -234 -301 275 841 381 -816 -783 367 515 -463 -1022 -824 -48 551 -804
1009h04k45L92J211K4j186k34Q28Q03j90j123P3J202M13n97q12M03Q89M43j076
1028D14n46N01Q48K4j135o98P32R29k66j203p76J241M47o49j293K98J126L37p45
1047d14j192O08J195J79q59r68P20J230m54q90k41J107R66q09j158L96R67L97
1065G80r16o96K45J480K86j484o50P39J144n37q82n34R51Q56m67j394J33J264
1083C18L16j050o50K99J019L95j243n42P82J017j32j352k48J072J019m97j235
1100g12K61P75P86q35p94p4J314K62j069m44N14J161j85j377l13R27Q65l47j277
1119e62j6J197O83r50j108K57J402k28p48p92L76J416l93j066l76J187O03n40
1137C42r72J7O28Q15n05j086J36J036N95j023o71N04R19L6j090m31R33O59n39
$$ plain form
1009 -804 -1049 -657 554 578 -608 -842 -14 789 599 -524 -451 751 1164 567 -245 158 1047 1490 414
1028 414 -132 369 1217 1241 106 -592 140 1069 803 -400 -1176 65 512 -137 -1430 -1132 -6 331 -414
1047 -414 -1606 -998 197 376 -483 -1451 -731 499 45 -845 -1086 21 987 178 -980 -584 383 780
1065 780 -136 -832 -587 893 1179 -305 -955 -216 928 391 -491 -1025 -74 782 315 -1079 -946 318
1083 318 634 -416 -1066 -767 252 647 -596 -1138 -356 661 529 -823 -1071 1 1020 523 -712
1100 -712 -451 324 1110 275 -519 -593 721 983 -86 -530 -16 1145 960 -417 -730 197 1062 715 -562
1119 -562 -578 619 1302 352 -756 -499 903 675 -73 -865 -489 927 534 -532 -908 279 882 342
1137 342 -630 -613 15 830 325 -761 -625 411 1006 -17 -688 -184 735 771 -319 -750 183 842 303
1156C03r37R8N11P70p88o92J21J168J06q57o55N72J057m9j203l97Q87O89l14p21
1176c31l34P12Q19n04q55m4J011K85q84n39M60Q85J39j071l88O40O47j21r58q5
1196e16P93M81n65q86L49O52L66o46o79L95P95M3q10o83P51Q97n07m10l81Q55
1216B94M75m48q48K88N37M29o15q83O09N36L03r55m42O52N04r7n95n36Q44N65
1236F17k77q40N1L91L80k30n21J20N52K2m76k89K91O13j07n93l64L75O23j07o37
1257d06j11O15N05j35r94K80M47L40n96j89j91O66L54n96m91K93M67lm43k74M39
1278b3M04j51m60l41N79K08j61n10J13P10l24J44q02L82P60m74l48r8J96L78j82
1299@n72K10K49L31n55m14J77P65l8l54k21J15J92J47l25k82M88J77o3k91k10
$$ plain form
1156 303 -634 -536 -25 745 -43 -735 -614 554 660 -197 -852 -280 777 728 -475 -872 15 704 390 -331
1176 -331 -665 47 866 362 -493 -537 474 759 -125 -664 -204 681 820 -251 -639 1 648 527 -431 -516
1196 -516 277 758 193 -693 -344 308 674 28 -651 -256 539 582 -228 -911 -160 737 230 -180 -561 294
1216 294 769 321 -527 -239 298 727 112 -771 -162 374 677 -278 -720 -68 436 339 -256 -792 52 617
1236 617 340 -500 -449 -58 322 92 -429 -309 243 265 -211 -500 -209 404 297 -296 -660 -285 338 231 -406
1257 -406 -517 98 603 468 -526 -246 201 541 -55 -244 -435 231 585 -11 -502 -209 258 255 -188 -462 -23
1278 -23 381 230 -230 -571 8 216 55 -455 -342 368 44 188 -614 -232 528 54 -294 -392 -196 182 0
1299 0 -572 -362 -113 218 -337 -751 -574 191 153 -201 -422 -307 -115 32 -293 -575 -87 90 27 -264 -474
1320d74L90K66Q5n03N6L85L20m97l09M46K59Mm68j29J79L75K5l64j15K93J09j57
1342A76k22R7L85J25l07m04M66K5k0m9n29K27N56j48m06J24J24K04k79j46j54
1363a55K31mJ6l59R1M25N7k9m18J80L52j10k46l7p4K41Q3l04mJ62K03k3l83P3
1387c2K46j24R9l48J54L75j73j98j34J1K88J38k95j18K21N6j24k26n2J97K72M0
1409B73n36l8K94N0k20m18K06K52j20j41l85L98K45O8l19j20L9Q1J03N5j41M5
1431c29L82k36p9L9J16J66l18J43p7J42J64l73l30L42L90l6k61j25J78K04M0l87
1453b45O4L33K70m60j89j31N49ml87J99o8L99p4k55j4K01m0p4L2k75K10J78k82
1476f3o2K64j48K55k18j76P7J95K6m99K13o3M21j46j25p1J62J16j73n12M52K41
$$ plain form
1320 -474 -84 182 267 -236 -180 205 525 28 -281 165 424 428 -40 -169 10 385 410 46 -69 224 333 176
1342 176 -46 51 436 561 254 -150 316 341 321 272 -257 -30 526 378 -28 96 220 424 145 -1 -155
1363 -155 76 72 88 -271 -180 245 302 273 -145 35 387 277 31 -6 -80 161 244 -60 -64 98 301 278 -105 -32
1387 -32 214 90 189 -159 -5 370 197 -1 -135 -124 164 302 7 -111 110 166 42 -184 -236 -39 233 273
1409 273 -263 -301 -7 43 -177 -595 -389 -137 -257 -398 -783 -385 -140 -72 -391 -511 -472 -391 -288 -233 -374 -329
1431 -329 53 -183 -262 -223 -107 59 -259 -116 -193 -51 113 -260 -590 -248 142 106 -155 -280 -102 102 142 -245
1453 -245 -181 152 422 -38 -227 -358 191 187 -200 -1 -69 330 256 1 -13 188 148 74 106 -169 41 219 -63
1476 -63 -125 139 -9 246 28 -148 -71 124 150 -349 -136 -199 222 76 -49 -120 42 158 -15 -527 -75 166
1498A66j44Q4l5j80L87j01j56j19j49L55J02m8j96O0K34M5l57J75j59M18k6l53
1520CQ9k5M77j47n72J69R4nK00m50J19L35k65m18J99J49J99r2l04m7L70K9ol18
1544b17J48N1J00j18q3J2J73L13l16l55K1M64jj57k51L59j23J44m15J91m6K45
1566A39P6o05pN02J35l73j68K93j91J87k0j16kN49m56p1K2L75l3p5l21l8L11o6
1590D7r2k94J07M38j08l93O6M06QN0k24l56L11P0J27m79N2M16p2J40l04o0K22
1613G8J56k29l6k1O22m27l48J07J2K29k08k24R3M25m9J9l68O8J85L3m15k2K03
1636a17J31M9l47k95P16J23l30k68L62M1J08k6l17mL74k8l32J14M1J33J34m67
1658b05M5J90K51k16n9j57K76J01N7m80K91J68j35k75J21K50r9p6j98n9K49K20
$$ plain form
1498 166 22 106 71 -109 278 177 21 -98 -247 108 210 162 -34 26 260 305 -52 123 -36 382 356 3
1520 3 92 67 544 397 -175 -6 88 83 283 -167 -48 287 22 -396 -197 -48 151 59 -245 -292 78 107 101 -217
1544 -217 -69 -18 82 -36 -119 -107 66 379 63 -292 -271 193 192 35 -216 143 20 164 -251 -60 -106 139
1566 139 215 -390 -397 105 240 -133 -301 -8 -199 -12 -32 -148 -150 399 -57 -128 -106 269 236 161 -160 -198 113 47
1590 47 -45 -339 -232 206 98 -295 -229 177 185 235 11 -345 -34 36 163 -316 -264 152 80 220 -84 -144 78
1613 78 234 5 -31 -52 570 143 -205 -98 -86 143 -65 -289 -196 229 180 199 -169 -101 84 117 -298 -320 -117
1636 -117 14 63 -284 -579 137 260 -70 -338 24 65 173 147 -170 -174 200 172 -160 -46 -5 128 262 -205
1658 -205 -160 30 281 65 6 -151 125 226 283 -197 94 262 127 -148 -27 223 124 48 -150 -209 40 260
1680B60q2m86L50K61K1l50O0j93J60L33m05j34J8L95n1l02N5q2K51K2j83k91M24
1703E1p1o4j29p0L40K01l42n6k9J11K10p0k99L65J86j02j50j68M06K68l70m71
1725b53K72K04j89k27Q7K66K52p0k11j61j24L20j21ok33K65J36k38k8m6L15P7
1747B87j70j01pK79J05k91J67R0j39K65l74P8J98j49p1j25J09O2J03n6l43O9J72
1770A58j15j35k14J96J19j69J14o9l1k15J97k18J97j8P9N4j78k20N13j96M5m16
1792e22M02K4o5m5k5J54m8nr1n8K79Mj40j36J45j67J18n0j38L36j84j6J57J38
1816F7j79j27K92l30J59P6J23k01K9k30L55M1j67k14K0m4K95m33K21k76L07m4
1838b60k86Q7K49R5l91J77J86j6K80k36k30J80J77J56q4p3Q0M03j84j97k4L6J70
$$ plain form
1680 260 178 -308 42 303 324 -26 34 -159 1 334 -71 -205 -187 208 157 -145 -90 -172 79 101 -82 -373 51
1703 51 -20 -84 -213 -283 57 258 -84 -140 -169 -58 152 82 -217 148 334 232 82 -86 320 588 218 -253
1725 -253 19 223 34 -193 -106 160 412 342 131 -30 -154 166 45 39 -194 71 207 -31 -59 -105 210 287
1747 287 117 16 9 288 393 102 269 359 220 485 111 189 387 238 167 42 151 213 316 260 -83 -14 158
1770 158 43 -92 -306 -110 9 -160 -46 -115 -146 -361 -164 -382 -185 -203 -124 -70 -248 -468 45 -151 -106 -522
1792 -522 -120 -96 -161 -206 -231 -77 -125 -130 -221 -279 0 4 -136 -272 -127 -294 -176 -226 -364 -28 -212 -228 -71 67
1816 67 -112 -239 53 -277 -118 -42 81 -120 -91 -321 34 75 -92 -306 -286 -330 -35 -468 -247 -523 -216 -260
1838 -260 -546 -459 -210 -115 -506 -329 -143 -159 121 -115 -345 -165 12 168 84 11 91 494 310 113 89 125 295
1861B95J16j08j01k4K64m9k24o9L23l22l9j26K31Q4j39J32k49L36k35J00kN7j37
1884A14J19l7o5PM48j73m01n9M44r0J0p5k2K23k53L27m57R9N5J69q8l09K01k07
1908b0J57j0Q5j81j2p3n1o2J40O9K6K1l84J34J06L11l07J44o3o9J50j49j02J39
1932aN5n5K91jl02J47n7n5M0O6m9l50K05K98j18j90l08J45Q3j2k64J83n3j4j0
1957c26J3l3R3p8r7J57k15M04k10L13k67J27n1M09k60k6j86K99O6r7o4j01M43
1980C13j87M3l68R5L59j69K6r8r5J82o5j91J54k4J75j57j73J04M4k73J98j01K69
2003F1l2N1m26j2L17q7J88j64k23K10K40J38m85J01J93m1J4P8q8K38p5j96j90
2026a90K41J86j56l24K71L01r8j86j30Q5J98J60l73j52J66J60l62k0k57J31M35
$$ plain form
1861 295 411 303 202 178 442 393 169 100 423 101 62 -64 167 251 112 244 -5 331 96 196 194 251 114
1884 114 233 196 131 138 586 413 12 -47 397 307 317 242 220 443 190 517 60 159 214 383 295 -14 187 -20
1908 -20 137 127 212 31 19 -54 -105 -167 -27 42 68 89 -295 -161 -55 256 -51 93 30 -39 111 -38 -140 -1
1932 -1 54 -1 290 289 -13 134 77 22 62 128 79 -271 -66 232 114 -76 -384 -239 -156 -168 -432 -249 -302 -316 -326
1957 -326 -313 -346 -253 -331 -428 -271 -486 -82 -292 21 -246 -119 -170 239 -21 -47 -233 66 132 35 -29 -130 313
1980 313 126 169 -199 -104 255 86 112 14 -81 101 36 -155 -1 -25 150 -7 -180 -76 -32 -305 -107 -208 61
2003 61 29 80 -346 -358 -41 -128 60 -104 -327 -117 123 261 -224 -123 70 29 43 121 33 271 196 0 -190
2026 -190 51 237 81 -243 28 329 231 45 -85 0 198 358 -15 -167 -1 159 -203 -223 -480 -349 86
2047H6j74k5j94L66k15j9j14n9L17R6j31l13N47q2K0j70M9O7K80k46n0N9K03k6
2071B72j20m4j95K16pn9J7j76K46l6k60J20P6j07j02M9j69L15P1p8m52M43k9j9
2095b8j19L7J61Q9j05j2q6P6J84r7o9J32K45j30l07j41K36q1J56k32J23N5J23
2118B10m9l46L44k23oK2j4j19K09J18k39k2M02l08K53k25m9N9J36j44J15j6j39
2141c1J08q2p4K9M12j23j54l10K66J16oj82j79K33R4m00J37n0L05j63N6j38J43
2164GK6K09j74j05L38K74m68k21L6K86J78j86j31k06K11j14k6N2K25J80k30j7
2186A44q7M8J59k47j34K97j95N1m4j3P6J17Lm04J66K49J05k79n5l02L69O2q9k74
2210b77J65K52k1k12P5k76K68J98j80L6j48Q1K62l91n5R4L02k75J33o5K12j13
$$ plain form
2047 86 -88 -113 -307 59 -156 -175 -289 -348 -31 65 -66 -379 168 86 106 -64 -15 52 332 86 36 95 298 272
2071 272 152 108 -87 129 122 63 80 -96 150 114 -146 -26 50 -57 -159 -110 -279 36 107 29 -423 20 -9 -28
2095 -28 -147 -110 51 140 35 23 -63 13 197 100 31 163 408 278 -29 -170 66 -15 141 -91 32 87 210
2118 210 161 -185 159 -64 -70 -48 -62 -181 28 146 -93 -115 287 -21 232 7 -42 17 153 9 124 108 -31
2141 -31 77 -5 -79 -50 362 239 85 -225 41 157 151 -31 -210 23 117 -283 -146 -196 109 -54 2 -136 7
2164 7 33 242 68 -37 301 575 107 -114 -78 208 386 200 69 -137 74 -40 -66 -14 211 391 161 144
2186 144 57 105 264 17 -117 180 -15 36 -8 -21 55 172 175 -229 -63 186 291 12 -43 -345 24 86 -3 -277
2210 -277 -112 140 119 -93 -18 -294 -26 172 -8 28 -120 -39 223 -168 -223 -129 173 -102 31 -34 178 65
2232F5k73K04k56L8L59m55P3j6J17o4j47rL02J07j53k69J14J24K93n28R1J8K70
2255Ek05j13R7M1K0j19J97K35l19K61o0k1K0Q6J29j2j57j00L30k36k53O8O6N4
2279A4m3J81j41l8J99k43j24J83p3j3O1K44j79N5P8j48K80l77L6L17j83J57j6
2302B27p2l5k79K12K78Lo8r2K71l37K97k88K9j4M7J6j7r4j06J16j46n7j8K26q1
2327A8l1k06J4K13J99k06J5rk4L0j0m5J18K42l68R5j45N79l85J70J09j72J20k11
2351A10Lq4J58L0l94J38m3k4J70j6N4k33L9O4j12K49j63R7j98Q5l3K7r3J62k05
2376b12J4l1K28J51l12M4k8j33L10K32n11M01j32j82J81J22m7l2L28n09L07k41
2398e2J53j99J73k27J8J82j11r7JP8n1M5qP4k9P6k06K25p8p0p3J42j11J37q2L26
$$ plain form
2232 65 -208 -4 -260 -222 137 -318 -245 -261 -144 -208 -355 -364 -62 45 -108 -377 -263 -139 154 -374 -283 -265 5
2255 5 -200 -313 -216 -175 -155 -274 -77 158 -161 100 40 19 39 125 254 242 85 -15 315 79 -174 -106 -40 14
2279 14 -29 152 11 -27 172 -71 -195 -12 -85 -98 -37 207 28 83 161 13 293 -84 -48 269 86 243 227
2302 227 155 120 -159 53 331 334 266 174 445 108 405 117 146 132 179 195 178 84 -22 94 -52 -109 -127 99 18
2327 18 -13 -219 -205 8 207 1 16 7 -17 13 3 -42 76 318 -50 45 -100 479 94 264 373 201 321 110
2351 110 113 29 187 217 -177 -39 -82 -106 64 48 102 -131 -92 -28 -140 109 -54 43 -155 -70 -103 -76 -169 -7 -212
2376 -212 -198 -229 -1 150 -162 -118 -146 -279 31 263 -248 153 21 -161 20 142 95 63 391 -118 189 -52
2398 -52 101 -98 75 -152 -134 48 -63 -160 -159 -81 -132 -87 -95 -21 -50 26 -180 45 -33 -103 -176 -34 -145 -8 -90 236
2424B36m0k93K45J16k35R0J34k59O1M3J47l18K00L4m8o2L2j9J16j58N5j40K00
2447A37j40j95K6R4j18Q5q6q8K22qO0j95P0J4O8O3Kjj63Q4N9k7K68k62j02Q3J30
2474H0k99J83K4k05K50J43o2j15J92m5r6O3j19P5J5j25K09j63l11M09k91O4k5
2497a49J69J40k62M8Q1j55R6o2M8J46j91J05j09n2K78j00p4P6O4j66K09N4k73
2520g9J05Q8P7j51K12ln2j03l48J41P1j35N6K2O7Np1P0k0K1M7n0r5Lj03q2M21
2547A14k2p8J15l07K34p4j07J48J15k19o8J94J90o2j01O3K2j5j69j23K52k49K02
2570E5l7J09j18M0K9J34j78q2J74j32p8K07r1q7q7J55l2l5j45N4J37r3QN5p6M0
2596g4J09q1R5n4j65K82k25J36R8k16K08k81P3L3J88k49J40J13Q9k01n4O7O8l08
$$ plain form
2424 236 196 -97 148 264 29 119 253 -6 55 98 245 -73 127 161 113 51 83 64 180 22 77 -63 137
2447 137 -3 -198 -172 -78 -196 -111 -197 -285 -63 -71 -11 -206 -136 -122 -54 9 11 10 -153 -69 -10 -37 231 -31 -133 -50 80
2474 80 -219 -36 -12 -217 33 176 114 -1 191 146 50 113 -6 69 84 -41 168 5 -306 103 -188 -124 -149
2497 -149 20 160 -102 -54 27 -128 -32 -94 -46 100 -91 14 -95 -147 131 31 -43 33 97 -69 140 194 -79
2520 -79 26 114 191 40 252 249 197 94 -254 -113 -42 -177 -121 -99 -32 -27 -98 -28 -48 -27 20 -30 -125 -122 -225 -307 114
2547 114 92 14 129 -178 56 -18 -125 23 138 -81 -149 45 235 173 72 135 157 142 -27 -150 102 -147 55
2570 55 18 127 9 49 78 212 34 -48 126 -6 -84 123 32 -55 -142 13 -19 -54 -199 -145 -8 -101 -93 -38 -114 -74
2596 -74 35 -46 49 -5 -170 112 -113 23 121 -95 113 -168 -95 -62 126 -123 17 130 219 18 -36 31 99 -209
2620b09K15J5nl0r9R0j08L3K43k32R0L8K23l08j71J81J80L3r6k36K18jl6N1P5
2645A54J60m25J24J44Lj86J17M8j31J68j35NJ18k28j00K79m10J64l9J12J64l23
2667b17k7m6K11l8R4J9n3nK13r2k02K10pk74L84r7j27J24M5j85J23j5k92M7L6
2692a71J11j32J3J29k64K60k6jn3J3K2K84j50k00K36o6q8R7O8nL08j49N2J22j0
2717D00l38K28p5k25J40J01j80J38%o7p0PK72m73K51j40R0K05j48j8m28M86k52
2740i6l7J39j10P4K27l4j80J52j03K2j63J23p6J59j00N8k17JN66m00k3J1R2j33
2764d8R2j13K8j7J01j22lO7J33j17Mj70K09q6j04J13o2L30q5j14j57r0K63j10
2788e8j60Q7k0L79j45J07k19J38p0p8L52l92J32j33Rj22K38J88l3j22J37k03J24
$$ plain form
2620 -209 6 21 16 -14 -113 -23 -131 -98 145 -87 3 41 264 -44 -215 -34 146 179 83 -153 65 64 28 79 154
2645 154 314 -111 13 157 160 -26 91 139 8 176 41 46 164 -64 -164 115 -295 -131 -170 -58 106 -217
2667 -217 -244 -290 -79 -117 -23 -4 -57 -62 151 59 -143 67 60 -214 170 73 -54 70 115 -70 53 38 -254 -207 -171
2692 -171 -60 -192 -179 -50 -314 -54 -80 -81 -134 -121 -99 185 35 -165 71 5 -83 14 82 77 385 236 288 410 400
2717 400 62 290 215 -10 130 231 51 189 189 122 52 59 331 -142 109 -31 59 264 116 98 -330 156 -96
2740 -96 -133 6 -104 -30 197 163 -17 135 32 54 -109 14 -62 97 -3 55 -162 -161 405 5 -18 -7 85 -48
2764 -48 44 -69 -41 -58 43 -79 -82 -15 118 1 5 -165 44 -42 -146 -33 -95 235 150 36 -121 -211 52 -58
2788 -58 -218 -131 -151 228 83 190 -29 109 39 -39 313 -79 53 -80 -71 -193 45 233 200 78 215 12 136
2811A36m9M2k16J45k07J87J72l85L08k00l5L25m73pK43J33l67R1q1J53J49k58
2833a94L15l06pJ37pj42Q9P1J07K21k62O1n6J36k45L25l20J13R1j94m6L09k95
2856i9M1j07L37m4j21N6l11K25J46m30K37p4J76k7Mj15J57Q6J27m15n1K82n5l2
2880gJ20j94L13J28r0m0J00j42K5p2p3K40k41j7j2Mj65J01J52l43P0n2J14Q3O3
2905F5l55K69j6No9J06l0J06j52j48K91l31pK19r3J46K77j89j0j29k8J31L0J2
2929A00j17L76n12K85j6Q2L0l46O9J21o4p5J57J3q8j02J26j44K01kP5k16J10n6
2953GN0k37Q2J32p4LL2R3O0J22k26j57K30j36L5q0m2L7J16l2n5mJ8N9j5J78m56
2980b60L92PJl09P3K75l54K27J32j87M3j21j57N0J92j03m2K03k21L57k04p5J28
$$ plain form
2811 136 87 129 -87 58 -149 38 210 -175 133 -67 -102 223 -250 -257 -14 119 -248 -157 -238 -85 64 -194
2833 -194 121 -185 -192 -55 -62 -204 -115 -44 63 284 22 83 27 163 -82 243 -77 36 127 -67 -113 196 -99
2856 -99 -58 -165 172 128 7 63 -248 -23 123 -307 -70 -144 32 5 9 -106 51 137 264 -151 -202 80 25 -7
2880 -7 113 -81 232 360 270 230 330 188 213 141 68 308 67 50 38 42 -123 -22 130 -213 -143 -195 -81 2 65
2905 65 -290 -21 -37 -32 -101 5 -25 81 -71 -219 72 -259 -266 -47 -140 6 283 94 84 -45 -73 58 88 100
2929 100 -17 359 -153 132 116 198 228 -118 -49 72 8 -67 90 103 15 -87 39 -105 96 94 169 -47 63 7
2953 7 57 -180 -98 34 -40 -37 -5 88 148 270 44 -113 117 -19 16 -64 -106 -69 47 15 -40 -44 -26 33 18 196 -260
2980 -260 132 139 140 -169 -96 179 -175 52 184 -3 40 -81 -238 -188 4 -99 -141 62 -159 198 -6 -81 47
3003D7j69J14k41K05k7J6k79K66rJ14j04K44j79P9L0M8j24J05p8j24J93P6k22
3026a9m6M55l06j69J45J05k52K35K3o2j68J15o2j11K05l19k4M3m5K68L2j51K02
3049I4N4j93N1p2N9j45J57J5L5RQ0k03q9J66Q5%K40k31q0j5o0P5J32q8j25N9j08
3076i8OJ37j13K18k00j64K98j9q1o9K10j59Q5jq2K11q8m9L0m5R6m0P8o2L3j19
3102A3k7J02k35M9K13j36k33J90o7K58M5j31Q6j65O9Q5k06K84j27m7k80L11k80
3125b29K26jK0n7J29q5l5Q2Jk2R1l14J96o4P0j62J94r1q0q3M03k95O5J40l4K7
3151I2k8l33K73K72j81j79J14q5j41JJ09J16R9j6j62kp9K44k3j40J98l3j90K69
3175A95j2k28J90r7j01K37j21K46l11J45j04k8J07M7O8l48K84j16k41L21j89l7
$$ plain form
3003 47 -122 -8 -249 -44 -71 -55 -334 -68 -77 37 -67 177 -2 77 107 155 31 136 58 -66 127 203 -19
3026 -19 -65 390 84 -85 60 165 -87 148 171 109 -59 56 -6 -117 88 -231 -255 -212 -257 11 43 -108 94
3049 94 148 -45 6 -66 -7 -152 5 20 55 64 144 -59 -148 18 103 103 343 112 32 17 -43 32 164 76 -49 10 -98
3076 -98 -92 45 -68 150 -50 -214 84 65 -16 -85 125 -34 51 50 -32 179 91 42 72 27 123 83 161 99 132 13
3102 13 -14 88 -147 -98 115 -21 -254 -64 -131 127 172 41 127 -38 31 116 -90 194 67 20 -260 51 -229
3125 -229 -3 -4 16 -41 88 3 -32 50 51 29 120 -194 2 -62 8 -154 40 -51 -131 -214 189 -106 -41 99 65 92
3151 92 64 -269 4 276 95 -84 30 -55 -196 -195 -86 30 129 113 -49 -51 -130 114 91 -49 149 116 -74 195
3175 195 183 -45 145 48 -53 184 63 309 -2 143 39 11 118 165 233 -115 169 53 -188 133 -56 -93
3197i3n5l3K30k39QJ18N8j2j08N8J53j43N2K6K12l98K34Q1p8p7j17L5J71Q6k65
3222i6Q5J43j74K7m9K85l65K0P4K22j55K35l09j57K88j25R7k08J95N2K8J79l50
3245e8J82j48k6j24K11j15m9J80n8K27j57j44J00J62k37P1J27j25J6r3j03K28
3267F7M3l73K97N4r1l8j26k7J47k1l8m0L60k83r3J64k39J15J00j30J09k25M42
3290A74k98J21k1J73m8j08K03j79j49M64o2l24J0L89l35l5J93r3j0Q1k32P3R0
3313G7p6J48k18k1OJ93k85K43r0j4q5K12j35M8p7J38o5R4J37j66Q4j2k52p1J52
3338c5k6R3R5k67J90j43K50j23j82q9L76J48k65q8M2J25j28K03k17R5L7j51P7
3361A7L5j40j07J28N9p2K59j2k38L5N2j15L7R7j2j43N6J61j00J21j67J03r9Q6
$$ plain form
3197 -93 -148 -181 49 -190 -182 -64 -6 -18 -126 -68 85 -58 -6 20 232 -166 68 149 71 -6 -123 -88 83 169 -96
3222 -96 -11 132 -42 -15 -64 221 -144 -124 -50 172 17 252 -57 -214 74 -51 46 -162 33 85 113 292 -58
3245 -58 124 -24 -50 -174 37 -78 -127 53 -5 222 65 -79 21 183 -54 17 144 19 35 -58 -161 67
3267 67 110 -263 34 88 -3 -41 -167 -194 -47 -68 -106 -146 214 -69 -162 2 -237 -122 -22 -152 -43 -268 174
3290 174 -124 -3 -24 149 101 -7 196 17 -132 332 270 -54 -44 345 10 -25 168 75 65 146 -86 -13 77
3313 77 1 149 -69 -90 -84 109 -176 67 -23 -37 -122 90 -45 3 -74 64 -1 93 230 64 148 136 -116 -187 -35
3338 -35 -61 32 127 -140 50 -93 157 34 -148 -237 139 287 22 -66 -24 101 -27 176 -41 54 91 -60 17
3361 17 52 -88 -195 -67 -8 -80 179 167 -71 -36 16 -99 -62 35 23 -120 -64 97 -3 118 -49 54 -45 41
3385D1j5O0pj58K14J7N2k12Rj32J16J8L6M5k9M1r8J48j75J00J20j35PR1Q9k81
3411c8J88r6R0j26r2J17j47J80r6O9j62J95J2j34k94K1L54M8M5j3m6k27K31j36
3435e7q8j64L43j12K4j9M5K42k10n9M8k03K98j96K15k29J4P2k7Np4N42m25l3k8
3460g6j30R1K07q6j74J2J13M2N4q5j3k5J9K49k06M8L3k06J44n8m7J17p2KK16j37
3486C2k33M7J11O9O4r5L0J53j93N7o0l7O3N7kk14O6P9J04k13l2K51k99K14PP5
3512A01j03M5k56K04r4n4K88j96RK66n22K92nOk18M48j29m9N7k8j91p6L02om06
3537c15L07O9n5J20l60K71j70l6J41J37k29R1j33K96j38J30j0k11j8K43k46J39
3559B3R8J21j70J08k73k14J75o0k7N5K42j08QJ00k28P2J09k15j9L41o6j70r7J80
$$ plain form
3385 41 26 86 79 -79 135 152 204 -8 1 -131 -15 3 39 84 55 96 -2 146 -29 71 191 56 63 154 243 -38
3411 -38 150 54 144 18 -74 43 -104 76 -20 49 -113 82 94 -40 -334 -313 41 89 134 121 75 -152 79 -57
3435 -57 -145 -309 34 -78 -54 -73 -28 214 4 -55 -7 -210 88 -108 107 -122 -108 -36 -63 -58 -132 410 -15 -48 -76
3460 -76 -206 -115 92 6 -168 -156 -43 -1 53 -32 -45 -70 -51 198 -8 40 73 -133 11 -47 -94 23 -49 -47 169 32
3486 32 -201 -154 -43 26 90 -5 25 178 -15 42 -18 -55 8 65 63 -151 -85 -6 98 -115 -147 104 -195 19 26 101
3512 101 -2 43 -213 -9 -103 -157 131 -65 -56 210 -312 -20 -25 -19 -237 211 82 33 90 62 -129 -205 97 91 -315
3537 -315 -8 61 6 126 -234 37 -133 -169 -28 109 -120 -29 -162 134 -4 126 116 -95 -113 130 -116 23
3559 23 121 242 72 180 -93 -307 -132 -192 -219 -164 78 -30 -22 78 -150 -78 31 -184 -203 138 72 -98 -195 -15
3583a5j9MJ1j01J38J95j31j52J90j26l2Q5k34J83l2M4m01N26q7k04P7o3K23m1
3607C8N2Q7J5k29K1o9J05n6K6J52k19q7J57K0j34O8J67k8k48L63j56j2p0K20l24
3632a41L72k40J79jo9j14L13n60L49j79P5nj3O5R8j69J02K54l86K44j04k0P1l37
3656b16K99j39J32j42K23N0l23J60lm6r5o3J47M7k26L23j18j72K61l36R6K63K3
3679A45k36L34l25O9k1l0L0J5J80k8Rk70L82q5j92k04J90j29J31K33j55j20J05
$$ plain form
3583 -15 -34 -30 -19 -120 18 213 82 -70 120 -6 -38 47 -187 -4 -36 8 -393 133 46 -158 -81 -144 79 38
3607 38 90 177 192 -37 -16 -85 20 -36 -10 142 -77 -164 -7 13 -121 -53 114 86 -162 201 45 33 -37 183 -141
3632 -141 231 -9 170 169 100 -14 299 -261 88 -91 -16 -21 -34 31 129 -40 62 316 -70 174 70 50 121 -216
3656 -216 83 -56 76 -66 157 207 -116 44 41 -5 -100 -163 -16 31 -195 128 10 -162 99 -237 -141 122 145
3679 145 -91 243 -82 -13 -34 -64 -34 -19 161 133 142 -128 254 169 -23 -227 -37 -166 -35 198 43 -77 28
$$ [...]
8191f2
##END NTUPLES=NMR FID
##END=
