##TITLE=1H_Pr 2835
 CDCl3
 8 sc, 
 9.2.2023
##JCAMPDX= 6.0         $$ Bruker NMR JCAMP-DX V2.0
##DATA TYPE= NMR FID
##DATA CLASS= NTUPLES
##ORIGIN= UXNMR, Bruker Analytische Messtechnik GmbH
##OWNER= root
$$ XWIN-NMR		Version 3.5
$$ Thu Feb  9 17:28:09 2023 Russian Standard Time (UT+4h)  she@DPX200
##.OBSERVE FREQUENCY= 200.13135
##.OBSERVE NUCLEUS= ^1H
##.DELAY= (6, 6)
##.ACQUISITION MODE= SIMULTANEOUS
##.ACQUISITION SCHEME= undefined
##.AVERAGES= 8
##.DIGITISER RES= 18
##SPECTROMETER/DATA SYSTEM= spect
##.PULSE SEQUENCE= zg30
##.SOLVENT NAME= DMSO
##.SHIFT REFERENCE= (INTERNAL, DMSO, 0, 15.7039)
##AUDIT TRAIL= $$ (NUMBER, WHEN, WHO, WHERE, WHAT)
$$ ##TITLE= Audit trail, XWIN-NMR		Version 3.5
$$ ##JCAMPDX= 5.01
$$ ##ORIGIN= Bruker BioSpin GmbH
$$ ##OWNER= she
$$ F:/spectra/data/she/nmr/H-F/1/audita.txt
$$ ##AUDIT TRAIL=  $$ (NUMBER, WHEN, WHO, WHERE, WHAT)
(   1,<2023-02-09 17:26:55.98 +0400>,<she>,<DPX200>,
      <created by zg, POWCHK disabled, PULCHK disabled
       configuration hash MD5:
       00 E9 B6 7A A2 85 ED C7 34 08 36 98 17 FE 4E 26
       data hash MD5: 16K
       4C 68 B1 1E 77 A0 FC 80 15 3A 0C 7E 1C 5F EA 1A>)
$$ ##END=
$$ 
$$ hash MD5
$$ 8A 13 A5 CD F8 38 DC 2E 0D F3 31 76 7B 20 16 C4
##$RELAX= 
##$RELAX= 
##$RELAX= 
##$RELAX= 
##$RELAX= 
##$RELAX= 
$$ Bruker specific parameters
$$ --------------------------
##$DU= <F:/spectra>
##$EXPNO= 1
##$NAME= <H-F>
##$PROCNO= 1
##$TYPE= <nmr>
##$USER= <she>
##$AMP= (0..31)
100 100 100 100 100 100 100 100 100 100 100 100 100 100 100 100 100 100 
100 100 100 100 100 100 100 100 100 100 100 100 100 100 
##$AQSEQ= 0
##$AQ_mod= 1
##$AUNM= <au_zg>
##$AUTOPOS= <>
##$BF1= 200.13
##$BF2= 200.13
##$BF3= 200.13
##$BF4= 200.13
##$BF5= 200.13
##$BF6= 200.13
##$BF7= 200.13
##$BF8= 200.13
##$BYTORDA= 1
##$CFDGTYP= 0
##$CFRGTYP= 5
##$CHEMSTR= <none>
##$CNST= (0..31)
1 1 145 1 1 1 1 1 1 1 1 1 1 1 1 1 1 1 1 1 1 1 1 1 1 1 1 1 1 1 1 1 
##$CPDPRG= <>
##$CPDPRG1= <>
##$CPDPRG2= <>
##$CPDPRG3= <>
##$CPDPRG4= <mlev>
##$CPDPRG5= <mlev>
##$CPDPRG6= <mlev>
##$CPDPRG7= <mlev>
##$CPDPRG8= <mlev>
##$CPDPRGB= <>
##$CPDPRGT= <>
##$D= (0..31)
0 1.2 0 0 0 0 0 0 0 0.06 0 0.03 0 0 0 0 0.0002 0 0 0 0 0 0 0 0 0 0 0 0 
0 0 0 
##$DATE= 1675949215
##$DBL= (0..7)
120 120 120 120 120 120 120 120 
##$DBP= (0..7)
150 150 150 150 150 150 150 150 
##$DBP07= 0
##$DBPNAM0= <>
##$DBPNAM1= <>
##$DBPNAM2= <>
##$DBPNAM3= <>
##$DBPNAM4= <>
##$DBPNAM5= <>
##$DBPNAM6= <>
##$DBPNAM7= <>
##$DBPOAL= (0..7)
0.5 0.5 0.5 0.5 0.5 0.5 0.5 0.5 
##$DBPOFFS= (0..7)
0 0 0 0 0 0 0 0 
##$DE= 6
##$DECBNUC= <off>
##$DECIM= 32
##$DECNUC= <off>
##$DECSTAT= 4
##$DIGMOD= 1
##$DIGTYP= 9
##$DL= (0..7)
0 120 120 120 120 120 120 120 
##$DP= (0..7)
150 150 150 150 150 150 150 150 
##$DP07= 0
##$DPNAME0= <>
##$DPNAME1= <>
##$DPNAME2= <>
##$DPNAME3= <>
##$DPNAME4= <>
##$DPNAME5= <>
##$DPNAME6= <>
##$DPNAME7= <>
##$DPOAL= (0..7)
0.5 0.5 0.5 0.5 0.5 0.5 0.5 0.5 
##$DPOFFS= (0..7)
0 0 0 0 0 0 0 0 
##$DQDMODE= 0
##$DR= 18
##$DS= 0
##$DSLIST= <SSSSSSSSSSSSSSS>
$$ [...]
##$SUBNAM2= <"">
##$SUBNAM3= <"">
##$SUBNAM4= <"">
##$SUBNAM5= <"">
##$SUBNAM6= <"">
##$SUBNAM7= <"">
##$SUBNAM8= <"">
##$SUBNAM9= <"">
##$SW= 18.05172834244
##$SWIBOX= (0..15)
0 0 2 0 0 0 0 0 0 0 0 0 0 0 0 0 
##$SW_h= 3612.71676300578
##$TD= 16384
##$TD0= 1
##$TE= 0
##$TE2= 300
##$TE3= 300
##$TEG= 300
##$TL= (0..7)
0 120 120 120 120 120 120 120 
##$TP= (0..7)
150 150 150 150 150 150 150 150 
##$TP07= 0
##$TPNAME0= <>
##$TPNAME1= <>
##$TPNAME2= <>
##$TPNAME3= <>
##$TPNAME4= <>
##$TPNAME5= <>
##$TPNAME6= <>
##$TPNAME7= <>
##$TPOAL= (0..7)
0.5 0.5 0.5 0.5 0.5 0.5 0.5 0.5 
##$TPOFFS= (0..7)
0 0 0 0 0 0 0 0 
##$TUNHIN= 0
##$TUNHOUT= 0
##$TUNXOUT= 0
##$USERA1= <user>
##$USERA2= <user>
##$USERA3= <user>
##$USERA4= <user>
##$USERA5= <user>
##$V9= 5
##$VALIST= <valist>
##$VCLIST= <CCCCCCCCCCCCCCC>
##$VD= 0
##$VDLIST= <DDDDDDDDDDDDDDD>
##$VPLIST= <PPPPPPPPPPPPPPP>
##$VTLIST= <TTTTTTTTTTTTTTT>
##$WBST= 1024
##$WBSW= 4
##$XGAIN= (0..3)
0 0 0 0 
##$XL= 0
##$YL= 0
##$YMAX_a= 193596
##$YMIN_a= -204106
##$ZGOPTNS= <>
##$ZL1= 120
##$ZL2= 120
##$ZL3= 120
##$ZL4= 120
##$ABSF1= 10
##$ABSF2= 0
##$ABSG= 5
##$ABSL= 3
##$ALPHA= 0
##$AQORDER= 0
##$ASSFAC= 0
##$ASSFACI= 0
##$ASSFACX= 0
##$ASSWID= 0
##$AUNMP= <proc_1d>
##$AZFE= 0.1
##$AZFW= 0.1
##$BCFW= 1
##$BC_mod= 2
##$BYTORDP= 1
##$COROFFS= 0
##$CY= 11.3945322036743
##$DATMOD= 1
##$DC= 2
##$DFILT= <>
##$DTYPP= 0
##$F1P= 2.36226072786647
##$F2P= -0.459571619588291
##$FCOR= 0.5
##$FTSIZE= 0
##$FT_mod= 4
##$GAMMA= 1
##$GB= 0.15
##$INTBC= 1
##$INTSCL= 1
##$ISEN= 128
##$LB= 0.24
##$LEV0= 0
##$LPBIN= 0
##$MAXI= 10000
##$MC2= 0
##$MEAN= 0
##$ME_mod= 0
##$MI= 1.114404
##$NCOEF= 0
##$NC_proc= 0
##$NLEV= 6
##$NOISF1= 3.799351
##$NOISF2= 2.8
##$NSP= 1
##$NTH_PI= 0
##$NZP= 0
##$OFFSET= 15.70392
##$PC= 1
##$PHC0= -19111.76
##$PHC1= 10.00078
##$PH_mod= 1
##$PKNL= yes
##$PPARMOD= 0
##$PSCAL= 0
##$PSIGN= 0
##$REVERSE= no
##$SF= 200.130013532006
##$SI= 16384
##$SIGF1= 3
##$SIGF2= 2
##$SINO= 400
##$SIOLD= 16384
##$SREGLST= <1H.CDCl3>
##$SSB= 0
##$STSI= 0
##$STSR= 0
##$SW_p= 3612.71676300578
##$SYMM= 0
##$S_DEV= 0
##$TDeff= 0
##$TDoff= 0
##$TI= <>
##$TILT= no
##$TM1= 0
##$TM2= 0
##$TOPLEV= 0
##$USERP1= <user>
##$USERP2= <user>
##$USERP3= <user>
##$USERP4= <user>
##$USERP5= <user>
##$WDW= 1
##$XDIM= 8192
##$YMAX_p= 0
##$YMIN_p= 0
$$ End of Bruker specific parameters
$$ ---------------------------------
##NTUPLES= NMR FID
##VAR_NAME=  TIME,          FID/REAL,        FID/IMAG
##SYMBOL=    X,             R,               I
##VAR_TYPE=  INDEPENDENT,   DEPENDENT,       DEPENDENT
##VAR_FORM=  AFFN,          ASDF,            ASDF
##VAR_DIM=   8192,          8192,            8192
##UNITS=     SECONDS,       ARBITRARY UNITS, ARBITRARY UNITS
##FACTOR=    0.0002768,     1,               1
##FIRST=     0,             0,               0
##LAST=      2.2672688,     0,               0
##MIN=       0,             -204106,         0
##MAX=       2.2672688,     193596,          0
$$ Real data points
##PAGE= N=1
##DATA TABLE= (X++(R..R)), XYDATA
$$ [...]
1859c33J22n23m32Q57J92j130N59J047m32m00j07Q76K41j017P88J028j080l39
1877h3K74J358q97j400J471M55k221M17J173q25o90l85J719n28j412J099Q04r76
1895f47l22M36J263j99j506J853L10j576L86J359m9j280l22J868n64j777J272
1912E05K71q22p04K27J161r09j470J799K10j545K8J181O78j233n32K440p71j773
1930a259J493J387j211q20J096J026j499p91J624k8j572J94O30N82j522o54J702
1947C78l53j789Q41J473o83j291O98J801j289q77J792K77j288j71Q16R99j862
1964e28m95K076l79j513L98Q30J44k083O63K041j706j244K021N11j246l52J329
1981D67P75j723o7K048l78j493M09J138l69j506L20J751j356j306J302N77j157
$$ y = [-333, -211, -734, -1166, -309, -117, -1247, -688, 359, -73, -473, -580, 296, 537, -480, 308, 1336, 256, -83, 191, 1549, 652, -748, 723, 1178, -1043, -626, 547, -278, -968, -1353, 366, -162, -1574, -475, 329, -647, -969, -533, 730, 531, -975, 878, 1188, -388, -2, 1357, 1308, 28, -294, 1574, 1010, -767, 505, 776, -46, -750, -523, 638, -271, -1741, 58, 268, -1277, -1249, -68, 610, -623, -1155, 1285, 514, -1259, 234, 1621, 410, -410, 686, 1712, 213, -578, 1046, 1018, -554, -360, 270, 852, -670, -1324, 378, 25, -1764, -923, 550, -133, -1424, -726, 1075, -214, -1091, 701, 978, -310, -481, 335, 1334, -528, -1023, 1053, 674, -839, -441, 389, 533, -1550, -887, 1154, -552, -1796, 225, 736, -510, -862, 467, 1242, -481, -548, 1500, 1122, -371, 38, 1176, 807, -699, -379, 1372, 16, -1290, 12, 589, -568]
1998e68j022J502J022k354r4K214l63j410O64J265R8j614M54J880j358r29J001
2015C88Q69p07j417J239R00k011l06J732l16j229j15J641m57j984J125J480r66
2032a34j056J297L63l16j126J401R66j539o20J535n1o94l59J083N7j729M83J617
2050A178j428l06N69K14m41r59J265Q26j698Q1J390k27q98k39J387J70j625P62
2068B1J118o98o71L23Q60n65j020J257P7j283j34Q97j39o78l69J106J88j284M76
2087e18J010n12m21L9Q10l5j438J525K79r38J28O66K86q73m97Q96J21j038M98
2106a2K43p5n80j06R88j97j342P67N55p55m8M10O00n99m77J083P3j159L63L47
2126G9O4k95MR09n60p61O97L5k66k3j41J089p43m36O55K33q00L17K94Q8l32k55
$$ y = [-568, -1590, -88, 934, -1420, -1514, 700, 337, -1073, -409, 856, 954, -660, -206, 1674, 316, -613, 388, 1257, 550, -867, 372, 1272, -739, -1045, 687, 371, -858, -973, 668, 211, -1773, -648, 832, -134, -1190, 107, 470, 154, -972, 429, 1395, -144, -764, 771, 720, 26, -333, 750, 807, -922, -439, 1178, -250, -556, 13, 227, -214, -1173, 92, 918, -780, -699, 691, 464, -434, -673, 714, 884, -741, 21, 1139, 441, -230, 93, 953, 388, -632, 625, 702, -581, -715, 182, 43, -635, -1004, 102, 290, -994, -518, 492, -20, -441, -402, 408, 373, -1065, 460, 739, -199, -71, 595, 881, 8, -489, 407, 528, -510, -12, 231, 156, -424, -530, 458, 261, -1081, -314, 241, -514, -562, -152, 448, -151, -628, 455, 528, -631, -268, 79, 143, -152, -148, 761, 201, -560, 137, 172, -94, -117, -258, 831, 88, -348, 307, 540, -260, 57, 351, 439, 107, -148]
2148a48O04l46m74L68N9l90M2k36R44o11l03L72n3j68K26Q5K91j74k36M95j44
2169B03j31L21j38K54l78l39Q24o05j50N68m40M4N0n85N60l32m44L15j1J77m2
2190b79k04O49j41l86N56K76m46J80n5L87k45l36O28o26q8M17l72L24l23m32M07
2211a09l13m9K03q9K03l55J31Q42n69j0N78m20J93Q8l55N39l84k81R27l44k86
2232A40J12j45K38l58l05Q26o25m39P24j78k90j48J26N96o15k72P65l09Q0K47
2252A70pL62o75J13P43j29n68L64l25L52n10K16N30o82n40P51j29l15k66L57J82
2273fm43L1O26m12j44K89L36K44r03J79R79q41q4M67q0k25o06Q87J42r42Q0Q52
2295D26m53n10L27M27l5o47K49P78p10k39L31O97l22p21N22Q36j316L52O90m02
$$ y = [-148, 456, 110, -364, 4, 63, -327, -285, -521, 423, -188, -491, -119, -172, -340, -114, -29, 262, 88, -148, 347, 203, 72, 393, 255, 509, 131, -208, 616, 11, -139, 429, -11, 33, 83, -502, 58, -274, -718, -403, -414, -237, -279, -483, 166, 25, -361, 195, 471, 25, 205, 150, 537, 292, -44, 584, -42, -130, 287, -85, 239, -84, -516, -109, -422, -471, -268, -357, -154, -509, -378, 464, -105, -115, 463, 43, 236, 324, -31, 508, 124, -157, 770, 426, 140, 252, 107, 345, -13, -318, 508, -117, -556, 168, -10, -300, -448, -322, 274, -341, -613, 152, -157, -77, 170, 163, 525, -150, -37, 706, 577, 9, 373, 48, 400, -110, 106, 636, -46, -586, 165, 36, -279, -545, -188, -6, -449, -418, 208, -204, -348, -59, 277, 521, -382, -203, 776, -65, -149, 318, 238, 13, -593, 294, 436, -506, -426, 426, -27, -537, -210, 217, 182, -465, -216, 562, -148, -387, -56, 641, 319, -402, 120, 956, -360, -8, 682, 280]
2315B80l50l01K86J61o06M9P05l65n14K17N35l6o52Q52N45q97k60P16P5k72k40
2336g2P36j20q61M32R78j018j24K25L12k49p39M25M97q92p2M08L83l21p82J148
2356B94m0q65N02R50q13j84K65O70m99o26Q23J07p82P6K79L23o27p21J144q9j082
2377h95K70J064n86m31J40R59p06p43R57N80p78J79K88O0l91j04Q06M8p82J34
2397F9N08q3q69k31J493p57j195R33L70q60k35O93L84n88k32Q79R5q50M69K06
2417A99N1l03M3N05j55p30Q48L73n66l91L34L64o26l00Q52m34r71O03J05K21m30
2438d08K1Q82l13o71M84L93k76m10O2Q47p08j71O83k96j63j85N20l9p88J73R81
2459F18o83l54O52k13l4m86P4R98o26m14N37L65k42m14L96L47o92RO98l86o40
$$ y = [280, -70, -371, -85, 76, -530, -481, 224, -141, -655, -438, 97, 61, -591, 261, 806, -91, -351, 365, 440, 168, -72, 664, 544, -317, 115, 1093, 75, -49, 176, 488, 239, -500, -75, 422, -470, -542, -134, 249, -72, -854, 294, 254, -611, -109, 841, 28, -156, 109, 779, 280, -346, 477, 584, -198, -122, 157, 480, -147, -868, 276, 187, -895, -625, 439, -147, -578, -438, 521, -185, -928, 29, 609, -169, 10, 298, 358, -33, -137, 669, 717, -65, 69, 577, 494, -375, -606, 887, 130, -1065, -132, 238, -622, -857, -164, 220, -368, -600, 279, 374, -476, -7, 199, 250, -53, -10, 495, 340, -390, 458, 831, 265, -126, 208, 572, -54, -354, 498, 64, -907, -304, -199, 22, -408, -387, 495, 182, -489, -5, 388, 112, -298, -236, 611, -97, -268, 415, 119, -44, -229, 291, 252, -536, -363, 618, -65, -419, 233, 20, -14, -500, -426, 572, -54, -468, 69, 434, 192, -222, 174, 521, -171, -162, 536, 150, -490]
2480d90O12J26l25k0m4O94r00J22J47j39L30o29O45J23n06L60L36l86M8n2K28
2501B80K18q25L45L24o94K80J05l39M10n58N50J22l27k03N03j72k34J83K30J49
2521C47o06L71L03o53K12L09k08j5j3OK91o32L10J28l70K39j47j07K96l87p3L52
2543d7m5k82J22K35J85k96J43K96m73K42K34k39K72k24L17r3n08L37j68J9j28
2564a01j47L00O7o82N61rm68L03j2K08M9k97K94Q5j27k56M16p6O41p84J17O72
2586G54n04k94L42j91l9j35J50M9l91K64K9n09K75j29L89p3l74L50K24k79K19
2607A27j07n0L19m18K44J50l07J05L36n01m2L2K58j19j89P0R5j64J77l26L66q0
2629b4l57K60K78j19J48J33k31J47m04L20J95l29Pl9Kj41p0K08J72m81j8L53K35
$$ y = [-490, 122, 248, -77, -97, -141, 553, -347, -225, -78, -217, 113, -516, 129, 252, -254, 106, 442, 56, 104, 52, 280, 498, -327, 18, 342, -352, -72, 33, -306, 104, -454, 96, 218, -109, -312, 191, 19, -215, -32, 198, 347, -259, 112, 415, -238, -26, 283, 75, 60, 47, 53, 344, -288, 22, 150, -220, 19, -128, -235, 61, -326, -399, -47, -92, -374, -252, -17, 168, -128, 15, 311, -162, 80, 314, 75, 347, 123, 440, 347, -161, 176, 8, 27, -101, -248, 52, 119, -563, -2, -11, -479, -176, -188, 20, 69, -228, 66, 151, 24, -232, 184, 108, 749, -35, 82, 754, 250, -44, 298, 107, 68, -67, 83, 132, -259, 5, 34, -475, -200, -329, 60, -13, -387, -37, 187, -92, 127, 20, -30, 289, -129, 115, 265, -42, 63, 399, -102, -144, -112, 146, 27, -162, -92, 3, -161, 16, -310, 56, -24, -381, -121, 157, 38, 186, 319, 88, 235, -169, 151, 346, 17, 24, -15, -13, -154, -224, -16, 156, -325, -343, 10, 245]
2652B45n77j26O35r1k69K69Q8j59k54L02N4j39j42J58J07k54K0J52k39K15l11
2673c16M60k65k79M62J26m70n8K65J84j88j97O36l8m36K79P4j23l8q2L43j54m04
2695b19J74L05m34j19J78K52m82j46Q38l19k41n6K48J71l80j93N07L5j40K56Q1
2716C16l30j70N90o5j06m43O49l62l97N23J1l36j77m1N36l36k61L70P4l45j2K82
2738c0N15p07l75R23k40j35kN14l32m7k07P26m88k40K08j6J06k81P1K46m03m86
2760f80O62j75o9k12M47J97o36J45N34l43oL40M6j40m54O78k2n7l03J34K58k71
2782G3l62L21L22p20M53j09K2l14L16J7k52j37L54K25m77L04Q4J15k41l74N87
2803B07L89o59j43M02l87K93m7K2O5k53J28Q3k73j51J85K37o3Q7k89J85K05k63
$$ y = [245, -332, -458, 177, 86, -183, 86, 174, 15, -239, 63, 117, -22, -164, -6, 101, -153, -133, 19, -220, -5, -316, 144, -121, -400, 62, 188, -282, -340, -75, 109, -79, -276, 360, 322, -114, 165, 239, 116, 78, -4, 339, 185, -219, -45, 260, -174, -293, -115, 137, -345, -491, 347, 28, -213, -269, -21, 150, -230, -423, 84, 119, -21, 235, 316, -14, -184, 406, 341, 235, -208, 441, 79, -318, 205, 216, -120, -297, -338, 198, -138, -399, -29, 45, -300, -312, -30, 485, -222, -597, 326, 86, -49, -51, 463, 131, 84, -123, 603, 115, -125, 83, 67, 173, -108, -37, 209, -194, -680, -18, -193, -262, -474, -27, 170, -466, -321, 213, -130, -136, 204, 250, 110, -344, 334, 312, 255, -48, 86, 344, 73, -289, 32, 354, -366, 87, -22, 0, -314, 2, 19, -233, -370, -16, 209, -268, 36, 120, 235, -6, -380, 207, 596, -63, -206, 196, -191, 102, 55, 77, 142, -111, 17, 100, -173, -324, -139, 98, 35, 122, -167, 18, 223, -40]
2825d0R2J8k76JL64Qn53M46J97m36K28k06M30l31m6J29L41l91j28K30q4l6m03
2848d46O10j53j27j35L75m1j66q6K81on08O20pj14k87R9J2n5J32N7j8m46K56J38
2872a5j62L4J41j59L59n53M99M4j99j25L81M8j45k07K02Jn09M63j49j44K82l2
2894E5j20J04j34P7oj12mj67N74l9m3J63k51N8j1M5P8m5j02K74j57j35J9kq7K2
2920E4N0j4l5k20J13M9l83L16P6K75n76K87J92l17K24J3l69K02L57n02K36L0J91
2943B49J12m22K49k51J57J87l35j33P0j8O3l9L1L1j7o0K08j33q0K45j13J77q6
2966I2m57O00k42k68L44pj84K69j49J46k84M1M39l41l40L06j69L27p2l74K38p6
2988a61j73J06L85m01J32PM44k59j86l0n0k4K66l7J44j95p3P1K6r9J66r8L51j19
$$ y = [-40, 52, 70, -206, -205, 159, 167, -386, 60, 257, -179, 49, -157, 273, -58, -104, 25, 366, -25, -153, 77, -7, -43, -446, 164, 11, -116, -251, 124, 83, -83, -169, 112, 106, -402, 218, 211, 97, -190, -91, -79, -134, -2, 55, 37, -409, -153, -15, -177, -143, -2, -161, 198, -355, 144, 188, -11, -136, 245, 293, 148, -59, 143, 144, -365, 98, -51, -195, 87, 55, -65, 39, -95, -18, -24, -136, -140, -307, 267, 228, 185, 348, 97, 155, 144, 189, 267, 222, 120, 394, 237, 102, 121, 119, 32, 54, 104, 90, 55, -165, -52, -3, -386, -70, 6, 281, -295, -8, 184, -133, 91, 104, -265, -63, 294, -208, 28, 58, 249, 361, -61, 188, -63, 94, 281, -54, -187, -117, -135, -72, -111, -80, -49, -66, -126, 82, -51, -131, 114, 1, 178, 92, -365, 235, -7, -275, 69, 62, -122, 147, -2, 144, -140, -99, 340, -1, -341, -35, -204, 123, 51, -323, -85, -161, -334, -228, 157, -244, -112, -105, 339, 80, -106, -136, -186, -210, 56, 19, 163, -32, -105, -34, -8, -107, 59, -39, 312, 193]
3012A93k50K75j17j43n4L37k01l91L25L6j20N7K73j51Rr1j99O69o81K41K95l85
3034g3r7K2M38k53m0j89K86k76P3K27j73R4k73K22J55k00K2L0O0l5k5j5L13n78
3058b85N8K34Rk28K24j72K58j42K04J04k47k60M95l53J14j34N2J10J24m53M20
3079A32J57m07K43k17k32J64J46m1j94k11L10J88k77m1J35K92l56K55J7j47jJ6
3101f9K58j72J1Q9K04l97l2J13K91j55k53J43K4l28K10j3j67J04k7K54J11n16
3123c17L87k00J17L6JJ22j15Qr5N51o18J67L8L0R2m85K36K24j90k9J32k20m3k93
3147d64M83k90J62J61p6K9LJ9J19J09k97L43j68p2j91J72j58J00J88J0r9l75J16
3170a76K24j93r4K79J58r2j0K39j48n15K33N0j76J77L9r6K36k4ol8j96J18K4K95
$$ y = [193, -57, 218, 101, -42, -96, 241, 40, -351, -26, 10, -110, -53, 220, 69, 78, -13, -212, 457, -224, 17, 312, -73, -170, -148, 290, 37, -3, -192, 94, -182, -109, 118, -55, 39, -234, -12, 143, -57, -35, -5, 55, 20, -5, -20, 293, -285, -227, 7, 16, -212, 12, -160, 98, -44, 160, 264, 17, -243, 252, -101, 13, -121, -69, 41, 165, -288, 132, 289, -118, 125, -92, -324, -160, -14, -55, -249, -460, -150, 38, -239, -280, -145, 147, -209, 46, 63, -84, -85, -69, 189, 17, 28, 117, 321, -76, -108, 5, 296, 141, -112, 31, 55, -273, -63, -76, -243, -139, -166, 88, 199, -317, 70, -130, -13, 23, 24, 146, 31, 39, -56, 495, -123, 44, 82, 112, 204, -281, -45, 179, -11, -40, 92, -128, -171, -464, 19, -271, -109, 52, -24, 5, 8, 27, 146, 255, -42, 301, 133, 61, -130, 42, -116, -16, 172, 182, 83, -292, -176, 48, -145, -239, 40, 198, 106, 96, 335, 187, -328, -95, -45, -221, -44, -5, -101, 135, 111, 105, 67, -129, -11, 13, 308]
3194C08o31K25P2J30m11J84J11%r2r4K87j75OK71mk13J21j56K84j87o5J13j87
3217a03K64k58M00j56m13q9O03l84l3j9rK09j23L6M74m67J10L19k16j48O7pK9
3240H6K60l38L44m14j13M39j58k13o7J90L8o56M01K51k83N9L4J24Q4l23J07M7
3262a01j31K82Q7%M4l17J15L32m99K23R5kp9l21J71K12k66J8R1n4r9k38L35K71
3286A69r3L0oj88J32J33j44Prj28L65k71J44q3l5m5L7k59M06n49M22m2k77L67
3310H3j25N6n4O4r4J43l29M46j29o4K92k86K20j92o1K77q3R8K27k96j0j7o7j30
3334c1q5J0J04K1k5r3J1qk5J89KK25m14J58o8k8L21m59J7L62j89J87j04K20k48
3359E0J1L81l95o0J08j94J70r6j21J51J78q7k04p6K15l9K1O8k52j36K96J3R0j43
$$ y = [308, -323, -98, -26, 104, -307, -123, -12, -12, -104, -198, 89, -86, -80, 191, 187, -26, 95, -61, 223, 36, -29, 84, -103, 161, -97, 303, 147, -266, -355, 248, -136, -169, -188, -197, 12, -111, -75, 399, -68, 42, 361, 145, -3, 64, 57, 86, 346, 8, 352, -62, -175, 264, 106, -107, -174, 16, 54, -602, -201, 50, -233, -174, -140, -16, 68, -255, -148, -101, -232, 50, 137, 137, 181, -136, -21, 311, -188, 35, 130, 128, 49, -272, -101, 111, -155, -137, -46, -100, -199, -437, -102, 169, 76, 106, 100, -88, 44, 177, 33, 40, 31, -97, 268, -3, 141, 58, 23, -22, 15, -244, 162, -387, 35, -7, -284, 83, -42, 14, -40, 24, -70, 73, -256, 190, 61, -3, 289, 3, 223, 31, -30, 247, 164, 262, 489, 193, 183, 166, 99, -31, -116, -106, -2, 19, -6, -99, -88, -96, -121, 68, 70, 295, -119, 39, -29, -57, 264, -195, -178, 184, -5, 182, 78, 298, 50, 61, 442, 47, -13, 95, -99, 71, -25, -146, 5, 183, 96, -108, -184, 31, -8, 13, 81, -171, -307, -11, 2, 92, -51]
3383e1j43J74J94l01Q7j10n6M85m00J71j2j29K3J35j31K10j64oK21l57J59LJ41
3406A43N5R1l48L41j67j03K8k02J41M3r6K06j1l5P2O6R1n02J20M32m59j42M46
3429B10k44J4N5k07L07q5l27j3J03K84j2k64J40Q0k82K13k04K45j71R0L72l40
3451c6lJ07K4j96J66q3J83k20K10j35j10R5J10kk68L43j38j71O8Q7J00j85j42
3474a96J26k61M86k93r3L97o6k17J18J18j53j28kK92j24m1K14Lk8j28rp5L2N3
3498B5K07k97j06J88o5L30j80j64M5kJ0p4J25n5J1j81L30k29l0O8pp6k33L77j01
3523h4O0J1J83l01L07k34M9L95m39p7J72q4j03K80k66J58N0J5J58k86J27J23j73
3546D1j29j3K55l5n2k46J42J04q7K40k62R6j05R5K47m39l8K88q7j65j44J92K62
$$ y = [-51, -194, -20, 174, -127, -40, -150, -206, 279, -121, 50, 38, -91, -68, 67, -64, 146, -18, -24, 197, -160, -1, 2, 143, 198, 289, -59, 282, 115, 12, 40, -162, -21, 22, -74, 132, 121, 86, 158, 224, 315, -187, -67, 365, -94, -236, 210, -34, -20, 35, -172, 135, 50, -277, -290, -187, 97, 85, -179, -39, 41, -241, -28, -232, 13, -158, -68, 304, -36, -39, 68, 92, -104, 62, -21, 162, -58, 152, 17, -93, 2, 112, 110, -158, 185, 47, -124, -56, 31, 131, -54, -196, -70, -331, 155, -138, -231, 166, 100, -117, 1, 119, -34, -162, -164, 128, 4, -37, 177, 180, 152, 24, 15, -60, -28, 25, 232, -65, -171, 17, -48, 282, 102, -62, -17, -19, -9, -83, 42, -13, -2, -183, 147, -82, -112, -44, -51, -127, -360, 17, -84, -24, -13, 170, -131, 176, -58, -9, 386, -53, -130, 42, -42, -145, 135, -131, 27, 77, 92, 250, -36, 91, 214, 41, -88, -101, 154, 119, 67, -179, -37, 67, -20, 220, -42, 54, -51, 44, 291, -148, -186, 102, 15, -150, -294, -102, 160]
3569A60k49p6K62l26J99J01l17K75j80Q2L45n07j34L93j51P1o6L07j92r0J9m6
3591a20p1K39j01J43k7j57R6n5J28j0l39J64J85k11L6Q3k19K53K52l07P3J12j14
3614C3q6J63j77R0J09p4k8k93N14j87l13K00P6n6q8P4n9m4J31q1m2L13j43o6K81
3639B47k32J05j95r9J71R2j99J27L59K2k56k96J01K92k06j65K99j84J33k42K30
3660A04p4j0J67j10m61L87j46J32M62o96M27m43L55j75J4n1M3L5l0q5K92j80m7
3683i0K37P0j84J62k07r7M0R0j93K17o9P5R9k31J73k13O8p0J71J41k99j34K81
3706C7j37q9O7J23L13n01K66J9L1k44K47k26LO3J64k29L67m37K40j54R1J59j14
3729E9O7k53J02K62l67l8M00k39Pm0J8P7J12j05Q0j82l8L61k91J2J0J07J02j65
$$ y = [160, -89, -165, 97, -229, -30, 71, -246, 29, -151, -69, 276, -231, -365, 28, -123, -52, -118, 189, -3, -93, -74, -120, -191, 48, -53, 90, 63, -94, 2, -53, 75, 65, -274, -110, 75, -136, -100, -17, -236, 17, 269, -38, 35, 147, 33, -53, 110, -67, 23, 132, 58, 30, -263, 251, 64, -249, -49, 27, -29, -117, -43, -102, -146, -15, -96, -138, 175, 32, -34, 247, 15, 120, -75, -174, -3, 89, -110, 17, 376, 398, 142, -154, -53, 239, 33, -132, 167, -17, 116, -126, 104, 30, 20, 187, 77, -384, 3, -143, -11, 451, -245, 182, -261, 94, -81, -67, -118, -75, -40, -70, -155, 137, -43, -90, 147, 217, 33, 195, -12, -109, -69, 21, -172, 45, -24, 51, 150, -81, 92, -121, -53, -123, 48, 189, -110, -244, 37, -100, -189, -122, 1, 314, -187, 79, 98, 129, -115, 132, -94, -91, -28, 136, -93, 274, -163, 77, -77, 14, 173, 59, 126, -127, -25, 237, -130, -168, 232, -7, 0, -40, -22, 55, 167, 62, 142, -40, -78, 283, -8, 4, 14, 121, 223, 58]
3753E8j55L0Q0J45J23j73Q4k46J84j63J51j9k66K20M8q0N5kn6m62M63N8pL0k89
3778a89L56j19M1J39l83L7m6L72M3l83J76J38l30J39r2p9j43J47J70J69k59j78
3800b74L08m97M96L8j17J28j03m9K16J34p3k83K14o5j97j56L36k53P6L46l05j72
3822b52L00J05N3j47m3k02L81j75k54L52j90j67K18j3L02l73J24k8K28k7K4k26
3844a0r8R0M7K0J72k66j50K28k32L51j49K42r6l13L05j07l18J85o1K11k22k9L01
3867A01O3k59K11k03L3J09j32j5M2J07j16K26m92P6L20j70K35l31Q9j5K77K26
3889C82j03l59J20J54k37J01J64m82L30j95R5R4k26J15j49K73j52J13j08J43J7
3910I0J7K17l71j8J64k01M09l80J42j1j69J19p5l6K18k84J25P5mp0J99q6J01k65
$$ y = [58, -97, -67, 13, 158, 281, 108, 192, -54, 130, -33, 118, 99, -167, 53, 101, 21, 76, 74, 18, -444, 19, 77, 70, 100, -189, 167, 48, 89, 228, -155, -118, -164, 208, 251, -132, 44, 182, -148, -9, -101, -180, -323, -176, -6, 163, -96, -274, 34, -463, 33, 71, -46, 82, -21, -70, 146, 280, 207, -76, 138, 73, -124, -280, 56, -197, -121, 225, -80, -252, 48, 153, 206, 59, 16, -186, 195, 20, -234, 118, -72, -239, -21, -34, 268, -105, 19, -9, 219, 192, 216, -10, -108, -18, 29, 49, 221, -45, -195, 33, -199, 152, 3, 245, 149, -164, 141, 34, -284, -99, -160, 51, -171, -200, 101, 164, -95, 116, -87, -54, 55, -77, -92, -50, 57, -59, 167, -325, -249, 71, -99, 136, -195, -106, -121, 156, 382, 279, -80, 40, 194, -43, 58, 222, -260, 70, -125, -30, 64, -162, -47, -196, 77, -75, 38, -70, 73, 90, 107, 324, -47, -65, 99, -102, 307, -73, 69, 58, -111, 8, -67, -103, 115, -169, -44, 31, 27, -43, 156, 70, 171, -94]
3934i4j20K7J18j31K15K64k13J51j04l18J78J96J16j71J4m04L84j11r7K88m07
3955b19J09J09q6K55o4m17L34M1k4j32q6M48n63L15o1l4K04Qq1J64k00j05K50
3978A65j70k9J65j22M0Pk41J94j95J3J63j2q3j68K06p9L9N7K52l11j20N50n38
4001b17J97K07k86L75k63J22M5k18l2J40Q7j22j88%K54O8k22J00j40J25O1m7q1
4024c5k15J10O6M4J32l22J01L10k41N8q5n3K01pp4J28k1j94R2P7n0K49l58O3o4
4049h8j8j25Q8N7p5K27k02R4j2J6J4k3J45j44J30p4k54M18o1m70M50k25R5K52
4073B15k35j72R1QJ64rJ68k46q1J31j11J92M3J0k81K34k92J74r3J71k77L30L7
4096A71k11m4J21P5k4mp9NP8k92K62J44m21K47Q9j46J45k6j54J38k0l9m1k0J82
$$ y = [-94, -214, -187, -69, -200, 15, 279, 66, 217, 113, -205, -27, 169, 285, 114, 128, -276, 108, -3, -100, 188, -219, -110, -1, -87, 168, 104, -313, 21, 62, 38, -94, -180, 268, -295, 20, -41, -75, 129, 137, 56, 220, 20, -85, 165, -5, -34, 131, 9, 49, 56, -185, 9, -186, -173, -10, -22, -105, -273, -67, -146, -107, -50, 202, -109, -229, 321, -217, -20, 187, -99, 276, 13, 135, 180, -38, -70, 70, 157, 35, -153, -153, 101, 169, -53, 47, -93, 32, 93, 46, -35, -250, -140, -74, -30, 102, -220, -119, 191, -50, 8, -77, -130, 71, 64, -10, 118, 97, -97, -5, 72, 22, 271, -87, -24, -88, -106, -231, -143, -86, -161, 66, -136, -42, -54, -38, -24, -47, 98, -46, 84, 10, -244, 174, 113, -357, 93, -132, -37, 215, -20, -192, -101, -93, 71, 62, 230, -16, -97, 34, -77, 115, 158, 168, -113, 121, -171, 3, -90, 81, -196, 134, 171, -40, -84, 37, 112, 88, 84, 5, 10, 88, -204, 58, 202, -219, 28, 117, -29, 116, 90, -64, 74, 54, 15, -26, -46, 136]
4121A36n7Q7j82j63L31p5O6r7j69J24P8k96N02l47R8J15k93KO5Q8j5O8l26N27
4145B67j97K64k57j52N1O3r0K27r0j04p2K32K9l66J9L39k53l1Q3J70j70L06m63
4168a95l9K70j28J10j88J20L1r5K96k0J3Nl00K39k39J36k8J13n34O72k45l63R8
4191b71M14j63j43J86L1k68J82M51n53J56J12j65n1J32L2J01j03r0J21l30N18
4212B99n04K10n4j46J67J88j84j87M23j71o2j69L05Q9k90L24j53l22L68l14J55
4233b8M40k02k6m40M43k53J30k4j08j4Q9J11qj11L0j88Q9j9J4K41j10k14P5K34
4257A51k41n8J72M8k84L01k04K55J28K8j79L8r0j10PJ90k18R2j62L9K2j53M22
4280A94j95j03K14m55J87J01J20K5r1k73K23J18R0n1n1j61K35q3L6N0k78Q5J49
$$ y = [136, 79, 166, -16, -179, 152, 77, 143, 46, -123, 1, 79, -217, 285, -62, 36, 151, -142, -140, -75, 13, -2, 66, -260, 267, 70, 334, 77, -75, -24, 39, -51, 176, 86, -18, -90, 142, 171, -195, -176, 163, -90, -121, -38, 132, -38, 268, -195, -234, 36, -92, 18, -170, -50, -19, -114, 182, 162, 175, 180, -120, 119, -120, 16, -12, 101, -433, 239, -6, -369, -271, 143, -20, -163, 23, 54, -214, -32, 419, -134, 22, 134, -31, -82, 50, 82, 183, 80, -10, 111, -219, 299, -205, 5, -49, -195, -28, 160, -24, -211, 212, 41, -21, -190, 115, 204, -86, 238, 85, -237, 131, -183, -28, 412, 210, 184, -256, 187, -66, 64, 40, -68, -82, 7, 118, 110, -1, 29, -159, -70, -89, -75, 166, 56, -158, -83, 151, -90, -148, 24, 72, -212, 89, -115, 140, 268, 296, 117, 155, 65, -45, -38, 152, -66, 26, -136, -97, -75, -228, 194, -1, -104, 110, -345, -158, -57, 63, 88, -3, -276, -53, 65, 155, 104, 53, -108, 127, 44, 80, 130, -148, -63, 86]
4303H6k6J19m2j51m2o0L43l68nK72k12L4k04K36Q6RJ91l52o3J93k88M23jj1l77
4328b10L32l9j22ML1J89k8j45m9l63M74J81n18J41j1j07L60Q3j73Q9j24K19l5
4351A79j90K02l82P1K03j36N1M4j17J17j52J93N4l21K32L48o83L43m9j5r6o0q5
4374b49L41k18J31j00J45k0M8j65J02M5o6j08N5K74l16K01p8j32K10q7L7j47K
4397i5L43lm69r5M06K5k20jJ56j50M1R1j89N4j31M86l53OR1L1J0o3j16J13q6J11
4423gJ03l35K41k27M36j25j50j38j1M86k25j81J63j92J74M1q9J57nj45L70l09
4445C2K3P7k73K54P6m05Q6K15k00K81j28l7P7o4K23j51j54J02k40K71n6j68J39
4468b0j13j03K85p0N7M1L1j89J39o6N8J70l76K43q5l0P5P6j43P4k02K95J2j34
$$ y = [86, 60, 179, 137, -14, -56, -116, 227, -141, -146, 126, -86, -52, -256, -20, 66, 75, 266, -86, -149, 44, -244, 179, 178, 167, -210, 122, 83, -39, -35, -4, 185, 157, 12, -37, -400, 74, 255, -263, -122, -133, -240, 120, 203, 30, 119, -5, 214, 179, -11, 191, -191, -120, 83, -53, -2, 42, -75, 42, -110, 83, 137, -184, 48, 396, -287, 56, 7, -8, -104, -164, -249, 92, -126, 5, -95, 50, 30, 78, -87, 15, 60, -6, -114, -59, 215, -101, 100, 22, -110, 100, 13, 50, -97, -95, 248, 245, -224, -319, 87, 112, -108, -109, 47, -103, -62, 29, -160, -106, -237, 249, -104, -98, -7, 24, 34, -29, -145, -32, -118, -7, 96, -239, 2, -225, 211, 86, -64, -202, -213, 273, 48, -133, 30, -162, 12, 53, -36, 121, 116, -29, 341, 32, 55, 132, -141, 113, 189, -216, -130, 85, -115, 166, 38, 1, 78, 14, 237, 86, -68, 34, -206, 65, 9, -159, -20, -133, -236, 49, -21, 36, 77, 108, -81, 58, -8, 50, 220, -156, 87, 2, -28, 47, 123, -20, 54, -148, 147, 159, 25]
4492B5j90R0R3m5P2lk9M1n4N6r1N4j96j2J27j23J5L43j63K48k29N8k9rL4k23J21
4519a9K8k00K16j82J0J85j22K75k0m10L03j77J41Oo6k6O7o8n1j0M0l5Q2J37j34
4544c0p4J8j2J53j45O7L13j87l07J14L75j20k31K62k57j22j46J94K42m38J57N5
4566a19J36P9j25k13J64Q8O9J62k16j95K91q7J39k40j3J37J8O1J4j68J27m7M2
4589A04q6o5J25p8m7N0Pj63K86j83L45l86J63k76j2L26r9o5J0J80Rj46rJ8J77
4614A85j81m1k2k83N11j29l1J03k16K16%o1j68L80l84N2j9m4L95l58J1J05N8j65
4638h6R0N3m5l3J79k39o4M18l11kn1O5l1m1qK52k39M36l33J90l3P1j41j93J88
4663I2j56R6k09K97o7j37K85j14j58Q6R3j26K2J35k76O6J35l8k56K64K81l53m6
$$ y = [25, -165, -75, 18, -27, 45, 42, 13, 54, 0, 56, -35, 19, -177, -189, -62, -185, -170, 173, 10, 258, 29, 87, 58, 49, 83, -140, -19, 9, -191, 25, -157, -147, 38, -84, 191, 171, -239, 64, -113, 28, 34, -32, -58, 9, -59, -110, -120, -80, -115, -33, 104, -30, -104, -86, -98, 55, -90, -23, 290, 103, -204, -90, 285, 165, -66, 196, -61, -183, -329, -135, 107, -331, -174, -119, 17, 96, -29, -242, -78, 10, 79, 241, 25, -170, 121, 34, 173, -67, -80, 57, 75, 136, 150, -18, 109, 62, 104, 18, -47, 78, 0, -47, 3, 10, -153, 133, -50, 295, -91, 72, -204, -216, 110, 11, -54, -44, 136, 145, -1, -10, 8, 185, 4, -37, -59, -342, 169, 40, 9, 112, -104, 112, 112, 51, -117, 263, -121, -69, -88, -132, 263, -95, -84, 21, 79, -86, 4, 57, 12, -21, 158, -81, -145, 273, -38, -40, -91, -26, -57, -98, -106, 146, -93, 343, 10, 200, 167, 238, 97, -96, 92, -64, 32, -177, 120, 53, -84, 201, 87, -71, 15, 108, -18, 4, 139, -137, -71, 64, 26, -230, 34, 315, -38, -84]
4686h4K8j64K17R3J40j07j33r9P9k61L16l3J30J46k08k4K4m7K48m65J11K14n8
4709F3l06M79l78P7P2r9K93k12k19M61l26J72J7j17j87K12K3K21l23j1K44j54
4731BL32l10l15oL53q4L3k12J46r0L33q5j68J38J50k85J41k26K60j45j59L84k4
4754A63j91J38L23l39j69K15k04q9N02m05J13k71J27J78j20J5k9o4J08J5p0Rm9
4777i4j2J35J08k03j49K86J03l97m6L10j35J06k86L14Q8m6k68P6k93N86Rl48K21
4800F5j03J26J89n20J28QJ79j69m9K78O6k03j1r6K92j17j67J12K86p1m46J32K
4823h9L6n2j56L8O2r9J80J6J58K5j27k82K37J20M4l01K34l8k5j30J72J04p1j45
4847h9J13j41LQ0J90j39j15j43L45L3o9Kq8nQ1n2k50K90L0j04n6P0M66n11N2K0
$$ y = [-84, -56, -220, -3, 90, 230, 123, -10, -109, -30, -291, 25, -8, 122, 268, 60, 36, 60, 13, 261, -204, -93, 121, 63, -243, 236, -142, -65, 7, -92, 201, -11, -230, 231, -95, 77, 94, -23, -210, 2, 25, 246, -77, -88, 156, 2, 334, 24, -291, -297, 56, -28, 5, -207, -61, -151, 182, 97, -71, 67, 217, -68, 73, -153, 107, -38, -197, 187, 163, -28, 110, 433, 94, -75, 140, -64, -153, 349, -56, 57, -214, -87, 91, -29, -14, -43, -107, 1, 16, -54, -45, -94, -106, 29, 137, -66, -215, 71, 174, -223, -269, 41, -94, 12, -274, 40, 128, 82, -186, -110, -403, 183, 192, -156, 65, -38, 88, 277, -243, -115, -107, 72, -97, -146, 132, 198, -5, -16, -112, 180, 63, -104, 8, 294, 223, -223, -91, -89, -53, -105, -261, -223, -161, -260, -80, -64, 94, 119, -8, -290, -53, 67, 111, -190, 44, 6, -19, -149, 23, 127, 56, -89, 24, -117, -114, -34, 156, 17, -98, -241, 104, 137, 68, 70, -18, -23, 58, 6, -244, 46, 76, -28, -84, -14, 452, -59, -7, 13]
4873A3l3K8j18o9P5J99rM9q0j63L65l37J89q1jl1L8J03kK3k81j98J70R2n7K91
4899A75k31J19Nl0q1K14k61P2j83K69K9m20L45o5K17l26J18j22L20k78j0L16n7
4922A35J68l04r0J93l94N38m1l22K31q7k79L92k53P4K61k09M4k7O4p9J4O2P9k77
4946a07K15k43J62j89M83m83J68J52m65J77j85M56l17J19k18M80r0J53j21k73
4966a26N4r7J69j56K99j99p2K32L5j23MN5p1n3J40n1j39J99k17R5J36R4j48k20
4990a60K18J18m5j41j28m4R4j12L8L79k64J19j33R4j3j87L31j92p0P0n7q3K32
5013F4O2N2l12NK81O3j12k38K15J13j88N9P1o8m5k07L44j24j41J68m1r9J60k06
5037a24P4K38p8o0R6j13o2%J89j10j84j71J09K53J25l64J08J34j66Ro7P1q5J31
$$ y = [13, -20, 8, -110, -179, -104, 95, 86, 135, 55, -108, 257, -80, 109, 28, 27, -4, 34, 137, 135, 158, -123, -321, -151, -59, -116, 175, -56, 63, 68, 38, -43, 171, -90, -18, -201, 68, 97, -323, 22, -43, 174, -152, -34, -156, 164, -114, -124, 192, 135, 303, -1, -91, 102, -292, 246, 205, -117, 114, 27, -252, 140, -113, -39, 222, 13, 57, 30, 94, 15, 29, 91, 170, -107, 108, -135, 27, -162, 321, -162, 6, 158, -307, -130, -315, 141, -176, -57, -275, 205, 115, 268, 147, -126, -72, -169, 0, -156, 143, -56, -128, 104, 139, 16, 20, 75, 4, -49, 91, 40, -99, 100, -117, -22, 114, 208, 60, -160, 58, 176, 131, -10, -138, -182, -88, -200, -162, 217, -47, 72, -61, 33, 20, -167, 164, -28, -98, -28, -85, -168, 64, 126, 178, -134, -129, 152, 215, 103, -135, 80, 193, 5, 64, 135, 67, 22, -185, 159, 35, -106, 62, 21, -78, 82, -124, -50, 188, 110, 50, 146, 33, -29, -29, 160, 50, -134, -305, -196, 57, 182, -182, -74, 60, -106, -97, -164, -93, -178, -47]
5061d7J03k1l2k87K94J50m44K03m3J47o2k7J55j37Q0n0o5P0j84K00n4L16l45J16
5085C6k10n5J12P6J73q0j74l9L4J66M4j23J33o6K8p9j64J31J21j05J72k02K7P1
5109B7J40j60K27l11N0p7Q5p8j5N1l9j6P8L1m5J9j31M27o4r1k8l3j52K64pl11
5135a59K88k28J85m6j51K04r4m0j42J1l1J86n0j60J39J77R1j17q9q3Q4j2q1J36
5159A8m22M18j12P7J40l01J31Q8J9j63K22K1k11Q4j67K04M7k90Q6R8r8l2L09j3
5183A53l65K42l4k02K26J99k88K21j95m6J97J09l40J55n1J34q6r6Q8k9J47J1j23
5206B7J08k18M2MJ5J30j24J78j99r6l1K0N3K74l79J76j54J6K08q2J40j06q9M3
5230d4j9K29L3l28K33J57j20m9J42j68j29J98k15p9PJ31P5P9K7k93K7j21L45k21
$$ y = [-47, 56, 35, 3, -284, 10, 160, -284, -81, -124, 23, -39, -66, 89, -48, 32, -18, -83, -13, -197, 3, -51, 265, -80, 36, -174, -229, -117, -41, 132, 52, -122, -161, -127, 39, 83, -40, 93, 27, 55, -24, -188, -57, 64, -41, 131, -71, -44, 27, 167, 7, 234, -77, -27, -104, -19, -97, -112, -61, -100, -116, -38, -7, -52, -33, -164, 263, 199, 108, 80, 47, -105, 159, 152, -159, 129, -99, 86, 40, -111, 93, -1, -41, -183, -172, -203, -17, -67, -227, -88, 89, 180, 63, -26, -109, -25, -37, -118, 18, -404, 14, -98, -21, 119, -182, -51, 37, 56, -107, 115, 136, -75, 9, -158, 46, 93, -197, -111, -13, -111, -143, 166, 153, -212, 30, -4, -206, 20, 219, -69, 152, -43, -89, 108, 217, -123, 32, -19, 115, 29, -67, 21, -8, 139, 150, 27, 135, -83, -41, -37, -22, 108, -16, 162, -37, -133, -164, -144, -91, 183, -196, -20, -174, -158, 50, -32, 108, 2, -87, -44, -63, 166, 199, -129, 104, 261, 141, 92, 234, 66, -63, 135, -80, -159, -152, -21, 54, 133, 160, -133, -106, -227, 118, -103]
5254a03Q9p8M41k33q0j62j08K82n2r7J03Q8m49M12Q3j82r2O7k30J15k4L40n1j87
5278a08L10k62J94l00K08j81JK15k2kk80J79J36P0q5J12l00J02m7K70m66K15J85
5301A44q9k62m3K0K57R3O9j38N3m92L37K41k62K6k5O9j1j36O1J80j86Q3J11o3
5325C7R2k07K37r6j65K09p2l49K97R8k88L11j35K5K31l14J2N0K50l45j37J42L6
5348h1p5J39P2kp8j00K4K39J15m17j9J82q4M4L33l66j09K52j4j35R5J18m57K41
5372h3J12q3J06L7O9l13J33n9k32N0J34K97k04l5J29l9j60K69j66o7L61k65j72
5395a81q6J58J93k83K49l30L55Q1k84K18J48l28K88n4k24L1j07M25m58J30O7N0
5417E8q9Q7O6on9K8j08P0k09N2K07l4R8j67j09k3L69m57L82j23kj28O3K5p1L1
$$ y = [-103, -14, -92, 349, 116, 36, -126, -234, 48, -4, -101, 2, 90, -359, 53, 136, -46, -138, -71, -301, -186, -210, 130, 79, -108, 202, -60, 134, -166, 42, -139, -138, 77, 55, 53, -227, -48, 88, 158, 73, 185, -115, -13, -60, 210, -256, -41, 144, 55, -207, -250, -230, 27, 120, 189, 51, 104, -388, -51, 190, -72, -46, -71, -2, -13, -149, -88, 92, -94, -11, 100, 37, 129, -78, 159, 63, -102, 107, 35, -314, -17, 81, -207, 104, -31, -6, 225, -89, -77, -27, 223, -122, -259, -117, -81, -156, -17, 55, 53, -25, -125, -101, 138, 253, -164, -183, -1, -85, -41, 292, -74, -183, 69, 55, -80, 15, 133, -324, -83, 29, -54, 52, 89, 158, -155, -22, -81, -313, -263, -129, 168, -36, -71, 58, 19, -141, 128, -38, -105, 256, -9, -181, -267, -109, 84, -199, 50, -280, 75, 156, -128, 90, 238, -90, 198, 144, -80, -49, -156, 269, -189, -59, 8, 58, -31, 56, 122, 116, 57, 85, -23, 47, -162, -110, 97, 63, 161, -6, -115, -138, 231, -226, 156, 33, 31, -97, -34, -9, -80, -49]
5443d9j31K25RM1j90J35M2M7l28J94K40l96K31k41J67J40J4l52J83J62q0j31o
5466g4J30l1N3J12k30P3l79K42J43n3N2%k65J98J18j1j52P7n7Q0j1n1o2K2N1J92
5492A67j56j77J01j01K37ok54O3K53j79P3j59J47J6R1q4l7l30M94j84J48l88M21
5515A56o2j45NQ8J90P6j70j13k50K98J8j33m0J24L6j41J57o2mM6o7k41M61k75
5539d8O8j89L6K10l08J74L03j91o8J09P1l75J41K58l87K80n2j78M28k49q0p8J20
5562erJ45J84k06J56l65K47J51l59J3J77j16J23M1n16K45K4J85r9j35Lk6L58j69
5586D7n5l7MK6rl23L39oj7n6j85KK81N9j28n7J63k8j50L2J53J57k67K46j31Mj0
5613E4j7o8Nr1K37p7J70l39K03k36K65M0l77M3J88N9j8O2L4Ll76J51K98j10%l21
$$ y = [-49, -180, 45, 54, 95, -95, 40, 82, 129, -199, -5, 235, -161, 70, -171, -4, 136, 150, -202, -19, 143, 63, -68, -74, 56, 25, 78, 190, -40, 33, -346, -104, 39, -14, 38, 38, -227, -29, 89, 78, -74, 3, -54, 26, 15, -36, -98, -76, -25, 167, 11, -166, -65, -166, 71, 65, -189, -126, 127, -52, 21, -138, 9, 25, 116, 32, -5, -335, 159, -25, 123, -265, 156, 94, -51, -46, 42, 232, 308, 138, 25, -225, 73, 91, -42, -82, 42, 78, -63, 94, 32, 28, 74, 7, -234, 227, -48, 20, -169, -133, 77, -231, -57, 246, 55, -13, 96, 167, -208, -67, 191, -196, 84, 32, -146, 282, 33, -47, -125, -5, -14, 131, 315, 109, 265, -100, 147, 298, -61, -48, 129, 13, 136, 177, -339, -94, -70, 115, 16, -119, -116, -142, 216, 47, -8, -45, -41, -15, -24, -347, -8, -14, -31, -87, -272, -270, 11, 70, -58, -115, 48, 20, -130, -98, 55, 212, -55, 191, 60, 64, 54, 37, -31, -26, -117, 120, 43, 213, -126, 77, -159, 106, 146, -231, -188, 0, 59, 41, 103, 137, 140, -236, -85, 213, 103, 103, -218]
5639b18J9K80j10j5LJ0J42p5l06L55j82K45l23J50j22MK71l30M26j79j97J39K14
5662B01k26q2J35O8n2J6o2j81K04Q4pj91J92l44R0K18p3K15k50M1k79L78j34J82
5686A43j23j93K76l05J51L2K46r7k72j0J68j1O2pL8o9p4J65j5O4l7j51J89l3l9
5711I8o3pl2j70Q9J99N5l1m5k03N0j89J89o8J11j88K11j28q8L23J06j30J15J0
5735B14k30j5J71j17k49P8K29j00KJ80l82K75r3Om1J53k0n4j0K1N5m3j47q3PK70
5761G7P6o6Ll46L11j32j96J38R3K18j57k48K25n7K64J8k53j11J68r6J20k8p5k01
5785b55J33R3J50k5Lj50J11k0k4j89K05J14j44m1k74M38j93q5M71k91j08J13O4
5808I6j63J16R5J33l50j41J33L18k11O0m7J92k74J25M3l4j88K85m24J53K67j1
$$ y = [-218, -199, 81, -29, -44, -41, -31, 111, 36, -270, 85, -97, 148, -175, -25, -147, -143, 128, -202, 224, 45, -152, -13, 201, -25, -107, 28, 96, 44, 60, -2, -183, 21, 105, 98, -93, 99, -245, -155, 63, -10, 205, -45, -4, -283, 95, -39, 143, 20, -173, 103, -202, -51, -19, 227, 130, -142, -152, 16, 5, 67, 60, 98, 29, -45, 120, 105, 169, 132, -19, 170, 137, 98, 35, 28, -4, -174, -85, 114, 169, 138, 93, -110, -60, -249, -60, -128, -17, -205, 6, -122, -210, 113, 219, 89, 204, 214, -16, -31, 140, 23, -226, -148, 81, -19, -17, 163, -219, 56, -37, -31, -72, 81, 61, 7, -3, 18, 73, 30, -117, -200, -193, 77, 153, 87, 90, -256, 55, -77, -273, -135, -42, 176, 19, -229, -4, -61, 203, 221, -32, -143, 25, -71, 49, 21, -54, -255, -122, -29, 121, 96, 99, -51, 60, 40, 16, -173, 32, 146, 2, -39, -313, 125, -68, -153, 318, 27, -81, 32, 96, -67, 49, 144, 277, -73, -214, -81, 237, 26, 86, 39, 231, -43, 82, 125, 91, -97, 188, -236, -83, 184, 173]
5830A73k14k8m8L6o4N7j15J02Q1k69K78k31J26M5j21j7M01r8O3m11L16J28k67
5853g7J6k39J39O0K24l49j7N0J62j52O0J41n2o9R8j97K64k32M4J60J88j73r8J26
5877G7Pj45O3O6O2J33O1k58J49m32K16j41k7J01o0J02O0j15j01L45r6M7k41J37
5901A0k00j09J85J65P6q4L1k77J79L43m01n8J88J4j38o5KJ70%j3J48k27J6nj09
5926a59K02j29M1K06j47P4j9l4Ml10K82n6L14m87J83R2j9m7n9k6J19N3k2j74K52
5951A34k45P3NpJ42q9K50l30r9J86M4p0Rj8j40K99j16Kk59M59j4k49K9j01k9P3
5977f1J80j18j01K23j32or0k8K72pk30J66MJ35k68j52L32k97N5J9J78j49l2J20
6001A3K0q3M2j78J97n9K08j62Q9J68j82k03P7j02Q9J76k07J0L80m77K14j16J03
$$ y = [173, -41, -69, -117, -81, -145, -88, -203, -101, -20, -289, -11, -242, -116, -71, -192, -209, 192, 94, 157, -254, 62, 190, -77, -61, -300, -161, -101, 123, -226, -243, -193, -31, -183, -123, 18, -34, -103, -5, -202, 62, -170, -126, 34, 222, 49, -49, 77, 84, -61, 2, 68, 130, 263, 324, 66, 215, -217, -1, -142, -169, -68, -128, -26, 34, -81, -182, 163, 67, 114, -127, 10, -190, -299, -114, 51, 127, 43, 74, -203, -24, 319, -82, -140, 48, 62, -76, -141, -139, 31, 31, 18, 166, -61, -45, -50, -159, 43, -86, -45, 161, 14, 88, 69, 35, 39, -271, 11, -45, 269, -218, -35, 57, 38, -9, -68, -94, 25, 78, 56, -118, 134, -111, -38, -33, -40, 102, 13, 263, -67, -166, 20, 64, -6, 3, -15, -155, 144, 28, 30, -229, 230, 216, -33, -4, -105, -134, -61, 119, 1, -100, 123, -9, -15, -105, -133, 139, 132, -98, 68, 72, 207, -61, -213, 119, -178, -123, -104, 74, -75, -107, 13, 33, -50, -8, -186, 11, -48, 160, -2, 87, 255, 73, -130, -53, -155, -66, 110, -97, -87, 293, -184, 30, -86, 17]
6024A7K15m27K48j04K3J92k21k05L89k86J53j41K64k60K15J08k23J14k44K50l47
6045b70M12j32J64k74K1L7J58j6k90K74k8J24k54lJ11j86J75K6K9J0j31j82O0
6068a65J11O4k6J0j57J8N2j1J02P9K7J47m62L12j07j40J93J6j03j14L39l04K14
6091I5j57q3L08k1k28J93k16k7N1J49J25j75k15J03L74l63J97j54j90K49m5J98
6113A68j25nj42j29J76J83k75J90m5j9K37k90J8P2N3j76K73l59R2L6JK34r3k2
6137E3o1O6k39J8M0pL09q1K11l22o8K85j61k27K72j40N1K22o4k71J43k94J87L3
6161d5l8J09k18N44k87j45J3L24q1k52J11r2J06k29J40K16r3j15J94j61j16J6
6183i9J59l2P5k01K02q1l6K21k38K0P1j80J00P6j4O7k95q9M8K94J72j70J1k5j74
$$ y = [17, 232, -195, 53, -51, -28, 164, -57, -262, 127, -159, -6, -147, 117, -143, 72, 180, -43, 71, -173, 77, -270, 142, 10, 174, -100, -79, -42, 116, 100, -190, 84, 56, 180, -74, -77, 34, -152, 23, 49, 78, 88, -43, -225, -165, -54, 10, -16, -6, -163, -145, -93, -104, -2, 77, 104, 251, -211, 101, -6, -146, 47, 63, -40, -154, 185, -119, 95, -62, -145, 163, 142, -86, 107, -109, -136, -85, 64, 189, 14, -201, -98, 276, -87, 110, -44, -234, 15, -30, 168, 43, 38, -104, -233, -57, 126, -149, 41, -4, -23, 214, -76, -58, 14, 67, -109, 164, -195, -103, -67, -66, 168, 75, 53, -8, 58, -181, -163, -123, -130, 179, 98, 309, -13, -81, 204, 43, -184, 88, -52, -1, 221, 157, -114, 29, -265, -78, -45, -83, 26, -192, 352, 65, -80, -67, 257, 176, -76, 35, -57, 49, -180, -40, 176, 83, -32, 162, 1, -115, -99, 60, 28, 103, -98, 104, 23, -13, 208, -30, -10, 61, -119, -19, 57, 43, 110, -185, -274, -226, 68, 240, 70, 81, 56, -118]
6208a18J48J06M1m09O00m21K91k63J82k73lK23j41j00m6j8J48N4k9j04J45J53
6230A66l95L94k58O3N1J42n2n3n2J46R6k88j23J88j48J28l2l4K57l38m9L98k61
6253e4L09L5k57k55L18L6J42l08k14L15k02J76L07p0j56j90J92j54J5q9M05m23
6275a22j06J60Q8j45k3K65k79J94NN8j05J36o2L6j95K0K91j89K31k01K5k3j72
6298a13L53q7r5k40n2L93k5jk18J60k27L04l70L93l15N27l62j51qL9K83n92M01
6321cnJ49j79L2j61J35k71J67K18k12J73k25N9P1mJ89p4j08o2R9k06j41L74l4
6345a9M4K98k97r8q2J99Q2j56N6R6n2P5l28J91K8j89K99l28K19K05j08m9L2m15
6369b97J60L38k7j41j33Q6J3j73j4j6K68k41K95K0j45j65J76J46j10j1j53mJ76
$$ y = [-118, 30, 136, 177, -232, 368, -53, 238, -25, 157, -116, -119, 104, -37, -137, -183, -201, -53, 1, -28, -132, 13, 166, -229, 165, -93, -30, 21, 163, 111, 58, 6, 152, 248, -40, -163, 25, -123, 5, -27, -61, 196, -142, -191, 207, -54, 255, 290, 33, -222, 96, 132, 274, -34, -248, 67, -135, 41, 348, 278, 122, -68, 124, -30, -15, -104, 301, -122, -228, -68, 20, -125, -148, 117, -162, 32, 37, 95, -10, 126, 64, 100, -95, -75, 216, 27, 258, 57, 82, 59, -113, 240, 153, 58, -182, -234, 159, 134, 133, -85, 75, -152, 152, -218, 175, -140, 387, 25, -126, -134, -95, 188, -404, -3, -8, 141, -38, -6, -167, -32, -303, -136, 82, -130, 43, -182, -123, -52, -56, 133, 59, -49, -111, -12, -218, -359, 15, -19, 25, 323, 26, -72, -154, 45, 127, -29, 27, 123, 71, 146, -182, 9, 37, -152, 147, -181, 38, 243, 135, 86, 118, -297, -137, 201, 174, 33, -100, -14, -1, -174, -188, -204, 64, -177, 118, 138, -7, -172, 4, 150, 40, 29, -124, -128, 48]
6392D8l09L03O8j35L99j61l42k3L15k28J93o2K5k63R4Q4j25J58J21k54K16J08
6414B30m67M27j52j44N8j05L04k56N8N6k22J58J80k89L28j59p0j13J79j8M7P4
6436A04k03K22j73K06k04j0l8j4k28K03M6j06p2L80j31j06J01j47J74k14K76m42
6458c76K99K11k62N2j20J66K25Q1l22j33J71R7m9q7q2J1J45o8q1J75j67K33k41
6481a22K03j28M0oK8j20J39N7l60K58j03KJ41K2Q9m0k23Q2L2j31K45l3p9oJ95
6506A82q1l91N69l29J43j3J16j63q6k9J46J53j85j90Q4N1o8J41J10k81Q0J00q8
6529b9K2m0J98l06J02J09K43k97m9J28k13K11k90Q9J2L1O8rO4j92L43k10Q2M2
6553A09k3O0Q1k02j9k28M38k08J12k51J54J7o7K5p9J48L0j96J95j56j89J60O8
$$ y = [48, -261, 42, 110, -25, 374, 213, -129, -152, 163, -65, 128, 66, 91, -172, -78, 6, -119, 39, 160, -94, 122, 230, -237, 190, 38, -106, -48, -153, 151, -105, -47, 9, -213, -55, 125, -164, 164, 5, -65, -178, 1, -17, 30, 104, -99, 123, -50, 156, -48, -58, -96, -110, -338, -135, -89, -195, -267, 113, -18, -124, -23, -170, 4, -210, 66, -376, -77, 134, -128, -76, -196, -30, 195, 276, -46, -179, -8, 89, 40, -47, -129, -118, 27, -41, -122, 53, -114, 119, -122, 81, -47, -7, -13, 15, -105, 34, 91, -269, -11, -114, -112, 29, 51, 140, 100, -123, -41, -9, -140, 105, 72, -7, -13, 182, 101, -290, 279, -50, 93, 80, 196, 33, -53, -82, 64, 217, 32, -158, -74, -23, -91, 50, 160, -121, -41, 59, -29, -7, -47, 151, -155, -53, 56, 299, 2, -47, 81, -132, 79, -211, -122, -110, -79, -11, -20, 44, -148, 195, -15, 67, 109, 86, 146, 227, 25, 6, -222, 216, 8, 120, -131, 23, 40, -27, -2, -81, 67, 97, -99, 96, -60, -249, -89, -21]
6576b1Nm2K9J82m4k34L09l48J95k63L22r7p9J37J2j66J68Q5k29K50k57J55L43
6599D12m34J80l43J29j27Q6J51j08k5J41Q5m93J35m6K50p5L73k74j73M1j36Q6
6621a65L40o1j62J82j09Q9k53M8J9n8N4J5J05k21n4M15l92M06k72k5M53l41j63
6644a50K80O0n6k02P6J40r0r7J4q3R1Q4P7r8j50K59k08p0J60Q3p3J46nl54N2Q1
6670c3l05L97j21q6K80K5k32j40J19J76j24l5J20k43J51J06r0K31l72L66k51N4
6692gj34J41M4pk20K29j32K48k11J8m2Q5k40L56j85J35j02O7j50J85k0j21J37
6715G4k53K71k13K1L76q3j68m27L86Q0Q0m26J67K46J27m61k9K95m6Q0j47P7j23
6738i6J30p3j58L48k04mM14m79J02r1K96m86M82j57j19R1k46K50J49l38M33k44
$$ y = [-21, -16, -58, -29, 153, 109, -125, 184, -164, 31, -232, 90, -7, -86, 51, 63, -103, 65, 150, -79, 171, -86, 69, 412, -22, 158, -185, -56, -183, -97, 54, -54, -79, 62, 147, -346, -211, -257, -7, -82, 291, 17, -156, -115, -251, -165, 175, 114, -48, 134, 25, 114, -139, -91, -72, -130, -76, -61, 44, -177, -231, 184, -208, 198, -74, -99, 354, 13, -150, 130, 190, 134, -68, 8, 148, 58, -39, -25, -108, -17, 67, 144, 46, -104, 155, -53, -123, 37, 120, 47, 193, 188, -166, -114, -33, -338, 59, -62, -148, 132, 157, -75, -215, -96, 80, -44, -79, 41, -202, -51, 55, -35, 196, -176, 190, -61, -7, -141, 0, 44, 37, -183, 46, -86, 162, -49, -31, -73, 12, -228, 128, -57, 78, -24, 43, -107, 78, 58, -63, 74, -179, 92, -121, -100, 276, 193, 25, -402, -16, 64, 144, -282, -115, 131, 258, -203, -232, 63, 17, 97, -50, 27, -96, 34, -39, -197, 151, -53, -57, 357, -122, -20, -111, 185, -301, 181, 24, -95, -4, -250, 0, 149, -189, 244, 0]
6760@k08L19k10L71k04J04k38K51m5k32K67j50J1P0k60R8n8N3oK57k86L0j89K36
6784a9M25l43K7Nm2K4oj37JP0o2J95j8p9j88K43j56J19l26K42N8K54k77k5q3k2
6810a20K26P7k92J78J31j71K4P5j1r3P9j76N9N3J4j65m1J70M3n2RJ99J76k97p7
6835A8J10j26j9M1j38j00K83K4N4k14L9k25L06J34k58l0N7J14k19J75n9N2M5L1
6859I5j56Q2L2j03M6J8p0Q0j68J61K17l28n4j96M81pM5q7j1n3j9k90M31M7l27
6884a34J54P2p5k03J61mN1k82K89K23m15K13j40j76J72J13J61k49J09l34K93L05
6906C04l20J48P2j14K5J25j05r8q4J88j44J94k33J14m7J35j20J71j97j15Rj22
6928b14J20K53q8j28K00m9m4K2O7j98J42j01J08j98K70J27k72j62J19K13q6m6
$$ y = [0, -208, 111, -99, 272, 68, 172, -66, 185, 140, -92, 175, 25, 36, 106, -154, -56, -114, -61, -67, 190, -96, -66, -255, -19, 406, 63, 90, 95, 53, 77, 71, -66, -65, 5, -57, 138, 120, 41, -147, 96, -60, 59, -267, -25, 33, 287, 10, -15, -98, -120, 106, 183, -109, 69, 200, 29, 53, 128, 117, 24, 103, -73, -14, 39, 53, -112, -153, 17, 60, 8, 17, 216, 392, 95, 18, 128, 2, -17, 24, -114, -214, 69, 93, 147, -67, -28, -253, 53, 187, -71, -101, -44, 70, -149, 26, -33, 19, 64, 95, -61, 21, 53, -50, -4, 14, -56, 24, -144, 17, 234, -94, -148, -344, 137, 130, 175, 88, 77, 24, 5, -285, 146, 193, -134, 20, 92, 17, -186, -25, -29, 22, -260, 29, 252, -163, 50, -90, -266, -94, 19, 180, -69, 40, -294, -1, 304, -16, 132, 204, 90, 115, 240, 135, 37, -47, 141, -3, 191, -42, 72, 25, 160, 40, 211, 14, -101, -92, -214, -94, 159, 71, -57, 143, 94, 50, 72, 139, -59, 83, -18, 90, -108, 162, 289, 17, -145, -26, 187, 101, 55]
6950E5L03n38L53m94K98K20j87p8P5J6J15j21Ro6j21K90m3J08m54M15j1n6j04
6973a6o8L2K10l99L11L1k23L0M3l8K42Mj24k16J47Q2l20q3K4K08K28l07R6K09
6997A03Qk11K40l45L18O3k11J84j41J51j76P6j36j8L41j89j22M1om6K4J38j23
7020c7N4p2K70k36P9J58j06q2l0N2k8N7k30N1J59j94K11M6Q0l85J3L49k76M9r4
7045a42L36r7j78L5K48J17k58k76J75J01m6j9M6Q5N1j45K3J73l72L41m89J45J23
7068b3k1R3q1J90l17J93p1m5J52p1r1J0j3Q5K56m78K28j07l9J7J41k06K48N2k15
7093a13J21j21P1k59P9K89j62Pj58M91j18K0l12J25q9j02L69m4k87Q0n4J57j79
7116a89J35K12m9l88J58o2L45k44K31p9j41J41m27L65j11K12q3K09k30r4j06L24
$$ y = [55, 358, -180, 173, -321, -23, 197, 10, -68, 7, 23, 138, 17, 26, -40, -161, 129, 86, 194, -260, 155, 144, 88, -16, -84, -52, 158, -241, 70, 101, -122, -92, -49, -87, 155, 159, 35, -181, -34, 48, -272, -355, -331, -123, 105, -202, -106, 103, 111, -100, 140, -205, 113, 176, -35, 149, 8, 159, -17, 59, -77, -95, 246, 57, -65, -24, -30, -76, -52, 86, -37, 17, -55, 215, -21, 58, 216, 110, 28, -2, 50, 22, 79, -151, -100, 59, -135, 76, 122, 202, -183, -170, 179, -97, -48, -142, 194, 97, -81, -46, 202, 319, 61, -215, -40, 61, 15, -4, 42, 127, 178, 33, 56, 229, -143, 198, -291, -146, -23, -44, 49, -32, 158, -159, 34, -37, -82, 70, -1, -92, -82, -95, -10, 246, -232, -4, -111, -150, -133, 8, -198, 50, 102, -113, 8, -113, -42, -301, -222, 67, -95, -88, -246, 245, 127, 147, -165, -40, -129, -231, 138, 94, -193, -113, -167, -10, -189, -54, 158, 109, -279, -121, -183, 162, -82, 149, 70, -71, 70, -357, 8, -103, 109, 26, 235, 5, -89, -195, 129]
7138A29R5m81K16L54L6m95N4l0K09J87j76L8Nl6M1j55P2j21O1j91Q5P4k2K16k49
7163h4K53k60J27j57K94J5m32J57J76j59J01J86l05K21K6k87L53j12k00o7J18
7184c6M9j7J14M5l05j6K21J14j99J49M6k04M6J39q0l65K34K28m0j82Q8j60J53
7207B2j00K0J7L7O0M3J80m66K17j7q6O9l8K4n5j3qlj82L57j88J84j41R5J09k66
7233a29J95K5k94J76J06j53J65k90L79k65n2O4K3R2l0R4j47l2K4R6q3J70k98K0
7257a44Q4O4n6j89M84j15k74J23RK13l38J03J57l1J3n1l1J5K0j95J17o5J89l35
7281b33J10j8K90k51K93j60J4j57L1M4K32k66J57J6r5M3k31K27q2j14K40j38J55
7304A07l02m9K84q8J61q1l6p8K36l40K48l15J85O6J12j03N3K2r4K05l04J67k7
$$ y = [129, 224, -257, -41, 313, 349, -146, -92, -122, 87, 274, 98, 136, 141, 105, 146, -9, 63, -58, 3, -188, -103, -29, -51, 165, -84, 169, -91, 36, -121, 173, 188, -244, -87, 89, -70, 31, 217, -88, 133, 159, -128, 225, 113, -87, -154, -36, 13, -4, 110, 155, -150, -166, 55, 169, -30, 119, 165, -39, 7, 146, 66, -299, -65, 163, 123, -59, 29, -131, 22, -78, -58, -41, -4, 56, 99, 279, -187, 30, 13, -73, -4, -42, -18, -73, -86, -94, -97, -279, 78, -110, 74, -67, 28, 137, -129, 66, 91, -203, -27, 79, -74, 91, -199, 180, -85, -137, -73, -50, 42, 12, 106, -41, -73, -49, 47, -36, 134, -164, -144, -60, 4, -52, -241, 243, 128, -146, -23, -14, 199, -139, -36, 121, 90, 103, 52, 21, 36, 56, -139, -22, -87, 102, -233, -123, -141, 149, -102, 191, 31, 45, -112, -81, -37, 195, -71, 86, 102, 7, 50, -181, 46, -36, -150, 90, -48, 107, -195, -244, 40, -48, 113, 32, -4, -82, 154, -186, 62, -253, -68, -2, 110, 7, 60, 82, -12, 193, -111, 56, 29]
7327B9N6j15K02O9l21r5O4Q6K26j19k8J38Jj02l15K30j49M4J13p8P9k02K29k43
7351b01j3J52j84M29j10j5k10J09q1j19K55L38k70o0k7j20L4K11L3j89K05j47
7373B0l4O0R4l66M17k77Q9j94K75J28o7j23k53J78K09j16j47p4j4K36M1P0p7q5
7397a0J39r0J45j12l14L68p6JP5l35L83j45Q3j06L4k3k34j03J78k44J70K68j69
7420a17k6j06J64L8J70j56Rl0P8j72K28jk54K26j11K11k33J41j31K5k3j20Q4j28
7444b34K85j21L08J17l17j82oJ2K62ml2j7j06K22l82K09o2MR0j94K8J84p5J14
7468A03q3P2P0j22K7K6lj01J1K2k9rM1n4L7P6j46j1J00j53KL98p55M11J88k24
7494a06O2j9J67n5k21K44k92J59J53N4N3j48J98m49L61k72J54j12j48L07l4l45
$$ y = [29, 85, -30, 172, 241, -80, -175, -111, -25, 201, 82, 54, 192, 193, 91, -224, 6, -143, -99, 14, -64, 15, -187, 42, -201, -214, -62, -246, 183, 73, 58, -152, -43, -124, -243, 12, 350, 80, 20, -7, -127, -93, 118, 151, -38, 167, 20, -14, 46, 140, -226, 191, -86, 3, -191, 84, 212, 145, 22, -231, -53, 156, 40, -107, -181, -195, 41, 82, 152, 75, -10, 129, 39, 184, 72, -242, 126, 50, 51, 126, -209, 174, 29, 112, 6, 40, 17, -217, -320, -142, -386, -216, 52, -117, -143, -249, -85, -47, 123, -33, -24, -54, 24, -148, 80, 79, -175, 51, -60, 151, -82, 59, -72, -47, -70, -190, -106, -234, 51, -70, 238, 355, 38, -144, -150, -138, 124, 120, 88, 71, -35, 187, -195, 14, -48, -44, 46, -148, -120, 64, -11, 103, 20, 92, 162, 40, 67, 93, 90, -11, 0, 22, -7, -16, 25, -29, 8, 84, -62, -73, 27, -126, -124, 274, -481, -70, 118, -106, -44, -63, 104, 49, -172, 72, -220, -61, 92, 146, 199, 51, 249, -200, 161, -111, 43, -69, -217, 90, 56, -289]
7516b89K92L1J37o3j28J05P7l6p8j76O1p7M38j37j90R4J33j25L7Pl64J60J33k05
7540a63J96k00O9j40K02J26p9o7K16k01k30J26K21P0lk59K65k30K05k05J07J00
7562A26k09J31j14j18J10O7j8jO3k77K4Q1K26j34j16J96j5L4p6j16K6J10J0j04
7586i4K6j43L4J19l1J5OJ36k85K01O1J7l7j48J55j88O2Nl7Q4k35L43Q4j61K31
7611B20L4k70k6n0K9j12K89j95J03M6k2K30k00p1JQj38J27k08p2M09j0l23Q2K17
7636I8k08mK23l5K9j15J76k13j81K42k47J36L59m85K39o7J41j60l9J42J03l15
7658a81R7L38m90L81l29K44m4j3j33Q4r0K78j29n5L27j86K1j45J02n6J01j1k33
7681a22P9r1K75l82pL39j63N7K35j33lMk36J60J6K9q4j09M07l70J20O5j12J74
$$ y = [-289, 3, 34, 171, 108, -20, 85, 162, 126, 48, -128, -67, -144, 294, 157, -33, 61, 194, 69, 106, 113, -251, -91, 42, -163, 33, -167, -98, -238, -36, 90, 11, -56, 160, -41, -271, -145, 76, 146, 143, -116, 149, -81, 124, -81, 26, 126, -83, 48, -66, -184, -74, -7, -25, -26, 37, -240, -216, -135, 91, -43, -159, 37, 22, 56, -20, -136, -110, 0, 10, -94, -68, -211, -177, -58, -89, -74, -68, 68, -217, -16, 45, 62, 25, -123, 32, -156, -94, -89, -126, -42, -277, 66, 150, -11, 220, 254, -16, -42, -92, -63, -175, 114, -81, 22, 68, 46, 276, 76, 5, 6, 14, -124, 3, -205, -277, 132, 122, -201, -119, 98, -110, -114, 109, 74, 103, -12, 164, -49, -230, 12, -235, -99, 260, -225, 14, -53, 88, -72, -111, 31, 134, -181, -84, 254, -236, 145, -184, 60, 16, 3, -130, -46, -136, 142, 13, -42, 285, 99, 120, -25, 77, 21, 122, 111, -122, -43, -134, 141, -241, -248, 91, -72, -15, 220, 87, 84, 88, -148, 12, 28, 57, -27, -136, 271, -99, 21, 86, -26, 148]
7705A48m3K7k02j54J25L6K04m88K98n8R0K74j98L4N0l03J93k23J33Q3p4J19r3
7728b2k8K23m22N33k51P8j9l14L07oj20L6J18O5k74J79J8O7o4k55Q1J22j23L55
7752B84j56j2l20J27M1K24k60R2n3n5rm4J31l37L80R4k17K6J20k82K27l3J37k58
7776a53L3R8q9kJ26Q4j60J73J28m63K02r3k58M72k75L11p0Q2k23J72K3j48P6k13
7800a67L52k67o6m4K12j12P2K22j89L1k22M2J19K07m1j40L0k36K99j81J80n7k53
7823b09M10k23L8k53K57j04J00Q1M5j42q1J90k01N6R3p8J17j40j7J49l57J57J73
7846F1P4k72J64J55R5m37L01p4j53m8J90l14M18j95J21n0lo6O5k58J37J91q2j26
7870a06K13j84J78m6K1J11j5J0P1k70K64j23o6k49P3J76m4J23l53K26J7m3k72
$$ y = [148, 105, 132, -70, -224, -99, -63, 141, -347, -49, -107, -17, 257, 59, 93, 143, -160, 33, -190, -57, 26, -48, 71, -22, -50, 173, -249, 284, 33, 111, 92, -222, 85, 79, -41, -5, 113, 178, -96, 83, 101, 168, 104, -151, -70, 52, -71, 284, 128, 116, -204, -77, -36, 188, -72, 20, -33, -88, -97, -141, -10, -347, 33, 127, -90, -64, 56, -226, 1, -32, 105, -153, -120, -22, -111, -113, 13, 97, -63, 110, 238, -225, -23, -116, -374, 98, -177, 134, 64, 146, -77, 95, 118, -30, 46, -167, 185, -82, -148, -192, 20, -92, -20, 202, 13, 44, -178, -136, -17, 190, 149, 9, 39, -197, 102, -79, 101, 44, -209, 201, -22, 16, -237, 20, -84, 16, 97, 142, 0, -81, 109, -92, -36, 57, -21, 96, -44, -61, 88, -269, -112, 61, 135, -137, 27, 182, 277, -160, 141, 67, -86, -134, 56, -258, 160, -35, 86, 36, 33, -33, 32, -226, -89, 102, 20, -106, 107, -77, 101, 55, 76, 187, 172, 182, 253, -17, 247, 124, 58, -191, -118, 58, 14, 137, -216, 10, 27, -16, -288]
7893b88K51O6J3j85J18kj05k16M13k31K46o4J00M6L1l58J62K12k32N3J57k24j8
7916e5m7J51j43P0l4p5K14k41K56n8J7p3n5l0J44n1l12K24J11K22o92N41J1L0
7940A25l73L79k48kK99l89J88Pm2J12lq5m9k6L62n22J24K10j00o7K24l92M16j0
7964A38l11J96J0M3j25PJ80k35p2N0L4J71k37L90j61j86L06k88O2k8R0Q9j63o2
7988a02L45m07R1R1M8J17k11O9J08k93J94j70M06k43P7k1k07O8K29j39j9m3J77
8011A65k62J16J36J44l92P7Q7j77J86p0RP3n2p5N4L24k44o6J5K50K0l51q5K8J53
8036F3j81J54l43J28K34k2q7J58m6J30j27J07o2j48Q4k43J95k0L3k05J69P4qL4
8060G1K2j15j5J90k67J61k43O1K30J4j93K11o9J40k47jr0K59l37K98q8l7K52k12
$$ y = [-288, -37, 29, 42, -143, -25, -27, -132, -348, 65, -166, 80, 16, 116, 162, 193, -165, -3, 209, -23, 30, 187, -37, -55, -102, 49, -94, -24, -58, -133, 81, -160, 96, 38, 55, -18, -73, -103, 41, -10, -322, -98, 13, 235, -457, 84, 95, 125, -248, 131, -117, -119, 180, -209, -21, -14, -56, 56, 53, -32, -81, -107, 255, -267, -143, 67, -33, -100, 124, -268, 148, 138, -173, 23, 33, 76, -49, -42, 138, -97, -169, -119, -85, 86, -151, 239, 78, -108, 198, -90, -28, -56, 34, 123, -40, -102, 243, -164, -73, 18, 66, 183, -28, 41, 149, -144, 50, -120, 286, 43, 120, 99, -108, -40, 189, 50, 31, -12, 165, -97, 19, 155, 299, -93, -16, 71, -106, 80, 10, 19, 92, 40, -35, 19, 343, 99, 33, 48, 298, 318, -33, -118, -90, 63, -118, 36, -307, -179, 55, 33, -54, 104, 58, 188, 61, 168, 106, -42, 42, -201, -6, -26, 7, -198, -29, 45, 37, 71, 93, -22, -37, 153, -114, 47, -196, -135, 95, 109, -84, 127, 58, 198, -49, -50, -140, 119, -218, 80, -8, -45, 207, -5]
8084eJ34Q8k08j07N6J70J9l49J81m6R4m5J22j38N5J5j11J0J06k7j76K72N8j97
8108b9M9J18k44K52J7k61L71r6l56L18Rj84J41k7j98J32m3J28K6j69Km4l8k28
8132c54M11o7J43L3k37K94m78K63K53k96J00j70R6p7j65L07o6k34L24N7j94K78
8154B21j16k25L21l71K15L6P9k47L2O5j07J72p3J21N3l13K37q9j69K47k02J04
8176iJ45n3o1j78K98o5l36M35k89J27k60L05o2J41N4
$$ y = [-5, 129, 217, 9, -98, -42, 128, 147, -202, -21, -67, 27, -18, 104, -34, 21, 36, -75, -65, 41, 14, -162, 110, 168, -29, 20, 138, -106, 146, 163, -98, 273, 177, -179, 139, 148, -36, 105, 78, -120, 12, -31, 97, 123, -46, -44, -88, -126, -354, 57, -10, 133, 166, -71, 223, -255, 8, 261, -35, 65, -105, -9, -86, -251, 56, -10, -244, 80, 137, -57, 221, 105, -120, 201, -170, 45, 81, 160, -87, -55, 10, -97, 75, 2, 123, 176, -137, 100, 11, -158, 89, -113, -9, 136, 83, 22, -156, 142, 77, -259, 176, -113, 14, -246, 59, -3, 138, 192]
8191A92
$$ Imaginary data points
##PAGE= N=2
##DATA TABLE= (X++(I..I)), XYDATA
0@%%%%%%%%%%%%%%%qJ6j6J6j6K1k9L2l8M6m9N7p1Q0q9J04j20J36j52J70j93K17
37A14k44K73l04L39l74M14m59N09n62O20o84P53q31R15j006J110j225J355j501
56g88J665j855K074k336K649l028L508m133M985o221Q181j1762K0389p7759r4023
71a58454J37471L9773k5111M9525J25255K0728o8434J3259N9584q2181j05343
82F072p82K7524m4239m9657N5165N3560q8696o0591M6435q627r0065k5229P2069
95a07061K7175m1749O9658J25299j50l9637L6527L7035m3461n7380M3539M7121
107I6916n2771j5389P0206K1874o2349m8354J8305l3293j09519q968O4767k0174
119g8749l6257N0775P1234j1836l8610M6594K8271o6283k0987O1864M0009j1603
$$ y = [0, 0, 0, 0, 0, 0, 0, 0, 0, 0, 0, 0, 0, 0, 0, 0, -8, 8, -8, 8, -8, 13, -16, 16, -22, 24, -25, 32, -39, 41, -48, 56, -64, 72, -80, 90, -103, 114, -130, 143, -161, 178, -196, 218, -241, 268, -294, 326, -358, 395, -436, 479, -527, 583, -642, 713, -788, 877, -978, 1096, -1240, 1409, -1619, 1889, -2244, 2741, -3480, 4701, -7061, 13328, -64431, -158454, -20983, 18790, -6321, 43204, 168459, 189187, 120753, 134012, 193596, 111415, 6072, 5290, 32814, -11425, -61082, -5917, 47643, -41053, -101644, -55209, -63836, -153901, -179130, -107061, -79886, -121635, -51977, 73322, 73172, 33535, 70062, 107097, 63636, 6256, 49795, 96916, 44145, 28756, 98962, 120836, 58487, 10133, 28438, -4855, -114374, -123342, -58575, -78749, -115006, -64231, 7003, -4833, -43443, 3151, 31422, -34861, -55848, 6016, 46025, 34422]
131C4422R039P0245J9017o4268n936L0089m9769p7708q454L6660j9531l8276M9010
144a5460L5539n7096l1702K5451L54m6554j9132N1467K6694j6835M5154P0584
156F8464P029k9389l30K8712k4081m8842K8420L1030l2499j0301L8386J7761m4392
169B9968m0622R455k6898o2114J666L2798J065j1218K0298M8184J706k7038K0528
182b222J3802l1707j4070L1856L8712l926o94M4111M587l9661o289L595k8480
195I614m2028j1398K4260l518j2230K7252J2850k0381j8283J389R527j9665j3571
208e6182L2739J9191J318K7147L1101N813k2154j2055Q509k1185k2581J1964M447
221H072o370K10J0039J0668j9614k5688l924j6227j7712M262J5455J7610K653
$$ y = [34422, 43461, 113706, 132723, 68455, 62519, 92608, 42839, -34869, -43323, -6663, -26194, -64470, -15460, 20079, -37017, -68719, -43268, -42914, -89468, -108600, -57133, -30439, -47274, -2120, 68464, 75493, 46104, 45774, 74486, 50405, 1563, 29983, 61013, 28514, 18213, 56599, 74360, 29968, -10654, -1199, -28097, -90211, -88545, -55747, -54682, -65900, -45602, 2582, 4288, -22750, -2222, 11580, -20127, -34197, -2341, 36371, 32445, 31751, 75862, 80449, 40788, 34499, 38094, 9614, -32414, -43812, -19552, -23070, -35300, -8048, 4802, -15579, -33862, -32473, -22946, -42611, -56182, -23443, -4252, -2934, 24213, 55314, 61127, 38973, 26918, 35427, 14242, -8339, 3625, 8072, 1702, 1912, 11951, 22619, 3005, -22683, -26607, -42834, -60546, -56284, -40829, -23219, -20566]
234b0566J2305K9272P14p053O083p277j0192k281J1161K0804L724M624J0779q766
248D3331r886j0349j7727j1409j9327r700J1036M066P558R255k919k544q842o989
262b4446K151o689K832J0972O362K2183J7836K949N341o645j2154r117q538L356
276F393k994o594J1960N322k199N55q223r261j8257j8157P836M848k246J2329
290a8688J4140Q844R2J176J2930j1275k1077O518P026j235N538J3217J2822j1673
304A8355j2667R822q840k4302q838O80J136o885P705K7825j955j5769Q253N929
318D49j0865j0015Q506J6426r118Q23L2848J0896j1995k709M043p059k5274m504
332g548J9481j0087j6872J4322J5216o809j5204M534O760k8798j5409K4046Q988
$$ y = [-20566, -8261, 21011, 21725, 14672, 20755, 13478, 3286, 1005, 12166, 32970, 36694, 41318, 52097, 43331, 33445, 23096, 5369, -6040, -25367, -35067, -24031, -19965, -12407, -3152, -6071, -8615, -17457, -24446, -22295, -28984, -26152, -15180, -8818, 13365, 31201, 34150, 39491, 32846, 20692, 11575, 3037, 6393, 3399, -3195, 8765, 14087, 11888, 12443, 4220, -5041, -23298, -41455, -33619, -28771, -31017, -18688, -4548, 4296, 4388, 5564, 18494, 7219, -13858, -7340, -314, -1549, 3989, 17206, 30028, 18355, 5688, 15510, 6670, -17632, -26470, -25790, -24654, -31539, -23834, 3991, 2036, -13733, -5480, 449, -10416, -20431, -11925, 4501, -4617, -3794, 29054, 39950, 27955, 25246, 29289, 22230, -3044, -7548, 11933, 1846, -15026, -704, 14512, 7703, -7501, -2967, 3793, -25005, -40414, -16368, -7380]
345g380j0351N750K4971J0148j8172L818K3508j6359k5671R254J6609m232j1630
358B63J8223J9356k5447j5862J8377k384k7996j2721J6714O435k0960J0421L3426
371A7845q420k1818P587J5202j1572k2413J5709K1625k0220n120L0856J0916k0639
384I538j3598J4896j677l4570J72K7191j0054k0258J2442K4840o784k4258J3656
397h464J5737k8370j3460K7446J5629j4417m509L1227J0001k8721L303K4803j4947
410A5258k8628M626K4035o633k2485J9096J9717k6791j7372J7421P175k6367j6458
423c7406K6198J0646k4477J0099L2972m115k3435M931K4408q985k5592J9287K1548
436B6079j8438q030K4229J5406k2137j9501J9980R15l3281m34K4046m527k3514
$$ y = [-7380, -17731, -11981, 12990, 23138, 4966, 8784, 32292, 15933, -9738, -484, 16125, 11893, 263, 18486, 37842, 12395, -3467, 14910, 12526, -15470, -28191, -11477, -5042, -26002, -15581, 17845, 9425, -12393, -4806, 10396, -1176, -23589, -7880, 13745, -6475, -11595, 19261, 30177, 9538, -4060, 10836, 9159, -25411, -25239, 1952, -8102, -28360, -15918, 8922, 2138, -22120, -8464, 7273, -21097, -34557, -7111, 8518, -5899, -10408, 20819, 30820, 2099, 5402, 30205, 15258, -13370, -8744, 15291, 8658, -13827, 5269, 24986, -1805, -19177, -1756, 5419, -20948, -37406, -11208, -562, -25039, -14940, 18032, 13917, -9518, -4587, 19821, 10836, -14756, 4531, 26079, 7641, -389, 23840, 39246, 17109, -2392, 17588, 18503, -14778, -15212, 8834, 4307, -19207]
449a9207N163K8767q905k7607J5064J5036k3887j2556K2354J9214j6112q793K9690
462A8221Q193k5289P95K0544o619k7286O6K8177o983k4570J6801J6450k1672j8880
476b2052J4571J1973k5045j5532K6474P971j9387P315K4820J254k1205Q02K5875
489A7834o913k1899J4373J8080j1566j3215J6593J7305k3728j9569J8506L4k5847
502b0012k235J8187L70k1114L178K5923o453j8940J0896J2608r528j1583J5832
515b871K2405j3227r809K4025P685j8568l499J4761j371k5061p71K2555q244j6926
529h916R089Q831j1188j4738Q061J2276j7135j0939J8059P805q487K13J6854N988
543A5773j9257j87K0952o661j4753Q032J1032o334j1418J1315J1242j8066j0782
$$ y = [-19207, -14044, 14723, 5818, -21789, -6725, 8311, -15576, -28132, -5778, 13436, -2676, -11469, 18221, 26414, 1125, 1920, 22464, 15845, -11441, -11375, 16802, 9819, -14751, 2050, 18500, -3172, -22052, -7481, 4492, -20553, -36085, -9611, -1640, -21027, -13712, 11108, 12362, -8843, -8041, 17834, 10921, -10978, 3395, 21475, 9909, -3306, 13287, 30592, 6864, -12705, 5801, 5835, -20012, -22247, -4060, -3690, -24804, -21626, 4297, -2156, -21096, -10200, 2408, -7120, -18703, -2871, 19534, 6307, -3502, 20523, 28208, 9640, 6141, 20902, 19531, -5530, -6301, 16254, 8010, -8916, 173, 9004, -2184, -16922, -8861, 3415, -13720, -24659, -6600, 1205, -7282, -7069, 9785, 15773, -3484, -3671, 17281, 10620, -4133, 3899, 14931, 8597, -2821, 8494, 19736, 1670, -9112]
556i112R716jj1005m542J0271N417j4918J370J8393k617j1402L002J0009l507
570A074j1087J2085J4524j2278m060J2550J893q343m536N543m98j5455m63J0808
584A757l104p015m26O015j949j1698O179R326j0309m206R826O100j282o50J0793
599I357K542j0674L560P500k998l340j135L430l6p339L640M258q436o361q9J363
615d758k887n904O527K328p669M476O642q63j95l88L214O02k109O051K779j733
631F113J504j680K141J175n874O42j291o195O48J074l8o30l122J855n55j913M015
648b131j680j891L805j386J949N378M80O17p98O28K195l434J140J624n321j74
664A001M14k32K565m658j632K360n101j065K735J030j540m058M985M496n193L275
$$ y = [-9112, 604, 603, -10402, -14944, -4673, 744, -14174, -12804, 5589, 2972, -8430, -5428, 4581, 1074, -10013, 2072, 16596, 4318, 258, 12808, 14701, 6358, 1822, 7365, 6867, -8588, -9051, 1757, -1347, -8362, -8788, -2773, -4722, -16420, -10241, -915, -11224, -15430, -5604, 496, -786, -1436, 9357, 11899, 1225, 4785, 12285, 9287, 5947, 4812, 8242, 8206, 867, 4507, 8765, 329, -6032, -6121, -4758, -7645, -13549, -7022, -4694, -12363, -7887, -1245, -2108, -2303, -2691, 523, 1125, -984, 5067, 7846, 6113, 7617, 5937, 8078, 9253, 3379, 4021, 2730, -3465, -2817, -1743, -1781, -2411, -5533, -3678, -4233, -6146, -2131, -3811, -5702, -1897, -3283, -1334, 4044, 4524, 5141, 4343, 4971, 7166, 3732, 4872, 6496, 1175, 1001, 1415, 1183, 3748, -910, -2542, -182, -5283, -6348, -3613, -2583, -4123, -8181, -3196, 1300, -3893, -618]
680f18O049n025k513K658M353M06m806L688L375n526m37L929R50m049p036M804
696B02L212q872J088P285m024o117J169P606j819q982N823M769p454n00O805L566
712C757m141n369P929M235r053J018P308j668p729l08J1383j399j1681O641O626
727G549r073m434O653M835q576o652J0527L111r647J912P476j262q433m40J1975
742E521j716j2254O781Q674p014n654Q302P901j0214q420J3268K250j1747J363
756b959Q622o07j0023P98J3057l595j2346N843P377o423p378O921J0215j0300
770g98q836J4356M253j2315l97J0029k05j2614J372J4751m668j1682P095P345
784G686n860q366O205R708j1639r235J3191M584j1048k282J0985K387j4439J46
$$ y = [-618, 5431, 406, -2107, 551, 4904, 5310, 504, 4192, 7567, 2041, 1604, 5533, 6483, 2434, -4602, 202, 3414, -5458, -4370, 2915, -1109, -7226, -6057, 1549, -270, -9252, -3429, 1340, -6114, -6614, 191, 3757, -384, -5753, 2176, 6411, -2642, -1624, 5684, 4016, -3713, -4021, 7362, 5963, -5718, 923, 7549, -1524, -5958, 695, 5530, -3046, -9698, 829, 3940, -5707, -3795, 3681, 2419, -6014, -6454, 5521, 3805, -8449, -1668, 7006, -8, -5662, 2640, 10541, 327, -8093, 5175, 7425, -4322, -2959, 5663, 5056, -4967, -4169, 8888, 5293, -7053, -1210, 6167, -256, -7634, -713, 9502, -798, -9634, 4722, 8975, -3340, -3737, 6292, 6087, -6527, -5155, 9596, 4928, -6754, 341, 7686, 1826, -6540, -335, 9373, -2266, -11501, 1690, 6274, -4774, -7056, 3929, 6316, -8123, -7977]
798g977J6409n421j2812O806R174n346q453Q710J0238j1664p955J1979L461j0615
812c466l563J0385L551j4417L81J6298m808j3502N009R225n715j0896Q636J1524
826H642j2501o528J3550M355r530l524R926L307j4095K28J5037k916j1701L751
840a999J0466l977j2431P435J0474j3462p927J1741N165r162m240J1571L280j3815
854f881J229J3384l511j0216K822J0439j866j0902Q021J0635j1272p123Q871M800
868H430r626o308J0387K949j4139K101J2137l223j0219J361Q959k698j0717Q154
882b452R504q371n064Q902O828o595o719J0301K725j3072J246J1022k027r285
896c057N36R550l561j1155N896O289r625n865O468O433n680n725J0484L567j0637
$$ y = [-7977, 8432, 3011, -9801, -2995, 6179, 833, -7620, 1090, 11328, -336, -8291, 3688, 7149, -3466, -7029, 3356, 6907, -7510, -7129, 9169, 4361, -9141, -4132, 5093, -622, -11518, -2882, 8642, -3859, -10387, 3163, 7518, -2012, -5536, 4390, 7697, -6398, -6170, 8867, 5951, -5750, -1999, 8467, 4490, -7941, -506, 9968, -3494, -11421, 320, 5485, -3677, -7917, 3654, 6934, -6881, -5652, 7732, 4221, -5995, -3173, 7266, 5400, -5502, 2519, 13154, 1882, -5241, 3630, 8430, -1196, -7504, 2883, 5832, -8307, -6206, 5931, 2708, -7511, -6150, 2809, 111, -10606, -2452, 7052, -1319, -6383, 2519, 9347, 2752, -3967, 6334, 9059, -4013, -2767, 8255, 6228, -3057, -2521, 7029, 3468, -7687, -1791, 4498, -5127, -10992, -4524, 1909, -3771, -9496, 988, 4555, -6082]
911f082J199R330m94q173K02J0940j245q923P381O569p516n539L991N012p009
926c57o875Q230J531q741Q30O790Mp455k137Q584j647p789O116O058l695l163
942c716M832O978m467n268P019J076p157P27M801J225o413j293P091k569p399
957d533L051J995m057m148K271N859l558l273O450J460m348M37M242J995m974
972a131r62P570q45l391L399K025k097m095L33L795m818l920L931k14k638J96
988b862K040J563m541j195M340j306k151K623J973N82j257K132M308l252j785
1003A212K249j612p76n78P46J922l339j011K818k033j381j69j299J60k034M00
1019d725M298j467M03K293q31J171j70J93J164k063L46J981r28K187n09k272R84
$$ y = [-6082, -4883, 4447, 3953, -4220, -4018, 6922, 5677, -3246, 4135, 10704, 3188, -2351, 1640, 6652, -357, -7232, 998, 2529, -6212, -5382, 1408, 1412, -6043, -8180, 404, -1243, -9032, -2916, 3142, -553, -3716, 1116, 8094, 3627, -1641, 5378, 6454, -703, 24, 4825, 6050, -363, -1656, 5435, 2866, -4533, -1482, 513, -3544, -7692, -5421, 438, -3120, -6393, 57, 1517, -2831, -2394, 1848, 3843, -1131, -2093, 5477, 4632, 1241, 4640, 6665, 4568, 473, 806, 4601, -217, -4137, -206, -420, -3058, -2862, -822, 741, -3800, -4995, -655, -1961, -4112, -1489, 484, 1066, -191, 1941, 6249, 2997, 1212, 3461, 1849, 1073, 495, 1241, 3163, -176, -1187, 1631, -402, -1783, -1952, -3251, -3091, -5125, -4725, -427, -1894, -1491, 802, -29, 1142, 972, 1165, 2329, 266, 612, 2593, 1665, 3852, 3343, 1071, 2055]
1036B055j994j638N47j535p1r00q62K556k93l61J608j142M26m53m30L225K8j243
1054d77K729J425J53n53K67J446l830k489L365q78k241N49Q7L98k309q37L410
1071B15k639k734J471J409Q46j105K022M709k745k271N065N00l342l82J974J197
1087D190l880N52M803l176l471J148L98j522l879J067L308l862j976N025J597
1102C22k123j476L515K158n612J035P150k509k753L000L383p08m556K053L466
1117F345o474k863L931N72l235k875L530K521o898l58O590l002m941J524N721
1132H8o33m618N012N790n306j771N450J684m035k975M786K469o458M68N861j715
1148D097n990o93M882j803p971L710N213n947k654N768L565m151l281O214K265
$$ y = [2055, 61, -1577, -1030, -2565, -2636, -3536, -4398, -1842, -2135, -2496, -888, -2030, -1604, -2057, -2487, 738, 766, -477, 2252, 3677, 3830, 3277, 3544, 4990, 1160, -1329, 2036, 1158, -1083, -534, -447, -49, -2358, -3195, 215, -2424, -5158, -3687, -2278, -1432, -2537, -515, 4194, 1449, -822, 4243, 4743, 1401, 1019, 2993, 4190, 310, 862, 5665, 2489, -982, 166, 564, -958, -4837, -3770, -462, -4324, -6300, -1275, 322, -1801, -3277, 238, 2396, -3216, -2181, 4969, 2460, -293, 2707, 6090, 5382, 826, 2879, 6345, -129, -2992, 939, 1511, -1724, -4599, -1069, 1452, -5446, -5804, 786, -2216, -7157, -5633, 88, -545, -5163, -151, 5639, 333, -1438, 4012, 5696, 1661, -1314, 3472, 5941, -517, -49, 5812, 4097, -1893, -2586, 2296, 493, -7478, -3768, 1445, -4502, -7156, -1388, 2177, -1974, -5255, 959, 3224]
1163C224o813J632O582r05m088M77O615m97p633L245M491o079m601M237L828n579
1179a864m634P224K070q176P82N793j438n517P63P257l54n643M919N197m133l468
1195a222L785M664n091n853O848K412p873M46O059j271p028q09O612k620o940
1210g881M451M129l573k528L709N941l762n060O984K587o260q3N993J370o352
1225c35l88P990k517p335L591L136n100m288L001M770n065m069O401J715n539
1240d032n27M644K184o423m87Q710o38n962M223N206k925n252L372M846o276m236
1256c573N648J163n075j127L715J158o215j850O622j488n684K136N120q58m201
1271d509L708O846m658l790O253J466m504q89M457J230n768m07N461j988n188
$$ y = [3224, -3589, -1957, 4625, 3720, -368, 109, 6724, 6227, -1406, 1839, 6330, 251, -4350, -113, 3715, -1864, -6498, 726, 2796, -5380, -4598, 1195, -243, -5760, -4997, 2260, 1906, -3737, 1182, 6379, 2246, -1222, 2563, 7227, 2136, -3717, 3131, 5543, -2330, -1884, 4175, 2904, -4124, -4933, 1679, -941, -7881, -3430, 699, -2874, -5402, -1693, 4248, 486, -4574, 2410, 4997, -1263, -1346, 4647, 6017, -335, -723, 7267, 4750, -2585, 1006, 4142, -958, -5246, -2245, 2525, -2540, -6609, -208, 1507, -4032, -4559, 85, 2269, -4154, -4641, 4069, 3431, -2531, 1692, 6898, 3973, -1279, 2093, 6939, 663, -3573, 2075, 3238, -1837, -2964, 751, 1909, -4306, -6156, 466, -1022, -6706, -4570, 550, -308, -4509, -801, 6045, 1387, -2403, 3850, 5316, 812, -77, 4380, 5610, -158, -565, 4896, 2908, -2280]
1286b280K50K153j634n520K225N107l967l483N164K215l110j656M856K374n838
1301c144J687O168m48k858J968K797r22m302J767L119m262l526K352J427k666
1316h43l227L301J796o271o80N122j348k989J392L469O04l214L642M138k844j348
1332G00K433J171j196k221K571J844m213q38L241r42l681j283J903m95m915K484
1348c437K881l056m27K198J575q36j442K799J646k601R65K584O36o97j247K336
1364C877m1l884Q76J949l326j742K64J178j269j897K026qk509O99J356P3K54o45
1382b769K707J490j516K118J516n03o08k99J304l79k235J624j31k343O56p73l40
1399d81q79j772P99o19j022J241jP15R77p24K003J171j138J291L43l65J001J87
$$ y = [-2280, -2030, 123, -1511, -7031, -4806, 301, -3666, -7149, -1985, 230, -2880, -4536, 320, 2694, -3144, -1457, 4711, 4263, 1405, 3373, 6170, 5248, 946, 2713, 5832, 1570, -1956, 396, 1823, -843, -4070, -769, 1027, -5244, -5924, -802, -2150, -5139, -3747, -278, 326, -2888, 754, 4892, 2048, 700, 3133, 4304, 3108, 887, 3458, 5302, 1089, 251, 3492, 2550, -1131, -2414, -511, -1006, -5921, -3437, -556, -3612, -4039, -1841, -266, -1102, -2544, 255, 1901, -700, 265, 2849, 3485, 2788, 1541, 3877, 3836, -48, 828, 2777, -549, -2291, -2027, -849, -2118, -4015, -1989, -1997, -4506, -3807, -2451, -2378, -2124, -2769, -62, 1428, -88, 2030, 3546, 3043, 2435, 2136, 3440, 3061, 826, 2450, 2319, -24, 632, -141, -481, -1360, -3132, -2333, -2952, -3974, -2733, -2734, -2019, -1042, -1766, 237, 1408, 270, 1561, 1904, 1539, 2540, 2727]
1417B727O79J59j298Q41j418o68L47k097k65L09k127N44P89n89N13n34O55L69
1435a064j007J865O81n18J113L74R95J217j817Q74L42j752k37l2p2p34k098J224
1453f46K58l047J075M46j405n56J46J865M47j487K271J524o74K41J424J302p95
1470B389j634K261R85k679O49J290r76k220j033J943j333l455J106J010j981l46
1486d024J070J848j159j849L220J075j952R76K246J051j200l75L868m29k864J600
1502C102J109k178j828L24J843k657k566K759K1k800j30J376L37k512k77M243
1518A66l01k331J965K688m06j850J813K778k717k153L433P53l227m80K022K67
1534B420l770q97L204j318l404R74J997q19k192J525L646k587j609L475J023j710
$$ y = [2727, 3406, 3565, 2267, 3108, 1690, 1022, 1369, -728, -993, -684, -2811, -2267, -1478, -2067, -1554, -2088, -1433, -1064, -2071, -206, 475, -43, 1070, 1444, 2439, 3656, 1839, 2713, 3055, 1303, 1066, 1034, 962, 228, -1870, -646, -388, -3435, -2360, -1914, -3319, -3875, -3729, -1864, -1417, -2904, -633, 891, 217, 458, 1882, 3184, 2389, 755, 3016, 4001, 1322, 1971, 3261, 2285, 65, -968, 975, -358, -3813, -2707, -1697, -3678, -4024, -2954, -1106, -2265, -4114, -894, 181, -1771, -795, 1451, 2502, 1302, 927, 4795, 4366, 1502, 3102, 4211, 2033, 205, 529, 2372, -285, -2851, -92, -71, -2871, -3001, -1625, -1288, -3800, -4077, 166, -135, -2466, -501, 2187, 1781, -69, 1744, 4522, 1805, -348, 3085, 3838, 611, 131, 2153, 2420, -1350, -2247, 957, -361, -3765, -2791, -794, -1613, -3805, -2280, 1366, -1221, -2830, 645, 1668, -42]
1550d2r85L033J558l440k60M241j043l391P25K008j141l416Q65L218l215k509
1566c794L034J021k439j462K759J663l804l3M592o79k450J183K890m87l163K142
1582I73L045k850k263K384J539k453j748K636J242m425j75L489j146k812K83K721
1598D40k8l517J924L615k482k103K456J849j763j922K692K063m309Q0L631o48
1614A978k759m07K465l53l964K072K464k518j697J710K171j534k399K952J985
1629B166l631j00L529J87k512qL221m16l245J585K054k213j908R92J621j427k644
1646b749K536J416l533m86K388Q55k926k85L579k7l006K142K694j686j441J222
1662F93K135j513k225K784Q09k848k57J687P28k572j532K975j78l538J305K285
$$ y = [-42, -1027, 2006, 3564, 124, -136, 4105, 3062, -329, 396, 2404, 1263, -2153, -1288, 1930, -1285, -3794, -760, 261, -2178, -3640, -881, 782, -3022, -3055, 1537, 858, -1592, -409, 2481, 1994, -1169, 973, 4018, 1168, -1095, 1289, 2828, 375, -1373, 1263, 2505, -1920, -2095, 1394, 248, -2564, -2281, 440, 412, -3105, -1181, 2434, -48, -2151, 305, 2154, 391, -1531, 1161, 3224, -1085, -1005, 2626, 1978, -781, -1188, 1277, 924, -3040, -968, 1496, -1022, -2719, -1009, 1162, -372, -2771, 181, 2166, -1465, -1565, 1964, 2151, -361, -369, 2852, 2436, -809, 776, 2830, 617, -1291, -299, 1322, -105, -2749, -213, 1203, -2330, -2816, -428, 427, -2499, -2784, 795, 768, -2238, -96, 2598, 912, -529, 693, 2828, 1315, -910, 1874, 2683, -165, -422, 1265, 1993, -579, -2111, 864, 686, -2852, -1547, 738]
1678G38j466j635R99K432j394j943K688Q65k060J13J689Q21j752p10K362j52k190
1695e95Q29J281r35k136K62K423j404k174K151Q68k484L2J532J010j983o09K938
1712A006m81j245Q89Q87R7j298J36K039r65k229J774P94j316j013J178Q13k201
1729a135o33K312q10j247Q08J97M75j005J06J880o29j155J306K86m53n97O33J616
1747A955j787q66K258p78o85n8N34J71j379P0J185q05l36Q17k81J94m90q6J205
1766H38j216m61J147q5j39k65M77M16j209M5J253q20m06M27l34M33m01n1P92q05
1786c64j67L79p7M36q33K43J125q29k14R85o40K6mk2K49m68J22K27n36J42k15
1807d35j31N52m20q93P15n7k84M19J78P72j139J52J122p31L20L20k49O90k65k37
$$ y = [738, -728, -2363, -1364, 1068, -326, -2269, 419, 1284, -776, -663, 1026, 1847, 95, -615, 1747, 1595, -595, 234, 1515, 580, -1556, -1294, 1129, -275, -2449, -298, 570, -1914, -1882, -350, 660, -1323, -1932, 1006, 525, -720, 169, 1056, 1153, -145, -9, 2030, 1065, -1164, 610, 1404, 88, -925, 253, 1066, -1135, -1768, 544, -266, -1513, -705, -508, -33, -1038, -932, 948, 319, -836, 470, 756, 303, -294, 339, 1955, 168, -698, 1560, 782, 97, 39, 573, 744, -635, -565, 620, -185, -521, 296, 15, 209, -281, -367, 838, -378, -839, 308, 223, 84, -181, 296, 712, -497, -452, 801, -19, -425, 2, -332, 101, -300, -351, 441, -364, -531, -152, -229, 207, -626, -383, 742, -87, -301, 684, 44, 70, 66, 44, 293, -175, -53, 174, -362, -220, -435, -566, -14, -434, -1327, -612, -669, -953, -534, -356, 416, -723, -571, 551, -180, 140, 460, 211, 901, 636, 399]
1827C99R66k27r52Q23k42q6p91K01P05j315o61J344l50m62K54o4L11o56J73Q94
1847B64k04l63K76L60O52j059O14J156j492k12J182l63l67o79Q29K52j684L36
1865e02J141j108m03q6N27L11j162O13J315j017n45Q23O57l57p46J092P73j653
1883c27J42J509n95q54j78P10K94j500M05R26q93r16P73N70m49j337R69J159j852
1902a444K6J969p8j255J89J496J04j706J118J396j372q17R18R47o06j464J134
1919E55Q37k073j36J341k10j297m05J618L50k584J477J191j069o26O92J478q86
1936B53j088J268R59j501O6J174J79j041r09J927P5k480P34J423j058j115L73
1953g61J794j321j941K419O00j701k5J198K38p08o98K025L6j718K89J248j45j510
$$ y = [399, 1365, 1138, 186, 1009, 767, 681, -110, 91, 796, -519, -1180, 164, -186, -648, -394, -458, -147, -803, -630, 264, 60, -303, -27, 333, 985, -74, 540, 1696, 204, -8, 1174, 811, 444, -235, 594, 846, -838, -502, 639, -469, -872, -958, -431, -120, -1282, -669, 646, -371, -916, -93, 564, 207, -539, 553, 1326, -327, -185, 1324, 729, -125, -303, 407, 701, -799, -394, 532, -361, -1277, -504, 66, -383, -1720, -751, 408, -1444, -1418, 551, 473, -782, -593, 903, 1007, -699, 419, 1815, 443, -374, 544, 1491, 885, -579, 555, 1392, -681, -817, 524, 314, -983, -1388, 230, 580, -2004, -527, 664, -405, -1031, -339, 1139, 253, -835, 433, 1392, -109, -43, 1131, 1310, 269, -640, 1287, 1362, -1118, -384, 1039, -19, -1134, -761, 1033, -288, -2229, 190, 790, -911, -936, 262, 500, -208, -906, 1119, 1155, -563, -274, 974, 829, -681]
1971f81J78K088j239j727J320J002j855l98J532K60j348l84J979M2j693N78J228
1988H82k56j090K67J843j150j247J141R16j310n92R01Q98k036o60K299o06j666
2005a466P64J029q8j429K34J970r04j382J271Q23p77o67J075J097j591q46K423
2022A536m71j551L45P48J85j605K36J991j461j413J538P6o39n33N81J193j583
2039h27l4J498r4j102K01R13M82j687L25J548p12j420R90O92o22q18O53J169j839
2058f84m87J164K72p06o17J036M03j333J97J513p40n00M71O99k39j071Q80J049
2076A307j347k91J217Jj089q3Q48R7j432L66Q87p67o27M08Q66m40o76M15Q61j293
2096g72o6J130J27m73l12O72M40j147L2J109p54k08J18P03j51j175N98P69q67
$$ y = [-681, -503, 1585, 346, -1381, -61, 941, -914, -1312, 220, 480, -868, -1252, 727, 769, -924, -346, 882, 626, -464, -197, 1646, 496, -751, 390, 1306, -4, -596, 305, 1203, -833, -1493, 806, 200, -1466, -702, 327, 239, -1190, -956, 1014, 110, -1272, -1, 822, 45, -622, 453, 1550, -41, -887, 1536, 1065, -486, -141, 607, 792, -813, -577, 1414, -47, -1460, 78, 154, -485, -1018, -437, 756, -827, -861, 637, 543, -559, -358, 555, 1037, -650, -325, 1223, 511, -909, 81, 773, 151, -667, -14, 1155, -684, -1171, -7, 265, -441, -1058, -22, 381, -952, -755, 758, 18, -482, -11, 688, 449, -622, 258, 1307, -40, -331, 886, 887, -202, -285, 563, 660, -772, -406, 481, -286, -913, -505, 361, -79, -755, -340, 521, -772, -838, 292, 419, -54, -366, 306, 746, -401, -369, 740, -14, -222, -104, 599, 448, -727, -129, 640, -227]
2115b27j11L69K34j75p51J052q0j128N46P15m93j85k35Q79j82j216P73O18p05
2134c02r8K80J08K64r56O79K76r64Q34n5J23j64j25Q16n8q72N06m5m0p3J12K4
2156B70k59m71N68j44n12L27R5L52o08l53O93j85m12P56j15NJ39j85L64K5o25
2177b75P16N0n10M22k30L07l26j96M74n91O4K37j34j92R5l43L30o7m65M31J99
2198dN3J14m41O01M1l20L08J64k04L13p20N04j70l02L01j0k60K25n66L53O2p84
2220g42M94%n24M15L35j05Q2m54O14Q9l85M54Q5J03k10k35O25k47m39K23L82n32
2242B8k95J06P37m85p12N22M3l33k8J11L99l87l42R63j68q18Q26K85j03m12J43
2263H0R94p65n59R14j34o03J05L6L34n97k79P89k73p37N35j58L48l17k53J267
$$ y = [-227, -338, 31, 265, 90, -661, 391, 311, -817, -271, 444, -49, -234, -469, 410, 228, -988, -215, 403, -302, -400, -120, -12, 252, -704, -25, 251, -713, 121, 66, 189, 25, -100, 716, 658, -214, 292, 247, 207, 134, 246, 270, 11, -460, 108, -36, -548, -221, -126, 226, -382, -735, -42, -227, -639, 117, 2, 7, 146, -39, 325, 350, -275, 441, 491, -19, 403, 173, 480, 154, -42, 432, -159, -95, 142, 8, -184, -89, -432, -102, -169, -634, -203, -4, 49, 163, -278, 323, 364, 44, 352, 516, 312, 625, -95, 409, 239, -63, 238, 228, -32, 193, -373, -20, 42, -742, -248, -248, -772, -357, -22, -127, -45, -499, 115, 204, -181, 273, 358, 461, 251, 16, 641, 394, -45, 178, 560, 28, -267, -161, 576, 91, -621, -99, -56, -389, -417, -306, 93, -294, -636, 327, 159, -659, 167, 452, 349, -63, 80, 1074, 309, -250, 664, 530, -73, 32, 68, 402, -195, -474, 315, 42, -695, -160, -318, 30, -287, -540, 727]
2283G27p03n97Q64J72n27j25M46K59o51O7N54l62o19N78j6M6k00m15R37n23m99
2304e87L75N67n01l52K89J065r96l85J225l66o19K53N60or57J83J043p78l42J83
2324a46K30o7n47J61O80p07n58R11J82p73q7R76J63j022K74J258q50pN09J23l02
2345D01n28K18Q43j053n29Q07L80o90m11M65N77j503N43J069p58p00O96L83l02
2364i2l95L70R54j148J57O71o6k68m11O04J63p05J50O66n98m12J47Q24r76k64
2384f29P15K04p25PL18l3j31k91Q40M52q94l7O47j4n48L7P81j32r63O89M61q31
2406g7l44L37K57l15m37R43j39j042M18O95m68k78M0M38N3o36N95N71q49R5M05
2427B62L15n82k23P90o1q06J96M21K6o75Q9O04l37m75M40Jm3l22m2Q47n10o98
$$ y = [727, 24, -573, 291, 463, -64, -189, 257, 516, -135, -68, 486, 124, -495, 83, 67, 113, -87, -502, 435, -88, -587, -212, 355, -146, -498, -209, 856, -140, -525, 700, 334, -285, -32, 528, 522, -435, -252, 791, 13, -329, -146, 84, 17, -530, -369, 311, -396, -954, -43, 139, -634, -721, 255, 418, -604, -330, 928, 78, 71, 580, 703, 401, -127, 91, 934, -119, -648, 159, 539, -151, -562, -97, 480, -1023, -480, 589, -169, -869, -173, 210, -92, -487, -117, 837, -311, -154, 517, 451, 183, -228, 376, 539, -166, -16, 650, 52, -360, -213, 611, -365, -629, 86, 290, -435, -428, -110, -143, -274, -565, 275, 727, -167, -204, 443, 429, -119, -82, 699, 567, -396, 293, 754, -77, -421, -84, 173, -142, -579, 364, 225, -817, -399, 296, -172, -450, -410, 28, 81, -555, 40, 611, -238, -143, 262, 577, -5, -228, 562, 501, -305, -109, 312, 338, -337, -248, 356, 19, -456, -16, -15, -58, -380, -422, 425, -85, -783]
2449g83Q55N25r30J98M51j99m13J79Q82n22o72P47L67p78M0J4N16o60m16O81L58
2470D40n33P8J76J03m02l40P79j40n46O73N7l61l2J21K89m67j3L31l35r9J53p
2492g5L58l79m02Q40q4p31M39J33k12j79L61N56o59j34N29m8m72K29q4L26l51
2513c9j92J85L4k31j8K62P0k54q8M76m34k64P45Jk97J70K58k35l97L57K94j43
2535B60J5j43j06K29m33K17J13l60J6L25l70K64m99K15L52m10J06L65k4m10K96
2556A8K01J44o04L69R3j62L10j64k94N12k99J80r2l27K46k18j43K49k96r3M93
2577A23n39K27k9k7J19N6P9L03l46j16O18l68J78j14J6l0j68L9Q5R8k67k09j10
2600c82M73n35K04L86r3l65M04j16J00l33J41M09l55J07J99j33J91o5j89J71m05
$$ y = [-783, 72, 597, -333, -135, 316, 117, -296, -117, 765, 243, -429, 318, 685, -93, -53, -39, 477, -183, -599, 82, 440, -93, -15, 161, 264, -138, -478, 301, 161, -385, 288, 345, -16, -48, 73, 362, -105, -118, 213, -122, -221, -68, -75, 283, -96, -498, 342, 258, -473, -34, 99, -113, -292, 69, 625, -34, -168, 361, 313, -159, 70, -14, 312, -39, -231, -46, -12, -243, -261, 1, 71, -183, -271, 205, -229, -493, 252, 253, -44, 126, 384, 149, -248, 109, 403, 260, 275, 132, 26, 255, -178, 39, 152, -208, -192, 133, -237, 27, -472, -257, 95, -315, -209, 156, 132, -278, 18, 219, 363, -241, 128, 221, 59, 369, 205, -89, 423, 124, 304, 212, -115, 131, -87, -230, 19, -277, -370, 123, -416, -189, -218, -245, -126, -70, 9, 312, -34, -150, 468, 100, 278, 164, 180, 150, -18, 21, 106, 204, -63, -272, -382, 91, -444, -240, 146, 53, -312, 92, -24, 76, -257, -116, 293, -62, 45, 244, 111, 302, 237, 48, 219, -186]
2621a86J95J36l7j83j16K14j11m81N23L74o65j14L28R0k99O03k57M52o87O0O67
2642E06m73j35J15J18J54l80r5K12k49j37L58l4K49m54J86K63n54m0M31J6j90
2663a33J26K73O2m81K45L20k67k57r1M02J64n50Q9L68l93j28O8K14r7k17J87K23
2685A27n82L95J50O2j98J8J72j23m26P84j33k33J41J9pj64k92N15l8m97P2M79
2707B41m73M1p5L29po91N44K82l15j75J95L22o0k94L62j73j96J09K32K1j09l02
2729a92O90l88l60L89J03l38q2K29K16l47m57M74R1o62N77J81J1k50K7O24m62
2750G4k47L58J74j88k58J16O37o10m9K62k53N3p7J46J57n78L0O28n13m39N89l49
2772c37N23m18j13M85l74Rk3M72m14j2K89K30n48K56L23k1m86J31K18j63k57K32
$$ y = [-186, 9, 145, 108, -75, -191, 23, -88, -569, -46, 328, -337, -451, -123, -33, -332, 271, 14, 466, -221, -161, 506, 33, -102, 13, 131, 285, -95, -190, 22, -227, -364, -6, -40, 209, -245, -59, 204, -350, -390, 41, 57, -133, -7, 266, 328, -153, 92, 412, 145, -112, -203, 199, 363, -187, -98, 270, -123, -251, -183, 31, -66, -283, -96, 127, -455, -60, 90, 152, -46, -28, 144, 21, -405, 379, 246, 13, 154, 173, 166, 2, -290, 225, 187, -310, -238, 241, -232, -191, -266, 63, 56, -635, -91, 191, -124, -299, -104, 218, 158, -136, 226, 53, -143, -34, 198, 219, 110, -192, 498, 110, -250, 139, 242, -96, -178, 51, 267, -80, -537, -63, 28, -634, -57, 124, 135, -115, -88, 536, 74, -173, 185, 359, 171, -87, 29, 666, 56, 7, 269, 16, 69, -8, 138, 295, -283, -253, 375, -138, -577, 12, -337, 186, -232, -345, 140, -234, -225, -248, 224, -190, -202, 87, 317, -231, 25, 348, 327, -159, -28, 190, 27, -230, 2]
2794BK34n22j95N34j31M1J5J17L1l88J85K04m3k6O7l1J43n13L61J79k71j26J84
2817E1P8M8n42N33K93o67J09J67k2k20K29j75K37l77Q7L49j39l53K36J13K33m26
2839a58K4L82j84oK93o08L32j70K13J14l26j20O16l22k76K08J2P9n30O05j49k34
2861b05J87J75k5j07r0K37J30m81L64P6l25%j7M4k23j14L33K89m47J7J77J03l72
2884b74k9L01K04k95K74R3j06j67J35J36j56q4J2K74l90LK91j54l73o1M48k32
2906a50q3J95j02j18L28j68K32k02rJ29N8n7PQ8k3J7k61J26J29k61J06J0Q9k41
2930a61rM32l04k92L47P6j45l2j91M52l29N3N4J29JM7N8P1j65n1l5Q3k60K09o3
2955b5jk16K57o6J51k59K33k87m5J59p2L34k1k28J57J1m9J16k51O6O1N7p4J57
$$ y = [2, 236, -286, -481, 53, -78, -37, -22, 95, 126, -262, -77, 127, 84, 58, 125, 94, 237, -276, 85, 264, -7, -133, 51, 129, 177, -365, 168, 461, -206, -97, 70, 48, -172, 57, -118, 119, -258, -171, 178, 39, -314, -78, 35, 268, -158, -134, 248, 64, 58, 351, -257, 75, -95, 118, 232, -94, -214, 402, 80, -196, 12, 24, 103, -427, 178, 29, -205, -18, 157, 132, 25, -65, 172, 302, -179, 185, 261, -64, -64, -81, -37, -260, -374, -41, 248, -199, -182, -5, 98, -274, -303, -2, 202, -93, 181, 274, 168, 1, 136, 272, 116, 32, 44, 318, -72, -69, 222, 68, -305, -366, 82, -150, -233, -38, -140, -258, 70, -98, 134, -68, -77, 52, 110, 53, 60, 148, 125, 142, -119, 7, 136, -125, -19, -9, 80, -161, -170, 262, -42, -334, 13, 89, -56, -88, -279, 173, -156, -103, -49, 80, 81, 128, 186, 257, 92, 41, 6, 89, -171, 38, -25, -26, -242, 15, -51, 100, -159, 74, -213, -258, -99, -171, 163, 142, -86, 71, 82, 33, 149, -102, -36, 25, 82, 8, 165]
2979A65l01K55q2J42p4l39J5K66k39M37j67l9r9M7L2j27m51O57j47pl7K12j53
3002c4K39m04J72R0j06N7j23L84l13p0K4J49l54K94J65k20k33L90r9O3j75J47
3024D3JQ3j42j93L61n22L34L09k60j27L3Q2q1n5J04M6J5j40J02j02l2K24j90L40
3048B33k04P7K19k75J37j34N1J65q6n02M99j79k26J67l2j08K6J09J50k43K12M4
3070A00k44J32l5qK35k27M0K18R2m26J10L74k64k72L49k3k52j08L34l02M45m45
3092a77J11J70m06L05J80n96L51P1p6p0m6N8O59l24j24K50p9p9j55L88k48j91
3114b8m9L03P5l82J36K3j05j70j06L59j63j64J39M44k4o13N35n6m06K46K86k2
3136B58L0j49L01r1m96K94Q6q1m39L52J90l45n7K62l6k46M7J11K71l89n6K16L16
$$ y = [165, -136, 119, 37, 179, 105, -234, -219, 47, -192, 245, 78, 39, -60, -13, 19, -108, -559, 98, -49, -56, -93, 119, -34, 205, -199, -27, 63, -43, 14, -109, 275, -38, -108, -84, 65, -289, 5, 170, -50, -283, 107, 8, 71, -104, 43, 44, 127, -15, -208, 153, -369, -35, 274, 14, -113, -80, 2, -79, -134, -30, 16, 31, -109, -7, -109, -141, 83, -107, 233, 29, 106, 325, 50, 187, 53, 104, 269, 183, -319, 180, 1, -225, -58, -90, -198, -172, -63, 87, -156, 56, 100, -144, -12, -47, -55, 180, -47, -7, 211, 303, -123, -13, 361, 97, -175, 174, 151, -101, -209, 125, -177, 268, -177, -66, 104, -302, 3, 183, -413, -62, 9, -67, -137, -183, -125, 534, 210, 86, 336, 257, 178, 23, 411, 163, -28, -77, 226, 301, -81, 55, 78, -27, -197, -303, 56, -107, -271, -132, 312, 288, -325, 210, 154, -252, -6, 280, 258, 288, 139, 440, 349, -147, 147, 233, 152, -287, 65, 255, -90, -147, 115, 79, -167, -120, -9, 262, -127, -183, 33, 349]
3159C49o42K35J79r0j70K92l0j27j57K13K61m72L25K4J70l64k96L59Q1o71N48
3180A7J44l08k6L48K67o92J26N4L73n61L35k58K98o1m64N01J05j76n6K58j72j42
3202i0L4Q8j53j61L10K28m03L09k54L29l99J7L85k70r9J85r4M8K15k94L66n9l80
3225a42K50j12j67Q8n0P9j83O1J62N9l50L50nJ70k09m5K97k82N9j13L8K62k68
3248e1K7K77j98k47K71o2j79J19j17J85k2l33M36m63J04N1L4L32k01L7k6P0j0
3271C4K12l50l1R5J88j58K34j84K92l77q1J34j47P9o2ojP2j3N7j46K63r7p6K24
3296A55j04o3OK44j46m6j15M73m01p4J55K8k25J81j0J80m16j72O73m93K63k06
3318a13J82J01l28J34L1l67M09n8Q7m56M51j0o8J2K54l6k5l06N2k0R7k0o6J13
$$ y = [349, -293, -58, 121, 31, -139, 153, 123, -4, -161, 52, 313, -159, 166, 190, 360, -4, -300, 59, 140, -531, 17, 161, -147, -173, 175, 442, -250, -124, -70, 303, -258, 77, -181, 117, 56, -408, 93, 198, 22, -34, 224, 52, -90, -56, 32, -121, -282, 28, 256, -147, 162, -92, 237, -162, -145, 240, -30, -129, 56, -38, 10, 225, -69, 297, 238, -142, 108, -4, -171, -83, -133, -54, -237, -176, -14, 45, -305, 45, 40, 210, 1, -44, 253, -29, 30, -83, -45, 217, -51, -24, 253, 55, -192, 79, 17, -162, -43, -160, 25, 3, -330, 106, -357, -253, -202, -168, 164, -37, 0, -26, 44, 34, 246, -104, -135, -40, 148, -10, 224, 40, 332, -45, -126, 8, -139, -60, -122, -128, -129, -57, -70, -13, -159, 104, 7, -69, 155, 51, -12, -6, 238, 92, 46, -69, 404, 3, -71, 84, 112, -113, 68, 58, 238, -178, -350, 323, -170, 93, -113, 69, 170, -158, -24, 7, -360, 49, -9, 78, -378, 73, 63, -5, 7, 261, 225, 200, -106, -54, -74, 23, 3, -63, 50]
3342E0N0k26J59m61L57M2k07M14k45k63K23k9k00N79k34Q1m63L11J35k70N7L76
3364B36j81J43k57K24j44J14m63L91k2l5J32j01K9m0k64o0M09r7K93n22J93j88
3386b10K04M8j5M3R7k35K82j37k77L94n1O9Mj82K06k31j30K74k91J72l0l6N4k78
3410b56K40J54j52r5J75j91J7L09l08M02m76m9M88l18J09j75K43m25m5K72n6K9
3432a08K46K8k56r8L70k46j58O6J40lJ14k92K82j91J01J3l52L13l7K16j61K17
3454B04L5k81P1j3j87L60Q1l43L9K73N4l02p5L05k10j3J70jj38n0K23q6j33j06
3478a23J06K93l17j82L03q9o2k33M44j89J56l3k4j90J80K0K09p6k40J19K37j11
3500A98l91M08j42r3j35K43J21k96K71j99J78m34J1M41k99N5J33K16m17J25K82
$$ y = [50, 100, -126, 33, -428, -71, -29, -236, 178, -67, -330, -107, -136, -336, 243, 9, 90, -373, -62, 73, -197, -140, 236, 55, 198, -59, 165, 21, 135, -328, 63, 41, 6, 138, 37, 66, 26, -238, -298, 111, 14, 307, -215, -22, -210, -6, 42, 27, 70, 167, -68, 214, 77, -200, 194, 143, 212, 216, 34, 240, 9, -121, 153, -138, 34, 4, -32, 22, -256, -16, 138, -14, -109, 66, -125, -108, 201, -107, 295, -181, -230, 258, -60, 49, -126, 117, -308, -353, -81, -137, -108, 138, 166, -90, -188, 182, -64, -222, -156, -16, -19, 95, -197, 85, -106, -5, 8, -344, -31, -68, 148, -13, 204, 239, -42, 29, 16, -171, 189, 270, -73, -34, 239, 293, -9, -84, 221, 11, -2, 168, 167, 29, -21, 202, 116, -17, -123, -17, 276, -41, -223, 80, -9, -71, -304, 140, -49, 107, 74, 50, -140, 40, 60, 269, 193, -47, 72, 309, 198, -193, 215, 73, -20, -155, 88, 209, -87, 184, -15, 163, -271, -260, 181, -118, -63, 70, 286, -131, -6, 276]
3521B76K07n14M8k3pq1K29j32J25L0l35K58k71O8L56j0p3k34K09O4l13O9L33n60
3545b81J66k61J07%M0J01L26m00J27J66L06l09Qj11K52q1k45K3J79qm88L24L52
3568B93r5l85L88l37R3K29j9K1l32O8J48o3m02M98J44m61K46j99L6M5J21P2k15
3591a06j12M92k56l8R2j23L14j15l70N78m4k93O5j75O7j30J22n4o1J55p3N7k0
3614b8J45O6l17J51j44J49j7j26l4L54l38j03K92j95J64j1K10j20J9o3l9K0j0
3637B5J03j65p3J72m62J79O8m5l0n7L20j1L1K2p7j43K58L5j53n8J31J41k3l01
3661a13J79R8kK7l33J58k6j7j74K49j07O5j06o9K37m31O51l70K61j4j12kM7p4
3685B2P3Ml69L16l0K5J04j76j2M3j8l2J09n26J55O20l92K65l4J54m46n3J44K65
$$ y = [276, 483, -31, 17, -6, -13, -94, 135, 3, 128, 158, -177, 81, -190, -122, 234, 224, 151, -83, 126, 190, -123, -54, 279, -281, -115, -376, -269, -269, -229, -128, 198, -202, -75, 91, 397, 88, 96, -15, 237, 156, -89, -66, 113, 105, -383, -59, 293, 198, -187, 201, -136, -43, 186, 167, 188, -144, -76, 72, 9, -393, 105, 249, -212, 34, -165, -129, -84, 37, 109, -106, -218, 274, 18, -20, 72, -51, 263, 148, -222, 356, 312, 19, 84, -91, -24, -154, -32, -86, -147, 8, -65, -8, -28, 117, 183, -134, 17, -127, 22, 5, -121, -155, 199, -139, -242, 50, -145, 19, 8, 218, 98, 117, 54, 15, 35, 25, 128, -37, -110, 62, -400, -221, -153, -198, -228, -285, 35, 24, 55, 77, 0, -143, 115, 150, -3, -61, 70, 211, 188, -113, 66, 164, 162, 189, -144, 14, -12, -29, -203, 46, -61, 4, -102, -171, 66, -365, 286, -84, 177, 163, 51, 49, 96, 22, 95, 99, -270, 46, 16, 41, 145, -31, -43, 0, -18, -50, 59, -467, -312, 308, -84, 181, 147, 301, -145, -198, -54, 211]
3709B11l91J88j88K09K66m50K46k31k2K94j55Pr9r1J36L4j56J72q8L12k08o2j39
3732b05J02j70N8J99k25O15o72M5J84k10M36r4QO2j79j2J37O2k91K19j65O6N7
3755B7l8N3K1p4j60J03J64j93L14R0j61L5l45J79J89q5j44O0n1K4j65j24L33j8
3779C4J14j0k04o2J41J48j23n1l2J32L6j02K20n02L11J48m41L01L3j73O8M9nj50
3803a20J05O4j80k08J32L15k54K68j55q0Q3j5r0J59l8k54J56J05K64m91M33l31
3825a32N4J05k31l4K06r2L68k58j06L89m65K5K6q7K25J59k13n4L0r2K32k71N29
3848C13k21q3K60l22m1M1j2J77r0k48M01j58j51L62l42%J01J2j42OL30k31k2K15
3872A55l64j0j76L77O9K22n01J94J37l30J64p2j3L50k26qK83l74J54J0J8r4P5
$$ y = [211, -180, 8, -180, 29, 295, -155, 91, -140, -162, 132, -23, -16, -115, -206, -70, -36, -192, -20, -108, 204, -4, -66, -205, -103, -273, -215, -16, -241, 374, -298, -253, -69, -279, 157, 63, 71, 133, -46, -58, 79, 141, -150, 69, -96, -30, 27, -11, 42, 63, -11, -171, -68, 96, -97, 217, 307, 146, 181, -164, 15, 204, 119, -25, 35, -16, 8, -157, -281, 52, 34, 148, 138, -66, -128, 13, 161, 38, -13, -45, 87, 123, 21, 241, -261, 50, 198, -243, 58, 91, -82, -14, 35, 30, -120, -15, 49, -131, -339, -207, 108, -146, 122, -33, -113, -30, -45, -135, 24, -14, -268, -112, -7, 257, -234, 199, -132, -78, 27, -204, -238, -32, -124, 244, -14, -120, 269, -196, -171, -145, -232, -7, 152, -61, -115, -85, -177, 55, -216, 313, 92, 9, 269, -53, -94, -53, -65, 112, 22, -226, 175, 17, -134, 228, -114, -114, -13, -1, -143, -137, 193, -38, -60, 155, -209, -219, -395, -18, 51, 273, -228, -34, 103, -227, -63, -135, -148, 202, -24, -32, 251, -123, 31, 41, 59, -35, 40]
3895D0j30N7mj3J58r7k47Q0J91J95l87K22K45k28m0r0J60j87J15O8L35k73p1L15
3919D14l53J33k65J5L13l12p7J89N9k25K71%j53j72K19j41m8K71j49L3j3P6J10
3942A95l99K63P3j0J12j40o9J16j16j06pK40j96J31j35o7O2l3J54K42m22L10k50
3965e2j09J60R3J60l70p8J54K15j41P6j78n1J63j69N2K61k08R1k17K72n5p4P8
3988G3j05n4K86m61N09l08J59l57L39j02o7K40m8n1R8k37L6M9P0K6Mq6j65L18
4012A66k99o0K29k00L03N9K0l06k51L17q8J89j99J68j58k9J23kj97J89J66k10
4034g0lP9K33O2l82L4l9J39M4k86J44J03j42J01J89k58J09J02qo8O5k16N8K26
4058B16j75j67J38k00J56K95j65j27K08j91L6Lk66J95M1K39k05l9J04J1J7j1j56
$$ y = [40, -90, -33, -37, -50, 108, 11, -236, -156, 35, 230, -157, 65, 310, 82, 42, -48, 112, -75, 40, 108, 443, 170, 99, 414, 61, 194, -71, -56, 257, -55, -132, 57, 116, -109, 162, 162, 9, -163, 56, -85, -133, 138, -11, 22, 9, 85, 195, -204, 59, 132, 122, 234, 94, 25, 141, 25, -81, -88, 152, -44, 87, -48, -115, -53, -86, 68, 310, -112, 198, -52, -161, -1, 92, 252, -118, -196, -42, 173, 32, 108, -70, -121, 42, -127, -75, 186, -22, 69, -148, 124, 69, -5, 73, -32, -86, 200, -261, 248, -60, 99, -258, 81, -21, -88, 152, 104, 53, 151, -86, -50, -1, 69, 95, 99, 13, -152, 166, -133, -193, 36, -164, 139, 198, 218, -88, -339, -22, -110, 79, -120, 48, -110, -139, -16, -18, -215, -26, 140, -70, -73, 6, 239, 301, -81, -47, -86, 53, 97, -189, -45, 58, -84, 17, 206, -52, 57, 159, 151, 83, 148, -68, -10, 216, 41, -126, 12, -188, -32, 263, 98, -29, 179, -12, 24, 27, -239, -44, -3, 236, 31, -8, 96, 107, 124, 113, -43]
4081d3K63j74j13K76m57L76r4l7r4L31j70Q0l02K78n3l98L65j10j3J66k03J79
4103E3o0j14JK98j85q3J42k5q6p7R8N4j70K32J99l10oq3K22K94o96M30l76J59
4127h9K30q6k39K66j08j35K04J6p8J58k49K82j03L2M6q8k7J63l11J87j57L41l81
4150a26O1R7k62M63n73K00P9r1K58l28K79l7J3P2m36L50k04J43r8N8j3J98j04
4173aJ96j99K26j25r9j21L87k93%J84l81L41q4j1l43N10p5j35l0Q3J32l17l4K39
4197E0J11j72J05O4l10lK33k84K29m9k7j3m9K3O2K1j05K58p8j31P3k86J92j80
4221b66K92J80m87N45k69p5K58p4k12K55l06K15r9l92O49L8l8k04k31K15R6j32
4243d2j4k7O4K5j60L71j98O1l2R0k85L65l57j73J83j6K17M2j94L15m69J49K5J41
$$ y = [-43, 220, 46, -67, 209, -248, 128, 34, -3, -97, 234, 64, 144, -158, 120, 67, -331, 34, -76, -89, 77, -126, 53, -7, -121, -120, 178, -7, -90, 52, 27, -59, -136, -38, 16, -154, 78, 277, -33, -39, -122, 100, 394, -302, 128, -248, -89, 141, 55, -184, 82, -26, -161, 43, 59, -19, 139, -110, 172, 69, 101, 147, 59, 32, 195, -116, 71, -86, 255, -126, -65, 32, -230, 233, -340, -140, -61, -152, 106, -222, 57, 20, 33, 105, -331, 19, -185, -42, -140, -82, -95, 103, -1, 195, -4, 222, 97, -2, -123, 264, -29, -29, 155, -226, 115, 31, 20, -323, 187, 112, -23, -53, 30, 162, -155, -189, 50, 161, -11, 94, 158, -152, -155, 78, -206, 23, -26, -53, -66, -115, -92, -30, -9, -114, 144, 66, -65, 8, -278, -86, -266, 26, 206, -281, 264, -5, -80, 178, 104, -108, 147, -159, 56, -43, -435, 214, 252, 214, 10, -221, -6, 90, -42, -56, -83, -19, 6, -154, 217, 19, 80, 48, 138, -147, 218, -139, -312, -129, -145, 72, 114, -80, 235, -234, -85, -60, 81]
4267H1O4r6J13rk50R9M3P2j34n1n0O8K04k54KP3L5l01K79K26l36L15l86J67l2
4292e8J81q4Oj18K36mj34m9P5n1L2R1j56J6j8j6j03K29K4K8Nj17j07M1K76n60
4318c35K03K44k26lP6M9NL00n17K45j21L35l32J28J29j68q2J26j43J68j86N56
4340D51l72j14J68k30K48J55j75j35J8N8k35J02J36k96O01k30n9Q9j53j39J98
4361H6j15p7Q5l5M6jRj28j26J34L47k08k3O4p0N9J55l20M25k83J58j97QnJ63o4
4387H7m0j47K90m62L29J9k24J58k8J21M1M7j56L4N1J09k99j27K39j77J78J83r5
4410A31j92j84K15rk36K05j39R9J20nL0j03RJ43n4q9q4K45j91j09P8j30M59r4
4434A15m8k01M2K7L6K6Mj1P3O6k72J98j42M4l2K22j42J37j88R7k23K44N8j71m
$$ y = [81, 145, 49, 162, 153, -97, 2, 45, 117, -17, -68, -118, -50, 154, -100, -98, -25, 10, -291, -12, 214, -122, 193, -193, -26, -58, 123, 39, 45, -73, 163, 159, 25, -24, 51, 0, 32, 123, -33, -17, -35, -51, -154, 75, 99, 127, 132, 15, -92, -51, 225, -335, -132, 112, -114, -117, -41, 8, 13, 313, -204, 41, -80, 255, -77, 51, 180, 12, -70, 56, -87, 81, -105, 451, 79, -35, 133, -97, 151, 306, 131, -4, 14, 72, -163, -61, 75, -221, 380, 150, 91, 180, 27, -112, 86, -29, -106, -21, -56, -10, -11, -2, -130, -256, -122, 225, 17, -6, 58, -12, 47, 202, -118, 307, 24, 182, -15, -7, -12, 151, 87, 47, -100, 190, -272, 57, 76, -148, 10, -18, 103, 144, 191, 35, 69, 120, 229, -70, -197, 42, -135, 43, 226, 131, -61, -245, -30, -39, -275, -70, -209, -110, 10, 5, 35, -68, -59, 84, 30, -59, -143, 102, -89, -198, -120, -250, 209, 115, 67, -134, -92, -65, -29, -3, 1, -10, 63, 129, -143, 55, -87, -43, -75, 147, 5, 142, -46, 51, -172, 72, 130, -41, -45]
4459d5J9k93L41j48j4J95j87R0K79k60k0O8o4K47l36m1Q7K2R6J08j53J94j96j11
4483a22J52j49J25N8L%q1M2j2J9n7pk16K42R8J11j25r1j01L43k71J55Q8l68K53
4508H9N0j74J10k43J60QO5o1J34k12J98l3j53P6j23M57l47M23l66j84J58j58J1
4531a15L6q1R0O0QJ31M5o2l0m7m00M25l14M84k79L36k17L6k97K67l38L30J02j25
4555D5j78K48l03L02j7o8J43k25J45k45N7J47q4k27M92L7k87k09j6Q5M35k32K
4578D7j11L3J18Q8j37k02J1J46oO9J18J6r4j06m1J03j39O7L2J4P2j41j59L13k02
4603i1K73m7l73J80J31J01l65N1M6j75J70J0J2J46J5O9k69K71r3J99j93l12K07
4626c7J69j39L8j02j4P6j01j46N6J68J51P6n35M78k6k65J14l2J72n3k12K24N7
$$ y = [-45, -26, -319, 22, -126, -140, 55, -132, -42, 237, -23, -43, 25, -39, 208, -128, -169, -82, -60, 36, 144, -9, 185, -11, -122, 30, -119, 6, 64, 67, 67, -14, 28, 16, 35, -22, -29, -245, -3, 95, 206, 81, -10, -111, 232, -39, 116, 204, -164, 89, 139, -35, 75, -168, -8, 0, 65, 4, 138, -74, 124, 91, -62, 14, -109, 348, 1, 424, 58, -126, 32, -126, -115, -79, -160, -70, -10, -2, 129, 174, 112, 82, 35, -365, 60, -254, 230, -49, 287, 70, 106, -191, 76, -262, 68, 170, 45, -133, 115, -188, 114, 97, 29, 172, -53, 92, -153, -96, 51, -33, -260, 232, 269, -18, -227, -243, -158, 277, 45, 47, -64, -31, 87, 175, 38, -164, -153, -7, -13, 56, 174, 190, 96, -10, -51, 52, -87, -20, 12, 26, 98, -43, -202, 111, -91, 182, 135, -238, -58, 73, 174, -191, -140, -94, -269, -99, -89, -77, 69, 84, 153, -116, 155, 62, 261, 68, -244, -37, 132, -7, 31, -71, -85, -9, -110, -256, -200, -32, 119, 195, -340, 138, 112, -153, -39, -71, 101, 48, -164, 60, 117]
4649A17J56j58l31J93k30J97L9J71k61L17j66j84M6J05Q2o1j5n7N1R6k06K09n1
4672E9j2j26M3K91k92j03J08M3j15J53P7kk14m6L7J74j97J00K58O5m60J56J40
4695A37L4n1k85L26%k84K31r2K5L2j15l12K71J61l6Jo4R0j11o5R4o0P0j03J07
4720Ak33K78J3M0k00J38Rj66m9J73Q9n7O1J24j75m2r3m6j80L41m7L9o9k8J43j18
4746e4K54j53J45k55k0j67K24R8p3q8j91M5K60j47P7j00J87J6l8l07L83k16j7
4769a37L61k88J96k17j97K84O3Mj74MK20q0P7J08k27k11M63n4r3k10j1J62o1j03
4793a21J43j24J83k41M09j55j06J55j64Q7j40J97K2k26J6J06k36M45k33J27l53
4814b09K42K37l28NJ53j80J42K2k05J47K27Pp30N41L6j13l9o9K38j18P3j66j57
$$ y = [117, 273, 115, -216, -23, -253, -56, -17, 154, -107, 210, 44, -140, -94, 11, 93, 32, 17, -40, 11, 107, -99, 110, 59, 47, -79, -36, 255, -37, -140, -32, 11, -104, 49, 126, 124, -90, -136, -99, 75, -122, -22, 236, 301, -159, -3, 137, 171, 120, -165, 161, 161, -123, 108, 16, 41, 73, -42, -354, -83, 78, 42, 43, -21, 69, -42, -107, -13, -73, -3, -106, 1, -232, 46, 59, 99, -101, 37, 46, -120, -169, 4, 93, 36, 97, 221, 46, 4, -89, -135, -315, 26, -21, 18, -51, -79, 64, -54, 200, 47, 192, -63, -83, -250, -26, 72, -1, -89, -280, -235, 25, -122, -45, -145, 42, 58, 20, -287, 96, -120, -137, 224, -64, 132, -85, -282, 2, 65, 69, -105, -101, 119, 39, 116, 224, -3, -214, 249, 195, 102, -108, -119, 43, -18, -121, 22, -102, 81, -160, 249, 94, -12, 143, -21, 66, -74, 123, 145, -81, -65, 41, -195, 250, 17, 144, -209, 33, 270, -58, -53, 100, -80, 62, 84, -121, 26, 253, 260, -470, 71, 107, -6, -45, -114, 124, 6, 79, -87, -244]
4837b44N8K44p2N2J54l13K23l45J69J19j85O6J21J28l85J30K96j63j95M04j74
4858H8k02L05k83Jn1M26l18j21j26J71N73p78L25J73k89J98j99p2K42j36M5j19
4880a47p5M37l03r0J20n0m5J88j68J97k34J02l6J14j58L26l46L40l13Q4k0j43
4902b20K67J69k50r7O4k3J36K7J20k67J68j10l0j43K52K06k4k50r5L06j92O9k1
4925F2J0l12L12J93l29J44j06K02l44J37K02J3j77J59k89J18J17r8P8j43J67k61
4947a45J19N0q9p9K21k59K20j50K5j95K48J06l34K58o6k0l5j6K38q0lj69K78n5
4971F8j79R6R4k74K45o0m9j00K36L1j41K2P3M4j91J7l35L34L26j92k41M59k92
4994ioJ14q3K4rM3r4Q6k03R8J88j56j94k4N17k27R3j27O4k05mN4j4J52q8J55k74
$$ y = [-244, -186, 58, -14, 38, 192, -121, 102, -243, -74, 45, -140, -74, 47, 175, -210, -80, 216, 53, -142, 262, 88, -114, 191, -92, -91, -142, 284, -34, -155, -281, -110, 463, -315, 10, 183, -106, 92, -107, -179, 63, -73, -28, -147, -222, 215, -88, -178, -58, -108, -153, 35, -133, 64, -170, -68, -104, 10, -148, 178, -168, 172, -141, -57, -77, -220, 47, 216, -34, -131, -67, -90, 46, 73, 193, -74, 94, -16, -46, -189, 63, 269, 245, -5, -100, 206, 14, 83, 62, 72, -240, 72, 265, -64, 80, -26, 176, -168, -31, 171, 184, 7, 166, -123, -5, 112, 14, 92, -51, 116, -145, -26, 24, -65, -144, 77, -182, 38, -112, -87, -282, -34, 72, -262, -4, -70, -90, -125, -141, 97, 17, 14, -155, 123, 68, -111, -15, 79, -195, 50, -10, -59, -159, 77, 108, -33, -11, 62, 106, -85, -68, -403, -69, 257, 65, -176, 283, -9, -15, 99, 16, 40, 31, 74, -20, 66, -137, -39, 149, -7, -201, -225, 292, 65, 158, 31, 95, -110, -114, -60, -74, 78, -10, 145, -129]
5021a29J71l1j3m3k1L4L6j82M8o3K63M9l58Q5K80j31K5j39J37j50L32k22j1j96
5045b29O4N8K7M8J23j77L4R2L1q8r4Q6L4M7j50K31k91K21l5L7j3k70L23l31K18
5070dL36l46P0m3j14l2M27k79J3m0nK2j29K8J52q8p4J68j80L7j97J81J89j92N4
5095d6K2n5L6k03J23J92L5j06j22N6J64J56j04ok66K90k15J76O9m71J71j8N8K42
5119A78l09jM06l72J89j8j96J29O3k35L9K31K9l10J10Q9L1L3Lj5J66k12n5O6j20
5144h1K2K56l49J49P2j31J09j15J00K48n57K72k41L23j58J62j0k14J38j64L23
5165A54k51J46j19JL05l93J74J22jj01j79P4K9P5N9o4L9K17j02k44O4M2N3l4p0
5190dl7J59O2o6M7k31l1Q7K1N5J20k21k65J20J68j19K15j24J28O6p7r8K47k45
$$ y = [-129, 42, 11, -2, -45, -66, -32, 4, -178, -130, -193, 70, 119, -239, -154, 126, -5, 20, -119, 18, -132, 200, -22, -33, -229, -165, -107, -80, -32, 91, -86, -52, 40, 71, -17, -111, -25, 9, 56, -94, 137, -154, 67, 32, 69, 56, -214, 109, -222, -4, 332, -14, 56, 13, -101, -133, 294, 15, 28, -12, -17, 5, -124, -96, 56, -32, -106, 62, -118, -81, -278, -97, 92, -100, -46, -24, -79, -43, -246, -123, 69, 104, -2, -124, -68, 96, 252, 148, 142, -124, 166, -49, 127, 196, -275, -104, -122, -64, 178, -131, -132, 274, -98, 91, 73, -123, 6, 69, -166, -127, 104, 133, -177, -67, 22, 53, 86, 89, 74, 240, 28, -27, 39, -81, -59, 197, -152, -3, 69, -62, 47, -68, 32, 280, -277, -5, -246, 77, -81, 81, 71, -143, -5, -169, 154, -97, 49, -70, -69, 236, -157, 17, 139, 138, 37, -142, -68, -39, 36, 95, 31, 70, 287, 185, -59, 5, 47, 100, 66, -4, -41, 118, 180, 114, 161, -70, -101, -14, 7, 62, 182, -39, -304, -184, -16, -135, 80, -44, 84, 150, 73, -25, 222, -23]
5214b3n2R4N1k59L54m4ko0j08Ml0O6Mj7j24J50o0N8P3J13j0l43J04L30m67K0M1
5241a37k8J82n2J52l25L01j51J24r9l3R0k64K52j8j25Q5q0J87J56j61j05K33l08
5264a24O0q2nK0K25l48K62J5ll9J78j83J56k66N3R1K0n9J84j98J18m0m46M63M8
5289A00l81J65J31l3j29L68k98Q8Q5o6L9k57J19k04J76M2K75k0J3l16j8K71j92
5312d2J30Rk16j08O5J18l45L62K61k16J5l06L53j20l31M80J09m63K47j60L04j54
5334hl51M54j43j18R2N7p8j29K46p0n8J50j67R1j4q8J98j64M7J75p6O4j83k3L0
5359f6J9L21k01k10J63j49O2J10n9l2J14n2k6j4J56k38M8j52J48K6J09O3m06K35
5383c1Jl46N04j96J85o1p4Q5J3j21lj30L50o4q5j47L50l57J20J35l75J63qK75
$$ y = [-23, -75, 19, 70, -189, 165, 121, 119, 59, -49, -45, -75, -9, -5, -22, -146, 4, -56, 2, 75, 188, 178, -165, -61, 269, -198, -178, -137, -165, 17, -35, 117, -208, 93, -58, 66, -33, -66, 24, -240, 12, -6, -131, -46, -126, 61, 217, 56, -49, 184, -124, -64, -146, -151, -131, 94, -254, 8, 23, 20, -19, 159, -24, 132, -134, -81, 10, 30, -29, 155, -43, 75, 35, -411, 52, 100, -281, -116, 15, -18, -147, 221, -77, 11, 96, 30, 69, -188, -69, -273, -97, -55, 220, 200, 213, -103, -121, 150, -42, 88, 97, -119, -227, -162, -44, -389, -27, 234, 18, 33, -273, 80, -40, -371, 109, 218, -245, 2, -158, 146, -8, -359, 95, -48, -166, -74, -17, -95, -224, 22, -48, -106, 44, -123, -32, -46, -134, 64, -100, -53, 122, 46, 110, -73, -96, -66, -47, 274, 73, -137, 26, -123, -61, 49, -10, -42, 72, 20, -6, -20, 136, -102, -54, -206, -58, -32, 77, 140, -266, -31, -30, -376, 128, -68, 117, 56, -18, 67, 80, -41, -44, -174, 176, 112, 27, -120, 230, -127, -7, 128, -247, -84, -92, 183]
5407A83j96j7R8j44K73q9j21p5J95R3j71J99k48J17k79J53J37k83Q2J34K1rj09
5430e6q9K18L3m9J0j57n2J3K65j60J54k24J51J0K5k59L03j58l00J12L7L04m8k71
5454a88K97j51Q1k30J00M37m88L41j95p6J23j23j25K68m3J54j09k2k79M5K42j04
5476d5K06k69J31L3M6j88K29m0k72R0K00j31J30j47n9M6o2J37j12j15J42J68j94
5499g6K98p1p7j10J94J5j91o7j32m1L44j04K10l33J21L0j40o5L34Mk28J16R3j74
5523e0J08r4K29J53k62n58M64J86j08k30J98Q5Qj44K6j52Q5n2J12L2n7J00l34
5546b55M35l37L7J79o6j7Q9o9k55L58Lj04lJJ40O5j78q6J38J65m55K95l02K74
5570E2J87k59j87P7J34m0M3N4J88k53J27J48j82j53K52nk70Q6l0k1P4l2J4j29
$$ y = [183, -13, -30, 68, -76, 197, 108, -13, -88, 107, 200, 29, 228, -20, 97, -182, -29, 108, -175, -93, 41, 62, 53, -56, -145, 73, 106, 57, 67, -90, -142, -129, 136, -24, 130, -94, 57, 67, 92, -167, 136, -22, -322, -210, -173, 131, 83, -188, 109, -42, 39, -191, -91, 346, -142, 199, 4, -72, 51, -72, -197, 71, 28, 182, 73, 51, -228, -183, 59, -45, 161, -108, 23, 56, 102, -86, 143, 103, -169, -79, 121, -10, 120, -27, -86, -40, -102, 35, -77, -192, -50, 118, -76, 222, 151, 74, -36, 158, 173, -18, -85, -217, -258, 86, -18, 192, -141, -20, 10, -130, -195, 139, 143, -85, 31, 124, -50, 58, -36, 193, 346, 84, -474, -10, 176, 68, -162, 36, 121, 129, -15, 11, -141, -56, -108, 4, 36, -21, 79, -255, 180, -157, -120, 59, -7, -24, 65, -4, -259, 99, 102, -2, -5, -4, 136, 201, 23, -63, 75, 240, -215, 80, -222, 52, 239, -20, -207, -130, 4, -36, 7, 61, 249, -4, 123, 271, 89, -64, 188, 183, -87, -1, -31, -52, 22, -10, 4, -125]
$$ [...]
8191e2
##END NTUPLES=NMR FID
##END=
