##TITLE=1H_Pr 2831
 CDCl3
 8 sc, 
 9.2.2023
##JCAMPDX= 6.0         $$ Bruker NMR JCAMP-DX V2.0
##DATA TYPE= NMR FID
##DATA CLASS= NTUPLES
##ORIGIN= UXNMR, Bruker Analytische Messtechnik GmbH
##OWNER= root
$$ XWIN-NMR		Version 3.5
$$ Thu Feb  9 16:55:14 2023 Russian Standard Time (UT+4h)  she@DPX200
##.OBSERVE FREQUENCY= 200.13135
##.OBSERVE NUCLEUS= ^1H
##.DELAY= (6, 6)
##.ACQUISITION MODE= SIMULTANEOUS
##.ACQUISITION SCHEME= undefined
##.AVERAGES= 8
##.DIGITISER RES= 18
##SPECTROMETER/DATA SYSTEM= spect
##.PULSE SEQUENCE= zg30
##.SOLVENT NAME= DMSO
##.SHIFT REFERENCE= (INTERNAL, DMSO, 0, 15.7039)
##AUDIT TRAIL= $$ (NUMBER, WHEN, WHO, WHERE, WHAT)
$$ ##TITLE= Audit trail, XWIN-NMR		Version 3.5
$$ ##JCAMPDX= 5.01
$$ ##ORIGIN= Bruker BioSpin GmbH
$$ ##OWNER= she
$$ F:/spectra/data/she/nmr/H-F/1/audita.txt
$$ ##AUDIT TRAIL=  $$ (NUMBER, WHEN, WHO, WHERE, WHAT)
(   1,<2023-02-09 16:54:09.82 +0400>,<she>,<DPX200>,
      <created by zg, POWCHK disabled, PULCHK disabled
       configuration hash MD5:
       00 E9 B6 7A A2 85 ED C7 34 08 36 98 17 FE 4E 26
       data hash MD5: 16K
       68 24 19 18 78 D6 2E 3C 06 92 6A BC 7D C4 07 7D>)
$$ ##END=
$$ 
$$ hash MD5
$$ B8 1A 83 5E DE 89 43 F8 B8 1E E8 9F D3 50 16 89
##$RELAX= 
##$RELAX= 
##$RELAX= 
##$RELAX= 
##$RELAX= 
##$RELAX= 
$$ Bruker specific parameters
$$ --------------------------
##$DU= <F:/spectra>
##$EXPNO= 1
##$NAME= <H-F>
##$PROCNO= 1
##$TYPE= <nmr>
##$USER= <she>
##$AMP= (0..31)
100 100 100 100 100 100 100 100 100 100 100 100 100 100 100 100 100 100 
100 100 100 100 100 100 100 100 100 100 100 100 100 100 
##$AQSEQ= 0
##$AQ_mod= 1
##$AUNM= <au_zg>
##$AUTOPOS= <>
##$BF1= 200.13
##$BF2= 200.13
##$BF3= 200.13
##$BF4= 200.13
##$BF5= 200.13
##$BF6= 200.13
##$BF7= 200.13
##$BF8= 200.13
##$BYTORDA= 1
##$CFDGTYP= 0
##$CFRGTYP= 5
##$CHEMSTR= <none>
##$CNST= (0..31)
1 1 145 1 1 1 1 1 1 1 1 1 1 1 1 1 1 1 1 1 1 1 1 1 1 1 1 1 1 1 1 1 
##$CPDPRG= <>
##$CPDPRG1= <>
##$CPDPRG2= <>
##$CPDPRG3= <>
##$CPDPRG4= <mlev>
##$CPDPRG5= <mlev>
##$CPDPRG6= <mlev>
##$CPDPRG7= <mlev>
##$CPDPRG8= <mlev>
##$CPDPRGB= <>
##$CPDPRGT= <>
##$D= (0..31)
0 1.2 0 0 0 0 0 0 0 0.06 0 0.03 0 0 0 0 0.0002 0 0 0 0 0 0 0 0 0 0 0 0 
0 0 0 
##$DATE= 1675947249
##$DBL= (0..7)
120 120 120 120 120 120 120 120 
##$DBP= (0..7)
150 150 150 150 150 150 150 150 
##$DBP07= 0
##$DBPNAM0= <>
##$DBPNAM1= <>
##$DBPNAM2= <>
##$DBPNAM3= <>
##$DBPNAM4= <>
##$DBPNAM5= <>
##$DBPNAM6= <>
##$DBPNAM7= <>
##$DBPOAL= (0..7)
0.5 0.5 0.5 0.5 0.5 0.5 0.5 0.5 
##$DBPOFFS= (0..7)
0 0 0 0 0 0 0 0 
##$DE= 6
##$DECBNUC= <off>
##$DECIM= 32
##$DECNUC= <off>
##$DECSTAT= 4
##$DIGMOD= 1
##$DIGTYP= 9
##$DL= (0..7)
0 120 120 120 120 120 120 120 
##$DP= (0..7)
150 150 150 150 150 150 150 150 
##$DP07= 0
##$DPNAME0= <>
##$DPNAME1= <>
##$DPNAME2= <>
##$DPNAME3= <>
##$DPNAME4= <>
##$DPNAME5= <>
##$DPNAME6= <>
##$DPNAME7= <>
##$DPOAL= (0..7)
0.5 0.5 0.5 0.5 0.5 0.5 0.5 0.5 
##$DPOFFS= (0..7)
0 0 0 0 0 0 0 0 
##$DQDMODE= 0
##$DR= 18
##$DS= 0
##$DSLIST= <SSSSSSSSSSSSSSS>
$$ [...]
##$SUBNAM2= <"">
##$SUBNAM3= <"">
##$SUBNAM4= <"">
##$SUBNAM5= <"">
##$SUBNAM6= <"">
##$SUBNAM7= <"">
##$SUBNAM8= <"">
##$SUBNAM9= <"">
##$SW= 18.05172834244
##$SWIBOX= (0..15)
0 0 2 0 0 0 0 0 0 0 0 0 0 0 0 0 
##$SW_h= 3612.71676300578
##$TD= 16384
##$TD0= 1
##$TE= 0
##$TE2= 300
##$TE3= 300
##$TEG= 300
##$TL= (0..7)
0 120 120 120 120 120 120 120 
##$TP= (0..7)
150 150 150 150 150 150 150 150 
##$TP07= 0
##$TPNAME0= <>
##$TPNAME1= <>
##$TPNAME2= <>
##$TPNAME3= <>
##$TPNAME4= <>
##$TPNAME5= <>
##$TPNAME6= <>
##$TPNAME7= <>
##$TPOAL= (0..7)
0.5 0.5 0.5 0.5 0.5 0.5 0.5 0.5 
##$TPOFFS= (0..7)
0 0 0 0 0 0 0 0 
##$TUNHIN= 0
##$TUNHOUT= 0
##$TUNXOUT= 0
##$USERA1= <user>
##$USERA2= <user>
##$USERA3= <user>
##$USERA4= <user>
##$USERA5= <user>
##$V9= 5
##$VALIST= <valist>
##$VCLIST= <CCCCCCCCCCCCCCC>
##$VD= 0
##$VDLIST= <DDDDDDDDDDDDDDD>
##$VPLIST= <PPPPPPPPPPPPPPP>
##$VTLIST= <TTTTTTTTTTTTTTT>
##$WBST= 1024
##$WBSW= 4
##$XGAIN= (0..3)
0 0 0 0 
##$XL= 0
##$YL= 0
##$YMAX_a= 143968
##$YMIN_a= -149271
##$ZGOPTNS= <>
##$ZL1= 120
##$ZL2= 120
##$ZL3= 120
##$ZL4= 120
##$ABSF1= 10
##$ABSF2= 0
##$ABSG= 5
##$ABSL= 3
##$ALPHA= 0
##$AQORDER= 0
##$ASSFAC= 0
##$ASSFACI= 0
##$ASSFACX= 0
##$ASSWID= 0
##$AUNMP= <proc_1d>
##$AZFE= 0.1
##$AZFW= 0.1
##$BCFW= 1
##$BC_mod= 2
##$BYTORDP= 1
##$COROFFS= 0
##$CY= 11.3945322036743
##$DATMOD= 1
##$DC= 2
##$DFILT= <>
##$DTYPP= 0
##$F1P= 2.36226072786647
##$F2P= -0.459571619588291
##$FCOR= 0.5
##$FTSIZE= 0
##$FT_mod= 4
##$GAMMA= 1
##$GB= 0.15
##$INTBC= 1
##$INTSCL= 1
##$ISEN= 128
##$LB= 0.24
##$LEV0= 0
##$LPBIN= 0
##$MAXI= 10000
##$MC2= 0
##$MEAN= 0
##$ME_mod= 0
##$MI= 1.114404
##$NCOEF= 0
##$NC_proc= 0
##$NLEV= 6
##$NOISF1= 3.799351
##$NOISF2= 2.8
##$NSP= 1
##$NTH_PI= 0
##$NZP= 0
##$OFFSET= 15.70392
##$PC= 1
##$PHC0= -19112.22
##$PHC1= 8.600783
##$PH_mod= 1
##$PKNL= yes
##$PPARMOD= 0
##$PSCAL= 0
##$PSIGN= 0
##$REVERSE= no
##$SF= 200.130013532006
##$SI= 16384
##$SIGF1= 3
##$SIGF2= 2
##$SINO= 400
##$SIOLD= 16384
##$SREGLST= <1H.CDCl3>
##$SSB= 0
##$STSI= 0
##$STSR= 0
##$SW_p= 3612.71676300578
##$SYMM= 0
##$S_DEV= 0
##$TDeff= 0
##$TDoff= 0
##$TI= <>
##$TILT= no
##$TM1= 0
##$TM2= 0
##$TOPLEV= 0
##$USERP1= <user>
##$USERP2= <user>
##$USERP3= <user>
##$USERP4= <user>
##$USERP5= <user>
##$WDW= 1
##$XDIM= 8192
##$YMAX_p= 0
##$YMIN_p= 0
$$ End of Bruker specific parameters
$$ ---------------------------------
##NTUPLES= NMR FID
##VAR_NAME=  TIME,          FID/REAL,        FID/IMAG
##SYMBOL=    X,             R,               I
##VAR_TYPE=  INDEPENDENT,   DEPENDENT,       DEPENDENT
##VAR_FORM=  AFFN,          ASDF,            ASDF
##VAR_DIM=   8192,          8192,            8192
##UNITS=     SECONDS,       ARBITRARY UNITS, ARBITRARY UNITS
##FACTOR=    0.0002768,     1,               1
##FIRST=     0,             0,               0
##LAST=      2.2672688,     0,               0
##MIN=       0,             -149271,         0
##MAX=       2.2672688,     143968,          0
$$ Real data points
##PAGE= N=1
##DATA TABLE= (X++(R..R)), XYDATA
$$ [...]
$$ plain form
1875 398 347 -1220 -723 168 329 -1056 -713 828 71 -865 291 982 215 -441 212 1343 187 -819
1893 -819 1386 777 -479 -199 326 433 -850 -897 926 69 -1413 139 247 83 -994 -447 1033 -181
1911 -181 -923 541 611 -192 -557 413 971 -480 -392 973 76 -935 -234 488 89 -1265 -634 572 -436
1930 -436 -1223 337 411 -46 -738 180 1176 -356 -506 1250 635 -513 108 628 632 -696 -48 1274 -198
1949 -198 -698 274 274 -328 -1142 -339 458 -994 -959 106 -140 -492 -665 303 660 -914 -281 1046 401 -50
1969 -50 511 739 399 -288 383 967 -111 -355 534 11 -315 -596 -154 331 -1114 -646 184 -565 -649 -490
1989 -490 253 177 -334 122 941 -252 -293 440 537 281 -304 300 575 -343 174 824 -52 -139 -85 -103 115 -623
2011 -623 -413 12 -676 -309 -660 -307 22 -543 -257 77 -176 -110 279 99 483 130 312 644 -85 279
$$ packed form
1875C98n1j567M97Q91J61j385L43J541p57r36J156O91p67o56O53J131j156j006
1893h19K205o09j256K80N25J07j283m7J823q57j482J552J08j64j077N47J480j214
1911a81p42J464P0q03l65R70N58j451Q8J365q97j011P01P22l99j354O31J206j008
1930d36p87J560P4m57o92R18R96j532j50J756o15j148O21N20Mj328O48J322j472
1949a98n00R72%o02q14Q03P97j452L5J065k46l52j73R68L57j574O33J327o45m51
1969e0N61K28l40o87O71N84j078k44Q89n23l26k81M42M85j445M68Q30p49q4J59
1989d90P43p6n11M56Q19j193m1P33R7k56n85O04K75r18N17O50q76q7N4j8K18p38
2011f23K10M25o88L67l51L53L29n65K86L34k53O6L89j80L84l53J82L32p29L64
$$ plain form
2031 279 443 417 96 6 -36 397 -397 -283 182 -415 -178 -579 -206 255 -243 -332 142 -374 119 228 -110
2052 -110 324 46 68 659 -129 130 -164 132 344 -388 37 493 -514 -151 -61 -294 9 -446 -305 240
2072 240 -403 -78 242 0 70 -37 264 285 -266 26 495 148 -243 67 156 478 -512 -187 530 -449 -211
2093 -211 125 2 -258 -412 -2 484 -637 -432 619 105 9 83 227 243 -372 205 664 -390 -388 -18 416
2114 416 -9 -747 93 575 -786 -461 373 -64 -321 -882 418 635 -797 -80 506 -28 -315 143 800
2133 800 355 -426 455 844 -496 103 375 491 -73 -596 369 253 -768 -166 366 57 -617 -356 364
2152 364 -48 -895 154 528 -193 -188 116 383 198 -69 645 678 -477 126 662 288 -163 -371 591 438
2172 438 -711 265 316 -374 -245 -108 511 -250 -835 298 154 -704 -34 207 201 -479 -219 525 419 -692
$$ packed form
2031B79J64k6l21r0m2M33p94J14M65n97K37m01L73M61m98q9M74n16M93J09l38
2052a10M34k78K2N91p88K59k94K96K12p32M25M56j007L63R0k33L03m55J41N45
2072B40o43L25L20k42P0j07L01K1n51K92M69l47l91L10Q9L22r90L25P17r79K38
2093b11L36j23k60j54M10M86j121K05J051n14r6P4J44J6o15N77M59j054KL70M34
2114D16m25p38Q40M82j361L25Q34m37k57n61J300K17j432P17N86n34k87M58O57
2133H00m45p81Q81L89j340N99K72J16n64n23R65j16j021O02N32l09o74K61P20
2152C64m12q47J049L74p21NL04K67j85k67P14L3j155O03N36l74m51k08R62j53
2172D38j149R76N1o90J29J37O19p61n85J133j44q58O70K41oo80K60P44j06j111
$$ plain form
2192 -692 92 461 3 128 102 758 158 -539 377 329 -275 -160 130 266 -280 -406 457 142 -599 93 174
2213 174 189 -147 -100 484 -240 -708 292 470 -259 -287 144 510 -347 -359 539 67 -408 5 142 353 -231
2234 -231 -170 801 -130 -367 474 386 43 -117 82 412 -235 -473 556 79 -538 -197 -246 162 -362 -481 321
2255 321 -133 -379 84 20 31 -440 -223 533 -85 8 533 174 190 250 190 190 124 -219 300 31 -19 46 -141 227
2279 227 -285 -94 319 -472 -319 264 17 150 -318 -452 415 20 73 238 80 239 287 108 650 430 266
2300 266 446 113 -26 322 -85 43 -31 -238 201 -486 -474 -291 -593 31 -20 -300 79 -289 -145 287 -269
2321 -269 95 -24 27 448 -1 32 206 138 33 37 -128 438 -60 -294 186 -67 -252 -68 -223 48 -33 -332
2343 -332 248 -251 -177 -120 155 -48 1 -143 293 -123 -255 117 243 149 -295 -210 511 -75 1 398 -94 -147
$$ packed form
2192f92P84L69m58J25k6O56o00o97R16m8o04J15K90J36n46j26Q63l15p41O92Q1
2213A74J5l36M7N84p24m68J000J78p29k8M31L66q57j2Q98m72m75M13J37K11n84
2234b31O1R71r31k37Q41q8l43j60J99L30o47k38J029m77o17L41m9M08n24j19Q02
2255C21m54k46M63o4J1m71K17P56o18R3N25l59J6O0o0%o6l43N19k69n0O5j87L68
2279B27n12J91M13p91J53N83k47J33m68j34Q67l95N3J65j58J59M8j79N42k20j64
2300B66J80l33j39L48m07J28p4k07M39o87J2J83l02O24n1k80L79l68J44M32n56
2321b69L64j19N1M21m49L3J74o8j05Mj65N66m98k34M80k53j85J84j55K71q1k99
2343c32N80m99P4N7K75k03M9j44M36m16j32L72J26r4m44Q5P21n86P6L97m92n3
$$ plain form
2365 -147 105 151 240 -223 28 219 -8 -182 1 164 -65 -114 9 302 -155 -51 -105 54 -140 -183 100 578
2387 578 -296 -263 370 246 -43 -132 228 100 -277 165 495 -84 -192 236 283 67 -361 151 434 -296 -399
2408 -399 291 62 -305 -179 68 269 -543 -295 495 -154 -254 76 133 -84 -427 -157 300 -533 -436 463 192
2429 192 -89 -139 185 525 -4 -147 620 -94 -312 -186 253 22 -443 26 431 -287 -322 -149 -99 -164 -307
2450 -307 278 442 -295 -54 553 186 58 -162 302 220 -116 238 543 -151 -78 307 327 -92 -437 190 348
2471 348 -486 -373 27 -334 -301 -359 130 -17 -448 31 148 -173 21 -101 93 242 -385 340 170 -56 153
2492 153 399 113 91 -63 383 32 -330 97 133 -242 54 -420 202 -193 -537 125 -94 -367 -203 103 -83
2513 -83 13 -414 363 -42 -378 209 448 45 6 49 545 -128 -232 99 3 -164 -97 -206 -177 -59 -771 0
$$ packed form
2365a47K52M6Q9m63K51J91k27j74J83J63k29m9J23K93m57J04n4J59j94m3K83M78
2387E78q74L3O33j24k89q9L60j28l77M42L30n79j08M28M7k16m28N12K83p30j03
2408c99O90k29l67J26K47K01q12K48P90o49j00L30N7k17l43K70M57q33R7Q99k71
2429A92k81n0L24L40n29j43P67p14k18J26M39k31m65M69M05p18l5J73N0o5j43
2450c07N85J64p37K41O07l67j28k20M64q2l36L54L05o94P3L85K0m19l45O27J58
2471C48q34J13M00l61L3n8M89j47m31M79J17l21J94j22J94J49o27P25j70k26K09
2492A53K46k86k2j54M46l51l62M27L6l75K96m74O22l95l44O62k19k73J64L06j86
2513h3R6m27P77m05l36N87K39m03l9M3M96o73j04L31r6j67O7j09K9J18p12P71
$$ plain form
2535 0 124 -335 -111 -144 -2 83 -118 45 109 -10 -11 113 86 227 -27 271 294 -67 30 185 -63 -16 -95 -28
2559 -28 142 -126 211 48 -119 -47 -64 -182 199 -311 -9 -82 -187 79 31 -140 241 -88 276 -186 -83 41
2581 41 -44 8 39 -73 107 -192 -167 -17 183 27 288 -183 222 87 -183 175 49 -44 -51 9 -131 68 -365
2604 -365 148 231 -240 -251 95 93 -234 -347 245 259 -434 -111 95 -132 169 113 473 19 45 495 153 39
2626 39 -9 -27 190 -51 -303 50 -52 -337 -155 -155 49 -208 -432 112 -17 -468 149 279 9 -288 -21 241
2648 241 -231 -179 301 340 -156 271 357 110 22 -62 585 126 -222 225 -39 -68 -344 -212 196 -98 -441 120
2670 120 81 -90 -97 19 265 -46 -216 260 258 -207 129 127 87 -136 -284 568 12 -5 169 262 -277 -55 -41 170
2694 170 116 -387 155 -118 -333 -220 71 -67 -99 -345 259 48 -313 109 202 213 -56 99 200 -290 -198 63
$$ packed form
2535@J24m59K24l3J42Q5k01J63O4j19jJ24k7J41k54K98K3l61R7J55k48M7p9O7
2559b8J70k68L37j63j67P2j7j18L81n10L02p3j05K66m8j71L81l29L64m62J03J24
2581D1q5N2L1j12J80k99K5J50K00j56K61m71M05j35k70L58j26r3pO0j40J99m33
2604c65N13Q3m71j1L46kl27j13N92J4o93L23K06k27L01n6L60m54K6M50l42j14
2626C9m8j8K17k41k52L53j02k85J82%K04k57k24N44j29m51O17J30k70k97K67K62
2648B41m72N2M80L9m96M27Q6k47q8q4O47m59l48M47k64k9k76J32M08k94l43N61
2670A20l9j71pJ16K46l11j70M76km65L36km0k23j48Q52n56j7J74R3n39K22J4K11
2694A70n4n03N42k73k15J13K91j38l2k46O04k11l61M22R3J1k69J55J01m90R2K61
$$ plain form
2716 63 159 -115 112 151 306 -29 -423 140 -224 -248 288 83 -154 -292 -151 162 -471 -255 193 129 -95 -159
2738 -159 364 296 -203 6 386 -85 127 -66 -65 147 -15 -86 156 -23 -91 300 226 102 -33 -37 100 -157 -235
2761 -235 127 -75 -35 -63 65 28 -293 5 580 -223 -36 109 179 202 -63 359 304 -163 165 -13 66 -116
2783 -116 0 13 324 -404 -110 201 -151 -45 32 152 215 -78 50 306 19 -313 -35 130 -214 -197 7
2804 7 227 -83 -138 60 168 -23 38 -8 56 -185 70 236 -22 -25 -205 -64 138 -229 -166 55 -2 -14 48 56 10
2829 10 -116 81 50 -129 2 -18 38 -50 -84 14 20 -83 -88 214 -104 9 112 -8 3 -176 -36 76 109 -116
2853 -116 -191 -60 20 -365 104 -14 -189 212 -343 -296 103 -344 57 -130 -227 -85 103 21 -87 -52 -204 171
2875 171 -103 39 86 168 -33 -92 319 185 -193 -131 520 -284 81 218 -79 -131 -362 16 -7 -149 -130 -7
$$ packed form
2716F3R6k74K27L9J55l35l94N63l64k4N36k05k37j38J41L13o33K16M48o4k24o4
2738a59N23o8m99K09L80m71K12j93JK12j62p1K42j79o8L91p4j24j35mJ37k57p8
2761b35L62k02M0k8J28l7l21K98N75q03J87J45P0K3k65M22n5m67L28j78P9j82
2783a16J16J3L11p28K94L11l52J06P7J20O3k93J28K56k87l32K78J65l44J7K04
2804GK20l10n5J98J08j91O1m6O4k41K55J66k58lj80J41K02l67O3K21n7j2O2Qm6
2829A0j26J97l1j79J31k0N6q8l4R8Oj03nL02l18J13J03j20J1j79J40J12L3k25
2853a16p5J31Q0l85M69j18j75M01n55M7L99m47M01j87r7J42J88q2j08L5j52L75
2875A71k74J42M7Q2k01n9M11j34l78O2O51q04L65J37k97n2k31L78k3j42J9J23
$$ plain form
2897 -7 92 -167 -62 127 109 -194 167 261 98 140 -46 53 451 -54 -26 292 -112 23 -71 -105 10 -136 -27
2920 -27 -101 -429 112 208 -300 -454 -85 1 141 -49 106 475 -50 -99 -58 -191 63 -164 8 72 -232 -129
2942 -129 226 110 153 -21 136 110 -228 -38 230 -191 -285 -223 171 -117 -263 -120 -59 -149 -20 -141 14 1
2964 1 -363 277 121 -206 91 64 -3 -135 -266 205 155 -454 -31 53 -202 -12 142 -226 -27 -283 -6 94
2986 94 -225 -26 105 150 136 -178 84 -216 -188 207 34 -53 108 -30 106 209 -208 151 41 -89 249 131
3008 131 -11 -109 -231 254 -44 -375 -49 146 -52 167 83 31 -212 16 141 21 -221 14 -256 175 -97
3029 -97 -266 209 -125 -149 363 67 65 -98 -44 180 -69 -307 30 441 -200 193 -46 160 -114 -128 235 -220
3051 -220 -149 -92 -53 13 -79 -38 -85 -30 -124 118 8 61 -90 48 122 101 266 245 68 90 142 183 -21 68 129 403
$$ packed form
2897gR9k59J05J89j8l03L61R4j63M2j86R9L98n05K8L18m04J35r4l4J15j46J09
2920b7p4l28N41R6n08j54L69Q6J40j90J55L69n25m9M1j33K54k27J72O4l04J03
2942a29L55j16M3j74J57k6l38J90K68m21r4O2L94k88j46J43O1r0J29j21J55j3
2964Al64O40j56l27K97k7o7j32j31M71n0o09M23Q4k55J90J54l68J99k56K77J00
2986I4l19J99J31M5j4l14K62l00K8L95j73q7J61j38J36J03m17L59j10j30L38j18
3008A31j42r8j22M85k98l31L26J95j98K19q4n2k43K28J25j20k42K35k70M31k72
3029i7j69M75l34k4N12k96kj63N4K24k49k38L37M11o41L93k39K06k74j4L63m55
3051b20P1N7L9O6r2M1m7N5r4K42j10N3j51J38P4k1J65k1j77K2N2M1k04Q9O1K74
$$ plain form
3077 403 81 -17 -90 -133 27 -141 -240 39 -137 3 -216 35 80 -1 -15 153 365 67 365 311 155 -119 -94
3100 -94 203 237 -212 99 -33 -10 -216 -163 27 -151 -141 83 -63 -102 3 -270 -137 31 25 -94 -140 7 35
3123 35 -132 -71 -99 71 49 201 -64 206 184 -55 91 -61 112 -91 -97 172 -29 117 -178 -244 121 -229 75
3146 75 171 59 -12 2 82 45 -71 -130 363 73 12 -81 25 -110 63 119 26 150 207 200 186 146 136 61 -64 -166
3172 -166 -45 -32 17 -297 90 -142 18 16 10 118 -35 -285 247 29 58 -294 235 128 -163 -209 212 -128 204
3195 204 196 63 22 86 31 123 114 -95 198 174 125 -99 112 352 -158 -73 131 86 -22 -170 42 138 -201 -143 279
3220 279 -79 -116 158 191 25 -357 38 341 125 -19 -264 36 48 33 105 201 -258 27 145 -52 -159 84
3242 84 -95 126 -191 87 -33 -232 -85 -278 -28 -34 -188 -120 176 33 250 258 95 -56 238 221 220 108 -73
$$ packed form
3077D03l22r8p3m3J60j68r9K79j76J40k19K51M5q1j4J68K12k98K98n4j56k74K5
3100i4K97L4m49L11j32K3k06N3J90j78J0K24j46l9J05k73J33J68oj19m6J47K8
3123C5j67O1k8J70k2J52k65K70k2k39J46j52J73k03oK69k01J46k95o6L65l50L04
3146G5R6j12p1J4Q0l7j16n9M93k90o1r3J06j35J73N6r3J24N7pj4m0j0p5j25j02
3172a66J21J3M9l14L87k32J60koJ08j53k50N32k18K9l52N29j07k91m6M21l40L32
3195B04qj33m1O4n5R2rk09K93k4m9k24K11K40n10Q5K04m5j08j48K12R6l39N8M22
3220B79l58l7K74L3j66l82L95L03k16j44k45L00J2j5P2R6m59K85J18j97j07K43
3242H4j79K21l17K78j20j99J47j93K50oj54O8K96j43K17Qj63j51K94j7jj12j81
$$ plain form
3265 -73 105 -172 -76 100 117 -82 -69 18 -201 -159 -66 -16 -124 85 -151 -82 -87 -326 -131 37 -281 -176 5 29
3289 29 -105 29 -30 229 -51 55 -118 70 19 113 -8 43 123 -219 48 62 89 -43 -247 45 -295 -209 85
3312 85 -50 38 109 -161 59 -172 30 25 -7 16 -27 206 14 -260 183 200 -32 -102 167 -43 -119 -149 42 247
3336 247 88 -154 -35 -324 68 -179 -69 121 -169 -32 233 146 107 108 -68 87 -96 -71 172 -20 129 -65
3358 -65 77 87 150 169 74 -263 0 -31 -114 -101 20 -28 -6 -140 -74 -35 -140 -35 172 155 -109 32 -62 233 -26
3383 -26 126 32 -299 37 -76 -9 -57 -248 -135 0 179 185 -63 62 63 -200 -63 -16 -218 77 -84 -95 -33 -147
3407 -147 91 -76 77 -5 -50 -142 -247 -45 186 -14 24 202 180 -15 277 175 343 169 -330 23 26 -132
3429 -132 -10 182 -295 -83 -342 60 -129 -186 245 -257 15 53 -273 90 -29 -523 122 206 342 167 -149
$$ packed form
3265g3J78k77R6J76J7j99J3Q7k19M2R3N0j08K09k36O9nk39J95J68l18J05J81K4
3289B9j34J34n9K59k80J06j73J88n1R4j21N1Q0l42K67J4K7j32k04K92l40Q6K94
3312H5j35Q8P1k70K20k31K02nl2K3m3K33j92k74M43J7k32p0K69k10p6l0J91K05
3336B47j59k42J19k89L92k47J10J90k90J37K65q7l9Jj76J55j83K5K43j92J49j94
3358f5J42J0O3J9r5l37K63l1q3J3J21m8K2j34O6L9j05J05K07j7k64J41r4K95k59
3383b6J52r4l31L36j13O7m8j91J13J35J79Ok48J25Jk63J37M7k02K95j61j1O2j14
3407a47K38j67J53q2m5r2j05K02K31k00L8J78k2j95K92j02J68j74m99L53Lj58
3429a32J22J92m77K12k59M02j89n7M31n02K72L8l26L63j19m94O45Q4J36j75l16
$$ plain form
3450 -149 -116 -7 -68 48 141 -224 100 280 110 198 -244 -67 185 -89 19 -134 136 6 -136 103 209
3471 209 54 13 -95 152 -57 -52 22 -211 38 243 -75 -62 193 227 1 13 52 -24 -45 -110 -82 116 -168 -182
3495 -182 121 150 66 -131 116 -105 -72 108 -180 14 95 -60 180 -71 -266 -39 -58 68 -141 -163 77 -186
3517 -186 -80 -120 112 -139 -63 -78 99 152 -54 182 11 -81 45 -33 15 0 116 162 -195 -88 97 -93 -115
3540 -115 -124 21 59 -197 77 163 -164 -66 145 246 -81 100 -189 220 138 -46 260 12 -70 74 83 -174 -134
3563 -134 52 -48 16 -245 129 13 -12 163 -1 147 -116 144 -102 -26 10 173 -110 -4 -7 13 37 -303 -41
3586 -41 25 124 -188 -194 175 30 -75 -124 248 80 -32 -163 -172 -45 22 -82 33 -49 98 -129 -176 165 129 -317
3610 -317 21 8 -50 43 -183 199 -292 183 -20 -86 176 197 79 -112 132 381 343 -119 -35 -29 -56 -58 -91 -458
$$ packed form
3450a49L3J09o1J16R3l65L24J80j70Q8m42J77K52k74J08j53K70j30j42K39J06
3471B09j55m1j08K47k09NP4k33K49K05l18J3K55L4k26J2L9p6k1o5K8J98k84j4
3495a82L03K9q4j97K47k21L3J80k88J94Q1j55K40k51j95K27j9J26k09k2K40k63
3517a86J06m0K32k51P6j5J77N3k06K36j71r2J26p8M8j5J16M6l57J07J85j90k2
3540a15rJ45L8k56K74Q6l27R8K11J01l27J81k89M09q2j84L06k48q2J44Rk57M0
3563a34J86j00O4k61L74j16k5J75j64J48k63K60k46P6L6J63k83J06lK0K4l40K62
3586d1O6R9l12oL69j45j05m9L72j68j12j31rJ27O7j04J15q2J47k27m7L41l6m46
3610c17L38j3n8R3k26L82m91M75k03o6K62K1j18j91K44K49l8m62Q4Ok7kl3l67
$$ plain form
3634 -458 -240 145 -49 -116 51 -403 -72 -128 -202 -63 60 346 27 279 -5 -39 289 -151 57 66 -100 145
3656 145 -208 8 -4 6 -129 150 -136 -114 134 189 19 -198 -129 -34 -70 -225 10 -232 144 73 -97 262 57
3679 57 70 161 66 -147 -33 113 103 -40 5 271 -37 96 92 -54 -72 -226 -313 -26 -131 31 149 150 97 39 110
3704 110 142 -324 -110 270 -158 -257 -9 157 -74 -205 -139 225 320 -220 -122 228 -34 21 -116 -3 -91 -80 -307
3727 -307 -287 45 -255 -31 32 -34 -300 -365 137 278 55 28 140 2 137 -62 29 -106 58 -103 -129 215
3749 215 74 181 -191 -273 -99 -175 -118 -281 -3 153 -81 40 -105 -272 135 -133 -335 114 72 -45 -73 -145
3771 -145 -47 -21 -12 -197 156 -117 -18 -203 35 217 143 8 -154 152 116 15 178 -47 -55 37 48 -143 -59 -100
3795 -100 -22 217 -235 -232 13 157 -210 -316 -288 79 -34 7 -135 336 -50 99 169 46 21 37 283 36 -111
$$ packed form
3634d58K18L85j94o7J67m54L31n6p4J39J23K86l19K52k84l4L28m40K08Rj66K45
3656A45l53K16j2J0j35K79k86K2K48N5j70k17O9R5l6j55K35k42L76p1j70L59k05
3679E7J3R1r5k13J14J46j0j43M5K66l08J33mj46j8j54q7K87j05J62J18Jn3n8P1
3704A10L2m66K14L80m28r9K48J66k31j31O6L64R5n40R8L50k62N5j37J13q8J1k27
3727c07K0L32l00K24O3o6k66o5N02J41k23k7J12j38J35j99R1j35J64j61k6L44
3749B15j41J07l72q2J74p6N7j63K78J56k34J21j45j67M07k68k02M49m2j17k8p2
3771a45R8K6Rj85L53k73R9j85K38J82p4j35j62L06l6j01J63k25qR2J1j91Q4m1
3795a00P8K39m52LK45J44l67j06K8L67j13M1j42M71l86J49P0j23k5J6K46k47j47
$$ plain form
3818 -111 185 116 55 -127 22 98 61 -206 -158 -122 13 -78 112 -193 -109 170 -32 -142 -54 -50 97 -133 47 124
3842 124 155 1 -18 24 80 -62 17 -29 156 -230 -91 76 229 -1 136 159 118 -3 93 -151 164 -118 -116 33
3866 33 1 85 -78 -35 -12 388 -253 -28 -152 17 345 164 -146 215 52 -130 169 -28 62 -210 -73 59
3888 59 122 -66 80 297 -53 -35 -277 186 51 12 -10 -420 -87 -102 -278 -48 144 5 65 156 427 143 33
3911 33 -99 -43 -71 143 -224 -12 166 -43 51 -13 -125 40 2 -50 -71 -62 236 15 124 203 135 -24 -196 -167
3935 -167 86 71 -321 278 -106 39 103 50 -8 -65 -61 282 -116 -226 200 77 70 -270 -30 82 17 -300 -47
3958 -47 -122 -185 -14 80 131 77 37 363 23 65 119 82 290 49 -48 -122 87 -219 253 305 20 171 -7 24 -53
3983 -53 13 60 -38 -11 -148 144 -33 -58 -219 127 -6 -198 -97 32 -75 -25 -109 -177 64 9 -42 -19 124 172
$$ packed form
3818a11K96o9o1j82J49P6l7k67M8L6J35r1J90l05Q4K79k02j10Q8MJ47k30J80P7
3842A24L1j54j9M2N6j42P9m6J85l86J39J67J53k30J37K3m1j21R6k44L15k82KJ49
3866C3l2Q4j63M3K3M00o41K25j24J69L28j81l10L61j63j82K99j97R0k72J37J32
3888E9O3j88J46K17l50J8k42M63j35l9k2m10L33j5j76K30J92j39O0R1K71k84j10
3911C3j32N6k8K14l67K12J78k09R4o4j12J65l8n2k1RK98k21J09P9o8j59j72K9
3935a67K53j5l92N99l84J45O4n3n8n7ML43l98j10M26j23pl40K40J12o5l17K53
3958d7p5o3J71R4N1n4m0L26l40M2N4l7K08k41r7p4K09l06M72N2k85J51j78L1p7
3983e3O6M7r8K7j37K92j77k5j61L46j33j92J01J29j07N0q4o8K41n5n1K3J43M8
$$ plain form
4007 172 292 235 138 -54 52 -177 -145 86 8 36 142 -149 61 -238 -192 148 -131 -68 -172 -163 -78 -129 239 -34
4031 -34 -124 -172 -72 -124 -38 -33 182 51 -17 40 311 -125 124 -269 98 118 -125 -132 24 -82 -178 12 -150 -113 165
4056 165 16 24 -28 -155 165 206 136 65 33 -70 29 -1 11 -102 44 3 -170 -12 -53 -108 58 -55 150 54 23
4081 23 -282 79 -203 -86 -187 -79 132 -186 61 -345 105 -98 -30 63 144 -113 136 110 45 141 -31 -3 -81
4104 -81 -75 126 -72 -160 141 -121 -140 -64 -31 -35 -152 -90 -206 -205 65 -223 10 94 -70 -12 56 40 20 72 369 233
4130 233 60 -2 -169 15 68 -127 40 -226 -258 -213 38 248 76 74 -126 22 -21 -214 129 -36 -87 53 126
4153 126 -40 -118 -33 -50 -140 210 76 64 10 197 45 -111 -82 -194 128 72 34 -117 -34 -255 165 -233 139
4176 139 143 -106 43 121 -1 121 -129 193 20 -305 152 -172 36 171 -207 -55 -65 26 55 -50 -47 80 168
$$ packed form
4007A72J20n7r7j92J06k29L2K31p8K8J06k91K10k99M6L40k79O3j04RQ5n1L68k73
4031c4r0m8J00n2Q6NK15j31o8N7K71m36K49l93L67K0k43pJ56j06r6J90j62L7K78
4056A65j49Qn2j27L20M1p0p1l2j03R9l0J2j13J46m1j73J58m1n5J66j13K05r6l1
4081B3l05L61k82J17j01J08K11l18K47m06M50k03O8R3Q1k57K49k6o5R6j72K8p8
4104h1OK01j98q8L01k62j9P6L3mj17O2j16JK70k88K33Q4j64N8O8j6k0N2K97j36
4130B33j73o2j67J84N3j95J67k66l2M5K51K10j72kk00J48m3j93L43j65n1J40P3
4153A26j66p8Q5j7r0L50j34j2n4J87j52j56K9j12L22n6l8j51Q3k21M20l98L72
4176A39Mk49J49P8j22J22k50L22j73l25M57l24K08J35l78J52j0R1K9j05LJ27Q8
$$ plain form
4199 168 218 -188 -48 205 -20 -169 -67 -179 -96 -174 69 146 -251 -62 54 -202 -253 52 69 -1 93 -157 -230
4222 -230 88 -51 -222 -165 57 -163 202 83 -134 90 150 -84 224 58 53 -31 381 72 30 -48 2 -53 -55 -2
4246 -2 -3 0 209 77 21 -110 82 140 86 -61 311 18 88 208 194 -158 -51 105 84 22 175 285 -166 -245 171
4271 171 124 -56 20 88 21 -67 -50 -277 149 49 -126 160 58 -71 11 151 99 93 -92 -308 91 38 -61 142
4295 142 -76 147 20 68 191 21 -117 140 32 259 48 -80 120 98 155 156 -260 -132 256 -186 -169 119
4317 119 -45 -90 -42 53 183 -25 134 5 53 -141 42 -58 15 -11 -83 64 25 130 80 -377 178 78 140
4340 140 -88 -68 235 359 -272 -56 -108 110 -54 -169 128 -85 -130 51 10 -96 -372 62 92 29 103 89 -168
4363 -168 -1 -76 74 167 -31 161 -12 -39 179 205 -33 34 -36 -96 33 20 -80 74 -355 -45 53 -150 -323
$$ packed form
4199A68N0m06J40K53k25j49J02j12Q3p8K43P7l97J89J16k56n1L05J7p0R4k50p3
4222b30L18j39j71N7K22k20L65j19k17K24O0k34L08j66nq4M12l09m2p8N0n5kN3
4246bjLK09j32n6j31J92N8n4j47L72k93P0J20j4l52J07J56k1o2J53J10m51p9M16
4271A71m7j80P6O8o7q8J7k27M26j00j75K86j02j29Q2J40n2oj85k16L99n3r9K03
4295A42k18K23j27M8J23j70j38K57j08K27k11j28K00k2N7Jm16J28L88m42J7K88
4317A19j64m5M8R5J30k08J59j29M8j94J83j00P3k6p2J47l9J05n0m57N55j00O2
4340A40k28K0L03J24o31K16n2K18j64j15K97k13m5J81m1j06k76M34L0o3P4j4k57
4363a68J67p5J50R3j98J92j73k7K18K6k38O7p0o0J29j3j00J54m29L10R8k03j73
$$ plain form
4386 -323 -5 32 101 -52 -71 -15 -147 48 -35 -18 -91 8 81 -107 -207 -8 248 25 14 -132 -233 -70 114
4409 114 -51 -161 -231 -260 -163 -60 -64 124 -74 24 -23 47 275 288 172 6 -124 116 -35 -50 133 151 332 51
4433 51 63 148 -121 -131 -30 46 -32 170 -270 291 209 -128 -163 262 -13 -135 -126 -25 89 257 213 -94 -106 115
4457 115 52 -121 -67 -128 104 122 66 244 64 -40 157 69 203 -181 -130 -27 51 -93 94 -190 -14 -182 -285
4480 -285 116 -161 68 -127 -240 393 -24 -92 -99 83 342 -47 26 -90 16 25 116 221 19 -144 -235 41 72
4503 72 -130 -210 242 200 73 -146 -57 -61 -219 -161 -43 -141 295 -11 -221 -21 -146 -110 57 122 268 -102 -83 -87
4527 -87 -145 -69 124 -10 75 338 39 -46 -128 -7 108 -54 180 -93 74 -178 7 -42 -93 -60 -9 57 234 -42
4551 -42 -63 140 -272 -207 -160 143 15 231 190 122 -63 -43 135 -8 -30 -168 -23 -24 -380 -16 -216 27 -7 -314
$$ packed form
4386c23L18L7O9j53j9N6j32J95q3J7p3R9P3j88j00J99K56k23j1j46j01J63J84
4409A14j65j10p0k9R7J03mJ88j98R8m7P0K28J3j16j66j30K40j51j5J83J8J81k81
4433E1J2Q5k69j0J01P6p8K02m40N61q2l37l5M25k75j22RJ01J14J68m4l07j2K21
4457A15o3j73N4o1K32J8n6J78j80j04J97q8J34l84N1J03P8j44J87k84J76j68j03
4480b85M01k77K29j95j13O33m17o8pJ82K59l89P3j16J06RR1J05k02j63r1K76L1
4503G2k02q0M52m2j27k19Q9mj58N8J18r8M36l06k10K00j25L6J67O5J46l70J9m
4527h7n8P6J93j34Q5K63k99q5q2J21J15j62K34k73J67k52J85m9n1L3N1O6J77k76
4551d2k1K03m12O5M7L03j28K16m1o8j85K0J78j43k2j38J45jl56L64k00K43l4l07
$$ plain form
4575 -314 15 -13 -35 244 -208 -289 -75 298 78 98 263 -207 147 -70 156 63 -20 -68 -6 -6 134 123 -6 -142
4599 -142 -17 -42 24 -211 56 357 -13 -114 177 -117 131 55 -43 121 -112 202 106 97 -46 72 -79 112
4621 112 -271 -9 101 -21 39 36 -26 146 -7 22 6 127 28 74 98 -122 -36 -71 -252 -153 97 159 75 -168 -47
4646 -47 236 165 -38 -202 -64 95 -179 -105 262 64 -141 -47 -247 128 46 133 -186 167 132 67 8 -65 -88 108
4670 108 -249 -113 -100 -203 167 -167 107 -141 162 -98 -52 99 16 57 -1 -189 127 21 151 -168 -34 -47
4692 -47 -94 -3 -19 -4 -10 239 -98 -9 103 39 160 -176 -70 -68 -21 74 -78 -260 -8 -70 3 -41 -93 23 -65 -11
4718 -11 -113 -77 -129 477 -86 -22 -306 77 -57 -122 62 -148 -34 -110 -38 69 21 69 95 173 -6 -384 -3 229
4742 229 -61 128 98 -52 101 31 -181 227 46 159 156 91 -145 203 95 95 66 -51 101 -54 75 -78 5
$$ packed form
4575c14L29k8k2K79m52q1K14L73k20K0J65m70L54k17K26r3q3m8O2%J40j1j29j36
4599a42J25k5O6k35K67L01l70j01K91k94K48p6r8J64k33L14r6rj43J18j51J91
4621A12l83K62J10j22O0lo2J72j53K9j6J21r9M6K4k20Q6l5j81R9K50O2q4k43J21
4646d7K83p1k03j64J38J59k74P4L67j98k05R4k00L75q2Q7l19L53l5o5n9p3k3J96
4670A08l57J36J3j03L70l34K74k48L03k60M6J51q3M1n8j88L16j06J30l19J34j3
4692d7m7R1j6J5oK49l37Q9J12o4J21l36J06KM7R5j52j82K52o2P3m4n2J16q8N4
4718a1j02L6n2O06n63O4k84L83j34o5J84k10J14p6P2J07m8M8K6P8j79l78L81K32
4742B29k90J89l0j50J53p0k12M08j81J13lo5k36L48j08%k9j17J52j55J29j53Q3
$$ plain form
4765 5 -270 -189 150 -81 -458 36 136 -118 -40 133 -130 -48 -11 -67 380 63 71 36 143 260 0 68 -131 -164
4789 -164 31 82 -52 100 -216 -18 295 -36 -155 103 -257 -325 -92 17 43 -38 -168 248 -38 153 -8
4810 -8 81 46 22 43 -141 37 -228 -109 -36 -122 -100 30 159 1 89 0 -143 181 100 9 -101 22 74 275 74
4835 74 -3 42 -127 -205 -200 -21 4 -39 35 -99 -43 208 -64 161 -87 231 -67 -38 -71 -126 -70 -341 -78 48 35
4860 35 214 -54 48 -6 38 -17 -41 54 12 -228 -163 27 0 -28 60 123 35 -158 -16 -142 -58 -46 -194 -99 -3 -333
4886 -333 -121 -18 26 -83 20 -141 -278 -24 22 -112 -214 -19 64 -264 117 30 -4 296 131 15 174 24
4908 24 -52 92 150 87 -54 32 -103 142 31 -90 -72 -55 140 66 -217 -65 -33 221 -92 -55 367 -185 64
4931 64 125 -112 168 -122 156 -32 114 -219 -128 -141 -96 85 -118 99 -31 -180 146 145 -254 8 -78 157 -33
$$ packed form
4765Ek75Q1L39k31l77M94J00k54P8J73k63Q2L7n6M47l17Ql5J07J17k60O8j99l3
4789a64J95N1j34J52l16J98L13l31j19K58l60o8K33J09K6q1j30M16k86J91j61
4810hQ9l5k4K1j84J78k65J19P3q6K2J30J29j58Q8q9j43L24q1r1j10J23N2K01k01
4835G4p7M5j69p8NJ79K5m3P4j34N6K51k72K25k48L18k98K9l3n5N6k71K63J26j3
4860C5J79k68J02n4M4n5k4R5m2k40O5J90k7k8Q8O3q8j93J42j26Q4J2j48R5R6l30
4886c33K12J03M4j09J03j61j37K54M6j34j02J95Q3l28L81q7l4L00j65j16J59j50
4908B4p6J44N8o3j41Q6j35K45j11j21J8J7J95p4k83J52L2K54l13L7M22n52K49
4931F4O1k37K80k90K78j88J46l33R1j3M5J81k03K17j30j49L26jl99K62q6K35j90
$$ plain form
4954 -33 -152 -49 99 -152 143 158 34 -278 -63 -234 -169 -13 171 0 -38 332 -90 -163 54 61 -99 -28 -29
4977 -29 21 -92 12 -66 8 12 -55 -209 -108 106 80 26 168 -112 17 34 117 6 115 12 48 -189 147 12
5001 12 -214 -51 -122 119 25 -17 -81 70 -143 31 -87 -27 -15 35 -242 134 -251 205 -58 191 45 93 -190
5024 -190 343 25 -77 134 -7 -23 -135 -207 -50 -117 -78 44 -201 -145 19 58 -122 173 64 -108 -137 -166 97
5047 97 -57 -3 236 -84 -229 231 -130 -42 -157 118 12 -144 -20 -131 -77 -92 -204 -246 103 -28 57 164
5069 164 270 172 224 163 -2 -23 60 -202 -50 -269 116 -4 -25 29 74 97 5 -72 -235 48 48 41 145 229 -56
5094 -56 205 121 -178 51 121 50 7 100 -65 52 90 120 70 -73 70 13 -35 -58 -117 -118 54 -244 -213 -101 31
5119 31 -287 -6 -160 -36 10 200 -25 -208 107 -265 -16 247 33 14 47 16 -114 161 74 -60 32 -167
$$ packed form
4954c3j19J03J48k51K95J5j24l12K15j71O5J56J84j71l8L70m22p3K17Pj60P1j
4977b9N0j13J04p8P4Mo7j54J01K14k6n4J42k80J29J7Q3j11J09j03L6k37L36j35
5001A2k26J63p1K41r4m2o4J51k13J74j18O0J2N0k77L76l85M56k63K49j46M8k83
5024a90N33l18j02K11j41j6j12p2J57o7L9J22k45N6J64L9j80K95j09j72k9k9K63
5047I7j54N4K39l20j45M60l61Q8j15K75j06j56J24j11N4j5j12m2L49j31Q5J07
5069A64J06r8N2o1j65k1Q3k62J52k19L85j20k1N4M5K3r2p7j63K83%pJ04Q4k85
5094e6K61q4k99K29P0p1m3R3j65J17L8L0n0j43J43n7m8k3n9jJ72k98L1J12J32
5119C1l18K81j54J24M6J90k25j83L15l72K49K63k14j9L3l1j30K75q7j34R2j99
$$ plain form
5141 -167 40 55 -52 -135 140 101 -72 86 102 -149 -246 -146 -76 295 156 98 172 -388 315 -100 -182 -170 -296
5164 -296 -10 -27 149 -82 29 -11 2 -234 61 407 191 -72 6 -6 -110 -78 -48 80 -40 56 -116 -2 21
5187 21 65 -154 102 32 -25 78 -149 154 -128 -140 -50 19 -284 138 -118 22 -38 183 -6 116 143 37 38 -71
5211 -71 -43 63 93 29 -243 -136 -193 48 -153 90 234 -152 72 11 59 3 -130 59 269 -161 105 166 135
5234 135 129 75 156 -250 64 -133 -145 -68 -27 -134 145 325 -95 172 13 -221 119 369 -41 -156 260 164 -145
5257 -145 55 222 -145 -237 119 25 82 178 -41 136 -51 -203 -177 -14 -206 5 -90 -34 203 -58 -151 -67 -116
5280 -116 -28 33 -125 -40 -78 103 126 -112 164 -98 95 277 -77 -42 119 90 -135 35 136 3 86 -239 -136
5303 -136 66 258 -22 65 33 336 -203 130 -92 69 56 -12 -83 -52 59 -166 -99 -171 -41 81 -16 -80 -84 -81 -14
$$ packed form
5141a67K07J5j07q3K75l9j73J58J6k51r7J00P0L71j39n8P4n60P03m15q2J2j26
5164b96K86j7J76k31J11m0J3k36K95L46k16k63P8j2j04L2L0J28j20R6j72J14K3
5187B1M4k19K56p0n7J03k27L03k82j2R0O9l03M22k56J40o0K21j89J22K7j06Jj09
5211g1K8J06L0o4k72J07n7K41k01K43J44l86K24o1M8n6j33J89K10m30K66O1l1
5234A35on4Q1m06L14j97j2P7M1j07K79J80m20K67j59k34L40K50m10j15M16r6l09
5257a45K00J67l67r2L56r4N7R6k19J77j87j52K6J63j92K11r5N6K37k61r3Q4m9
5280a16Q8O1j58Q5l8J81K3k38K76k62J93J82l54L5J61k9k25J70J01j33Q3l25J03
5303a36K02J92k80Q7l2L03n39L33k22J61j3o8p1L1J11k25O7p2J30J22r7o4mLO7
$$ plain form
5328 -14 99 -223 166 -61 83 -44 84 -56 229 -111 -183 35 -104 80 -103 105 -162 -298 -77 54 -19
5349 -19 215 19 -175 -60 53 -73 37 -120 -177 19 344 -18 176 212 100 -126 -82 -114 -176 30 -47 117
5371 117 -6 27 -154 93 86 -159 -150 118 -82 -180 39 39 -107 265 -23 14 287 96 46 83 30 415 12 12 -35
5396 -35 -121 95 -76 61 95 329 29 -78 152 1 -45 -130 -66 29 -44 28 -68 -19 -211 157 18 -24 -98 90
5420 90 191 22 211 130 128 85 147 -146 26 -127 52 125 -19 -73 54 -237 -41 10 -134 351 44 -170 40
5443 40 -98 -50 229 98 -163 -81 89 68 -90 -250 -110 -59 -45 189 -139 -162 -20 -39 -32 -46 -87 -188 -33 274
5467 274 -26 228 163 -71 16 -272 -106 0 82 -6 -165 -165 -27 -174 260 -164 102 -28 -122 106 -8 73 -46
5490 -46 -64 140 -64 208 36 53 278 139 -24 -125 26 -202 255 -24 -39 -99 53 91 -35 -39 -77 229 224 252
$$ packed form
5328a4J13l22L89k27J44j27J28j40K85l40p2K18j39J84j83K08k67j36K21J31p3
5349a9K34j96j94J15J13j26J10j57n7J96L25l62J94L6j12k26M4l2o2K06p7J64
5371A17j23L3j81K47pk45RK68k00r8K19%j46L72k88L7K73j91n0L7n3L85m03%m7
5396c5q6K16j71J37L4K34l00j07K30j51m6q5O4R5p3P2r6M9j92L68j39m2p4J88
5420I0J01j69J89q1km3O2k93J72j53J79P3j44n4J27k91J96N1j44M85l07k14K10
5443D0j38M8K79j31k61Q2J70k1j58j60J40N1J4K34l28k3J42j9Pj4m1j01J55L07
5467B74l00K54o5k34Q7k88J66J06Q2q8j59%J38j47M34m24K66j30r4K28j14Q1j19
5490d6j8K04k04K72j72J7K25j39j63j01J51k28M57k79j5o0J52L8j26ml8L06nK8
$$ plain form
5514 252 77 -116 -115 -90 141 241 14 96 117 128 -148 -144 43 -124 58 -208 174 188 -88 101 -46 -142 -61 -29
5538 -29 -36 273 181 -10 -136 -204 -120 160 54 -127 -106 21 175 59 137 -249 328 -92 173 -12 -220 15 -137
5561 -137 43 -170 -226 20 -26 -194 82 91 187 168 -99 -54 -222 192 24 36 -50 -33 279 -29 33 48 21 364
5585 364 142 -66 128 106 -27 -166 -221 279 -132 69 17 248 53 -412 180 -105 151 -234 234 200 133 107
5607 107 -140 169 -11 36 44 63 69 35 -260 -197 -75 24 -127 -136 -172 -125 -101 -77 -131 -37 140 97 25 173 -210 5
5633 5 145 351 -128 179 -77 71 -78 -66 -219 14 -111 -81 -65 -24 -109 -222 223 -95 -25 -50 269 -37 -133
5656 -133 -146 -6 -32 -146 188 -10 77 33 382 328 -257 -112 91 185 37 -78 -217 -93 -22 47 19 175 127
5679 127 -118 -20 -32 -138 77 6 6 101 -32 -202 -135 28 104 -4 -169 17 138 -116 -73 90 -8 254 90
$$ packed form
5514B52j75j93JK5K31J00k27Q2K1J1k76MJ87j67J82k66L82J4k76J89j47r6Q1L2
5538b9pL09r2j91j26o8Q4K80j06j81K1J27J54j16P8l86N77m20K65j85k08K35j52
5561a37J80k13n6K46m6j68K76RR6j9k67M5j68M14j68J2q6J7L12l08O2J5k7L43
5585C64k22k08J94k2j33j39n5N00m11K01n2K31j95m65N92k85K56l85M68l4o7k6
5607A07k47L09j80M7QJ9Ol4k95O3J22R9j51rl6M7K4K4n4R4J77m3p2J48l83K15
5633EJ40K06m79L07k56J48j49J2j53K33j25L0J6M1q5j13M45l18P0k5L19l06r6
5656a33j3J40k6j14L34j98Q7m4L49n4n85J45K03R4j48j15j39J24P1O9k8J56m8
5679A27k45R8j2j06K15p1%R5j33j70O7J63P6j08j65J86J21k54M3J63r8K62j64
$$ plain form
5702 90 28 -195 21 -12 -111 -52 72 -8 -93 103 -218 -22 132 -29 -212 -42 45 60 -284 55 -12 -145 -122 -361
5726 -361 -8 249 102 -233 150 -49 -34 -224 121 47 -160 -125 155 -129 63 -292 186 -10 32 -125 -109 -30
5748 -30 -36 244 100 71 172 -151 38 128 127 -60 292 -128 70 20 36 266 114 369 -41 115 -108 -38 -4 -130
5772 -130 68 -171 279 72 286 -79 -116 82 190 63 0 -7 136 -220 -97 71 -87 50 -24 209 -32 131
5794 131 -97 143 83 87 -65 67 147 -159 102 299 -131 -123 66 -100 -111 -19 59 153 -5 -108 2 294 93
5817 93 -5 18 274 81 -196 98 -191 12 -113 -163 236 -53 115 -75 17 89 -263 76 -122 -100 -2 166 121
5840 121 -47 105 52 179 164 387 -72 -127 373 -128 -134 5 -25 124 -133 -170 -113 48 -228 -67 219 219 155 -14
5864 -14 175 43 -135 18 -189 17 43 60 209 354 11 182 26 -144 180 -238 1 31 90 111 133 66 70
$$ packed form
5702I0o2k23K16l3r9N9J24q0q5J96l21J96J54j61j83J70Q7J5l44L39o7j33K3k39
5726c61L53K57j47l35L83j99J5j90L45p4k07L5K80k84J92l55M78j96M2j57J6P9
5748c0oK80j44k9J01l23J89R0jj87L52m20J98n0J6K30j52K55m10J56k23P0L4j26
5772a30J98k39M50k07K14l65l7J98J08j27o3pJ43l56J23J68j58J37p4K33k41J63
5794A31k28K40o0Mj52J32Q0l06K61J97m30QJ89j66j1R2P8R4j58j03J10K92k01
5817I3r8K3K56j93k77K94k89K03j25n0L99k89J68j90R2P2l52L39j98K2R8J68m5
5840A21j68J52n3J27j5K23m59n5N00n01oJ39l0J49k57l7N7J61k76J61K86%o4j69
5864a4J89j32j78J53k07K06K6J7J49J45l43J71j56j70L24m18K39L0N9K1K2o7M
$$ plain form
5887 70 -111 -103 344 62 -91 -68 -88 -43 -250 47 228 246 -23 -280 -163 -58 -81 -145 248 -5 -65 154 -6
5910 -6 12 -109 -125 -107 151 -172 -28 -177 -1 110 -74 26 165 26 43 -171 -195 -37 -236 48 208 -43
5932 -43 232 112 114 -28 -88 91 -56 143 20 44 -69 -4 -8 58 -12 -91 -129 -170 -54 -233 -89 -24 22 -23 165
5957 165 32 -168 170 -78 66 33 216 91 99 105 -45 69 -84 -334 -23 252 -26 82 228 -54 -176 12
5979 12 -7 -54 254 -192 40 -295 90 44 -230 -87 342 -8 -191 136 54 72 -8 38 -42 265 9 65 45 26
6003 26 -55 -71 154 -199 186 -65 -126 0 -162 256 -154 49 -13 -103 -35 -54 12 4 -39 -87 -58 -21 225 25 145
6028 145 26 72 -6 125 -245 -68 90 30 -224 -108 201 168 279 -17 -101 -168 249 229 -93 -167 10 -104 -6
6051 -6 6 127 -258 54 171 95 -95 62 71 309 -143 46 -76 -97 324 50 219 -10 -59 146 -24 -145 -23
$$ packed form
5887G0j81QM47k82j53K3k0M5k07K97J81J8k69k57J17J05k3o4L93k53o0K19j60
5910fJ8j21j6J8K58l23J44j49J76J11j84J00J39j39J7k14k4J58j99K84J60k51
5932d3K75j20Kj42o0J79j47J99j23K4j13O5mO6p0p9l8m1J16j79J44O5M6m5J88
5957A65j33k00L38k48J44l3J83j25QOj50J14j53k50L11K75k78J08J46k82j22J88
5979A2j9m7L08m46K32l35L85m6k74J43M29l50j83L27q2J8q0M6q0L07k56N6k0j9
6003B6q1j6K25l53L85k51o1J26j62M18m10K03o2r0O8j9O6qm3m8K9L7K46k00J20
6028A45j19M6p8J31l70J77J58o0k54J16L09l3J11k96q4o7M17k0l22p4J77j14R8
6051fJ2J21l85L12J17p6j90J57RK38m52J89j22k1M21k74J69k29m9K05j70j21J22
$$ plain form
6074 -23 -97 225 -31 207 50 210 114 -75 36 253 5 -44 296 -37 -109 -233 71 1 -33 -227 239 -68
6096 -68 46 -195 68 105 -220 266 170 113 -339 361 -131 105 -32 -131 -194 -119 28 -76 237 219 -39 -126 -38
6119 -38 -23 -291 -80 -135 -133 212 49 19 131 32 -93 38 132 172 126 79 -134 -257 17 108 26 141 46 97 -100
6144 -100 -29 -79 21 123 188 -287 -141 57 -145 -82 96 30 148 133 140 -165 -295 20 85 -120 -87 178 20
6167 20 101 -50 72 -62 -60 146 106 -86 203 56 153 -23 -72 147 115 185 -71 -199 137 -158 -16 -125 42
6190 42 184 56 -127 -85 -143 95 23 -62 -143 -139 -86 85 -67 -51 -94 136 -113 -139 -300 -139 -95 -6 -133 142 2
6215 2 -52 -159 -73 220 -225 47 68 -141 4 -29 69 188 15 -63 -71 51 -170 44 -69 -96 133 31 20 167
6239 167 -35 33 -197 247 -77 -36 255 -55 -237 -239 81 -16 -7 -213 48 39 -23 -7 10 117 292 63 -148 -117
$$ packed form
6074b3p4L22k56K38j57J60r6j89J11K17k48m9L40l33p2j24L04p0l4j94M66l07
6096f8J14k41K63L7l25M86r6n7m52P00m92K36j37r9o3P5J47j04L13j8k58q7Q8
6119c8J5k68K11n5KL45j63l0J12r9j25J31R4M0m6m7k13j23K74R1q2J15r5N1j97
6144a00P1n0J00J02O5m75J46J98k02O3J78o6J18j5Pl05j30L15O5k05L3K65j58
6167B0Q1j51J22j34KK06m0j92K89j47R7j76m9K19l2P0k56j28L36k95J42j09J67
6190D2J42j28j83M2n8K38p2q5q1MN3J71j52J6m3K30k49k6j61J61M4Q9j27K75j40
6215Bn4j07Q6K93m45K72K1k09J45l3R8J19j73p8qJ22k21K14j13k7K29j02j1J47
6239A67k02O8k30M44l24M1K91l10j82kL20r7Rk06K61ro2J6J7J07J75k29k11L1
$$ plain form
6263 -117 112 -38 139 325 -266 204 33 -37 185 93 -100 90 -91 108 16 -61 -139 300 109 24 -212 33
6285 33 39 41 -60 -64 28 30 -259 161 213 -165 -30 49 148 -90 -253 141 26 -10 120 44 -14 151 -15 81 -122 18
6311 18 129 -25 -68 -126 92 -137 101 146 11 -215 -182 52 32 66 87 63 87 53 134 -152 191 15 -65 -157 -43
6336 -43 -94 13 62 -161 -83 85 -192 37 165 -126 30 265 119 286 -34 -83 170 -67 -111 86 -93 44
6358 44 258 77 24 78 85 111 180 -230 208 111 -101 -239 -161 -48 111 -49 115 -93 -69 160 3 55 -13 -27
6382 -27 -204 -52 -44 -139 -182 82 101 -19 -95 -65 -59 -33 -132 -310 -72 78 -56 -335 -103 -65 122 65 105 281 120
6407 120 -200 32 -185 -228 145 20 -118 7 -110 121 128 -41 -54 49 25 -35 78 -167 32 86 -72 -126 122
6430 122 74 2 30 -58 11 -220 12 26 -144 279 -288 -47 -93 -55 -134 -248 278 101 106 -45 -104 21 75 20 -51
$$ packed form
6263a17K29j50J77J86n91M70j71p0K22r2j93J90j81J99r2p7p8M39j91q5k36K45
6285C3OKj01mR2Kk89M20N2l78J35P9R9k38j63L94j15l6J30p6n8J65j66R6k03J40
6311A8J11j54m3n8K18k29K38M5j35k26L3K34k0L4K1k4K4l4Q1k86L43j76q0r2J14
6336d3n1J07M9k23P8J68k77K29J28k91J56K35j46J67l20m9K53k37m4J97j79J37
6358D4K14j81n3N4PK6O9m10M38r7k12j38P8J13J59j60J64k08K4K29j57N2o8j4
6382b7j77J52Qr5m3K64J9j20p6L0OK6r9j78K38J50j34k79K32L8J87n7M0J76j61
6407A20l20K32k17m3L73j25j38J25j17K31Pj69j3J03k4o0J13k45J99N4j58n4K48
6430A22m8p2K8q8O9k31K32J4j70M23n67K41m6L8p9j14N26j77Nj51n9J25N4n5p1
$$ plain form
6455 -51 19 199 -173 68 26 -19 -33 191 -39 -116 -147 48 -547 164 -44 -38 -147 -156 226 -186 174 173 48 -172
6479 -172 99 -101 51 -193 137 36 144 -12 20 -187 -55 -49 121 313 -32 -160 195 -39 96 296 -172
6500 -172 20 11 -147 107 36 151 -212 -52 -71 104 -60 -144 -191 -9 33 -179 354 -7 -160 173 177 200 -1
6523 -1 147 35 66 86 126 106 154 92 150 217 234 -24 57 56 -1 -8 -106 -70 -63 -80 146 -108 98 105 -15 82 -70 -183
6551 -183 -159 257 -24 98 -140 -29 -177 -76 115 -100 -91 15 -117 58 -199 -88 150 -31 122 261 521
6572 521 -149 -10 -9 125 -57 -80 32 109 -117 -10 170 29 23 -349 -254 120 30 -151 102 71 -98 241 -32
6595 -32 -132 -70 11 18 -12 148 -27 84 68 -120 92 4 -109 80 33 -294 99 13 68 18 169 72 325 159
6619 159 102 50 36 -98 -145 284 38 -31 262 -61 20 -140 86 139 -44 174 150 93 31 34 -73 -75 -215 46 46
$$ packed form
6455e1P0J80l72K41m2m5j4K24k30p7l1J95n95P11k08Oj09rL82m12L60jj25k20
6479a72K71k00J52k44L30j01J08j56L2k07J32OJ70J92l45j28L55k34J35K00m68
6500a72J92rj58K54p1J15l63J60j9J75j64q4m7J82M2k12N33l61j53L33MK3k01
6523aJ48j12L1K0M0k0M8o2N8O7J7k58Q1jn7pr8L6Pj7K26k54K06Pj20R7j52j13
6551a83K4M16k81J22k38J11j48J01J91k15RJ06j32J75k57J11K38j81J53J39K60
6572E21o70J39JJ34j82k3J12P7k26J07J80j41ol72R5L74r0j81K53l1j69L39k73
6595c2j00O2Q1Pl0J60j75J11j6j88K12q8j13J89m7l27L93q6N5n0J51r7K53j66
6619A59n7n2j4j34m7M29k46o9K93l23Q1j60K26N3j83K18k4n7o2Lj07kj40K61%
$$ plain form
6644 46 96 -93 272 131 1 -274 -34 157 -223 113 21 -79 -17 -68 193 72 182 91 -98 88 -14 153
6666 153 -46 42 188 188 254 -3 -172 159 251 14 -234 1 -14 -237 -40 -38 64 -131 194 -4 -18 -172 129
6689 129 71 -106 24 327 -262 35 86 -113 -68 -260 -50 4 -251 -86 -142 -33 -86 65 293 1 19 27 126
6712 126 -1 -23 -230 -90 30 -252 22 -18 -249 -166 167 -122 86 70 -62 -16 -111 21 -281 -26 -45 68
6734 68 177 -114 253 -155 222 -43 -109 28 -8 45 15 360 -2 -53 81 -105 -80 171 -76 241 46 -71
6756 -71 16 -52 -96 -174 -144 136 189 -105 -8 -229 -97 -96 -12 46 37 -95 -5 0 177 18 -86 55 -108 59 -35 32
6782 32 8 -56 68 -115 -18 -104 -111 -150 -126 32 199 187 49 122 6 28 -290 2 153 -8 -98 122 -74 82
6806 82 49 121 139 58 -75 -41 4 -107 -67 170 -231 213 307 160 104 -145 -18 204 -89 -73 -39 -72 -67 144 -110
$$ packed form
6644D6N0j89L65j41j30k75K40J91l80L36r2j00O2n1K61j21J10r1j89J86j02J67
6666A53j99Q8J46%O6k57j69L31R2k37k48K35j5k23J97KJ02j95L25j98j4j54L01
6689A29n8j77J30L03n89K97N1j99M5j92K10N4k55J65n6J09n3J51K28k92J8QR9
6712A26j27k2k07J40J20k82K74m0k31Q3L33k89K08j6j32M6r5J32l02K55j9J13
6734F8J09k91L67m08L77k65o6J37l6N3l0L45l62n1J34j86K5K51k47L17j95j17
6756g1Q7o8m4p8L0K80N3k94R7k21J32JQ4N8rj32R0NJ77j59j04J41j63J67r4O7
6782C2k4o4J24j83R7q6pl9K4J58J67j2j38P3j16K2l18K92J51j61r0K20j96J56
6806H2l3P2J8q1j33L4M5j11M0K37m01M44R4j47n6k49J27K22k93J6L4l3NK11k54
$$ plain form
6831 -110 91 61 207 -4 -11 111 98 -63 -214 185 366 -69 238 119 149 -49 -99 -72 -58 -233 145 79 -61
6854 -61 70 -164 -67 6 -88 -109 111 -121 21 2 -59 138 -274 -245 32 92 31 257 97 66 -287 -9 -11 -124
6878 -124 -68 61 74 -54 -111 9 2 -347 171 86 -219 -205 -149 127 178 -95 -27 65 47 107 95 141 30 132 41
6903 41 -54 169 -11 -59 97 91 -36 106 194 42 74 -6 -5 55 63 69 -136 -146 12 59 -176 -250 -472 183 29 69
6929 69 221 -18 -144 233 -98 -162 -118 -258 124 72 205 -28 -11 -334 -71 -84 -68 186 120 27 -4 -91 -83 230
6953 230 116 -65 96 -187 23 172 -234 151 -43 31 -169 -120 138 -83 132 -92 -9 16 51 -173 90 234
6975 234 209 113 -141 88 -16 -41 -186 -24 -4 -121 89 -68 -6 -256 1 -23 -85 12 118 -19 190 -25 -45
6998 -45 56 -62 37 -141 117 170 104 -19 97 60 146 -32 -71 -264 25 52 120 -95 68 78 -20 -30 -30 -51 40
$$ packed form
6831a10K01l0J46k11pJ22j3j61j51L99J81m35L07j19L0j98n0K7J4j75L78o6j40
6854f1J31k34R7P3r4k1K20k32J42j9o1J97m12K9K77O0o1K26j60l1l53K78kj13
6878a24N6J29J3j28n7J20pl49N18q5l05J4N6K76N1k73O8R2j8O0j2M6j11J02r1
6903D1r5K23j80m8J56oj27J42Q8j52L2q0JO0QOk05j0J58M7k35p4k22O55j54M0
6929F9J52k39j26L77l31o4M4j40L82n2J33k33J7l23K63j3J6K54o6r3l1q7QL13
6953B30j14j81J61k83K10J49m06L85j94P4k00M9K58k21K15k24Q3K5L5k24K63J44
6975B34k5r6k54K29j04k5j45J62K0j17K10j57O2k50K57k4o2R7J06j37K09k15k0
6998d5J01j18R9j78K58N3o6j23J16l7Q6j78l9j93K89K7O8k15J63J0r8j0%k1R1
$$ plain form
7023 40 153 100 44 -193 -260 -69 34 -85 -61 74 -52 126 -51 17 -122 -205 -144 -141 -250 -113 -6 -165 29
7046 29 -216 -21 92 -47 -26 176 119 -44 -77 -199 27 -104 -189 91 31 115 -60 170 -33 -230 -33 141
7068 141 -231 -40 -56 92 185 -333 64 201 -2 125 -78 -130 28 -151 -180 -2 -119 -34 59 -79 -20 -53 204
7091 204 -58 9 -148 13 -15 67 130 -125 14 -114 -260 -182 -12 30 90 61 254 149 -138 93 -313 77 148
7114 148 95 -56 -17 -206 -26 -109 14 42 -61 22 -25 -194 -167 -68 45 -115 -83 -173 -26 91 -79 -125 -14 136
7138 136 105 28 108 87 103 113 -82 -114 -214 10 -18 -187 -2 121 -212 209 252 -22 -226 72 47 5 44 90
7162 90 -258 -176 26 202 -14 417 -129 -103 170 -18 150 64 132 -350 -41 73 -10 -31 100 30 65 -100 -101 -175
7186 -175 47 -13 80 102 129 100 -13 107 89 43 -41 29 121 199 183 61 -233 176 226 268 22 -27 116 93 -133
$$ packed form
7023D0J13n3n6k37o7J91J03j19K4J35j26J78j77O8j39q3O1Lj09J37J07j59J94
7046B9k45J95J13j39K1K02n7j63l3j22K26j31q5K80o0Q4j75K30k03j97J97J74
7068A41l72J91j6J48R3n18L97J37k03J27k03n2J58j79k9J78j17Q5R3j38N9l3K57
7091B04k62O7j57J61k8Q2O3k55J39j28j46P8J70M2O0k9J93j05k87K31m06L90P1
7114A48n3j51L9j89J80q3J23K8j03Q3m7j69K7R9J13j60L2r0J47J17j70m6J11J50
7138A36l1p7Q0k1J6J0j95l2j00K24k8j69J85J23l33M21M3k74k04K98k5m2L9M6
7162I0l48Q2K02J76k16M31n46K6K73j88J68q6O8m82L09J14q3k1J31p0L5j65jp4
7186a75K22o0R3K2K7k9j13J20j8m6q4P0R2P8j6j22k94M09N0M2k46m9J43k3k26
$$ plain form
7211 -133 -27 263 -109 -242 -179 42 89 -202 -83 32 17 -4 136 -19 41 -41 24 -48 27 230 90 -39 222
7234 222 -124 -153 -95 32 163 -39 181 86 34 -330 -111 -196 -99 -28 -214 100 4 -69 11 -117 -86 183 -58 37
7258 37 -32 130 48 -210 147 -152 166 -82 220 154 103 -25 20 218 8 103 -119 -85 -309 157 81 -41 39
7281 39 79 66 -23 51 93 157 96 -232 -85 212 85 88 95 10 2 141 -65 43 66 156 65 -36 221 125 -20 112
7307 112 -176 -270 -206 -216 -188 -141 49 1 -85 -27 124 116 93 -253 108 -6 -104 34 166 57 -113 258 52 -203
7331 -203 -41 -168 3 39 51 5 209 -35 83 14 -169 -253 83 33 -58 -6 -96 -16 -23 -341 -51 -167 -297 -129
7355 -129 226 -1 141 176 -95 9 -106 0 -116 -4 32 66 -47 2 104 79 -129 89 -258 -43 49 -234
7377 -234 155 -139 -43 -21 -25 -169 -198 140 294 -2 152 166 -111 253 20 -85 170 16 -10 94 16 8 87 248
$$ packed form
7211a33J06K90l72j33O3K21M7k91J19J15j5k1J40j55O0q2O5p2P5K03j40j29K61
7234B22l46k9N8J27J31k02K20r5n2l64K19q5R7P1j86L14r6p3Q0j28L1K69k41R5
7258C7o9J62q2k58L57k99L18k48L02o6n1j28M5J98k10R5k22L4k24M66p6j22Q0
7281C9M0j3q9P4M2O4o1l28J47K97j27LPq5qJ39k06J08K3R0r1j01K57r6j45J32
7307A12k88r4O4j0K8M7J90m8q6N8J51qk3l46L61j14r8J38J32j09j70L71k06k55
7331b03J62j27J71L6J2m6K04k44J18o9j83q4L36n0r1N2r0Q0pl18K90j16j30J68
7355a29L55k27J42L5k71J04j15J06j16J12L6L4j13M9J02k5k08K18l47K15R2k83
7377b34L89k94R6K2mj44k9L38J54k96J54J4k77L64k33j05K55j54k6J04p8qP9J61
$$ plain form
7401 248 -64 23 155 56 -41 -71 176 -55 -122 -50 -183 0 -19 -254 23 101 284 -158 39 98 14 -106 209
7424 209 85 -121 -75 283 -27 -75 -121 -142 -198 146 -65 150 347 -260 -63 -70 46 85 79 49 203 -157 51 110
7448 110 -10 -80 -64 220 -105 -104 49 35 168 -70 -121 16 33 28 131 -32 108 -33 54 52 -102 110 27 -18 -404
7473 -404 102 276 -32 52 -89 -150 164 -106 94 363 14 81 -154 112 145 -46 -18 75 80 -122 -72 222 222 445
7497 445 223 -7 -127 -179 51 179 73 44 87 -249 -108 -89 -36 160 12 -78 -195 222 -80 12 -135 90
7519 90 -222 101 -69 103 108 -61 -219 20 293 62 -4 -20 -12 184 66 39 50 247 12 180 -122 -79 -17 -103
7543 -103 -263 -25 -37 -98 219 57 -113 -38 330 64 12 -2 -139 -34 17 30 -101 -325 45 258 94 -143
7565 -143 -89 217 -90 26 87 -48 177 -147 219 -121 82 -86 111 -130 -73 -45 -81 -247 47 -230 -221 314
$$ packed form
7401B48l12Q7J32r9r7l0K47k31o7P2j33J83j9k35K77P8J83m42J97N9q4j20L15
7424B09j24k06M6L58l10m8m6k1n6L44k11K15J97o07J97pJ16L9ol0J54l60K08N9
7448A10j20p0J6K84l25JJ53j4J33k38n1J37J7nJ03j63J40j41Q7kj54K12q3m5l86
7473d04N06J74l08Q4j41o1L14k70K00K69l49O7k35K66L3j91K8R3Nk02N0K94%K23
7497D45k22k30j20n2K30J28j06k9M3l36J41J9N3J96j48r0j17M17l02R2j47K25
7519I0l12L23j70J72Nj69j58K39K73k31o6j6QJ96j18k7J1J97k35J68l02M3O2q6
7543a03j60K38j2o1L17j62j70P5L68k66n2j4j37J05N1J3j31k24L70K13j64k37
7565a43N4L06l07J16O1j35K25l24L66l40K03j68J97k41N7K8l6j66K94k77RN35
$$ plain form
7587 314 -150 -82 345 81 -3 170 -20 -84 143 -80 -262 -94 32 88 -159 -24 19 -107 -10 137 64 133 48
7610 48 325 108 -26 44 174 59 -12 89 -241 -146 -76 -67 -175 56 -90 168 -54 3 16 209 118 56 -8 -22
7634 -22 273 -77 -269 -61 -147 40 -202 117 -115 -42 -117 -118 216 13 -55 -35 114 -249 -75 239 13 -159 157
7657 157 -262 -195 -39 -31 -289 15 156 68 -134 -202 236 151 -133 12 132 57 -48 28 126 169 -112 112 19 -75
7681 -75 75 -99 -125 112 57 90 159 56 55 133 97 124 42 46 -21 -3 95 190 -241 -123 -106 -119 88 -40 -183 192
7707 192 -171 -92 8 -238 -110 -14 54 80 77 119 -78 280 3 11 17 -92 32 -234 19 -92 -100 -21 -21 68 -238 75
7733 75 -27 -167 69 21 -122 68 -11 -190 91 36 62 -75 14 213 237 -154 -189 32 -25 134 -34 107 25
7756 25 143 -42 236 -31 -201 175 51 270 52 103 -73 74 -71 163 -229 73 -158 -168 71 47 11 66
$$ packed form
7587C14m64O8M27k64q4J73j90o4K27k23j82J68J26N6k47J35M3j26R7J47p3O9q5
7610D8K77k17j34P0J30j15p1J01l30R5P0Rj08K31j46K58k22N7J3J93r1o2o4j4
7634b2K95l50j92K08q6J87k42L19k32P3p5jL34k03o8K0J49l63J74L14k26j72L16
7657A57m19O7J56Qk58L04J41q8k02o8M38q5k84J45J20p5j05P6R8M3k81K24r3r4
7681g5J50j74k6K37n5L3O9j03jP8l6K7q2Mo7J8R8R5m31J18J7j3K07j28j43L75
7707A92l63P9J00k46J28R6O8K6lM2j97L58k77QOj09J24k66K53j11qP9%Q9l06L13
7733G5j02j40K36m8j43J90p9j79K81n5K6j37Q9J99K4l91l5K21n7J59j68J41q2
7756B5J18j85K78k67j70L76j24K19k18N1j76J47j45K34l92L02k31j0K39k4l6N5
$$ plain form
7778 66 -55 34 -32 75 -238 -33 -1 6 200 6 140 -170 16 287 20 -82 -18 103 -19 -177 50 -21 80
7801 80 -5 199 46 21 103 34 137 180 121 -157 143 143 -95 57 -185 54 -90 -47 23 -173 60 96 -27 -141
7825 -141 36 41 -264 -109 -35 -259 47 30 113 -224 -155 -178 35 41 156 233 108 -19 72 287 190 -23 21 161
7849 161 -50 22 14 -244 38 51 -5 10 -9 7 27 -316 -39 -121 83 170 -209 -190 113 -139 -199 71 207 260 -4
7874 -4 -45 61 -35 -72 97 -41 144 121 283 -75 -65 184 303 -150 213 -33 195 78 -210 -220 140 -37 -95
7897 -95 -130 204 -134 -61 177 70 -72 -20 -104 -133 92 129 324 -137 -24 72 160 -132 -106 222 -87 -198 119
7920 119 -129 -10 -102 -108 -118 -133 171 -123 -110 -172 18 161 146 21 254 63 -7 254 185 52 9 67 26 -141
7944 -141 -158 -65 25 -49 -146 -140 71 -124 -7 -62 18 -207 -13 81 101 49 -8 -141 -65 6 19 94 -131 -96 -200 -3
$$ packed form
7778F6j21Q9o6J07l13K05L2PJ94j94J34l10J86K71k67j02O4J21j22j58K27p1J01
7801H0q5K04j53k5Q2o9J03M3n9k78L00%k38J52k42K39j44M3P0j96K33L6j23j14
7825a41J77Nl05J55P4k24L06j7Q3l37O9k3K13OJ15P7j25j27R1K15r7k13M4J40
7849A61k11P2qk58K82J3n6J5j9J6K0l43K77q2K04Q7l79J9L03k52o0K70J36N3k64
7874dm1J06r6l7J69j38J85k3J62l58J0K49J19m53L63k46K28j17k88j0L60j77n8
7897i5l5L34l38P3K38j07j42N2q4k9K25L7J95m61J13R6Q8k92K6L28l09j11L17
7920A19k48J19r2oj0j5L04k94J3o2J90J43j5j25K33j91p0K61o9j33m3N8m1j67
7944a41j7R3R0p4r7OK11j95J17n5Q0k25J94R4K0n2n7j33P6P1J3P5k25L5j04J97
$$ plain form
7970 -3 -62 111 83 -164 183 21 95 -185 233 -83 101 42 -82 -1 7 288 -123 -26 -105 47 -157 3 -41 -51
7994 -51 -175 172 1 27 -49 -83 218 249 138 -283 -199 104 -235 -180 7 -79 118 -119 -124 -360 -20 -190 -223 -320
8018 -320 -48 244 -90 6 -70 -19 -410 -14 -21 162 190 56 -108 78 -300 -119 -24 -17 142 -159 55 -97 -124
8041 -124 -273 -97 30 -13 172 -80 -84 -55 -72 130 -68 -222 -112 286 -117 -191 -10 -173 -121 -208 -165 -76 27
8064 27 68 -7 33 -147 101 -75 -91 80 -121 -68 -97 -80 -1 148 -159 7 60 91 -10 -70 33 -216 -62 87
8088 87 -12 37 -247 -157 69 -180 217 97 266 -108 122 -11 143 -45 -104 -36 -70 -54 44 -92 -18 48 -146 244
8112 244 -99 -148 115 -128 -88 187 -44 80 126 93 110 68 42 36 27 7 207 -34 -162 101 298 40 196 24
8136 24 -46 -81 479 -11 114 68 -15 53 -112 165 -160 72 79 -92 124 19 -197 136 72 94 315 -92 15
$$ packed form
7970cn9J73k8k47L47j62P4k80M18l16J84n9j24Q1QK81m11R7p9J52k04J60m4j0
7994e1j24L47j71K6p6l4L01L1j11m21Q4L03l39N5J87q6J97k37nk36L40j70l3r7
8018c20K72K92l34R6p6N1l91L96pJ83K8j34j64J86l78J81R5PJ59l01K14j52k7
8041a24j49J76J27m3J85k52mK9j7K02j98j54J10L98m03p4J81j63N2q7M3Q9J03
8064B7M1p5M0j80K48j76j6J71k01N3k9J7P9J49l07J66N3L1j01o0J03k49J54J49
8088H7r9M9k84R0K26k49L97j20J69l74K30j33J54j88n9O8l4J6R8j36P4O6j94L90
8112B44l43m9K63k43M0K75k31J24M6l3J7m2k6ork0K00k41j28K63J97k58J56j72
8136B4p0l5N60m90J25m6q3O8j65K77l25K32Pj71K16j05k16L33o4K2K21m07J07
$$ plain form
8159 15 -57 -337 187 -2 -48 4 -119 482 -210 200 -16 -71 123 329 1 -55 75 278 116 124 -142 85 24
8182 24 -159 -197 -89 -27 -46 -83 -45 -72 31
$$ packed form
8159A5p2k80N24j89m6N2j23O01o92M10k16n5J94K06l28n6J30K03j62Qk66K27o1
8182B4j83l8J08O2j9l7L8k7J03
8191C1
$$ Imaginary data points
##PAGE= N=2
##DATA TABLE= (X++(I..I)), XYDATA
$$ plain form
0 0 0 0 0 0 0 0 0 0 0 0 0 0 0 0 0 0 0 -8 8 -8 8 -8 14 -16 16 -17 24 -24 32 -32 40 -46 49 -56 64 -72 81 -93 102
39 102 -113 127 -142 158 -175 191 -213 232 -256 284 -312 344 -379 416 -461 510 -566 628 -701 784
59 784 -884 1006 -1157 1350 -1603 1956 -2482 3347 -5015 9434 -45750 -108320 -12112 10821
73 10821 -6571 25306 113237 138278 88458 94805 143968 85717 14877 21294 38919 6344 -32652
86 -32652 1426 39502 -19757 -54774 -24988 -40419 -98306 -121253 -85464 -63365 -94138 -61761
98 -61761 15904 21307 3572 26727 54313 38358 -5004 15501 53682 22733 11254 53533
110 53533 70906 43009 12263 24298 18898 -48384 -67334 -35696 -47716 -71205 -55154 -12528
122 -12528 -5317 -36872 -14895 18853 -13298 -31544 -1389 23116 18430 13209 55758 81564 47288
$$ packed form
0@%%%%%%%%%%%%%%%%%qJ6j6J6j6K2l0L2l3M1m8N6o4P2q6R5j05J20j36J53j74J95
39A02k15K40k69L00l33L66m04M45m88N40n96O56p23P95q77R71j076J194j329J485
59G84j668J890k163K507k953L559m438N829q362J4449n5184o2570R6208K2933
73A0821j7392L1877Q7931K5041m9820O347M9163n8251p0840O417J7625l2575l8996
86c2652L4078L8076n9259l5017K9786j5431n7887k2947L5789K2099l0773L2377
98f1761P7665N403j7735K3155K7586j5955m3362K0505L8181l0949j1479M2279
110E3533J7373k7897l0746J2035n400o7282j8950L1638j2020k3489J6051M2626
122a2528P211l1555K1977L3748l2151j8246L0155K4505m686n221M2549K5806l4276
$$ plain form
135 47288 44538 68243 49462 13378 1135 17213 11595 -22058 -6632 16958 -8645 -25922
147 -25922 -17931 -13756 -31379 -52054 -30087 -13864 -32260 -18544 10211 14603 8730 5974 21613
160 21613 21200 -2350 7592 20977 9109 4999 9078 16008 8472 -12927 -7351 -6906 -27712 -27170
174 -27170 -19024 -15115 -14113 -17140 -1702 4430 -7777 500 7645 4260 8216 10024 22540 28332
188 28332 18957 25554 24131 10352 6410 -2885 -6843 -9625 -20545 -14716 -13455 -20304 -15780 -21970
202 -21970 -28025 -25754 -33109 -28937 -21398 -17128 -3014 2239 10302 25074 19555 18204 22106 15010
216 15010 12669 9745 14378 24800 15644 16569 25528 13240 973 -6146 -11858 -18047 -33712 -26896
230 -26896 -9226 -15243 -11750 4770 8443 2349 -6054 2291 7659 -9754 -3284 19424 20386 20495
$$ packed form
135D7288k750K3705j8781l6084j2243J6078n618l3653J5426K3590k5603j7277
147b5922P991M175j7623k0675K1967J6223j8396J3716K8755M392n873k756J5639
160B1613m13k3550R942J3385j1868m110M079O930p536k1399N576M45k0806N42
174b7170Q146L909J002l027J5438O132j2207Q277P145l385L956J808J2516N792
188B8332r375O597j423j3779l942r295l958k782j0920N829J261o849M524o190
202b1970o055K271p355M172P539M270J4114N253Q063J4772n519j351L902p096
216A5010k341k924M633J0422r156R25Q959j2288j2267p119n712o189j5665O816
230b6896J7670o017L493J6520L673o094q403Q345N368j7413O470K2708R62J09
$$ plain form
244 20495 28700 40405 34607 9442 9298 13093 -11718 -21884 -11422 -5144 -10475 -17420 210 5867
258 5867 -20985 -25664 -14902 -24315 -35727 -30099 -5144 3217 -6574 14506 36757 21690 9873
271 9873 15576 19100 3852 -11945 9475 23590 3966 6445 25377 20394 -2914 -15908 -4641
284 -4641 -14696 -45331 -33697 -9374 -16447 -21699 -4774 15058 2390 -18952 81 8585 -17804
297 -17804 -18804 5877 16742 5877 7199 35229 32938 607 3676 15810 -2969 -22881 -16211
310 -16211 5278 -4135 -19945 5469 18539 -6448 -15561 -2589 108 -20154 -26028 4609 10576
323 10576 -8020 7081 30078 23595 4721 5987 22056 5195 -18001 1638 15605 -798
335 -798 -6833 9605 18947 -2835 -17093 3035 -280 -26606 -20906 -381 487 -12644 -4940 21256
$$ packed form
244B0495Q205J1705n798k5165j44L795k4811j0166J0462O278n331o945J7630N657
258E867k6852m679J0762r413j1412N628K4955Q361r791K1080K2251j5067j1817
271I873N703L524j5248j5797K1420J4115j9624K479J8932m983k3308j2994J1267
284d641j0055l0635J1634K4323p073n252J6925J9832j2668k1342J9033Q504k6389
297a7804j000K4681J0865j0865J322K8030k291l2331L069J2134j8779j9912O670
310a6211K1489r413j5810K5414J3070k4987r113J2972K697k0262n874L0637N967
323A0576j8596J5101K2997o483j8874J266J6069j6861k3196J9639J3967j6403
335g98o035J6438R342k1782j4258K0128l315k6326N700K0525Q68j3131P704K6196
$$ plain form
349 21256 11273 -9191 7241 17653 1155 -9266 4442 19766 3675 -5279 18829 19047 -5073
362 -5073 -6605 4942 1729 -19115 -19206 2704 -5646 -22125 -6325 5411 -5072 -16176 -6448 7786
376 7786 -6911 -14964 7354 12158 -1680 -37 13213 16451 -1022 -3079 14612 5828 -10190
389 -10190 -1057 7285 -163 -12543 -7406 4385 -10334 -20037 -4583 -1970 -11549 -11815 173 7888
403 7888 -4425 -4944 11734 7269 -2689 4242 13194 12763 4029 9225 20721 9424 126 7556 5121
418 5121 -4108 -10212 -5098 726 -9980 -10515 573 -4297 -10859 -9910 -7276 -6657 -14046 -9349 3811
433 3811 840 2089 11683 13965 12644 7981 9265 12031 2625 2127 8458 6170 6161 7237 7669 7587 -2370
450 -2370 -5173 -4969 -13359 -14354 -11879 -10753 -5239 -4627 -685 4653 241 749 399 -4039 -1024 -1407 -148
$$ packed form
349B1256r983k0464J6432J0412j6498j0421J3708J5324j6091q954K4108K18k4120
362e073j532J1547l213k0844r1K1910q350j6479J5800J1736j0483j1104R728J4234
376G786j4697q053K2318M804j3838J643J3250L238j7473k057J7691q784j6018
389a0190R133Q342p448j2380N137J1791j4719r703J5454K613r579k66J1988P715
403G888j2313n19J6678m465r958O931Q952m31q734N196J1496j1297r298P430k435
418E121r229o104N114N824j0706n35J1088m870o562R49K634O19p389M697J3160
433C811k971J249R594K282j321m663J284K766r406m98O331k288rJ076M32q2r957
450b370k803K04q390r95K475J126N514O12L942N338m412N08l50m438L015l83J259
$$ plain form
467 -148 6418 7298 10905 11788 7458 8445 1481 -6988 -6069 -10230 -12068 -10156 -8187 -2191 -3381 -6202
483 -6202 134 -3943 -10305 -9213 -8273 -5243 -5348 -1606 11249 11533 9027 15446 14523 8703 2368 1450
499 1450 5411 -2164 -4895 6072 6572 974 1136 2682 885 -10944 -14436 -4960 -11041 -15943 -5865
514 -5865 2789 3058 -416 5580 13666 2071 -4881 4749 4618 -2334 -2071 8043 13087 2299 2275 13257
530 13257 3649 -9458 -7185 -2921 -7277 -16308 -7824 5412 -3298 -7018 5543 7910 -945 -6220
544 -6220 2986 8220 -3810 -1548 15514 12594 4181 8338 16295 10925 -4880 -1425 7775 -6363
558 -6363 -14143 -3412 955 -7285 -13983 -3644 1518 -15435 -16206 -2315 -5176 -14079 -9264 5101
572 5101 6279 -5504 3746 17618 6347 -1459 7533 13207 4357 -4936 6897 13322 -3240 -5436
$$ packed form
467a48O566Q80L607Q83m330R87o964q469R19m161j838J912J969N996j190k821
483f202O336m077o362J092R40L030j05L742J2855K84k506O419r23n820o335r18
499A450L961p575k731J0967N00n598J62J546j797j1829l492R476o081m902J0078
514e865Q654K69l474N996Q086j1595o952R630j31o952K63J0114N044j0788k4J0982
530A3257r608j3107K273M264m356r031Q484J3236q710l720J2561K367q855n275
544f220R206N234j2030K262J7062k920q413M157P957n370j5805L455R200j4138
558f363p780J0731M367q240o698J0339N162j6953p71J3891k861q903M815J4365
572E101J178j1783R250J3872j1271p806Q992N674q850r293J1833O425j6562k196
$$ plain form
586 -5436 7062 3170 -9321 -11402 135 -1710 -17112 -10117 3540 -4628 -11660 -2715 7188 882
600 882 -7786 5393 14508 240 -386 12455 13093 2558 -569 11334 10732 -5640 -1318 9085
614 9085 398 -9008 -5613 2785 -4376 -16642 -5844 1516 -10656 -11802 -305 3904 -4068 -6388
628 -6388 7303 8626 -4949 -24 10810 6617 -136 3839 14393 9338 -2097 6341 11232 -1146
642 -1146 -6382 -573 2183 -5887 -10636 1585 3193 -8120 -4830 2531 -830 -8337 -7501 2002 -599
657 -599 -8610 1441 8568 2914 793 5124 9033 801 -6064 1937 2216 -5955 -3823 2184 2943 -2508
673 -2508 -3456 3814 -729 -10233 -5071 -2152 -5771 -6459 -2010 5247 2530 -763 6999 6241 -840 -517
689 -517 1047 1719 -1549 -1755 6425 5291 693 4245 4011 288 -3603 -5154 -2065 -5173 -7600 -1122
$$ packed form
586e436J2498l892j2491k081J1537j845j5402O995J3657q168p032Q945R903o306
600H82q668J3179R115j4268o26J2841O38j0535l127J1903o02j6372M322J0403
614I085q687r406L395Q398p161j2266J0798P360j2172j146J1497M209p972k320
628f388J3691J323j3575M925J0834m193o753L975J0554n055j1435Q438M891j2378
642a146n236N809K756q070m749J2221J608j1313L290P361l361p507Q36R503k601
657e99q011J0051P127n654k121M331L909q232o865Q001K79q171K132O007P59n451
673b508r48P270m543r504N162K919l619o88M449P257k717l293P762p58p081L23
689e17J564O72l268k06Q180j134m598L552k34l723l891j551L089l108k427O478
$$ plain form
705 -1122 499 -392 1324 1618 3020 -307 -3157 348 -1180 -2386 1262 2460 5051 5373 3534 6224
721 6224 2808 -699 -127 -3033 -2601 -1664 -2946 300 1146 419 1997 -739 -631 -979 -5286 -2998 -1413
738 -1413 -2149 779 1851 4177 4788 1241 3848 3293 -1966 -1475 -661 -594 -413 -1749 3106 3533 -1896
755 -1896 213 882 -1937 -4587 -4844 -779 -1984 -5489 1184 3990 -495 -153 1601 2795 -1310 -4166
771 -4166 2148 2157 -3978 398 3961 2477 -563 -731 4313 -38 -6413 -890 1537 -3455 -4187 -139
787 -139 3640 -937 -4193 3909 3405 -4587 -1876 2768 2079 -2834 -2002 6855 2835 -3820 2432 5823
803 5823 28 -3720 154 4744 -2146 -6011 3061 3310 -4178 -2977 2722 3227 -4133 -3836 5574 1311
819 1311 -5760 156 4972 736 -3672 745 7555 -81 -4618 4853 5197 -2626 -3140 2517 3849 -4813
$$ packed form
705a122J621q91J716K94J402l327k850L505j528j206L648J198K591L22j839K690
721F224l416l507N72k906M32R37j282L246Q46p27J578k736J08l48m307K288J585
738a413p36K928J072K326O11l547K607n55n259M91Q14O7J81j336M855M27n429
755a896K109O69k819k650k57M065j205l505O673K806m485L42J754J194m105k856
771d166O314Ro135M376L563j484l040j68N044m351o375N523K427m992p32M048
787a39L779m577l256Q102n04p992K711M644o89m913Q32Q857m020o655O252L391
803E823n795l748L874M590o890l865R072K49p488J201N699N05p360K97R410m263
819A311p071N916M816m236m408M417O810p636m537R471L44p823n14N657J332q662
$$ plain form
835 -4813 -5024 5098 1073 -5963 -1083 4146 260 -6191 -2149 5142 -2667 -7346 2212 4362 -1964
850 -1964 -2806 4102 6795 -2762 -3188 6224 2327 -5050 -1552 4669 2752 -4587 -144 7613 -286 -5873
866 -5873 1059 2351 -3948 -7281 -492 3610 -4909 -4394 5081 2698 -4243 -2110 2987 1374 -6458
881 -6458 -2985 5672 -110 -3444 3368 6371 1899 -2784 2182 5440 -3892 -4957 3166 2089 -2800
896 -2800 -1673 4297 4014 -4283 -2049 4550 -2234 -6388 -1998 1897 -631 -4345 1833 6243 -853
911 -853 -2008 3921 2346 -2311 -3118 2264 3994 -3006 387 6697 2846 -560 852 3049 346 -5437
927 -5437 -1794 2119 -3337 -3456 1160 1872 -830 -3515 585 1260 -5325 -3551 783 -1001 -1615 132
943 132 3877 3626 -817 2742 4657 -382 -951 930 1365 393 -1238 2429 3760 -1260 -87 1137
$$ packed form
835d813k11J0122m025p036M880N229l886o451M042P291p809m679R558K150o326
850a964q42O908K693r557m26R412l897p377L498O221j917p339M443P757p899n587
866e873O932J292o299l333O789M102q519N15R475k383o941K133N097j613p832
881f458L473Q657n782l334O812L003m472m683M966L258r332j065Q123j077m889
896b800J127N970k83q297K234O599o784m154M390L895k528l714O178M410p096
911h53j155N929j575m657q07N382J730p000L393O310l851l406J412K197k703n783
927e437L643L913n456j19M616P12k702k685M100O75o585J774M334j784o14J747
943A32L745k51m443L559J915n039n69J881M35r72j631L667J331n020J173J224
$$ plain form
959 1137 -1661 -2703 -3965 -1845 -1848 -4519 -1144 701 -1389 -273 80 893 486 -2176 418 1918 -530
976 -530 1732 2462 2761 3461 1342 2462 1976 -846 42 -277 -1720 -411 -1955 -1009 -125 -1813 -634
993 -634 -1163 -2201 -986 -2494 -1966 141 -886 428 1395 1379 2963 1247 1682 3605 575 654 1973
1010 1973 1250 1519 -326 906 2260 -1725 -1641 846 -1412 -2667 -2849 -1262 -566 -3970 -1470 1471
1026 1471 -1271 -1278 1073 1958 1157 -1302 1562 3739 -742 210 3373 1871 326 -203 2604 2255 -2841
1043 -2841 -621 2218 -1770 -3300 -1834 309 -895 -4555 -227 2497 -2787 -1968 1432 1135 -1354
1058 -1354 -2434 2515 2650 -2619 14 4428 1593 -946 263 3529 925 -4094 267 2439 -3038
1073 -3038 -3321 660 1928 -1482 -3632 2334 2378 -4142 -1413 2745 468 -2467 -895 4803 2505 -2667
$$ packed form
959A137k798j042j262K120lk671L375J845k090J116L53Q13m07k662K594J500k448
976e30K262P30K99P00k119J120m86k822Q88l19j443J309j544R46Q84j688J179
993f34n29j038J215j508N28K107j027J314R67j6J584j716M35J923l030P9J319
1010A973p23K69j845J232J354l985Q4K487k258j255j82J587O96l404K500K941
1026A471k742pK351Q85q01k459K864K177m481R52L163j502j545n29K807l49n096
1043b841K220K839l988j530J466K143j204l660M328K724n284Q19L400k97k489
1058a354j080M949J35n269K633M414k835k539J209L266k604n019M361K172n477
1073c038k83L981J268l410k150N966M4o520K729M158k277k935J572N698k298n172
$$ plain form
1089 -2667 2395 5037 -745 -2411 732 2590 -1748 -4726 2033 2174 -4063 -1968 2078 240 -4121
1104 -4121 -3392 1966 -204 -5519 246 4166 329 -1012 2523 5840 1164 -2507 3960 3998 -2040 -1071
1120 -1071 3281 2860 -1576 -1797 4166 882 -5363 -1627 709 -2779 -5383 -2740 2038 -1907 -4661
1135 -4661 1995 3264 -2366 -1742 2295 2941 -1356 -1306 5290 3627 -1128 2819 5251 2480 -1586 -307
1151 -307 3264 -1586 -5308 -131 797 -3525 -3783 -630 1116 -3988 -4802 1026 -534 -4715 -1599 1543
1167 1543 1350 -999 1202 6037 2600 -541 3862 4210 998 -318 1845 4249 -215 -1402 3117
1182 3117 1398 -2524 -1836 -835 -1222 -5058 -4514 -98 -2725 -4533 -621 562 -388 -1551 234 2647
1198 2647 -480 -877 3387 2814 852 1763 3272 4010 484 730 3482 483 -1706 -166 -193 -939 -2562
$$ packed form
1089b667N062K642n782j666L143J858m338k978O759J41o237K095M046j838m361
1104d121P29N358k170n315N765L920l837j341L535L317m676l671O467L8o038R69
1120a071M352m21m436k21N963l284o245L736K336l488k604K643M778l945k754
1135d661O656J269n630O24M037O46m297N0O596j663m755L947K432k771m066J279
1151c07L571m850l722N177R28m322k58L153J746n104q14N828j560m181L116L142
1167A543j93k349K201M835l437l141M403L48l212j316K163K404m464j187M519
1182C117j719l922O88J001l87l836N44M416k627j808L912J183r50j163J785K413
1198B647l127l97M264n73j962R11J509P38l526K46K752k999k189J540k7p46j623
$$ plain form
1215 -2562 -1820 483 -2403 -2911 -542 -1103 -1895 -1842 -542 921 -1037 -433 2750 1242 961 1865 2040
1232 2040 2219 308 1050 1951 -477 -313 733 -471 -160 -1004 -1282 -127 -2164 -1615 -1045 -2030 -1158 -1009
1250 -1009 -1061 568 -317 246 1263 336 1714 1034 338 1893 633 144 1357 261 866 204 -843
1267 -843 866 -428 -1665 -397 -928 -1441 -1329 -1621 717 -389 -1284 1647 931 -215 957 734 1898
1284 1898 7 -357 2268 1136 -422 893 930 601 -1091 -1338 1162 -1838 -3141 -466 -784 -1968
1300 -1968 -1535 -296 1413 -1468 -1393 2275 747 -869 659 2196 2120 35 1387 4071 1414 -154
1316 -154 1929 1651 -375 -1918 -291 1061 -2897 -2837 622 -821 -3131 -2298 -406 -606 -3794 -2025
1332 -2025 1328 -1190 -1787 1265 2456 1394 -301 2425 4394 -28 -456 3396 1719 19 -404 1938
$$ packed form
1215b562P42K303k886n08K369n61p92N3J300J463j958O04L183j508k81R04J75
1232B040J79j911P42R01k428J64J046j204L11q44k78J155k037N49N70r85Q72J49
1250a009n2J629q85N63J017r27J378o80o96J555j260m89J213j096O05o62j047
1267h43J709j294j237J268n31n13J12k92K338j106q95K931p16j146J172k23J164
1284A898j891l64K625j132j558J315L7l29j692k47K500l000j303K675l18j184
1300a968M33J239J709k881P5L668j528j616J528J537p6k085J352K684k657j568
1316a54K083k78k026j543J627J352l958O0L459j443k310Q33J892k00l188J769
1332b025L353k518n97L052J191j062j695K726J969m422m28L852j677j700m23K342
$$ plain form
1348 1938 1980 -2316 -1231 1991 -1525 -3846 -2128 -230 -1604 -4209 -977 1592 -1932 -1951 2001 1478
1364 1478 -987 -1115 2111 3148 -1260 737 4419 1786 -280 1012 2847 1241 -2452 -245 2137
1379 2137 -2393 -3264 -85 255 -2074 -3261 437 1023 -3637 -2281 1170 -513 -1705 -753 2510 2133
1395 2133 -1446 1841 4136 516 -291 1610 2731 268 -1657 1759 2222 -1975 -1157 1319 224 -2296
1411 -2296 -2353 439 -237 -3882 -564 1533 -1169 -1722 203 1838 111 -1970 1687 2307 -1468 -451
1427 -451 1613 1374 -564 -681 2163 817 -2471 -318 956 -940 -2043 -783 965 -477 -2233 904
1443 904 1638 -1182 -7 1104 1513 -135 -835 2376 1763 -982 587 1770 346 -451 -553 1209 -304
1460 -304 -2481 -266 -316 -1815 -1835 -909 -45 -978 -1856 708 532 -1287 16 725 858 172 554 2050
$$ packed form
1348A938M2m296J085L222l516k321J718J898j374k605L232K569l524j9L952n23
1364A478k465j28L226J037m408J997L682k633k066J292J835j606l693K207K382
1379B137m530q71L179L40k329j187L698N86m660J356L451j683j192R52L263l77
1395B133l579L287K295l620q07J901J121k463j925L416M63m197Q18K476j095k520
1411b296n7K792o76l645L318K097k702n53J925J635j727k081L657O20l775J017
1427d51K064k39j938j17K844j346l288K153J274j896j103J260J748j442j756L137
1443I04P34k820J175J111M09j648p00L211o13k745J569J183j424p97j02J762j513
1460c04k177K215n0j499k0R26Q64r33q78K564j76j819J303P09J33o86L82J496
$$ plain form
1478 2050 1192 -224 1690 1613 389 -60 -96 593 -676 -1633 -45 -467 -1690 -826 -1047 -601 -999 -1534
1496 -1534 199 -369 -848 714 816 913 1201 908 2186 1675 712 2036 872 863 681 -35 56 183 -1366
1515 -1366 -8 -1040 -1317 -1066 -2021 -1439 -1596 -2578 -1104 -1017 -800 136 -661 580 1104 175 1396 1515
1533 1515 883 1650 1141 1961 1644 389 1458 1715 14 46 -129 -156 -743 -2100 -669 -991 -2237 -1053
1551 -1053 -660 -910 -1260 -1518 381 66 -1389 551 1262 467 700 1081 1880 1061 -150 1809 1672 -579
1569 -579 -119 272 326 -737 -1019 723 21 -2130 -643 -181 -1177 -1883 -886 694 -595 -1399 1280 1560
1587 1560 -271 94 1024 1508 34 -399 1975 1277 -743 462 1341 188 -1161 -743 1425 -524 -2598
1604 -2598 -228 229 -1661 -1551 -143 975 -1063 -1252 1068 478 -1265 -230 1002 827 -836 -101
$$ packed form
1478B050q58j416J914p7j224m49l6O89j269r57J588m22j223Q64k21M46l98n35
1496a534J733n68m79J562J02R7K88k93J278n11r63J324j164rj82p16R1J27j549
1515a366J358j032k77K51r55N82j57r82J474Q7K17R36p97J241N24r29J221J19
1533A515o32P67n09Q20l17j255J069K57j701L2j75k7n87j357J431l22j246J184
1551a053L93k50l50k58J899l15j455J940P11p95K33L81P99q19j211J959j37k251
1569e79M60L91N4j063k82J742p02k151J487M62r96p06R97J580j289q04K679K80
1587A560j831L65R30M84j474m33K374o98k020J205Q79j153j349M18K168j949k074
1604b598K370M57j890J10J408J118k038j89K320n90j743J035J232j75j663P35
$$ plain form
1620 -101 2498 423 -1457 1110 1215 -437 -1251 17 1028 -1528 -1632 1200 443 -1348 -757 751
1636 751 599 -1507 -375 2043 103 -1115 1120 1858 449 -649 802 2212 -555 -1257 1331 326
1652 326 -1218 -1244 289 424 -2078 -1557 1057 -587 -2080 -638 381 -353 -1516 18 1753 -284
1668 -284 -980 2007 1465 516 -203 1610 2067 -441 -338 1790 250 -954 -177 657 59 -1764 -834 822
1686 822 -1492 -1953 -68 152 -960 -1294 429 1140 -953 -287 2030 529 -117 688 1395 1109 -854
1703 -854 283 1962 -120 -537 626 628 -241 -1736 -415 581 -1605 -1561 15 -641 -800 -711 280 296 -1059
1722 -1059 119 1247 -3 -172 674 1025 857 -302 1190 1594 62 213 814 109 -265 -911 -84 15
1740 15 -1335 -544 -67 -631 -701 -697 -238 -236 -925 31 943 -298 118 714 723 786 34 641 908 -88 306 504
$$ packed form
1620a01K599k075j880K567J05j652q14J268J011k556j04K832p57j791N91J508
1636G51j52k106J132K418j940j218K235P38j409j098J451J410k767p02K588j005
1652C26j544k6J533J35k502N21K614j644j493J442J019p34j163J534J735k037
1668b84o96K987n42r49p19J813M57k508J03K128j540j204P77Q34n98j823R30J656
1686H22k314m61J885K20j112l34J723P11k093O66K317j501o46Q05P07k86j963
1703h54J137J679k082m17J163Kq69j495J321R96k186M4J576o56j59Q9R91J6j355
1722a059J178J128j250j69Q46L51j68j159J492M04j532J51O01p05l74o46Q27R9
1740A5j350P91M77n64p0MM59Ko89R56R12j241M16N96RO3p52O07K67r96L94J98
$$ plain form
1762 504 89 135 -218 432 190 -756 -220 -127 -917 -387 -753 -334 194 -510 -9 313 -83 164 217 76 640
1783 640 -101 423 444 -38 470 292 103 191 -559 -2 -15 -397 -341 -510 -476 -56 -816 -463 558 -384 -309 -84
1805 -84 153 70 -440 601 1021 -161 259 956 610 397 102 488 531 -342 53 578 -461 -338 -467 1
1825 1 -629 -1116 -408 150 -876 -628 228 42 -65 -661 573 759 -499 -41 1069 83 -233 -294 823
1844 823 697 -805 422 1071 -570 -411 -8 275 -396 -1071 146 532 -1181 -601 365 72 -485 -414 885
1863 885 649 -869 214 1242 -485 -217 629 823 282 -624 594 967 -909 -147 665 166 -665 -1005
1881 -1005 852 -62 -1363 -359 416 -491 -750 -471 1053 -265 -995 757 1088 -698 -325 584 672 -267
1899 -267 -558 1259 487 -1230 341 764 257 -944 -340 1053 -325 -1181 402 900 -668 -770 -61
$$ packed form
1762E04m15M6l53O50k42r46N36R3p90N30l66M19N28p04N01L22l96K47N3j41N64
1783F40p41N24K1m82N08j78j89Q8p50N57j3l82N6j69L4M20p60L53J021r42P5K25
1805h4K37q3n10J041M20j182M20O97l46k13k95L86M3q73L95N25j039J23j29M68
1825Ao30m87P08N58j026K48Q56j86j07n96J234J86j258M58J110r86l16o1J117
1844H23j26j502J227O49j641J59M03K83o71o75J217L86j713N80R66k93n57P1J299
1863H85k36j518J083J028j727K68Q46J94n41r06J218L73j876P62Q12m99q31l40
1881a005J857r14j301J004P75r07k59K79J524j318p30J752L31j786L73R09Q8r39
1899b67k91J817p72j717J571M23n07j201O04J393j378q56J583M98j568j02P09
$$ plain form
1916 -61 758 -391 -812 1046 756 -954 20 1095 273 -398 -128 828 147 -1187 502 668 -448 -691
1934 -691 -343 423 -821 -1516 572 196 -805 -95 444 659 -240 50 1312 586 -426 666 887 171
1952 171 -282 341 1201 -74 -656 656 -44 -685 -418 -115 268 -792 -1078 464 -41 -1124 -15 382
1970 382 -148 -478 85 798 -125 -470 793 333 -96 163 232 807 -143 -406 541 -65 -961 -157 34 41 -967
1991 -967 -512 372 -306 -756 -79 -380 -21 -170 -30 746 51 65 1089 644 261 408 510 382 -44 65
2011 65 912 1 -328 161 -181 -4 -332 -340 178 -660 -433 -209 -605 -110 -269 -265 152 -259 -111 389 -74 244
2033 244 71 70 466 181 125 451 65 262 94 -318 96 -148 -590 130 -223 -178 -244 -440 70 -176 -292 286
2055 286 -229 -237 85 -29 129 -94 -365 619 302 -287 376 30 131 -412 -20 255 -94 -473 186 -109 -256
$$ packed form
1916f1Q19j149m21J858k90j710R74J075q22o71K70R56o81j334J689J66j116k43
1934f91L48P66j244o95K088l76j001P10N39K15q99K90J262p26j012J092K21p16
1952A71m53O23Q60j275n82J312p00o41K67L03L83j060k86J542n05j083J109L97
1970C82n30l30N63P13r23l45J263m60m29K59O9N75r50k63R47o06q96Q04J91Pj008
1991i67M55Q84o78m50O77l01L59j49J40P76o95J4J024m45l83J47J02j28m26J09
2011F5Q47r11l29M89l42J77l28qN18q38K27K24l96M95j59MM17m11J48N00m63L18
2033B44j73jL96k85n6L26l86J97j68m12M14k44m42P20l53M5o6j96N10k46j16N78
2055B86n15qL22j14J58k23k71R84l17n89O63l46J01n43L92K75l49l79O59k95j47
$$ plain form
2076 -256 -111 -176 306 -255 -467 259 185 -232 80 294 193 -229 -156 628 117 -336 223 219 -37 -469 -227 523
2098 523 -286 -356 483 -345 -378 -83 -39 414 -458 24 590 -46 -64 599 254 26 -345 -18 834 -442 -484
2119 -484 577 162 -210 -336 -107 376 -1004 -603 300 -617 -659 -335 -119 10 -933 338 667 -116 -2
2138 -2 559 349 -11 -268 871 817 -244 -73 878 314 -361 -90 232 243 -799 -151 480 -419 -483 21 -36
2159 -36 -426 -948 -104 545 -600 -414 577 -17 -481 -150 366 595 -521 143 763 -120 -212 201 78 103
2179 103 -663 184 477 -520 -236 132 -19 -308 -748 210 93 -775 -413 573 -186 -151 -88 180 113 -714 401
2200 401 766 -320 -124 402 297 -15 -444 452 544 -403 -134 570 -101 -138 -250 339 32 -611 215 385
2220 385 -502 -89 207 133 -303 -584 553 316 -590 -298 28 -89 -334 -306 440 47 -530 93 372 -71
$$ packed form
2076b56J45o5M82n61k12P26p4m17L12K14j01m22P3P84n11m53N59mk56m32K42P50
2098E23q09p0Q39q28l3K95M4M53q72M82N66o36j8O63l45k28l71L27Q52j276m2
2119d84J061m15l72j26K29M83j380M01R03r17m2L24K16J29r43J271L29p83J14
2138bN61k10l60k57J139n4j061J71R51n64o75K71L22J1j042O48O31q99o4N04n7
2159c6l90n22Q44O49j145J86R91n94m64L31N16K29j116O64O20q83r2M13j23K5
2179A03p66Q47K93r97K84L68j51k89m40R58j17q68L62R86p59L5O3K68o7q27J115
2200D01L65j086J96N26j05l12m29Q96R2r47K69P04o71l7j12N89l07o43Q26J70
2220C85q87M13K96p4m36k81J137k37r06K92L26j17k45K8P46l93n77O23K79m43
$$ plain form
2240 -71 9 93 396 192 -229 378 570 57 -175 361 199 36 -85 334 -101 -407 -209 1 -79 -553 -358
2261 -358 103 65 -745 -59 -45 -308 4 27 207 246 -229 508 49 -86 452 117 298 316 -256 307 31 -252
2283 -252 29 122 16 25 -402 93 -94 -439 -109 -159 -240 -56 -4 185 51 -245 517 195 28 132 -130 315
2305 315 451 82 355 545 -259 -49 19 16 202 -120 238 -117 -248 -138 -158 -223 207 -285 41 409 -427 7
2327 7 36 -55 140 -108 397 51 -132 593 12 -158 157 -177 273 171 -229 550 135 -404 -110 -59 -70 -301
2349 -301 -443 360 19 -520 -38 112 -192 -120 45 150 6 -276 297 390 -96 128 35 170 -62 -378 621
2370 621 121 -219 162 -125 86 -204 -179 337 -133 -455 356 166 -236 -132 58 407 -160 -446 434 -203
2390 -203 -414 60 284 18 -2 -77 346 89 -330 151 239 53 -92 -63 580 -119 18 401 186 -160 -35
$$ packed form
2240g1Q0Q4L03k04m21O07J92n13k32N36j62j63j21M19m35l06J98K10q0m74J95
2261c58M61l8q10O86J4k63L12K3J80L9m75P37m59j35N38l35J81J8n72N63k76k83
2283b52K81R3j06Rm27M95j87l45L30n0q1J84N2J89j34k96P62l22j67J04k62M45
2305C15J36l69K73J90q04K10O8lJ86l22L58l55j31J10k0o5M30m92L26L68q36M34
2327GK9r1J95k48N05l46j83P25n81j70L15l34M50j02m00P79m15n39K94N1j1k31
2349c01j42Q03l41n39M82J50l04P2J65J05j44k82N73R3m86K24r3J35k32l16R99
2370F21n00l40L81k87K11k90K5N16m70l22Q11j90m02J04J90L49n67k86Q80o37
2390b03k11M74K24k66k0p5M23k57m19M81Q8j86j45K9O43o99J37L83k15l46J25
$$ plain form
2411 -35 63 88 -297 -328 611 -32 -331 235 -30 -68 -291 -86 319 -387 -540 100 -43 -197 -249 260 407 -428
2433 -428 -294 530 192 -111 74 212 457 -427 152 662 277 -294 336 89 57 -408 -57 165 -406 -365 467
2454 467 -14 -458 -113 114 327 -228 -255 541 243 -16 293 121 -24 45 -53 699 -3 2 445 -70 -242 -9
2476 -9 -93 263 -440 -267 226 -520 -403 48 124 134 -450 -247 381 -346 -243 153 48 -70 27 295 435 -220
2498 -220 -92 360 -97 137 120 99 304 -312 219 59 -168 -247 138 -197 21 -212 62 99 -240 -275 221 -188
2520 -188 -50 -153 -10 316 -210 339 318 -150 -34 162 -16 76 -8 378 173 -213 21 33 36 53 -285 87
2542 87 157 -452 -216 75 45 -85 -352 -51 80 -337 53 287 171 61 -171 35 84 -433 -30 -16 -215 105
2564 105 58 -238 273 117 -65 127 2 51 -135 -17 49 -49 96 -30 -212 30 136 -282 372 104 -100
$$ packed form
2411c5R8K5l85l1R39o43k99N66k65l8k23K05M05p06j53O40j43j54n2N09J47q35
2433d28J34Q24l38l03J85J38K45q84N79N10l85n71O30k47l2m65L51K22n71M1Q32
2454D67m81m44L45K27K13n55k7P96k98k59L09j72j45O9r8P52p02NM43n15j72K33
2476iq4L56p03J73M93p46J17M51P6J0n84K03O28p27J03L96j05j18R7K68J40o55
2498b20J28M52m57K34j7k1K05o16N31j60k27p9L85l35K18k33K74L7l39l5M96m09
2520a88J38j03J43L26n26N49k1m68J16J96j78R2q4L86k05l86K34J2LJ7l38L72
2542H7P0o09K36K91l0j30k67L01J31m17L90K34j16j10k32K06M9n17M03J4j99L20
2564A05m7k96N11j56j82J92j25M9j86J18O6r8J45j26j82K42J06m18O54k68k04
$$ plain form
2585 -100 299 -315 -45 96 -280 -66 -187 -29 179 -36 -180 262 93 9 -60 -8 122 -82 169 349 -125
2606 -125 -111 140 3 102 -66 -202 -20 -497 -146 -38 92 -20 66 -154 18 -346 -3 315 71 -93 74
2627 74 257 4 -189 160 136 -350 138 172 -40 179 -141 186 -99 -458 -20 169 -8 10 -229 -22 -117 -230
2649 -230 9 78 -138 -64 290 -55 187 -364 266 358 12 -246 551 118 35 -195 246 99 -268 84 302
2670 302 -212 24 -187 45 -268 -385 237 29 -188 -173 -176 -107 131 -242 160 90 -231 169 67 -39 33 53
2692 53 227 -39 -234 275 305 -277 -49 -149 -19 -225 -311 287 88 -280 87 -83 -74 -61 160 198 84 -312
2714 -312 112 -48 -295 -53 -82 334 -194 -431 411 125 -21 131 186 -180 -166 21 238 21 -178 54 12
2735 12 -166 -185 -327 49 51 -33 205 -99 -225 127 128 36 -120 -32 137 346 -254 81 202 55 -84 -86 38 9
$$ packed form
2585a00L99o14K70J41l76K14j21J58K08k15j44M42j69q4o9N2J30k04K51J80m74
2606a25J4K51j37R9j68j36J82m77L51J08J30j12Q6k20J72l64L43L18k44j64J67
2627G4J83k53j93L49k4m86M88L4k12K19l20L27k85l59M38J89j77J8k39K07r5j13
2649b30K39O9k16P4L54l45K42n51O30R2l46k58P97m33q3k30M41j47l67L52K18
2670C02n14K36k11K32l13j17O22k08k17J5lO9K38l73M02p0l21M00j02j06P2K0
2692E3J74k66j95N09L0n82K28j00J30k06q6N98j99l68L67j70RJ3K21L8j14l96
2714c12M24j60k47K42k9M16n28k37Q42k86j46J52N5l66J4J87K17k17j99K32m2
2735A2j78j9j42L76Kq4K38l04j26L52Jr2j56Q8J69K09o00L35J21j47j39kJ24k9
$$ plain form
2759 9 -83 78 149 -182 -184 -145 -123 63 86 103 65 -472 4 -54 -232 -294 207 387 0 -5 303 -27 -45 -37 -118 341
2785 341 -26 -142 231 79 -64 -202 9 198 -166 -196 276 -199 -177 -22 202 -98 -123 -86 142 76 -124 78
2807 78 -24 -81 -172 -425 79 -140 -140 225 -178 -295 -127 198 224 -110 -69 86 11 -79 -173 -88 129 -36 -158 130
2831 130 -72 -233 254 -23 -21 139 -26 102 -66 59 81 -65 -213 -94 31 391 99 -299 -81 7 -24 260
2853 260 -67 64 -382 -120 -64 -48 -169 232 -61 -216 -18 -236 341 -44 -101 -38 -96 -59 -163 -54 285 -467
2875 -467 -205 -67 -140 -44 14 -49 294 -174 -160 194 60 2 -8 114 115 78 -108 336 -185 -24 160 -62 57
2898 57 -413 54 289 -268 24 -60 102 -116 42 76 362 -18 -139 381 -119 23 219 66 202 79 -37
2919 -37 106 36 6 86 11 357 -60 12 187 -289 -222 -74 68 65 82 112 44 49 -76 217 -153 39 368 179 -84
$$ packed form
2759Ir2J61P1l31kL9K2J86K3J7l8n37M76n8j78o2N01J80l87nL08l30j8Qq1M59
2785C41l67j16L73j52j43j38K11J89l64l0M72m75K2J55K24l00k5L7K28o6k00K02
2807G8j02n7r1k53N04k19%L65m03j17J68L25K6l34M1J55p5r0r4Q5K17j65j22K88
2831A30k02j61M87k77KJ60j65J28j68J25K2j46j48J19J25L60k92l98K18Q8l1K84
2853B60l27J31m46K62N6J6j21M01k93j55J98k18N77l85n7O3n8L7j04J09L39p52
2875d67K62J38p3R6N8o3L43m68J4L54j34n8j0J22Jl7j86M44n21J61J84k22J19
2898E7m70M67K35n57K92q4J62k18J58L4K86l80j21N20n00J42J96j53J36j23j16
2919c7J43p0l0Q0p5L46m17P2J75m76O7J48J42lJ7L0o8Nj25K93l70J92L29j89k63
$$ plain form
2944 -84 -71 60 -217 9 8 29 174 -145 60 181 89 -57 12 193 -329 30 173 -153 -96 -322 -163 -84 -3
2967 -3 57 282 -88 -125 39 29 143 -161 -60 146 -174 -77 14 21 150 -66 5 180 -135 -49 470 -226 -54 -450
2991 -450 275 -91 -196 -29 140 -117 -66 59 163 117 -373 -17 -22 -163 -2 347 -13 -129 -103 84 251 -157
3013 -157 161 81 141 277 132 53 169 -260 -86 191 -206 59 -4 8 -79 -134 -47 146 -295 -118 -75 -47 98
3036 98 -190 95 32 -41 141 -26 108 -202 100 26 31 -64 -102 50 -70 -34 178 260 11 -246 71 93 -258 214
3060 214 87 -300 -323 37 102 -237 -176 95 263 -79 304 10 -226 202 -53 398 63 203 337 431 -154
3081 -154 162 -96 117 132 -295 -30 -160 -81 94 -126 -46 93 -209 254 -126 -130 -71 -68 -46 24 204 139 43 -15
3105 -15 206 47 45 100 42 114 310 -72 65 -28 182 265 -331 129 -113 -6 38 -178 -12 -207 90 45 113 -151
$$ packed form
2944h4J3J31k77K26jK1J45l19K05J21r2j46O9J81n22L59J43l26N7k26J59P9Q1
2967cO0K25l70l7J64j0J14l04J01K06l20R7R1PJ29k16P1J75l15Q6N19o96J72l96
2991d50P25l66j05J67J69k57N1J25J04m6m90L56nj41J61L49l60j16K6J87J67m08
3013a57L18q0O0J36j45p9J16m29J74K77l97K65o3J2q7n5Q7J93m41J77M3K8J45
3036I8k88K85o3p3J82j67J34l10L02p4Nr5l8J52j20L6K12Q2k49k57L17K2l51M72
3060B14j27l87k3L60O5l39O1K71J68l42L83k94k36M28k55M51l35J40J34R4n85
3081a54L16k58K13J5m27K65j30P9J75k20Q0J39l02M63l80mN9LK2P0J80o5r6n8
3105a5K21j59kN5n8P2J96l82J37r3K10Q3n96M60k42J07M4k16J66j95K97m5O8k64
$$ plain form
3129 -151 -70 -173 -193 196 -148 -159 245 -165 -186 -46 -307 127 -52 82 25 -113 239 -38 -133 362 -225 183
3151 183 102 -32 6 -20 -3 9 203 -125 52 -218 129 -37 -271 39 215 -176 -44 159 9 49 -130 25
3173 25 -33 -322 2 267 10 147 -199 -76 -228 3 -86 91 -27 -6 17 -205 95 -64 240 -193 -109 184
3195 184 -195 27 -11 143 83 -186 -3 116 -8 53 154 18 211 -21 -218 133 72 54 -134 -403 270 96
3217 96 -237 77 -161 -426 1 -131 31 -128 79 338 -132 -92 215 120 -91 115 16 10 -127 -196 -161 122 -172
3240 -172 137 5 121 148 -160 142 -107 -99 117 18 -138 9 -297 290 -262 -417 100 -231 90 -20 65 255
3262 255 -46 -1 52 -9 -169 276 147 182 104 -121 50 -78 -278 213 77 -21 92 88 108 89 -73 96 14 -139
3286 -139 100 -15 -49 -211 -20 189 -273 -50 184 62 29 -122 -190 143 123 -72 256 -148 110 -48 -136 131
$$ packed form
3129a51Q1j03k0L89l44j1M04m10k1J40k61M34j79J34n7j38L52k77r5M95n87M08
3151A83q1j34L8k6J7J2J94l28J77k70L47j66k34L10J76l91J32K03j50M0j79J55
3173B5n8k89L24K65k57J37l46J23j52K31q9J77j18K1K3k22L00j59L04m33Q4K93
3195A84l79K22l8J54o0k69J83J19j24O1J01j36J93k32j97L51o1j8j88k69O73j74
3217I6l33L14k38k65M27j32J62j59K07K59m70M0L07r5k11K06r9oj37o9L5K83k94
3240a72L09j32J16K7l08L02k49QK16r9j56J47l06N87n52j55N17l31L21j10Q5J90
3262B55l01M5N3o1j60M45j29L5p8k25J71j28k00M91j36r8J13mK0j9j62J69q2j53
3286a39K39j15l4j62J91K09m62K23K34j22l3j51o8L33k0j95L28m04K58j58q8K67
$$ plain form
3308 131 -192 -55 94 -169 -66 203 -27 44 -9 -115 -36 -195 -186 41 -148 -34 -174 172 80 -269 -160 224
3330 224 -51 92 -68 140 119 172 132 234 -30 -48 44 -192 -36 -178 -77 291 -213 85 -12 -173 265 -412
3352 -412 -154 166 193 -335 87 87 114 32 78 232 -50 -177 -37 -105 -50 34 -6 -119 14 -51 254 151 44 3
3376 3 4 155 303 -280 -105 -93 9 -281 -257 256 -240 -236 -165 149 92 151 -319 135 -111 140 205 19 -146 115
3400 115 -377 -3 262 -89 29 -152 3 9 87 -269 8 127 112 232 40 82 -125 -94 99 111 171 -68 110
3423 110 313 -305 33 387 15 -77 30 15 277 89 -148 77 -447 82 -58 -236 -40 -146 383 -195 -142
3444 -142 55 150 -200 174 -87 1 90 -302 183 111 -297 -188 125 160 169 -15 286 -138 -10 173 -237 -162 -120
3467 -120 179 263 34 -128 329 -85 -29 189 -25 21 -235 -326 117 -25 -226 -27 -84 -210 -162 -106 106 75 130
$$ packed form
3308A31l23J37J49k63J03K69k30P1n3j06P9j59RK27j89J14j40L46r2l49J09L84
3330B24k75J43j60K08k1N3m0J02k64j8R2k36J56j42J01L68n04K98r7j61M38o77
3352d12K58L20K7n28M22%K7q2M6J54k82j27J40o8N5Q4m0j13J33o5L05j03j07m1
3376CJJ51J48n83J75J2J02k90K4N13m96MP1L14n7N9m70M54k46K51O5j86j65K61
3400A15m92L74K65l51J18j81J55OP8l56K77J19j5J20j92M2k07L1J93J2O0k39J78
3423A10K03o18L38L54l72r2J07j5K62j88k37K25n24N29j40j78J96j06N29n78N3
3444a42J97R5l50L74k61Q8Q9l92M85p2m08J09L13L5Rj84L01m24J28J83m10P5M2
3467a20K99Q4k29j62M57m14N6K18k14M6k56r1M43j42k01J99n7j26M8N6K12l1N5
$$ plain form
3490 130 146 145 -1 -149 218 127 140 -163 286 -164 -65 -94 9 243 107 45 44 64 -321 121 99 -225 -245 -80
3514 -80 -60 142 -124 257 24 -130 -47 70 -191 -82 -53 -22 143 -232 -92 -16 42 -204 5 141 -46 -127 135
3537 135 113 36 47 -21 15 46 80 -261 -48 114 -34 -36 32 -186 -80 -14 -11 -75 -212 -153 164 -89 173 115 -173
3562 -173 -12 35 75 49 -173 -36 -105 19 16 -72 -120 -194 44 -19 198 -77 -14 79 58 -118 -132 -114 77 -82 116
3587 116 60 -4 -6 9 77 -119 48 26 252 61 60 87 62 27 -50 -30 -74 -331 2 -23 -109 -77 -74 -90 -21 -101 -384 -25
3615 -25 -113 -100 -51 96 -136 107 -4 102 -134 -199 14 -181 -15 85 -120 84 -223 -28 324 27 -40 223
3637 223 83 -135 -49 -233 108 -359 -119 -16 -23 -172 383 153 81 -72 26 219 -208 211 136 -22 122 -5
3659 -5 42 48 -61 176 40 69 -85 154 -14 125 -34 -180 -103 -37 -198 127 -185 109 116 13 -65 -151 -79 2 -14
$$ packed form
3490A30J6jj46j48L67r1J3l03M49m50R9k9J03K34j36o2jK0l85M42k2l24k0J65
3514h0K0K02k66L81k33j54Q3J17k61J09K9L1J65l75J40P6N8k46K09J36j87q1K62
3537A35k2p7J1o8L6L1L4l41K13J62j48kO8k18J06O6Lo4j37N9L17k53K62n8k88
3562a73J61M7M0k6k22J37o9J24lq8m8p4K38o3K17k75O3R3k1j76j4J8J91j59J98
3587A16n6o4kJ5O8j96J67k2K26j91jK7k5l5p7K0m4k57L33k5q6L2Lj6O9q0k83L59
3615b5q8J3M9J47k32K43j11J06k36o5K13j95J66J00k05K04l07J95L52k97o7K63
3637B23j40k18Q6j84L41m67K40J03pj49N55k30p2j53R8J93m27M19p5j58J44j27
3659eM7Oj09K37j36K9j54K39j68J39j59j46P7O6j61L25l12K94Pj03p8q6P2Q1j6
$$ plain form
3684 -14 -9 88 95 -39 -12 86 126 -80 -18 34 156 -56 -27 144 -22 -154 -82 38 172 -52 -110 51 -57 -139 -55
3709 -55 -89 -83 29 103 -164 127 -12 19 11 -1 98 145 -19 244 5 -157 188 221 38 209 -6 103 -17 -187
3733 -187 63 33 -13 -118 -123 -17 231 -26 132 99 67 61 40 -83 -4 -170 -92 -219 63 282 -34 -14 -258 -11
3757 -11 -61 -89 -13 59 -141 268 208 -103 216 -2 10 35 12 32 -43 -170 -41 -248 -88 205 -171 75 132 -132
3781 -132 121 -15 -45 -201 48 27 -14 40 251 21 -49 -36 260 88 159 117 -143 -38 233 271 5 -95 114
3804 114 -190 -15 -85 -113 -121 -59 -7 -41 -99 20 206 -6 160 12 171 23 -30 -291 102 79 200 -212 7
3827 7 -77 167 52 181 -265 -60 -182 -225 -159 -147 74 4 -222 -21 135 -420 230 -77 -231 101 -127 85
3849 85 51 -30 200 -48 -52 -201 104 -121 88 195 270 109 66 21 -187 -138 130 141 -197 51 -29 241 -69 -195
$$ packed form
3684a4NR7Pj34K7R8M0k06O2N2J22k12K9J71j66j32P2J20J34k24n8J61j08q2Q4
3709e5l4OJ12P4k67K91j39L1qj2R9M7j64K63k39j62L45L3j83J71k15J09j20j70
3733a87K50l0m6j05nJ06K48k57J58l3l2ok1j23P9j66P8j27K82K19l16K0k44K47
3757a1n0k8P6P2k00M09o0l11L19k18J2K5k3K0p5j27J29k07J60K93l76K46N7k64
3781a32K53j36l0j56K49k1m1N4K11k30p0J3K96j72P1m2k60J05K71L8k66j00K09
3804A14l04J75p0k8qO2N2l4n8J19J86k12J66j48J59j48n3k61L93k3J21m12K19
3827Gq4K44j15J29m46K05j22m3O6J2K21p0k26K01J56n55O50l07j54L32k28K12
3849H5l4q1K30k48mj49L05k25K09J07P5j61m3m5k08M9K68J1l38K48q0K70l10j26
$$ plain form
3873 -195 5 -295 -164 -210 -60 -63 -175 77 185 49 -125 100 74 107 -77 -40 -189 -116 150 -15 -56 -30 16
3896 16 -193 59 254 52 -86 -42 -52 -51 -141 142 146 7 95 30 116 251 173 -81 -97 -36 -86 -55 -81 143 46 30
3922 30 24 -38 -203 140 -214 -81 193 -310 143 -127 269 -126 1 55 -109 119 -5 -120 -154 -211 4 58 84
3945 84 37 -83 315 151 133 -179 209 135 -131 183 153 -223 -175 -197 -15 -32 -276 -10 205 132 -168 -192 83
3968 83 -154 60 66 -74 40 3 -453 -18 24 -49 51 117 75 -59 -72 -131 -61 -222 -83 -98 -180 -360 30 11 -140
3993 -140 -18 -127 -172 -116 38 -186 -51 170 -74 -55 -56 142 274 136 -272 153 202 136 -3 62 -72 -9 60
4016 60 -106 -2 121 135 50 97 -215 -143 -88 -18 50 18 -68 216 -6 77 310 46 81 35 115 -14 160 -71 176
4041 176 124 -156 216 65 146 -29 -174 -93 85 -53 339 -87 210 43 -79 350 92 -73 -2 1 56 -105
$$ packed form
3873a95K00l00J31m6J50lj12K52J08j36j74K25k6L3j84L7j49P3K66j65m1K6M6
3896A6k09K52J95k02j38M4j0Jr0K83Mj39Q8o5Q6J35p8k54j6O1n0L1k6K24r7j6
3922C0oo2j65L43l54J33K74n03M53k70L96l95J27N4j64K28j24j15l4n7K15N4K6
3945H4m7j20L98j64j8l12L88p4k66L14l0l76M8k2J82j7k44K66K15p3l00k4K75
3968H3k37K14Oj40J14l7m56M35M2p3J00O6m2j34j3n9P0j61J39j5q2j80L90j9j51
3993a40J22j09m5N6J54k24J35K21k44J9jJ98J32j38m08M25M9o6j39O5j34O3O9
4016F0j66J04J23J4q5M7l12P2N5P0O8l2q6K84k22Q3K33k64L5m6Q0j29J74k31K47
4041A76n2k80L72j51Q1j75j45Q1J78j38L92m26K97j67j22M29k58j65P1LN5j61
$$ plain form
4063 -105 94 -69 -73 15 35 -107 244 -163 419 86 62 -56 71 -179 -113 -99 5 99 21 -223 -49 -21 53 116
4087 116 60 95 9 153 47 170 109 89 -231 -37 -195 115 99 -96 66 221 29 161 40 -214 134 223
4109 223 82 80 27 -114 197 141 205 18 -125 22 44 -131 42 213 -32 122 -17 254 56 -33 -278 -90
4131 -90 -264 -80 44 139 -98 53 122 106 -32 104 -94 82 225 14 27 -53 -188 -18 -270 85 -127 -282
4153 -282 -39 -65 -26 92 -46 -195 200 -16 -119 -175 -31 147 -56 -134 64 -28 211 187 -175 -271 -108 37
4175 37 312 108 199 -121 84 44 -12 79 115 83 194 85 -38 -68 48 -117 186 17 3 249 -287 63 331
4198 331 -14 -185 -179 30 86 -169 77 230 32 154 9 123 62 48 -138 164 -81 147 0 -64 25 -102
4220 -102 -137 -43 -149 40 -106 27 112 -81 120 -46 74 -207 -96 275 131 -267 -117 -118 134 232 -28 135
$$ packed form
4063a05J99j63mQ8K0j42L51m07N82l33k4j18J27k50O6J4J04R4p8k44J74K8P4O3
4087A16n6L5q6J44j06J23o1k0l20J94j58L10j6j95J62J55j92J32j21k54L48Q9
4109B23j41kn3j41L11n6O4j87j43J47K2j75J73J71k45J54j39K71j98q9k45J88
4131i0j74J84J24R5k37J51O9j6j38J36j98J76J43k11J3q0j35J70k52L55k12j55
4153b82K43k6L9J18j38j49L95k16j03n6J44J78k03p8J98r2K39k4l62r6J63J45
4175C7K75k04R1l20K05m0n6R1L6l2J11j09j23l0J16j65L03j69j4K46n36L50K68
4198C31l45j71OK09N6k55K46J53j98J22j45J14o1j4j86L02k45K28j47o4Q9j27
4220a02l5R4j06J89j46J33Q5j93K01j66J20k81J11L71j44l98J50jK52R8k60J63
$$ plain form
4242 135 -93 -219 -138 -114 -209 -3 -70 -64 15 -154 20 78 -201 -90 -115 163 -21 95 -93 200 -269 33 203
4265 203 46 -170 135 -78 14 55 188 -229 -173 173 224 -186 -4 -64 105 166 24 347 -129 114 141 16
4287 16 8 -98 -200 -99 -5 -152 18 -111 102 26 167 -30 131 185 -78 -92 -80 331 19 -238 -127 -237 169
4310 169 -208 -294 -76 -146 29 -6 -14 -68 -119 -119 -50 103 90 -87 35 181 -147 -215 150 -202 145 221 232 122 -1
4335 -1 9 72 193 113 77 -365 210 -25 -144 33 94 79 166 -129 171 9 6 -132 -166 -32 9 225 117 192 81
4360 81 -76 3 55 7 -71 123 -106 -154 84 20 211 -32 83 -64 75 79 -116 105 38 -32 -85 -114 42 -206
4384 -206 79 -126 -39 -223 77 162 -41 46 118 -172 -15 210 -78 95 183 -17 51 256 16 -87 -5 -25 205
4407 205 6 -347 87 238 -44 85 84 -134 -137 133 185 69 -131 -47 43 55 112 -26 11 298 -128 -12 68 -169
$$ packed form
4242A35k28j26Q1K4r5K06o7OP9j69J74N8k79J11k5K78j84J16j88K93m69L02J70
4265B03j57k16L05k13R2M1J33m17N6L46N1m10J82o0J69O1j42L23m76K43K7j25
4287A6qj06j02J01R4j47J70j29K13p6J41j97J61N4k63j4J2M11l12k57J11j10M06
4310A69l77q6K18p0J75l5qn4n1%O9J53j3j77J22J46l28o8L65l52L47P6J1j10j23
4335aJ0O3J21q0l6m42N75k35j19J77O1j5Q7k95L00j62lj38l4J34M1K16j08P5j11
4360H1j57P9N2m8p8J94k29m8K38o4J91k43J15j47J39Mj95K21o7p0n3k9J56k48
4384b06K85k05Q7j84L00Q5k03Q7P2k90J57K25k88J73Q8k00O8K05k40j03Q2k0K30
4407B05j99l53M34J51k82J29jk18lK70N2j16k00Q4R0J2N7j38L7K87m26J16Q0k37
$$ plain form
4431 -169 -175 88 117 -103 272 0 347 43 243 195 182 94 -207 75 -284 -24 -105 11 -205 -314 -42 -246
4453 -246 -167 -163 -250 -24 -189 -89 -95 -223 -63 -33 -112 170 183 70 53 -137 69 261 -23 23 -8 110 -47 -64
4477 -64 -98 -92 -105 -42 268 101 202 84 -153 -166 33 -29 34 -81 -165 -53 214 -124 -50 -52 -19 -54 -347 -79 51
4502 51 -5 97 -183 126 132 -146 -202 161 -1 211 -176 -117 26 -106 -33 98 -116 -105 -81 -84 -68 -83 255 162 -48
4527 -48 188 208 60 -198 -323 -105 -135 79 5 215 -73 36 281 -117 122 -84 -2 -199 -9 -129 82 -42
4549 -42 18 -249 -45 4 -89 -145 137 68 90 -50 -105 34 -79 141 210 -111 -251 -14 -27 -178 -108 14 38 -201
4573 -201 33 -29 40 113 -60 14 82 173 51 18 -109 537 110 -40 307 49 -9 199 125 -315 -7 -49 37 -27
4597 -27 8 354 -130 124 89 254 -51 50 -127 -25 -135 147 -92 49 -51 -80 -27 -176 -227 209 -219 -143
$$ packed form
4431a69oK63K9k20L75k72L47l04K00m8j3q8l01K82l59K60q1J16k16j09K72k04
4453b46P9Mq7K26j65J00oj28J60L0p9K82J3j13j7j90K06J92k84M6l1J18j57j7
4477f4l4Oj3O3L10j67J01j18k37j3J99o2O3j15q4J12K67l38P4kL3l5k93K68J30
4502E1n6J02k80L09Ok78n6L63j62K12l87N9J43j32P3J31k14J1K4lJ6j5L38r3k10
4527d8K36K0j48k58j25K18l0K14p4K10k88J09K45l98K39k06Q2j97J90j20K11j24
4549d2O0k67K04M9r3n6K82o9K2j40n5J39j13K20O9l21j40K37j3j51P0J22K4k39
4573b01K34o2O9P3j73P4O8R1j22l3j27O46m27j50L47k58n8K08p4m40L08m2Q6o4
4597b7L5L46m84K54l5J65l05J01j77J02j10K82k39J41j00k9N3j49n1M36m28P6
$$ plain form
4619 -143 -12 -73 85 165 -19 158 68 -214 -75 -68 -30 310 207 -190 -137 52 -80 -181 117 78 -31 -257 -90
4642 -90 -99 135 93 -237 65 49 168 -26 281 163 -1 -87 240 143 -18 81 244 -153 -267 -102 159 173 54
4665 54 104 -155 -44 42 -54 -109 285 61 215 48 22 -133 73 21 228 -249 -315 44 157 34 137 -223 -10
4688 -10 -149 71 -96 -84 197 84 231 12 -148 32 37 -199 83 8 45 -43 10 78 38 -114 229 -55 162
4711 162 48 -113 -21 153 -154 244 78 100 55 138 -82 -153 -114 22 122 80 -210 57 44 -55 -10 237 44
4734 44 -54 187 -314 -109 253 89 -212 43 169 108 -27 -13 168 -90 35 225 32 263 -5 33 -27 145
4756 145 -21 65 157 118 103 -96 61 90 -192 -26 -79 154 -73 60 -36 -156 -53 -30 157 30 -89 -19 277
4779 277 32 117 -52 44 112 -135 87 -109 74 293 26 18 -74 15 -24 -47 3 91 40 -28 67 -195 132 -89 -106
$$ packed form
4619a43J31o1J58Q0j84J77r0k82J39PL8L40j03l97N3J89j32j01K98l9j09k26J67
4642i0rK34m2l30L02j6J19j94L07j18j64q6L27r7j61R9J63l97j14J65K61J4j19
4665E4N0k59J11Q6r6n5L94k24J54j67k6j55K06n2K07m77o6L59J13j23J03l60K13
4688a0j39K20j67J2K81j13J47k19j60J80Nk36K82p5L7q8N3O8m0j52L43k84K17
4711A62j14j61R2J74l07L98j66K2m5Q3k20p1L9J36J00m2k90K67j3r9M5K47j93
4734D4r8K41n01K05L62j64l01K55J26o1j35J4J81k58J25J90j93K31k68L8o0J72
4756A45j66Q6R2l9j5j99J57K9k82J66n3K33k27J33r6j20J03K3J87j27j19P0K96
4779B77k45Q5j69R6O8k47K22j96J83K19k67qr2Q9l9k3N0Q8n1o8R5k62L27k21j7
$$ plain form
4804 -106 -20 80 65 314 -33 133 76 98 11 181 180 139 56 -232 179 194 -72 -23 -89 -52 85 37 -37 68 -84
4829 -84 70 -128 -111 179 25 -29 -222 62 -83 71 -38 -107 -26 -174 120 118 112 31 -35 97 366 23 -275 -95
4853 -95 -134 -61 96 76 76 533 -207 -116 83 248 56 74 52 6 -157 139 226 52 41 -55 128 -7 107 -63
4877 -63 -25 72 -37 -94 145 -37 -226 112 38 140 -148 -31 -67 89 159 -30 -59 122 -1 -95 -13 257 -111
4900 -111 21 96 56 -40 -97 -138 98 293 18 -217 42 200 -90 140 -24 190 -37 -279 16 52 -61 -80
4922 -80 150 31 124 -137 125 -43 -15 56 -295 88 -117 -77 44 232 -122 139 -7 -2 96 -127 90 53 -213
4945 -213 10 78 95 99 -174 -140 106 115 -47 -11 64 -2 -236 -96 72 -66 -112 95 -48 200 282 -16 -175 119
4969 119 8 -25 -175 -69 168 -94 -242 39 -305 -5 -111 215 -127 -79 149 -59 134 103 50 77 115 145
$$ packed form
4804a06Q6J00j5K49l47J66n7K2q7J70jm1q3k88M11J5k66M9o6L7J37m8p4J05j52
4829h4J54j98J7K90j54n4j93K84j45J54j09o9Q1j48K94koq1o6J32K69l43k98J80
4853i5l9P3J57k0%M57p40R1J99J65j92J8k2m6j63K96Q7j74j1r6J83j35J14j70
4877f3L8R7j09n7K39j82j89L38p4J02k88J17l6J56P0j89k9J81j23r4Q2K70l68
4900a11J32P5m0r6n7m1K36J95k75k35K59J58k90K30j64K14k27k42K95L6j13j9
4922h0K30j19R3k61K62j68K8P1l51L83k05M0J21J88l54K61j46NR8k23K17l7k66
4945b13K23O8J7Mk73L4K46Rj62L6P5o6k34J40J68j38m6K07j43K48Q2k98j59K94
4969A19j11l3j50J06K37k62j48K81l44L00j06L26l42M8K28k08J93l1n3K7L8L0
$$ plain form
4991 145 -193 51 -91 128 -109 -143 -46 -253 235 182 -277 -26 -38 131 -115 -171 94 153 -95 -81 -108 31 151
5014 151 -32 -213 -108 76 35 -124 -38 219 -71 141 -65 -156 40 11 87 57 -110 -150 -51 -225 24 110 -165
5037 -165 -124 64 218 64 -139 -157 107 63 87 -78 -12 32 5 252 -51 -213 -25 -11 363 34 -68 37 -131
5060 -131 142 -126 -60 80 -7 80 187 54 -145 99 -150 71 53 1 -206 29 56 49 142 7 183 -141 172
5083 172 -159 240 -116 48 -48 94 115 -108 187 -43 17 -27 101 -181 221 -189 62 137 123 126 25 4 159
5106 159 166 97 -12 107 158 -69 -143 -34 139 123 -76 132 -28 -16 196 47 138 24 124 43 -124 -91 -176 21
5130 21 -207 -96 336 52 155 141 44 -4 -97 -47 -329 186 19 -74 143 -57 -128 77 -179 304 -38 -11 160
5153 160 69 213 -102 64 174 -106 43 114 -135 53 -73 -77 -140 65 -195 -35 183 -147 30 -77 -76 -15 -69
$$ packed form
4991A45l38K44j42K19k37l4R7k07M88n3m59K51j2J69k46n6K65N9k48J4k7J39J20
5014A51j83j81J05J84m1j59Q6K57k90K12k06r1J96k9P6l0j67m0R9j74K49Q6k75
5037a65M1J88J54j54k03j8K64m4K4j65O6M4k7K47l03j62J88J4L74l29j02J05j68
5060a31K73k68O6J40q7Q7J07j33j99K44k49K21j8n2k07K35K7pR3j35J76l24L13
5083A72l31L99l56J64r6J42K1k23K95k30O0m4J28k82M02m10K51P5j4Lj01k1J55
5106A59Po9j09J19N1k27p4J09J73j6j99K08j60J2K12j49R1j14J00q1j67L3q5J97
5130B1k28J11M32k84J03j4r7m8r3N0k82N15j67r3K17k00p1K05k56M83l42K7J71
5153A60r1J44l15J66J10k80J49P1k49J88j26mo3K05k60J60K18l30J77j07JO1n4
$$ plain form
5176 -69 -101 64 166 44 22 -237 158 185 -102 238 -20 185 0 -3 28 25 197 124 -20 -30 147 109 -27 45
5200 45 25 -91 -82 62 64 -42 -108 -120 -136 -78 74 103 25 24 137 -39 132 -127 -145 309 -155 -265 43 27 -181
5225 -181 116 159 -243 -21 -226 153 49 -187 -133 -43 203 105 -9 70 -97 -179 -105 -229 75 -230 84 64 -87
5248 -87 44 0 5 51 -179 33 -122 -125 -29 -151 -220 38 -119 -44 189 30 -74 -71 -16 -88 -218 227 -75 -76 190
5273 190 -79 180 214 -86 30 26 -112 78 -155 111 125 -127 -27 -156 87 36 25 27 -183 72 20 29 64 -301
5297 -301 -15 -37 52 83 226 -93 75 -68 108 42 35 69 -211 -50 22 -203 -191 186 80 182 8 -70 -189
5320 -189 -194 -114 -44 -175 -46 -63 -236 -12 -66 82 -361 92 108 41 -119 20 83 -162 46 -104 72 -94 207
5343 207 -80 -106 -111 30 -23 251 -58 20 -44 -55 -14 19 88 17 -48 88 73 -28 -112 -12 -5 69 180 -49 -2 -52
$$ packed form
5176f9l2J65J02j22k2k59L95K7k87L40k58K05j85lL1lJ72p3j44j0J77l8j36P2
5200D5k0j16RJ44Kj06o6j2j6N8J52K9p8jJ13j76J71k59j8M54m64j10L08j6k08
5225a81K97M3m02K22k05L79j04k36N4R0K46r8j14P9j67q2P4j24L04l05L14k0j51
5248h7J31m4NM6k30K12j55lR6j22o9K58j57P5K33j59j04LN5p2j30M45l02jK66
5273A90k69K59L4l00J16mj38J90k33K66J4k52J00j29K43n1j1Kk10K55n2RL5l65
5297c01K86k2Q9L1J43l19J68j43J76o6pL4k80J61P2k25J2L77j06J02j74p8j19
5320a89nQ0P0j31J29j7j73K24n4J48m43M53J6o7j60J39O3k45K08j50J76j66L01
5343B07k87k6nJ41n3K74l09P8o4j1M1L3O9p1o5J36j5j01q4J00PP4J11k29M7n0
$$ plain form
5369 -52 -135 210 290 -100 -89 33 17 227 42 -54 -87 -248 -106 54 -59 70 -86 0 153 -176 176 -44 -286
5392 -286 -4 -255 301 -187 -80 62 20 -76 29 153 -96 147 170 79 263 -63 -124 -146 201 -165 27 -185
5414 -185 -57 -40 105 314 -152 101 162 23 -26 25 -237 -61 -50 -83 -53 -91 352 -198 40 191 229 156 52
5437 52 -6 -15 16 -203 -72 94 100 81 -121 146 -52 -370 40 8 -160 -24 -38 -409 -102 51 25 85 24 48 112
5462 112 -228 15 -89 386 -43 292 -4 27 189 245 9 -185 -81 9 15 -71 146 12 -12 -23 -138 46 10
5485 10 -53 60 113 -91 -32 97 97 89 226 1 -134 133 79 -332 182 -181 53 62 264 66 -32 -75 236 172 43
5510 43 15 -145 23 -89 19 -34 27 0 74 -53 -362 -104 135 -21 -53 -125 -82 139 -24 -22 113 90 -59 182
5534 182 -56 82 68 89 11 -12 -257 59 189 15 -27 -233 37 46 35 125 -307 86 -108 -138 101 164 -222 8
$$ packed form
5369e2q3L45Q0l90J1J22j6K10j85r6l3j61J42J60j13J29j56Q6J53l29L52k20k42
5392b86K82k51N56m88J07J42m2r6J05J24k49K43K3r1J84l26o1k2L47l66J92k12
5414a85J28J7J45K09m66K53O1j39m9N1k62J76J1l3L0l8M43n50K38J51L8p3j04
5437E2n8rL1k19J31J66Oj9k02K67j98l18M10l2j68J36j4l71L07J53k6O0o1K4O4
5462A12l40K43j04M75m29L35k96L1J62N6k36j94J04R0Oq6K17j34k4j1j15J84l6
5485A0o3J13N3k04N9J29%qJ37k25j35K67n4m11N14l63K34RK02j98r8m3L11o4j29
5510D3k8j60J68j12J08n3O1k7P4j27l09K58K39j56l2p2M3K21j63KJ35k3j49K41
5534A82k38J38j4K1p8k3k45L16J30j74m2k06K70Rj1R0m32L93j94l0K39O3l86K30
$$ plain form
5558 8 40 102 112 179 -60 -39 -25 37 -104 -251 -28 -41 166 33 -12 109 49 86 -243 84 97 75 46 5 91 27
5584 27 95 -108 217 -30 -3 423 -180 6 149 115 -75 -192 156 48 -19 -88 193 70 135 150 141 -6 -146
5607 -146 57 9 -248 -27 -101 -69 -93 -10 31 -170 -25 -198 144 128 -101 -64 -88 149 -52 -140 30 -73 124
5630 124 13 218 93 56 -117 166 -191 -36 203 -75 60 -252 -15 185 55 42 56 -13 -108 -96 -45 -75 85
5653 85 13 -202 60 -231 187 254 55 56 35 81 198 268 -181 32 -103 -122 -145 109 96 -310 -190 3 19 -346
5677 -346 -176 266 -233 226 -78 -189 23 -204 -244 206 -85 -41 14 269 15 206 160 12 -184 269 133
5698 133 -78 145 -22 -196 149 53 211 152 -14 182 70 -138 -201 -161 87 161 -69 -88 -36 -38 -14 138 -163
5721 -163 -74 -105 76 65 119 137 -244 -231 -85 95 16 -21 202 -163 188 -127 -21 -3 -73 -16 -33 96 93 -43 33
$$ packed form
5558HL2O2J0O7k39K1J4O2j41j47K23j3K07j33m5J21o0L7l29L27J3k2k9m1Q6o4
5584B7O8k03L25k47K7M26o03J86J43l4j90j17L48j08o7o9K81j23O5J5rj47j40
5607a46K03m8k57K21p4L2k4Q3M1k01J45j73L42j6k29L7k4K37k01q8J70j03J97
5630A24j11K05j25l7j73K83l57J55K39k78J35l12K37K00j30j3J4o9r5J2N1l0J60
5653H5p2k15K62k91M18O7j99Jk1M6J17P0m49K13j35j9k3K54j3m06J20J93J6l65
5677c46J70M42m99M59l04j11K12k27m0M50k91M4N5K55k54J91m6j48j96M53j36
5698A33k11K23j67j74L45r6J58n9j66J96j12k08o3M0K48P4k30j9N2kK4J52l01
5721a63Q9l1J81j1N4J8l81J3J46J80p9l7K23l65L51l15J06J8p0N7j7J29lj36P6
$$ plain form
5746 33 303 -18 109 -143 33 12 106 75 -174 -55 349 -87 -134 77 105 58 7 -91 248 74 109 213 208 69
5770 69 83 -328 -153 72 -106 -106 -267 -112 4 188 -142 -57 150 148 3 76 -310 -20 151 130 57 -150 -155 139
$$ packed form
5746C3K70l21J27k52J76k1R4l1k49J19M04m36m7K11K8m7n1r8L39j74L5J04nj39
5770F9J4m11J75K25j78%j61J55J16J84l30Q5K07kj45P3l86K90J71k1p3k07nK94
$$ [...]
8191I8
##END NTUPLES=NMR FID
##END=
