##TITLE=1H_Pr 2807
 CDCl3+DMSO
 8 sc, 
 15.03.2022
##JCAMPDX= 6.0         $$ Bruker NMR JCAMP-DX V2.0
##DATA TYPE= NMR FID
##DATA CLASS= NTUPLES
##ORIGIN= UXNMR, Bruker Analytische Messtechnik GmbH
##OWNER= root
$$ XWIN-NMR		Version 3.5
$$ Tue Mar 15 12:37:50 2022 Russian Standard Time (UT+4h)  she@DPX200
##.OBSERVE FREQUENCY= 200.131346
##.OBSERVE NUCLEUS= ^1H
##.DELAY= (6, 6)
##.ACQUISITION MODE= SIMULTANEOUS
##.ACQUISITION SCHEME= undefined
##.AVERAGES= 8
##.DIGITISER RES= 18
##SPECTROMETER/DATA SYSTEM= spect
##.PULSE SEQUENCE= zg30
##.SOLVENT NAME= CDCl3
##.SHIFT REFERENCE= (INTERNAL, CDCl3, 0, 15.7039)
##AUDIT TRAIL= $$ (NUMBER, WHEN, WHO, WHERE, WHAT)
$$ ##TITLE= Audit trail, XWIN-NMR		Version 3.5
$$ ##JCAMPDX= 5.01
$$ ##ORIGIN= Bruker BioSpin GmbH
$$ ##OWNER= she
$$ F:/spectra/data/she/nmr/H-F/1/audita.txt
$$ ##AUDIT TRAIL=  $$ (NUMBER, WHEN, WHO, WHERE, WHAT)
(   1,<2022-03-15 12:36:44.54 +0400>,<she>,<DPX200>,
      <created by zg, POWCHK disabled, PULCHK disabled
       configuration hash MD5:
       00 E9 B6 7A A2 85 ED C7 34 08 36 98 17 FE 4E 26
       data hash MD5: 16K
       68 72 66 44 9E 4B E8 70 40 D8 C3 2E F7 D8 1E FE>)
$$ ##END=
$$ 
$$ hash MD5
$$ 77 16 40 CA DF 74 C8 32 2A CD FA 5B 92 A5 1C 37
##$RELAX= 
##$RELAX= 
##$RELAX= 
##$RELAX= 
##$RELAX= 
##$RELAX= 
$$ Bruker specific parameters
$$ --------------------------
##$DU= <F:/spectra>
##$EXPNO= 1
##$NAME= <H-F>
##$PROCNO= 1
##$TYPE= <nmr>
##$USER= <she>
##$AMP= (0..31)
100 100 100 100 100 100 100 100 100 100 100 100 100 100 100 100 100 100 
100 100 100 100 100 100 100 100 100 100 100 100 100 100 
##$AQSEQ= 0
##$AQ_mod= 1
##$AUNM= <au_zg>
##$AUTOPOS= <>
##$BF1= 200.13
##$BF2= 200.13
##$BF3= 200.13
##$BF4= 200.13
##$BF5= 200.13
##$BF6= 200.13
##$BF7= 200.13
##$BF8= 200.13
##$BYTORDA= 1
##$CFDGTYP= 0
##$CFRGTYP= 5
##$CHEMSTR= <none>
##$CNST= (0..31)
1 1 145 1 1 1 1 1 1 1 1 1 1 1 1 1 1 1 1 1 1 1 1 1 1 1 1 1 1 1 1 1 
##$CPDPRG= <>
##$CPDPRG1= <>
##$CPDPRG2= <>
##$CPDPRG3= <>
##$CPDPRG4= <mlev>
##$CPDPRG5= <mlev>
##$CPDPRG6= <mlev>
##$CPDPRG7= <mlev>
##$CPDPRG8= <mlev>
##$CPDPRGB= <>
##$CPDPRGT= <>
##$D= (0..31)
0 1.2 0 0 0 0 0 0 0 0.06 0 0.03 0 0 0 0 0.0002 0 0 0 0 0 0 0 0 0 0 0 0 
0 0 0 
##$DATE= 1647333404
##$DBL= (0..7)
120 120 120 120 120 120 120 120 
##$DBP= (0..7)
150 150 150 150 150 150 150 150 
##$DBP07= 0
##$DBPNAM0= <>
##$DBPNAM1= <>
##$DBPNAM2= <>
##$DBPNAM3= <>
##$DBPNAM4= <>
##$DBPNAM5= <>
##$DBPNAM6= <>
##$DBPNAM7= <>
##$DBPOAL= (0..7)
0.5 0.5 0.5 0.5 0.5 0.5 0.5 0.5 
##$DBPOFFS= (0..7)
0 0 0 0 0 0 0 0 
##$DE= 6
##$DECBNUC= <off>
##$DECIM= 32
##$DECNUC= <off>
##$DECSTAT= 4
##$DIGMOD= 1
##$DIGTYP= 9
##$DL= (0..7)
0 120 120 120 120 120 120 120 
##$DP= (0..7)
150 150 150 150 150 150 150 150 
##$DP07= 0
##$DPNAME0= <>
##$DPNAME1= <>
##$DPNAME2= <>
##$DPNAME3= <>
##$DPNAME4= <>
##$DPNAME5= <>
##$DPNAME6= <>
##$DPNAME7= <>
##$DPOAL= (0..7)
0.5 0.5 0.5 0.5 0.5 0.5 0.5 0.5 
##$DPOFFS= (0..7)
0 0 0 0 0 0 0 0 
##$DQDMODE= 0
##$DR= 18
##$DS= 0
##$DSLIST= <SSSSSSSSSSSSSSS>
$$ [...]
##$SUBNAM2= <"">
##$SUBNAM3= <"">
##$SUBNAM4= <"">
##$SUBNAM5= <"">
##$SUBNAM6= <"">
##$SUBNAM7= <"">
##$SUBNAM8= <"">
##$SUBNAM9= <"">
##$SW= 18.0517287032376
##$SWIBOX= (0..15)
0 0 2 0 0 0 0 0 0 0 0 0 0 0 0 0 
##$SW_h= 3612.71676300578
##$TD= 16384
##$TD0= 1
##$TE= 0
##$TE2= 300
##$TE3= 300
##$TEG= 300
##$TL= (0..7)
0 120 120 120 120 120 120 120 
##$TP= (0..7)
150 150 150 150 150 150 150 150 
##$TP07= 0
##$TPNAME0= <>
##$TPNAME1= <>
##$TPNAME2= <>
##$TPNAME3= <>
##$TPNAME4= <>
##$TPNAME5= <>
##$TPNAME6= <>
##$TPNAME7= <>
##$TPOAL= (0..7)
0.5 0.5 0.5 0.5 0.5 0.5 0.5 0.5 
##$TPOFFS= (0..7)
0 0 0 0 0 0 0 0 
##$TUNHIN= 0
##$TUNHOUT= 0
##$TUNXOUT= 0
##$USERA1= <user>
##$USERA2= <user>
##$USERA3= <user>
##$USERA4= <user>
##$USERA5= <user>
##$V9= 5
##$VALIST= <valist>
##$VCLIST= <CCCCCCCCCCCCCCC>
##$VD= 0
##$VDLIST= <DDDDDDDDDDDDDDD>
##$VPLIST= <PPPPPPPPPPPPPPP>
##$VTLIST= <TTTTTTTTTTTTTTT>
##$WBST= 1024
##$WBSW= 4
##$XGAIN= (0..3)
0 0 0 0 
##$XL= 0
##$YL= 0
##$YMAX_a= 66183
##$YMIN_a= -28001
##$ZGOPTNS= <>
##$ZL1= 120
##$ZL2= 120
##$ZL3= 120
##$ZL4= 120
##$ABSF1= 10
##$ABSF2= 0
##$ABSG= 5
##$ABSL= 3
##$ALPHA= 0
##$AQORDER= 0
##$ASSFAC= 0
##$ASSFACI= 0
##$ASSFACX= 0
##$ASSWID= 0
##$AUNMP= <proc_1d>
##$AZFE= 0.1
##$AZFW= 0.1
##$BCFW= 1
##$BC_mod= 2
##$BYTORDP= 1
##$COROFFS= 0
##$CY= 11.3945322036743
##$DATMOD= 1
##$DC= 2
##$DFILT= <>
##$DTYPP= 0
##$F1P= 2.36226072786647
##$F2P= -0.459571619588291
##$FCOR= 0.5
##$FTSIZE= 0
##$FT_mod= 4
##$GAMMA= 1
##$GB= 0.15
##$INTBC= 1
##$INTSCL= 1
##$ISEN= 128
##$LB= 0.24
##$LEV0= 0
##$LPBIN= 0
##$MAXI= 10000
##$MC2= 0
##$MEAN= 0
##$ME_mod= 0
##$MI= 1.114404
##$NCOEF= 0
##$NC_proc= 0
##$NLEV= 6
##$NOISF1= 3.799351
##$NOISF2= 2.8
##$NSP= 1
##$NTH_PI= 0
##$NZP= 0
##$OFFSET= 15.70392
##$PC= 1
##$PHC0= -16951.52
##$PHC1= 13.20078
##$PH_mod= 1
##$PKNL= yes
##$PPARMOD= 0
##$PSCAL= 0
##$PSIGN= 0
##$REVERSE= no
##$SF= 200.130013532006
##$SI= 16384
##$SIGF1= 3
##$SIGF2= 2
##$SINO= 400
##$SIOLD= 16384
##$SREGLST= <1H.CDCl3>
##$SSB= 0
##$STSI= 0
##$STSR= 0
##$SW_p= 3612.71676300578
##$SYMM= 0
##$S_DEV= 0
##$TDeff= 0
##$TDoff= 0
##$TI= <>
##$TILT= no
##$TM1= 0
##$TM2= 0
##$TOPLEV= 0
##$USERP1= <user>
##$USERP2= <user>
##$USERP3= <user>
##$USERP4= <user>
##$USERP5= <user>
##$WDW= 1
##$XDIM= 8192
##$YMAX_p= 0
##$YMIN_p= 0
$$ End of Bruker specific parameters
$$ ---------------------------------
##NTUPLES= NMR FID
##VAR_NAME=  TIME,          FID/REAL,        FID/IMAG
##SYMBOL=    X,             R,               I
##VAR_TYPE=  INDEPENDENT,   DEPENDENT,       DEPENDENT
##VAR_FORM=  AFFN,          ASDF,            ASDF
##VAR_DIM=   8192,          8192,            8192
##UNITS=     SECONDS,       ARBITRARY UNITS, ARBITRARY UNITS
##FACTOR=    0.0002768,     1,               1
##FIRST=     0,             0,               0
##LAST=      2.2672688,     0,               0
##MIN=       0,             -28001,          0
##MAX=       2.2672688,     66183,           0
$$ Real data points
##PAGE= N=1
##DATA TABLE= (X++(R..R)), XYDATA
0@%%%%%%%%%%%%%%%%jRj6J6j6J6j8K6l2L3m1M9n7O5p3Q5r4J06j22J38j54J72j94
$$ 0 0 0 0 0 0 0 0 0 0 0 0 0 0 0 0 0 -1 8 -8 8 -8 8 -10 16 -16 17 -24 25 -32 33 -40 45 -49 57 -65 73 -81 91 -103
39a03K17k42K69k98L31l65M03m47M92n42N99o60P25p97Q81r75J079j197J330j485
$$ -103 114 -128 141 -157 174 -191 212 -235 257 -285 314 -346 379 -418 463 -512 567 -630 700 -785
59g85J669j886K149k476K897l465M273n525P752j2946N2523K2003l6106P395p923
$$ -785 884 -1002 1147 -1329 1568 -1897 2376 -3149 4603 -8343 44180 66183 30077 37472 29549
74B9549n785j0732P290P50j0269k1523p607K234N882K494J325j2977o634Q060
$$ 29549 23764 13032 20322 21072 10803 -10720 -18327 -16093 -10211 -7717 -6392 -19369 -26003 -17943
88a7943J3014J144m627K999J0235K29j269J0233J8363m398k4349j5639K55K905
$$ -17943 -4929 -3785 -8412 -5413 4822 5051 3782 14015 32378 27980 3631 -12008 -11753 -8848
102h848R91J565J030p886j2333k520Q937Q846M586N273r66j1882k923J0688J1238
$$ -8848 -7857 -6292 -5262 -13148 -25481 -28001 -19064 -10218 -5632 -359 -1325 -13207 -16130 -5442 5796
117E796R84m111L473N805k285l855M817K287j2892j3692N88O796M710J086Q56
$$ 5796 6780 2669 6142 11947 9662 5807 10624 12911 19 -13673 -13085 -6289 -1579 -493 363
132C63k302p184k74J1931J2043K132k671j416o571q133M305J2969O902n340p296
$$ 363 -1939 -9123 -9397 2534 14577 16709 14038 12622 6051 -2082 2223 15192 22094 16754 9458
147I458n61j927n752k108K895l291j1091l979M590L295Rl81J393j217k012O170
$$ 9458 8897 6970 1218 -890 2005 -1286 -12377 -16356 -11766 -8471 -8462 -8843 -7450 -8667 -10679 -4509
163d509J1113J600p236m769l46k094J736J0292Q761j669j0532n524J869p54j064
$$ -4509 6604 8204 968 -3801 -4147 -6241 -4505 5787 14548 12879 2347 -3177 -1308 -2062 -3126
178c126L493J653p121p796J894N397J788P28K356K396k128p92O307L424m789o109
$$ -3126 367 2020 -5101 -12897 -11003 -5606 -3818 -3090 -734 1662 -466 -1258 5049 8473 3684 -2425
194b425J053L710J372M195N786q91q352q223Q80M463J63l94N96m437q358j869
$$ -2425 -1372 2338 3710 7905 13691 12800 4448 -3775 -2895 1568 1731 1337 1933 -2504 -10862 -12731
210a2731O894N924J370L71R53j434m395J405N883N54m397r91M194J318o36J691
$$ -12731 -5837 87 1457 1828 2781 1347 -3048 -1643 4240 4794 397 -594 3600 4918 4282 5973
226E973L85m574p031j002N334J769l145j922j974m409k224O318Q961K174k486
$$ 5973 6358 1784 -5247 -6249 -915 854 -2291 -4213 -6187 -10596 -12820 -6502 2459 4633 2147
241B147k199j159j983p80O070N014j864l899O2J849o23p91J500l47m032l238K449
$$ 2147 -52 -1211 -3194 -3974 2096 7110 5246 1347 1409 3258 2635 1844 3344 2997 -1035 -4273 -1824
258a824L162k336k892K8J47l85L090O868K467l974n192j381Q97r2L223N144o29
$$ -1824 1338 -998 -3890 -3862 -3715 -4100 -1010 5858 8325 4351 -841 -2222 -1325 -1417 1806 6950 6321
275F321o279l527J383J857p9J468J322k258m048j277L578J457k249J051K152M75
$$ 6321 42 -3485 -2102 -245 -324 1144 2466 208 -3840 -5117 -1539 -82 -2331 -1280 872 1347
291A347K33K212K540k877m924j736K160K009O09J347J44n376m401P56L944K497
$$ 1347 1580 3792 6332 3455 -1469 -3205 -1045 964 1573 2920 3064 -2312 -6713 -5957 -2013 484
307D84j03J59j575l672j815K634M875Q87r11J356M49r64n26J994Q26k872j952
$$ 484 381 540 -1035 -4707 -6522 -3888 987 1874 963 2319 2768 1804 1278 3272 4098 1226 -726
324g26J508K151k36j944o4j917l782K76L824K979j129k589j372j562j630K668
$$ -726 782 2933 2697 753 689 -1228 -5010 -4734 -910 2069 940 -1649 -3021 -4583 -6213 -3545
340c545N025L029k087j659J2p86O1J774K775j39k601j004O81K2j798m88R19j508
$$ -3545 1480 4509 2422 763 775 -11 50 1824 4599 4460 1859 855 1536 1558 -240 -728 191 -1317
358a317j365J839J790o89k857j651Q44K21J716L783K311j665m215p25J605J082
$$ -1317 -2682 -843 947 258 -2599 -4250 -3406 -3185 -1469 2314 4625 2960 -1255 -1980 -375 707
374G07J963J860J55l253l519l00J123K7j64Q81K17k338l75J628O77p51j016J217
$$ 707 2670 4530 4685 1432 -2087 -2387 -1264 -1237 -1401 -520 -303 -2641 -3016 -1388 -711 -1462 -2478 -1261
392a261J953N98R06M63q02l487q68K327J674J004j54j311k356l435n09K668K277
$$ -1261 692 1290 2196 2659 1857 -1630 -2498 -171 1503 2507 2353 1042 -1314 -4749 -5258 -2590 -313
409c13L57m22K73j055p86J357K890J265n8k6N05k53j221P7j38r28j292Q57J833
$$ -313 44 -378 -105 -1160 -1946 -589 2301 3566 3508 3482 3987 3734 2513 2590 2452 1524 232 1089 2922
428B922n06j397j600j658j185l66K544L041m3j430r29j23j55J412K735J078r76
$$ 2922 2416 1019 -581 -2239 -3424 -3790 -1246 1795 1752 322 -607 -730 -885 527 3262 4340 3364
445C364k567j797o88j435r5R38j58j061r68O16J56r60n83J7J215N82J456K272
$$ 3364 797 -1000 -1688 -3123 -3218 -2280 -2438 -3499 -4467 -3851 -3695 -4655 -5238 -5221 -4006 -3424 -1968 304
463C04R41r80q23J310J724J434J795N20j883k591k390K93Q92O09R96J59j395j685
$$ 304 1245 265 -558 752 2476 3910 5705 6225 4342 1751 -639 -346 546 1155 2151 2310 915 -770
481g70n04O86O80k78M43K71K24m30J43J235j73m3Q06J999N45l59m48j629j896
$$ -770 -1274 -588 92 -186 257 528 752 322 465 1700 1527 1484 2290 4289 4834 4475 4027 2398 502
500E02j384P46K298N13o3m69j965j645q67Q40N41n75o77j533j271m94n89J464
$$ 502 -882 -136 2162 2675 2612 2143 178 -1467 -2334 -1494 -953 -1528 -2205 -3738 -5009 -5503 -6092 -4628
518d628J314K40M99M65J59n63n83J84j75P20J354J678J604l33n93m19m47O05J046
$$ -4628 -3314 -3074 -2575 -2110 -1951 -2514 -3097 -2913 -3088 -2368 -1014 664 2268 1935 1342 923 476 1081 2127
537B127R20l86j595j350p78O45R03J400J863j42q79r26o87o21l58L24N6j92L02
$$ 2127 3047 2661 1066 -284 -1062 -417 486 1886 3749 3607 2728 1802 1115 494 136 460 516 324 626
556F26l23K13l7j123L35J12R4P43m6l95q75m78N22J572J811J301J116j002j954
$$ 626 303 516 479 -644 -309 -197 -103 640 594 199 -676 -1154 -632 940 2751 4052 5168 4166 2212
575B212j448m72n39j78J90r02j030j006q84m62Q73l46J80N35l63j6L9J80N26J216
$$ 2212 764 292 -247 -425 -235 -1137 -2167 -3173 -4057 -4519 -3646 -3992 -3812 -3277 -3640 -3656 -3617 -3437 -2911 -1695
595a695J724K066K119Q51o61p41j083j235J60j94K64m69r38j009q92j52N28J121
$$ -1695 29 2095 4214 5065 4404 3663 2580 1345 1505 1311 1575 1106 168 -841 -1733 -1885 -1357 -236
613b36N50p42j28m30o88K47M53J378J398J014P74M09r06n09j077q44p16pK5n10
$$ -236 314 -428 -556 -986 -1674 -1427 -974 404 1802 2816 3590 3999 3093 2584 1507 663 -53 -60 -35 -545
633e45n42o74l69j06P42J065N39L37o73j183l95N0L17J551R03N64N67n40n34m40
$$ -545 -1087 -1761 -2130 -2236 -1494 -429 110 447 -226 -1409 -1804 -1754 -1437 114 1017 1581 2148 1608 1074 634
653F34p12m01n67k8m45l48n8m57L15M53Q65Q76P41J19l31j233o47r7N83J336J075
$$ 634 -78 -479 -1046 -1074 -1519 -1867 -1925 -2382 -2067 -1614 -749 127 868 987 656 -577 -1224 -1321 -738 598 1673
674A673O30j79j87m97m97j30l8r7n16l59n89l83K53K31R59R94K38N19o2p64r78
$$ 1673 2303 2124 1937 1440 943 813 775 678 162 -197 -786 -1169 -916 -685 274 1268 1506 2025 1963 1199 221
695B21p20l73M19O00J102N31m63n74p09m00k01K07n7n06o78o58n60P3R63J078
$$ 221 -499 -872 -453 147 1249 1780 1317 743 34 -366 -567 -360 -417 -923 -1601 -2259 -2819 -2746 -1783 -705
715g05P23O46J18l78l35r84J89q5L35P19N81K14j92k93j54k42j0m2l59N4p40j047
$$ -705 18 664 782 404 69 -915 -726 -811 -476 243 824 1038 846 553 399 157 147 105 -254 -200 -940 -1987
737a987l61J63M31J106J008Q67Q8m43p50n39K43K30R13L86L08K42k63J24j98K2
$$ -1987 -2348 -2185 -1754 -648 360 1227 1315 872 122 -417 -174 56 969 1355 1663 1905 1642 1766 1568 1590
757A590kk90j18p04j029o10o92K69O44N53P94L82k60p98n06l93N6M98K34K79M42
$$ 1590 1588 1298 1180 476 -553 -1163 -1855 -1586 -942 -389 405 787 527 -271 -777 -1170 -1114 -616 -382 -103 339
778C39j42j20j39L56N28P7n3k10n76j033o81n4K36N87N96L91J23k53n89q37o6
$$ 339 197 77 -62 294 822 899 846 636 60 -973 -1654 -1708 -1472 -885 -289 102 225 -28 -617 -1454 -1520
799a520J66R2O32M71k31J43J3J04N01N28Q06J20m01n50o02k01k63J44R46L85J70
$$ -1520 -1354 -1262 -630 -159 -390 -247 -234 -130 371 899 1705 1825 1424 874 272 71 -192 -48 898 1283 1453
820A453k20o18m64k82j35j4M31J97j04j95P5l81M24J52Q06M95k44k72p99o65o61
$$ 1453 1233 615 151 -131 -266 -280 151 348 244 49 124 -257 167 319 1125 1620 1376 1104 305 -360 -1021
841a021J48O9N61M60K50n56j88l28k34N0K16J8L38m31p1j14kK18M78Q00j40p2
$$ -1021 -873 -804 -243 217 467 -89 -277 -605 -839 -789 -573 -555 -217 -648 -719 -833 -835 -617 -139 661 521 449
863D49p11r11O5p13J92N87Q2L06j3L36k14q9J12N12Q05j16K34O8j05l93K36L06
$$ 449 -262 -1173 -1108 -1821 -1629 -1042 -960 -654 -667 -331 -545 -634 -522 -10 795 679 913 981 876 483 719 1025
885A025L25K98q9j15q28n55n00J02L29N4L09K28m5L0k38K78J48M97L60k19J39
$$ 1025 1350 1648 1559 1444 616 61 -439 -337 -8 46 355 583 538 568 330 608 756 1253 1613 1394 1533
906A533n11l20j42l46K63L7L8k07p56n18q01l24p8K75K90L55L02m81K8L18L04
$$ 1533 1022 702 560 214 477 514 552 345 -411 -929 -1730 -2054 -2132 -1857 -1567 -1212 -910 -1391 -1363 -1045 -741
927g41L56P97r5K85l17p2l17k46M31J24J55L10m18l56p11k29r7J45N6M63P9k9
$$ -741 -385 412 317 602 285 213 -104 -350 81 205 360 670 252 -104 -815 -1044 -1141 -996 -940 -477 -398 -427
949d27l29k08M81J63M21K85M17k33k48Rj94r1N36K28M84m4r3j78j49L5j30N31
$$ -427 -756 -964 -483 -320 101 386 803 570 322 331 137 46 582 810 1294 1250 1157 979 830 865 735 1266
971A266L01m01M29m93m58k01l33K01k10k34O5j78n62m48k59K35M2K31J03K72r4
$$ 1266 1567 1166 1595 1102 644 443 110 311 101 -133 -68 -246 -808 -1256 -1515 -1280 -1238 -1007 -904 -632 -726
992g26k0j87L42K64N91M88L06L7n17k4k6l4K91J71l91K7l81l35m10k27j07j36
$$ -726 -746 -933 -591 -327 264 752 1058 1095 578 554 528 494 785 956 565 592 211 -124 -534 -761 -868 -1004
1014a004K81p8j70k69l66Q4J05N40M79L87K01o6k06k25J59O75J50N15P7K9l40
$$ -1004 -723 -801 -971 -1240 -1606 -1522 -1417 -877 -398 -11 190 124 -82 -307 -148 527 677 1192 1269 1298 958
1035I58l18K49J44k80J77j78l64l14n7p29J76Q8L57J71J07L9n83o0k15L00O8J15
$$ 958 640 889 1033 753 930 752 388 74 17 -712 -536 -448 -91 80 187 226 -357 -417 -632 -332 -264 -149
1057a49L80n6J52n72M33l12L34N1L80k51l80k04j35q5m8J33N14J20L0Kl50j95
$$ -149 231 175 327 -245 188 -124 210 261 641 390 10 -194 -329 -414 -462 -329 185 305 335 337 -13 -208
1079b08N2k52j0J77K62k90o5j28j78J35K65kK90J34l14l36k44K81M95L19K43K55
$$ -208 -156 -408 -418 -241 21 -269 -334 -462 -640 -505 -240 -242 48 182 -132 -468 -712 -431 64 383 626 881
1101H81J65j68j54q4k39l6K0j98N3k54j87n8j29O6L44J1j20L6k6p45J96M6K23
$$ 881 1046 878 724 640 401 365 385 187 240 -14 -201 -259 -388 -322 22 33 -87 -51 -77 -822 -626 -580 -357
1124c57M75N56J99M0k77k16Kl43O3j32q5l30l31kn71P36j28L18j09L2N7k91j77
$$ -357 118 674 873 913 636 420 422 79 142 10 -75 -405 -736 -738 -1309 -573 -701 -383 -492 -460 -403 -694 -871
1147h71J03P1L53L06O65L18k41j60K08j95J31j35j26n7n74j19M5j76L23J78M60
$$ -871 -768 -697 -344 -38 627 945 704 544 752 557 688 553 427 370 -204 -323 -278 -454 -131 47 507
1168E07K7m84N3l57l37J73J46K54K40O40mK97n9l41R2j5k89Qk49k04l79p4OK43
$$ 507 534 50 103 -254 -591 -418 -272 -18 222 862 858 1155 1096 755 847 832 543 551 302 98 -281 -355 -349 -106
1192a06K90J56KL3n15l13j70k38M4J78K22P6j79K95K24l40L9m9L8j24j17m47L08
$$ -106 184 340 342 375 -140 -453 -623 -861 -817 -639 -417 -341 -520 -225 -1 -341 -302 -351 -313 -437 -554 -1001 -693
1215f93k31K24K25K78K34L19o2k10k86R7j08L90L1K46j37K03j47L26j4l6ol16
$$ -693 -924 -700 -475 -197 37 356 294 84 -202 -105 -213 177 208 454 317 520 373 699 685 649 643 327
1237C27r9k28m16n1K52J90K67K26N93j99J65j52m05j18LJ8L53j9j28k97j13M2
$$ 327 228 0 -416 -467 -215 -25 242 468 1061 862 1027 875 470 352 355 373 726 707 579 282 169 211
1259B11J00l23L0l99l38m54k03l0K1K73R2N95J3O9J48j87K30m90M09j67r8M07
$$ 211 311 -12 18 -381 -719 -1173 -1376 -1406 -1385 -1112 -1020 -425 -412 -343 -195 -382 -152 -642 -233 -400 -498 -91
1281i1O6J61qq1k4K48r6k12J34o59k29J27R4K00N88L8K72P1j25J82l9M9p7J31
$$ -91 -25 136 128 47 23 271 175 -37 97 -562 -791 -664 -570 -370 218 256 528 599 474 656 617 666 589 720
1305G20N6m79K73J14J35n5M4k3j62j30p4p6o16j17J99L0M14j2J3j69j3l97M1k6
$$ 720 776 297 570 684 819 764 808 785 623 493 419 343 -273 -390 -191 -161 253 241 254 85 72 -325 -284 -310
1329c10ol95r4P8K6j05k2R4K70N0J74k03n13K04q6m1J07J98Q5P61k14J30k4j11
$$ -310 -316 -711 -805 -727 -701 -806 -828 -734 -464 -414 -240 -443 -956 -752 -838 -879 -772 -574 -489 272 58 188 164 53
1353E3p0K2PLk07l89J76J08L64K65K54J16n2J58l24k18r7J41K09L20k53J54O3
$$ 53 -17 5 12 15 -192 -581 -405 -297 67 332 586 702 650 808 484 266 169 310 519 839 586 740 803
1376H03j15R7j45j01k30k74j39k03m8m72J97R2J32K93J23R6l12j29K08m01L08
$$ 803 688 785 640 539 309 35 -104 -307 -355 -827 -630 -538 -406 -113 10 106 -206 -335 -127 -528 -220
1397b20R2j58M83K49j57K35M3j57rp3l21q8k8l99J6Q5K1J9J29J35k23l0l4l69
$$ -220 -128 -286 197 446 289 524 567 410 401 328 7 -81 -109 -508 -492 -407 -386 -367 -238 -103 -326 -356 -390 -759
1421g59K62J54q5M76n7l6J76P9J56J62l8k6J02k55j37l29K71N1L61n12NL53j78
$$ -759 -497 -343 -428 48 -9 -45 131 210 366 528 490 464 566 311 174 -155 116 167 528 16 21 374 196
1444A96p4q8j93k38J23M8J94l69M2M3l1J86j9P4J50K7l76q3K4O5M35P2L77J12
$$ 196 122 34 -159 -397 -274 -226 -32 -401 -359 -316 -347 -161 -180 -106 44 71 -305 -388 -364 -299 136 208 585 697
1468F97k24K98k96R6p6j15O0k12k09J9J14n4k85j87L56k38m6j20k09j41J6K18
$$ 697 473 771 475 571 495 380 440 228 19 38 152 98 -187 -374 -18 -256 -302 -422 -631 -772 -756 -538
1490e38K56j24L69R6p9L79n7j19L08J69j50O6k33j67R8R5k67K16l12o2Lk21M6
$$ -538 -282 -406 -37 59 -20 359 302 183 491 660 510 576 343 176 274 369 102 318 6 -56 -53 -274 -228
1513b28q5q1l5l07M24Q2jJ12k2o6K43K14J26l63M01k24pj17R8m3M42l66K03n1
$$ -228 -313 -394 -429 -736 -312 -230 -231 -119 -141 -207 36 250 376 13 414 190 183 66 164 121 563 197 400 349
1537C49l8l28j49k78M16J09k81L03j46K5Oo8oK72k25Q1K39j84l04J07R2J6K2K81
$$ 349 311 -17 -166 -444 -28 81 -200 103 -43 -18 -12 -80 -86 186 -39 42 281 97 -207 -100 -8 8 30 311
1561C11k43J11o23J34rL05o3K18J10j56O0j13K88l45o7K94q1k60k76L15J44l76
$$ 311 68 179 -444 -310 -319 -14 -77 141 251 95 155 42 330 -15 -82 212 131 -129 -405 -90 54 -322
1583c22J63m9K7J73j98J76J55j39J62j68L82o2J50P7j84j41J31J23j00J03l53
$$ -322 -159 -208 -181 -8 -206 -30 125 -14 148 -20 362 300 450 527 343 202 333 456 356 459 106
1604A06j66J52j04k91J08r6p2J87j29J92m71M81J12j82L4L26N1M5l04j8K15l58
$$ 106 -60 92 -12 -303 -195 -291 -363 -176 -305 -113 -584 -103 9 -173 -139 187 238 283 -21 -39 176 -182
1626a82L55j64J22o7j20K0r2k98Q8p0j42J17o5r5L79j55l0J41J33R0J19J46J08
$$ -182 173 9 131 64 -56 -36 -128 -426 -338 -408 -550 -433 -498 -593 -214 -369 -399 -258 -125 -35 84 230 338
1649C38l7j45K48L4l4P7K18p2p8k20L22k96j57j70K15k00k24J60J20k6N9O9J71
$$ 338 301 156 404 438 404 481 699 627 549 329 651 355 198 28 243 43 -181 -21 99 73 132 201 372
1672C72l8l93K97j95k64m8J33Q6o4M2n8J02r0o6N4k90m5J09r0K94m21l22O09J38
$$ 372 334 -59 238 43 -221 -269 -136 -50 -114 -72 -130 -28 -118 -184 -130 -420 -465 -356 -446 -152 -573 -895 -286 -148
1696a48Q2k91L17j6j23q9m7O7j61q2L77m2p4J91L93j40j01MJ24J0k27K23J1K06
$$ -148 -66 -357 -40 -56 -179 -268 -315 -248 -409 -491 -114 -156 -230 -39 354 214 113 117 241 251 24 247 258 464
1720D64k2O0K80K3j12l72K07k76j37J44n2k84Qq5j33J42N3J25J79p7m33J0N2l
$$ 464 442 502 782 805 693 321 528 252 115 259 207 -77 -69 -154 -287 -145 -92 33 212 135 -298 -288 -236 -239
1744b39J68r6K26j9NK93l08q0m72L35k46l5j91JK13k87J64J18R6j70J89k32L51
$$ -239 -71 -167 59 40 45 338 30 -50 -522 -187 -433 -468 -659 -658 -445 -732 -568 -450 -354 -524 -335 -567 -216
1767b16k09KK57K30J08j20L34R5J43l38L84J24n20o8K57n2n27K32O7N2o6L78r1
$$ -216 -425 -423 -166 64 172 52 386 481 624 286 670 794 274 206 463 411 -116 116 183 235 169 547 456
1790D56J13k53q3K06k01l87J15K96j09n3M79k20J00j37q5m9m38m9K61j39k30k0
$$ 456 569 316 233 439 238 -149 -34 262 153 100 579 359 459 322 237 188 -250 -299 -38 -177 -407 -427
1812d27J98J17j53Q4l4L32k21Kj97L8l66J78Q7M56k90J48m3R9N2k20l2K00k64
$$ -427 -229 -112 -265 -181 -215 117 -104 -102 -299 -261 -627 -449 -362 94 -196 -48 -91 8 60 -160 -192 8 -256
1835b56M7O7L39j67K7K66j90O2K22k30j10Jj04J6j11K8K09R4o6k52J74J08k26
$$ -256 -209 -142 197 30 57 323 133 195 417 187 77 78 -26 -10 -121 -93 116 210 144 -108 66 174 -52
1858e2m20K02jM6p7M10O9oj2J05K69k22o4j94L59k04j97K78rl50J58l18K04o4
$$ -52 -472 -270 -271 -225 -302 108 177 171 159 264 533 311 247 53 412 208 11 289 280 -70 88 -230 -26 -90
1882i0k52j71j1P0j55Q1K27n9N0J53L01J04o1M9K7j15M4J05j3l35K94K22M7j25
$$ -90 -342 -513 -524 -454 -609 -528 -301 -360 -310 -157 144 248 187 236 263 148 192 297 284 -51 243 465 512 387
1906C87j92K72r6k75k47L8n0l47J70L79l88J12K28J7j24k73J44K63k07j16J92
$$ 387 195 467 371 96 -151 -113 -163 -510 -340 39 -349 -237 -9 8 -116 -389 -245 18 -189 -305 -113
1927a13J59q5m7J80J96jj81M15o2l47j62L76l38p6j15J15K38pm11N65L5l52l56
$$ -113 46 -39 -86 94 290 289 108 523 461 114 -48 328 -10 -86 -201 -86 152 145 -266 299 334 -18 -374
1950c74K10n4m68J70o0L58np9L92r6k36L37K41l26j6l9L68j20J55L0k27L24j30
$$ -374 -164 -218 -686 -516 -576 -218 -223 -302 90 -6 -242 95 336 10 -6 -45 323 203 358 388 161 485 355
1973C55r3k5k02j70o5K28kj30l8p2KJ05J05J94k69J53k60J64N1j83K64J75Q1l93
$$ 355 262 237 35 -135 -200 28 26 -104 -142 -214 -212 -107 -2 192 -77 76 -184 -20 31 -152 112 287 368 -25
1997b5J38M36l54Q9J53j20j93k34L3R0k46J84j12O5j13J81K9K01n73L4K23N5k88
$$ -25 113 549 195 284 437 317 124 -110 -77 13 -233 -49 -161 -96 -209 -28 1 202 -371 -337 -114 -59 -347
2020c47J92L58n9j44P1K23j97q4K1J92m31N2p2J13K33l79k0K60j7k81p8N65k88
$$ -347 -155 203 144 0 71 294 97 13 34 226 -205 -153 -225 -112 121 -258 -278 -18 -35 -316 -394 171 -117
2043a17q1J86J09m18K42J15Ol2J5K58k77m3j47J15K09q6l21K57L7mJ88P9k34j38
$$ -117 -198 -12 97 -321 -79 36 42 10 25 283 6 -37 -184 -69 140 54 -267 -10 27 23 211 290 56 -82
2067h2J26K26k28k19J36M2J1j26K26j26J20R6k06J73q4j41J29j2J22j49q1J29
$$ -82 44 270 42 -177 -41 1 12 -114 112 -14 106 202 -4 169 85 -56 73 61 183 34 -47 82
2089H2L4k8k1J49k51J6P5J92j14o16K45K23j60l0j2L78l62j36K28r4j44o2m0M53
$$ 82 116 88 67 216 -35 -19 56 248 134 -482 -237 -14 -174 -204 -216 162 -200 -336 -108 -202 -346 -408 -448 5
2113Ej59J72j28J45J48m64K90q2J5j04M15J32m22n1K81J24m16J90K51m67K63k94
$$ 5 -154 18 -110 35 183 -281 9 -73 -58 -162 253 385 -37 -88 193 317 -99 91 342 -125 138 -156
2135a56K26r8L1j51K68j14k35K77J71P7l75J51L35o2j65J03j37L5Q3j39J57j95
$$ -156 70 -28 3 -148 120 6 -229 48 219 296 -79 72 407 345 180 283 146 181 264 125 282 87
2157H7k77r9J47J27j21O4jj14j34J37K81j65k15P5L32l30k61M48m7k68M79j37
$$ 87 -190 -289 -142 -15 -136 -72 -73 -187 -321 -184 97 -68 -283 -208 124 -206 -467 -19 -66 -334 145 8
2179Hj8l08J08J92J1K5j24J02J88j74j2k5Q4k07k36L87O5j30j3J47J9j91K47j93
$$ 8 -10 -318 -210 -18 -7 18 -106 -4 184 10 -2 -27 57 -150 -386 1 66 -64 -77 70 89 -102 145 -48
2203d8L72k62J05J05j68o4K51k9N6k1j59J35J72j62k24K10k14j54J17K39k23j07
$$ -48 324 62 167 272 104 40 291 262 318 297 138 273 445 283 59 269 55 -99 18 257 34 -73
2225g3j58k5J25m1n6j3o6l8r3K51N8j61j44L24n0m9J42K13r3k13J98J7Mj51J39
$$ -73 -231 -256 -131 -172 -228 -241 -307 -345 -438 -187 -129 -290 -434 -110 -160 -209 -67 146 53 -160 38 55 59 -92 47
2250D7J04j59jQ5r5L5j62N4p7j90J08P0O7qO4Q1J11j21J32n1K45j16k99K75M0
$$ 47 151 -8 -9 76 -19 16 -146 -92 -169 -359 -251 -181 -114 -122 -58 23 134 13 145 94 339 223 -76 199 239
2275B39n0mL6o1q7O0L24l19n1o5j39l9J2K75j48L9j23j8J49m9J09k98M45n28K56
$$ 239 189 185 221 160 73 133 457 138 87 22 -117 -156 -144 131 -17 22 -101 -119 30 -19 90 -208 237 -291 -35
2300c5Q4k06J63j71M43r2P1j70Ok61r9K73l8K9p8m8N0k27K82k09l9J49J86k44
$$ -35 49 -157 6 -165 278 186 257 87 93 -168 -267 6 -32 -3 -81 -129 -79 -306 -24 -233 -272 -123 63 -181
2324a81K15k5l58J46J00k1N1J57j54K61j77K8jQ9j96J99m6k3J12J85r8L9j77J65
$$ -181 34 9 -349 -203 -103 -124 -73 84 -70 191 14 42 41 130 -66 133 87 64 176 361 263 302 125 290
2348B90j17j55j12k09K43K55n74J55J39L1J04k07K06K22m61m9J78K03l6m9J20
$$ 290 173 18 -94 -303 -60 195 -379 -224 -85 -54 50 -157 49 271 -190 -239 -61 142 106 57 177
2369A77NL2R7j81J56j43j64j69p9n3Q8J31j71M8K10K7j06k9J24j85j7p1K27j24
$$ 177 182 214 311 130 286 143 -21 -190 -269 -322 -234 -103 -274 -226 -16 11 -95 -124 0 -185 -202 -273 -46 -170
2393a70o4J37K10K1J90PL9j71J04l73J13l3L8Jq1K61K49l24O8j47k20l8qj8K94
$$ -170 -234 -97 113 134 324 331 370 199 303 -70 43 10 48 49 -32 229 478 154 222 75 -145 -183 -191 -209 85
2418H5j67J11j44j53M69l65K28k25j5L28j03k33M07j08j30J83m8L2L3l57K80o3
$$ 85 -82 29 -115 -268 201 -164 64 -161 -176 152 49 -184 223 115 -15 168 120 152 185 -172 108 45
2440D5n2n5k11Q9R7J36k92l04L83j97Q6K63r6j47K23Ll96L32J69l74L38j3K51
$$ 45 -7 -62 -273 -184 -87 49 -243 -547 -164 -361 -275 -12 -108 -255 -32 -29 -425 -93 76 -298 40 27 278
2463B78k2L3k78O5J8k7J99J03m30R7J44j16J17k42N8j67J61K3l47K84j76J6J47
$$ 278 256 289 11 76 94 67 266 369 -61 36 180 64 181 -61 -3 -170 -9 14 -333 -49 -225 -209 -62
2486f2r3K10p3J32J55j92j5J89P3k90J41j88K29n9L14l76k14K16r4N1j57k72J14
$$ -62 -155 55 -18 114 269 77 62 251 324 34 175 -13 216 157 471 95 -119 97 3 54 -103 -375 -261
2509b61k17J11J70o1J04R2l2r7p7K11j96J83j68n6K62l00L72J93k08K18j20q3
$$ -261 -478 -367 -197 -258 -154 -62 -94 -191 -268 -57 -253 -70 -238 -294 -32 -332 40 233 25 243 123 40
2531D0jjL5l6K8j94K41k83m9J49k62M13k35K52l5k42K79l10J05J39J59mL3j43
$$ 40 39 38 73 37 65 -129 112 -171 -220 -71 -333 80 -155 97 62 -180 99 -211 -106 33 192 188 221 78
2555G8K04K18l35p7K43k44k4K09k41K3j51J76n6M9j04Nk37J41j44QJ19m9m4K78
$$ 78 282 500 165 88 331 87 63 272 31 54 -97 79 23 72 -32 -27 -264 -123 -267 -259 -140 -189 -233 45
2579D5j99J31K6K8J54l59L77O0q6n1j80K29j39K9J42m51J51L73m76P9Mj0OR7l
$$ 45 -154 -23 3 31 185 -174 203 263 177 126 -54 175 36 65 207 -244 -93 280 -196 -117 -113 -123 -117 -20 -23
2604b3J20j72J31P3j81n6K60nj6lj00L03k90L04j66j46L82l59P6R9k03l8j40J01
$$ -23 97 -75 56 129 -52 -108 152 147 131 128 28 331 41 345 179 33 415 56 132 231 28 -10 -150 -49
2628d9q1J97l20K89j21J45l56j05L27j8J49Rl19K21L6n9J9N0M6j8J82l14J17j28
$$ -49 -130 67 -253 36 -85 60 -296 -401 -74 -92 57 66 -253 -32 4 -55 -36 14 60 42 224 -90 27 -101
2652a01k6K90k66J66J5j05P3J57j61n5j03L0n3O0M9j49J91l34P7L19k11M30k13
$$ -101 -127 163 -103 63 78 -27 46 203 42 -13 -116 -86 -139 -79 -30 -179 12 -322 -245 74 -137 293 80
2675H0k89L53K5j59K1J91lj56kj27J57j9R8m1J45j68k66p0J68j50J12K56r0M0
$$ 80 -209 144 169 10 31 222 219 63 61 -66 91 72 170 129 274 106 -160 -230 -62 -212 -100 156 66 106
2699A06Koj84O1O4k42J81R9p7J5J26KP4k0P2l82J80J39j76P1M3l61N13r3m24K10
$$ 106 108 102 -82 -21 43 -199 -18 81 4 19 145 147 221 201 273 -109 71 210 34 105 148 -213 300 207 -217 -7
2725gl5j74Q1M4j88K5J12Lk2OJ33k8k03L63J95%l75k1j12K35j05k2R1J70j19k78
$$ -7 -42 -216 -135 -91 -279 -254 -142 -139 -161 -155 -22 -50 -253 110 305 305 -70 -91 -203 32 -73 -95 -4 166 47 -231
2751b31K24j17r4K77r1j8j40q1K73n6N8P0k08L37J2l57J79L5M7P8O4k83J25J29
$$ -231 -7 -124 -218 59 -32 -50 -190 -271 2 -54 4 74 -134 203 215 -142 37 72 119 197 261 -22 103 232
2775B32p9j51J94k17L2K32j91L30k28j02J80l05J5j38P7j03K8L42l61M48j48j63
$$ 232 153 2 196 -21 11 243 52 382 154 52 232 -73 -58 -196 -119 -222 -194 148 -213 235 87 -76
2797g6j50L00J43lj91J33k19K29k00J08M03l33Jj18J2j3P1k34K05j65J59j52k83
$$ -76 -226 74 217 214 23 156 -63 166 -34 74 477 144 145 27 39 26 97 -137 68 -97 62 -90 -373
2820c73l0J06N3Nj38N15j4l15K58j03J0K40j99N9R4j51K6J51J8k29J39M9j19L00
$$ -373 -403 -297 -244 -239 -377 138 124 -191 67 -36 -26 214 15 74 168 17 43 194 212 -17 122 171 52 352
2844C52m22K94k41M8J2k34J54q0N1J03j55j11OK56l9j25M1L23j72j42Q0L5j51
$$ 352 -70 224 -17 31 43 -191 -37 -117 -66 37 -118 -229 -223 33 -6 -131 -90 233 61 -81 -1 34 -117
2867a17J27J93j63J88l41J96Qk23J39J64k83N8Q1k11j89L41K78k98n7Q6j83Q4
$$ -117 10 203 40 228 -113 83 91 -132 7 171 -112 -54 27 -184 -373 -32 246 -52 -109 -23 -206 -122
2889a22L74l15j6J52n8K58j44P9j18K00M0j98J11n0o5L15k88M7k84J15O9Pj11
$$ -122 252 -63 -79 73 15 273 129 208 90 290 330 132 243 193 128 443 155 202 -82 33 102 109 -2
2912bO7rk38J5j11M5J1J86p2q2Q5j20m2N8M69k33JP5k23J73L5k71K59R5j31K00
$$ -2 65 56 -182 -167 -278 -233 -222 -36 -108 -190 -105 -225 -267 -209 260 27 28 103 -120 53 88 -183 76 171 40 240
2938B40m7l02n2J70j01M9o6J64J21l58R1N5j76J85K30n4k0K23k18J21k20K12j14
$$ 240 193 -109 -161 9 -92 -43 -109 55 176 -182 -91 -36 -212 -27 203 149 129 352 134 255 35 247 133
2961A33J81k22m4o9K05j14J00K37n34J64O1K1q1j02pp3J23K19j5m68L11k79K00
$$ 133 314 92 48 -21 184 70 170 407 -127 37 98 119 38 -64 -71 -144 -21 198 183 -285 26 -253 -53
2984e3j01K19k65Q6K72p0L3p4M6k97P1Lr5J12MO0J5l4Q4m1K94j41o5N3k85j71
$$ -53 -154 65 -200 -114 158 88 121 47 93 -204 -133 -130 -225 -113 -109 -49 -34 -68 16 -25 269 128 63 116 -169 -340
3010c40K2RJ42J72J12j92J92l42J55K71k99J74j57J97j31O2m7o4J54J14k79K21
$$ -340 -318 -309 -167 5 117 -75 117 -225 -70 201 -98 76 -81 116 -15 47 0 -64 90 204 -75 146
3032A46K6K8j54k41Q4jl7K5o8kJ84j36j4kL02o24L86J68j75mR5j43L00n8P5L2
$$ 146 172 200 46 -195 -111 -112 -149 -124 -192 -194 -10 -146 -160 -162 140 -484 -98 70 -105 -109 -14 -157 143 85 160 192
3058A92N2M0j35k83L53k12Pq0J20n9q6k08l3O1K61q1q1P4n4j08J14K03N6K30j44
$$ 192 244 284 149 -134 219 7 14 -66 54 -5 -91 -299 -332 -271 -10 -91 -172 -98 -152 -260 -146 57 113 343 199
3083A99or6J26o6j78J23n8K28k24k70K3J15r0P8Lq4K6NL4o9j65M03m5o1O5p0K41
$$ 199 193 97 223 157 -21 102 44 272 48 -222 -199 -84 -174 -96 -93 -177 -151 -146 -112 -181 -346 57 12 -49 16 -54 187
3110A87j42j3K0K65j40j67J01l66L96m37J14J05J40M6p0L29m37J50j53j55N9o2
$$ 187 45 32 52 317 177 10 111 -255 141 -296 -182 -77 63 109 39 368 -69 81 -72 -227 -168 -230
3132b30M47j59K3J5o1J22Kj90j6K54k06L40l31L5j21N7Q2Q1k7k1N7j68J36k10
$$ -230 217 58 81 96 35 157 159 -31 -47 207 1 341 10 45 -76 -19 63 144 117 96 153 -15 121 -89
3156h9J63j68L07k29m6J31j35R7o4mj18Jj16J82n5J25nQ3r4M4K68n9k41J55q6
$$ -89 74 -94 213 -16 -62 69 -66 31 -33 -37 -155 -154 -270 -88 -143 -18 -23 60 -34 10 278 219 -22 133 47
3181D7j48L59k68M4j84J86P0j23K4l17L05J89n41j36O46n4j03N5q6j10K00R0N1
$$ 47 -101 258 -10 34 -150 36 106 -17 7 -310 -5 184 -357 -493 153 99 -4 51 -35 -145 55 145 196
3204A96j52j21R6n2J14O3p1R8J5l09O4R6j5J69m65j03L38J34j68m9J46L4k2j68
$$ 196 44 -77 19 -33 81 144 73 171 186 -123 -59 37 22 191 -274 -377 -39 95 -73 -122 24 58 36 -132
3228a32J1q6K85k9L2k24R6J63j22K9j59K43O1Q6l7k11J55pk63J47j90K03l5m9
$$ -132 -121 -207 78 49 81 -143 -47 116 -6 23 -136 107 168 254 217 6 161 154 -109 38 -152 51 16 -33
3252c3P5l0k49K04P0l13M18m04K34j94M67k57o3j38M46m9J86l10R1K90j02k37
$$ -33 42 12 -237 -33 37 -276 142 -262 -28 -222 245 -12 -75 -213 233 184 370 60 151 441 339 102
3274A02j46j14K30jj92K92j36m0l94M77k71M8j44J80j49P3J32J23j06J00n3q7
$$ 102 -44 -158 72 71 -121 171 35 -5 -399 78 -193 -145 -289 -109 -258 -185 -53 70 -36 64 11 -76
3296g6J06O2r2JK93j65k9q2J08p5J60J31j97m9q9J28k57O2jJ08J75k96j29K52
$$ -76 30 92 0 1 294 129 100 18 126 51 211 342 145 96 7 135 -122 -60 -61 47 222 -74 -203 49
3320D9J28k04r5Q4k6P3n4J3N3N1J1k33J59L14j86J07l70J00oNj32K10j3k08j50
$$ 49 177 -27 -122 -38 -64 9 -45 -32 21 72 83 -150 9 323 137 244 -126 -26 -32 -27 -159 51 38 -170 -320
3345c20J80K20l37L2K56j08j86J10J61p8j27L7L3J5MN6K73j61l8J28q6Q8j54l6
$$ -320 -140 80 -257 -225 31 -77 -263 -153 8 -70 -197 -160 -127 -112 -108 -52 221 60 22 150 64 152 -2 -38
3369c8J73J8j26j68J83j00k94L04O0J44j75r0J08n1J65j25j03O8R0J89j84k00
$$ -38 135 153 27 -141 42 -58 -352 -48 12 156 -19 -109 -1 -52 113 -12 -115 -47 43 232 48 -152
3391a52L56L0K70m95J27L2j95k7K13k08K9lj04K23o5J3k59J0q5J83j97K43J32
$$ -152 204 234 504 9 136 168 -27 -54 159 -49 -20 -23 -127 96 31 44 -215 -205 -290 -107 -304 -61 71
3414G1m70K50j03M51l74K16RO7j09r1K11k10J8K91j88J46%j35j63J27p4j17K28
$$ 71 -399 -149 -252 199 -175 41 50 117 8 -83 128 -82 -64 227 39 185 185 50 -113 14 -60 -177 51
3437E1k8J02j75P8j49K48j67N3j57K30J3J38p2q9j97N5J72k41J70l8J90J66k76
$$ 51 23 125 -50 28 -121 127 -40 13 -144 86 99 237 165 76 -121 -66 106 -135 35 -3 187 353 77
3460G7j29r4J40l6m0j25N01l31q7o1j9J29k27J11K24K08m10n3L3K39k51L6P3J42
$$ 77 -52 -146 -6 -42 -82 -207 294 -37 -124 -185 -204 -75 -302 -191 33 241 -169 -222 -189 50 -201 -165 -92 50
3484E0J80j31J93k10k43O2J9K25j55j17P3m2J02o2K01J1j58L02k00j62k87M56
$$ 50 230 99 292 82 -161 -99 -80 145 -10 -127 -54 -96 6 -56 145 156 -2 300 100 -62 -349 107
3506A07j89K46m66K87J4J17kj60l5J71p8P6k0R6k33N04m41o3J33o3M3J04j30J
$$ 107 -82 164 -302 -15 -1 116 114 -46 -81 90 12 88 68 164 -69 435 -6 -69 64 1 44 148 18 19
3530A9k4Q5R4m3m04L69j31j39J83k62L20j10M8o9O3k4K9N1M9q5j02j2L4O60m30
$$ 19 -5 80 174 131 -273 96 -35 -174 9 -253 67 -43 5 -64 -1 -25 4 55 104 19 -83 -95 -61 599 169
3555A69P2k78r4L71k12j14K10j40p7L56n45L05k2P6O2j70L23l66L4J52k20K32
$$ 169 241 -37 -131 240 28 -86 124 -16 -93 263 -282 23 1 77 139 -31 292 -74 -40 112 -108 124
3577A24q2l54L87j60K02p8J0K4r4J06p3M5J2oQ4q2j41K34l59L8J16l5K6P8j4k38
$$ 124 42 -312 75 -85 117 39 49 73 -21 85 12 57 69 63 147 65 -76 158 -201 -163 -47 -82 -56 22 8 -230
3603b30L03j88J81j14J35Q0k33K54k67J59M5j10J23j31q3pR0P9j05o3m0Q9j82
$$ -230 73 -115 66 -48 87 167 -66 188 -79 80 125 15 138 7 -76 -83 7 86 -19 -82 -122 -33 -215
3626b15J25K24j6j06M7k6n6k36L50P0k14k44L34J2Q8k4k79M04l00K04l50l7L91
$$ -215 -90 134 118 12 59 33 -23 -259 91 161 -53 -297 37 49 137 113 -166 238 -62 142 -208 -245 146
3649A46j19J3m5j92j05K65j33K89j46j80j9m9L17j12Q6J04J11q7j5k18J17J15
$$ 146 27 40 -5 -197 -302 -37 -170 119 -27 -207 -226 -275 42 -70 16 120 231 144 129 -89 28 143
3671A43k21J22j1M0oJ30k33K18j48j13J71M9j26j19J29LP7j02j18k64K06K71l5
$$ 143 -78 44 33 73 67 197 -36 182 34 -79 92 141 15 -104 25 28 105 3 -115 -379 -173 98 63
3694F3J95k83j09KQ1r5J03K60j30j33K83lm28K37j40Q9j09J92j81J04Q8R5j87
$$ 63 258 -25 -134 -132 -51 -146 -43 217 87 -46 237 234 -194 43 -97 -8 -117 75 -106 -2 86 181 -6
3717fM3R2k14O7n6J99j02M7J27j92q1p8J58l9l1K73j86N7Q9k45rK55J32l96J41
$$ -6 37 129 -85 -18 -74 125 23 70 197 5 -76 -154 4 -35 -66 207 21 78 167 -78 -87 168 300 -96 45
3742D5K4m8J62Ok09o8J06r8j49m0L06J14o8l86L32r5J2r2M2J47P6j83jK41k65
$$ 45 69 21 183 189 -20 -88 18 -80 -229 -269 37 151 83 -303 29 -66 -54 -146 -104 43 119 -64 -65 176 -89
3767h9R4K61k48J38J0j91J42k61K6m9K29K1p3J80l04K6j65%K61j10P1k79M03n2
$$ -89 5 266 18 156 166 -25 117 -144 -118 -167 62 83 10 190 -114 -88 -253 -253 8 -102 -31 -310 93 41
3791D1j8n0K40n1o2j69J64N7j77J14P0j75L3J72l46P3R7R2j0oo3p4J32k02p4K31
$$ 41 23 -27 213 162 100 -69 95 152 -25 89 159 -16 17 189 -157 -84 13 105 95 89 26 -48 84 -118 -192 39
3817C9q2krJ05k03j32L00l1K25j57J4J73l20J28K31n9m5l74J44K15j07Lo6J02
$$ 39 -43 -45 -54 51 -152 -284 16 -15 210 53 67 240 -80 48 279 220 175 -199 -55 160 53 56 -10 92
3841I2N3ojj73j67J79J61k31p8K51j0j8j09K01m57L07J1k46K34K86l07j86P7K58
$$ 92 145 139 138 -35 -202 -23 138 -93 -171 80 70 52 -57 144 -313 -6 5 -241 -7 279 -28 -214 -137 121
3865A21n8j3K86k36k13J08J02J37j68j82R4j48J07r9m1K94j96MJ80j77J02k36
$$ 121 63 50 336 100 -113 -5 97 234 66 -116 -22 -170 -63 -162 -203 91 -105 -101 79 -98 4 -232
3887b32J79J65k70J23J81r0m0j0N8l9K03l42P4J82L0j87n9n1J30j30o3J55q5n4
$$ -232 -53 112 -158 -35 146 56 16 6 64 25 228 -114 -40 142 172 -15 -74 -125 5 -125 -188 -33 -118 -172
3911a72M0J52k80J40L26l21O5J5J19o4K67k25L0J82l30L10k18p2J18N5R4l22K1
$$ -172 -132 20 -260 -120 206 -115 -50 -35 84 20 287 62 92 274 -56 254 36 -36 82 137 231 -91 -70
3934g0mL30m40J90k20l3K45J42j4l67Q8P3M3j52M54k02L06m30J68J21k03o0J31
$$ -70 -74 256 -184 6 -214 -247 -2 140 126 -241 -153 -80 -37 -189 265 63 369 -61 107 228 25 -35 96
3957I6%L9k74Q5k6J12k81L50l68K58n1J96q4J3k42j7K61j64J59j71J89Q9l5k04
$$ 96 96 135 -139 -54 -80 32 -249 101 -267 -9 -60 136 52 65 -177 -194 67 -97 62 -109 80 169 134 -70
3981g0L37l01p7J33j5j15nL60r7oj20j9Q4j92K83l32J44j35J16l8J30M3k43nJ58
$$ -70 267 -34 -111 22 7 -108 -113 247 150 144 24 5 89 -103 180 -152 -8 -143 -27 -65 65 108 -135 -140 18
4006A8m38L33K5J44J6j42q7J04J20J9J67L9j79rr1j16n3K93k70m9J67J77l10K68
$$ 18 -420 -87 -62 82 98 -44 -131 -27 93 112 279 318 139 130 39 -77 -130 163 -107 -156 11 188 -122 146
4030A46q8j17k5J87p0P7N4k27k8J22R7m2l4P7J7p2L1p2J79k62J55k27K81k77J11
$$ 146 58 -59 -84 103 33 110 164 -63 -91 31 128 86 52 129 146 74 105 33 212 -50 105 -122 159 -118 -7
4055gJ9k5J54k87J88j19R4O5k79P1K98M4r0k04lO7j11J21L2q2K15k84L80k14r1
$$ -7 12 -13 141 -146 42 -77 17 82 -197 -126 172 216 126 -78 -81 -14 -125 -4 28 -54 161 -123 257 43 -48
4080d8J14j19J20m1p8j50L3KL11k37j35J46L5m9n4K59j55o4J8J47j92j27J20N9
$$ -48 66 -53 67 26 -52 -202 -169 -167 144 -93 -228 -82 -47 -96 -150 109 -46 -110 -92 55 -137 -264 -144 -85
4104h5L05j71r4K52m97L63r3J05J48j2l28J92N4k67JJ84Q6k68MK13q8k72K9J51
$$ -85 220 49 -45 207 -290 73 -20 85 233 221 -107 85 139 -128 -127 57 143 -125 -121 92 4 -268 -239 -88
4128h8L1K95k63P4J92k66K97k27J4J4K9P3K84l22j88j15L33j84J33L1k12J90p5
$$ -88 -57 238 -25 49 241 -25 272 45 59 73 102 175 459 137 -51 -166 167 -17 116 147 -65 125 50
4151E0L4K3j51J57k28o8O6K20k50m1K36J5R5j08j63L07j3k01K37q4l0j64oK02
$$ 50 84 107 -44 113 -115 -183 -117 103 -147 -188 48 63 158 50 -113 194 181 -20 217 133 103 -61 -67 135
4175A35j29j73J63R0mj75J77j25M3n6K15l42L98j3k90P9J3j11J62j88K59k66L28
$$ 135 6 -167 -4 86 82 -93 84 -41 2 -54 161 -181 217 204 -86 -7 6 -105 57 -131 128 -138 190
4198A90r3k69K91j33J02k13J57o5k0J69O6j77j64O8L37l15Q7K9l40J41J31K26
$$ 190 97 -172 119 -14 88 -125 32 -33 -53 116 182 5 -159 -91 246 -69 18 47 -293 -152 -21 205
4220B05n6l00J22r6L0J31j29Qj14K44M2nn8J96j55j10J38J19k8n5l48J90L88n28
$$ 205 149 -151 -29 -125 -95 36 -93 -85 -199 45 87 82 24 220 65 -45 93 212 184 129 -219 -29 359 -169
4244a69J96k52J55R4j15j2R6j02n7J99j81L38k44j33L33l07L71k68LM7m7M6O6
$$ -169 27 -225 -70 24 -91 -103 -7 -109 -166 33 -148 190 -54 -187 146 -161 210 -58 -55 -8 -55 -9 57
4267E7O4l15K23J72j19l8j11KP3K05k95K40j1l19J73pj34J08j88J44M8K1J17R5
$$ 57 121 -194 29 201 82 44 -67 -65 8 213 -82 158 147 -172 1 -6 -140 -32 -220 -76 -28 -7 110 205
4291B05k74l0J02J62o4J7j59p3J37p5r6J99j66KK54l81J10K57o2l21J40K69j70
$$ 205 -69 -99 3 165 101 118 -41 -114 23 -52 -148 51 -115 -113 141 -240 -130 127 65 -256 -116 153 -17
4314a7q6J8k9j3J84Q3l6k7j35R7O1j45J12K3L1q1KK4O5k31Q6o8n2J25j58J20M1
$$ -17 -103 -85 -114 -127 57 140 104 77 -58 39 100 -45 67 90 121 40 42 66 131 -100 -14 -82 -134 -9 -167 -47 -6
4341fj55m8K89j31L1k02K57j46J15k16K43P6J48j98J02m6Oq3R2j50J45k55K31
$$ -6 -161 -209 80 -51 -20 -222 35 -111 4 -212 31 107 255 57 159 113 119 36 128 -22 123 -132 99
4364I9M2j50j5N2K90k19P1j88P7j76N0K5R9K39k91K1m5L03k63O3k03K94k17M5
$$ 99 141 -9 -24 28 318 99 170 -18 59 -117 -67 -42 57 296 5 26 -19 284 21 84 -119 175 -42 3
4388CJ55j20J03n8L8l36J97k8l1j19L76j30j59K42j81R2j67J01J79l02L5L92j34
$$ 3 158 38 141 83 121 -215 -18 -46 -77 -196 180 50 -109 133 -48 44 -123 -22 157 -145 -110 282 148
4411A48q7j62l3O5L06k59Q6L4r4o6K36O4k35P9J40k17m7P0M6Q6m6n3j77K71j81
$$ 148 61 -101 -134 -69 237 -22 64 98 4 -62 174 238 3 82 222 5 -42 28 74 160 114 61 -116 155 -26
4436b6j43M4K04l3k52K26L1J09o7q6j48K23k27L26J12l26K22k03L4K31k98J59
$$ -26 -169 -125 79 46 -206 20 51 160 93 7 -141 82 -145 181 293 -33 189 -14 20 251 -47 112
4458A12J60j72j61k07N11j04o5j08N4k49j86O11k65M8n0J63l6k42K32J70j9l9
$$ 112 272 100 -61 -268 243 139 74 -34 20 -229 -415 196 -69 -21 -71 92 56 -186 46 216 197 158
4480A58n5k29K0K11r1L85l58q8l6J52k21J93n1o0L3L2j21OK37k57l1L94j94n1
$$ 158 103 -126 -106 105 14 399 41 -47 -83 69 -152 41 -10 -70 -37 -5 -126 -120 117 -140 -171 223 29 -22
4504b2njo1K0j16M56l06Q4j62k1K57r6J5m9M8p5j7M4L6L7J5j8j02j88O9K7J52
$$ -22 -27 -28 -89 -69 -185 271 -35 49 -113 -134 123 27 42 -7 41 -34 -51 -7 29 66 81 63 -39 -227 -158 -131 21
4531B1r6Q9m1K01l05K95k47K07j17j54J88j75j26M95j08k1j86K4K09q7J28k50
$$ 21 -75 14 -27 174 -131 164 -83 124 7 -147 41 -134 -260 235 127 106 -80 -56 153 66 194 -56
4553e6Q2n1P3j04n7j6p6J46J12j97j59N14j39j09q6K46L8q8j85K6M3J70p2Q4j20
$$ -56 26 -25 48 -56 -113 -129 -205 -59 53 -144 -303 211 72 -37 -123 123 161 73 -112 -86 -43 127 55 139 19
4578A9N8n3o2J2q4J86k05K44k03R8Kj26j4n9RJ04K05o1j28J79p6l1L04m46K69
$$ 19 77 24 -38 -26 -110 76 -129 115 -88 10 12 -114 -128 -187 -178 -74 131 70 -58 121 45 14 318 -128 141
4603A41l0k43J20j82P6J03j34J84J22l5qk17K34j61P8j39k5K61j55J07M6l29R6
$$ 141 111 -132 -12 -194 -118 -15 -149 35 157 122 114 -103 131 -30 48 -91 -116 145 -10 97 143 -186 -90
4626i0L16n25p4L67k52M20j83j57j39K52j02J76K3N1k60L27Q9j49p8j26kL20k32
$$ -90 226 -299 -373 -6 -258 162 -21 -178 -317 -65 -167 9 32 83 -177 150 239 90 12 -114 -116 204 -28
4649b8l6j96p5M57j95K42k62J6j02J92Q4m8lJ35q9J4k58P9J39j23M3J04R7j0j29
$$ -28 -64 -260 -335 122 -73 169 -93 -77 -179 13 97 49 46 181 92 106 -152 -73 66 -57 -14 90 187 177 48
4674D8L8N2J08j82j84K12p2j88M5L0k6L81m29J29J09K4N4k39M47l36k89K52k3
$$ 48 86 138 246 64 -120 92 20 -168 -123 -93 -119 262 -167 -38 71 95 149 -90 357 21 -268 -16 -39
4697c9K10J9l36K09J1K0j78J39J5m61O35k56j08K19l68J71P5P4k33J27J66k19
$$ -39 171 190 -146 63 74 94 -84 55 70 -391 244 -12 -120 99 -269 -98 -23 51 -182 -55 111 -108
4719a08J41j42J62j29J88l42K16j8J19Q8j82J41j41J32o3l8j8k8k6L8k1M7j47
$$ -108 33 -109 53 -76 112 -230 -14 -32 87 175 -7 134 -7 125 62 24 6 -22 -48 -10 -31 16 -131
4742a31J57j98J02O9M2Pq0j60lK21J07k83R0K5M9j32L1j88K00n1j02J36P2k9P9
$$ -131 26 -172 -70 -1 41 48 -32 -192 -195 26 133 -150 -60 -35 14 -118 -87 -275 -75 -126 -228 -92 -20 -49 30
4767C0J32j3q8k81L85L8k18P4J08p4O9j86j7M7r4%O3J3J13O3p4L1k9k63J25J95
$$ 30 162 149 61 -220 165 203 -15 59 167 93 162 -24 -41 6 -88 -88 -25 -12 101 164 90 121 92 -171 -46 149
4793A49o2j62L28j46Q4j26k88J62L58m18oJ99j87J0J54L8M1m3j40JQ0l2j4J49
$$ 149 87 -75 253 107 191 65 -223 -61 297 -121 -127 72 -115 -105 49 87 128 85 -55 -54 26 -6 -20 129
4817A29j66K96j37L4q9k33p5K72M6n0j88L09r7j21J01J38k65J14Q6j16J50l55
$$ 129 -37 259 122 156 67 -166 -241 31 77 27 -161 148 51 -70 31 169 -96 18 104 -12 138 -217
4839b17K00j7J20j00p9o5n1M70k41k40J27M14k54J28k42k0P5K89l31j3J12K6j08
$$ -217 -17 -34 86 -14 -93 -158 -209 261 20 -220 -93 321 67 195 -47 -67 8 297 -34 -47 65 91 -17
4862a7kN0J30j57L7p4L43k72j22J28l3k29J0J77o1J04j9L35l16jk3K47r4j98J29
$$ -17 -19 31 161 4 41 -33 310 38 -84 44 11 -218 -208 -31 -92 12 -7 328 12 11 -12 235 141 -57 72
4887G2k33K87j45j11L30k76K01j8l57J16J73j72R0l7J12j97jK96j39J22q6Jj60
$$ 72 -161 126 -19 -130 200 -76 125 107 -250 -134 39 -133 -43 -80 32 -165 -166 130 -9 113 27 28 -132
4910a32J96m5o3J35J69l09K37k85K40R7k20q3J68j88P7j19j13L94j52K90j41m55
$$ -132 64 19 -44 91 260 -49 188 -97 143 240 20 -63 105 -83 -6 -125 -238 156 4 294 153 -302
4932c02J87J0K49p2l57L96k14J60q4p0L2j74K65P0J97m71N2R0K05nk2k49k03J79
$$ -302 -115 -105 144 72 -285 111 -103 57 -27 -97 -65 -239 26 96 293 -178 -126 -36 169 164 142 -107 -310 -131
4956a31Q0o1J51k36N4nJ82PJ45o6l04J67J35l01O6l7O0K4m9J34k38J2K71j45J
$$ -131 -51 -112 39 -197 -143 -148 34 41 186 120 -184 -17 118 -183 -117 -154 -94 -70 -119 15 -223 -211 60 -85 -84
4981h4M9K81j27np0r9L2j49O6PK47j07m3K24m47K05K21k21N1j83n3J07%K49j35
$$ -84 -35 246 119 114 44 -55 -23 -172 -106 -99 148 41 -2 222 -225 -20 201 -20 31 -152 -205 -98 -98 151 16
5006A6J1J39j26N5k2p0J9l3k2J64k07j8N2k6M1lk01R2J4J67M2o8J24j11j42K25
$$ 16 27 166 40 95 73 3 22 -11 -33 131 -76 -94 -42 -68 -27 -30 -231 -139 -125 42 84 16 140 29 -113 112
5032A12k55Pj7J30r7K17K38l55Nn3mj38K95JR4j82k9K01j83j14Q7m8j03R3J05
$$ 112 -143 -136 -153 -23 -120 97 335 -20 -15 -68 -72 -210 85 86 180 -2 -31 170 -13 -127 -40 -88 -191 -98 7
5057Gk7K1qj17j1j84K76j56M33j65l52L86k90L32k78J58o7q9Nk27L75K06r4j23
$$ 7 -20 1 -7 -124 -135 -319 -43 -199 234 69 -283 103 -187 145 -133 25 -42 -131 -126 -353 22 228 134 11
5081A1Nj56O9K9p0J71k42L71q9r%j07M2k84J41O4J70j01k25M50l57K38j72j40
$$ 11 16 -140 -71 -42 -112 59 -183 188 99 90 90 -17 25 -259 -118 -54 116 15 -210 240 -117 121 -51 -191
5105a91K43J6N0k67K2M37k44J93j54j59P3M9J43l71O9K7L7J06J34k07Jq6J69p2
$$ -191 52 68 118 -149 -127 310 66 259 105 -54 19 68 211 -160 -91 -64 -27 79 213 6 7 -79 90 18
5129A8J43l02J48l2R2J43J66m70P0K55l73l7K70l7n2O5j38j12q0J75j3L36k40
$$ 18 161 -141 7 -25 67 210 376 -94 -24 231 -142 -179 91 54 2 67 -71 -183 -263 -88 -101 235 -5
5152ej63L74j85K28k48J76q4r2j48K76j09q6n4J66j2P5L4k61O4N1l1J48p3k05
$$ -5 -168 206 21 249 1 177 93 1 -147 129 20 -66 -120 46 34 109 143 -118 -54 -3 -34 114 41 -164
5176a64k08L54l0P8O1l73L20j80J20Q2Ok5m4J76j79K53l80P7k17L17K15p5j48
$$ -164 -372 -18 -48 30 91 -282 38 -142 -22 60 66 41 -3 173 -6 247 -133 -56 -273 44 259 184 36
5199C6n8Pr6J50N2J06l97R0J00P3o4j56Q8J38k05J08m1K0R7l30J81J17N6j21P9
$$ 36 -22 -15 -111 39 91 197 -200 -110 -10 63 -1 -157 -69 69 -136 -28 -69 -49 48 -282 -101 16 72 -49 30
5224C0J31j63jj7J93j53J27J54l33n3J66q2p2P0RP3J1k20J25lj55R2k8L1j2J15
$$ 30 161 -2 -3 -20 173 20 147 301 -32 -85 81 -1 -73 -3 6 79 90 -130 -5 -8 -163 -71 -99 -68 -80 35
5250C5O9p1m5L05j46Q6j68M5P0l56J54j17J04K39j50p5J54M6k47J69j40P9j72
$$ 35 104 33 -12 293 147 233 65 110 180 -176 -22 -139 -35 204 54 -21 133 179 -68 101 -39 40 -132
5273a32J03r4K4P6M2L7n9J09o1k1J91M0j63k88K20K67m19O6K8R1N8p7m4p9J23
$$ -132 -29 -123 -99 -23 19 56 -3 106 45 24 215 255 92 -196 24 291 -128 -62 -34 57 115 38 -6 -85 38
5298C8j06j7J69m6j4k8M4k17l6K77l8k1K55p7j60q6r8K43J39k93J22k62M41j63
$$ 38 -68 -85 84 38 24 -4 40 -177 -213 64 26 5 260 183 23 -63 -161 82 221 -72 50 -212 229 66
5322F6o6l0P3N4p8j08N6k28J05L09k01L0Oq6J40k6M6O2j70K14m10K83k02L31j39
$$ 66 0 -30 43 97 19 -89 -33 -261 -156 153 -48 -18 -12 -98 42 16 62 124 -46 168 -242 41 -161 170 31
5347C1N9P9j20k56J16l6L51l28K44k06j47J57P5K0OK3q1n0L62m88J35J41r4P6
$$ 31 90 169 49 -207 -91 -127 224 -104 140 -66 -213 -56 19 39 45 68 -13 -63 299 -189 -54 87 -7 69
5371F9j0K6j27J08K7j79J86M5j06j77MJ28L6R5j85j13K16n3k27J44J82J0j75o8
$$ 69 59 85 -42 66 93 -86 100 145 39 -138 -134 -6 30 125 -60 -173 43 -10 -237 -93 89 99 -76 -144
5395a44P5q8J50m5k2Q2L12l61L04j76k57O4Q2M4j67K27r4J46m6k6K8o2L9q4J60
$$ -144 -69 -157 -7 -52 -74 8 320 -41 263 87 -170 -106 -24 20 -147 80 -14 132 86 60 88 26 65 -19 141
5420A41j11p7j05L54k74M06n84K67r5j06O6m2R0J18p7N8J63k41m3k2K82p0j05
$$ 141 30 -47 -152 202 -72 334 -250 17 -78 -184 -118 -160 -70 48 -29 29 192 -49 -92 -114 168 98 -7
5443gK0K91m03l4k9J15J25l03J47PJ19K13k76J83j47Q2k8k27p4K00j75M10k53
$$ -7 13 304 -99 -133 -162 -47 78 -225 -78 -71 48 261 -15 168 21 103 75 -152 -226 -26 -201 209 -44
5466d4J02j7m3j94J80l8LJ85m72M38J79l68K03l4j07N7J23k11M1r1l1J15q6O0
$$ -44 58 41 -2 -196 -16 -54 -51 134 -338 100 279 -89 114 80 -27 30 153 -58 -17 -108 -139 -24 -110 -50
5490e0M4mR1N7m1r1l46K74O3r7J1K69j25m2K06J5Jp4j51K27k63J46q7O6O0k73
$$ -50 -6 -10 81 138 97 6 -340 -66 -3 -100 -89 180 55 13 219 234 235 161 10 237 -26 120 33 99 159 -114
5516a14O5M0J83m3O1nk3j72k22J29L29k91J42j22J36N1j74R0j20Rp9J45J05k8
$$ -114 -49 -9 174 131 192 187 164 -8 -230 -101 228 -63 79 -43 93 144 -30 60 -60 -51 -130 15 120 92
5540I2j73K55j26k51J56j06K00mj76K53j57J08k46Q1L69j76n0k4j69j12M97m32
$$ 92 -81 174 48 -203 -47 -153 47 43 -133 120 -37 71 -175 -94 275 99 49 25 -144 -256 241 -191
5562a91J53P4O4J16l70J40rK5Rj84L46n8j88kK9n2K06k09J50k95J53J8K27k20
$$ -191 -38 36 100 216 -154 -14 -23 2 11 -173 173 115 -73 -75 -46 -98 108 -101 49 -246 -93 -75 152 -68
5586f8P8r8O9J67j70j5r3J62j93K28k81J87J57Kj23K3N6j21J10k78L26j39Q1N7
$$ -68 10 -88 -19 148 -22 -37 -130 32 -161 67 -214 -27 130 132 9 32 88 -33 77 -201 125 -14 67 124
5610A24k32L4J56m2j34J04n3r4NK33p5J7k34P4K17k81m5L67J2k90J26r3J24k29
$$ 124 -108 -74 82 40 -94 10 -43 -137 -132 101 26 43 -191 -117 100 -181 -226 141 153 -137 -11 -104 20 -209
5634b09L77j55L4P9J04l51m5L00m41J90J78r3J64J05k35q9N3j66K54M8j15l4J47
$$ -209 168 13 47 126 230 -121 -166 134 -307 -117 61 -32 132 237 2 -87 -34 -200 54 102 -13 -47 100
5657A00j66J17n7k25K02J01l16K60j57J5J2j38J83J21j71J66j64L28j66q4J43
$$ 100 -66 51 -6 -231 -29 72 -244 16 -141 -126 -114 -252 -69 52 -119 47 -117 211 45 -39 104
5678A04j14J06j36L04k43P2m1N8O5j55J8j06j0K15r8k85N05j86k64J63M6J29k9
$$ 104 -10 96 -40 264 21 93 52 110 175 20 38 -68 -78 137 39 -246 259 73 -191 -28 18 147 118
5701A18m12J46J83J9K5J47l0k06mk42K89j7qm8j35K21k81K97Ok07J95k53n2R0
$$ 118 -294 -148 35 54 79 226 196 -10 -14 -256 33 16 8 -40 -175 46 -235 62 68 -139 56 -197 -249 -159
5725a59L57k14O4L1j28r1J90p5q2n4K21j41J9k1J57l84N42r5j93R3j70J86O1k09
$$ -159 198 -16 48 79 -49 -140 50 -25 -107 -161 60 -81 -62 -83 74 -310 232 137 -56 37 -133 53 114 -95
5749i5K41p2J1r4J04j31N9J26k21P6n2L4J14K9R5j47J39k55m2p3K28Mn2m11L71
$$ -95 146 74 85 -9 95 -36 23 149 -72 4 -48 -14 100 129 224 77 216 -39 -81 -154 74 78 26 -385 -14
5774a4j61K86l14k46N96k74M6J2J43n4J9j04J82pp2k6R1j88J11j38K57j6q2j93
$$ -14 -175 111 -203 -449 147 -127 -81 -69 74 20 39 -65 117 110 38 12 103 -85 26 -112 145 129 47 -146
5798a46K03l7ML88n32N8M5M5k6J56k76J28j71K66j78Q8J23j89L56k85O2k83L63
$$ -146 57 20 24 412 -120 -62 -17 28 2 158 -118 10 -161 105 -73 15 138 -51 305 20 82 -201 162
5821A62p5o8oj58K25K08n20L01k17R4j30L41N9m26J77J47j43P7k07J45j32J64
$$ 162 87 19 13 -145 80 288 -232 69 -148 -54 -184 157 216 -210 -33 114 -29 48 -159 -14 -146 18
5843A8L29l79K57l53J34q5J32n5N2l6q4m8K48k50K37O7j33m5q8J93j1k03K8p8
$$ 18 347 -32 225 -128 6 -79 53 -2 50 14 -70 -118 130 -120 117 184 51 6 -82 111 100 -103 -75 -153
5867a53Pj8J57l9K44o31L74k42L49R5j77l1n8J30l4J50n4Q2j66N4J18k69L88j86
$$ -153 -146 -164 -7 -46 198 -433 -59 -301 48 143 -34 -65 -123 7 -27 123 69 151 -15 39 157 -112 276 90
5891I0j46kQ7j73K72K17m08MJ72p0l32N74k50k71K88N5j51J48p0O8j14J8J65k02
$$ 90 -56 -58 29 -144 128 345 -63 -59 113 43 -289 285 35 -236 52 107 -44 104 34 102 -12 6 171 -31
5915c1K25k43K55l46m6J20J27n7K9J27l57J62j18K42j14j63K54J67k46l1J3L0
$$ -31 194 -49 206 -140 -186 -66 61 4 33 160 -197 -35 -153 89 -25 -188 66 233 -13 -44 -31 -1
5937aM8j32K42j08j24L03j57%j42K55k39J83K7o1J01j96N3k0Lj25K17j30K48n42
$$ -1 47 -85 157 49 -75 228 71 71 -71 184 -55 128 155 94 195 -1 52 32 35 -90 127 -3 245 -297
5961b97L31o0l75K83Q9l2J13r8N5q4k5J83r0l3J05o7k36L33j57p7J25K0J3l0N6
$$ -297 34 -26 -401 -118 -29 -61 52 -46 9 -75 -100 83 -7 -40 65 -2 -238 95 -62 -139 -14 6 19 -11 45
5986D5j27J82j92M0M9j66j9L37n02M64j56K50j90k57K83k29J58j19K54r8O9j04
$$ 45 -82 100 -92 -52 -3 -169 -188 149 -353 111 -45 205 15 -242 41 -188 -30 -149 105 7 76 -28
6008b8m9L4j44J17J90j90L14m95M14j58r0L41l58J28k81J49P2J27l5j10K7k22
$$ -28 -77 -43 -187 -70 120 -70 244 -251 163 5 -85 256 -102 26 -255 -106 -34 93 58 -52 -25 -247
6030b47K24j36J41j18p6Q1K86j21M8Lk32J13K36m01K20l9r6j52J59J11k18J64
$$ -247 -23 -159 -18 -136 -212 -131 155 34 82 85 -147 -34 202 -199 21 -18 -114 -266 -107 4 -214 -50
6052e0JJK22k07K51p7j04j94P0J0J38O7k28J10k13K76kj13P9L38m63J39m0K23
$$ -50 -49 -48 174 -33 218 141 37 -157 -87 -77 61 128 -100 10 -203 73 71 -42 37 375 -88 51 11 234
6076B34j03lp3k04K66K0k42K10k38kK87r7k92J25K2L89k46j31K6P0j30J05L4L7
$$ 234 131 128 55 -149 117 137 -105 105 -133 -135 152 55 -237 -112 -90 299 53 -78 -52 18 -112 -7 27 64
6100F4j02K7n0j37J44rJ21j13k41M25j67o2K08k67j47L09k9j53L00j8j53O3R4
$$ 64 -38 -11 -61 -198 -54 -63 58 -55 -296 129 -38 -100 108 -159 -306 3 -26 -179 121 103 -50 13 107
6123A07%k42J07O8k5RJ95k97K83j27L9j29J05P7k34J99L1k11k9Q1MM0j04J39q8
$$ 107 107 -135 -28 40 15 24 219 -78 205 78 117 -12 93 170 -64 135 166 -45 -74 7 11 51 -53 86 -2
6148bJ10k69K09l22K76R8j64Q0L3N7r7n2K7j63K96J76k94J76j1k60K44J24n4l32
$$ -2 108 -161 48 -274 2 100 -64 16 49 106 9 -43 -16 -179 117 293 -1 175 164 -96 148 272 218 -114
6172a14J06Qn4K33r6r2K03m80L65J2j48K08l34J66N6k81J94L5j4K80l88L30k81
$$ -114 -8 0 -54 179 83 -9 194 -286 79 91 -57 151 -183 -17 39 -242 -48 -13 -27 253 -135 195 -86
6195h6j38k2K51p7k5N8K41J04l99J70j19k4J7j2J78k0k49j73L54J28j78J36Q4
$$ -86 -224 -246 5 -72 -97 -39 202 306 -93 77 -42 -66 -49 -61 117 97 -152 -325 29 157 -21 115 199
6218A99j82o2J67m18L89j94K20K2N6m02j9K05N0J89r1q0k05J6K68k07O2K04k62
$$ 199 17 -45 122 -296 93 -101 119 141 197 -205 -224 -19 31 220 129 49 -156 -140 128 -79 -17 187 -75
6241g5P3Q2r1J10o5j78K12N9j18k92M55l66R8J20J21k86K86Ll23J79J17l9j84
$$ -75 -2 80 -11 99 34 -144 68 127 9 -283 172 -194 -96 24 145 -141 145 148 -175 4 121 82 -102
6264a02J07j79o8o0M9L73k76K43j3Nj32p2K25j33J45j5m2j03l6R2m8K16l27J05
$$ -102 5 -174 -242 -302 -253 120 -156 87 74 79 -53 -125 100 -33 112 97 55 -48 -84 8 -40 176 -151 -46
6288d6j18J33J06P6j51O9j10J1M1J73l14Q4Ln7J02j2o5lJ01p6K37k64J39Ok52
$$ -46 -164 -31 75 151 0 69 -41 -30 11 184 -130 -46 -43 -100 2 -10 -75 -78 23 -53 184 -80 59 65 -187
6313a87J81j18K49k62J78q7R7j10o9K38j01j27J86Q2l40Q8K48k52R3j01J18j88
$$ -187 -6 -124 125 -137 41 -46 51 -59 -128 110 9 -118 68 150 -190 -102 146 -106 -13 -114 4 -184
6335a84J49l6mn5K16J45k21m7j50q1K97N9j03K52k12N6M0j8k53N8K50n3k34J39
$$ -184 -35 -71 -75 -130 86 231 10 -37 -187 -268 29 88 -15 237 25 81 121 103 -150 -92 158 105 -129 10
6359A0j18J24K10k02l35J25K14l5j59r5K45j10o1M15K7j89q3j2l8n7O4j20J79
$$ 10 -108 16 226 24 -311 -186 28 -7 -166 -261 -16 -126 -187 228 255 66 -17 -29 -67 -124 -60 -180 -1
6382aj1N8M1j55Q8j40K04N1n1k64L89k73J73Kj53J04j67L14q9n8k20J10j54K58
$$ -1 -12 46 87 -68 20 -120 84 135 84 -180 209 -64 109 111 -42 62 -105 209 120 62 -158 -48 -202 56
6406E6M9mO2k7l07K93k25J86qj57J11J11l06J04J62k92P6J67R9k32l5J24m4K66
$$ 56 105 101 163 136 -171 122 -103 83 75 -82 29 140 -166 -62 100 -192 -116 51 150 -82 -117 7 -37 229
6430B29l41J82k3l2k06K09J01j85K04Pr3j0M8J0j71J52J65j89k4k22J57Q4k3J64
$$ 229 -112 70 47 15 -191 18 119 -66 138 145 52 42 90 100 -71 81 246 57 33 -189 -32 52 29 193
6454A93j3l64J86N1q9j5l8j0K16j66L20l01J12o9K8Qj47L89j57q7k16K33qj44
$$ 193 180 -184 2 53 -36 -51 -89 -99 117 -49 271 -30 82 13 41 49 -98 291 134 47 -169 64 56 -88
6478h8L65n45L49j48m3O6L41k70q5OP3j23Q4K36l23n5J64Ln9j64K07l8m9J39k7
$$ -88 277 -268 81 -67 -110 -44 297 27 -58 -52 21 -102 -18 218 -105 -160 4 7 -52 -216 -9 -47 -96 43 16
6503A6K6j32J6J11O7J59m00L07k20J1l1k3kJ04J51j02r3O2j31p9L65r4q4L46j21
$$ 16 42 -90 -74 37 104 263 -137 170 -50 -39 -70 -93 -95 9 160 58 -35 27 -104 -183 182 88 4 350 229
6528B29j69j75J71j02R7l4j7j98K94J4j52K4k33M09j80J49l89K72q9J90k56R4
$$ 229 60 -115 56 -46 51 17 0 -198 96 110 -42 -18 -251 158 -22 127 -262 10 -79 111 -145 -51
6550e1p4P2p7K84j87Q4j03J14Pk52P7j16J0K20N0PJ27m17L47M3q8J73l8k60j8
$$ -51 -125 -53 -130 154 -33 51 -52 62 69 -183 -106 -222 -212 8 58 65 192 -225 122 165 77 250 212 -48 -66
6575f6L2q7J56j46L04j97j18m4J88K7p6L6K3J14pj2r2L3q7j24J25K16Nj67jR0
$$ -66 -34 -121 35 -111 193 -4 -122 -166 22 49 -27 9 32 146 139 127 35 68 -19 -143 -18 198 203 36 35 125
6601A25J5o0j07Oj24M8j22L48j55k57L09j86Q9J57m25K56J7Q1J81j03k03J88k82
$$ 125 140 80 -27 -21 -145 -97 -219 129 -26 -283 26 -160 -71 86 -339 -83 -66 15 196 93 -110 78 -204
6624b04L23m36J25K81J49j07k03o5L84k34k19J72j79L32l07J78K3J10m3Rj96O7
$$ -204 119 -317 -192 89 238 131 -72 -137 247 13 -206 -34 -213 119 -188 -10 13 123 80 89 -107 -40
6646d0Mj31L42r4mj07J31k14J04n8K9K03k18k4L15j75k11J85N8j46Loj8K26J72
$$ -40 -36 -167 175 81 77 -30 101 -113 -9 -67 -38 165 -53 -77 238 63 -148 37 95 -51 -48 -54 -72 154 326
6671C26l93M4j58L02j40R8j36J25L1k36K92k53J70p5M5L0j42q6J21J99K53n45
$$ 326 -67 -23 -181 121 -19 79 -57 68 99 -137 155 -98 72 -3 42 72 -70 -156 -35 164 417 -128
6693a28K33pj51r7L5J37J6J45k97J96j29n6j04P3J27q4L91k91n2J54L5j81p6O8
$$ -128 105 98 -53 -150 -115 22 38 183 -114 82 -47 -103 -207 -134 -7 -91 300 9 -43 111 146 -35 -111 -43
6717d3r4L61j92j99K05R4k49K36j78j80M26j72p2qJ11k3j22J89o3j61K99P3r2
$$ -43 -137 224 32 -167 38 132 -117 119 -59 -239 187 15 -57 -65 46 23 -99 90 27 -134 165 238 146
6740A46p2j01R4j4P8k43J49j35n9J27J12L2j53P0j2j11L1jJ47K5j48j25J32J5
$$ 146 74 -27 67 53 131 -112 37 -98 -157 -30 82 114 -39 31 19 -92 -61 -62 85 110 -38 -163 -31 -16
6764a6r5J95r8k78K33K34j50p0P5l5k4m4J55j68J2J6K5k4J63l7j95J53j20J00
$$ -16 -111 84 -14 -292 -59 175 25 -45 30 -5 -29 -73 82 -86 -74 -58 -33 -57 106 69 -126 27 -93 7
6788Gk0J97j47N6pr6n6NJ94J2k19Q3M1k05K09P6N9m78M60q3J13k53J68j18K0J05
$$ 7 -13 184 37 93 86 -10 -66 -61 133 145 -74 9 50 -155 54 130 189 -289 171 88 201 -52 116 -2 18 123
6814A23l63K88J15j17K40k11k33R4O6R6j42J01k68J87K15m23K83O0k75J6K57l48
$$ 123 -240 48 163 46 286 75 -158 -64 2 98 -44 57 -211 -24 191 -232 51 111 -164 -148 109 -239
6836b39L74k48J35Q8o1j09J65R2l19MR9m5J18o6J25j37J91Q2l89K43j53R7l4J04
$$ -239 135 -113 22 110 49 -60 105 197 -122 -118 -19 -64 54 -12 113 -24 167 249 -140 103 -50 47 13 117
6860A17l73K30J83j12j64K54j11J41j56l6J35q2k15L2L21l79K34M1L6q5n8J49
$$ 117 -256 -26 157 45 -119 135 24 165 9 -27 108 26 -189 -157 164 -215 19 60 96 11 -47 102
6882A02k72K53r4j03k0k5L76m14K96L6p0k09J28J53o7l7k85J92l4J58J95j22L8
$$ 102 -170 83 -11 -114 -134 -159 217 -197 99 135 65 -144 -16 137 70 33 -252 -60 -94 64 259 137 175
6905A75j37L1j93J22K07l98M33l20j47M50j23J5L2j3k52J51j21OJ96l9J5j13K83
$$ 175 38 69 -124 -2 205 -193 240 -80 -227 223 100 115 147 134 -118 33 -88 -82 114 75 90 -23 260
6928B60k66j73Q7L3J1r2J92K7K2k14J46k00m5K46j21Km8K04JK9j73j68K64l3j22
$$ 260 -6 -179 -92 -59 -48 -140 52 79 101 -113 33 -167 -212 34 -87 -85 -133 71 72 101 -72 -240 24 -9 -131
6953a31L53j48J15k76K10j27q7J00o7R2J89k73P6Q2ql45K79j04j38Q1m8K15M3
$$ -131 222 74 189 -87 123 -4 -91 9 -58 34 223 -50 26 108 100 -245 34 -70 -208 -127 -175 40 83
6976H3J99j69L3J10l76L8L3j07J24j64J29p6J42K1Kk73K89p9Q8J0j2j2l3p9k5
$$ 83 282 113 146 256 -120 -82 -49 -156 -32 -196 -67 -143 -1 20 22 -251 38 -41 47 57 45 33 0 -79 -104
7001a04N9J18J66k77P2r1M9P2k09L12mk07K01j61j40R1j16L30l95M54l04L29k73
$$ -104 -45 73 239 -38 34 -57 -8 64 -145 167 163 -44 157 -4 -144 -53 -169 161 -234 220 -84 245 -28
7024b8J66k11L5J0o9P8j55L4L12k90O2M9j28L92k74j58K86k8J00k16J72k0Q3J06
$$ -28 138 -73 -38 -28 -97 -19 -174 -140 172 -118 -56 -7 -135 257 -17 -175 111 83 183 -33 139 119 202 308
7048C08m80K8J02M4j14K28R9m44M97q1j64j50J72M9P0l20J35J08l0l86K90L5q2
$$ 308 -172 -144 -42 2 -112 116 215 -229 268 187 23 -127 45 94 164 -156 -21 87 57 -329 -39 -4 -86
7071h6j29M6L57j72K6j19R2o4p0J44p7J31l8J4k02K73j05J96k76P4K10l01O9k5
$$ -86 -215 -169 188 16 42 -77 15 -49 -119 25 -52 79 41 55 -147 126 21 217 -59 15 225 -76 -7 -32
7095c2k4J84j35L19j35l7L8l21j21K87N9Q3p6R1j40M5r0k08K34ML5R6j3l05j16
$$ -32 -56 128 -7 312 177 140 178 -143 -264 23 82 165 89 180 40 85 -5 -213 21 25 60 156 143 -162 -278
7120b78Q3K34k15N37l29j26J32Q6l92L04J69j54q7j12K40k8J66j90J53o1j67J9
$$ -278 -195 39 -176 361 32 -94 38 124 -268 36 205 51 -36 -148 92 64 230 40 193 132 -35 -16
7142a6L10k40q4n0O3J21K9q8j71K56p8J14j53k2J27j45J42q1L4Pp0q0l91M59J3
$$ -16 294 54 -30 -80 -17 104 133 45 -126 130 52 166 13 -9 118 -27 115 34 68 75 5 -75 -466 -7 6
7167Fq1j7K22o5P7k04M3j21P1r7L01j53k68K15L1J62j99J44j28M5K97l70J52j72
$$ 6 -75 -92 130 65 142 -62 -19 -140 -69 -166 135 -18 -286 -71 -40 122 -77 67 -61 -16 281 -89 63 -109
7191a09o0N7J04J69k32N0R3r1j36K05k26J33k67K29j83L76R3j78J20n27M42n5
$$ -109 -169 -112 -8 161 -71 -21 72 -19 -155 50 -176 -43 -310 -81 -264 112 205 27 147 -380 62 7
7213GP6J24l56L77l4l8k61L87l41K50j12m3j30l4L75K6l38K07j12k59K16r7K14
$$ 7 83 207 -149 228 194 156 -105 282 -59 191 79 36 -94 -128 247 273 -65 142 30 -229 -13 -110 104
7236A04r8j26K20j37k6K22j20k12J96J8j31J48r0J19m0N1l82L20qqJ09k61K35
$$ 104 6 -120 100 -37 -63 159 39 -173 23 41 -90 58 -32 87 47 98 -284 36 28 20 129 -132 103
7259A03o6k6K02O7l02O0O1l70K45J08j77K1Km5L56k89J87p6k48L23j55K23k05
$$ 103 37 11 213 280 -22 38 99 -271 -26 82 -95 -74 -72 -117 239 -50 137 61 -187 136 -19 204 -1
7282aQ0j00p2J63q0J94R3j29r5j3O9m2K2l9n2M1K99k86l5R2j8q8N9j56J61J59
$$ -1 79 -21 -93 70 -10 184 277 148 53 40 109 67 89 50 -2 39 338 52 17 109 91 3 62 -94 67 226
7308B26P9j30j15l2J18j19Qn6O7j45J9J27J75k24q9j01L56p7q8J28k36J12J45
$$ 226 305 175 60 28 146 27 35 -21 46 -99 -80 47 222 -2 -91 -192 164 87 -1 127 -109 3 148
7331A48l3n9J01p0j14J62p7M0L8j87K6n2J84l1j13K20k95K67j11jo9j53rK67j89
$$ 148 115 56 157 87 -27 135 58 98 136 -51 -25 -77 107 76 -37 183 -112 155 44 43 -26 -179 -188 79 -110
7356a10P8J28k83J05o0J80p9%j38K40q2J06m57L54j7JQ6J6j2J07j14lo4J92j37
$$ -110 -32 96 -187 -82 -142 38 -41 -41 -179 61 -21 85 -372 -18 -35 -34 52 68 56 163 49 46 -18 174 37
7381C7P7O9m3m18L75K32l98J19j62J95j71L9n2J33m1PK13j04j41J10j12K22j85
$$ 37 114 183 140 -278 97 329 -69 50 -112 83 -88 -49 -101 32 -9 -2 211 107 -34 76 -36 186 1
7404AN7j90R7M5j17J30k08M2L10k44l9ML18k20K0m6j16K59j80L16m67J98J73q7
$$ 1 58 -132 -35 10 -107 23 -185 -143 167 -77 -116 -112 206 -14 6 -40 -156 103 -77 239 -228 -30 143 56
7428E6j61K15l60K68j04J81k25K02lJ5J70k74J5k2j07K40k8rL0j54J0J30L6J24
$$ 56 -105 110 -250 18 -86 95 -130 72 69 84 254 -20 -5 -27 -134 106 78 69 99 -55 -45 85 121 245
7452B45q3k00J5o8k96K50K53j89R3K32k82k9j06K08j42m2L09j94j08K63j18K03
$$ 245 162 -38 -23 -91 -387 -137 116 -73 20 252 -30 -59 -165 43 -99 -141 168 -26 -134 129 11 214
7474B14K30o01R6j57J75N2j27K98k16R4j38J50pl47L09o8j6J82J8r0k51J74m0
$$ 214 444 -157 -61 -218 -43 9 -118 180 -36 58 -80 70 63 -284 25 -43 -59 123 141 51 -200 -26 -66
7497f6K06j74M9J10kJ23j85j57J17j03J63j75L28o7q1J60k44j16J57N5j75J60
$$ -66 140 -34 15 125 123 246 61 -96 21 -82 81 -94 234 167 86 246 2 -114 43 98 -77 83
7519H3j29J26p4P2l9M0j13k2J84j00J24o3q7Q5j99OO0J8j76R8K45j22r6J90J57
$$ 83 -46 80 6 78 39 79 -34 -56 128 28 152 89 2 87 -112 -106 -46 -28 -204 -106 139 17 -79 111 268
7544B68l88L3R7QQ4j62L39l96K2J65N7O7n16N49j18j57J06M5O2k83K10j66L27
$$ 268 -120 -87 10 18 102 -60 279 -117 -95 70 127 194 -322 227 109 -48 58 103 165 -118 92 -74 253
7567B53j07j90J78k72lk32N84j61J03J52m34K36k86N14j98J40l07j55J42P3j99
$$ 253 146 -44 134 -138 -141 -373 211 50 153 305 -129 107 -179 335 137 277 -30 -185 -43 30 -169
7588a69J42n9r6J88l5j91K02j49J33R1j10K60m30J00J29o4m6K33L3k3q2l9j61
$$ -169 -27 -86 -182 6 -29 -220 -18 -167 -34 57 -53 207 -223 -123 6 -58 -104 129 162 139 57 18 -143
7611a43L95l94L50k34mpJ45P8n0l8q5J70o7k86J39L77m60L03L5N0j46j75k30K46
$$ -143 252 -142 208 -26 -30 -37 108 186 136 98 13 183 116 -170 -31 346 -114 189 224 274 128 -47 -277 -31
7635c1K20j26o7%Q8l0l23L64m5j94J49p1J81K8j45k6N0n1M1J07N5j19j19l4O1
$$ -31 189 63 -4 -4 84 54 -269 95 50 -144 5 -66 115 143 -2 -28 22 -29 12 119 174 55 -64 -98 -37
7660c7o0j33P9J97J68n3k92K14k09K21l9j90L71j9k84J75l5k55K02j06M8j3J92
$$ -37 -97 -230 -151 46 214 161 -131 83 -126 95 56 -134 237 218 -66 109 74 -181 21 -85 -37 -50 142
7683A42k23J92q9J47j71j52J90j48K54j12m04M78k14J52j07j08L76k78J09P5r2
$$ 142 -81 111 22 169 -2 -154 36 -112 142 30 -374 104 -110 42 -65 -173 203 -75 34 109 17
7704A7j9j97K8K06j48J75j01J08jL1j68R5l5q3L07j02k84J32K88l04J88p0Q6j11
$$ 17 -2 -199 -171 35 -113 62 -39 69 68 99 -69 26 -9 -92 215 113 -171 -39 249 -55 133 63 149 38
7728C8j50J61Q2N9l22L3L79k19j96J86J39j79N0j37J62J55o1l95J71L98k51r1
$$ 38 -112 49 131 190 -132 -99 280 61 -135 51 190 11 61 -76 86 241 180 -215 -44 354 103 12
7750A2O9qj88l6J56o1P6R8k0j31Qj90K26K33m78j3J88J05lr6n4J18j05j5r8K76
$$ 12 81 73 -115 -151 5 -56 20 118 98 -33 -25 -215 11 244 -234 -247 -59 46 43 -53 -107 11 -94 -109 -207 69
7776F9l11J52K90j80k29J54K95j56k61K42k27j12J75n5O9K0N6J45k99J36m1L3
$$ 69 -242 -90 200 20 -209 -55 240 84 -177 65 -162 -274 -99 -154 -85 -65 -9 136 -163 -27 -68 -35
7798c5L17m11L53%k52J45o2p1o0J7r1L21k95K12o3j27M1N0j14K0M1K64J4k98O1
$$ -35 282 -129 224 224 -28 117 55 -16 -76 -59 -150 171 -124 88 25 -102 -61 -11 -125 -105 -64 200 214 -84 -23
7823b3K20l9j13j15P1K6k23L39j22J3j69L21k64J0J65q5j25J84L1L4j2k07k7J79
$$ -23 197 158 45 -70 1 27 -196 143 21 34 -135 186 -78 -68 97 12 -113 71 102 136 124 -83 -110 69
7847F9k77R2J21l8J1j74K53J9j66K43q6p5o5K31l5q2Qk22K81j06k59L69q1j1J
$$ 69 -208 -116 5 -33 -22 -196 57 76 -90 153 67 -8 -73 158 123 41 49 -173 108 2 -257 112 31 20 21
7872B1J11k88M3K05p6K58m20J04r1m6n7N1L3J19Jm9N0J2l9J63r7J47j14j24J39
$$ 21 132 -156 -113 92 16 274 -146 -42 -133 -179 -236 -185 -152 -33 -32 -81 -31 -19 -58 105 8 155 41 -83 56
7897E6j83J17J60j86n9J48J3k68k4J64J52j52Q8M3jo9j42K11q6J19j84j71K54
$$ 56 -127 -10 150 -36 -95 53 66 -202 -226 -62 90 -62 26 69 68 -1 -143 68 -18 101 -83 -254 0
7920@K4P8j57Q8L0J16l51M7L7n5K10o7j09j27J81K65m17L87K04l24O7J3j39J01
$$ 0 24 102 -55 33 63 179 -172 -125 -88 -143 67 0 -109 -236 -55 210 -207 180 384 60 127 140 1 102
7944A02LL4k90J9K54j29p8J39R6m6P3K12j97o8k36J67Q8J28m04K61n00K94M3K19
$$ 102 105 139 -151 -132 122 -7 -85 54 150 104 177 389 192 124 -112 55 143 271 -133 128 -372 -78 -35 184
7968A84k18J07j73N9J64P1k24q7J38k13R7K22k00L2J0l6q0J82j73k3J81J41j18
$$ 184 -34 73 -100 -41 123 194 -30 -117 21 -192 -95 127 -73 -41 -31 -67 -147 35 -138 -161 20 161 43
7991D3j67J58M8r1L2m5R0j92N5J30l7R4l1K7j77j67K8L03l0m2j00R6K3j60L88
$$ 43 -124 34 82 -9 23 -22 68 -124 -69 61 24 118 87 114 -63 -230 -202 101 71 29 -71 25 48 -112 276
8016B76k00p2j39K54j4j56Q7jj86oK89k93L00j31j36J77p9l4R5j20j06Q4M28l29
$$ 276 76 4 -135 119 105 -51 36 35 -151 -157 132 -161 139 8 -128 49 -30 -64 31 -89 -195 -111 317 -12
8040a2N7J13k35L9R5K6K08m14O8K0k4K74j85j6P5l6J10j50q1K83k34J10j81R8
$$ -12 45 158 -77 -38 57 83 291 -123 -55 -35 -59 215 30 14 89 53 163 13 -68 215 -19 91 -90 8
8064HJ58k01K26l99L00k65L16k70K91k6j92o2nQ4L3n1k0J06m7k6k33N84m63K01
$$ 8 166 -35 191 -208 92 -173 143 -127 164 138 -54 -116 -121 -37 -4 -55 -75 31 -16 -42 -275 309 -154 47
8088D7J08k18l3K69l22N7L13j74J12k97J99J5m0K31l67J1Q3k04lm7L85J80j77
$$ 47 155 -63 -96 173 -149 -92 221 47 159 -138 61 76 36 267 -100 -89 -6 -210 -213 -260 125 305 128
8111A28k69K04k2R2K27n44N1L33j65r3l72L15l0q6L2M53l21l48P17m68L68j33
$$ 128 -141 63 41 133 360 -184 -133 200 35 -58 -430 -115 -145 -231 -199 254 -67 -415 302 -166 202 69
8133F9o3j45J97p1K93m46J35K4K8m3K19k18P0l8J04l18J83K49l52L37j81r1P1
$$ 69 6 -139 58 -13 280 -166 -31 -7 21 -22 197 -21 49 11 115 -203 -20 229 -123 214 33 -58 13
8156A3O1L8P2k18qJ9K53k28N3J08k35p3J06j79J03K40j1j64J26j27k08K46K85
$$ 13 74 112 184 -34 -42 -23 230 2 55 163 -72 -145 -39 -218 -115 125 114 -50 76 -51 -259 -13 272
8179B72j06j24k53K43m7j0K05j56j90k0K80l39
$$ 272 166 42 -211 32 -15 -25 180 24 -166 -186 94 -245
8191b45
$$ Imaginary data points
##PAGE= N=2
##DATA TABLE= (X++(I..I)), XYDATA
0@%%%%%%%%%%%%%%%%%%%%%pJ5j6J6j6J6j6K2l0L2l3M0m7N0n8O6p3Q1q9J01j13
$$ 0 0 0 0 0 0 0 0 0 0 0 0 0 0 0 0 0 0 0 0 0 0 -7 8 -8 8 -8 8 -8 14 -16 16 -17 23 -24 26 -32 34 -39 42 -47 54 -59
42e9J25j39J54j70J86k04K27k51K75l03L33l68M08m51N00n56O23p00P90r01J040
$$ -59 66 -73 81 -89 97 -107 120 -131 144 -159 174 -194 214 -237 263 -293 330 -370 420 -481 559
63E59j220J465j816K356l322N574k0336n865M5127J4425j1933j7964N656J5613
$$ 559 -661 804 -1012 1344 -1978 3596 -16740 -22605 22522 36947 25014 7050 12706 28319
77B8319J0037m140m627n651q287o571L691j970m724p34m275j2354o586Q337J2233
$$ 28319 38356 34216 29589 23938 15651 9080 12771 10801 6077 5343 1068 -11286 -17872 -9535 2698
92B698p043j5973n69J7597J4896K879P690P774r293j5775n427Q852Q919k127p550
$$ 2698 -4345 -20318 -20887 -3290 11606 14485 22175 29949 20656 4881 -546 8306 17225 15098 7548
107G548r210j1062o580P215J0874k459n705kl010o349m53J0154R126m730o860
$$ 7548 -1662 -12724 -19304 -12089 -1215 -3674 -9379 -9381 -12391 -18740 -19193 -9039 87 -4643 -11503
122a1503P132J3802K486m286J81m691r823n116M759Q235j758q093m816l473k056
$$ -11503 -4371 9431 11917 7631 7812 3121 -6702 -11818 -7059 1176 -582 -8675 -13491 -16964 -19020
137a9020P222J5063O452q102o807N52J024J240O623J1485L443p420l488O117M715
$$ -19020 -11798 3265 9717 1615 -5192 -4640 -3616 -2376 4247 15732 19175 11755 8267 14384 19099
152A9099m040l574j001n797p197M43M103m8p480n272J577J624J800P251O572o455
$$ 19099 15059 11485 10484 4687 -2510 -2067 2036 1988 -5492 -10764 -9187 -7563 -5763 1488 8060 1605
168A605j1720k599M938N323M519N678L935n919q505J612O742J516l266j284k453
$$ 1605 -10115 -12714 -7776 -2453 2066 7744 11679 5760 -2745 -1133 5609 7125 3859 2575 122
183A22o739l359L090M173j606m372J938M044l16P88L770n81q281l935O235Q001
$$ 122 -6617 -9976 -6886 -2713 -4319 -8691 -6753 -2709 -3025 -2237 1533 952 -7329 -11264 -5029 2972
199B972M045P50J019j963p155j405P416N416l155n101k527m993m536K069O494
$$ 2972 7017 7767 8786 6823 -332 -1737 5679 11095 7940 2839 312 -4681 -9217 -7148 -654
214f54L321l835k732K418N38j821J330K994j245m369K448O890L474j215k034j16
$$ -654 2667 -1168 -3900 -1482 -944 -2765 -1435 1559 314 -4055 -1607 5283 8757 7542 5508 5392
230E392k547l196L961N156j710p944m970j280j623J645O203M861k583o613j084
$$ 5392 2845 -351 3610 8766 7056 -888 -5858 -7138 -8761 -7116 -913 3948 1365 -5248 -6332
245f332K472L18O77L756K219l282k469L461L472o6k240j84O37k425p87L347J18
$$ -6332 -3860 -3542 -2865 891 3110 -172 -2641 820 4292 4226 1986 1802 2439 14 -773 2574 2692
262B692n417m944Q21L205J900L717L391j069o549m019L712M152J072J186J161
$$ 2692 -2725 -7669 -6848 -3643 -1743 1974 5365 4296 -2253 -6272 -2560 1592 2664 3850 5011
277E011k489m877l64M316K397j288j555J68j339l365P78K400j337k949N16L872
$$ 5011 2522 -2355 -2719 1597 3994 2706 1151 1319 -20 -3385 -2607 -207 -1544 -4493 -3977 -105
293a05K547M15J092k97l391l481J545N964J246j360j663j935l440j709L627M391
$$ -105 2442 2857 3949 3652 261 -3220 -1675 4289 5535 4175 2512 577 -2863 -4572 -945 3446
309C446n49l049k409q69j996o45L296K944j616j434J537K443k16m87J201j91j357
$$ 3446 2897 -152 -2561 -3430 -5426 -6071 -2775 169 -1447 -2881 -1344 1099 883 396 1597 1406 49
326D9k23L677K598k541k845j133r65l7J747L651K36m484l955j333R52K03K372
$$ 49 -174 3503 6101 3560 715 -418 -1383 -1420 327 3978 4214 -270 -4225 -5558 -4606 -4403 -2031
343b031L732r20l242j110J511J895OJ468J806n93j437K77K374p89k790k79O62
$$ -2031 1701 781 -2461 -3571 -2060 -165 -159 1309 3115 2522 1085 1362 3736 2947 157 -122 540
360E40M29K26R37L93l223m102j06K400J727R03J694K7l812j947J430L926J949
$$ 540 969 1195 2132 2525 -698 -4800 -4906 -2506 -779 124 1818 1845 -1967 -3914 -2484 1442 3391
377C391J36N45r57k565j433J508J834j053j488M52l63p12q71N91k08j968m49K492
$$ 3391 3527 4072 3115 550 -883 625 2459 1406 -82 370 7 -705 -1576 -985 -1193 -3161 -3610 -1118
395a118K536J68q36k78j476j742J448L136K823q45k391j617k278j180J056K240
$$ -1118 1418 1586 750 472 -1004 -2746 -1298 1838 4661 3816 1425 -192 -2470 -3650 -2594 -354
411c54J71k056j068n10l31P09J041K166P02p67R30J620J20j172l24O89j58L89
$$ -354 -183 -2239 -3307 -3817 -4148 -3439 -2398 -232 470 -297 633 2253 2373 1201 877 1566 1408 1797
429A797K053J263j152l363j965k6k0J191J686Q26j869k234p9J676J605K018J655
$$ 1797 3850 5113 3961 598 -1367 -1393 -1413 -222 1464 2290 421 -1813 -1892 -216 1389 3407 5062
446E062O86j890j589q5L11m30j042M90m54j196m98n12q39k054j940O74Q60K79
$$ 5062 5748 3858 2269 2184 2495 2065 1023 1513 1059 -137 -635 -1147 -1986 -4040 -5980 -5306 -4446 -4167
464d167O82J01p07j651R31K652K897J744K26m64j639k011K54J643R50J57m16m25
$$ -4167 -3485 -3384 -4091 -5742 -4811 -2159 738 2482 2708 2244 605 -1406 -1152 491 1441 1598 1182 757
482G57r16j225M80J88o0p77k56P63k03o76J92J58K9Q07K380J827P69o78j696p34
$$ 757 -159 -1384 -904 -716 -776 -1553 -1809 -1046 -1249 -1925 -1733 -1575 -1546 -739 1641 3468 4237 3559 1863 1129
502A129o26M28K492J822j73n81j085o29r9N35Q13J00r77k095j323p05j019j09
$$ 1129 503 931 3423 5245 5072 4491 3406 2777 2678 3213 4026 4126 3149 1054 -269 -974 -1993 -2102
520b102N03K19j7j43N66r20j354j267k64J67R90J321J399l79q24o09N08J075J259
$$ -2102 -1599 -1380 -1397 -1540 -974 -1894 -3248 -4515 -4779 -4612 -3622 -2301 -902 -1281 -2105 -2714 -2206 -1131 128
539A28J080l66j416j555j150Q79J004R77J771L76L3n92n22L54n97j94J52M29L44
$$ 128 1208 842 -574 -2129 -3279 -2400 -1396 -419 1352 1728 1761 1169 647 1001 404 210 362 791 1135
558A135l90O9J16j232j82L32R70P4m46j160j197p00m09J677K737J786J120K82
$$ 1135 745 814 930 -302 -484 -152 818 892 446 -714 -1911 -2611 -3020 -1343 1394 3180 4300 4582
576D582n76o28k20K91N55l37p82q84o59q96n39k11m11o36m18n20r05j438r76o14
$$ 4582 4006 3378 3158 3449 4004 3667 2885 2001 1342 446 -93 -304 -715 -1351 -1769 -2289 -3194 -4632 -5608 -6222
596f222N39J170K005K039J699L5r4m00k82R83N22M20l38q90j172q01j4L90N05
$$ -6222 -5683 -4513 -2508 -469 1230 1265 1171 771 489 1472 1994 2414 2076 1186 14 -787 -801 -411 94
615I4K80m36q53j072p60l40J68M42J296J120J531Q63N96k42q61J7R4n8M28o79
$$ 94 374 -62 -915 -1987 -2747 -3087 -2919 -2477 -1181 -61 1470 2333 2929 2687 1826 1843 1937 1879 2307 1628
635A628p49j191q95J78N30P75P59L1q92j192r58j44L40R17Q15J139J98Q2J82j22
$$ 1628 879 -312 -1207 -1029 -499 276 1035 1066 174 -1018 -1976 -2120 -1780 -863 -48 1091 1289 1371 1553 1431
655A431K30m63l4l40p10l26p39j080o4k01Q65O92Q35L87p91j086q26l86O80Q40
$$ 1431 1661 1198 1164 824 114 -212 -951 -2031 -2095 -2296 -1431 -739 96 483 -308 -1394 -2220 -2606 -1926 -1086
675a086R31R03k10P9j75J16K21J59J96l36n68q17n86l41K85P03O46R62M63J10
$$ -1086 -155 748 538 617 442 558 779 938 1134 798 230 -587 -1173 -1514 -1229 -526 120 1082 1545 1655
695A655m68p65q95M5J46Q98P32J26O03o67k87N7N9K34J93l62j067j051q25m27
$$ 1655 1187 422 -473 -428 -282 616 1348 1474 2077 1410 1123 1180 1239 1473 1666 1304 237 -814 -1639 -2066
715b066K64Q78O12M02M65m18l39q79l07K54J34N11M85M23Nn2nN2O78J68n4k19
$$ -2066 -1802 -924 -312 90 555 137 -202 -1081 -1388 -1134 -1000 -489 -4 419 424 372 367 419 1097 1265 1211 992
737I92j133j102j117j96M39P80N13L73K73k01o78k48L6j45O62L75O14q8J98L63
$$ 992 -141 -1243 -2360 -2556 -2117 -1337 -824 -451 -178 -379 -1057 -1305 -1269 -1414 -752 -377 237 149 347 710
757G10P2P19N94J15K24n31p31q15p84k22L05O53N23K56k30j65r03r1k53J25N04
$$ 710 782 1501 2095 2210 2434 1903 1172 357 -427 -649 -344 309 832 1088 858 693 -210 -301 -554 -429 75
778G5l51K18k86J15Q4J36O49O73L41j86n85n01o08n89K37J50P78K24J07k83o88
$$ 75 -276 -58 -344 -229 -145 -9 640 1313 1654 1468 883 382 -226 -815 -578 -428 350 574 681 398 -290
799b90m42j99k85l3L04K7m38k98J54m77N98Q37Q63L35k97m25m66k52M9J37N85
$$ -290 -732 -931 -1216 -1249 -945 -918 -1356 -1654 -1500 -1977 -1379 -542 321 656 359 -66 -532 -784 -735 -598 -13
820a3L50N45K84m63j05m19k24m1L95K7l92l24J2k89J89Q24O22K98M83k37m62m44
$$ -13 337 882 1166 703 598 179 -45 -86 309 336 -56 -380 -368 -657 -468 356 978 1276 1759 1522 1060 616
842F16m05k19J49O38PJ17j92j41k64n01J09J08L65l6l12n07j77J17J68M37O78
$$ 616 211 -8 141 779 786 903 711 570 306 -195 -86 22 387 351 39 -468 -645 -528 -360 77 755
863G55L14j1m49p50k79m70l98L15J2P8j37l99J4m07Q7O51J84K29p2Q9m01l7M24
$$ 755 1069 1058 609 -141 -420 -890 -1288 -973 -961 -883 -1020 -1419 -1405 -1812 -1725 -1074 -890 -661 -733 -644 -1045 -1082 -658
886f58L88P58N05K11l2p16k20l78n82K68K24M7L09m53P7l75J9Q95J49L67N67m4
$$ -658 -270 488 993 1204 1172 456 236 -142 -724 -456 -232 -185 124 -329 -252 -627 -608 287 436 803 1370 1326
908A326Lj69M8K93J71K2M59J73o31n18n67m40l87rj18J17n46k20j30j86j63M85
$$ 1326 1329 1160 1208 1501 1672 1694 2153 2326 1695 1177 610 170 -217 -226 -344 -227 -773 -993 -1123 -1309 -1472 -987
930i87O34M73k30K51k48k17k29L85N76K47K12k71No34l06k76o1J21Q2RN2n75k36
$$ -987 -353 120 -110 141 -107 -324 -553 -168 408 655 867 596 601 -33 -339 -615 -676 -555 -473 -464 -412 -987 -1223
953a223m5K52L41K50M4n0l31k96rm0N19O2L42M28k32j9k97J12nP46M10K8L28K3
$$ -1223 -1268 -1016 -675 -425 -381 -431 -762 -1058 -1067 -1107 -588 -526 -184 244 12 -7 -304 -192 -197 549 959 987 1315 1338
977A338N8k56q9j57M18K86j45k60m45p17l34j33K37M7j15k98Q7o43j15J36L23
$$ 1338 1396 1140 1051 894 1312 1598 1453 1193 748 31 -303 -436 -199 -152 -267 -565 -478 -1121 -1236 -1100 -777
998g77Q1N23L48L68n41K41j54L48K78L06L36l28L39p02J1l6k25Q1k39n2k44o02
$$ -777 -696 -173 175 543 2 243 89 437 715 1021 1357 1029 1368 666 677 641 416 497 258 206 -38 -640
1020f40l48m53n2J27L58r4M22k66k71k6Q9K36N69J82J53K83k45j62P11l0K96J47
$$ -640 -988 -1441 -1493 -1366 -1008 -1102 -680 -946 -1217 -1243 -1154 -918 -349 -167 -14 269 24 -138 573 543 839 986
1042I86j68P2l97l03j6l31L81l3j7N52m15k80O3n27N5K62J05k25J42P2m96J30
$$ 986 818 890 493 190 174 -157 224 191 174 726 311 31 94 -433 -378 -116 -11 -236 -94 -22 -518 -388
1064c88K91pO69J00P1l80l37j01j14k07O9M40M30O9j80J51k16k73pO3J77j54j08
$$ -388 -97 -104 565 665 736 356 19 -82 -196 -403 -334 106 536 605 425 576 360 87 80 143 320 166 58
1087E8o1l12j22k78N02J26j54Q5l82m30j73o7K49M45K13K08L78n4J54O3j98L16
$$ 58 -3 -315 -437 -715 -213 -87 -241 -156 -538 -968 -1141 -1208 -959 -514 -301 -93 285 231 385 448 250 566
1109E66m0J5J6q4n19O7o7J76J1M75r2j86k21q15J67j05o3N81L13O11m08K02J98
$$ 566 526 541 557 473 -46 21 -46 130 141 616 524 338 117 -698 -531 -636 -699 -118 195 806 398 600 798
1132G98n5O4L42j52m4m72k14k56l31OJ94opj08L5n01l28k0m92L29K90R9O44J54
$$ 798 743 807 1149 997 953 481 267 11 -320 -314 -120 -126 -133 -241 -206 -707 -1035 -1055 -1547 -1218 -928 -829 -185 -31
1156c1P9L7L57k70K33K8O7l84q0k11k4q1M5K20J35P2l41J72n39o4j06n6L85J79
$$ -31 48 85 442 172 405 433 500 116 36 -175 -199 -280 -235 -15 120 192 -149 23 -516 -580 -686 -742 -357 -178
1180a78M05K51r7K42j08L05K65P1l82m56k67O5L9K4L23J92j54L12m41k96m9k0
$$ -178 227 478 381 623 515 820 1085 1156 774 318 51 116 155 179 502 694 540 852 411 115 66 46
1202D6k5j79R7N8P6o4L41n9n7J06lj49k99l73k16j47k8P0N4L11M48k68j74j94
$$ 46 21 -158 -61 -3 73 9 350 291 234 340 337 188 -111 -484 -700 -847 -875 -805 -751 -440 8 -260 -434 -628
1226f28m7P2R6L12n2o7m6K19J47L9K10K20j99j79n0p03p8k76M26J65K74K77J38
$$ -628 -675 -603 -507 -195 -247 -314 -360 -141 6 45 255 475 276 97 47 -656 -734 -1010 -584 -419 -145 132 270
1249B70J50J86k66j16L4M2K24J46L59l69K99j02J76L40J24m31p5n27p27j67K5
$$ 270 420 606 340 224 258 300 524 670 1029 660 959 857 1033 1373 1497 1066 991 464 -263 -430 -405
1270d05k13L44K7j47J11L44n23J21K41l13j64J64K24l19K2%K44K1J28L41J03n76
$$ -405 -618 -274 -247 -394 -283 61 -462 -341 -100 -413 -577 -413 -189 -508 -486 -486 -242 -221 -93 248 351 -225
1292b25j49n71l43J89J28J28K85p8L64j9J12j3j05L55j59J87p9J9J59Q2J1N25
$$ -225 -374 -945 -1288 -1099 -971 -843 -558 -636 -272 -291 -179 -192 -297 58 -101 86 7 26 185 267 278 803
1314H03q5L34j25m0k90m17np2J25L99k22L66j26k9J37k9p1j41N7l13j43p8k67
$$ 803 718 1052 927 887 597 180 175 103 228 627 405 771 645 616 753 724 653 512 569 256 113 35 -232
1337b32K3L19j76J71j82N7j79M8n22j45l6j18J65K86K74Q0k04O6L61k80K9K00
$$ -232 -209 110 -66 105 -77 -20 -199 -151 -673 -818 -854 -972 -807 -521 -247 -167 -371 -305 56 -224 -195 5
1359Em65j93k84k9K66J48J72J96J29rm4j02j09j52K03J82M86p5K93j91L26l9P9
$$ 5 -460 -653 -937 -966 -700 -552 -380 -184 -55 -64 -108 -210 -319 -471 -268 -86 400 325 618 427 753 714 793
1382G93J08k22j14k0l07j94j18pJ22p3J98m7j05l05NM9j27k3K15N55o28L08J97
$$ 793 901 679 565 545 238 44 -74 -81 41 -32 166 119 14 -291 -286 -237 -364 -387 -172 383 -245 63 260
1405B60LM59j56m9M5J65l13j15k39l6k23q4L04K03j55q9k18l50L23m16j11M01
$$ 260 263 722 566 517 562 727 414 299 60 24 -199 -283 21 224 69 -20 -238 -588 -265 -681 -792 -391
1427c91j14j21K03k09N23J64m8K03n7Q9r9l84J65l6K97L12k31K57j67M37n04q0
$$ -391 -505 -626 -423 -632 -109 55 7 210 153 242 143 -241 -76 -112 185 497 266 523 356 793 289 209
1449B09P4J2P2k19k09p3l89L50Q5k53K29J57k00k23j91l29K82J68J33M3j1L10
$$ 209 283 295 367 148 -61 -134 -523 -173 -88 -341 -112 45 -155 -378 -569 -898 -616 -448 -315 -272 -283 27
1471B7Q2J40m1K11Q5J40k5k58J52j80J74J22k90J43j3k24m4l85j36k77o3QM7j32
$$ 27 109 249 208 419 504 644 619 361 513 333 507 629 339 482 469 245 201 -184 -320 -597 -660 -652 -605 -737
1495g37L03Q0K3J21J31r1J80J63o9M11j90j76M06j41K23k50N5r2q2j92q2j07l04
$$ -737 -434 -354 -331 -210 -79 -170 10 173 104 515 325 149 555 414 637 387 442 350 268 76 -6 -113 -417
1518d17J85m9k61J29K8K5J75j90J54p1O9N42n84K26J57J93j95J27J1J7k36K81
$$ -417 -232 -281 -542 -413 -385 -360 -185 -375 -221 -292 -223 319 -265 -39 118 311 116 243 254 271 35 316
1540C16r3K1j98p6j94M09l05L4R5jR7l06L40K81k64j55oJ54k88K06L9k2J5R3M3
$$ 316 223 244 46 -30 -224 185 -120 -86 9 8 105 -201 139 420 156 1 -5 149 -139 67 106 84 99 192 235
1565B35o51J40L2M7J15j68Q7k3M2j94L91m6Q6P7P8J27m92K34k20o4j91K56p4j73
$$ 235 -416 -276 -244 -197 -82 -250 -163 -186 -144 -338 53 7 93 170 248 375 -117 117 -103 -167 -358 -102 -176 -349
1589c49J21j88J18M2j68L64K39q4j5J87q9J34J36m61L40L4K25l26O4J24j2j37
$$ -349 -228 -416 -298 -256 -424 -60 179 95 80 267 178 312 448 -13 327 361 586 260 324 448 436 299
1611B99k67m1K04l15J57j32o6K34k39l5J06M43k80k8J12K8r7l6K55N7l8m5J05
$$ 299 32 -9 195 -120 37 -95 -161 73 -166 -201 -95 348 68 40 152 180 83 47 302 359 321 276 381
1634C81k62o1j22k68J49j96j73J57k74L3j02P8L6j42M00L3o5J97j97J04K5J32
$$ 381 119 58 -64 -332 -183 -379 -552 -395 -669 -636 -738 -660 -624 -766 -366 -333 -398 -201 -398 -294 -269 -137
1656a37K96n5K39j57m4L96k06k9m0j11J78l48L2j01L01MPO9K48m33K9p3L57l36
$$ -137 159 104 343 186 142 538 332 303 263 152 330 -18 14 -87 214 218 225 294 542 109 138 65 422 86
1680H6L5L32q7r9N8n0K23l64q2O7K84j67m04M5J13k09k05K43M4l8K6K80l48k61
$$ 86 121 453 366 267 325 275 498 134 52 119 403 236 -168 -123 -10 -219 -424 -181 -137 -175 -149 131 -217 -478
1704d78J24K74n06j24K67M6K02l28M2N19m50j23K98J68l22k40K39J47K49J06J58
$$ -478 -354 -80 -586 -710 -443 -397 -195 -523 -481 38 -412 -535 -237 -69 -391 -631 -392 -245 4 110 268
1725B68pR2Q5j39M97m17j46Q0M26l79l21j09M07q4N3j62M35k80j71j14N0k5j48
$$ 268 261 353 438 299 796 379 233 313 739 360 39 -70 337 253 306 144 579 299 128 14 64 39 -109
1748a09L74L5q1L3K70J02k98k01J38J0l35j25J55rl91J37pJ37j78k77L93j85m54
$$ -109 265 300 219 252 522 624 326 125 263 273 -62 -187 -32 -41 -432 -295 -302 -165 -343 -620 -227 -412 -866
1771h66J40K42j52j29K94L68K8l54M25n0J50j28lJ26l84J81N0K02m5j6P3M7P5
$$ -866 -726 -484 -636 -765 -471 -103 -75 -429 -4 -54 96 -32 -35 91 -293 -112 -62 140 95 79 152 199 274
1794B74o5j57J41j17l62L83J34q8l8L04K60k73L1J05l56P9k88K02M4l12N1L98
$$ 274 209 52 193 76 -286 97 231 143 105 409 669 396 427 532 176 255 -33 169 213 -99 -48 350
1816C50P0k24r0K51Nl64M5k86K16k20k83M37K31k98J47Q8R0k90r8J16j5l93K3
$$ 350 420 196 106 357 362 -2 43 -243 -27 -247 -530 -93 138 -160 -13 75 165 -125 -223 -107 -122 -515 -492
1839d92L41k28J50J78K29j36K55n36M07k09kn9J46J62l16N29l11J10j10J55m14
$$ -492 -151 -379 -229 -51 178 42 297 -239 168 -41 -43 -102 44 206 -110 419 108 218 108 263 -151
1860a51J55j11P4j06k34J8J57M76m46l5L17Q8k26N1J01J77l40R1N5K09J35j44
$$ -151 4 -107 -33 -139 -373 -355 -198 278 -168 -203 114 202 -24 27 128 305 -35 56 111 320 455 311
1882C11Q9J65l10k07P4j41j54k45J50j93j02K20K24j9k14J97p2J31q2K62l55M19
$$ 311 400 565 255 48 122 -19 -173 -418 -268 -461 -563 -343 -119 -138 -352 -155 -227 -96 -178 84 -271 148
1904A48l16K28r6L15k7J35K64k33j87j97R1k6l58J42K19j30j70Q8L20j39l7R5
$$ 148 -168 60 -36 279 252 387 651 418 231 34 125 99 -259 -117 102 -28 -198 -110 210 71 34 129
1926A29j20J1o98L86K37l13J8M92J57m26K36K96j03j88o8M1J31m8k75M16L21n12
$$ 129 9 20 -678 -292 -55 -368 -350 142 299 -127 109 405 302 114 46 87 218 170 -105 311 632 120
1948A20n6K8M30n53M8l0J04m68J41p4J26j14j4R4j10l9J38O8j00J58j48K99k07
$$ 120 64 92 522 -31 17 -13 91 -377 -236 -310 -184 -298 -312 -218 -328 -367 -229 -161 -261 -103 -251 48 -159
1971a59J20Q9L30m02K57J32J90j34l65j5K82m13o9N8J12J43k83J17M4j62j96J74
$$ -159 -39 50 380 -22 235 367 557 423 58 43 325 -88 -157 -99 13 156 -127 -10 34 -128 -324 -150
1993a50j09J78l29K92J3J12m2J69L61k50J67l74L15j28k36J84k9J02m6M9k7k76
$$ -150 -259 -81 -410 -118 -105 7 -35 134 495 245 412 38 353 225 -11 173 144 246 200 249 222 -54
2015e4J7R3Rj48l00K79L9k99J92J59Q7k94L43MM5j43k85N78k65j85M29k52r9O3
$$ -54 -37 56 65 -83 -383 -104 -65 -364 -172 -13 74 -220 123 127 172 29 -256 322 57 -128 301 49 -50 13
2039A3J36N2j20l22R8J58n2j34l2m7O8k69L26J08k07P6J77p4J48l62K09n4j33
$$ 13 149 201 81 -241 -143 15 -37 -171 -203 -250 -182 -451 -125 -17 -224 -148 29 -45 103 -259 -50 -104 -237
2062b37K47O9OJ11j60J71M4j67j29J87r9p3k04J91K66k45j16M19k32k62m0L09
$$ -237 10 79 85 196 36 207 251 84 -45 142 43 -30 -234 -43 223 -22 -138 281 49 -213 -253 56
2084E6R6l41N6J42J16k03n6L65M6M1K26jn6n28K60l3L91n59K71n2lR7j22%j46
$$ 56 152 -189 -133 9 125 -78 -134 231 277 318 544 543 487 -41 219 186 577 18 289 237 234 331 209 209 63
2109F3k18K0J11k51m0J86K2k2k65P6K12O2l04K12M4o9n6K90k87J90k48L54Q4l78
$$ 63 -155 -135 -24 -275 -315 -129 -107 -129 -394 -318 -106 -44 -348 -136 -92 -161 -217 73 -214 -24 -272 82 166 -212
2133b12K37J72K3k23p1J10n9k40lK52J3l6N9j43R7J61j55K09L9j83O4L24l79J44
$$ -212 25 197 220 -3 -74 36 -23 -263 -266 -14 -1 -37 22 -121 -24 137 -18 191 230 47 111 435 56 200
2157B00M5J17k27j71L57N9j09j62j76M02j43l21J05R6k27m0j7M4L5j50N6j5K82
$$ 200 245 362 135 -36 321 380 271 109 -67 335 192 -129 -24 72 -155 -195 -212 -168 -133 -283 -227 -242 40
2180D0k7j92J92j59r4M4K34j68J03J1l9l52K20qJ72j6j29o0J43K00j06q6K20l44
$$ 40 13 -179 13 -146 -240 -196 38 -130 -27 -16 -55 -407 -187 -195 -23 -39 -168 -228 -85 115 9 -77 143 -201
2204b01r8M10j54p4k22J70R0J0O0J62L4k91J79J61J51n2n1J56j77l1Q5P5q9k20
$$ -201 -299 111 -43 -117 -339 -169 -79 -69 -9 153 187 -104 75 236 387 335 284 440 263 232 317 392 303 83
2228H3J58qj12o1P4k17k1J49k08L2j74J68J47k08O0P4L1j17K16p1K2m6OJ0kl4
$$ 83 241 233 121 60 134 -83 -104 45 -163 -131 -305 -137 10 -198 -138 -64 -33 -150 66 -5 17 -29 -23 -13 -15 -49
2254d9j49L25o6j42J79k24pk51J33k60K34J03k28K03J6J08p9L2j91JK25K09k29
$$ -49 -198 127 61 -81 98 -126 -133 -384 -251 -511 -277 -174 -402 -199 -183 -75 -154 -122 -313 -312 -87 122 -107
2277a07L44o04J12N27k1j58J09j88L70j3j49k69rl1N8p9K42j28K16l31j49M69
$$ -107 237 -367 -255 272 251 93 202 14 384 371 222 -47 -56 -87 -29 -108 134 6 222 -109 -258 211
2299B11k58L74k44k20J35n4J5R6J82p7J33k74K97m45L58j25J05k17L8R2j02k00
$$ 211 -47 327 83 -137 -2 -56 -41 55 237 160 293 19 316 -129 229 104 209 -8 30 122 20 -180
2321a80K02l36K37q0J72p9j25N3j66J97r4K8RrK33r7K1J71k16N5k3P8N6Q9j39
$$ -180 22 -314 -77 -157 15 -64 -189 -136 -302 -105 -199 -171 -162 -171 62 -35 -14 157 -59 -4 -27 51 107 196 57
2346E7K01R3K4j31j27J65N4m20n4J70k42J00J31j31kK1M2j81K1P6O4j81J70m2
$$ 57 258 351 375 244 117 282 336 -84 -138 32 -210 -110 21 -110 -112 -91 -49 -230 -209 -133 -69 -250 -80 -122
2370a22r8K13j21K66k18K35R5n7j10J32l25j39K08J53J42l07j22L41k90j01J35
$$ -122 -220 -7 -128 138 -80 155 250 193 83 215 -110 -249 -41 112 254 -53 -175 166 -124 -225 -90
2391i0J52l92J39n6RO1j90L38j72J21K40O2J1L1j96L8lR8k48K94j24j45K16J69
$$ -90 62 -330 -191 -247 -238 -177 -367 -29 -201 -80 160 222 233 264 68 106 103 201 -47 247 123 -22 194 363
2415C63j27k35K6Lol0J14q7q8j30K64P2k03J09J65j57J85j96n3k93L72L4K69J0
$$ 363 236 1 27 30 24 -6 108 21 -67 -197 67 139 -64 45 210 53 238 42 -11 -304 68 102 371 381
2439C81r2k68M7j1L9J09l08L11j10Nk17R7j30K18k86L2J32j77K39l56K54l06J82
$$ 381 289 21 68 57 96 205 -103 208 98 103 -114 -17 -147 71 -215 -183 -51 -228 11 -345 -91 -397 -215
2462b15J78j83M0K5J58j13R6kq3J13p1q2R4K44Oj23K77j50K68l36Jk12k29l4p8
$$ -215 -37 -220 -180 -155 3 -110 -14 -16 -99 14 -57 -139 -45 199 205 82 359 209 477 141 142 -70 -299 -333 -411
2487d11M71o8J47j48L26j53l98M42P2j54R1p9P1j87J3K01K3J23m0j30Nj19J9O6
$$ -411 60 -8 139 -9 317 164 -234 208 280 126 217 138 209 22 35 236 259 382 342 212 217 98 117 183
2511A83l81K98p7k55K31n29J40M92k97R3qP2j49L3j08j02L5L25p0K3k56L95J70
$$ 183 -198 100 23 -232 -1 -530 -390 102 -195 -102 -110 -38 -187 -154 -262 -364 -329 -4 -74 -51 -307 88 258
2534B58k4j18j75N6m0J74k41L31l23K60k10K82m13J48p0n7J22l07K90J76n3l1
$$ 258 234 116 -59 -3 -43 131 -110 221 -102 158 -52 230 -183 -35 -105 -162 -40 -347 -57 119 66 35
2556C5J62j28J71n1j13Q5p2K23J43j67l19K00m5P1k25K29j25L56l89P8j52j20
$$ 35 197 69 240 189 76 161 89 312 455 288 -31 169 124 195 -30 199 74 430 41 119 -33 -153
2578a53P1k77L77q1k06L89k33J41kr6M8p3N6j37M3R0o5K23J02j90k6n7K9p7n6
$$ -153 -82 -359 18 -63 -269 120 -113 28 26 -70 -22 -95 -39 -176 -133 -43 -108 115 217 27 1 -56 -27 -104 -160
2603a60j36J86J55j36L2P2j26M4R6n5l2m2j11J34O7j74J29j99J19M5L68j71j84
$$ -160 -296 -110 45 -91 -59 13 -113 -69 27 -28 -60 -102 -213 -79 -12 -186 -57 -256 -137 -92 276 105 -79
2626g9J30K50k59m8m4J56l2Q5Q6o3J7L2k34lk7K9j7j65l9O2J46r1J50J53p6O8
$$ -79 51 301 42 -6 -50 106 74 159 245 182 199 231 -3 -6 -33 -4 -21 -186 -225 -163 -17 -108 42 195 119 187
2652A87r7j37j28K59L6l00J85R7J25j03q6J33j59n5r5M2J94l85L09j28k3p4J11
$$ 187 90 -47 -175 84 120 -180 5 102 227 124 38 171 12 -43 -138 -96 98 -287 22 -106 -129 -203 -92
2675i2K29k54p7L8k3o3J82J11j18J92j87M0m3J30m6K8K53j70k09K05j86j32J33
$$ -92 137 -117 -194 -156 -179 -242 -60 51 -67 125 -62 -22 -65 65 19 47 300 130 -79 126 -60 -192 -59
2698e9p8P4l8J14m0k17R0N2K19m02M45o0j25j3J16j64K69j64k06L67J1pl56L84
$$ -59 -137 -63 -101 13 -27 -244 -154 -102 117 -285 160 100 -25 -38 78 -86 183 19 -187 180 191 184 -172 212
2722B12j18N1K74k00p1M7k19L0j23Q2K09k89J12J9j61r1Mn3L66J7l17M21j78m3
$$ 212 94 145 419 219 148 195 -24 6 -117 -35 174 -115 -3 16 -145 -236 -232 -285 81 98 -219 202 24 -19
2746a9k8p6O2o7O2K4l0K05p1q5J36k95K90m67J78K21j97M4L6k14m8N4J38k23J92
$$ -19 -47 -123 -61 -128 -66 -42 -72 133 62 -23 113 -182 108 -359 -181 40 -157 -113 -77 -291 -339 -285 -147 -370 -178
2771a78M12j40m05J82o2J7K56j90L08j81J54K07k29O6J71k59o6Q6Lk32k16L92
$$ -178 234 94 -311 -129 -191 -174 82 -108 200 19 173 380 151 217 388 129 63 149 152 -80 -296 96
2793I6K4l8r4N6K69l39m52J84J61L29o5J3j89J13M1j71N2L07j07j12K23j90P5
$$ 96 120 82 -12 44 313 -26 -478 -294 -133 196 131 144 -45 68 109 -62 -10 297 190 78 301 111 186
2816A86j30j36R4O7q1J25k02j91lk1K5m1L25k49J46P0k62L31J81l2k18K48o6k37
$$ 186 56 -80 14 81 0 125 -77 -268 -271 -292 -267 -308 17 -232 -86 -16 -278 53 234 202 -16 232 166 -71
2840g1J21L36j17r4J41l02J09q4n6J8l37K19L20M4j99p9K11j81l04L69J38l04
$$ -71 50 386 269 175 316 14 123 39 -17 1 -336 -117 203 247 48 -31 180 -1 -305 64 202 -102
2862a02J04K9m9l5j0L41m51J27j61M08m21L46p9j58K28m7L7k38J43Q0k23K73k80
$$ -102 2 31 -18 -53 -63 278 -173 -46 -207 201 -220 126 47 -111 117 70 107 -131 12 92 -131 142 -138
2885a38J72r5k46J67k89L78l26O4R9J20k56L69l74J77M84k04k58J36K15pJ90k41
$$ -138 34 -61 -307 -140 -429 -51 -377 -313 -214 -94 -350 19 -355 -178 306 102 -156 -20 195 188 378 137
2907A37j8K6q4Q6N3k7k6R4q8P4l83O2j6N6Q1o3j32J11J5k96J63R8KkK25l40J81
$$ 137 119 145 61 147 200 173 147 241 153 227 -156 -94 -110 -54 27 -36 -168 -57 -42 -338 -175 -77 -75 -77 148 -192 -11
2934a1l2K04p7k4k33J61J18J4j00k94J16O1j06k6R2j02R6l17M61k33L4L30k99
$$ -11 -43 161 84 60 -173 -12 106 120 20 -274 -158 -97 -203 -229 -137 -239 -143 -460 1 -232 -198 132 -167
2957a67QJ54Q9l65K18j4J76K93m23J96L4k10L12n7LM6k20j14N3k80N49l48K96
$$ -167 -159 -5 84 -281 -63 -77 99 392 -31 165 199 -11 301 244 247 293 73 -41 12 -268 281 -67 229
2980B29l08R5j54J99k41J44K15k25n4n3K80K8k05J54k04K37K1j54J83j40J9j98
$$ 229 -79 16 -138 61 -180 -36 179 -46 -100 -153 127 155 -50 104 -100 137 158 4 187 47 66 -132
3002a32M29k37j18r1L47k7j21j3l32J92N8J18k63K40J48k89N5OJ30o7l43N81j77
$$ -132 297 60 -58 -149 198 171 50 37 -295 -103 -45 73 -190 50 198 -91 -36 -30 100 33 -310 271 94
3025I4k05K81j76j16J58J85j20l17N93O6j55%L8j69j62N4j23L9K11k29N4J64l81
$$ 94 -111 170 -6 -122 36 221 101 -216 377 443 288 288 326 157 -5 49 -74 -35 176 -53 1 165 -216
3048b16L05o6J3n8m2j90M82l98J32k53L74M6k26K52j27k6J51k1R5j00J6O0k38
$$ -216 89 23 36 -22 -64 -254 228 -170 -38 -291 83 129 -97 155 28 2 153 132 227 127 143 203 -35
3071c5N8j2J27k42J08r5r1q7M7q1K11m5P9r2K76q2m7p3J98j37K16m1j56J23j09
$$ -35 23 11 138 -104 4 -91 -182 -269 -222 -303 -92 -137 -58 -150 126 44 -3 -76 122 -15 201 160 4 127 18
3096A8Lq2K20r5J78k60j65K26j42P4o8P5j12j84K69J81K1J35k42J95n5L7l82J30
$$ 18 21 -61 159 64 242 -18 -183 43 -99 -25 -93 -18 -130 -314 -45 136 157 292 50 245 190 227 -155 -25
3120b5P2K35l76K37j54M9J23K21k21k05o9J18j6N8j58J12k33P6O7K06j46j48N17
$$ -25 47 282 -94 143 -11 38 161 382 161 -44 -113 5 -11 47 -111 1 -232 -156 -89 117 -29 -177 340
3143C40m30K19j79N7o6N9P7j89O7M44o86K96L5j54J25k27K94Q1j66O0M3o4k36
$$ 340 -90 129 -50 7 -59 0 77 -112 -45 399 -287 9 44 -110 15 -212 82 163 -3 57 100 36 -200
3166b00L12R1j47k26K3O7j53J76k05L18Q8q7R4j66J20l08J93j49L39J21k41J10
$$ -200 112 203 56 -170 -147 -80 -233 -57 -262 56 144 57 151 -15 105 -203 -10 -159 180 301 60 170
3188A70p2N4%j8o9m5M0j34o3J1j57K36r6m8J21R6j6q1Q9m7K13l11K11N0k33L44
$$ 170 98 152 152 134 65 20 60 -74 -137 -126 -283 -47 -143 -191 -70 26 10 -71 18 -29 184 -127 84 134 -99 245
3214B45k09Pj14M11j78Q3j68M7k3J05k72L9L6p0R8kJ01k74J20k20J81k10K1N83
$$ 245 36 43 -71 340 162 245 77 124 101 206 -66 -27 9 -61 37 35 136 -138 -18 -238 -57 -267 -246 337
3238C37k80K03k59k15K60J58k60lN4n5O5P7N7k3L2o5m0n9M6j18N5j20R7k4q4q2
$$ 337 57 260 1 -214 46 204 -56 -59 -5 -60 5 82 139 116 148 83 43 -16 30 -88 -33 -153 -56 -80 -164 -246
3264b46O1q1j47J80K78J86k99p0K14k76N20o1j11J33k14p3l7K00N0k92j36K62
$$ -246 -185 -266 -413 -233 45 231 -68 -138 76 -200 320 259 148 281 67 -6 -43 157 207 -85 -221 41
3286D1J67l30L07j71j61j10O1J25j47P6r1K29j38K32m48L10q2J85M9k04R4n5K08
$$ 41 208 -122 185 14 -147 -257 -196 -71 -218 -142 -233 -4 -142 90 -358 -48 -130 55 104 -100 -6 -61 147
3309A47J06j71N8j1O7j60J61k81R0J06k06J03P7j22q9K18k04R7P8k0R1k00K59
$$ 147 253 82 140 129 196 36 197 -84 6 112 -94 9 86 -36 -125 93 -111 -14 64 44 135 -65 194
3332A94m1o9J7Q4j17L6J65k42K58j51j09O4J43k7n9Oj77K9L8j95J74r2j60K45
$$ 194 153 84 101 185 68 104 269 27 285 134 25 89 232 205 146 152 -25 4 42 -153 21 -71 -231 14
3356A4p8J20j63j25K70k74M68j96n0k6L9j04Q8j4K05k14J61l21L31k13J54j51
$$ 14 -64 56 -107 -232 38 -236 232 36 -14 -40 -1 -105 -17 -31 174 -40 121 -200 131 -82 72 -79
3378g9p2Q9N5O4k00J22j19K21M0J96n20K67o1J59j89L5J95j6Jk44K22o2J67j58
$$ -79 -151 -62 -7 57 -143 -21 -140 81 121 317 -203 64 3 162 -27 8 203 187 188 -56 166 104 271 113
3402A13Q1o2N6j44J91L4l42L23k10l38K50j46J12p5J34P3k12O7k3J93k09L8O6
$$ 113 194 132 188 44 235 269 -73 250 40 -298 -48 -194 -82 -157 -23 50 -162 -95 -118 75 -134 -96 -30
3425c0o6L8j38k6J77k12L83l37K74J15j30Q6j75j30R9R4L56l91j25K9j62j47L27
$$ -30 -96 -58 -196 -222 -45 -257 126 -211 63 178 48 134 -41 -171 -72 22 378 -13 -138 -109 -271 -418 -91
3448i1J94k01n8J66J59m57K48J16j24P6p7J82j24L8J27j3o6j99J04r5R8Q5n1J25
$$ -91 103 -98 -156 10 169 -288 -40 76 -48 28 -49 133 9 47 174 161 95 -104 0 -95 3 88 37 162
3472A62r8p8p6j0K3k32R9K05j30M5kN8k8k41J84j50J83K2j02K37k0l0n3K26l57
$$ 162 64 -14 -90 -100 -77 -309 -210 -5 -135 -90 -92 -34 -62 -303 -119 -269 -86 -64 -166 71 51 21 -32 194 -163
3497a63J63J22m0j43J05j07J99Q7k10R9n0r6K75k94k26K31J25j5J53k50J37j20
$$ -163 0 122 82 -61 44 -63 136 223 13 112 62 -34 241 -53 -279 -48 77 62 215 -35 102 -18
3519a8K79k01P4k75K34J4L0N5r7n1J39l8k71J73l74K56N6R8l6Pk22r3L32j49L80
$$ -18 261 60 134 -141 93 107 137 192 95 44 183 145 -126 47 -327 -71 -15 83 47 54 -168 -261 71 -78 302
3544C02k39L7k05J70M6k03M5J44O9j20j38K57l27J56J26q0R3l2On5j66J02j3J93
$$ 302 63 100 -105 65 111 -92 -47 97 166 46 -92 165 -162 -6 120 40 133 101 107 52 -114 -12 -25 168
3568A68k10K2O4j70o3J35k27K49j33j14K95l73K60J04J63l31K97k65m2K87j28
$$ 168 -42 -20 44 -126 -189 -54 -281 -32 -165 -279 16 -357 -97 7 170 -161 136 -129 -171 116 -12
3589a2K37k69R4m3j22K47J57j10j20r0l9k75N86k51O7k41L57l63j03K21r8J71
$$ -12 225 -44 50 7 -115 132 289 179 59 -31 -70 -345 241 -10 57 -184 173 -190 -293 -72 -170 1
3611Aj87L56k11j8O0K09k2k24K17j75K7O2j02P2j75J60N5j41j21K44j34n5qK01
$$ 1 -186 170 -41 -59 1 210 188 -36 181 6 33 95 -7 65 -110 50 105 -36 -157 87 -47 -102 -110 91
3635I1k35J53k6Nj91P5J48m6P8j09J37o0P3k97K02j53N10j86j59L9K41m25M2R4
$$ 91 -144 9 -17 -12 -203 -128 20 -26 52 -57 80 20 93 -204 -2 -155 355 169 10 49 290 -135 -93 1
3659Aj17j6j97M12N2k95Q7q3J0J86k08L28k79J86mj96j13L38J48l02j15K38n6
$$ 1 -116 -132 -329 83 135 -160 -73 -156 -146 40 -168 160 -119 67 63 -133 -246 92 240 -62 -177 61 5
3682ER6J6L1Jj42Q9m5l8N2l%J44j86k55K18J70j77MK31j94k5n2j32L34k48L4J64
$$ 5 101 117 148 149 7 96 51 13 65 62 62 206 20 -235 -17 153 -24 -20 211 17 -8 -60 -192 142 -106 -72 92
3709I2Qk11J09K21l57n7K39L2j01J2J05N3q1P5m03K53j8r3j31K6K44o2R4k72J67
$$ 92 100 -111 -2 219 -138 -195 44 76 -25 -13 92 145 64 139 -264 -11 -29 -122 -253 -227 17 -45 49 -223 -56
3734e6n8J1J01J28j53r1M3j44M51j63P5M5j31j34L15k38L4R8j6O3k40j26N8L63
$$ -56 -114 -103 -2 126 -27 -118 -75 -219 232 69 144 189 58 -76 239 1 35 133 117 180 -60 -186 -128 235
3758B35j70k34M7K29k42m1L42m92L63j18J38q0j42K23K0r9J48q4J08M9k33Q5o
$$ 235 65 -169 -122 107 -135 -176 166 -326 37 -81 57 -23 -165 58 78 -21 127 43 151 200 -33 52 46
3781D6J98k87n9N1j37J92j75J64O4r6k06r4J99j6L1J7l9J86q8N5N1k8L6J15P5
$$ 46 244 -43 -102 -51 -188 4 -171 -7 57 -39 -245 -339 -140 -156 -125 -108 -147 39 -49 6 57 29 65 180 255
3806B55p2o6K58k42k66mL35l24O9p2J21J50k61K05k98R6mn0kK92k18N9K08k14
$$ 255 183 117 375 133 -133 -137 198 -126 -57 -129 -8 142 -119 86 -212 -116 -120 -170 -172 120 -98 -39 169 -45
3830d5p0Q5M3O2k0L3J11K5r4k36L25m52L38j81L6J72l99L77P9k31n5K70j01l03
$$ -45 -115 -30 13 75 55 88 199 224 130 -106 219 -233 105 -76 -40 132 -267 110 189 -42 -97 173 72 -231
3854b31j0K22o4K6J87m9j2k02K52j37l9O6K34j14nl00Q6J05Q9j51O5J92j54j32
$$ -231 -241 -19 -83 -57 130 81 69 -133 119 -18 -57 9 243 129 124 -176 -90 15 104 -47 18 210 56 -76
3878g6R6M6N6m26M39j76n0o6J68J62k07j42r9J36K61n4R2k36k8P2J98Q1m01P4
$$ -76 20 66 122 -304 135 -41 -91 -157 11 173 -34 -176 -275 -139 122 68 160 -76 -104 -32 166 247 -154 -80
3902h0J01j57L17j71j44K54L3k16M1Q8j37k13J8L14j73k2J09j12J4K40q4J19k97
$$ -80 21 -136 181 10 -134 120 153 -63 -22 66 -71 -284 -266 48 -125 -147 -38 -150 -136 104 20 139 -158
3925a58N2N7J14K75l64J44r0J09j55M13k78j05O5k9J09q3k62J59O6j82K99m33
$$ -158 -106 -49 65 340 -24 120 30 139 -16 397 119 14 79 50 159 76 -186 -27 39 -143 156 -277
3947b77J36l8J75j3K4j05J0J32j10J37rj43K40j54o7K92n05K81j67J67n1Kj46
$$ -277 -141 -179 -4 -17 7 -98 -88 44 -66 71 62 -81 159 5 -62 230 -275 6 -161 6 -45 -43 -189
3970a89J80l3J34j19o0R7K1j9q4J27j01K5j42J19J10J7j9J28l12j98M50j27P2
$$ -189 -9 -42 92 -27 -87 10 31 12 -72 55 -46 -21 -163 -44 66 83 64 192 -120 -318 132 5 77
3993G7rj93K15j28J02m8l0mL1OJ35j24j11n0K0M7J89M2r7kM8j47J01j07J73j54
$$ 77 68 -125 90 -38 64 16 -14 -18 13 19 154 30 -81 -131 -111 -64 125 167 70 68 116 -31 70 -37 136 -18
4019a8N0R5Mj85K18q2n3J65l46K16j52K78j65l1r3J67l1kK8K0j88l5K2J85N6K4
$$ -18 32 127 131 -54 164 82 29 194 -152 64 -88 190 25 -6 -99 68 37 35 63 83 -105 -140 -118 67 123 147
4045A47k26J67n0L01m21pL54m30J49J25J27l67L17n5k20n5O10p22L27L3j88l6
$$ 147 -79 88 38 339 -82 -89 265 -165 -16 109 236 -131 186 131 -89 -144 466 -256 71 104 -84 -120
4067a20k0L18j56l2j75J68pJ0RK11p5l00K54j03Q3OR3j16j73J19j05O9K2m9L1
$$ -120 -140 178 22 -10 -185 -17 -24 -14 -5 206 131 -169 85 -18 65 71 164 48 -125 -6 -111 -42 -20 -69 -38
4092c8O2k34Q4J25J09n9L7j36k79K77n2J37j81L80j29l46K04j23Q8q4K43k38K28
$$ -38 24 -210 -126 -1 108 49 86 -50 -329 -52 -104 33 -148 232 103 -243 -39 -162 -74 -158 85 -153 75
4115G5P9r6K6k12J58Q5n6q2K78q2o0j84K15k28K77n1rk01m8K73k31q0K12l23L64
$$ 75 154 58 84 -128 30 115 59 -23 255 173 113 -71 144 -84 193 142 133 -68 -116 157 -74 -154 58 -265 99
4140I9L5j80oMr1Q5K10m1k04N5n5n3K92p8P8j89M1o6K30p5l49L94j20j78J0l9
$$ 99 134 -46 -52 -48 -139 -54 156 115 -89 -34 -89 -142 150 72 150 -39 2 -64 166 91 -258 136 16 -162 -152 -191
4166a91J67m6Q3K3k38K20k11K43l24K21j69M23l9o1r0p3J63j62j61Q6J88n1J73
$$ -191 -24 -70 13 36 -202 18 -193 50 -274 -53 -222 201 162 101 11 -62 101 -61 -222 -136 52 1 174
4189A74l56L14l00L42j75O7k49J07M1J58k30K73j12k02K48k06K53j48j74J9K23
$$ 174 -182 132 -168 174 -1 66 -183 -76 -35 123 -107 166 54 -148 100 -106 147 -1 -175 -156 67
$$ [...]
8191g7
##END NTUPLES=NMR FID
##END=
