##TITLE=1H_Pr 2790
 CDCl3+DMSO
 8 sc, 
 15.03.2022
##JCAMPDX= 6.0         $$ Bruker NMR JCAMP-DX V2.0
##DATA TYPE= NMR FID
##DATA CLASS= NTUPLES
##ORIGIN= UXNMR, Bruker Analytische Messtechnik GmbH
##OWNER= root
$$ XWIN-NMR		Version 3.5
$$ Tue Mar 15 12:44:16 2022 Russian Standard Time (UT+4h)  she@DPX200
##.OBSERVE FREQUENCY= 200.131346
##.OBSERVE NUCLEUS= ^1H
##.DELAY= (6, 6)
##.ACQUISITION MODE= SIMULTANEOUS
##.ACQUISITION SCHEME= undefined
##.AVERAGES= 8
##.DIGITISER RES= 18
##SPECTROMETER/DATA SYSTEM= spect
##.PULSE SEQUENCE= zg30
##.SOLVENT NAME= CDCl3
##.SHIFT REFERENCE= (INTERNAL, CDCl3, 0, 15.7039)
##AUDIT TRAIL= $$ (NUMBER, WHEN, WHO, WHERE, WHAT)
$$ ##TITLE= Audit trail, XWIN-NMR		Version 3.5
$$ ##JCAMPDX= 5.01
$$ ##ORIGIN= Bruker BioSpin GmbH
$$ ##OWNER= she
$$ F:/spectra/data/she/nmr/H-F/1/audita.txt
$$ ##AUDIT TRAIL=  $$ (NUMBER, WHEN, WHO, WHERE, WHAT)
(   1,<2022-03-15 12:43:14.71 +0400>,<she>,<DPX200>,
      <created by zg, POWCHK disabled, PULCHK disabled
       configuration hash MD5:
       00 E9 B6 7A A2 85 ED C7 34 08 36 98 17 FE 4E 26
       data hash MD5: 16K
       33 30 31 71 5B F1 CD 98 36 88 53 B1 4A BB 7E 92>)
$$ ##END=
$$ 
$$ hash MD5
$$ 08 C3 47 C5 D1 3A B3 07 00 4F 79 E1 21 AD 19 61
##$RELAX= 
##$RELAX= 
##$RELAX= 
##$RELAX= 
##$RELAX= 
##$RELAX= 
$$ Bruker specific parameters
$$ --------------------------
##$DU= <F:/spectra>
##$EXPNO= 1
##$NAME= <H-F>
##$PROCNO= 1
##$TYPE= <nmr>
##$USER= <she>
##$AMP= (0..31)
100 100 100 100 100 100 100 100 100 100 100 100 100 100 100 100 100 100 
100 100 100 100 100 100 100 100 100 100 100 100 100 100 
##$AQSEQ= 0
##$AQ_mod= 1
##$AUNM= <au_zg>
##$AUTOPOS= <>
##$BF1= 200.13
##$BF2= 200.13
##$BF3= 200.13
##$BF4= 200.13
##$BF5= 200.13
##$BF6= 200.13
##$BF7= 200.13
##$BF8= 200.13
##$BYTORDA= 1
##$CFDGTYP= 0
##$CFRGTYP= 5
##$CHEMSTR= <none>
##$CNST= (0..31)
1 1 145 1 1 1 1 1 1 1 1 1 1 1 1 1 1 1 1 1 1 1 1 1 1 1 1 1 1 1 1 1 
##$CPDPRG= <>
##$CPDPRG1= <>
##$CPDPRG2= <>
##$CPDPRG3= <>
##$CPDPRG4= <mlev>
##$CPDPRG5= <mlev>
##$CPDPRG6= <mlev>
##$CPDPRG7= <mlev>
##$CPDPRG8= <mlev>
##$CPDPRGB= <>
##$CPDPRGT= <>
##$D= (0..31)
0 1.2 0 0 0 0 0 0 0 0.06 0 0.03 0 0 0 0 0.0002 0 0 0 0 0 0 0 0 0 0 0 0 
0 0 0 
##$DATE= 1647333794
##$DBL= (0..7)
120 120 120 120 120 120 120 120 
##$DBP= (0..7)
150 150 150 150 150 150 150 150 
##$DBP07= 0
##$DBPNAM0= <>
##$DBPNAM1= <>
##$DBPNAM2= <>
##$DBPNAM3= <>
##$DBPNAM4= <>
##$DBPNAM5= <>
##$DBPNAM6= <>
##$DBPNAM7= <>
##$DBPOAL= (0..7)
0.5 0.5 0.5 0.5 0.5 0.5 0.5 0.5 
##$DBPOFFS= (0..7)
0 0 0 0 0 0 0 0 
##$DE= 6
##$DECBNUC= <off>
##$DECIM= 32
##$DECNUC= <off>
##$DECSTAT= 4
##$DIGMOD= 1
##$DIGTYP= 9
##$DL= (0..7)
0 120 120 120 120 120 120 120 
##$DP= (0..7)
150 150 150 150 150 150 150 150 
##$DP07= 0
##$DPNAME0= <>
##$DPNAME1= <>
##$DPNAME2= <>
##$DPNAME3= <>
##$DPNAME4= <>
##$DPNAME5= <>
##$DPNAME6= <>
##$DPNAME7= <>
##$DPOAL= (0..7)
0.5 0.5 0.5 0.5 0.5 0.5 0.5 0.5 
##$DPOFFS= (0..7)
0 0 0 0 0 0 0 0 
##$DQDMODE= 0
##$DR= 18
##$DS= 0
##$DSLIST= <SSSSSSSSSSSSSSS>
$$ [...]
##$SUBNAM2= <"">
##$SUBNAM3= <"">
##$SUBNAM4= <"">
##$SUBNAM5= <"">
##$SUBNAM6= <"">
##$SUBNAM7= <"">
##$SUBNAM8= <"">
##$SUBNAM9= <"">
##$SW= 18.0517287032376
##$SWIBOX= (0..15)
0 0 2 0 0 0 0 0 0 0 0 0 0 0 0 0 
##$SW_h= 3612.71676300578
##$TD= 16384
##$TD0= 1
##$TE= 0
##$TE2= 300
##$TE3= 300
##$TEG= 300
##$TL= (0..7)
0 120 120 120 120 120 120 120 
##$TP= (0..7)
150 150 150 150 150 150 150 150 
##$TP07= 0
##$TPNAME0= <>
##$TPNAME1= <>
##$TPNAME2= <>
##$TPNAME3= <>
##$TPNAME4= <>
##$TPNAME5= <>
##$TPNAME6= <>
##$TPNAME7= <>
##$TPOAL= (0..7)
0.5 0.5 0.5 0.5 0.5 0.5 0.5 0.5 
##$TPOFFS= (0..7)
0 0 0 0 0 0 0 0 
##$TUNHIN= 0
##$TUNHOUT= 0
##$TUNXOUT= 0
##$USERA1= <user>
##$USERA2= <user>
##$USERA3= <user>
##$USERA4= <user>
##$USERA5= <user>
##$V9= 5
##$VALIST= <valist>
##$VCLIST= <CCCCCCCCCCCCCCC>
##$VD= 0
##$VDLIST= <DDDDDDDDDDDDDDD>
##$VPLIST= <PPPPPPPPPPPPPPP>
##$VTLIST= <TTTTTTTTTTTTTTT>
##$WBST= 1024
##$WBSW= 4
##$XGAIN= (0..3)
0 0 0 0 
##$XL= 0
##$YL= 0
##$YMAX_a= 120625
##$YMIN_a= -81175
##$ZGOPTNS= <>
##$ZL1= 120
##$ZL2= 120
##$ZL3= 120
##$ZL4= 120
##$ABSF1= 10
##$ABSF2= 0
##$ABSG= 5
##$ABSL= 3
##$ALPHA= 0
##$AQORDER= 0
##$ASSFAC= 0
##$ASSFACI= 0
##$ASSFACX= 0
##$ASSWID= 0
##$AUNMP= <proc_1d>
##$AZFE= 0.1
##$AZFW= 0.1
##$BCFW= 1
##$BC_mod= 2
##$BYTORDP= 1
##$COROFFS= 0
##$CY= 11.3945322036743
##$DATMOD= 1
##$DC= 2
##$DFILT= <>
##$DTYPP= 0
##$F1P= 2.36226072786647
##$F2P= -0.459571619588291
##$FCOR= 0.5
##$FTSIZE= 0
##$FT_mod= 4
##$GAMMA= 1
##$GB= 0.15
##$INTBC= 1
##$INTSCL= 1
##$ISEN= 128
##$LB= 0.24
##$LEV0= 0
##$LPBIN= 0
##$MAXI= 10000
##$MC2= 0
##$MEAN= 0
##$ME_mod= 0
##$MI= 1.114404
##$NCOEF= 0
##$NC_proc= 0
##$NLEV= 6
##$NOISF1= 3.799351
##$NOISF2= 2.8
##$NSP= 1
##$NTH_PI= 0
##$NZP= 0
##$OFFSET= 15.70392
##$PC= 1
##$PHC0= -16950.54
##$PHC1= 11.00078
##$PH_mod= 1
##$PKNL= yes
##$PPARMOD= 0
##$PSCAL= 0
##$PSIGN= 0
##$REVERSE= no
##$SF= 200.130013532006
##$SI= 16384
##$SIGF1= 3
##$SIGF2= 2
##$SINO= 400
##$SIOLD= 16384
##$SREGLST= <1H.CDCl3>
##$SSB= 0
##$STSI= 0
##$STSR= 0
##$SW_p= 3612.71676300578
##$SYMM= 0
##$S_DEV= 0
##$TDeff= 0
##$TDoff= 0
##$TI= <>
##$TILT= no
##$TM1= 0
##$TM2= 0
##$TOPLEV= 0
##$USERP1= <user>
##$USERP2= <user>
##$USERP3= <user>
##$USERP4= <user>
##$USERP5= <user>
##$WDW= 1
##$XDIM= 8192
##$YMAX_p= 0
##$YMIN_p= 0
$$ End of Bruker specific parameters
$$ ---------------------------------
##NTUPLES= NMR FID
##VAR_NAME=  TIME,          FID/REAL,        FID/IMAG
##SYMBOL=    X,             R,               I
##VAR_TYPE=  INDEPENDENT,   DEPENDENT,       DEPENDENT
##VAR_FORM=  AFFN,          ASDF,            ASDF
##VAR_DIM=   8192,          8192,            8192
##UNITS=     SECONDS,       ARBITRARY UNITS, ARBITRARY UNITS
##FACTOR=    0.0002768,     1,               1
##FIRST=     0,             0,               0
##LAST=      2.2672688,     0,               0
##MIN=       0,             -81175,          0
##MAX=       2.2672688,     120625,          0
$$ Real data points
##PAGE= N=1
##DATA TABLE= (X++(R..R)), XYDATA
$$ [...]
1762a262j82J264M0j259M56J318j84j158J60J084p9j369J002J019j41p32K96J124
1780A397p26j225O69R45r16q82Q31P81p68j98J015K43q54o28P43j49j020l84P89
1799c37J47r53M1J108K72j036M98P49j78j020M79P48n69p80M74M54l37r60Q12
1818c88P80m13l71J200K63n61k22P26%j226O1N70m4o74J07J036l72p59P45P23
1838A181k91j216M66L45p37n79M09Q11p91o20O91N06p60q01O88O53r18m59J270
1857a52O50o41m16J157J7q82l76J203J63j106r2R97K74o19M52Q39j95r52L15M17
1877A053k88j328M27O29n45r53N33Q74j016n65R01N17m48n87Q80N81r97l08N97
1896d3L19q44l03R50K1o51M40Q69j83l38m1P98n67n33j19N34j56p35K64P12m95
$$ y = [-1262, -1444, -180, -140, -1399, -943, 375, 191, -967, -807, 277, 198, -1171, -169, 850, 709, -23, 273, 1397, 671, -554, 115, 1060, 144, -738, 93, 874, 106, -92, 923, 1166, 312, -316, 427, 278, -742, -1126, -337, -190, -1143, -1102, 6, 278, -758, -260, 489, 311, -709, -230, 518, -51, -831, -357, 97, -240, -1200, -388, 392, -21, -392, 808, 1071, 510, 288, 1014, 1014, -212, -151, 419, 375, -299, -192, 844, 472, -287, 458, 1181, 890, -326, 140, 485, -252, -831, -422, 389, -402, -1022, -331, 175, -585, -1386, -698, -45, -963, -1422, -152, 498, -143, -559, 598, 615, -267, -643, 560, 723, -383, -475, 522, 796, 177, 629, 1468, 1273, 321, 636, 1053, 765, -563, -136, 493, -52, -1005, -472, 402, -614, -1179, -278, 239, -209, -796, 84, 665, -332, -640, -43, 276, -568, -871, 79, 100, -551, -111, 758, 575, 237, 196, 994, 427, -106, -225, 309, 153, -582, -318, 394, -101]
1917a01l18M94L67p39qM71J19m02l03O39M03o60j97O74j78p00J69L54On36J73
1938b73R63k49p70L55O24m45q06M51M77n04o70N32R25p66o07J008M24q02j14M97
1958B50K85n25l95P84M14p11k71N72R9p68k02Q43j92o78j01P76j7m32k48N71k03
1979a49m81N9N17q7k75J04M63l89r8N12K04k77k77L19O65p20k59K88K03m82k18
2000c78O98l66q3p5L80r7l38N8K03k9m85L91L27l17m95O05J69k22J53J0J37k72
2022b6QM85j93n23j77L04L17o85K43L41J65n38MN34o0o15k31P64l01p50M10Q99
2044C75k38n24M12M34k8l46M6M64m22m83O10M17m71o92P70M28m81j14j5K73m93
2065g8l41M42m1n22k20M09M72o44k26P34J74m55k59P33m7n10O2K65J93l00K31
$$ y = [-101, -419, 75, 442, -297, -305, 166, 285, -117, -420, 219, 622, -38, -235, 439, 261, -439, -270, 84, 90, -446, -273, 690, 441, -329, 26, 650, 205, -601, -150, 327, -177, -847, -315, 610, -156, -763, 245, 669, -133, -247, 250, 535, 10, -385, 399, 813, 102, -169, 403, 502, -266, -468, 375, 183, -495, -596, 180, 163, -269, -517, 54, -149, -630, -571, -54, -141, -416, -312, 151, -238, -336, 176, 380, 103, -174, 145, 810, 90, -169, 119, 322, -160, -378, 320, -46, -129, -204, 176, 79, -259, -201, 2, -27, -512, -121, 206, -111, -606, -1, 168, -54, 99, 109, 246, -26, -18, 467, 274, -249, -426, -122, 195, -490, -247, 94, 259, -279, -275, 259, 199, -416, -647, 117, -184, -934, -524, 375, 137, -387, 25, 459, 431, 85, 131, 595, 173, -310, 300, 717, 246, -446, 324, 752, 271, 157, 142, 415, -78, -419, 23, -18, -540, -760, -351, 121, -523, -749, -15, 159, -296, -555, 178, 131, -379, -317, -52, 141, -159, 72]
2086G2Q7M78k07j7L07m15j10L3O6j91k1j36L04k72P6J20p9j74j79N95n72k75K9
2109d81L6J88k91J04M78j61M7K04M05m12l46nO60q18K65O4M35m88J31K72J00k00
2131A87k42K92J93m05n05O85j21m15RO01J98n28K12M92l09l43j08J93q9n02K9
2152d76M07l34k32O35M69m55n77L57L26l89j97j43K49K7n9R4O57l64N4L02K29
2173E80j53k45L27L3l99k62L83J33j16j67O59j35m33J55J94n46j33p6N4m33jJ62
2195d19l2K80j13K19N7k48m69N58m4k51Q3K92J15n8J78N66j15o4N3J52k64n02
2217b6k6J5j70j01K13K17j10L4M17J5n00k38K71l06k41l59K83L53m56N2P09J73
2239B19j91J36K70J34p30k9L09o5o25K45N02l6j56L36L11j90k43N8J50l73j44
$$ y = [72, 159, 637, 430, 413, 720, 305, 195, 228, 294, 103, 82, -54, 250, -22, 54, 174, 95, -79, -258, 337, -235, -510, -481, -445, -257, -548, -444, 34, -127, -80, 124, 529, 117, -229, -234, 426, -392, -127, -63, 372, -116, 15, 287, 387, 187, -55, 237, 430, 25, -480, 205, 84, -331, -322, 279, 477, -51, 161, 653, 344, 1, -107, 86, -3, -505, -476, -69, -403, -635, 0, 469, 14, -563, -206, 120, -269, -466, -609, -360, -333, -392, -298, 359, -5, 49, 351, 580, 427, 182, 509, 542, 143, -119, 264, 397, 281, 114, 773, 638, 205, 360, 554, 8, -125, -201, -147, -580, -581, -419, -451, -171, -284, -65, -8, -256, -725, -167, -211, -462, -379, -87, 28, -30, 148, 714, 599, 535, 588, 740, 476, -26, -52, -37, -207, -308, -95, 122, 12, 46, 463, 478, -22, -260, 11, -295, -536, -895, -612, -259, -715, -663, 46, 219, 28, 164, 434, 568, -162, -191, 118, 53, -572, -327, 175, 139, -17, 319, 630, 440, 197, 255, 405, 32, -112]
2260a12M9J06k44R7n0N08k92l9K85l00j82k7K19k25j68P0L31l6K0k06M80k37j14
2283f7J33o7k14m42L72p0j26j6K14N20J6j64K95m4j53k95L92m33K6N7P7l5L06
2306B82J08L78j54l10%J57m85k70k33P2l0j58J58M25J67n35M59O8K49j00l93N
2328a40q9l52K39O9J1Q8N99j76O4o2K37ql27j31j00K15k37k62N65l01n2L00l5
2351A15N6m36O7P2j55j79K65M3J68j2O7J49j67Q9J2L7j18l53N4M2k6J76Q6Q8Q6
2376B26q6M40l45J68l95R0o13j54M75k24R5O7J88j18N47L2R7o7l02k87l1J2p5
2399b60r5R4L29J1N8J69K41m19q4P8j93j42m54L05O1j46M1M85j84J53P2O9n6k98
2423a65K8J74n5j63L3N08j82J16J54j89M56m46k51l3k86j27L31j14J35m5p9K32
$$ y = [-112, -63, 43, -201, -104, -154, 354, 62, 23, 308, 8, -174, -201, 18, -207, -375, -305, 26, -10, 10, -196, 284, 47, -67, 66, -1, -215, -657, -285, -355, -481, -497, -283, 237, 253, 89, 384, 340, 187, -108, 284, -149, -123, -66, 11, -24, 282, 390, 768, 614, 304, 304, 461, -24, -294, -527, -455, -485, -643, -485, -60, 107, -428, 31, 99, 348, 248, -145, -140, -229, -581, -342, -273, -262, -174, 425, 249, 313, 251, 488, 480, 153, 22, -78, 137, -100, -362, 203, -98, -150, 150, 115, 171, -265, -198, -126, -281, -460, -195, -152, 16, 4, 71, 220, 53, 142, 154, 191, 73, -280, -226, -184, -210, -34, 52, 140, 226, 140, 580, 235, 403, 8, 98, -515, -669, -194, -418, -323, -256, -68, -186, 361, 393, 490, 423, 121, -166, -197, -185, -260, -355, -261, 68, 79, 137, 306, 547, 128, 44, 122, -71, -213, -667, -362, -301, -447, -406, 79, -105, 48, 120, 189, 133, -165, -137, 37, -18, -181, -148, 360, 178, 294, 448, 259, 715, 269, 18, -15, -301, -428, -97, -211, -76, -121, -200, 32]
2445C2K44k14O7n2R9k76l11j63J14KL42J17M2K8M42k67j76L2k59K73l77JJ23P6
2469f1q4K19m6J7J57P2j01j48m08P9K68k38K93PJ35l0J65O0k6K67m38L76m59j60
2493h4M9j53NO8n5K89j27J5K24J26l64p8j56k01J25p5L4J07m1J61L0J47J23q1
2517H8J67K05l58k38J89m1M1k7o4J94K5m5K59k74Q7n6J16m05j02j36J84m7L3N1
2541a54J66r0l3K2%l12RM08j93K29J8j7J13J51kn2M4J5m7j92l93K89j10J53m9
2566b7j26N39j31J30l39J80k47P2j18k26J73l62L13K5J38O2l7J05K44k13K7j37
2588D5O0j90k81j17J73K7N8K47N4K23j72L5L43m73R6p0l65J81P7O8k97J40K4K24
2612A10J68j65o3J10p4j47L58n3k63m9J51l40j6L01k60J26l34j26l9L04J88j25
$$ y = [32, 276, 62, 129, 77, 176, -100, -411, -574, -460, -458, -116, 1, 43, 71, 513, 246, 70, 102, -157, 116, -261, -260, -137, -61, -145, 74, 28, 45, 202, 274, 173, 25, -383, -304, -36, -274, 19, 26, 161, 131, 296, 356, 330, 597, 159, 535, 76, -84, -35, -188, -183, -115, -170, 119, -8, 7, 231, 357, -7, -85, -241, -442, -317, -392, -358, -251, -292, -131, -101, 46, 169, 88, 255, 460, 102, -136, 53, 12, 53, 26, -38, 156, 181, 136, 395, 121, 208, 152, 268, -137, -239, -375, -191, -238, -205, -154, 12, -78, -111, -89, -89, -401, -392, 16, -177, 52, 70, 53, 166, 317, 315, 263, 307, 322, 275, 83, -310, -21, -131, 22, -27, -153, 386, 255, 385, 46, 226, -21, 51, -67, -293, -120, -482, -169, -144, -6, 56, 19, 124, 368, 155, 182, 45, 105, -85, -366, -483, -310, -283, -225, 22, 76, 299, 127, 162, 505, 32, 128, 58, -307, -126, -49, 19, -278, -138, -114, 110, 278, 113, 50, 160, 86, -61, 297, 244, -19, -68, 83, -257, -273, 28, -232, -106, -440, -566, -605, -301, -113, -238]
2634b38J99L9L3K65k75k75J68k4k03K2K23K33k03J06J98J58p3k%m4j37k42j06
2657a78m0J84n4Qj81oJ12J70j07J29j7n2K31j08j52p3r5j60M76n44L11Q8K09p
2681A44L7K18N8l02R3J13k06m8j81j21J33N2r9l1n0K72j87J78k31J09N6J54j43
2704A8J81j00n2J3m04K91k44M3K82k15M00J08l07K98k2j59J26j88n4M0l57K6j61
2727d37R8K40m1J00J72j46L54J71k84j43J74j43l7j54m0L73j04j39j83K70m6k07
2749a52L06j59L7J8j30K8q2j10n7o2K35P1j44j21K8J73K85J1j31L44Jm3l4j66
2773A46R5j03m29K49N7l1M6J00j02J21J14n41M64k43N8j94l4O3p2m9N8J02l8K19
2797E6P7k3o8j52L17J19k01k94K65k94P9K23l15K29o2m1M2P4p2L4qj60P7q5L14
$$ y = [-238, -39, 0, 33, 298, 23, -252, -84, -108, -311, -289, -66, 167, -36, 70, 268, 426, 353, 351, 351, 307, 170, -72, -178, -218, -34, -88, -80, -261, -267, -155, 15, -92, 37, 20, -32, 199, 91, -61, -134, -229, -389, 87, -457, -146, -58, 151, 144, 181, 399, 457, 155, 248, 361, 155, 107, -74, -195, -62, -10, -109, -140, -190, 82, -105, 73, -158, -49, 7, 161, 18, 199, 99, 47, 60, -344, -53, -297, -254, 28, -187, 213, 321, 14, 312, 290, 131, 257, 69, 15, 55, -302, -276, -437, -339, -99, -140, -40, 132, -14, 340, 511, 227, 84, 258, 115, 78, -76, -116, 257, 153, 14, -169, 101, 55, -152, 154, -5, 32, 50, -80, -52, -134, -244, -301, -363, -128, -57, -201, -322, -294, -121, 164, 175, 44, 388, 389, 346, 312, 146, 241, 138, -291, -42, 15, -16, 30, 130, 28, 149, 263, -278, 186, -57, 1, -193, -227, -164, -236, -285, -227, -125, -163, 56, 133, 110, 42, -110, 207, 326, 125, -169, 96, -198, -119, 104, -211, 18, -44, -85, -43, 31, -41, -7, -15, -175, -98, -183, 131]
2822A31j88R2J82j87k24J3qj47L71k11L35j44L95j15l96K02q3j53L34k66k80J61
2844a86Mq1M1R1M4m9J70m5K86k71j10L01J8j37J08j56o2p1O4K77q1J71j66pn6
2869I7K12k28J48n8k01J24k83N0J7L55k81%L4j74K0J2J34o7J45j24o1K78J06j19
2893A36J59j85J15l93M1J43L15m47J55j61N1K67q3J34mj62o1k21J83L0j25J39
2915B6Q4j68K3J83O5j85Q9j5Q2K7n6j96K59m94K12J1O9J40l02M42j13l33l2J97
2939A5j67O4k79R6j9K32L2j53L27k78M5J97q0lk44M1J74j75L70J90l83L93k18
2962A77M0j19N3k60k6k20J52j86K09P3k25L96m93L80K75l11J45j63j91K02k99
2983c91M39l8m1J68k52J67j12K26l30K23J31k12L20l13K37m12J63o4P8J68j95
$$ y = [131, -57, 35, 217, 30, -194, -181, -189, -336, 35, -176, 159, 15, 410, 295, -101, 101, 18, -135, 199, -67, -347, -186, -182, -263, -222, -131, -87, -136, 34, -11, 275, 4, -106, 195, 213, 76, 184, 28, -34, -105, -41, 236, 155, 326, 160, 153, 97, 309, 81, 229, 171, -30, 94, -189, -139, -122, 233, -48, -48, -14, -188, -168, -156, -22, -89, 56, -68, -129, 149, 255, 136, 295, 110, 225, -168, -127, 16, 331, -116, 39, -122, -71, 196, 113, 247, 243, 81, 20, -201, -18, 12, -113, 26, 110, -58, -35, 148, 213, 28, 117, 102, 184, 211, 155, -41, 218, -276, -64, -53, 16, 156, -146, 296, 183, -150, -182, 15, -152, -88, -367, -271, -290, -58, -26, -179, 148, -130, -85, 112, 32, 29, -215, -174, 0, -175, 195, 385, 2, 395, 177, 217, 98, 151, -109, -135, -355, -203, -389, -180, -107, -332, 64, -429, -49, 226, -85, 60, -103, -294, -92, -391, 48, 10, -31, 137, -115, 52, -60, 166, -164, 59, 190, -22, 298, -15, 222, -190, -27, -91, -13, 155, -40]
3004d0K03j22M4M3j38Lk17L08l3m35N46k8n2n7O7j99K69j42j99J70p8J76n2K79
3028C16l99K21k3M1l04m1k11K11P1L11m63K91R1J16j13J24j03J04k01N1m4m18
3050c72K00k17K36J28N6o8o7r3K3J76p0K0k03k09K46j9J6J3O2m7K21J64k0r0j13
3075b7K68k85K04j96L50l77K48J4j27m6J13J67M6l72j14J80k42J09K48k46O2J7
3097fk45K28oJ98k25r2k67L58k47J17J49J29p8K09n4q1j0j2N0j42j1N6k00O3L0
3122h9N2n1R9J02rJ20m00J71j00m7Nj60J81p3n2K08J43j35J50M26k27j27J97l53
3146C1j06N75m12k22L6L38J60n75K36J38M1j64l0l9J5J1j80P7K30l75L84j4j44
3169A1J39J72k71l70K37K26o3j5J21j50j5J90l3l11M15l48p9k76K24K74l51L66
$$ y = [-40, 163, 41, 85, 128, -10, -7, -224, 84, 51, -384, 162, 134, 82, 25, 92, -107, 162, 20, -179, -9, -87, 89, 37, 316, -83, 138, 115, 156, -148, -189, -400, -189, -118, 193, -270, 21, 112, 228, 115, 239, 136, 240, 39, 90, 46, -372, -172, -389, -153, -25, 31, -37, -104, -197, -174, 2, -68, -48, -251, -460, -214, -233, -217, -204, -142, -189, 32, 196, 176, 86, -27, 241, -44, 160, -36, 314, -63, 185, 199, 72, 26, 139, 306, 352, -20, -134, 46, -196, -87, 161, -85, -23, -6, -251, -23, -29, 169, -56, -148, -415, -57, -304, -187, -38, 91, 13, 222, 168, 87, 77, 65, 115, -27, -38, 18, -182, -119, -89, -37, -88, 11, 113, 104, 224, -176, -5, -105, -152, -147, -307, -126, -199, -251, -43, 100, -35, 115, 541, 314, 187, 384, 31, -75, 500, 88, -134, -98, 240, 400, -175, 61, 199, 240, 76, 46, 7, 22, 33, -147, -70, 160, -215, 169, 155, 11, 150, 322, 51, -319, -82, 144, 81, 66, 187, 37, 22, 212, 179, -132, 283, -65, -144, -420, -196, 78, -273, 93]
3191I3m33M25k13J26j28J31qn7L3j49j93MK79Q3P6j32K55j53j14L84nk26r8J97
3215A77j21m3m2j3J21j57K37k54K30j23j08N5O8l3O4Q0m54M52r9j44J80k13M22
3238B82m47K66J12k53j34K29o4j88K05LM5oj03k3p7L19k91L08l24o3J56K8l9p9
3262a38L33m2Mkj26O0q2j29O4n2J09q0O0N3k9k05M8O3L3j55J47k18L23J1R0j33
3288Gj78J85p3J8Q3k46K1L13j73J51J0k40L55j69j97J41O9J03j07k88K91Lj92
3311a13j9J38j46J45o8J00p7K85k34J66l00J16J14l4R8l53J11J91J04Rl81J95
3333D7J15k9J90j49k96J02p1P5j95L35j45O4L1j25Lj18o1M82k22n1J15j47J93
3356A43j24M5j0M4m1j81M71m61J74j71M56k43k39K42j45K05j54j81P7J15J09J3
$$ y = [93, -340, 85, -128, -2, -130, 1, -7, -64, -31, -180, -373, -369, -90, -7, 69, -63, 192, 39, -75, 309, 304, 78, -20, 177, 56, 13, -29, -42, 79, -78, 159, -95, 135, 12, -96, -41, 27, -6, 58, 138, -316, 136, 37, -107, 73, -140, 282, -165, 101, 213, -40, -174, 55, -9, -197, 8, 11, 56, 50, -53, -76, -153, 166, -125, 183, -141, -204, -48, -20, -59, -138, 195, 153, 157, 155, 29, 89, 7, -122, -58, -110, -1, -81, -21, 32, 3, -202, -154, -91, -58, -213, -66, -284, 39, 50, 140, 7, -171, 14, -59, -41, 42, -204, -183, 130, -43, 108, 118, -122, 233, 64, -133, 8, 77, 180, 73, -215, 76, 79, -113, -132, 6, -140, 5, -63, 37, -40, 245, 11, 177, -123, -7, 107, 73, 171, -182, -71, 120, 224, 233, -148, 47, 162, 133, 323, 174, -122, -20, -91, -16, -211, 124, -21, 43, 74, -51, -48, -166, -227, 255, 33, -18, 97, -50, 143, 19, 64, 54, 98, 57, -124, 347, -114, 60, -111, 345, 102, -137, 105, -40, 165, 11, -170, -93, 22, 131, 144]
3378A44l09J17k32K43oJ17M2o3j18L29j56Lq6J28Kj82J54k07K53k71J04L3j15
3401g6K36l72J93j99L36k24J0l4j40J85K79l38P7oR1j92R3J40k63M85j07QM1l66
3425a43K25L6%j07j52K99k67K11q0J9o8j72J16j97r0J10n7L8J74J44l87J81j1
3448a78O1MJ10J49j23K24k42l6J44m9R5j68N1M57n48m6P8k3o6R5J79r5l04L44
3472A13j6r4Pr4R9J03O4q4J88k35Q3j03j22K00j88m7KK9K24j88p8mN0Q9J83j43
3498C8L7l04J42r6J88O6L7L8J09l28k9j5J25J18k41M6P5Q4J41k52R5P8Jj71m7
3523f5J0J29l5J33j0j29j92K79j96J13k18J17j22K40j27J44r3k22J26J72R0j58
3545a4J46o3M4Q7j43j40K63r9j15J47J68m12J32J6q4P8j2j5j66K09j24K1O6j47
$$ y = [144, -165, -48, -280, -37, -43, 74, 116, 53, -65, 264, 108, 111, 25, 153, 155, -27, 127, -80, 173, -98, 6, 39, -76, 160, -212, -19, -218, 118, -106, -96, -130, -270, -85, 194, -144, -67, -73, 18, -174, -81, 59, -204, 281, 174, 182, 223, -143, 82, 118, 118, 11, -141, 158, -109, 102, 22, 41, -27, -199, -83, -280, -370, -260, -317, -279, -105, 39, -348, -167, -178, -117, -113, -3, 146, 23, 247, 5, -31, 113, 64, 159, -9, 42, 499, -49, -95, -17, -40, -106, -11, 168, 73, -231, 113, 97, 3, 10, -84, 15, 118, 182, 98, 286, 51, 134, 31, -91, 109, -79, -126, -124, -95, 129, -59, -137, -141, -91, -2, 181, 38, 75, -229, -87, -183, 5, 71, 108, 146, 255, -73, -102, -117, 8, 126, -115, -69, 6, 90, 231, -21, 74, 152, 153, -18, -65, -55, 74, 39, 172, 162, 33, -159, 120, -76, 37, -181, -64, -186, 54, -73, 71, -22, -244, -118, 54, 144, -14, 132, 69, 113, 200, 57, -83, 180, 81, -34, 113, 281, -131, 1, 17, -67, 11, -1, -16, -182, 27, -97, -76, -10, -157]
3569a57P2k18J79J92M7j41M49n93L84j98J77j51j7P0J91o31L17K64k1k57k5J0
3591e7J4j6Q7O9l21N1R2K60l59J92P2k40N9L7O9j41K64j95J11L3j18n9J62l7o5
3616c6M9n5J03k27O4J72j75J12p8K43k3k87P7K69m67J54J58P4j37K22l98J04K85
3639B03k2k1j77J36l1o3j88J90J3m7K17l55L61k35rR6J55l1l82J64j46K91j09
3662A0j62L70j07k4j16j88J96J2j67K44nm2J80k04L7n9l00J93J84J0lj77J43Q
3686C3p0J27j69j51K05k6J52k06O3R8P3r0j67K81r6k8J44j84kN6k4L8J50j09J72
3711B70j18j03J46j15q3N4p5o4p0J20l8K5j11L23O9l8k4l98M31j38j7J68j8j5
3735A81k9NP4l35O3P4rJ42k46r1K70k21q6K47l78K59M5K55l14J57m2k19pK38q4
$$ y = [-157, -85, -303, -124, 68, 115, -26, 423, -170, 214, 16, 193, 42, 25, 95, 286, -345, -28, 236, 215, -42, -67, -57, -43, -59, 28, 97, -224, -173, -81, 179, -180, 12, 84, -156, -97, -60, 9, -132, 132, -63, 48, 81, -37, -96, 66, 29, -36, 13, -42, 61, -166, -102, 70, -105, 7, -71, 172, 149, -138, -61, 208, -259, -105, 53, 127, -10, 212, -186, -82, 203, 181, 160, -17, 119, 88, 25, -163, 27, 40, -7, 210, -145, 216, -19, -28, 68, 223, 192, -190, -26, -172, 119, 10, -152, 218, 111, 87, -29, -217, -21, -9, -176, 68, 63, 21, 201, -3, 34, -25, -325, -132, 52, 62, 59, -118, 25, 33, -37, 90, -79, -230, -25, -51, 101, -105, -42, 56, 129, 39, -128, 153, 57, 29, 173, -11, -13, 43, 19, 57, 207, 98, 270, 152, 49, 195, 80, -3, 51, -24, -88, -158, -38, -76, -51, -162, 161, 230, 192, 168, -230, 201, 63, 46, 214, 196, 181, 152, 157, 231, -104, -41, 33, 24, 166, -80, -171, 99, -122, -208, 39, -339, -80, -35, 220, -94, 63, 21, -198, -205, 33, -51]
3760e1q9J28j7L6K82o5p1j90J83k75L37j77p4Q9j07j17R5Q9j05q3p8J04l0n5K94
3785E3l6j97N8K7N3L43j59J1j1q0J26k29P5j4j93J93m3K63j02p5R5m28J02K52
3809H4j60J58n5J98j43jl97M78j82q2k25K48J59j40J9M0j2J38n5q2m7K30k52l5
3833a16J33kj29J87k28J49J21j56k8J06n8Lk41J58J17K4o4J8P8N7k70R0j35N6
3857a30J71J40N0k62J13o6J23l80K82J58k84L9L56k34N2k51O8K63l50j30K39m9
3879h2j01J91L4n4O2J75k56l7j42K77J04l14Q9M9J60N2j21o0J30K31l77R3j92
3902h9K2J5K7J32j16Q6k96Q9p2J38J27k11K00l97L35j12J90j04K5Mj29J09K6N3
3926E2L9R0n3j4o2k56J7K26k3k8j45J12k98L24j64K25k71L31J89n55R2M79m7j83
$$ y = [-51, -140, -12, -29, 7, 289, 224, 153, -37, 146, -129, 208, 31, -43, 46, -61, -178, -83, 6, -99, -182, -260, -156, -186, -241, 53, 17, -180, -122, -95, -42, 301, 142, 153, 142, 62, 188, -41, 34, 20, -173, 20, -23, 240, 138, 63, 158, -270, -168, 84, -76, 82, 27, 225, 82, 81, -316, 162, -20, -102, -327, -79, 80, -60, -41, -1, -13, 125, 70, -12, -59, 171, -81, -116, 17, 15, -114, 73, -155, -6, 115, -41, -69, 37, -21, -18, -259, -101, 16, 40, -24, -6, 72, 129, -141, -51, -186, -130, 41, 181, 231, -31, 82, 16, 139, -241, 41, 199, -85, -46, 310, 76, 128, -123, -55, 208, -142, -272, -33, -82, -183, 8, 42, -12, 50, 225, -31, -68, -210, 67, 171, -143, -54, -5, 155, 207, 86, 26, 156, 387, 10, 103, -89, -67, -52, -25, 107, -9, 77, -219, -130, -202, -64, 63, -148, 52, -345, -10, -122, 68, -36, -11, -7, -136, -27, -1, 52, 91, 181, 128, 114, 52, -204, -187, 39, 16, -12, -157, -45, -343, -19, -183, 42, -229, 102, 291, -264, -172, 307, 260, 77]
3950G7j85J89J04o8k68M29L5k54Q3j82M9K4J13k30R3O2K1j07j27J57p3Q5O4j15
3974b4J7j34K70j17J76O7l04M0k42M6L44l38J52K50k47J13k29J9K02l31J34l3
3996a69N7L7J13j49J48L6k88N1J52J18N1k77J91R4J73l62j61L67k31J60j4j31
4018c4L3L57j74r8j00O8J18j17l3j44J65j04o1R2R5K9p1l0J33j29K3R7k37J00
4042b2J42j45J81j9L1J00k43j44J34r6L3o4L12j60J77l33J11l9j66J87j07o0p8
4065b68Q3K18k88J45J97k05P3r2R6p1O0K0K09m56J10M9K2P6j1j06l2L6p2L39r7
4090C5p6N5n7j51J30Lj52K81k46j0J24J07J91k47N7L1J94j29m01L48Q7l8Qj27
4114A7J5K3K02L0k57j8j78j1r4K34K5J66m3k5l94K12J54o3j30J29j36J96l61N43
$$ y = [77, -108, 81, 185, 117, -151, 278, 313, 59, 142, -40, 9, 33, 146, -84, 9, 71, 92, -15, -142, 15, -58, 27, 91, -24, -7, -141, 129, 12, 188, 255, -49, -9, -251, -205, 139, -199, -47, 203, -44, 69, -160, -141, 61, -270, -136, -169, -112, -75, 38, -111, 37, 73, -215, -164, -12, 106, 157, -120, 71, 165, 338, -24, -185, 182, -49, 111, 97, -34, -1, 356, 182, 84, -16, 52, 170, 53, 20, -124, 41, -63, -124, -32, 63, 92, 21, -9, 124, -5, 18, 115, -122, -22, 120, -25, 156, 137, 168, 268, 25, -119, 15, -81, -48, -112, 200, 40, 217, -116, -5, -44, -210, -23, -130, -190, -268, -185, 33, -255, -110, 87, -118, -45, -137, -41, -112, -52, -32, 177, -279, -169, -120, -98, -22, -33, -139, -171, -135, -207, 132, 35, -41, 14, -43, -194, -64, -61, -213, 68, -178, -188, -64, 43, 234, -13, 44, 75, 269, 140, -261, 87, 174, 136, 144, 17, 32, 55, 257, 287, 30, 12, -166, -177, -271, -37, -12, 154, 111, 86, -308, -96, 58, -5, -135, -6, -142, 54, -307, 236]
4138B36j85K6k60J23J62k00J31n0N6m19K10K59Pj36l9J51J36j50k65K20j01ok7
4161a21K26n9J5p6J83j66P0Q3q4j21K74lk69J46j2J94l49Q5j6R3J6j69O1k0j73
4186a92J44j47K10n7n4n0J13j5O0K17l04J71l68M06j58J42n9J06j88J28r4pj29
4209a25M1J45l60K78j99K41j56P8k9J98k38K1J5M1L6J57k22M5J13l7j50j56K12
4232e1J00k94k6K78M1O4q2J2Q2o1j7j75j48J00j08L32m08K38l9mO7k05K92J84
4256A72l84L76l8K3m5m13O09j92Kk00J34P7l21K95%r5rj3j18K5L9j02L21n7j03
4281a7q8l0K8j3n7K31P2j11J77l83K43J02r5o5l0o8J22r1M0J07K5j52j05K65j56
4306d9J3pk2J76j8j87p3r6M23j73o6J99j64P4p8k1J71o3q7J58O8k70J4J68j35
$$ y = [236, 51, 77, -183, -60, 102, -98, 33, -17, 39, -380, -170, 89, 96, -40, -79, 72, 208, 58, -207, 13, -88, -94, -121, 105, 46, 61, -15, 168, 2, 72, 155, 71, -50, 224, 221, -48, 98, 86, 280, -69, 16, 0, 93, 109, -60, 1, -19, -192, -48, -195, 15, -42, -96, -146, -33, -48, 12, 229, -75, 96, -272, 134, -24, 118, 59, 165, -23, 105, 11, 4, -125, -84, 61, -299, -21, -220, 21, -135, -57, -86, 112, -126, -105, -90, -49, -13, 144, -78, -33, 80, 43, -107, -263, -51, 49, -245, -271, 7, 48, 112, 30, 42, 124, 63, 46, -129, -277, -177, -285, 47, -361, -123, -162, -166, -99, -304, -12, 172, -212, 164, 126, 149, 104, -309, 300, 108, 110, -90, 44, 121, -200, 95, 95, 0, -9, -22, -140, -115, -76, -178, 143, 86, -17, -105, -135, -107, -120, -177, 54, 126, 15, 192, -191, 52, 154, 59, -6, -36, -104, 18, -73, -33, 74, 99, -53, -158, 107, -49, -36, -43, -65, 111, 93, -94, -167, -263, 160, -13, -79, 120, -44, 30, -48, -69, 102, 39, -48, 110, 178, -92, -78, 90, -45]
4331d5J78l36K56k31Q8r7K50k98J61K19j98P3J0j96O0L11n4M5p3N5q2l7N4k69
4355a56J73n7o7K0J56P0k76K1J1j58K52o0J7J65Q5j24j01L0J87j92K86k17r6p
4379c8J05O5m7k8j07Ol11K35J23P5p7K29j59j2q7K20j07J88l97J04p4k05m7L77
4403C1j35J06j70R7N5R8Kn8j66J57j24J50l0L8k7j39M4J7J85j21j48K37j41N4
4427A2r4j8K81l31J47j44J10qJ00l0j00rj0K42p7j0j35K21j10j55J22K4k9P5k0
4452E4r2J88l72L04k38J51R1j09Q2J0m1j22J33j69l9J74p8J74n25K80K95k6j21
4475DJ18j79J65r9j1J41k81J79O6j07N0j51K25j90J31p1K4l88L20O6j67J77j10
4498h8j10l3J5K54k4j9r6L02J78k04k49J37l6J13p8Q9l65L28P6O6m73J10K93j97
$$ y = [-45, 133, -203, 53, -178, -90, -187, 63, -235, -74, 145, -53, 20, 30, -166, -106, 205, 151, 196, 123, 178, 96, 59, 113, -156, 17, -40, -107, -87, 69, 139, -137, -116, -105, -263, -11, -71, -54, 111, 196, 72, -29, 1, 188, -4, 282, 65, -31, -38, 67, 132, 85, 57, -50, -44, -355, -120, 3, 78, 1, 230, 71, 59, -28, 192, 85, 273, -124, -20, -94, -299, -346, 31, -104, 2, -168, -71, -16, 82, 84, 26, -140, 17, -107, 43, 13, 51, 24, -115, -71, -54, 131, 10, -138, 99, -42, 12, -82, -100, 181, -150, -3, -147, -37, -45, 55, 25, -75, -84, -94, 148, 71, 61, -74, 147, 37, -118, 4, 28, -1, 74, 54, -38, 150, -222, 82, -156, -5, 86, -23, 59, 69, 28, -94, 39, -130, -169, 5, -73, 101, -424, -144, 151, 125, 4, 122, -57, 108, 9, -2, 139, -142, 37, 103, -4, 46, -105, 120, -70, 61, -10, 14, -374, -54, 12, -155, 22, -88, -198, -231, -216, 38, 14, -5, -101, 201, 379, 175, -74, 63, 27, 140, 62, 151, -214, 114, 190, 256, -217, -107, 186, -11]
4522a1J46l24K58m82M36n9j79K20k21J49M7N0J57j43Q4k23K03j73Q4rj07N2k17
4545b62M35k05oJ77N0j85m4J37j67J4l2j81J19R4j16Q8J41Q4j06L5jJ37j49n9
4569bm3J95k72J8K38k36K85j60j80K71k51J05lj53j6J10mJ7J17r9J65m0N3n3m8
4594A4j60L2J29J13K1jk45K54k43L23k28J94l05j33K92l86L66j72N0L29j52j79
4616h7p7J34L0j21JJ61O8j56m2k1L81k59J11K0J11M3m35J89Q9l95J88q2L11j40
4640B2Q5K2j11j20J12j88J80P2j14q9Q2N3m9N6l1o1J64K8O6J44n53M04j91O4J36
4665A83j24J27k77O5q8O7K4J12j73N6j42o4J25L12l46P7P7r4M3m3P8o2j39J29
4689g7O7N0l2J90l0k83J24JJRJ89J13k78J40j54oP2r0M1r6m9J80nJ8j07k53L53
$$ y = [-11, 135, -189, 69, -413, 23, -36, -215, 5, -216, -67, -20, 30, 187, 44, 128, -95, 108, -65, 19, 10, -97, -45, -262, 173, -32, -38, 139, 189, 4, -40, 97, -70, -56, -88, -269, -150, -56, -172, -84, 57, 141, 35, 70, 69, 206, 57, -2, -45, 150, -122, -104, 134, -102, 183, 23, -157, 114, -137, -32, -35, -188, -204, -94, -98, -81, 36, -63, 102, 62, 115, 62, 14, -146, -114, 15, 128, 149, 148, -97, 157, -86, 237, 9, 203, -102, -235, 57, -329, 37, -135, -85, 244, 92, -87, -164, -30, 0, -121, -120, 41, 109, -47, -89, -110, 271, 12, 123, 143, 254, 297, -138, 51, 140, -255, -67, -149, 162, 22, 107, 129, 18, -102, 10, -178, 2, 74, -40, -129, -47, 6, -43, 13, -18, -79, 85, 113, 179, 323, -230, 174, -17, 47, 183, 59, 186, -91, -26, -114, -47, -23, 89, -84, -28, -170, -234, -109, 203, -143, -66, 11, -83, -40, -83, -5, -67, -206, -77, -10, 40, 8, 198, 168, -115, 9, 10, 11, 20, 209, 322, 44, 184, 30, 24, 96, 6, 47, -49, -98, 82, 77, 95, -12, -265, 88]
4716H8n1Rl35L30K5Mk8K7o8L13l49Q8Q2j53J4j92J66j32J80k0o6M9J09k25j13
4741b48K49q2j47K34J49j24k0j00K1%K1%j94J81K80l83K90J45j56j93J79j58k21
4764b77NK94j28olJ57K07j6r3M8j44m6R2k49K11O9j98L3%P4J66j10l03K43j8j64
4790a56L86l09J09J31j27jR5j50o1J3J42Q9k1p4j27j45K74k98J84j20J45j42J67
4813DJ37l01K4L77j49m47K91K89l38K22R1j62r0J61K01m82K93j55J9N9j08K43
4835A79j97n7j29Q8K58r7M2j18k4K08j19j64O6J93m38P9J94J11J98k49qj08J30
4858C8K02j49j61P1j6JoJ18j6j26J84j49J59m49K13j29K27r3Q1L0j05J12k07J36
4882c4pJ82j07j02J00j2j46J90j90M4K49k85O9M03l12k42J45K4j02K97l27J70
$$ y = [88, 37, 46, -289, 41, 66, 70, 42, 69, 1, 314, -35, 53, 135, -18, -4, -196, -30, -162, 18, -2, -68, -19, 90, -135, -248, 1, -81, -228, 6, 155, 31, 11, -89, -68, -68, -47, -47, -241, -60, 220, -163, 127, 272, 116, -77, 102, -56, -277, -272, 22, -106, -112, -115, 42, 249, 233, 140, 188, 44, -2, 90, -159, 52, 121, -77, -44, -44, 30, 196, 86, -217, 26, 8, -156, 230, -79, 30, 161, 34, 33, 128, -22, -83, -70, 72, 161, 140, 66, -61, -206, 68, -230, -46, -166, -21, -163, 4, 141, -160, -136, 241, 92, -355, -64, 225, -113, 109, 200, 38, -52, 109, 310, -172, 121, -34, -15, 44, -64, 179, -18, -75, -204, -116, 142, 45, 87, -31, -55, 153, 34, -130, -64, 129, -309, -230, -36, 75, 273, 24, 16, -92, 38, 240, 91, -70, 1, -15, -14, -20, 98, 82, -44, 140, -9, 150, -299, -86, -215, 12, -81, 0, 30, -75, 37, -170, -34, -41, 141, 34, -68, 32, 20, -126, 64, -126, -82, 167, -118, -49, 354, 42, -200, -55, -31, -133, 164, -163, 7]
4904Gj7J37J76k54J63l46J14j29r1O2J05J54J61k11M2J24k93N2L61j96l1q1k64
4927b55J87jN9Q1j31K77l71n5N69n15L9Q9J24K9n0j56J85J4o4J03%j25J04k81
4951a44M2J02L6j35j83J95O6J2J65j46l36J2K62R0j72J91M8j02q2o0L57k60J09
4974F7J85o6j60J43k26L2l9K54j17K89l43j9k2P8k45J82j75J17o3j98K54L9K45
4997B12m15R7N7J74r5j41P8J66m16K48j73K40j26J07N0R7J00j45o1q8K64j46j05
5020b1N4j20O8L10m11J02J42n3J1k2qk0rj80J02pr9J3N8K15l06OJ79J89l20J97
5046G0J20j87M8j01n9J76j88J14n9J48J39n16M27k65J69k88K7J61O7O9j27PK4
5069b4j90K74K2N6p9K4k00J13p7J11J40R7l94J21r8L97l97J22K7k5M3j13P4j79
$$ y = [7, -10, 127, 303, 49, 212, -134, -20, -149, -240, -178, -73, 81, 242, 31, 73, 197, -96, -44, 317, 121, 90, 9, -255, -68, -69, -10, 71, -60, 217, -154, -209, 360, -155, -116, -27, 97, 126, 76, -80, 105, 119, 55, 158, 158, 33, 137, -144, -102, 0, 36, -99, -282, -87, -21, -9, 156, 10, -326, -314, -52, 38, -134, 57, 105, 3, -79, -139, 218, -42, 67, 252, 186, 26, 169, -57, -25, -64, 190, 73, 362, 19, 0, -22, 56, -189, -7, -182, -65, -128, -326, -72, -33, 212, -203, -106, -49, 125, 30, -111, -33, 133, -283, -35, -208, 32, -94, 13, 63, 160, 260, 115, 54, -34, 230, 84, -21, 33, -87, -19, 291, -120, -18, 124, 71, 82, 60, 52, 32, 23, -157, -55, -62, -161, -148, -90, 125, -181, -175, 4, 193, -127, 70, 190, 3, 51, -50, -109, 67, -121, -7, -66, 82, 221, -295, 132, -133, 36, -252, -225, -64, 3, 72, -55, -48, -24, -214, 60, 82, 138, 59, 83, -117, -4, -81, 30, 170, 267, -127, -6, -104, 293, -104, 18, 45, 20, 63, -50, 24, -155]
5093a55K58j01m4K64l2q4k92J16K29j04j2n6OKL5j50O7j6J44j56l4J89j45o4J4
5118a21J39j64K32q7M8k4k14J61R4j79R9QN0j50J81rJ98k65M9j56P3q2J66P5k80
5143a58J74K13n3k09j0p5K68lnk92O5L73k56R8l0j41n7K49k12K6K42n9r0n5n1
5168d8L7l9k02L00J10k96J45J46k28Q5O9L1j96QJ03O2j65l9K67k0K2l4k34L03
5192A87k07j95J16j0K56j05j28P8J75k55m7M7K4k83L11J04k69Q6R1p0p8Q9j36
5215b19J67J75o7N7p9k91M78j46k35K88l13M11k48j2r0j8K19j82J71k19J83l3
5237cJ53j28P7L1J28k13K22j48l12J90l33O4L29k73J28L6Q8o4J81k32K43q9j58
5260h3k1K31j29J20K14k79q8J32j29K14k12K9J26k67Q6q4L0r0J89J51j24j6N5
$$ y = [-155, 103, 2, -42, 222, 190, 106, -186, -70, 159, 55, 43, -13, -7, -5, 30, -120, -53, -69, 75, -81, -115, 74, -71, -135, -121, 18, -146, 86, -1, 47, 23, -191, -30, 64, -115, -16, -8, 42, -108, 73, 64, 262, -3, 46, -110, -37, -119, 47, 122, -158, 16, 229, 176, -33, -43, -118, 150, 147, 142, -150, -85, 288, 32, 130, 100, -41, -98, 151, -61, -35, 207, 148, 58, 3, -48, -11, -50, -252, 48, 158, -138, 7, 153, -75, 10, 79, 110, -86, -78, 25, 87, -78, -117, 150, 130, 152, 118, -116, 187, -20, -215, -99, -109, 147, 42, -86, -8, 167, -88, -135, -88, -64, -347, -36, 68, -201, -115, -24, -94, -172, -83, -219, -52, 123, 56, 113, 34, -257, 221, 75, -160, 128, -185, 226, -22, -34, -124, -142, 77, -105, 66, -153, 30, -3, 150, 22, 99, 130, 258, 45, 267, 119, -193, -3, -336, -272, 57, -216, -88, -52, 36, -28, 153, -79, 164, 75, -83, -104, 127, -2, 118, 332, 53, -35, 97, -32, 182, -30, -1, 125, -142, -56, -140, -110, -200, -11, 140, 16, 0, 55]
5283E5j20N5m1R4Jl2L4j2k52K24k91L05m9J11pj73l1J56j51K05k6p4l09J85K15
5308G2l89K30qK59M0k4j15J56q4O8m25J38P2R9N7Kj25q3j63K04P1j14R5q5M3J63
5334A54k21K63j40j81K89l20J57p4j31K01k19J10n7K10J01q0M0J12k94O1J06j68
5356h1L9j9j96J59M9l9J63j99J57m08J05p0M02j31k55L21K44l98J48rj20J06k7
5379e9J87r4L04o51M96j93O8j15k40L26J76K2l41K0M8K38q6n5j36MP1j33P6J79
5403A12j36j00N4J50Q7J4l02K69o4m4q8J22J2k01j06K56L2q5m5k5R4J65k55J3
5427g1J43J07m11J14Q4N3K5m7r2J00R8k56K45j35r2K13j81J42M3m59M11k70L15
5450G9Q4k91K16j52K03k34r3J37K54k08j06J24m2J55j6k76J54R8m07J17K43j97
$$ y = [55, -65, -10, -51, 43, 44, 12, 46, 34, -218, 6, -285, 20, -29, 82, 75, -98, -129, 27, -124, 81, 55, -19, -328, -143, 72, -317, -87, -95, 164, 204, 180, 65, 221, 137, 205, -220, -82, -10, 89, 146, 148, 23, -60, -223, -19, 52, -62, 33, -52, -9, 154, -67, 196, 56, -125, 164, -156, 1, -73, -204, -3, -222, -112, -169, 41, 142, 62, 102, 214, -80, -19, 87, -81, -42, -61, -257, -98, -49, -88, 75, -124, 33, -375, -270, -340, 62, -69, -324, -3, 241, -157, -9, -18, -138, -32, -59, 128, 34, 338, -313, 183, -10, 58, -57, -297, 29, 205, 227, -114, -94, -46, 192, 106, 51, -85, -81, -10, -143, -67, 112, -24, -124, -70, 80, 167, 181, -121, 148, 84, 40, -48, 74, 86, -115, -221, 35, 67, -18, -63, -88, 6, 171, -84, -71, 72, 179, -232, -118, -34, 19, 44, -3, -95, 5, 103, -153, 92, -43, -135, 78, -103, 39, 82, -377, 34, -236, 79, 163, -128, 88, -64, 139, -95, -188, -51, 203, -5, -111, 13, -29, 126, 110, -166, -12, 86, -321, -204, 39, -158]
5472a58L57l33J88j38K75k17J45q2k16J35k5j64L05J3j09j55K32q8pq9j85K74
5494d2K86k90k31K93J5j66R5L12k06N3j8j9K08j95j15K51j66j18j04N2k7O7J73
5517A08K2l4m9P6k25K5j30J86j48K71m44K96q8L05j13o3k4L9P9k2K0L8j49p0J60
5542F6j30j70J39m6K53j29j5j7J02p8M0M5m3j59J35J30N7m15J18J75j18j16K19
5565D3kJ8k37L0K63j22M3K97m04R8J11j60j81J86M4k02K64l6Q4j53m5k50L50j11
5589g2j87R4M09l01K02J49j53m62K66K71l37M4J71k82L65oro9j11L3K20j84m3
5612HK0o7n6j7n4K86m7j94j19J28K7n5M42j59j18j96M54l78J18j6k23K46Oj3K54
5637B77k25k07K70k31K74k43l3L05l48O2J26j68J50K9N8k80K07j05K97l30J08
$$ y = [-158, 199, -134, 54, -84, 191, -26, 119, 37, -179, -44, -69, -233, 72, 85, -24, -179, 53, -35, -42, -131, -316, -42, 244, -46, -277, 16, 31, -135, -40, 272, 66, 119, 101, 82, 290, 95, -20, 231, 65, -53, -157, -105, -132, -65, 108, 130, 96, 47, 123, -102, -77, -207, -21, -169, 102, -342, -46, -134, 171, 58, -5, -29, 10, 89, 67, 87, 125, -24, -94, 66, -64, -234, -95, -141, 112, -17, -32, -49, 53, -25, 15, 60, 17, -142, -7, 123, 180, -235, -117, 58, -60, -176, 43, 41, 59, -178, -148, 115, -7, 36, 333, -71, 27, 138, -22, -203, -17, 27, -175, 89, 53, 137, -16, -61, -311, 39, -72, -259, -165, 244, -57, 145, 294, 141, -321, -55, 216, -121, -77, 94, -188, 177, 171, 162, 93, -18, 15, 235, 51, 8, 28, -39, -95, -112, -166, 120, 73, -121, -240, -112, -85, -140, 302, 143, 25, -171, 283, -95, 23, 7, -216, 30, 36, 23, 277, 52, -155, 115, -116, 158, -85, -118, 187, -161, -99, 27, -141, 9, 38, 96, -184, 23, -82, 215, -115, -7]
5658gR2j89J37J74j5k96M07j36KKJ2j03j95K16j86M00k82m2J21j64mk29J31K10
5682E6j32J20o9J92k77Q9P1j95L02Nk02m0P1q1L63l44O7p3j8L9r0o6L84j56J83
5707A99l08K77j25m1j49J3N9J5k9O2R1l50L49j73J77l17K95k63K05m3J87q0j91
5730a40J22n4L99l40M1O4j19L7K7j53J6R5l3k8j35J23K96j74L1K05l16K4M7k19
5754a84L58j52Rl9L2o6m3J06p0L1r5L37k73P5J2k59L83k68j68K13O6k55L82J46
5778B78m53K27kL0l05J65r8J07J62J43k97J83L8Lk81K0k21L96k67J65M5RLj49
5802i9NL8k7K6K86l36O2L7pk56J41L6j39M28j79P9nj03LNP1J31k03P6j71l2R2
5829d1K13j67M5l28L58j20O0l9J0k95J52J90L9L4LR1k67M4J68j46J49j71J1j18
$$ y = [-7, 85, -104, 33, 207, 192, -104, 303, 167, 169, 171, 183, 80, -115, 101, -85, 315, 33, -9, 112, -52, -56, -285, -154, 56, -76, 44, -25, 167, -110, -21, 50, -145, 157, 162, -40, -80, -9, -90, 273, -71, -4, -77, -95, -56, -146, -212, 172, 16, 199, -109, 168, 43, 2, -147, -134, -75, -60, -89, -27, 64, -286, 63, -110, 67, -250, 45, -218, -13, -56, 131, 51, -140, -18, -72, 327, -13, 28, 92, -27, 10, 37, -116, -100, -5, -38, -66, -201, -78, 218, 44, 75, 280, -36, -12, 35, -184, 174, 22, 31, -8, 24, -42, -85, 21, -49, -18, -113, 224, -49, 26, 38, -221, 162, -106, -274, -61, 5, -250, 132, 278, -175, 52, 50, 80, -225, -60, -158, -51, 111, 254, -43, 140, 178, 181, -100, -80, -301, 95, -172, -7, 38, 47, 50, -99, -94, -56, -83, -57, 229, -107, -45, -8, -15, -271, -130, -94, -233, 195, 16, 95, 90, -13, -10, -5, 66, 197, -6, 70, -101, -133, -41, 172, 5, 50, -278, 80, -40, 20, -19, -9, -304, -152, 38, 77, 111, 114, 205, -62, -18, 150, 4, 153, -18, -7, -125]
5853a25J14J5j91K64l6n2Q3j87MJ89n0r3J93j14j24K06j27j23L39k87N2K79N7
5876B86k29r4J2OLJ35l87R4J90q1J42l21J48J69M8p5J5j20j4J26R9j94j25L33
5900A66l00L84l90M5J58k55K38ok13K09j58K53k14l1J34n9J6m4L4J1K72l44J28
5923C4J90k58L1l49J12L57m2j56j0J45j8m8l0N5N5j05n3K35k6j34J63l54L2L09
5947A35j70Q5q2J69k37K06j86p%K55j10Mj4j33K42l65O9J17j90L44J38k66J11
5970A15j47M1J75k93P6j3J25Q0k17L44n32J5L02j14K41j23j24p6J00j1O6j86m5
5993b01J20r6J38P5k32J55m1L5J96j74R7k8j60J2n3J89O6k57L21j83M24l28m6
6016B9m2LM3j34J51O8j41Q7j57n3qJ83K7q9Q3k24L39j96j7rJ53j46o4K19j8l80
$$ y = [-125, -11, 4, -187, 77, 41, -11, 72, -115, -111, 78, 28, -65, 128, 14, -110, 96, -31, -154, 185, -102, -50, 229, 286, 57, -37, -25, -19, -16, 119, -268, -174, 16, -65, 77, -244, -96, 73, 121, 46, 61, -59, -73, 53, 152, -42, -167, 166, -134, 250, -140, -95, 63, -192, 46, 40, -173, 36, -122, 131, -83, -114, 20, -39, -23, -67, -33, -22, 250, -94, 34, 224, -34, -3, -352, -240, 117, 75, -81, -91, 54, 36, -12, -42, 13, 68, -37, -90, 145, 119, -15, 148, -206, -174, 135, -35, 50, -32, 137, -100, 106, -80, -87, -87, 168, 58, 62, 48, -85, 157, -208, -139, -22, -212, 132, 270, 4, 115, -32, 9, 184, -109, -33, -46, 79, 159, -58, 286, -246, -231, 71, -43, 198, 75, -49, -125, -25, -36, 30, -156, -201, -81, -177, -39, 36, -196, -41, -82, -47, 149, -25, 72, 44, -116, -104, -157, 32, 98, -159, 162, -21, 403, 75, 29, -13, -10, 33, -101, 50, 118, -23, 64, -93, -146, -154, 29, 56, -33, 50, -174, 165, -31, -48, -57, 96, -50, -114, 105, 87, -293]
6042b93L83j85R0r1L16O0l51J38q8q8j20K09K06l43J07j77L54j9k4k47K71j79
6064g1J13J27l4k18Q3J51j35P5j7k26J67k8O2l7j70K14m1j4j17N0mJ81k64K20
6088F7k17J06J49k0j01L6J37J8k86Q4o5R7K15l95K05K3O0j3K14j28k98j6M59n21
6112a90K7l0J78J13r2o5r1P5J12n1j00K57j73R6J23l00N1K90k13K53j69oJk4j79
6137a07NJ43Oj92l2K22J7m7q7k14N83m26J00R2j33J47o4j52m6K11j55K75l23K99
6161A22K7o1r5J80n7k03J7n6K23j42k40J63J64q9l31K86J05j20J48O6k1j63P2
6184ek0J61P0l57R4K35l27M43k87J40k97J53J65j24OJ3l6Rj0j63L6j29J91J28
6208H9p1j48j4J80nk07K2Q9L8n6j49J01K83j97m2j59K68j4N1k45K64j81l7J41
$$ y = [-293, 90, -95, -5, -96, 220, 280, -71, 67, -21, -109, -229, -20, 186, -157, -50, -227, 127, 108, 84, -163, 108, -71, 42, 169, 135, -83, 0, 151, 16, 91, 74, -152, 15, -13, 49, 12, -158, 56, 15, 1, -116, -66, -70, 111, -153, 67, -150, -44, 105, 85, -16, 20, 157, 175, -111, -27, -92, 5, 220, -175, 30, 53, 113, 100, 314, 186, -112, -128, 331, -190, -163, -193, -15, 98, 6, -59, -150, -75, 37, -14, -114, 143, -30, 66, 189, -111, -60, 230, 17, 270, 101, 95, 96, 72, -107, -102, 41, 47, -145, -177, 45, 62, 15, -72, -286, 297, -129, -29, 63, -70, 77, 13, -139, -185, 26, -129, 146, -177, 122, 149, 88, -7, 173, 116, -87, -70, -126, 97, -45, -285, -122, 42, -47, -378, -92, 13, -107, 41, 107, 86, -77, -5, -25, 136, 206, -151, -57, 178, -149, 294, 7, 147, -150, 3, 168, 44, 50, 63, 27, 36, 26, -137, -101, -230, -39, 89, 18, -130, -144, 36, 31, -176, -154, -65, -27, -83, -232, -131, 152, -45, -87, -246, 22, 8, 59, -186, 78, -103, -140, 1]
6232Aj31J91k1j61q6K91k00k30L98j63j45K20J81L5j35j06K37l50N1J95j38J33
6254F7j05l7p4L5K58j35j88J60O8j16K20n9n7r4j22J90l0l8J04j1j54m2l4K63
6278F9o4j77M6J99M8LN6P6k53J68j14k11K99k05J10l3K60l81N9K23L3m11K21O8
6302H9r7J58k25N4J11J3j71J12Q0k44m5J62j56J67r9L91m01L51m09L64k04k6J9
6325fJ30k83R7J31k29K25j39j18K23l5K44j94p0r2L60k40j0R2p0m0m6K9p1K11
6349I9l28J10j57K39K85l77J02k43J77N7p8R2rJ14n9j04L42l58J7%J42l7J28k91
6373a37O6j21K00q3Q2j9J40j54P9j3O7j43l8P5K6r9R8m18M77M6l03K39P1l28K42
6398E2n4M4r2j41L17j46K75k99Rj00K23q1oJ19j27K23j54j45P6q5l9J62RNr6J06
$$ y = [1, -130, 61, 40, -121, -207, 84, -116, -346, 52, -111, -256, -36, 145, 180, 45, -61, 176, -174, -123, 72, -66, 67, -38, -75, -149, -114, 144, 9, -179, -19, 49, -67, 153, 94, 37, -57, -179, 11, -19, -57, 47, 36, -118, -160, -194, 69, 5, -172, -126, 73, 121, 124, 180, 256, 3, 171, 57, -154, 145, -60, 50, 17, 277, -104, -45, 178, 211, -200, 21, 89, -8, 150, -75, -21, 90, 103, -68, 44, 124, -120, -165, -3, -159, 8, -91, 300, -101, 250, -159, 205, 1, -25, -6, 124, -159, -62, 69, -160, 65, -74, -192, 31, -4, 240, 46, -24, -116, 244, 4, -6, 86, 16, -24, -70, -41, -112, 99, -229, -119, -276, -37, 248, -129, -27, -270, -93, -36, -114, -22, -31, 83, 24, -80, 262, -96, -79, -79, 63, 26, 154, -137, -71, -192, 8, -75, 7, -12, 128, -26, 53, 40, 107, -36, -74, 1, 27, -72, 26, -392, 85, 131, -172, 67, 138, -190, 52, -2, 42, -50, -191, 126, -20, 255, -44, -35, -135, 88, 7, 1, 120, -7, 216, 62, -83, -7, -92, -131, 31, 40, 45, -51, 55]
6424E5J2P1l82J37K07l34K21N6j64Q3R6n4M7PO4n9Nj86k2J98L9k63m0J67j8K89
6450B32j56k4m3R1l73J48L71k41J85j82o9L8k0j10K66j45Q7J18n5j24J04j2M3
6473A29k22M0N0q5Q6Mk19K23j4M0R2Om49K98k14L72j96O4j4K8j50K67k85K41R
6498A01P7J4n6k29j29K71L5k59J00M53k10K8m0j76j55K55k52J89k26J20j40L01
6520G2J52k74k0o2k94M06n8n7J93K2j6j18K06J13m37P6N7J53k3j68J36j13K87
6543B33j92l3n6l4L5j7J2j41p7L53m45L35o9J09J7O0k33J28n9J4r8K94Q9l50q
6568a33j02L75j13j71k5P8K1q2K29q4j31J85J34M5j70O3o9r9k1j36L25j06J1k4
6592@p1J46m9J56m21J56J06N5l76K78j2n1P3m7k71K99N0n3j1P7K34k97p2p6K82
$$ y = [55, 67, 138, -244, -107, 100, -234, -13, 43, -121, -38, 58, 4, 51, 58, 122, 63, 68, -118, -140, 58, 97, -166, -206, -39, -57, 232, 76, 52, 9, 100, -273, -125, 246, 5, 190, 8, -61, -23, -43, -153, 113, -32, 55, 173, 118, -6, 98, 86, 129, -93, -53, -3, -88, -2, 2, -217, 6, -8, 32, 124, 130, -319, -21, -235, 137, -59, 5, -9, 19, -131, 136, -149, 92, 101, 178, 192, 136, -93, -222, 49, 84, -175, -75, 378, 168, 196, 156, -20, -175, 80, -172, 17, -209, -89, -229, 72, 224, -50, -70, -132, -426, -20, -78, -135, 58, 80, 64, -54, 152, 265, -172, -96, -39, 114, 91, -77, 59, -54, 233, 41, 8, -48, -82, -47, -64, -52, -193, -270, 83, -362, -27, -96, 13, 30, 90, -143, -15, -74, -60, -158, 136, 225, -125, -133, -235, 140, 27, -144, -169, -91, -70, -152, 77, -7, -138, 47, 181, 226, 56, 119, 50, -49, -70, -206, 119, 13, 24, 0, -71, 75, 26, 182, -239, -83, 23, 78, -298, -20, -32, -83, -10, -57, -328, -29, 21, -32, -43, 34, 268, -29, -101, -177, 105]
6617A05j03j7J45k72J45J63p0m5N6j7J51l07j96K99O0n1l2p7J32l28J55P8rr6
6641a31N0R4l36N18k83J1p2l1L9L82j05j14J14j9k3N9j81O6j63n1J60n2p0J01
6665c7j1L6J42q8R9k74J83k37J42m3Q9k0OJ24j99k46K78j05L32k89J41o5j84K40
6689A4p5R1m9J56Q9j86l8M8J07j52L2j63J32m4K67k76k36M19j63n3K36l79K85
6712F2j9j28J82Q2k58M8r6J13K46k28j08P0K8K13j27j07K18l08OJ43Q2q2n5j9
6736d2J26k83K85J5j24J29j55j45J26m9L79j67J88m80J63L47n57L47K5k6j54J97
6758A45p3o4k35j20N19k55j18K19j5k4pK5K9k6L4R8J08k34k09K88L2k15O9O2n1
6783a8L5k53L98l3o3k1L9J02j84p0J20J76j53o9K04l70N4L4p6R3J70Q3l18j5J26
$$ y = [105, 2, -15, 130, -142, 3, 166, 96, 51, 107, 90, 241, -66, -262, 37, 97, 46, 14, -63, 69, -259, -104, -26, -35, -131, -81, 13, -323, 195, -88, -77, -149, -180, -141, 241, 136, 22, 136, 117, 94, 153, -28, 38, -125, -176, -16, -68, -138, -37, -48, -12, 130, 42, 141, -133, 50, -187, -45, -88, 1, -19, -13, 111, -88, -334, -56, -161, 171, -118, 23, -42, -226, 14, -61, 30, -19, 137, 226, 40, 2, 50, 157, 5, 37, -126, 6, -38, 229, -47, -283, 136, -27, -80, 156, -223, 62, 43, -85, 97, 179, -79, -31, -127, -14, 232, 4, -104, -34, -6, 207, 80, -27, 191, -117, -111, 32, 114, 32, -23, -42, 84, -199, 86, 101, -23, 106, -49, -194, -68, -117, 262, 95, 283, -197, -34, 313, -244, 103, 128, 102, -52, 145, 72, 8, -227, -347, 172, -83, -201, 18, 3, -21, -28, -3, 26, 0, 34, 132, 240, 6, -203, 85, 117, -98, -29, 33, -18, 17, -236, 162, 129, 66, 45, 84, 186, 2, -68, 52, 228, 75, 6, 210, -160, -106, -72, -148, -55, 115, 198, -120, -135, -9]
6808iJ89k20p2J28j2J1m1Q7J12l31j17L66Jr2l27K86K77m65L64k61J98j23J81
6831A30k4k88L07K9m5j05k30O3K62j76j50J48J39L6P5l02R0n7k6K2O8J02r6j60
6855a88J24J29j47J40j95K75j56PJ90k39J44j18P9m1M3n5R3J2K1l6o3p7Q8j73
6879a43q5Q5R4k7N7j88J06K43j37j88L66n59L87JJ06l36L00q2j37K18k08j75j2
6902c14P6P7oL73j53K1j09J52l6j65L8O5j65L07j80j06K62k43J64j09o1K68k77
6925a21L07j8k24O1l3R5k06M7K02l5j40k35L60l8J4k5m0q0J40j57n7K42J47l41
6949a35J89p6J97J04k31J52j59j31L8J3Q2r5J64j20n7J87oj15K9k54k0K46J85
6972A87k10k5J12j08%r2M99l79N3j10J39Kl9j62K08q7L72l74j55r7M59k11p0K77
$$ y = [-9, 180, -40, -112, 16, 4, 15, -26, 61, 173, -158, -275, 91, 92, 0, -327, -41, 236, -229, 135, -126, 72, -51, 130, 106, -182, 125, 154, 109, 4, -226, -163, 99, -77, -227, -79, 60, 96, 171, -131, -41, -98, -124, -102, -34, 68, -28, -188, -64, 65, -82, 58, -137, 138, -18, -11, 179, -60, 84, -34, 45, 4, 47, -8, 85, 97, 118, 82, 19, -58, 30, -143, -228, -143, -49, -76, -19, -207, -101, 142, 5, -183, 183, -376, 11, 12, 118, -218, 82, 0, -137, 81, -127, -302, -314, -238, -161, -167, 206, 53, 74, -35, 117, 81, -84, -46, 19, -146, 161, -19, -125, 137, -106, 58, -51, -112, 156, -121, 186, 168, -56, 5, -28, 67, -139, -92, 110, 75, -65, -300, 60, 22, 36, 11, -29, -109, 31, -126, -183, 59, 206, -135, 54, -22, 175, 279, 48, 200, 41, -90, -52, -39, 43, -52, 112, -8, -65, 122, 116, 1, 30, -224, -244, 2, 187, -23, -48, 64, -44, -44, -136, 363, -16, 37, -73, 66, 68, 29, -133, 75, -12, 360, -14, -169, -266, 193, -18, -88, 189]
6996A89k22oJ6J7j4RL13k85MK5q2j5K10j76J57L0k76l7K37n9k05J57k25L42k51
7021a47n7J87j3j9l03N19k13O7K49n34J02K67j48J3Q3j67l9K77j02p2o3L18k55
7044e0K62m32J61K17k06J57nj49j30j9M13l4p3r6Ok07L44j30j59qk7L26j63K53
7068B51n08K66k53K79Q8k45N9%J1k5r9K29o3o2k30Q2L12k23o7K91J69j53n6o6
7092a3k29K29p0J35j66J66j30J29n3j8J03k29J5r3M26k76J38l3M5k30K28k22Q8
7115f0J85l74M32m8J7j26k10N7O4j24j0J64R9j28j9%J7J14J7Kn5O5k17K16k19
7140a41J15Q7r9P4J21j90k9m2n7P1O7l20O58k66k94N53k95J55j92P2K79l56j35
7163a64L24j90m7K55k83P5MR4j74K31k14J01l1j59l4lN9L55k34m9mP7J24j20r9
$$ y = [189, -33, -39, -23, -6, -20, -11, 302, 17, 21, 46, -36, -51, 159, -17, 140, 170, -106, -143, 94, 35, -170, -13, -238, 104, -147, -204, -17, -30, -49, -352, 167, -46, 21, 270, -264, -162, 105, -43, -30, 53, -114, -153, 124, 22, -50, -113, 205, -50, 212, -220, -59, 158, -48, 109, 104, -45, -175, -194, 219, 185, 112, 16, 22, -185, 159, 29, -130, -138, -165, 161, -2, 251, -257, 9, -244, 35, 123, -122, -63, -63, -52, -77, -176, 53, -10, -72, -302, -220, 92, -131, -198, 93, 262, 109, 53, -13, -242, -13, -83, 52, -114, 52, -78, 51, -2, -20, 83, -146, -131, -224, 202, -74, 64, 31, 76, -154, 74, -148, -60, 125, -249, 183, 135, 152, 26, -184, -127, -63, -187, -197, -33, 66, -62, -81, -81, -64, 50, 67, 69, 14, 79, -138, 78, -141, -26, 61, -38, 36, 157, -33, -62, -104, -161, -90, -23, -343, 315, 49, -245, 308, 13, 168, -24, 48, 327, -29, -164, 160, -30, -77, 178, -105, -30, -26, 68, -106, 125, -89, 12, -19, -178, -212, -215, -156, 199, -35, -84, -88, -11, 113, -7, -106]
7188a06J22K7L7Q8j59l8j57lK88J87k46J04l08J54o2N9j17J01Pj91N6J40J08o1
7212C0p4J2N0J04k67J03j55J97r6N2J29k70J71o5L08m06K90l67oN15l37J05J7
7235D0%j54L04j16j36K47j67J55o8K23r1k54K3J47j05o8J33q7k66K09J4K45k25
7258CL5n1L2N1j20J38k36J66j35M7k13M45m69K28P8j66K02J61k51J12j85M8q1
7281a61N94o17J11L56l41m9o3K09k57L02r9J13o5j08J10K36l33q9P4k04L29r5
7303d7j19L17l1j21J75k18L6k08L88k46j57J05K02K2r0O2r6L2J2m9k41L87l79
7326b64K95p9j78J22K11R3l47J68j42J77k35J48JJ26j78J97j69l3j05J57k4n0
7348a09J33j41K62k7l46L49r8r0J49n2N5j62R1L00k59N9p2Mp7K21l67J43OP8L2
$$ y = [-106, 16, 43, 80, 168, 9, -29, -186, -189, 99, 286, 40, 144, -164, -10, -72, -13, -130, -29, -22, -213, -157, -17, 91, 30, -44, -32, 18, 122, -145, -42, -197, 0, -96, -44, 85, -185, -14, -79, 229, -177, 113, -254, -260, 255, -82, 23, 40, 40, -114, 190, 74, -62, 185, 18, 173, 105, 328, 237, -17, 6, 153, 48, -20, 113, 26, -240, -31, -17, 228, 3, 38, -13, 19, 70, -50, 88, -148, 18, -117, -70, -283, 162, -307, -79, -1, -167, 35, 196, -55, 57, -128, -80, -161, 433, -184, -73, 283, -58, -107, -170, 39, -218, 84, -15, 98, 33, -75, 35, 271, -62, -151, -77, -281, 48, -47, -166, 151, 120, -1, 174, -44, -8, -216, 172, -74, -231, -126, 76, 98, 8, 70, -26, 6, 18, -31, -272, 115, -264, 31, -48, -226, -104, 107, 200, -147, 21, -121, 56, -179, -31, -30, 96, -82, 115, -54, -87, -192, -35, -59, -109, 24, -117, 145, 118, -228, 121, 23, -67, 82, 30, 85, -77, 14, 314, 55, 114, 42, 46, -31, 190, -177, -34, -28, 50, 82]
7373H2J90l85J91J12k99K31r7j82K82j25j39p2L42k48J46P9k92L2k20L65O6n8
7395AK2NK26k10l6Q0R5p3o9Qn7k2J48j24n2J89j18k19J16J18Q7n7m7L3j58J25
7421A1J05j56M4qm9K39p8j51r0L09M7l74M2jj5O8J61j35j37L61l56P5j93K41k02
7446b42J13K14j35J39J06l3j55j77K06k3M8k16J54J75r6m7qk02K92j07j4L1q9
7469f6R6k09J47J09m1j08J45j40K76j62j81K96m9k3oj46J72o5J64l1k29r8R0Q
7493e1J25q7N4j33L48p2m27M48k19M2l7J09j62J88l04J17L9k24L38j84J81j82
7515i3K20j45k49L68j57N9R2j44NO3p9J81J33k56J15R8k09kK8j87J9M0P9q0M3
7540e8K78j71N4J93l30J40k13K57k24k34K23m3K63O3k24j90J99N5j63K12j80L38
$$ y = [82, 272, -113, 78, 190, -109, 122, 25, -157, 125, 0, -139, -211, 131, -117, 29, 108, -184, -152, -372, -7, 59, 1, 23, 28, 254, 44, 8, 88, 183, 110, 41, 49, -8, -30, 118, -6, -58, 131, 13, -206, -90, 28, 115, 58, 11, 44, -114, 11, 116, -40, 4, -4, -53, 186, 108, -43, -133, 176, 223, -151, -109, -110, -125, -57, 104, -31, -168, 193, -163, -88, -281, -40, -242, -129, 85, -50, 89, 195, 162, 7, -170, 36, 13, 61, -155, -1, 174, 78, 31, 23, -179, 113, 6, -8, 23, -66, 30, -179, -32, 77, 36, -72, 73, -67, 209, 47, -134, 162, 113, 90, 84, -62, 110, 45, 209, 178, -51, -149, -59, -51, 74, -13, 41, -92, 256, 184, -243, 205, -14, 28, -9, 100, -62, 126, -178, -61, -22, -246, 92, -92, 89, -93, 127, -18, -267, 101, -56, 3, 95, -49, -44, 19, -60, 121, 254, -2, 113, 211, 2, 0, 28, -159, -140, -100, -21, -101, -58, 220, 49, 103, 296, -34, 106, -107, 150, -74, -308, -85, -128, 135, 198, -26, -216, -17, 38, -125, 87, -93, 245]
7562B45k34J01l5q0K9rj99M9j1O6o3m7N0J61j47p5M49o1p7k49K77k03L4J68J1
7587A50j50m2j2J27O1P3k82J86L8l52L12j28P6K04m28o3L30o0k96L87j69j1J42
7610I3o3n0P4l64K40K14m1o8J52O5l24K28p2ol8j77L9J07O7K8j03L3j9K2n4j9
7636c6L23l57l8n0L46j99J05m9q5J98j95oN9Q1R4q7p1n0Op6Q3k35N14l87j37K20
7662b9l5k0J64l7l74K40J2M3KJ10M8k64L53j91m5L92m70K00lJ57m07Q7QJ04k6
7687A9O8j35j11K75p2M9K22k80L5K9l3j22K4n9L3J22l11L73l23K45k2l9J59l60
7711b14L24l58M63m14K09J9J28k16K18j13k41M2Q2mJ92M1k53M4R0K3J1k75J66
7734c6J55l32K79R3k51J60q3L1l85M24k04L07Q5j0l88L79k21K2L8o1L4j30K19
$$ y = [245, 11, 112, 77, -3, 26, 17, -182, -133, -144, -78, -141, -188, -138, 23, -124, -199, 250, 189, 112, -137, 140, -63, -29, 139, 150, 0, -42, -54, 73, 134, 207, -75, 111, 149, -203, 109, -19, 57, 261, -167, -230, 100, 40, -256, 131, -38, -49, 93, 30, -20, 54, -310, -70, 144, 103, 35, 187, 252, -72, 156, 84, 78, 40, -137, -98, 9, 76, 104, 1, 34, 15, 37, -17, -36, 287, -70, -108, -158, 188, -11, 94, 45, -40, 158, -37, -43, 16, 97, 191, 104, 33, -17, -11, -87, -4, -239, 275, -112, -249, -29, -64, -84, 80, 43, -331, -91, -79, -36, -34, 76, 124, -140, 213, 22, -23, 369, -101, 99, 96, 253, -154, -67, -59, 45, 19, 87, -48, -159, 116, 44, 93, 315, 35, 70, 99, 66, -56, -32, -91, -58, 64, -247, 126, -197, 48, 26, -13, 146, -214, 110, -248, 215, -199, 10, 29, 157, -59, 159, 46, -195, -153, -71, -75, 117, 158, -95, -51, 39, 62, 73, -202, -36, 119, -213, 66, 159, -92, 68, -15, 16, -369, 55, -149, 158, 243, 233, -155, 224, 3, 25, 63, 2, 36, -94, 125]
7757A25k27P8J67j44l7n1K96l92J17K45j87k27K33j03r3J96Q2j57J41j56J21J8
7779D5m4j06K53l6l33K57j00kR2k7Rn6J00j73J42L12n67L58k80J34p6K40l14J44
7803b8L4J10O6k20Q6j9k36L25J24m67j8J83J79l3p4J8j54P9P8k85JJ69OK48j70
7828BJ19l46P9O6n1k1J29N0m0l1j63L81k22k44K08R7m3pR0p4n2Q8j78j63J67l2
7854a91L03j34j8OR4k52J46J85j67O8P1j14j53J64Q4j95J60k07Q5L28l32L35k67
7877aj4J0n0J75q1L1p6j89J79q5M0J15l9J21j3J89m54K85k72J26J06l16J51J81
7901A19q4m4m8J08p0%J47mJ9m25K34J09j39J36L9j58n9J83kp3K18k81k1J13J16
7926A33L2j64k0r0J44J67K0j50k61P3K48k13l4R5J60j48M4j91J94j03j8J51L5
$$ y = [125, -102, -24, 143, -1, -38, -89, 207, -185, -68, 177, -10, -237, -4, -107, -200, -4, 78, -79, 62, -94, 27, 45, 1, -105, 148, 112, -221, 36, -64, -66, 26, -1, 8, -48, 52, -121, 21, 333, -234, 124, -156, -22, -98, 142, -172, -28, 6, 116, 182, -38, 48, 29, -207, 118, 242, -225, -243, -60, 119, 86, 12, 30, -124, -45, 33, -252, -251, -82, -76, 172, 2, 121, -225, -146, -80, -131, -152, -23, 27, -13, -44, -207, 174, -48, -292, -84, 13, -30, -37, 53, -21, -73, 15, -163, -326, -159, -191, 112, -22, -40, -34, 60, -192, -46, 139, -28, 40, 111, -3, -156, 8, 92, -103, 57, -150, -65, 263, -69, 266, -1, -15, -5, -55, 120, 39, 70, -6, -195, -16, -101, -61, 54, 15, 136, 123, 312, -142, 143, -129, -3, 103, -213, -62, 119, 35, -9, -57, 51, -19, -19, 128, 124, 143, -282, -48, 61, -78, 58, 97, -61, -120, 63, 61, -12, 206, -75, -96, 17, 133, 165, 1, -19, -109, 35, 202, 222, 72, -189, -116, 132, -81, -115, -20, 140, -8, 36, -155, 39, -64, -82, 69, 104]
7949A04q7L1j74J41k18j56N86l25L21m89Q3N1K25j46P1m2J78j80K34k18Q5j24
7971d9m4J42l0J44k29Q6j81j9J12k19J5J82L08k50j26J55j24J64q5Qj95L21j54
7994f8K02r2k04K73j86J34o1J9m8j4K3k38K60J13M1J26k99j59M4K21P3j78j21
8017a39J73J5J27k03J72j73R8m6J74k02Rp0Q5J7K07j23K06l78L6L28j66j9l57
8040b29J66j62J37L0K66m5l30L06m96L34K92l26n6K34j17m3j5N7o4J07km6Q5J2
8064I5j88n9J87j60J6P7j04R9nk0qJ9J81k10N3K18k33J05J96l65M5o8J99n2Q6
8089A04l1l7N2j34k7O6K36j40j86K50r8l1n9k11R4K18J09l5q0j07j37K9J08J07
8113F0J04n0j64K4O2l6Ol1R8j32J97n17K23K39k40J82j5J64k53M9J32Q8l00k47
$$ y = [104, 17, 48, -126, 15, -203, -359, 227, -98, 223, -266, -183, -132, 93, -53, 18, -24, 154, -26, 208, -10, 75, -49, -93, 49, 19, 163, -66, 20, -161, -180, -68, -287, -272, -90, 218, -32, -158, -3, -127, 37, -48, -40, -235, 86, -68, 134, 42, -162, 111, -75, 59, -2, 17, -31, -45, -22, -260, 0, 113, 154, 280, -19, -178, -134, 87, 160, -18, -139, 34, 49, 176, -27, 145, -28, 70, 24, 198, -4, 5, -65, 20, 37, 244, 121, 327, -51, -15, 313, 147, 128, -229, -63, -225, -88, -58, 208, 163, -167, 139, -357, -23, 269, -57, -113, 121, 4, -39, -54, 3, -61, 46, 44, -2, 83, 95, -93, -152, 35, -125, -109, -32, -136, -37, -42, -62, -70, -51, 130, -80, -27, 191, -42, 63, 259, -106, -61, -129, 70, 18, 104, 73, 36, 88, -46, -73, -7, 229, 89, -97, 153, 55, 24, -35, -246, -152, 66, 175, 140, 60, -47, -184, -155, -47, 60, 164, 114, -50, -26, 36, 0, 6, -25, 73, -59, 138, -379, -156, 83, -157, 25, 10, 174, -79, -30, 102, 190, -110, -357]
8137c57P8K96j03J2J57J44k03j57K53k07J3J67q3p2J28k82K63Q7j21k76K22P7
8159C6J85k32l2M1p0j7L7r0J70j95K25J31j52r5N9J56j21j86j19L56l92K14O9
8182b2J86k08P1J2K2j47L09m71L2
$$ y = [-357, -279, 17, -86, -74, 83, 227, 24, -133, 120, -87, -74, 93, 10, -62, 66, -216, 47, 134, 13, -263, -41, 36, 221, -11, -43, -2, -72, -89, -52, -142, 28, -167, 58, 189, 37, -58, 1, 157, 36, -150, -269, 87, -305, -91, -22, 164, -44, 27, 39, 61, -86, 223, -248, -216]
8191b16
$$ Imaginary data points
##PAGE= N=2
##DATA TABLE= (X++(I..I)), XYDATA
0@%%%%%%%%%%%%%%%%%nJ3j6J6j6J6k1K9l2L4m2M8n4O3p2Q1r1J04j16J29j45J63
39H6j83K03k25K49k76L07l40L76m14M57n03N53o09O72p41Q18r05J003j116J247
59F59j402J589j817K102k472K973l698M838o898J1775m2830k5411J22424L4901
73I6733o9717m0123M8686J6043l8557m713M8204j0669o7921j990P8709J9146l4797
86C9034K5970M2868n2594p4831K1554O3617j1698m4461J2674K4324m3938m9099
98d6580L6364N3223l0273m1446K1539Q807m3546j439O5449K4944m7208k6253K2921
111c498j756m1414N487O4341Q917n9196r822M0930m570k8737K7670M0484k7716
124A1120m6696J2663L7294o574j5740L5054K4747n5701n2540K7578K9163l0837
$$ y = [0, 0, 0, 0, 0, 0, 0, 0, 0, 0, 0, 0, 0, 0, 0, 0, 0, 0, -5, 8, -8, 8, -8, 8, -13, 16, -16, 18, -24, 24, -30, 33, -39, 42, -49, 55, -61, 68, -77, 86, -97, 106, -119, 130, -146, 161, -179, 197, -217, 240, -263, 290, -319, 353, -388, 430, -475, 528, -588, 659, -743, 846, -971, 1131, -1341, 1632, -2066, 2772, -4126, 7649, -35181, -60592, 61832, 96733, 27016, -13107, 35579, 51622, 13065, 8352, 56556, 45887, -22034, -24024, 54685, 73831, 39034, 65004, 107872, 55278, -19553, 2001, 65618, 53920, 9459, 22133, 46457, 2519, -46580, -10216, 43007, 12734, -28712, -7173, 1634, -41912, -43351, 22098, 47042, -166, -26419, -3498, -5254, -46668, -41181, 23160, 32077, -27119, -36941, 3989, -581, -29318, -1648, 38836, 11120, -35576, -22913, 14381, 7807, -7933, 27121, 51868, -3833, -56373, -28795, 368, -30469]
136c0469j3445M3236J4840m1320q926N0133K6152l1783j8936J9311j9799n7896
148f8902N55N7217J0999l2325J5143M2714j4252l4252K5570M6863j5127m8583
160a4380K722K9236j9037k4677M0296M3910k8783l6364K3840K0426k9380j0616
172b807M0032J7943m1851k7444L2541J7986l3943r709L6126j792n2604j0134M0656
185E000P508k6088P294K8570j5411m1451N667L6176o174k9135J4150K7915k3420
198i399k8412K8315L1743k2447k6591J4733J1597k5599j0716L6820K6418k0758
210E704j3212K4929M009l5322m166L1394m590l6902j211L1610K836j7786J8165
223E458L6016r385l6935J697K3593j7978k7134K0899K3958k3514k1061K6783K4194
$$ y = [-30469, -43914, -678, 14162, -27158, -36084, 14049, 40201, 8418, -10518, 8793, -11006, -68902, -68347, -11130, -131, -32456, -17313, 25401, 11149, -23103, 2467, 49330, 34203, -14380, -11658, 17578, -1459, -26136, 14160, 58070, 29287, -7077, 16763, 37189, 7809, -2807, 37225, 55168, 13317, -14127, 18414, 36400, 2457, -7252, 28874, 27082, -25522, -35656, 5000, 12508, -13580, -6286, 22284, 6873, -34578, -28911, 7265, 1091, -28044, -13894, 14021, -9399, -37811, -9496, 22247, -200, -26791, -12058, -461, -26060, -36776, 44, 26462, 5704, -7508, 17421, 21430, -13892, -18058, 13336, 8746, -28156, -29367, 2243, 5079, -12707, 5458, 41474, 32089, -4846, -3149, 20444, 2466, -24668, -3769, 20189, -3325, -24386, 2397, 26591]
236B6591j9643j5121K2952R486l4588j9830L0081J7155k8192p456L0972J841l4591
249b0343k297L2230J701k8688J669K7455l503k7768R852L4733r128l2599R263
262g423K5408j6286k3096K2017K7856j6467k1551J6085J7824k1267k1345K0433
274B188J6228k6661j5176K7920J5558k3245n491K6931J938l2119r679K1667J783
287A842k6065P60L0900J154k4103Q188K7886q788k6942P400J8183j6315k0933
300b6833J6031K3016j0915j4749J9197J8991k0639j7848J9533J1410k5246j0355
312a8407K5487Q992k0338k065K4138M171k4101m128K2489k431k7111K383K6012
325A5091n234k4091J0948K3230j3008k2919J0278J9414j3739j9489J5852J9891
$$ y = [26591, 6948, -8173, 14779, 24265, -10323, -30153, -72, 17083, -11109, -18565, 12407, 14248, -20343, -22640, 9590, 11291, -17397, -15728, 11727, 8224, -19544, -9692, 25041, 15913, -16686, -7423, 17985, 1699, -21397, 620, 28476, 12009, -9542, 6543, 24367, 3100, -18245, 2188, 18416, -8245, -23421, 4499, 20057, -3188, -8679, 18252, 20190, -11929, -21608, 59, 1842, -24223, -23463, 7437, 8591, -15512, -7324, 20562, 11774, -15168, -7768, 10415, -5900, -26833, -10802, 12214, 1299, -13450, 5747, 24738, 4099, -13749, 5784, 17194, -8052, -18407, 7080, 16072, -4266, -6331, 17807, 21978, -2123, -6251, 16238, 13807, -13304, -10921, 15091, 9857, -14234, -3286, 19944, 6936, -15983, -5705, 13709, -30, -19519, -3667, 16224]
337A6224j7443j8822J8274J5799k3213j5205K2349R149k2503o357K7155J1739
349A7146k0485m739K2892J552k9129n033K4676m96k5546N148K6205m217j9519
362a1545R967K3079r444k4500N834J6933j2820j9073J6250K2042j5251j7155J7698
375B015J3347j8349j1269J8384R560j9737q843K0686J1126j6017l842K1814Q49
388A9724k6644m393K0252j497j8939N070K0381n308j8743P298K0485o474j9522
401h310O221J4570j5369j7846J6308J7768j3403j2826J4700Q575j8361q511J9424
414B940J1695j7311q139J8984O435j9334j460K1651j107k5223l304J7065k931
427c9j5980Q302K1650m041k0544M667J8267r278j8509R998J3648j6482j7765J4649
$$ y = [16224, -1219, -20041, -1767, 14032, -9181, -24386, -2037, 7112, -15391, -21748, 5407, 17146, -3339, -8078, 14814, 16366, -12763, -17796, 6880, 6384, -19162, -14014, 12191, 7974, -11545, -1578, 21501, 12057, -12443, -6609, 10324, -2496, -21569, -5319, 16723, 1472, -15683, 2015, 15362, -2987, -14256, 4128, 13688, -6049, -14892, 5794, 16920, 903, -2939, 18875, 19724, -6920, -11313, 8939, 7442, -11497, -6427, 13954, 8646, -10097, -2799, 17686, 11212, -8310, -2089, 12481, -2888, -20734, -4426, 13342, -61, -12887, 1813, 10388, -7973, -16484, 2940, 14635, -2676, -10815, 8169, 14604, -4730, -6190, 15461, 14354, -10869, -14173, 2892, -39, -16019, -7717, 13933, 9892, -10652, -5985, 12282, 3004, -15505, -5507, 8141, -8341, -26106, -11457]
441a1457J6723j1006q844J5410R569j8537j2051J8804J2708j5520o110J9078L648
454A2415k0647j308K1704K209j9365j497J5921k112j7115P953K4693j879j9335
467A637M313J4726j1735j7620J1556J4839j3840j5871J0057J2754j0745q547J6177
480G701R699j9286j4246J3834P418j5730k866J8372J091k0146l128J6317K419
493A449j5004J442J6249l899j7917O140K2360j384j4300Q491J2283j2896j5243
506a2229J0975J5408q980j1717J1069J0262j3049q950J7246J0870j7803j0137
518g035J2639K182j6958k537J8086K617j9194m989J3291n44j5296L468J9350l252
532A828j8131N224J7040m468j1912Q764J2296j1511j5778Q300J4618n324q161
$$ y = [-11457, 5266, -5740, -14584, 826, 10395, -8142, -20193, -1389, 11319, -4201, -10311, 8767, 12415, -8232, -9540, 12164, 14373, -4992, -6489, 9432, 7320, -9795, -1842, 22851, 20972, 1637, 5950, 20676, 8941, -8679, 2877, 17716, 3876, -11995, -1938, 10816, 71, -8476, 7701, 17400, -1886, -16132, -2298, 5120, -10610, -13476, 4896, 5987, -14159, -17287, -970, 1449, -13555, -12113, 4136, 237, -17680, -11540, 10820, 9436, -4864, 3627, 15910, 3014, -12229, -1254, 14154, 5174, -6543, 4526, 14788, 1739, -7211, 10035, 20905, 3102, -7035, 5604, 7786, -9172, -11709, 6377, 8994, -10200, -15189, -1898, -2442, -17738, -14270, 5080, 1828, -16303, -11079, 5961, 1493, -10419, -1655, 10641, -870, -16648, -8348, 6270, 946, -7215]
545g215J4533J1583j4082j0129J4721R153j3718p556J1461J851j6657l225J7254
558G974O271j4260l708J3249k757j8047K644J7303k987j5865L117J2463n710j1655
572a1968Q332J4176q459j5401O064J1791r326q318J4548J1321j3478r654J2836
585B464O901j1189l528J3278M031j5577n775J5186L938j2696l77J4650l004j6602
599h300K503J5813j585j1871L658J0510p597j5558O008J3256p719j2739Q241R768
613D388j1227p451J4168J0319j1509q954R109L927j3082m786J5170N917j3302
626g313l110J5409K547j1987K926J4781k982j5359K03J2132k017j0934O237J3502
640A4035o131j3521O269J2057p735j0550Q987O762j1954r291J0260R114r192o164
$$ y = [-7215, 7318, 18901, 4819, -5310, 9411, 18564, 4846, -2710, 8751, 10602, -6055, -9280, 7974, 14245, -15, -3723, 9526, 6769, -11278, -8634, 8669, 5682, -10183, -7066, 5397, -313, -11968, -3636, 10540, 2081, -13320, -7256, 4535, -4791, -13109, 1439, 12760, -718, -10372, 2464, 9365, -1824, -5352, 7926, 11957, -3620, -9395, 5791, 9729, -2967, -3344, 11306, 8302, -8300, -5797, 10016, 8431, -3440, 218, 10728, 3131, -12427, -6419, 6837, -882, -13621, -5380, 4388, -6839, -14290, -122, 10197, -1312, -10266, -1157, 2770, -10312, -15098, 72, 5989, -7313, -10423, 4986, 7533, -4454, -1528, 13253, 10271, -5088, -4885, 7247, 5230, -5704, 533, 14035, 7904, -5617, 652, 12709, 4974, -5576, 3411, 10173, -1781, -11072, -812, 8302, -890, -7054]
654g054J0814M721j3318n332J3955M242j3089k303J1569q14j2242J426J3752q5
668F242j1961J437J1479l348j1350M997J2418o911j2731N544Q948p534p403R837
682c36R680q710q093Q853P290j0061o496J0991M294j3812m428J2531M119r488
696c666J14J2196K97j2903q45J1259j131j2324J202J1444m612j1187O022J2430
710H296m434r639N663P765q062q724O739Q526p560q471R291P237r223m096J1732
725E040N283j1357m261J0148J551j0947j311J1060Q54j1473k68J2099m01j0935
739d918K975J1065n042j1591L900R229n835q866N741R067o028q614Q359R209p536
754A115p085Q762N025j0617n090J0053L952r460k488J0013L476r898j395J1420
$$ y = [-7054, 3760, 8481, -4837, -10169, 3786, 8028, -5061, -7364, 4205, 3391, -8851, -7425, 6327, 6242, -5719, -4282, 7197, 3849, -7501, -2504, 9914, 3003, -9728, -4184, 4764, -2770, -10173, -336, 9344, 634, -7459, 1394, 8684, -1377, -7873, 3118, 7412, -6400, -10828, 1703, 5822, -3666, -3552, 8644, 8941, -3962, -4807, 6452, 5321, -7003, -5801, 5643, 1031, -10156, -4134, 8296, 3862, -5777, -114, 7651, -411, -9135, -2396, 6130, -1430, -9901, -610, 6627, -2596, -6692, 5040, 10323, -1034, -5295, 4853, 6404, -4543, -5854, 5206, 6060, -5413, -5681, 6418, 6017, -4918, -1943, 9122, 4080, -7511, -3611, 5618, -217, -9083, -3342, 5725, -303, -8917, -558, 8651, 1115, -5970, 2792, 7817, -2800, -7890, 2163, 6115, -3345, -5833, 4180, 7656, -2242, -3637, 7783]
768G783O55j1521q92J0013k427j0800K699J0198l075q769M083R326m494q854N248
783h27P808p216r220O308P078q211n768R530N199q000l867Q725L964r496l662
798g655R018J674j0094j701J0876J107r510K380J0445j100q765K301R159l353
812D782r154L240Q765m098q146O223Q894n776o706P444N539q169n884N936L787
827F677q610m411P740L916q719k867R163K259r904q86Q735r46r487J98Q908j356
843D10q247K678R003j430q384L822R613m731p434N355O594o850o903O344N892
858E732o648n104O857M963p395m469Q574L014r743k934P291Q57r272m17R141K85
874G32p686J182Q907r63q092K272Q555l532q123M038P815l209n797O627O846m764
$$ y = [7783, 8438, -3083, -3975, 6038, 3611, -7189, -4490, 5708, 2633, -6136, -2053, 7273, 2779, -6075, -827, 6981, -235, -9455, -3147, 3931, -4280, -10048, -518, 4681, -3319, -7186, 1539, 5503, -3993, -7655, 1363, 3037, -7057, -8758, 2118, 3225, -6285, -3905, 6540, 5440, -3325, -1024, 8135, 4782, -4372, -1132, 7633, 3535, -4611, 1612, 10506, 4730, -1976, 5468, 11007, 2838, -3046, 2890, 6677, -1933, -6344, 1396, 5312, -3407, -6274, 2889, 5148, -4756, -5642, 3093, 2147, -7340, -7142, 1766, 410, -7837, -5159, 3844, 2414, -5970, -2148, 7465, 2734, -4700, 655, 7249, 399, -6504, -160, 5732, -916, -6020, 837, 5800, -1595, -6064, 2510, 5524, -4219, -7153, 138, 995, -8277, -8694, 447, 732, -6954, -5772, 3135, 2172, -5920, -3648, 4907, 1375, -6748, -2710, 5105, 1896, -3901, 2726, 9572, 4808]
890D808n515N398N121o124n458O807M076p694l199Q173L392p701j858P800l81
905G645q775j502O985n14q473M90P591k385q450K847P583l399p672L589O089n040
921c391o169M471O197n510n856N427N167n581l571Q066M748o994k390P392K344
936D350p015j102O879J034p516q42Q398P52o614J926P569k350p891K181N785l350
952B194o514L151O055m256n692M739O279m716n311M713M027o974m060O966L823
967D424n501j860O887K310o542j162O803J191p653j146P152n13o690K204P705
982G609k274p081J837N589l397o426K768N598m714o152M036N132n237m072M978
997a806L548n780l619N734L531n257j963O205J473p171j973P447P91o468O36P067
$$ y = [4808, -707, 4691, 9812, 3688, -1770, 5037, 9113, 1419, -1780, 6393, 9785, 2084, 226, 8026, 7645, -1130, -2632, 4353, 3839, -4634, -4144, 3447, 1062, -7388, -4541, 3042, -357, -8029, -4440, 1649, -3391, -9560, -5089, 1108, -4402, -10258, -4831, 336, -5245, -8816, -750, 3998, -2996, -5386, 2006, 4350, -2665, -3767, 3112, 4146, -3370, -4212, 4186, 4938, -1676, 250, 7819, 5469, -2422, -241, 5544, 2194, -4320, -1169, 4886, 630, -5062, -323, 5956, 1240, -4071, 642, 4669, -2305, -6365, 601, 4424, -1077, -2937, 3950, 6260, -282, -1444, 5359, 6550, -1103, -2249, 4903, 4390, -2300, -96, 7609, 5335, -1746, 91, 5680, 2283, -4143, -1375, 4223, -491, -6643, -2607, 2525, -2712, -6784, -1806, 1742, -4038, -7657, -1923, 1608, -3649, -5612, 593, 2066, -5105, -7078, 369, 1160, -5308, -4672, 2395]
1013B395m29n962K287P184k071o009J412N285l500n820L719O773l630m609M597
1028A622M908n205m032N276L010n739l881N578L014n059j630O653J361o895j434
1043b453N718l54o458N18O477p66n876J447N893j127o003J926M813l624n816L341
1059b344N780l383m052M492M091m735m008M627L385m675l323N189K287n355j709
1074c733O416Q04o330r23N233p42n506R20O499k62n838J585N292j827n755K542
1090a625N140l714m807M068M316k551k979M231L402m569m042M158K480m567k506
1105c565N349K014n481r96N361P55n319j024M528j23n820M50N910m8m947J524
1121a432N454k508n421K844M548k993m317L164M150k803l457M259L923m671l856
$$ y = [2395, 1966, -3996, -1709, 5475, 3404, -2605, -1193, 4092, 592, -5228, -1509, 5264, 1634, -2975, 1622, 6530, 1325, -2707, 2569, 5579, -160, -4041, 1537, 4551, -508, -2138, 4515, 5876, -1019, -2453, 3265, 2911, -3547, -3029, 3448, 2682, -3194, -1747, 4146, 3019, -2984, -1058, 3755, 131, -5685, -2344, 3436, 53, -3999, 493, 4584, -151, -4159, 468, 3853, -822, -4145, 1044, 3331, -2024, -3733, 2683, 3487, -2843, -3766, 1467, 725, -4781, -3861, 2638, 2376, -3462, -1877, 3415, 1588, -4167, -1625, 3515, -199, -5006, -938, 3378, 827, -2152, 2079, 5481, 912, -3130, 1028, 3508, -1059, -3565, 1784, 3798, -1683, -2679, 2682, 3437, -1882, -2906, 1622, 1499, -4321, -3871, 2039, 1991, -2956, -1432, 4022, 1514, -3907, -1063, 3485, 492, -3825, -661, 3489, 686, -2771, 1488, 5411, 740, -3116]
1136c116M159K343n168j877N303J679m586j463M831O69n367m26M420r1n504P29
1152c465N719q13m278K236M323k260n158K210M300k914l380L132M000k808l582
1167b738M053L273m709k733L882J294m730j472N093J759m171q02M465O33n289
1182b192m30M786o06m941J344M903r67l987K328M433k373m509J710L732k763l711
1198c243L536L895l284k989L665K217m475k541L655J074l974j690M205J967m220
1213b202l64M295O4n031m16M440p32m099J541M432q29l572J373M283k216m253
1229c286K075L430k872l032L535L430k849k371L763J840l852k091L301J624l943
1244a298j016M442J149l741k00M277m62m859L6L750j026l688J186M105q68l796
$$ y = [-3116, 1043, 3386, -1782, -3659, 1644, 3323, -1263, -2726, 2105, 2774, -2593, -3019, 1401, 1310, -4194, -3465, 2254, 1441, -2837, -601, 3722, 1462, -3696, -1486, 2814, -100, -3480, -348, 3652, 844, -2738, 1315, 4588, -121, -2854, 1028, 2322, -2408, -3880, 1213, 2972, -1199, -2001, 2464, 3097, -2192, -2622, 2164, 1558, -3383, -2039, 2864, 1897, -2090, 238, 4671, 2298, -2211, -501, 3231, 468, -3243, 293, 4188, 904, -2085, 1580, 3797, -678, -3219, 436, 1510, -2464, -4154, 51, 2018, -2202, -2566, 1729, 1793, -3238, -3654, 786, 54, -4045, -2504, 1928, 1099, -2473, -1100, 3183, 967, -3286, -1211, 2219, -653, -3685, -150, 3280, 431, -1940, 1823, 3663, -189, -2280, 1021, 2645, -1298, -2314, 2128, 3277, -464, -664, 3613, 3151, -1708, -1672, 2078, 1052, -2636, -1450, 2655, 1787, -2009]
1260b009J696L239k268m262K260K968k839k645L394L045k708j721L066J972l758
1275e70k118L451J563l429q98M415J030l271n9L814n36m196r3K928p49l751J266
1292a203L551q50l930J513K890k798l675K079K461k668k410K935K684k686j635
1307c742L057J726l406j966L750J362l300J04L891J284k881n6L850j06l859M9
1323b43L180p11l001J289L738j048l464J788K650k622l609J921K048k383k000
1338b467K179K668k620k154K730R93l686j405K739J071l084J5L457O71k757J47
1354a503L196m38l602K64L340q54k851J959L295j252k483K004K287j876k674J535
1370C47K815k408k032K597K076k750j495K224J257l615j478K559P89k567m16K873
$$ y = [-2009, -313, 2926, 658, -3604, -1344, 1624, -1215, -3860, -466, 2579, -129, -1850, 1216, 3188, -570, -2688, 763, 2326, -1103, -2001, 2414, 3444, 173, 114, 3928, 3392, -804, -897, 2031, 1282, -2469, -1203, 2348, 1498, -2432, -919, 1971, -827, -4502, -2423, 38, -2630, -5040, -2105, 579, -2107, -3742, -685, 1041, -2365, -4331, -581, 781, -2519, -2415, 1476, 2760, -121, -177, 3673, 3567, -292, -243, 2937, 2226, -775, 514, 4252, 3204, -260, 1528, 4178, 1556, -2053, -132, 1916, -467, -2467, -288, 2380, -240, -2394, 336, 1329, -2357, -3762, -1023, 48, -3036, -3021, 436, 1107, -1650, -1503, 1693, 1255, -2347, -2083, 1257, 403, -2448, -489, 2806, 1554, -929, 1075, 3362, 1486, -1188, 347, 3162, 754, -1278, 1319, 3395, 645, -850, 1374, 2631, -984, -2462, 97, 886, -1681, -2097, 776]
1386G76O39l367J45K502o46l626K27K719n88k564K010L121o26k347J390K177j619
1403C23k610K157J977k054j433L015K106k397r11K120N59k898q23K085N12k746
1419a018n0K897M87l376Q1K563j076l056L05K310j160k070J405K875o97k047J471
1436a56J807j828k013K065J720j850j253K560J419k294n28K173Q68k770o53K390
1452A657P59k417l02K906n9k948R7J850q48k876R19K389j042j833J387K584j408
1469H15j882J010J803k707j975J587J809j975j070K343J444j975q36K086P46k885
1485a662p67K408j8k267M69K883J84k650N96K240p33k321N86K157m94j973J528
1502A66K230j187j524J633R79j670j995J351J484j933q14J838J382k115p52J756
$$ y = [776, 1415, -1952, -1807, 695, 49, -3577, -3350, -631, -1219, -3783, -1773, 1348, 722, -1625, -235, 1942, 323, -2287, -130, 1847, -207, -1640, 1375, 3481, 1084, 173, 2293, 2852, -46, -869, 1216, 1728, -1018, -1068, 1829, 2316, -1060, -979, 1584, 508, -2548, -2243, 67, -1093, -3163, -1758, 1117, 420, -1627, -156, 1651, -177, -2190, -125, 1595, -255, -1508, 1052, 2471, 177, -351, 1822, 2690, -80, -733, 1657, 2416, -1, -303, 2603, 2544, -404, -307, 1543, 695, -2181, -1262, 1127, 85, -1748, -361, 2223, 815, -1067, -57, 1746, -961, -2936, -1349, 460, -1515, -2585, -242, 1202, -773, -1609, 477, 1223, -1662, -2429, -21, -39, -2306, -1837, 1046, 1230, -1420, -824, 1416, 683, -1638, -1052, 1105, 611, -1362, 166, 2396, 1209, -315, 1318, 2297, 627, -1368, -17, 1467, -466, -1280, 558, 1940, -175, -927, 829]
1518H29N22k124n94K289K4j874K79K073J36k695j3K099n43k056O05K685p37j707
1536h02J529J525j451j937J732L70j921j451J834J132j469l53K179R68j638j410
1552a163K127j93k220m82K101j2j388J42K415M90k449N37J973j051k406L53K237
1569A011j022j394J512J453r59j452J005J005j340j662J572R07j353r99J964Q89
1585A137j980JJ668M66k229j15K102K10j825q8K197l07j890J70J854r45j584N51
1603f07J778o09j463R68J294r84j790N68J236j617j015J601J176j384l17J721
1619E56M79j115l66R28Q8j566k91J748M37j059N76K038n13j689N09J018j174j378
1637g74O05J136r77q84J235J390q51j313J014M58j506j080J258L73j277m97J812
$$ y = [829, 1351, -773, -1367, 922, 946, -928, -649, 1424, 1560, -1135, -1148, 951, 408, -1648, -1043, 1642, 905, -802, 727, 2252, 801, -1136, 596, 966, -955, -2406, -572, 560, -909, -1262, 917, 1885, 247, -1163, 964, 771, -1449, -1931, 170, 158, -1230, -1088, 1327, 1817, -632, -95, 1878, 827, -1579, -1226, 1011, -11, -1405, 107, 1560, 601, -851, 154, 1159, -181, -1843, -271, 636, -717, -1716, 248, 1137, -843, -842, 826, 1292, -937, -1052, 1050, 1260, -565, -653, 1544, 1237, -653, -483, 1371, 426, -1158, -607, 1171, 562, -901, 67, 1361, 377, -1413, -845, 391, -1226, -2241, -640, 536, -848, -1165, 556, 1035, -80, -446, 482, 570, -996, -1287, 461, 898, -161, 415, 2453, 1940, 251, 760, 1778, 604, -774, -169, 967, -10, -894, 341, 1731, 880, -433, 581, 1039, -467, -1547, -289, 84, -1193, -1690, 122]
1654A22L32j248K2J373M20j818r8J703Kj569J68J479p60j585N40J561m72j587
1672a415R87J327o64j058J043J256j579r33P16R01j336j276J847R13j027l19J360
1689G43M87j404p09J354r2j411J30J709j63j038N34J050k21j589L32Q24o52j251
1707a367Q05J513l51n00Q69J143r69q95Q04M26j296j074J089M93j033p9J264L40
1725A182j088k40Q52pj605L05P41m57j583M49R73n87r09N82J121l07r11R69J282
1744G62p16p98J128P49j159r82J200M02q49j95J294P36j295k04J543J14j549j87
1762fO87j08j452K43J064k16r38P6J142o28j072M33R86p73q08M86J546p53p46
1781h37J204N82l16j364Q30M31r66n80R85O95o36j06J178M18j073q0P07j49j416
$$ y = [122, 454, -794, -772, 601, 1021, -797, -895, 808, 810, -759, -591, 888, 128, -1457, -917, 644, 172, -1415, -428, 899, 235, -823, 220, 1476, -103, -1036, -320, 581, -755, -2031, -184, 729, -298, -617, 743, 1230, -174, -883, 471, 379, -1032, -902, 807, 644, -394, 140, 1190, 969, -620, -288, 536, -116, -1367, -562, 951, 600, 100, 969, 2112, 1143, 248, 1052, 1478, 182, -892, 197, 690, -343, -422, 842, 1182, 94, -146, 706, 699, -906, -601, 140, -317, -1900, -1451, -478, -1065, -1974, -1392, -271, -578, -1489, -520, 762, 46, -752, 376, 1125, -34, -1016, 184, 586, -263, -458, 836, 1572, 277, 73, 1616, 1730, 181, -6, 681, 573, -879, -636, 428, 212, -726, -650, 492, -136, -1208, -775, 211, -562, -1370, -884, 662, -91, -837, 367, 949, 633, -731, 99, 530, -436, -1016, -31, 664, 28, -78, 1100, 1518, 445, 365, 1072, 923, -493]
1800d93k28Q26J09j200J36J145k52n26L84R57n68p52O44L72o28j056O31O67j241
1819a073l58J061M32q57j28J277Q8n85k3O52K61r93j10Q03l46q29M48J173j62
1838G31p03M74P73m51k99o4N25k70j121O41Q33n66j071R62N24j258q81R26K15
1857h0j184j45J248K00p96j35J316l16q72J03N45K73j273K35J186j06q05L77J394
1876A165m92m66L12O60q6j216k1R82n40q59M86M83m30o74P52M64q07k46P93L16
1896E76p26k82Q37k96o77o4M59j37k52L2J013j52o59O21O53m65p84L71M17n86
1916a01o46R55J07k76m39N92O4l89q5L36J63m90m31R69L70q26j43R12l23q31M72
1937d0N00m59m10L62O31k38l80kQ37p85q39N69O62p14m06N64M56o85l54P39K93
$$ y = [-493, -721, 105, 214, -986, -850, 295, 43, -483, -99, 858, 290, -462, 182, 554, -74, -1130, -499, 168, -1073, -1431, -370, 62, -795, -923, 354, 442, -143, -166, 486, 747, -246, -356, 447, 101, -728, -280, 893, 731, 28, 502, 1275, 824, 525, 461, 986, 716, -405, 236, 1069, 503, -568, 394, 918, -340, -1221, -295, -80, -1264, -1409, -161, 39, -757, -892, 424, 108, -764, -661, -116, 157, -1116, -881, 305, 199, -606, -229, 1165, 673, 207, 519, 1179, 1093, -123, -144, 838, 298, -561, -75, 408, -22, -696, 56, 520, -287, -533, 260, 576, -150, -432, 405, 109, -568, -632, -173, -310, -562, -530, 483, 331, -328, 293, 946, 481, -303, 68, 485, -101, -747, 208, 315, 39, -400, 192, 256, -133, -218, 118, 281, -209, -640, 329, 699, -127, -270, 642, 319, -512, -40, 460, 1, -409, -47, 584, 346, -34, -36, 801, 16, -823, -254, 408, -306, -712, -148, 308, -377, -731, 8, 301]
1958C01m04p66J127P2n03m84J035J86p32J14M24J75p73j35P65J42o46j99J045
1977G44l93n15M25J91l05n73J28L89k79l23J38L91l39k15L82L28l31q1Q2K70m86
1998c72R1M89j34n6Q1l8J23k10m6L89j63m13j53O98n0m09J36N14o69j48K35M06
2020C01l32l67M97J80k42j19K83L53q74j68P19n6n90L43P18k00n13o1O70k77p47
2041d82j99N47m5o73L60M74k73l57N75L99m49m57M17Q35q28m12O08M73m58j75
2061a20O91J00k35l59L16L04m98l06M34N3o78J25L74k16m55K90J71J6p04k3P24
2082Dm73l63L41P9q8j46M69N54m37l80Q12K77m70N4M8j36j06k11K78M16n70j1
2104e9N99Q0p44J82M19j73o23O9j0L4j15J56J58q5q3L09N01p07l57L68J82p83
$$ y = [301, -103, -869, 258, 330, -173, -657, 378, 564, -168, -54, 370, 545, -228, -363, 402, 544, -102, -301, 744, 351, -164, 261, 452, 147, -426, -298, 91, -188, -511, -373, 18, -321, -536, -154, 174, -157, -238, -156, 114, -372, -281, 208, 74, 18, 99, 61, 184, -26, -72, 317, 154, -259, -412, 286, 236, -173, -37, 477, -192, -340, -105, 301, -31, -398, 99, 279, 37, -82, 201, 554, -320, -488, 231, 175, -415, -72, 646, 446, -67, -128, 542, 265, -482, -681, -134, -179, -852, -492, -18, -291, -648, -73, 326, -123, -580, -163, 672, -156, -568, 40, 513, 55, -120, 571, 671, 436, 77, 393, 697, 199, -107, 327, 380, -298, -173, 201, -15, -470, -180, -9, 7, -697, -720, 4, -469, -832, -491, -412, -500, -646, -177, 377, -60, -440, 372, 649, 179, 233, 281, 145, 39, -172, 106, 522, -48, -59, 540, 620, -124, 58, 477, 304, -319, -250, -260, -226, -341, -185, -27, -112, -195, 114, 615, -92, -449, -81, 101, -682]
2126f82o8L74M82j78l5N89j71l60j80N94k00o70L52L76j36m87L4O93k27k58K74
2147A16N22l07k66R3J70l44k37K95O0n1n56M99M98m18j19j20J48j42n28J13J70
2168d04m96j16K79M90lJ01O56k09k97j15J65R4k08j69rM30J64L8K38j25j81O26
2190I49m30m3l67N8Pk67l60K22O7K10k35M32k10k30k14N9K0l86ML19J02l82K61
2213d14L75J60j24L30K07l58l37K97lm92J43K02M6Q8P6N18J18k37k93m2L9o13
2235c14j63Q1j74J09J5N42K48l46K22NJ73k86l22J02k29k30J81J95O7r1K64L75
2257D24j07j09M3J27l79k48J57M5j41k13N08J36j60K61P2j58j26R2j93l8l26J04
2279b29o6L77j1K05O4l71L36j54k75l22j87j8M1M7K1L25p7K62Q3K22J09k13n97
$$ y = [-682, -750, -376, 106, -72, -107, 482, 311, -49, -229, 365, 165, -505, -153, 223, 87, -400, -366, 327, 100, -158, 116, 638, 331, 65, 158, 328, -16, -253, 42, 102, 51, -505, -6, 492, 74, -45, -165, -17, -159, -687, -574, -404, -900, -1016, -737, -247, -250, -149, 507, 298, 1, -114, 51, 145, -63, -232, -241, 189, 353, 391, 629, 504, 323, 949, 519, 476, 109, 167, 174, -93, -453, -231, -164, 46, -189, 243, 33, -197, -411, -352, -332, -718, -714, -395, -293, -675, -414, -39, 121, -3, 327, 534, 176, -161, 136, 133, -359, -216, -14, 32, 120, 196, 714, 832, 595, 302, 260, 299, -314, -477, -396, -570, -461, -446, 96, 344, -2, 220, 225, 398, 112, -210, -108, -337, -567, -386, -191, -124, -215, 49, 424, 317, 208, 251, 378, -1, -249, -92, -47, -188, -401, 107, 243, 83, 344, 416, 258, 132, 224, 31, -7, -333, -229, -295, 82, 71, 276, 340, -31, 305, 151, -124, -446, -633, -651, -610, -563, -542, -217, -294, -32, 51, 273, 382, 169, -428]
2302d28N8N0j02r8K54M75l13K46M28M8j49J76K09n80n00j4N83o02k06J85K73p8
2324h5K16K6J94j40l69L84l33l0l93K30J13M1Q6Q6L54l48K84K09o7l74l44J20
2346a40L77l94q7N41k03M5J26k04M09k62k26R2k94k04Q1J62k85J00L98K64j79
2367A17J55nk3k60k51rR6l58K77J91P6J2K09J94j38qr2k12l27k43K74j34M6L7
2391c76K76K01J17r5L17j8j50p5k15Q3m06KO8M20r8K80l1K88j40j79J58k39m20
2414b32N3J73l59K50k42K17N10l02k46K17j14m13m9L14r3j76O9M25M2j0J03Q0
2436B17L38m38J24Q4o29Q6k8J54j34J94J31J29k01J20m2j53K67j74j54Ll74K92
2458a88J65m3m6L57J70j72m3qJ1l23j48n6J10k48M16j18L65k86R7M15k51j38L9
$$ y = [-428, -370, -320, -422, -520, -266, 209, -104, 142, 570, 618, 469, 645, 854, 274, -226, -240, 343, -259, -465, -280, -7, -85, 131, 157, 351, 211, -158, 226, -107, -137, -530, -300, -187, -146, -60, 26, 380, 32, 316, 525, 458, 84, -260, -140, 237, -157, -244, 297, 94, 139, 265, 61, 470, 208, -18, 74, -220, -424, -343, -181, -466, -366, 32, 296, 117, 272, 267, 244, -16, -267, -276, -180, -538, -261, -70, 6, 18, 227, 421, 283, 275, 183, -29, -356, -599, -325, -459, -413, -376, -100, 101, 218, 123, 440, 422, 272, 197, -18, 65, -341, -339, -271, 149, 51, 331, 300, 588, 448, 269, 427, 188, -232, -179, -6, -365, -115, -357, -140, 370, 68, -178, 39, -75, -488, -537, -223, -316, -492, -423, 2, 44, 34, 137, 217, 555, 117, 241, 325, -304, -218, -246, -92, -226, -32, 99, 228, 27, 147, 105, -48, 219, 45, -109, -106, -480, -188, -23, -66, -112, 245, 415, 243, 200, 192, 203, -120, -268, -324, -214, -462, -46, -164, 201, -85, 12, 427, 176, 38, 77]
2481G7j43k22JP5J9M6K59n5K21J88Op8m23J90l63M81k56R1j23J49J06j35K57j40
2505B28K29m70n0R3k42j06j96nJ13M9N2L58j98Q1K2mK74l23J39J2l56j1L14N1
2529E4K22QJ28M1kNj61k7j45q6J00l41J99j15L63k73J81j47l19J69O7o0k38K71
2553a06k30J72j26Q4K81K8J10J16k85r3J12k61L11k98J70n5K02J04l4J10J07m9
2575C70k30k12j33PpJ20j59P7K31j49L80j48R7k5j16J13j74k18k5j0mr4M0Q7O1
2600a21P7J01K47J15k41mm03J76p0k78L87J3j28m3M0K22J18K75k50J16j05J95
2622D39m96K79J61k49k19R7Q0l9j96j40K7j84K95r3K72j67J60J47j77n1J94k27
2644h7o5R5J2k98J01K10j06M50j7K01J5L20k48l2k34k04o8k39k95J39J72R3L0
$$ y = [77, -66, -288, -287, -212, -193, -147, 112, 57, 278, 466, 472, 394, -29, 161, -202, 279, 23, 114, -9, 140, 246, 111, 368, 228, 457, -13, -63, 30, -212, -318, -514, -519, -406, -357, -305, 53, -145, -64, -42, -46, 228, -95, 44, 56, -300, -311, 3, 54, 276, 284, 412, 453, 451, 456, 295, 268, 123, 37, 137, -204, -5, -120, 243, -30, 151, 4, -315, -146, -79, -139, -377, -106, -336, -164, -290, -206, 75, 103, 213, 329, 44, -49, 63, -198, 113, -185, -15, -70, 132, 236, 202, 312, 419, 370, 140, -72, -205, -198, -205, -85, -244, -167, 64, -85, 295, 147, 244, 219, 103, 216, 42, -176, -201, -211, -215, -309, -269, -182, -121, -44, 57, 304, 419, 178, 174, -229, -53, -123, -401, -14, -1, -129, -172, -132, 90, 208, 483, 233, 349, 244, 439, -57, 222, 383, 134, -85, 12, 92, 53, -143, -283, -256, -440, -145, -238, 34, -133, 27, 174, -3, -54, 140, -87, -152, -57, -45, -343, -242, -32, -138, 312, 295, 496, 511, 831, 583, 551, 317, 113, 45, -194, -489, -350, -178, -85, -55]
2667e5o5J74k31K70M4K01k86k49p6J34K6j97M0L5j0L71j75J74n3J30K83k27K24
2690D82l22m6j23P1j22R2k07Q1j03K8O4N8K20j80J02J31j27J95l48O9Kj86n6K89
2714F4J31l89J13m6K28O8J58m04K17k8l0j38L2k03j48r9L87k56K76j38L92p2J32
2737B47j64K14J02m23K23r0l8L9j19jo5K23l01K07n9N9L4O2j79K25m6j91O6k02
2761a77o7m1q3k4L77l83L12N2j63K68l9Q2n3J90j13J66k14j46j67R9j7J69j52
2784a24J90J68k51M3K68P6k86m00Q7J43m4K13m02J14j32K06k3J47J50J29l20J64
2806A16Qj59P2Q7jP3k90k7kj9K11j08J21n7K19k90J19j62J99R8p8k36J27m29J70
2831b38J12l5J88qqK46l78M85j74K2R7j92P8l09J00k24L27j82NJ46j41j75N2L75
$$ y = [-55, -120, 54, -177, 93, 137, 338, 52, -197, -273, -139, -113, -310, -270, -235, -245, 126, -49, 125, 72, 202, 485, 258, 482, 160, 114, -9, 62, -60, 32, -175, -94, -197, -169, -105, -47, 173, -7, 95, 226, 99, 294, -54, 15, 17, -169, -225, 64, 195, -194, -81, -127, 101, 169, 327, -77, 140, 112, 82, -56, -24, -227, -375, -474, -87, -343, -67, -205, 187, 115, 247, 83, 297, 399, -24, 199, 109, 71, 110, -9, -10, -75, 148, -153, 54, -5, 54, 88, 150, -29, 196, 150, -41, 25, -177, -244, -285, -368, -392, -15, -398, -86, -34, -197, 71, 32, 114, 61, 251, 138, 304, 90, -56, -223, -124, -141, 28, -124, 66, 234, -17, 26, 294, 370, 84, -316, -229, -86, -130, 83, -319, -205, -337, -131, -154, -7, 143, 272, -48, 116, 124, -35, 37, 124, 123, 196, -94, -121, -123, -142, 69, -39, 82, 25, 244, -46, 73, -89, 110, 208, 130, -106, 21, -408, -238, -126, -161, 27, 19, 11, 257, -121, 364, 190, 212, 309, 117, 195, -114, -14, -238, 89, -93, -88, 58, -83, -258, -206, 169]
2855A69j15K4j23M4j25J52k0j34p7J68j64J65o1K54j15L19k96K28l77J47p4k4
2877c5K59J20n18M78j24j66p1J94j30N0j79j24N7n6K56J9r3P3M3R8k51J81p5p4
2901f8l0l18N27j69p3J17K37j66J41k70J04Rk08O0P7K3P5k80r8J06K15j50L48
2924B09j10j93P3J02k5j1l2K28j54K9k68L95Kk91K69k38j87J92L7k99J73K1jn3
2948a32o2J58J49l8K7Mk0j68r7r2M20m03M36j35J24J45L6J86k66k05r2O4k2O0
2972G7l00K71K3Rj06L27k75n5Nl0q2j25L29k24j63K11k34K48P5j48K25J21J67
2995C46l42K22j54o4l4J49J7j57R4j60K25p8n1j7K73l81j56n5L05K0R6k73K03
3018B8K3o3J48r2M8o5j74q3L7J22P9K46o0P0J62j34k79J21k29r9j2j68MJ06k3
$$ y = [169, 54, 78, -45, -1, -126, 26, 6, -128, -205, -37, -201, -36, -97, 157, 42, 361, 65, 293, -84, 63, -11, -35, 224, 344, -174, 304, 180, 14, -57, 137, 7, 57, -122, -246, -189, -245, 11, 30, -63, 10, 53, 151, -100, 81, 6, -68, -98, -416, 111, -58, -131, -14, 223, 57, 198, -72, 32, 41, -167, -107, -30, -7, 68, -212, -310, -204, 11, -139, 209, 99, -94, -21, 81, 56, 45, 13, 241, 87, 116, -152, 243, 245, -46, 223, -15, -202, -10, 27, -272, -99, -78, -79, -132, -194, -36, 113, 75, 102, 106, 86, -82, -179, -271, 149, -254, 182, 47, 171, 316, 352, 538, 272, 67, -25, 39, 17, 77, -223, 48, 71, 80, -26, 301, 26, -29, -24, -54, -136, -261, 68, -156, -319, -108, -342, -94, -19, -167, 58, 179, 346, 4, 226, 72, 8, -26, 123, 140, -17, 77, -83, 142, 64, 13, -4, 269, -112, -268, -323, -18, 2, 98, -175, 28, 51, -12, 136, 44, 92, 27, -147, -230, -193, -71, 8, 254, 194, 264, 426, 292, 13, 134, -95, -194, -206, -374, -370, -264, -287]
3043b87K26Q0M0M5J89j50R8m09J89j40O4j04O9J15k72O1K79L6n3j38q7K40p1j48
3067a28l09L02K2j97j94L92l4o5P5K47L5j05j37j2J10J17rq0J68j8Rm8J14O2O8
3092C85l13r2K8j58K36j63K46m3j62K10R9m9q7j76l0J6M4j56j0L8J29K04pM3M0
3117B72J2j07O1o3l25J02q8J54j32L12J9o2Q8m31K65k19L5J05l5k00M5R5L5q9
3141a51P1k96K34O1O0l0K43k48L9K07l66L7K6O0J79l33Q3J4M01l79m2J92mk11
3165a53K26j28K76j80p0J72j04m0k0N5P7j33o0J04LO5qJ10K5R8m3l12K4Lq4j26
3191b23R9O2j0J28j58J55j12P8J32j25Lk03l3K54j85LJ95l42L24K92l15j3J35
3214A41k90N9J14J65J10l26j49K78R9l18J05j28J81J49l13p4K03k05J19K6K0j38
$$ y = [-287, -61, 19, 59, 104, 293, 143, 241, -168, 21, -119, -55, -159, -90, 25, -247, -186, 93, 129, 76, -62, -149, 91, 20, -128, -437, -135, -113, -310, -504, -112, -146, -211, -136, 111, 146, 41, -96, -108, 2, 119, 110, 30, 198, 180, 189, 141, 255, 317, 385, 72, -20, 8, -150, 86, -77, 169, 126, -36, 174, 273, 224, 137, -39, -69, -53, -9, -165, -175, -137, -8, 196, 189, 232, 272, 284, 177, 238, 175, -150, -48, -136, 18, -114, 198, 217, 155, 243, -188, 77, -142, -107, -2, -37, -237, -192, -97, -62, -151, -80, -376, -142, -81, -21, -51, 192, -56, -17, 190, -176, -139, -113, -53, 126, -207, -124, -110, 291, -88, -130, 62, 58, -153, 73, -55, 221, 41, -29, 143, 39, -1, -21, 34, 111, -22, -82, 22, 25, 90, 82, 192, 217, 315, 272, -40, -16, -13, -97, -223, -124, -62, -72, 56, -102, 53, -59, 19, 151, 26, 29, -174, -207, 47, -138, -135, 60, -282, 42, 334, 19, 6, 141, -149, -90, 24, 189, 299, -27, -176, 102, 201, -117, -12, -140, 41, 190, -123, -197, 6, -199, -80, -54, -34, -172]
3236a72J37P6j08OM21k29J03j26J1k0j64M6rJ41l2K35j09n0l41L35l18O3p8M5
3260a37Q3j28P0J02j20l0P7j14P7Q9K13k23J15k28K61k22K4J94k38K50j53J58
3282A20J32j48l30J40K67l21n6J05J15J0n9j55J80oJ63Q9k38l8l11K30J23j92
3304a80J77K9J06j03J82q5P8Q2k72o9p8J02j26J67k12j45M38j30m2O8J01j66J18
3327D0j51J6j08J31J05KM1jJ61j05k24j9L58k46n7L6o6m8J42j50K41j51NJ02k22
3352a68K12j18J90k02j39L89j40l08K54j25J45K67pk14k7j3n4J19J08k89O4p4
3374a30K28k7J9p4R0j15o6K15k54J8N7j60K48k1k29L51k84l3K38M3L4j39j02K24
3398A31p8J14j93J02pR7k70J52K02k50o2L8R9j50N4n7K48j13k36J63r7k42L30
$$ y = [-172, -35, 41, -67, -61, 360, 131, 234, 108, 119, 99, -65, -19, -28, 113, 81, 316, 207, 157, -184, 151, -167, -104, -182, -137, -54, -182, -112, -10, -130, -160, -83, -197, -120, -31, 182, -41, 74, -154, 107, -115, -91, 103, -135, 115, -38, 120, 252, 104, -226, -86, 181, -140, -196, -91, 24, 34, -25, -180, 0, -6, 157, 246, 8, -30, -341, -111, 12, -180, -3, 26, 132, 29, 211, 126, 204, 286, 14, -55, -133, -31, -157, 10, -202, -347, 91, -39, -81, -13, 88, -78, 40, -111, -95, -203, -72, 33, 35, 76, 75, 236, 131, -93, -112, 246, 0, -57, -21, -87, -135, 7, -143, 98, -53, -48, 54, -168, 44, -74, 116, -86, -225, 164, 24, -284, -30, -155, -10, 257, 250, 36, 9, -4, -58, 61, 169, -120, -56, -130, 98, 71, 90, 16, 106, -9, -75, 140, -114, -96, -39, -199, 49, 28, -201, 150, -134, -167, 71, 114, 148, 9, -93, 131, 53, 167, -26, 76, 69, 166, -104, 48, 250, 0, -62, -24, 75, -75, -21, -78, 170, 57, -179, -16, -113, -355, -25]
3421b5LJ29l55K14j02N6J86p0M5j20l9K09L62n03Nj0K25k50j68K92L8k06K8O6
3445A0k0j87R2J88k03R3j87K17k89J57R8Q9l47M81j19J73j51J04j85N8N2n2k20
3468a48M64m86L08m14K76J31j20k06O9Q6jJ23p7q5K8J1j13K94k54J49o2k5J20
3491F8n3PJJ50p6j05M1kJj98J97k02J26J63j56%Q8p9j01L9J5J5J53j90L42j56
3517H8J48j23j70R3R1J25n12K28L15k52k88K71jP2p4j68O8J19Q1k21J58n4J30
3540A24l22J91r2J76l61L20j69p5O2L07p3J02l57L84k03r6l4M32l74l1L79l29
3562c9p2J36K2J0M1k74J43K0R7j21J26p4Q7N2k73K73m9j11j2J62j11l5J65J15
3586B78j80J17j49O6k02J98j20k39L71Pj17m6j5j07J60J98l87j8J42m8J21r6J84
$$ y = [-25, -22, 107, -248, -34, -136, -80, 106, 36, 81, -39, -78, 131, 493, -10, -5, -15, 210, -40, -208, 84, 122, -84, -56, 10, -10, -197, -105, 83, -120, -27, -214, 3, -286, -129, -31, 58, -289, 192, 73, 246, 95, 199, 14, 72, 124, 72, -148, 316, -170, 138, -276, 0, 131, 11, -195, -126, -40, -41, 82, 5, -80, -52, -41, -154, 140, -114, 35, -27, -52, 68, 15, 22, 23, 173, 97, -8, 33, 31, 32, -166, 31, -171, -45, 118, -38, -38, 50, -29, -130, -91, -76, -61, 92, -98, 244, 88, 236, 113, -57, 36, 127, 252, -260, -32, 283, 31, -257, 14, 13, 85, 11, -157, -89, 30, 111, -110, 48, -6, 124, -198, -7, -99, 77, -284, 36, -133, -208, -146, 161, 88, 190, -167, 217, 14, -82, -116, 316, -58, -89, 290, -39, -111, 25, 47, 57, 98, -176, -33, -13, 84, -37, 89, 15, 102, 154, -119, 154, 105, -6, -18, 144, 33, -2, 163, 278, 98, 215, 66, 132, -70, 128, 8, -231, 140, 147, 30, -16, -31, -138, 22, 220, -167, -185, -43, -91, 30, -66, 118]
3609A18m6m7K39q8l48J64j65L9M39l60K9R2q8J04r3J0n0Q8Q3m79K76L1O0n4k41
3634b87L44J38j79MJ46l00M8J5L21j64R8k09J5R0M9O8m4ok82J39J09p9j32l2k06
3659c36J44L57m34L67j99k7J09J0K3J94r0k11N1K3P7j18K74k63L50l36J16O9j56
3682fk3K2J35m7l1p7N9P0j27r9P8k44J64J75j84q4l8J75q3J19J48j29k45L36j82
3707a18P3n8L68r2l1j05qJ60m21L13n4j94j2J30pLJ05j87q0J94J18K7l13J69M6
3732B6k84L89L3j68J98j23Rj0o3K20k17o7m1J21J47q4J11j74O1k46M39l29M08
3755C56l02k92J31P4k03K16J3P7o5P1L8j99J58l43L38J3k16K52K6j77R2j2j13
3778f7o8J47L2j90J39O7j87jJ39j48L04m55J82N0r2K14p1J28l7n1Q0j30j88R6
$$ y = [118, 72, 25, 264, 176, -172, -8, -173, -134, 305, -55, -26, 66, -22, 82, -11, -1, -51, 37, 120, -359, -83, -52, 8, -46, -287, 57, 195, 16, 20, 166, -134, -86, -71, 250, 86, 184, -25, -10, 80, 129, 197, 153, 147, -135, 4, 113, 34, -98, -130, -336, -192, 165, -269, 98, -101, -128, -19, -9, 14, 208, 118, -93, -42, -19, 58, -60, 214, -49, 301, -35, 81, 150, -6, -29, -7, 128, 81, 50, -27, 32, 102, -25, -124, -46, -290, -126, 49, -135, -219, -257, -82, -165, -46, 102, -27, -272, 64, -118, -45, -103, 265, 173, 142, 37, 29, 189, -232, 81, 27, -167, -179, -49, -56, -53, 52, -135, -215, -21, 97, 124, -189, -20, 26, -258, 131, 164, -4, 194, 71, 80, 70, 7, 227, 10, -57, -98, 23, 170, 86, 197, 23, 84, -162, 277, -52, 356, 54, -238, -107, -33, -236, -20, -7, 70, 5, 76, 114, -85, 73, -270, 68, 81, -135, 117, 143, -34, 58, 46, -67, -135, 12, 44, -146, -7, 60, -127, -128, 11, -137, 167, -288, -106, -56, -148, 66, -5, 123, 86, 35, 115, -15, -203, -107]
3802a07l1J72N0M5k05JL1r1q3L15k58Q6K95k66n8PP0J59l85K4L89j57Q5j40j59
3827b11L18Jj70p8Q0rJ62j96J23J15jj9j3j59K79j04K5K16j95j16J12n0j46P5
3851C9n6R5k39O7K98o7j38k40J30J20J4p0J49j60K04q3j78J23M5m7J38j8k25O9
3875c0j86l2M48j97j26q3J98k62L68O4j24np7J06j7K01l41K21M5j37J62k07L37
3898C26q7J54k57Q2l17K61L3k49pN1o3K4j2q9J9K87j12k8P8k39O6J18M0j41J31
3923F9mN3j90j80M21j58K20n4k67O3K8K40m56J29n1Q2j04J07j27K17q9j52j2j00
3947c15J75O7j59K13j14J33L8M3K7k10K4J15J22k41J01R5MJ50j66j40K49j74j05
3970f8j1N2k4m6lN7j01L52q1k73R0L9R0P5j69L99l17j87L41j36R4k3rj71K54j62
$$ y = [-107, -138, 34, 84, 129, -76, -75, -44, -135, -218, 97, -161, -75, 220, -46, -104, -97, -27, 132, -253, -229, 160, 3, 88, -52, -211, 107, 108, -62, -140, -60, -69, 93, -103, 20, 135, 134, 115, 102, -57, 222, 118, 143, 359, 164, 48, 160, 110, -36, 39, -17, 78, -161, -94, 204, 137, -1, -241, -111, 9, 23, -47, 102, -58, 146, 63, -115, 8, 53, 6, 144, 126, -99, -30, -216, -248, 200, 3, -123, -206, -8, -270, 98, 162, 38, 33, -44, 62, 45, 246, -95, 126, 171, 34, 196, -11, 326, 239, 393, 136, 218, -99, 162, 195, -54, -61, -10, -73, -49, -61, -150, -131, 156, 44, 16, 94, -145, -79, 39, 79, -62, 69, 65, 118, -72, -252, 169, 11, 231, 177, -90, -27, 1, 241, -215, -86, -137, -55, -159, -52, -179, 38, -51, -203, -215, -315, -140, -73, -232, -19, -133, 0, 38, 81, 108, -102, -78, 37, 159, -82, 19, 114, 118, 268, 102, -38, 211, 37, -68, -79, -27, -51, -97, -100, -43, -144, 208, 127, -146, -56, -17, 73, 148, -21, 378, 61, -126, 215, 79, 173, 150, 141, -30, 224, 62]
3996F2l86J80M9j59J45J01j07k6O9J66l85K01Q9l21K26jK8j40K16j39J24j30j2
4019a50J27m5P5Q4k7K6l64K76k12K52j24j52K03j52R6K23k53J04k64L70L3j1l85
4042b70J74K84p8L5j79J75j13q1J10K7k95L08q2K2M5j99L06j59Kj62K4M2J3l8
4066h9M0J39k9p4m9R7K12k35j57M2M2j44K66Q6Po3k3qj47n3J53j91L75k73J28
4091E2j2K16o7j29J8l13K06k5q9J52P5k94L73j71N4q2J37M7k12R0J50j19J71j23
4115A05n3QL07k70qr9p1J32k01Q5J17K8k6M0j30q3J21j38pK58j14N7k7j41k5L5
4141a00J50N7n6j32o9P5J26P8r2p2l0P1j04K31J04k9j79J06k66J35K17k34R7j29
4165d5Q7o0O2j05N6O6n0O5j40J26j1o5J8J14kj67l3J45K54k00k59J55k00M62k09
$$ y = [62, -324, -144, -95, -254, -109, -8, -115, -141, -72, 94, -291, -90, -1, -322, -96, -97, -69, -209, 7, -132, -8, -138, -150, -23, -68, 7, 91, 64, 90, -274, 2, -210, 42, -82, -234, -31, -183, -87, 136, -117, -13, -277, 93, 126, 115, -270, -96, 188, 110, 145, -34, 141, 28, -53, 57, 84, -211, 97, 15, 37, 82, -117, 189, 30, 32, -130, -106, -64, -51, -89, -49, 90, 61, -13, -62, 35, 247, 12, -145, -103, -61, -205, 61, 147, 154, 91, 68, 60, -87, -140, 13, -178, 197, -76, 52, 40, 256, 189, 60, 78, -235, -29, -54, -143, 9, 84, -210, 163, -8, 46, -36, 101, 148, -64, 26, 176, 57, 228, 105, 52, 60, 367, 97, 89, -10, -81, 51, -150, -65, 52, 80, 54, 94, -36, -119, 2, -136, -143, 115, 1, 58, 31, -110, -135, -100, 50, 107, 51, -81, -150, -75, 51, 129, 37, -35, -65, 6, -98, 133, 237, 208, 29, 135, -131, 4, 221, -13, 84, -45, 42, -18, 44, -61, -5, 61, 11, 76, -64, 62, 51, -14, 4, 118, 116, -51, -84, 61, 315, 115, -144, 11, -189, 273, 64]
4190F4m8l04K56Rp8l3J09P4J80n50L66m4nj02K1N6L3J70k13j3J56r1l51K29k7
4215a36J90j33J6J93j19o2J01j87N33n35p0J48J38J9k84Q1K30n1l5o1J70k01K19
4238A64m52N11l00l0M37m70J3N9R5m9k6L7n2J85k00J03J32k77J1K08j22p6J41
4261D2q3j48K41j16j64JJ36K85Q9l62j07M00j26l02K09J45p3j91L46k66p5L05
4283A86l93J93j08J07K01J12m65J48J74k40J61m8k30L8K17r0R3J12l58K46K6J61
4305B43J25l78j60J12Q9j17j5J67On40M89Lk19J04J24j97K59k20L02k98J9L63
4327B61m66M01j77L2J11k73J19o5J08r2q0J94k27L75l49J68j06J82l86J84J14
4348B8J18o7m01L33K4k16J37m2J49l00J97J43l99J64J13J43m05L56j65J34k60
$$ y = [64, 16, -288, -32, -23, -101, -134, -25, 49, 229, -321, 45, 1, -4, -106, -85, -29, 4, 174, -39, -52, 104, 13, -338, -109, -136, 54, -79, -63, 130, 11, -51, 50, -137, 396, -139, -209, -61, 77, 96, -188, -107, 123, 72, 37, -24, 146, -55, 164, -288, 223, -77, -107, 330, -140, -127, -68, 27, -22, -48, -11, -63, 122, -78, 25, 157, -120, -109, 99, -23, -99, 42, -41, -189, 52, -64, -228, -227, -91, 194, 283, -79, -186, 214, 88, -214, -5, 140, 67, -124, 222, -44, -119, 186, -207, -14, -122, -15, 186, 298, -167, -19, 155, -85, 76, 28, -202, -164, 53, -37, 56, 168, -190, 56, 82, 243, 368, -10, -170, -58, 31, -86, -101, 66, 72, -468, 21, 24, -195, -91, 33, -164, 95, -125, 177, -121, -102, 261, -205, 196, 19, 51, 162, -111, 8, -57, 51, -41, -121, 73, -154, 221, -128, 40, -66, 116, -270, -86, 28, 146, 79, -322, 11, 35, -181, -44, -86, 63, -237, -40, 103, -296, -132, -19, 124, -281, 75, -90, 44, -216]
4369b16J97J2L2R0j08m0O2l4K02j24j10k05K34OK0j35k8P0Q8k18J99P6j96J48
4393B2L7k6K05j25mR9l53K69J14l08k06M21q4l51M47j19k16J13j77L07m6M2j35
4416g4L8L0J2j6J0j0j25L46n8k84O8J12R8j92Q2N1j59M9j32n2J43M9k1K9o6j42
4442b14L64l9k59R4q3J68O4p9k0O1N0j84k9J65J33J40j99k20J76p5j06R8m9J31
4466H8J14q5q4j15M7jL08n05K16J13q4j35J5J49L1k10M11k3O7m66L18j56J64j88
4490a1KK91o08O01l30J56r0j94K47j00k9J07l02J14K31j88M2J0K03l13M67Rl72
4513e7J18j87r3K09J72K0k63J22j4j8J84l03K26K6j20p6Q1j19m6j44L99k67K05
4536E5Q5j60j97M7K81j82J19p8J10J72k19J56Pl14J39Q5P7j26r9oJ57j24j05P9
$$ y = [-216, -19, -7, 25, 115, 7, -33, 29, -5, 197, 73, -37, -242, -8, -2, 18, -117, -145, -75, 13, -205, -6, 70, -126, 22, 59, 33, 238, 113, 109, 208, -145, 124, 238, -70, -276, 145, 61, -290, 157, 38, -178, -65, -242, 65, 19, 61, -74, -36, -6, 6, -10, 0, -10, -135, 211, 153, -131, -63, 49, 147, -45, 37, 88, -71, -22, -154, -206, -63, -14, -35, -6, -72, -214, 150, 111, -148, -54, -137, 31, 95, 16, -4, 57, 107, -77, -106, 59, 192, 332, 133, -87, 89, 14, -92, 6, -43, 88, 202, 117, 33, -82, -35, -36, 272, -233, -17, 96, 12, -123, -108, 41, 72, -138, 273, 250, 317, -149, 169, 13, 177, -11, -9, 282, -326, 275, -55, 101, 11, -183, 64, -36, -65, 42, -260, -146, 85, -103, -61, -51, 152, -161, 306, 315, -57, 61, -126, -219, -10, 162, 182, -81, 41, 27, 9, 193, -110, 116, 142, 22, -54, 27, -92, -138, -282, 117, -150, 55, 140, -20, -217, -170, 111, -71, 48, -30, 80, 252, 33, 189, 196, -118, 21, 106, 183, 57, -42, -48, 109, -15, -120, -41]
4560d1k46K28J7o0J41j3j51m2K95l28L2l4K63j60R1J53l39J58J07j05Q5j09Rk9
4584g8K09j20K02l18J8p0M0L19j11k40kL02l95Q7J66j22N8J20j02J27Mk17k9K51
4608I9j62j57L92r8k01J33J95j76l8r2L4j6L7O1j44K57k01J43j59p8k9PQ4jJ56
4633D6k86J61j76L31Q5L8k82j19J16L12k69m7J9J57j17L91n68J94k1R9Qk7l65
4656c20L37k17K90Rj03m9k48K96L86p75M93k10J09J12j59j42K06K0O1j01p5K15
4678A35q2j68J52j26K01r8q5J09J54o5l87M50j73J15k63K91J38k03k81L49o4k94
4700a95K56n4J40l14K62k35L07k57K41J75l57J10J47l00k0L7l3J59l78L60p4O8
4722D5j54K50j32J08k08J64j15n0J75l82K71k25J58l6j5K1M2j8L49l23J49Q7j39
$$ y = [-41, -287, -59, -42, -102, 39, 26, -125, -167, 128, -200, -168, -202, 61, -99, -8, 145, -194, -36, 71, -34, 51, -58, -49, -78, 131, 11, 213, -105, -87, -157, -117, 202, 91, -149, -151, 151, -244, -157, 9, -113, -55, 65, -37, 90, 94, -123, -152, 99, -63, -220, 172, 74, -127, 6, 201, 25, -13, -105, -71, -87, -50, 11, -133, 124, -77, 66, -93, -171, -200, -193, -109, -110, 46, -240, -79, -255, 76, 161, 199, -83, -202, -86, 226, -43, -90, -71, 86, -31, 360, -208, -14, -35, 64, 72, 45, -320, 17, -200, 90, 99, -4, -53, -301, -5, 381, -394, 99, -111, -2, 110, -49, -191, 15, 35, 96, -5, -80, 135, 53, -115, 37, -89, 112, 14, -71, 38, 192, 127, -260, 190, 17, 132, -131, 160, 298, 95, -186, 163, 99, -195, 61, 7, 147, -167, 95, -140, 167, -90, 151, 326, -31, 79, 226, -74, -94, -57, -90, 69, -309, 51, -23, 45, -109, 141, 9, 117, -91, 73, -42, -92, 83, -299, -28, -253, -95, -131, -146, -125, -83, -101, 248, -75, 74, 161, 22]
4745B2m5L5L7k37N7J86k08K11l23K21J00j81J45j20K50O8k81j67K81k3j7J02j14
4768aQ0j04jK29n0j82Qp8r1K19q6P3j27J80r7oM7j0J29m3M6k25Q9n0J22J23j83
4795A1j4J35l4K02j05l9j92K84j69l5P7k70L35ok66r7j40M48m72K57J58k12N0
4818i4O8K38l19O6J07k20k3M8J95m8r1J66j07l48K51J59j28j07K16j12J03Rj11
4841h2K2J11p0J35J4l27J87J28k76J04Mm3K85j80O6J19jO1n7j28qm0Kj10L21k23
4867A4l8O4q6R8n0J49j5m23K6O4oK1Q6J31J91l19Kk0K87l52J00Q0o1L74m08q7
4893a78j32L79J13k31J18Q2j84J40J06l65J92j87J3k15J60P7N7J34n5m6J16k16
4915a22J54M2K11k50R3j37R9Kk19J06j64L55j2l20J97K3l6q2K20J6k02j35K04
$$ y = [22, -23, 12, 49, -188, -131, 55, -153, 58, -265, -44, 56, -125, 20, -100, 150, 218, -63, -230, 51, 28, 11, 113, -1, 79, -25, -26, 203, 153, -29, -21, -99, -190, 29, -57, 16, -111, 69, -28, -34, 13, 3, 132, 89, 135, -90, -1, -51, 71, 194, 11, -3, 132, 98, 300, 195, 156, -36, 248, 79, 44, 121, -149, 186, 180, -86, -183, -323, 125, -347, -90, 68, -144, -94, -26, 212, -107, -41, 66, -154, -177, -129, 66, 18, -73, 93, -14, -362, -111, 48, -80, -187, 29, -83, 20, 29, -82, -60, 51, -19, 116, 130, -197, -10, 118, -158, -54, -50, -93, 192, 12, 78, 197, 196, 257, 200, 72, 64, 24, 26, -84, 237, 14, -24, 40, -46, 52, 2, 151, 136, -287, -261, -197, -203, -182, -96, 35, 226, -93, -91, -111, 176, -176, -76, 4, -57, 317, -91, -178, -310, 69, 182, -49, 69, 151, -33, 107, 213, -152, 40, -147, -134, -349, -189, -112, -55, 79, 24, -22, 94, -122, 32, 74, 285, 35, 128, -9, 90, 92, -127, -21, -185, 170, 158, -162, 35, 58, 22, -60, 160, 176, -26, -161, 43]
4938D3L9R5k99K04r9N0J86l8k86J82n0j20J69n8j13M9J28j39r6J73Nk25L59j14
4962D5K79l01J16j04k68O5J58k3K34o8K61n17K06k84M8J79j4K8r1O3j30L20l2
4985A70k17J78k61J27j54K8P3R4M1K18m95J15J15j47K36k94K05j67K61m7k62J29
5007e4J66r0l16N06j77k17L07l07L03q5j6j35M0KJ32J45J2Pl77Q0J35m5P0k14
5031a28p0J63O0K41m93K49k43J94j66K58j57K7J06l9k33M19k75J34j11rL4k22
5053b61K61LJ68k4j71K65j98j02QL6J11k22J05J80l41J90J0J03p1j96K33j48J10
5076D9J18p0r6J53j12N0N7j25j35M3K10k89J40j56J84r1l9J70J9M4k85J65o8J73
5100A09k61Q4R5K76k10j98M1j43M54k73j11N5N7K1J17j53N5L3j80J53pRj15J3
$$ y = [43, 82, 177, -122, 82, -17, 33, 219, 181, -105, 77, 27, -93, 76, 18, -95, -46, 82, -57, -153, 20, 25, -200, 159, 45, 324, 23, 139, 35, -233, -168, -10, -33, 201, 133, 394, -123, 83, -201, -153, 26, 12, 40, -51, 12, -118, 202, 170, -47, 131, -130, -3, -157, -129, -56, 38, 79, 297, -198, -83, 32, -115, 121, -173, 32, -135, 126, 79, -183, -54, 112, 22, -294, 212, 35, -182, 125, -182, 121, 36, 20, -115, -75, -73, 59, 204, 216, 223, -154, -74, 61, 16, 86, -128, -198, -35, 25, 266, -227, 22, -221, -27, -193, 65, -92, -65, 41, 2, -231, 188, -87, 47, -64, -73, -39, -261, 0, 3, 171, 147, -24, 241, 43, -59, -51, -15, 96, -126, -21, 159, -182, 8, 18, 121, 50, -146, 87, -61, 49, 167, 97, 1, 154, 42, 92, 149, 24, -111, -68, 142, -147, -7, -163, 21, -70, -109, 61, 80, 124, -161, 4, -64, 109, -152, -68, 27, 303, 93, -105, -64, -207, 247, -26, -137, -82, -25, -4, 113, -40, 15, 48, -132, 21, 14, 23, -92, -79]
5124g9Q3K80m70K21k38L20k43L15k1J12l62K9Q4p6J65j09j04Q6N4R3k8p4k18K48
5148F8j41Q7j45k0M2K75k82J01j14p6K2K85k1J16j28O9kj65j65jL89j34l4J90
5172B16j5j5l04o6L21j64L5j5K9l5j32K07j27M8K2j30Q7J13N3l08Q4O7j08J53
5196A6j20J92l7k84K82N1m2l8j32J95R0l18J94k75K46m6L9K91j14l38K05o5M7
5219C9r4Q3l2mP8J42O1p3k8m0n4J36q3j22J9k09J85m9LK68j63k41J50k54K78J97
5245A93l50o3K31j88J35j03J69j50k5K59j0j42J45Rl66M57j83j03O2R6Oj05J1
5268a5K45l08J24Mk90M17j7l21J98N7m37L83j6J47k14J52L3j51M3N2j22j6K65
5291B13k00o5L16l26O2J9k11L03R4m5k54jJ42k71q6J82K50j96J29Jlj01J28k01
$$ y = [-79, 4, 284, -186, 35, -203, 117, -126, 189, 168, 280, -82, -53, 31, -45, 120, 11, -93, -7, 47, 140, 112, 38, -180, 68, -73, 14, -131, -151, -109, 166, -116, -15, -129, -205, -183, 102, 81, 197, 69, 138, 136, -29, -194, -195, 194, 60, 26, 216, 201, 186, -118, -184, 137, -27, 8, -7, 22, -13, -145, 62, -65, -17, 5, -125, -38, 75, 128, -180, -96, -29, -137, 16, -104, 88, 51, -233, 49, 100, 58, 20, -112, 83, 173, -145, 49, -226, 20, -26, 13, 304, 190, -148, 57, -8, 39, -55, 28, -4, -8, 70, 212, 273, 200, 172, 132, 78, 214, 131, 9, 28, -181, 4, -45, -42, 226, 63, -178, -28, -282, -4, 193, -157, -220, 11, -177, -42, -145, 24, -126, -151, 108, 98, -44, 101, 110, -256, 201, 18, -85, -23, 73, 79, -26, -15, 230, -78, 46, 50, -240, 177, 160, -161, 37, 94, -343, 40, 24, 171, -43, 109, 142, -9, 34, 86, -36, -52, 213, 13, -52, 264, -62, 0, 19, -192, 111, 205, 160, -94, -95, 47, -224, -310, -128, 122, -74, 55, 56, 53, -48, 80, -121]
5315a21K73j49K85l8k51m0k6p1J33K38l63J30j87J60K5R6K1k75R4p0L2K16j55
5338d3K9j19J20K9K60k78J08K90m14K15k75p9L91m42J83o1Q3j91J15K71jP4m92
5361b27J87j8J73Q2l44L10K9k59P3j49R1K6m4M6K51j65j9M5J5l91K91j37LM73
5385C42l38j05R0Ko8j7K29j04l58K69J47l7j04Jk36M34j15J37k19O0k35L25j34
5408c4p7L28l47J40K2J95l11M5J2j09K46k2R8j70K00j54k11K43K3J0j67O3j55
5431a32K93j00Q8k76O3P8K0J20j23r1N9M6k55K24j08J60j8L5j25O2j4J06l17O7
5455a38K1J57M4Lj96J09O3k06L36k44K00k57j51J47K41O2k07p7nnK1r6L52j25
5479D9R6j36L7n6k0J63l4j79K6P5K85n39M34k31P9j7j53N7l14L38k53K09J97j01
$$ y = [-121, 152, 3, 288, 250, -1, -41, -67, -138, -5, 233, -130, 0, -187, -27, -2, 94, 115, -160, -66, -136, -104, 112, -43, -14, -133, -13, 16, 276, -2, 106, 396, -18, 197, -78, -157, 234, -208, -25, -86, -3, -194, -79, 192, 191, 265, -227, -40, -58, 115, 197, -147, 163, 192, -67, 6, -143, -52, -26, -70, -24, 227, 62, 43, 88, 103, -288, 3, -134, -131, 342, 4, -101, -11, -9, -77, -94, 135, 31, -327, -58, 89, 52, -52, -51, -287, 147, 32, 169, -50, 10, -225, 100, -34, -111, 217, -130, 10, 32, 227, -84, -39, -27, -136, 110, 88, 186, 16, 216, 62, -149, 94, 117, 127, -40, 23, -132, 161, 61, 149, -127, -64, 14, 34, 154, 31, -60, -1, 45, -210, 14, -94, 66, 48, 83, -42, 20, 6, 112, -205, -138, -117, 40, 84, 87, -109, 0, 63, -143, 193, -51, 149, -108, -259, -112, 129, 191, -16, -93, -98, -103, -82, -178, 174, 49, 145, 9, 46, -10, -30, 133, 99, -80, -54, 21, 306, -233, 201, -30, 49, 32, -121, -64, -378, -40, -293, -84, 113, 12]
5503A2j79j01L10l7j31J56k7l0J00k50K89j99P0J87P9k71N9kO4j64j1M5o4l4J24
5528ep9K75k61k33M6K22J1p2%J60j88J27K81l41J10l9J40n01L43j47J4o0J77J01
5552H1p3j04K62l19J59k5J39j76j67J84L2M1K3K07k71L7o1o6J79J3k1KJ57j79
5576E4j82K11m9L8j01J11K0nj54R5j88r8L90k36J62K16m41j02L84Q0m48N27j90
5599I4P8k26j10J96J23k13K01r8j11J00K4P6J16k85k3J12J2j61L28l95J43r3R0
5622b2P3k65K03O0N3K0rj67L34JM4k56N4m3J88k47J18j87J56l71K92J80l55K41
5646I5j74L37m51J44M6K45j85j42R1j39J7K02j02P3j49j24K42k31K91Lj36n1K09
$$ y = [12, -167, -268, 42, 5, -126, 30, 3, -27, 73, -177, 112, -87, -17, 170, 249, -22, 37, 35, 99, -65, -76, -31, -95, -129, -5, -84, 191, -70, -303, -257, -35, -24, -96, -96, 64, -124, 3, 284, -57, 53, 14, 154, -347, -4, -151, -137, -197, -20, 81, 8, -96, 166, -153, 6, -19, 120, -56, -223, -39, -7, 34, 57, 264, -7, 30, -31, -97, 82, 95, 74, 76, 233, 54, -128, 83, 34, 72, -29, 82, 102, 97, -57, 38, -150, -248, 142, -94, 68, 284, -157, -259, 125, 205, -243, 284, 94, 172, -54, -164, 32, 155, -58, 143, 45, -66, 34, 58, 134, 250, -35, -58, 54, 66, -95, 233, -162, -19, -112, -22, 51, -214, -11, 49, 102, 122, 113, -54, 280, 281, 325, 69, 123, 80, 268, 21, 139, -48, 108, -263, 29, 209, -146, 95, -79, 258, -193, -49, -3, 242, 57, -85, 6, -133, -116, 86, -16, 57, -92, -216, 26, -205, 86, 89, -47, -98, 111]
$$ [...]
8191i7
##END NTUPLES=NMR FID
##END=
