##TITLE=1H_Pr 2753
 CDCl3
 8 sc, 
 9.2.2023
##JCAMPDX= 6.0         $$ Bruker NMR JCAMP-DX V2.0
##DATA TYPE= NMR FID
##DATA CLASS= NTUPLES
##ORIGIN= UXNMR, Bruker Analytische Messtechnik GmbH
##OWNER= root
$$ XWIN-NMR		Version 3.5
$$ Thu Feb  9 16:29:42 2023 Russian Standard Time (UT+4h)  she@DPX200
##.OBSERVE FREQUENCY= 200.13135
##.OBSERVE NUCLEUS= ^1H
##.DELAY= (6, 6)
##.ACQUISITION MODE= SIMULTANEOUS
##.ACQUISITION SCHEME= undefined
##.AVERAGES= 8
##.DIGITISER RES= 18
##SPECTROMETER/DATA SYSTEM= spect
##.PULSE SEQUENCE= zg30
##.SOLVENT NAME= DMSO
##.SHIFT REFERENCE= (INTERNAL, DMSO, 0, 15.7039)
##AUDIT TRAIL= $$ (NUMBER, WHEN, WHO, WHERE, WHAT)
$$ ##TITLE= Audit trail, XWIN-NMR		Version 3.5
$$ ##JCAMPDX= 5.01
$$ ##ORIGIN= Bruker BioSpin GmbH
$$ ##OWNER= she
$$ F:/spectra/data/she/nmr/H-F/1/audita.txt
$$ ##AUDIT TRAIL=  $$ (NUMBER, WHEN, WHO, WHERE, WHAT)
(   1,<2023-02-09 16:28:38.20 +0400>,<she>,<DPX200>,
      <created by zg, POWCHK disabled, PULCHK disabled
       configuration hash MD5:
       00 E9 B6 7A A2 85 ED C7 34 08 36 98 17 FE 4E 26
       data hash MD5: 16K
       A1 15 DD C0 3E 86 0B 9C 59 87 83 3C 56 4C 93 65>)
$$ ##END=
$$ 
$$ hash MD5
$$ C5 89 07 E2 44 2C 25 8D 4B AB DB D0 8E 17 10 F2
##$RELAX= 
##$RELAX= 
##$RELAX= 
##$RELAX= 
##$RELAX= 
##$RELAX= 
$$ Bruker specific parameters
$$ --------------------------
##$DU= <F:/spectra>
##$EXPNO= 1
##$NAME= <H-F>
##$PROCNO= 1
##$TYPE= <nmr>
##$USER= <she>
##$AMP= (0..31)
100 100 100 100 100 100 100 100 100 100 100 100 100 100 100 100 100 100 
100 100 100 100 100 100 100 100 100 100 100 100 100 100 
##$AQSEQ= 0
##$AQ_mod= 1
##$AUNM= <au_zg>
##$AUTOPOS= <>
##$BF1= 200.13
##$BF2= 200.13
##$BF3= 200.13
##$BF4= 200.13
##$BF5= 200.13
##$BF6= 200.13
##$BF7= 200.13
##$BF8= 200.13
##$BYTORDA= 1
##$CFDGTYP= 0
##$CFRGTYP= 5
##$CHEMSTR= <none>
##$CNST= (0..31)
1 1 145 1 1 1 1 1 1 1 1 1 1 1 1 1 1 1 1 1 1 1 1 1 1 1 1 1 1 1 1 1 
##$CPDPRG= <>
##$CPDPRG1= <>
##$CPDPRG2= <>
##$CPDPRG3= <>
##$CPDPRG4= <mlev>
##$CPDPRG5= <mlev>
##$CPDPRG6= <mlev>
##$CPDPRG7= <mlev>
##$CPDPRG8= <mlev>
##$CPDPRGB= <>
##$CPDPRGT= <>
##$D= (0..31)
0 1.2 0 0 0 0 0 0 0 0.06 0 0.03 0 0 0 0 0.0002 0 0 0 0 0 0 0 0 0 0 0 0 
0 0 0 
##$DATE= 1675945717
##$DBL= (0..7)
120 120 120 120 120 120 120 120 
##$DBP= (0..7)
150 150 150 150 150 150 150 150 
##$DBP07= 0
##$DBPNAM0= <>
##$DBPNAM1= <>
##$DBPNAM2= <>
##$DBPNAM3= <>
##$DBPNAM4= <>
##$DBPNAM5= <>
##$DBPNAM6= <>
##$DBPNAM7= <>
##$DBPOAL= (0..7)
0.5 0.5 0.5 0.5 0.5 0.5 0.5 0.5 
##$DBPOFFS= (0..7)
0 0 0 0 0 0 0 0 
##$DE= 6
##$DECBNUC= <off>
##$DECIM= 32
##$DECNUC= <off>
##$DECSTAT= 4
##$DIGMOD= 1
##$DIGTYP= 9
##$DL= (0..7)
0 120 120 120 120 120 120 120 
##$DP= (0..7)
150 150 150 150 150 150 150 150 
##$DP07= 0
##$DPNAME0= <>
##$DPNAME1= <>
##$DPNAME2= <>
##$DPNAME3= <>
##$DPNAME4= <>
##$DPNAME5= <>
##$DPNAME6= <>
##$DPNAME7= <>
##$DPOAL= (0..7)
0.5 0.5 0.5 0.5 0.5 0.5 0.5 0.5 
##$DPOFFS= (0..7)
0 0 0 0 0 0 0 0 
##$DQDMODE= 0
##$DR= 18
##$DS= 0
##$DSLIST= <SSSSSSSSSSSSSSS>
$$ [...]
##$SUBNAM2= <"">
##$SUBNAM3= <"">
##$SUBNAM4= <"">
##$SUBNAM5= <"">
##$SUBNAM6= <"">
##$SUBNAM7= <"">
##$SUBNAM8= <"">
##$SUBNAM9= <"">
##$SW= 18.05172834244
##$SWIBOX= (0..15)
0 0 2 0 0 0 0 0 0 0 0 0 0 0 0 0 
##$SW_h= 3612.71676300578
##$TD= 16384
##$TD0= 1
##$TE= 0
##$TE2= 300
##$TE3= 300
##$TEG= 300
##$TL= (0..7)
0 120 120 120 120 120 120 120 
##$TP= (0..7)
150 150 150 150 150 150 150 150 
##$TP07= 0
##$TPNAME0= <>
##$TPNAME1= <>
##$TPNAME2= <>
##$TPNAME3= <>
##$TPNAME4= <>
##$TPNAME5= <>
##$TPNAME6= <>
##$TPNAME7= <>
##$TPOAL= (0..7)
0.5 0.5 0.5 0.5 0.5 0.5 0.5 0.5 
##$TPOFFS= (0..7)
0 0 0 0 0 0 0 0 
##$TUNHIN= 0
##$TUNHOUT= 0
##$TUNXOUT= 0
##$USERA1= <user>
##$USERA2= <user>
##$USERA3= <user>
##$USERA4= <user>
##$USERA5= <user>
##$V9= 5
##$VALIST= <valist>
##$VCLIST= <CCCCCCCCCCCCCCC>
##$VD= 0
##$VDLIST= <DDDDDDDDDDDDDDD>
##$VPLIST= <PPPPPPPPPPPPPPP>
##$VTLIST= <TTTTTTTTTTTTTTT>
##$WBST= 1024
##$WBSW= 4
##$XGAIN= (0..3)
0 0 0 0 
##$XL= 0
##$YL= 0
##$YMAX_a= 130257
##$YMIN_a= -143712
##$ZGOPTNS= <>
##$ZL1= 120
##$ZL2= 120
##$ZL3= 120
##$ZL4= 120
##$ABSF1= 10
##$ABSF2= 0
##$ABSG= 5
##$ABSL= 3
##$ALPHA= 0
##$AQORDER= 0
##$ASSFAC= 0
##$ASSFACI= 0
##$ASSFACX= 0
##$ASSWID= 0
##$AUNMP= <proc_1d>
##$AZFE= 0.1
##$AZFW= 0.1
##$BCFW= 1
##$BC_mod= 2
##$BYTORDP= 1
##$COROFFS= 0
##$CY= 11.3945322036743
##$DATMOD= 1
##$DC= 2
##$DFILT= <>
##$DTYPP= 0
##$F1P= 2.36226072786647
##$F2P= -0.459571619588291
##$FCOR= 0.5
##$FTSIZE= 0
##$FT_mod= 4
##$GAMMA= 1
##$GB= 0.15
##$INTBC= 1
##$INTSCL= 1
##$ISEN= 128
##$LB= 0.24
##$LEV0= 0
##$LPBIN= 0
##$MAXI= 10000
##$MC2= 0
##$MEAN= 0
##$ME_mod= 0
##$MI= 1.114404
##$NCOEF= 0
##$NC_proc= 0
##$NLEV= 6
##$NOISF1= 3.799351
##$NOISF2= 2.8
##$NSP= 1
##$NTH_PI= 0
##$NZP= 0
##$OFFSET= 15.70392
##$PC= 1
##$PHC0= -19113.33
##$PHC1= 11.00078
##$PH_mod= 1
##$PKNL= yes
##$PPARMOD= 0
##$PSCAL= 0
##$PSIGN= 0
##$REVERSE= no
##$SF= 200.130013532006
##$SI= 16384
##$SIGF1= 3
##$SIGF2= 2
##$SINO= 400
##$SIOLD= 16384
##$SREGLST= <1H.CDCl3>
##$SSB= 0
##$STSI= 0
##$STSR= 0
##$SW_p= 3612.71676300578
##$SYMM= 0
##$S_DEV= 0
##$TDeff= 0
##$TDoff= 0
##$TI= <>
##$TILT= no
##$TM1= 0
##$TM2= 0
##$TOPLEV= 0
##$USERP1= <user>
##$USERP2= <user>
##$USERP3= <user>
##$USERP4= <user>
##$USERP5= <user>
##$WDW= 1
##$XDIM= 8192
##$YMAX_p= 0
##$YMIN_p= 0
$$ End of Bruker specific parameters
$$ ---------------------------------
##NTUPLES= NMR FID
##VAR_NAME=  TIME,          FID/REAL,        FID/IMAG
##SYMBOL=    X,             R,               I
##VAR_TYPE=  INDEPENDENT,   DEPENDENT,       DEPENDENT
##VAR_FORM=  AFFN,          ASDF,            ASDF
##VAR_DIM=   8192,          8192,            8192
##UNITS=     SECONDS,       ARBITRARY UNITS, ARBITRARY UNITS
##FACTOR=    0.0002768,     1,               1
##FIRST=     0,             0,               0
##LAST=      2.2672688,     0,               0
##MIN=       0,             -143712,         0
##MAX=       2.2672688,     130257,          0
$$ Real data points
##PAGE= N=1
##DATA TABLE= (X++(R..R)), XYDATA
$$ [...]
$$ plain form
1831 916 743 -1079 -129 890 -122 -707 -123 552 -282 -1159 379 650 -794 -550 375 338 -605 -825 607
1850 607 431 -1087 109 1103 50 -832 164 682 -39 -1164 407 683 -837 -313 1 441 -642 -880
1868 -880 1095 307 -973 7 552 18 -688 -168 1031 55 -740 671 810 -317 -247 494 697 -420
1886 -420 -901 1082 301 -962 -256 692 -132 -928 -688 447 -411 -1201 259 230 -539 -894 37 900 -434
1905 -434 -549 1246 630 -237 199 995 978 -130 242 1594 452 -585 378 654 -142 -909 -261 369 -957
1924 -957 -985 19 104 -1030 -597 236 252 -698 -402 790 -201 -197 436 776 -16 -153 448 1296 -64 -285
1944 -285 841 254 -187 -344 321 447 -1044 -388 397 -360 -715 0 -138 -106 -728 0 680 -581 -406
1963 -406 523 222 165 -80 677 1076 -285 -36 901 119 -327 148 208 310 -722 -182 329 -544 -522 -82
$$ packed form
1831I16j73j822R50J019j012n85N84O75q34q77J538K71j444K44R25l7r43k20J432
1850F07j76j518J196R94j053q82R96N18p21j125J571K76j520N24L14M40j083k38
1868h80J975p88j280R80N45n34p06N20J199r76p95J411J39j127P0P41K03j117
1886d20m81J983p81j263P06R48q24p96K40J135q58p90J460k9p69l55R31Q63j334
1905d34j15J795o16q67M36P96j7j108L72J352j142j037R63K76p96p67O48O30j326
1924i57k8J004Q5j134M33Q33J6r50K96J192r91MO33L40p92j37O01Q48j360k21
1944b85J126n87m41j57O65J26j491O56P85p57l55P15j38L2o22P28O80j261J75
1963d06R29l01n7k45P57L99j361K49R37p82m46M75O0J02j032N40N11q73K2M40
$$ plain form
1983 -82 -412 -276 -446 231 305 -555 94 297 -63 223 258 362 458 -223 263 420 -1 163 123 283 -110 -516
2005 -516 94 18 -731 -285 -224 -151 148 -125 260 312 -152 158 293 20 155 -134 -35 627 -273 137 488 -97
2027 -97 -239 -149 -121 -272 -533 -113 -208 -372 -72 -74 35 46 -34 -167 308 -4 120 348 24 341 33 240 648
2050 648 -256 157 167 -349 214 -237 6 -42 -615 -423 4 -450 -296 -298 -320 -26 -324 -145 573 -308 106 282
2072 282 215 416 5 499 634 -135 10 402 -203 -109 -434 93 -54 -743 -202 10 -737 -536 -123 -41 -122
2093 -122 -692 546 352 -262 -84 681 437 173 16 795 573 -95 151 624 160 -95 337 196 164 -666
2113 -666 -166 269 -620 -327 -64 6 -446 -570 2 -156 -495 45 280 22 81 254 405 393 -432 545 450
2134 450 -155 -37 306 456 -94 -427 460 247 -673 -182 285 32 -493 -178 530 -13 -514 88 409 -190
$$ packed form
1983h2l30J36j70O77P4q60O49K03l60K86L5J04R6o81M86J57m21J64m0J60l93m06
2005e16O10p6p49M46O1P3K99k73L85N2m64L10J35k73J35k89R9O62r00M10L51n85
2027i7j42R0K8j51k61M20r5j64L00kJ09J1q0j33M75l12J24K28l24L17l08K07M08
2050F48r04M13J0n16N63m51K43m8n73J92M27m54J54kk2K94k98J79P18q81M14J76
2072B82o7K01m11M94J35p69J45L92o05R4l25N27j47o89N41K12p47K01M13Q2q1
2093a22n70J238j94o14J78P65k44k64j57P79k22o68K46M73m64k55M32j41l2q30
2113f66N00M35q89K93K63P0m52j24N72j58l39N40K35k58N9J73J51j2q25R77r5
2134D50o05J18L43J50n50l33Q87k13r20M91M67k53n25L15P08n43n01O02L21n99
$$ plain form
2154 -190 -52 177 428 -208 -47 580 279 -291 -270 386 64 -373 -136 244 -120 -806 287 532 -473 -319
2174 -319 71 410 -322 -265 700 471 -345 114 468 237 -189 -242 432 -77 -413 -15 242 -393 -473 4 541
2195 541 -238 -574 326 -128 -510 -524 -56 368 -213 -134 857 -85 -73 114 369 -56 -204 -285 570 96 -554
2216 -554 594 -132 -375 -383 16 336 -647 -487 564 -149 -241 92 387 171 -474 128 811 310 -265 734
2236 734 302 261 -120 230 447 -603 -268 115 -269 -356 -4 -57 -71 -620 -120 198 -387 -617 -1 102 31
2257 31 -80 201 274 -131 -147 700 329 2 314 426 301 26 -47 518 -199 -186 69 -14 21 -400 -34 124
2279 124 -590 -364 -106 -152 -239 -338 187 359 -166 437 137 81 -173 47 112 32 42 333 313 -279 223 40 -261
2302 -261 -232 -311 49 112 -613 -232 146 -466 37 156 -156 42 -123 -16 113 -211 196 121 -127 364 -78
$$ packed form
2154a90J38K29K51o36J61O27l01n70K1O56l22m37K37L80l64o86J093K45j005J54
2174c19L90L39p32N7R65k29q16M59L54k31m26n3O74n09l36L98K57o35q0M77N37
2195E41p79l36R00m54l82j4M68M24n81P9R91r42J2J87K55m25j48q1Q55m74o50
2216e54J148p26k43qL99L20r83J60J051p13r2L33K95k16o45O02O83n01n75R99
2236G34m32m1l81L50K17j050L35L83l84q7L52n3j4n49N00L18n85k30O16J03p1
2257C1j11K81P3m05j6Q47l71l27L12J12j25k75p3N65p17J3K55q3L5m21L66J58
2279A24p14K26K58m6q7r9N25J72n25O03l00n6k54K20O5q0J0K91k0n92N02j83l01
2302b61K9p9L60O3p25L81L78o12N03J19l12J98j65J07J29l24M07p5k48M91m42
$$ plain form
2323 -78 142 281 -181 -10 17 -298 102 -116 -6 65 -214 -203 104 12 96 -59 -227 69 -253 -134 -98 -54 208
2346 208 -321 59 -15 -399 -47 169 -335 85 200 84 29 -176 -33 185 -333 -192 -20 102 -29 -141 162
2367 162 126 -345 108 156 -78 -76 -153 -148 86 -373 18 222 -320 -87 -103 -108 -77 -268 108 324 -108 -180 265 353
2391 353 -19 -35 186 200 -272 -94 427 -42 194 78 278 -159 -394 222 165 -314 -101 -253 -261 -221 -468 17
2413 17 126 -172 -181 61 -235 -489 -144 66 140 -10 573 405 -231 150 245 173 -30 -199 225 295 -515 -68
2435 -68 26 0 -180 -333 352 -118 -459 182 250 -51 -386 178 97 -44 -415 8 292 73 -155 260 95 47
2457 47 22 172 138 -266 108 116 -85 -94 39 228 -210 -362 6 115 -106 -309 -28 151 -221 -304 341 136 -173
2480 -173 8 75 357 2 3 356 -314 -125 264 255 -152 -226 -1 108 -153 -200 392 102 -252 -30 -36 145 -178
$$ packed form
2323g8K20J39m62J71K7l15M00k18J10P1k79J1L07r2Q4j55j68K96l22J19L6M4K62
2346B08n29L80p4l84L52K16n04M20J15j16n5k05J43K18n18J41J72J22j31j12L03
2367A62l6m71M53M8k34Kp7NK34m59L91K04n42K33j6nL1j91L76K16m32p2M45Q8
2391C53l72j6K21J4m72J78N21m69K36j16K00m37k35O16n7m79K13j52qM0k47M85
2413A7J09k98rK42k96k54L45K10P4j50N83j68o36L81R5p2k03j69M24P0q10M47
2435f8R4k6j80j53O85m70l41O41O8l01l35N64q1j41l71M23K84k19k28M15j65m8
2457D7k5J50l4m04L74Qk01rJ33J89m38j52L68J09k21k03K81J79l72q3O45k05l09
2480a73J81O7K82l55JL53o70J89L89rm07p4K25J09k61m7N92k90l54K22oJ81l23
$$ plain form
2503 -178 38 115 -218 -187 -143 -64 -338 -68 56 131 -24 -242 264 -368 -280 -44 69 -48 249 -196 106 7
2525 7 -239 208 -26 97 97 63 190 -170 -187 119 23 -64 44 125 196 -373 -203 343 -140 -313 264 -19 -306
2548 -306 -264 74 -1 15 -61 -27 113 102 -46 99 185 -187 250 199 -53 -186 -223 198 -46 -184 -25 216 -266
2571 -266 -174 -134 108 -36 -294 -169 -62 -57 28 180 -330 -14 5 265 81 -265 335 -54 57 -47 176 75
2593 75 -193 26 -133 138 -284 -213 21 -87 -90 -163 -25 -174 1 -13 187 -46 -11 -21 83 294 -225 455 178
2616 178 -296 220 -44 -36 -72 -138 -67 40 -23 92 50 98 -72 -188 -89 -24 -80 137 144 -171 120 -51 -95 165 141
2641 141 -63 -82 278 -48 32 -55 -53 -266 35 227 33 -258 173 86 -229 -181 -145 330 -201 31 232 -209 -39
2664 -39 -268 -232 150 15 -25 -49 -13 86 -236 136 43 -7 -160 208 -152 17 136 -31 -242 -162 31 58 -49
$$ packed form
2503a78K16P7l33L1M4P9k74K70J24P5j55k18N06o32Q8K36J13j17K97m45L02r9
2525Gk46M47k34J23%l4J27l60j7L06r6q7J08Q1P1n69J70N46m83j73N77k83k87
2548c06M2L38p5J6p6L4J40j1j48J45Q6l72M37n1k52j33l7M21k44j38J59K41m82
2571b66R2M0K42j44k58J25J07NQ5J52n10L16J9K60j84l46O00l89J11j04K23j01
2593G5k68K19j59K71m22P1K34j08lp3J38j49J75j4K00k33L5j0J04K11n19O80k77
2616A78m74N16k64Ql6o6P1J07o3J15m2M8j70j16R9O5n6K17Pl15K91j71m4K60k4
2641A41k04j9L60l26Q0q7Kk13L01J92j94k91M31q7l15M8L6M75n31K32K01m41J70
2664c9k29L6L82j35m0k4L6R9l22L72r3n0j53L68l60J69J19j67k11Q0J93K7j07
$$ plain form
2687 -49 31 93 374 -28 -32 68 69 -50 -154 -124 205 172 -282 -156 43 -107 58 236 82 194 205 80 -122
2710 -122 -147 201 42 -67 48 135 116 11 -25 552 104 -116 276 42 31 -94 -77 -84 28 -333 -50 -191 -207
2733 -207 12 -154 -52 -107 84 328 -71 -505 188 101 -65 -82 109 572 -14 80 68 192 168 171 107 29 -89
2756 -89 58 90 -177 -273 -62 30 -176 -7 -69 -54 -147 -144 214 -59 -357 -234 -173 88 -70 -211 33 -133 -115 171
2780 171 -155 151 83 -331 252 -266 -122 104 27 -48 32 -13 220 -298 -158 298 -24 -134 121 136 37 -231
2802 -231 78 154 -107 -45 -13 274 -268 219 -1 138 42 -41 124 2 -66 1 274 20 -1 12 30 -51 -216 118
2826 118 229 307 -200 65 -65 -185 -123 180 173 -80 -9 -193 174 -75 -98 306 66 -118 27 -66 -72 -93 42
2849 42 168 146 -66 67 -190 89 131 -61 32 -23 -187 222 -294 -112 -7 29 129 -176 44 -19 -94 99 -147
$$ packed form
2687d9Q0O2K81m02mJ00Jj19j04L0L29l3m54J26J99j50J65J78j54J12J1j25k02
2710a22k5L48j59j09J15Q7j9j05l6N77m48k20L92k34j1j25J7pJ12l61K83j41j6
2733b07K19j66J02n5J91K44l99m34O93q7j66j7J91M63n86R4j2J24k4Lo4p8j18
2756h9J47L2k67r6K11R2k06J69o2J5r3LL58k73k98J23O1K61j58j41K44j66J8K86
2780A71l26L06o8m14N83n18J44K26p7p5Q0m5K33n18J40M56l22j10K55J5r9k68
2802b31L09P6k61O2L2K87n42M87k20J39r6q3J65j22o8O7K73k54k1J3J8q1j65L34
2826A18J11P8n07K65j30j20O2L03pk53P1j84L67k49k3M04k40j84J45r3ok1J35
2849D2J26k2k12J33k57K79M2j92R3n5j64M09n16J82J05L6J00l05K20o3p5J93k46
$$ plain form
2872 -147 18 159 136 97 150 160 -84 244 39 120 -158 113 -55 123 224 -58 253 27 147 68 -5 3 145
2895 145 153 -239 16 -96 -86 34 -13 6 204 -124 214 38 156 235 75 55 27 -16 49 205 -26 -111 52 197
2919 197 -144 -160 257 -39 -92 -59 -350 -124 132 181 -117 -122 6 -18 157 -37 124 156 340 153 -110 52 -108
2942 -108 41 322 124 29 -157 39 -73 202 -20 78 73 -134 -112 29 54 142 -240 27 47 168 87 21 -10 231
2966 231 -22 177 136 30 90 -99 -28 -92 -232 43 70 -91 -129 8 -30 -84 -66 -150 -7 0 -33 -185 -9 -108 -112
2991 -112 8 -38 -8 -164 316 106 200 -52 40 51 9 -119 220 -103 -116 -186 39 -219 -349 101 15 -242 353
3014 353 -24 -101 42 74 -60 -84 -117 26 57 -247 160 -71 -110 -201 -36 1 -46 -13 51 23 134 -34 147 147 78
3039 78 178 172 191 159 94 -133 -26 -30 21 -36 118 15 44 50 -82 -112 -173 269 -198 -25 -123 -143 -275 -125 74 92
$$ packed form
2872a47J65J41k3l9N3J0k44L28k05Q1k78K71j68J78J01k82L11k26J20p9p3QJ42
2895A45Ql92K55j12J0J20m7J9J98l28L38j76J18P9j60k0k8m3O5J56k31q5J63J45
2919A97l41j6M17k96n3L3k91K26K56M9k98nJ28k4J75j94J61L2J84j87k63J62j60
2942a08J49K81j98r5j86J96j12K75k22R8nk07K2J41K5Q8l82K67K0J21q1o6l1K41
2966B31k53J99m1j06O0j89P1o4j40K75K7j61l8J37l8n4J8q4J43Pl3j52J76r9m
2991a12J20m6L0j56M80k10R4k52R2J1m2j28L39l23j3p0K25k58j30M50q6k57N95
3014C53l77p7J43L2j34k4l3J43L1l04M07k31l9r1J65L7m7L3O4k8J11j68J81%o9
3039G8J00oJ9l2o5k27J07mN1n7J54j03K9Oj32l0o1M42m67J73r8k0j32J50J99J8
$$ plain form
3065 92 -26 -90 371 -73 34 28 63 -50 67 -25 228 182 7 125 135 8 -71 194 60 166 151 -168 -76 -54
3089 -54 28 -158 -50 197 55 275 -50 -183 -55 73 -114 371 226 203 124 18 -21 192 19 -152 5 106
3111 106 -77 -179 66 -361 -189 65 2 -253 -79 -34 349 -13 40 164 1 18 -61 95 191 -276 -13 307
3133 307 -41 -121 43 -1 160 -83 -48 94 -48 -131 232 -76 37 90 205 -8 -48 -54 44 -70 -235 210 -39
3156 -39 55 12 34 41 -164 113 281 193 22 -1 -15 87 73 153 -77 -77 -26 -25 149 240 -40 353 64 -52 116 257
3182 257 85 -5 -15 -179 -14 -75 169 -61 -33 -198 29 -106 38 28 -57 355 -107 127 -71 -164 71 -122
3204 -122 125 43 -68 -38 150 -42 -5 -42 208 175 -13 90 250 41 -60 -53 -34 -47 29 79 -74 -206 -204 83
3228 83 41 56 16 -231 204 145 42 333 -115 230 147 39 188 78 -194 21 260 38 39 132 120 -270 97
$$ packed form
3065I2j18o4M61m44J07oL5j13J17r2K53m6j75J18J0j27p9K65j34J06j5l19R2K2
3089e4Q2j86J08K47j42K20l25j33J28J28j87M85j45k3p9j06l9K13j73j71J57J01
3111A06j83j02K45m27J72K54o3k55J74M5L83l62N3J24j63J7p9J56R6m67K63L20
3133C07l48q0J64m4J61k43L5J42j42q3L63l08J13N3J15k13m0oR8j14j65M45k49
3156c9R4m3K2Pk05K77J68q8j71k3j4J02j4Q0k30%N1JJ74R1k80L93k89j16J68J41
3182B57j72r0j0j64J65o1K44k30K8j65K27j35J44j0q5M12m62K34j98r3K35j93
3204a22K47q2j11L0J88j92L7l7K50l3j88J03J60k09j01PJ9j3P6N0j53j32KK87
3228H3m2J5m0k47M35n9j03K91m48L45q3j08J49j10k72K15K39k22JR3j2l90L67
$$ plain form
3251 97 132 -285 11 -210 -230 68 -118 94 69 159 222 -67 134 129 351 76 97 -214 -86 -34 309 -76 -102 -106
3275 -106 210 -146 -59 -15 -228 183 -95 58 245 53 -82 72 37 -77 133 -7 267 62 25 284 -59
3296 -59 284 237 -6 -215 -162 -68 -105 -295 -179 -164 78 72 -421 66 -52 -253 -235 125 361 -129 5 129 389
3319 389 0 -157 7 143 0 78 115 -81 94 -16 -40 -87 -41 -44 -190 342 -59 -168 -165 -87 -275 -166 -109 -45
3343 -45 -40 19 200 -19 -2 -18 -34 -146 273 243 58 -189 114 307 -64 156 247 -81 95 -5 5 97 -78 -118
3367 -118 -215 -204 71 3 -35 141 -56 36 -77 -89 -258 -31 -436 108 -136 154 235 -212 96 190 -24 -53 259
3390 259 43 111 124 -162 -156 -90 27 206 -61 -97 123 -105 -67 -97 87 -12 -182 -15 -189 69 -129 -168 -69 -127
3414 -127 -161 197 -95 -13 -225 28 100 267 -168 98 -93 -19 -284 -122 -145 63 7 68 47 4 -23 -6 -117 140
$$ packed form
3251I7L5m17K96k21k0K98j86K12k5R0O3k89K01nK22k75K1l11J28N2L43l85k6m
3275a06L16l56Q7M4k13M11k78J53J87j92j35J54l5j14K10j40K74k05l7K59l43
3296e9L43m7k43k09N3R4l7j90J16J5K42om93M87j18k01J8L60K36m90J34J24K60
3319C89l89j57J64J36j43P8L7j96J75j10k4m7M6lj46N32m01j09LP8j88J09N7O4
3343d5NN9J81k19J7j6j6j12M19l0j85k47L03J93l71K20R1l28J76j00J0R2j75m0
3367a18r7J1K75o8l8J76j97R2j13j2j69K27m05N44k44K90Q1m47L08R4k14k9L12
3390B59k16O8J3k86OO6J17J79k67l6K20k28L8l0J84r9j70J67j74K58j98l9R9n8
3414a27l4L58k92Q2k12K53P2J67m35K66j91P4k65J62k3K08n6O1k1m3k7J7j11K57
$$ plain form
3438 140 -54 72 80 235 82 -208 -132 234 81 7 -188 192 417 73 -123 -81 151 28 -8 -26 84 81 -98
3461 -98 43 -301 51 70 -54 185 62 -389 -122 -75 -195 -21 29 29 99 -155 217 -79 -152 -31 -26 208 -298
3484 -298 -5 -12 95 12 -106 -164 2 -144 32 -7 -26 -229 -122 -125 27 -110 -129 66 -8 -145 92 46 -77 -109
3508 -109 -149 70 -80 69 60 15 87 189 271 -295 120 51 -42 -3 89 -76 19 -38 -173 11 -23 -158 -228 -39 72
3533 72 1 104 32 17 33 -88 122 102 241 59 112 278 -102 271 -45 75 -24 42 77 -79 68 23 -26 175
3557 175 353 173 152 -234 -26 -166 -130 95 -119 213 -51 54 19 -21 83 -45 -11 -61 203 -13 -4 -275 -140
3580 -140 87 122 137 209 211 11 -48 -85 -1 -134 286 -309 -96 -153 -219 -207 -4 162 -7 -82 -207 169 -208 80
3604 80 20 138 121 -25 232 293 -60 60 193 -186 47 146 -46 -194 169 -14 -54 -69 13 -171 -132 128 43
$$ packed form
3438A40j94J26QJ55j53k90P6L66j53p4j95L80K25l44j96M2K32j23l6j8J10lj79
3461i8J41l44L52J9j24K39j23m51K67M7j20J74N0%P0k54L72k96p3J21NK34n06
3484b98K93pJ07q3j18n8J66j46J76l9j9k03J07lJ52j37j9J95p4j37K37m6j23l2
3508a09m0K19j50J49rm5P2J02Q2n66M15o9r3L9R2j65R5n7j35J84l4j35p0J89J11
3533G2p1J03p2j5J6j21K10k0J39j82N3J66l80L73l16J20r9O6L5j56J47m5m9K01
3557A75J78j80k1l86K08j40L6K25k14L32k64J05l5m0J04j28L4n0K64k16Rk71J35
3580a40K27L5J5P2Kk00n9l7Q4j33M20n95K13n7o6J2K03J66j69p5j25L76l77K88
3604H0o0J18j7j46K57O1l53J20J33l79K33R9j92j48L63j83m0j5Q2j84L9K60q5
$$ plain form
3627 43 -150 -129 -193 -279 73 108 -263 -235 260 -4 -88 -37 10 102 -82 57 133 -1 -207 165 -279 140 208 87
3651 87 59 43 139 -8 109 -133 -129 -65 -228 -16 115 -96 -96 -113 162 13 -97 -13 87 100 54 -56 -96 78 -56
3676 -56 58 190 -183 -167 -73 47 268 146 35 -156 -100 213 -133 28 -55 178 17 -178 -274 -50 -49 -107 99
3699 99 -148 184 40 -122 34 -146 86 46 -32 -21 145 173 12 170 -174 42 -101 -106 48 183 197 -160 -158
3722 -158 30 -152 124 70 -31 -111 186 -66 94 -50 -189 -185 165 285 -137 72 27 38 -113 308 229 262 -153
3745 -153 50 -39 -164 -294 10 -42 -100 -32 -14 100 -91 -130 55 334 83 265 14 61 172 11 46 -17 -127
3768 -127 14 2 58 231 -69 143 106 89 -49 111 160 92 290 -40 73 64 -88 -21 115 58 -204 41 171
3791 171 -81 62 -17 -23 -56 186 -50 -146 159 85 76 -143 61 66 -131 -49 -57 -254 -72 -41 -5 5 7 132 167 102 80
$$ packed form
3627D3j93K1o4q6L52L5l71K8M95k64q4N1M7R2j84J39P6j34k06L72m44M19O8j21
3651H7k8j6R6j47J17k42MO4j63K12J31k11%j7K75j49j10Q4J00J3m6j10m0J74j34
3676e6J14J32l73J6R4J20K21j22j11j91N6L13l46J61q3K33j61j95r6K24Jn8K06
3699I9k47L32j44j62J56j80K32m0p8J1J66K8j61J58l44K16j43nJ54J35J4l57K
3722a58J88j82K76n4j01q0K97k52J60j44j39ML50J20m22K09m5J1j51M21p9L3m15
3745a53K03q9j25j30L04n2n8O8J8J14j91l9J85K79k51J82k51M7J11j61L5o3j10
3768a27J41j2N6J73l00K12l7j7j38J60M9o8J98l30J13rj52O7J36n7k62K45J30
3791A71k52J43p9ol3K42k36r6L05p4rk19K04Nj97Q2qj97J82L1L6J0KJ25L5o5k2
$$ plain form
3818 80 -257 -39 -53 36 -87 -106 205 -11 115 -151 -51 -124 406 42 -73 141 -24 158 54 73 175 261
3840 261 8 -179 -36 51 30 103 -77 -88 -64 0 89 -313 141 26 -270 31 108 -14 -83 -169 -156 -25 26 233
3864 233 7 21 294 66 -115 -19 53 139 -147 -202 -227 70 15 -19 -2 163 -220 78 81 -118 -18 -137 -19 54
3888 54 -97 -66 -129 -110 98 -254 233 168 43 25 31 -20 77 -105 80 92 -18 57 20 -190 -57 -19 9 144 6
3913 6 -77 -34 -89 -55 122 75 -222 115 38 71 -190 -116 25 -141 170 -94 270 265 49 -23 153 235 196 -67 -255
3938 -255 80 140 -13 -102 -27 -23 -135 -9 -17 20 54 41 -23 -44 20 -151 -220 1 68 45 253 285 9 -152 -124 122
3964 122 225 -135 209 99 -69 -20 -226 107 243 220 -47 -35 -246 -298 -32 85 263 24 -121 134 -290
3985 -290 -254 29 -55 42 -198 -94 206 153 -100 20 -82 -58 8 193 -112 38 128 -52 205 135 3 -101 100
$$ packed form
3818H0l37K18j4Q9j23j9L11k16J26k66J00p3N30l64j15K14j65J82j04J9J02Q6
3840B61k53j87J43Q7k1P3j80j1K4O4Q9m02M54j15k96L01P7j22o9q6J3J31N1K07
3864B33k26J4K73k28j81R6P2Q6k86n5k5K97n5l4J7J65l83K98Lj99J00j19J18P3
3888E4j51L1o3J9K08l52M87o5j25j8On1R7j82J85J2j10P5l7k10J33L8K8J35j38
3913Fq3M3n5L4J77m7k97L37p7L3k61P4J41j66L11k64L64nk16p2J76Q2l9k63j88
3938b55L35O0j53q9P5Mj12J26qL7L4j3o4k1O4j71o9K21O7k3K08L2k76j61K8K46
3964A22J03l60L44j10j68M9k06L33J36k3k67J2k11n2K66J17J78k39j45K55m24
3985b90L6K83q4R7k40J04L00n3k53J20j02K4O6J85l05J50R0j80K57p0j32j04K01
$$ plain form
4008 100 -204 -113 74 -127 -70 111 308 -118 48 1 -73 310 -70 245 197 58 19 33 54 -18 51 91 -76 -281
4032 -281 81 -25 -36 -171 -84 49 -36 -44 232 49 -159 -173 183 -21 -182 39 13 20 33 177 25 51 180 -77
4056 -77 -61 169 -27 145 134 -102 -167 -37 -37 77 288 -7 65 218 105 14 -64 179 -108 -287 89 242 186
4079 186 74 -209 272 54 -63 196 -263 -81 28 -23 195 -50 -4 -106 -3 92 61 16 300 -31 -353 64
4101 64 -163 -168 146 -275 6 -118 102 -66 24 -2 -167 59 24 -209 -30 53 -181 -78 76 -223 -314 -122 21
4124 21 -38 327 96 -75 -22 -8 105 -125 209 -229 106 -179 -7 277 130 -174 43 93 6 -58 -204 -330
4146 -330 -93 -114 199 42 -59 309 26 -63 71 118 131 53 -34 -8 -46 139 5 276 72 -369 -146 192 70
4169 70 207 202 93 58 65 -67 168 -131 -38 157 -60 35 4 -128 -83 46 43 296 226 -77 103 28 66 -111 155
$$ packed form
4008A00l04R1J87k01N7J81J97m26J66m7p4L83l80L15m8j39l9J4K1p2O9M0j67k05
4032b81L62j06j1j35Q7J33q5qK76j83k08j4L56k04j61K21k6PJ3J44j52K6J29k57
4056g7J6K30j96J72j1k36o5J30%J14K11k95P2J53j13r1p8K43k87j79L76J53n6
4079A86j12k83M81k18j17K59m59J82J09n1K18k45M6j02J03R5l1m5K84l31l22M17
4101F4k27nL14m21K81j24K20j68R0k6j65K26l5k33J79Q3k34J03J54k99r1J92J43
4124B1n9L65k31j71N3J4J13k30L34m38L35k85J72K84j47l04K17N0q7o4j46j26
4146c30K37k1L13j57j01L68k83q9J34M7J3p8q7K6l8J85j34K71k04m41K23L38j22
4169G0J37nj09l5Pj32K35k99R3J95k17R5l1j32M5J29lK53p0l03J80p5L8j77K66
$$ plain form
4194 155 153 -190 9 -179 -201 -147 -8 125 -4 105 78 -102 200 -22 8 15 160 -92 -162 -80 -61 -102 100 -70
4218 -70 -150 178 126 72 -113 269 100 -91 84 236 68 251 -49 4 292 89 -16 -95 4 -155 -219 177 -39
4241 -39 -74 -25 -133 -76 89 -17 -109 -86 -120 -118 56 32 171 114 -137 -22 25 139 -43 97 106 3 61 178 27
4266 27 4 87 -23 17 -32 188 80 -213 162 -61 79 -140 200 -81 -6 -43 -88 -3 51 -183 262 68 -88
4289 -88 114 -272 163 53 68 -80 -261 -72 223 -129 -119 41 -102 41 -120 53 72 -157 -74 206 -97 -55
4311 -55 -45 88 228 41 107 118 46 -64 194 64 100 -156 -77 76 -88 -40 -252 17 -138 78 -213 70 -112
4334 -112 -105 66 53 -127 -67 203 218 -469 -78 -262 -6 -199 -47 -164 -170 18 108 110 122 -81 -162 -85 58 163
4358 163 -23 -151 56 90 -116 67 -129 -116 27 -50 -42 49 59 -168 -8 -49 -87 69 43 293 40 -62 -7 144
$$ packed form
4194A55kl43J99j88k2N4J39J33j29J09k7j80L02k22L0PJ45k52p0Q2J9m1K02j70
4218g0q0L28n2n4j85L82j69j91J75J52j68J83l00N3K88k03j05p9R9j59o4L96k16
4241c9l5M9j08N7J65j06r2K3l4KJ74k4J39n7k51J15M7J14j82J40Rj03N8J17j51
4266B7k3Q3j10M0m9K20j08k93L75k23J40k19L40k81P5l7m5Q5N4k34M45j94j56
4289h8K02l86M35j10J5j48j81J89K95l52J0J60j43J43j61J73J9k29Q3K80l03M2
4311e5J0J33J40j87O6J1p2j10K58j30L6k56P9J53j64M8k12K69j55K16k91K83j82
4334a12PJ71j3j80O0K70J5o87L91j84K56j93J52j17oJ88R0KJ2k03q1P7J43J05
4358A63j86j28K07L4k06J83j96J3J43p7QR1J0k27J60m1l8J56k6K50k53j02N5J51
$$ plain form
4382 144 -184 46 319 162 126 218 -151 27 88 48 -135 184 168 -119 215 -286 8 20 -60 272 -136 58
4404 58 189 -118 86 -31 30 -60 103 -206 20 11 -97 97 34 223 82 -248 152 252 -36 263 -152 -101
4426 -101 133 -78 -102 -77 -64 -14 -277 -125 -183 -121 184 -33 -338 233 -138 -57 151 250 1 -13 -100 100 37 110
4450 110 55 -53 30 1 -164 27 106 -27 44 225 -166 122 -148 77 252 42 -71 124 65 -68 -62 -13 202
4473 202 -86 -8 -134 -45 180 198 125 162 184 -77 124 -222 164 67 -34 172 -146 49 -236 33 -23 13 144
4496 144 21 173 101 -54 -59 210 76 -14 -97 -50 172 98 -141 -58 -88 -186 -106 8 -143 184 -14 21 205 76
4520 76 -230 -57 -32 18 -212 175 -9 -50 -8 107 -100 16 62 -47 64 95 206 216 -189 27 -103 -71 -162
4543 -162 -96 -132 -5 14 3 -13 51 -130 70 51 26 225 14 -32 45 51 82 -82 227 -169 -57 220 -95 -59 -16
$$ packed form
4382A44l28K30K73j57l6R2l69J78O1m0j83L19j6k87L34n01K94J2q0L32m08J94
4404E8J31l07K04j17O1r0J63l09K26rj08J94o3J89j41l30M00J00k88K99m15N1
4426a01K34k11k4K5J3N0k63J52n8O2L05k17l05N71l71Q1K08R9k49j4q7K00o3P3
4450A10n5j08Q3k9j65J91P9j33P1J81l91K88k70K25J75k10j13J95n9j33OM9K15
4473B02k88P8j26Q9K25J8p3L7K2k61K01l46L86r7j01K06l18J95k85K69n6L6J31
4496A44j23J52p2j55nK69j34r0q3M7K22p4k39Q3l0r8Q0J14j51L27j98L5J84j29
4520G6l06J73K5N0k30L87j84m1M2J15k07J16M6j09J11L1J11J0m05K16j30L2r1
4543a62O6l6J27J9j1j6O4j81K00j9k5J99k11m6P7OL1j64L09l96J12K77l15L6M3
$$ plain form
4568 -16 -67 -201 3 50 0 86 -5 21 -86 -161 188 -10 -111 -3 -79 -244 -39 -110 37 -167 -133 86 -78 -117
4592 -117 140 124 -231 -154 57 -43 49 -65 -20 40 -120 57 95 -324 198 267 79 -288 -11 230 -158 72
4614 72 181 56 -172 -77 -34 122 -30 9 192 11 -80 -105 -125 -53 245 -127 -27 -20 76 -45 -26 -204 52 -51
4638 -51 280 -80 172 -29 24 133 2 133 94 -3 -194 133 -45 31 -131 -128 -53 112 -162 3 -138 145 153
4661 153 -46 12 -124 139 231 -6 217 -238 -8 149 144 257 -7 124 176 286 -105 -148 -58 228 -55 285
4683 285 32 -112 -63 271 -86 42 -99 -109 -50 95 1 -203 97 -183 -201 -92 -21 -93 12 -44 -16 -92 165
4706 165 59 -124 -70 -89 192 62 -38 34 -87 121 57 -3 -178 -35 -78 -110 158 -29 197 -45 -217 -258 -125
4729 -125 -74 2 20 -48 -32 -105 -130 -16 287 192 115 213 51 -147 -160 110 -72 50 -54 29 31 132 86 115 72 -274
$$ packed form
4568a6n1j34K04M7n0Q6r1K6j07p5L49j98j01J08p6j65K05p1J47k04L4K19j64l9
4592a17K57j6l55P7K11j00R2j14M5O0j60J77L8m19N22O9j88l67K77K41l88K30
4614G2J09j25k28R5M3J56j52L9J83j81r1k5k0P2K98l72J00PR6j21J9j78K56j03
4638e1L31l60K52k01N3J09j31J31l9r7j91L27j78P6j62LP5J65k74J65j41K83Q
4661A53j99N8j36K63R2k37K23m55K30J57nJ13k64J31N2J10l91m3R0K86k83L40
4683B85k53j44M9L34l57J28j41j0N9J45r4k04L00k80j8J09P1p2J05n6K8p6K57
4706A65j06j83N4j9K81j30j00P2j21K08o4o0j75J43m3l2K68j87K26k42j72m1J33
4729a25N1P6J8o8J6p3k5J14L03r5p7R8j62j98j3K70j82J22j04Q3KJ01m6K9m3l46
$$ plain form
4755 -274 94 -83 41 -57 -117 -27 -291 -277 -72 -311 -16 -186 133 -180 88 -151 -65 -19 210 139 -92 95
4777 95 -80 -211 70 315 11 -36 -98 114 279 -206 167 -81 33 -235 -158 12 -45 54 32 -28 -63 24 160
4800 160 152 123 -52 177 95 -45 453 -107 15 177 56 -18 157 -159 -105 -229 -43 9 -125 -44 -71 -301 -135
4823 -135 47 -101 -50 142 9 168 -152 89 -121 -144 205 -7 -15 -2 117 42 47 140 -44 93 -15 -77 96
4846 96 -252 -14 178 -164 271 -107 -162 197 97 -208 -16 24 193 -138 -18 40 113 -119 -317 90 -101 -52
4868 -52 -87 118 -61 6 77 -161 -52 59 -90 -97 96 -73 -67 -204 -172 -273 -141 -23 -168 -63 -113 44 29 -36
4892 -36 -41 -156 -142 -91 -129 -5 119 29 124 -126 23 202 -43 -187 112 99 -139 -123 -147 -55 -63 -73 -18 -53 8 -48
4918 -48 -27 -100 8 181 -185 111 10 43 -130 77 178 -8 25 149 142 -232 78 2 58 127 -29 73 -96
$$ packed form
4755b74L68j77J24r8o0R0k64J4K05k39K95j70L19l13K68k39Q6M6K29p1k31J87
4777I5j75j31K81K45l04m7o2K12J65m85L73k48J14k68P7J70n7R9k2o0l5Q7J36
4800A60qk9j75K29q2j40M98n60J22J62j21p4J75l16N4j24J86N2j34Q1k7k30J66
4823a35J82j48N1J92j33J59l20K41k10k3L49k12qJ3J19p5NR3j84J37j08o2J73
4846I6l48K38J92l42M35l78n5L59j00l05J92M0J69l31J20N8P3k32j98M07j91M9
4868e2l5K05j79O7P1k38J09J11j49pJ93j69Oj37L2j01J32J18j45J05n0J57j5o5
4892c6nj15J4N1l8J24J24r0R5k50J49J79k45j44K99j3k38J6k4R2qj0N5l5O1n6
4918d8K1p3J08J73l66K96j01L3j73K07J01j86L3J24pl74L10p6N6O9j56J02j69
$$ plain form
4941 -96 93 120 242 231 160 82 -8 -197 -286 -5 82 125 6 -117 -176 137 51 -145 372 43 75 0 -229 -58
4965 -58 115 1 70 21 -128 24 -52 11 98 55 127 -145 -66 216 -50 -150 -105 8 -131 -6 -87 275 -128 -71
4989 -71 -81 228 59 -169 -45 -28 29 118 39 41 2 239 -155 171 146 -90 -168 -21 -51 -115 118 -108 107 17 52
5014 52 73 -351 105 -139 170 121 -11 242 72 36 78 -93 -34 -43 -234 -36 -179 261 -291 31 -67 -152 -110 94
5038 94 126 41 196 -80 269 165 -65 -60 170 210 -68 131 183 40 -167 -47 181 -213 -216 329 -90 57 9
5061 9 19 122 -216 97 221 -54 75 -69 -36 156 -47 126 78 64 -162 -15 -155 -146 122 207 -214 99 -206
5084 -206 -39 -27 -35 0 -42 -38 109 139 -11 19 -23 103 4 78 -169 10 -133 -16 251 -177 78 214 13 -128
5108 -128 2 -217 79 12 -193 120 -122 51 186 -27 -36 -188 69 5 -91 -245 243 -73 25 288 -212 -142
$$ packed form
4941i6J89K7J22j1p1p8r0j89q9K81Q7M3j19j23n9L13q6j96N17l29L2p5k29J71
4965e8J73j14O9m9j49J52p6O3Q7m3P2k72P9K82k66j00M5J13j39J25q1L62m03N7
4989g1j0L09j69k28J24J7N7Q9p9Kl9K37l94L26k5k36p8J47l0o4K33k26K15r0L5
5014E2K1m24M56k44L09m9j32K53j70l6M2j71N9rj91J98j43M40n52L22r8q5M2K04
5038I4L2q5J55k76L49j04k30NK30M0k78J99N2j43k07J20K28l94lN45m19J47m8
5061IJ0J03l38L13J24k75J29j44L3J92k03J73m8j4k26J47j40RK68Q5m21L13l05
5084b06J67J2qL5m2MJ47L0j50L0m2J26r9P4k47J79j43J17K67m28K55J36k01j41
5108a28J30k19K96o7k05L13k42J73J35k13rj52K57o4r6j54M88l16R8K63n00P0
$$ plain form
5130 -142 -44 -117 -129 81 -15 150 -43 -33 66 -213 65 149 -56 -35 -22 -8 96 28 -104 61 -80 -45 -144 349
5154 349 -18 -203 -86 -129 20 -32 -151 101 87 -124 1 -80 8 124 -313 126 19 -94 126 -27 126 -119
5176 -119 71 -34 -162 -130 -40 -149 169 34 -144 -176 48 -330 93 -119 -9 63 -149 169 -119 -106 150 -51
5198 -51 -206 -19 -16 152 -146 -24 155 -21 -26 -132 36 111 86 -155 -47 -65 13 -120 180 124 181 49 -157 80
5222 80 34 -133 -236 33 176 18 -191 204 -129 -149 16 -2 -123 254 -217 -187 8 -166 42 -94 -36 -12
5244 -12 220 45 -97 -25 145 -221 -76 -115 -6 217 248 58 -22 -32 66 32 -103 36 56 37 -88 -87 -144 20
5268 20 106 119 211 -22 170 -210 -6 -206 -41 218 227 172 293 84 -118 8 -78 -108 -137 -150 41 70 40 12 82
5293 82 221 -190 -63 40 -57 127 -169 -1 -280 -83 -157 95 -72 30 184 -15 240 -37 -237 -8 -66
$$ packed form
5130a42R8p3j2K10r6J65j93J0R9k79K78Q4k05K1J3J4J04o8j32J65j41L5r9M93
5154C49l67j85J17m3J49n2j19K52j4k11J25q1Q8J16m37M39j07j13K20j53J53k45
5176a19J90j05j28L2R0j09L18j35j78l2K24l78M23k12J10P2k12L18k88J3K56k01
5198e1j55J87LJ68k98J22J79j76nj06J68P5k5k41J08j8P8j33L00n6N7j32k06K37
5222H0m6j67j03K69J43j58k09L95l33k0J65j8j21L77m71L0J95j74K08j36N8K4
5244a2K32j75j42P2J70l66J45l9J09K23L1j90q0j0R8l4j35J39K0j9j25Jn7J64
5268B0Q6J3R2k33J92l80K04k00J65K59Rn5J21k09k02J26q6l0k9j3J91K9l0k8P0
5293H2J39m11J27J03r7J84k96J68k79J97p4K52j67J02J54j99K55k77k00K29n8
$$ plain form
5314 -66 236 -56 -19 -106 -60 -187 263 123 68 -138 -35 -24 45 238 -158 80 -63 23 75 -79 -179 -152 -138 41
5338 41 -137 160 187 141 -112 28 -141 -47 -311 -29 104 16 -194 -91 -61 196 25 -76 -24 66 -39 -87 176
5361 176 -6 -183 -140 95 -180 180 -67 -29 -49 55 -33 144 127 18 -117 201 -102 -41 -68 59 63 160 10
5384 10 83 65 -271 -81 119 -52 141 -15 -19 1 -65 -140 8 -89 -17 -168 134 -169 108 178 113 -89 130 -50
5408 -50 -65 -24 -91 -47 -206 -223 123 176 104 109 115 -243 -35 -386 -34 172 126 32 -136 -5 -71 -91 19 109 -41 -140
5434 -140 181 101 -155 50 165 -126 -38 -114 -73 -275 188 -51 141 30 -126 -172 82 144 36 109 39 -40 -105
5457 -105 5 -20 74 54 -164 -158 -275 -58 186 -310 -161 -87 118 191 71 80 -120 312 166 -187 -74 -44 -104 -42
5481 -42 220 215 -76 13 -28 62 149 197 -126 -77 257 112 -139 187 -150 146 -95 -59 -179 31 -273 -60 234
$$ packed form
5314f6L02k92L7q7M6j27M50j40n5k06J03J1O9J93l96K38j43Q6N2j54j00K7J4J79
5338D1j78K97K7m6k53J40j69R4k64K82J33q8k10J03L0K57j71j01N2R0j05m8K63
5361A76j82j77M3K35k75L60k47L8k0J04q8J77j7j09j35L18l03O1k7J27MR7j50
5384A0P3j8l36J90K00j71J93j56mK0o6p5J48r7P2j51L02l03K77P0o5k02K19j80
5408e0j5M1o7M4j59j7L46N3p2NOl58K08l51L52K06m6r4j68J31o6k0J10R0j50r9
5434a40L21q0k56K05J15k91Q8p6M1k02M63k39J92j11j56m6K54O2j08P3p0p9o5
5457a05J10k5R4k0k18Oj17K17K44m96J49P4K05P3j20Rk00M32j46l53J13L0o0O2
5481d2K62nk91Q9m1R0Q7M8l23M9L34j45k51L26l37K96k41L6j20K10l04K13K94
$$ plain form
5504 234 -310 13 65 155 72 -156 -69 -127 6 227 94 -126 280 76 -101 237 194 -214 34 -150 -243 -27
5526 -27 -137 62 -129 -190 312 -135 -66 67 246 13 -113 -119 -109 13 -7 -204 25 -196 103 67 19 -31 -203
5549 -203 158 80 53 -199 94 -218 80 7 140 -40 92 65 -49 351 164 -94 -103 -115 -143 -80 -4 -11 -11 81 81 16
5575 16 241 -108 6 -199 -199 46 114 12 -47 394 21 273 -104 -87 234 175 -190 95 -44 -93 -121 168 -227
5598 -227 -147 134 -51 241 -236 165 120 282 336 -89 217 31 125 -26 -107 141 189 284 134 -227 -262 70 -289
5621 -289 -200 15 96 -12 -165 -220 105 146 -162 23 12 45 44 169 84 -153 52 43 -131 -38 -103 -173 92 125 -14
5646 -14 -75 -139 3 -28 184 192 -148 56 -105 -371 245 -133 -207 -315 -35 -45 41 93 -352 -98 31 -76 20 63
5670 63 84 229 50 200 -25 10 14 -150 -26 58 149 -104 56 132 57 106 6 -32 -363 115 -6 -52 224 -113
$$ packed form
5504B34n44L23N2R0q3k28Q7n8J33K21j33k20M06k04j77L38m3m08K48j84r3K16
5526b7j10J99j91o1N02m47O9J33J79k33j26oJ0J22k0j97K29k21K99l6m8n0j72
5549b03L61p8k7k52K93l12K98p3J33j80J32k7j14M00j87k58rj2k8O3P6p%R2%o5
5575A6K25l49J14k05%K45O8j02n9M41l73K52l77J7L21n9l65K85j39m9k8K89l95
5598b27Q0K81j85K92m77M01m5J62N4m25L06j86R4j51q1K48M8R5j50l61l5L32l59
5621b89Q9K15Q1j08j53n5L25M1l08J85j1L3jJ25q5k37K05rj74R3o5p0K65L3j39
5646a4o1o4J42l1K12Ql40K04j61k66O16l78p4j08K80j0Q6N2m45K54J29j07R6M3
5670F3K1J45j79J50k25L5Mj64J24Q4R1k53J60P6p5M9j00l8l31M78j21m6K76l37
$$ plain form
5694 -113 -183 -164 145 -180 32 -27 10 168 -64 -54 -111 -7 97 -106 34 -230 -79 -36 -185 -101 104 131 -30
5717 -30 -242 -147 -147 267 17 112 108 9 -85 -53 283 17 -224 -19 25 -4 -98 237 -8 -70 3 -16 19 -86 -72 72
5743 72 -57 -55 -66 34 -65 15 -98 90 -82 -115 100 -173 -77 106 124 -17 94 58 246 -47 -4 -83 92 143
5767 143 47 -149 -78 151 -19 115 -26 139 -194 82 77 -6 -175 -30 89 -111 -94 19 -335 184 -24 150
5789 150 -62 14 131 311 -148 253 -171 -2 55 -44 322 -73 95 243 161 -168 -49 -121 -212 146 254 232
5811 232 -103 44 93 106 215 6 348 35 1 137 134 189 101 -69 -143 141 61 73 160 -132 96 222 92 -84
5835 -84 29 -48 16 20 58 147 9 -105 -135 44 32 135 -42 167 133 -37 120 -67 -3 -5 176 123 -133 53 -6
5860 -6 -63 -19 300 -268 80 -21 90 142 77 -59 94 72 -146 -48 -20 106 -23 369 -67 208 244 -289 256
$$ packed form
5694a13p0J9L09l25K12n9L7J58k32J0n7J04J04k03J40k64J51M3j49Q4K05K7j61
5717c0k12R5%M14k50R5mr9r4L2L36k66k41K05M4k9r4L35k45o2P3j9L5j05J4J44
5743G2j29Kj1J00r9Q0j13J88j72l3K15k73R6J83J8j41J11l6J88k93M3p9J75N1
5767A43r6j96P1K29j70J34j41J65l33K76nq3j69J45J19k00J7J13l54N19k08J74
5789A50k12P6J17J80m59M01m24J69N7r9L66l95J68J48q2l29J19p2r1L58J08k2
5811B32l35J47M9J3J09k09L42l13l4J36lN5q8j70p4K84q0J2Q7k92K28J26j30j76
5835h4J13p7O4ML8Q9j38j14l0J79j2J03j77K09l4j70J57j87O4kJ81n3k56J86n9
5860fn7M4L19n68L48j01J11N2o5j36J53k2k18R8K8J26j29L92m36K75L6n33N45
$$ plain form
5883 256 215 -231 -151 -53 -240 37 -28 49 50 241 61 -256 224 -40 -11 137 -101 -273 22 -198 -39 -254 -91
5906 -91 273 -130 -63 64 -154 172 -158 62 -29 -212 -286 -132 -17 -186 -94 69 203 -15 -159 -23 103 -170
5928 -170 90 -112 55 57 -64 24 151 234 12 -211 43 127 -316 -142 61 -68 -82 170 -70 -179 -75 -273
5950 -273 -65 -108 -86 75 -376 -14 -17 -70 -55 136 225 196 77 -158 -41 -48 84 80 -164 -143 -81 38 -57 160 105
5975 105 180 279 245 -245 160 -75 224 115 -165 36 -43 213 29 102 -54 35 -62 54 -31 -5 -154 -23 115
5998 115 32 -34 -102 -31 29 25 -20 -66 -3 220 -185 -33 -5 -237 -128 -52 225 -47 126 -148 -94 6 320 -16
6022 -16 231 98 -14 37 -197 -82 -104 -31 113 208 -170 116 -50 -150 162 -20 150 27 7 -122 16 15 -229
6045 -229 54 259 194 217 -149 -116 74 80 249 -57 -208 -93 -73 -38 108 -65 -29 -9 -27 110 -141 154 178 -119
$$ packed form
5883B56m1m46Q0R8j87K77o5P7JJ91j80l17M80k64K9J48k38j72K95k20J59k15J63
5906i1L64m03O7J27k18L26l30K20r1j83p4J54J15j69R2J63J34k18j44J36J26k73
5928a70K60k02J67Kj21Q8J27Q3k22k23K54Q4m43J74K03j29j4K52k40j09J04j98
5950b73K08m3K2J61m51L62ln3J5J91Q9k9j19k35J17pJ32mk44K1O2J19r5K17n5
5975A05P5R9l4m90M05k35K99j09k80K01p9K56j84P3j56Q9r7J16q5K6j49J31J38
5998A15q3o6o8P1O0mm5m6O3K23m05J52K8k32J09P6K77k72J73k74N4J00L14l36
6022a6K47j33j12N1k34J15k2P3J44R5l78K86j66j00L12j82J70j23k0j29J38jk44
6045b29K83K05o5K3l66L3J90OJ69l06j51J15K0L5J46j73L6K0j8J37k51K95K4k97
$$ plain form
6069 -119 2 131 133 -144 -63 26 -4 16 -164 -95 -42 5 218 -354 338 150 -53 252 -72 -43 -172 166 8
6092 8 -44 158 -150 39 -136 -7 -36 -136 18 -55 -15 -43 232 -74 -119 -66 70 -65 -78 81 -5 -51 15 -50 6
6117 6 -90 -118 -353 125 173 165 -21 -137 287 65 -472 -56 80 -191 -180 81 68 27 76 70 -28 15 -63 -188 85
6142 85 -79 -151 202 127 84 -47 -112 2 56 66 332 74 20 16 313 -96 -13 -148 12 247 73 166 -357 43
6166 43 27 126 -99 -10 122 -186 79 33 131 23 289 -41 -54 236 105 -75 93 36 41 64 71 -109 149 -164
6190 -164 125 33 153 36 -17 -200 201 -37 104 36 -38 76 184 54 171 28 -335 10 -126 105 -6
6211 -6 117 -3 -82 0 -62 40 178 14 13 -8 159 -336 114 121 112 185 117 275 -10 81 115 -12 -94 20 101 104 -24
6238 -24 222 27 123 -9 -119 -52 -121 60 -355 -131 139 6 -131 146 -87 -155 166 -132 -192 23 92 -321
$$ packed form
6069a19J21J29Kk77Q1Q9l0K0j80O9N3M7K13n72O92j88k03L05l24K9j29L38j58
6092Hn2K02l08J89j75J29k9j00J54p3M0k8K75l06m5N3J36j35j3J59q6m6O6o5N6
6117Fr6k8k35M78M8qj86j16M24k22n37M16J36k71J1K61j3m1M9or8M3p8j25K73
6142H5j64p2L53p5m3j31o5J14N4J0K66k58n4mK97m09Q3j35J60K35j74R3n23M00
6166D3j6R9k25Q9J32l08K65m6R8j08K66l30j3K90j31j80J68n7NK3Pj80K58l13
6190a64K89r2J20j17n3j83M01k38J41o8p4J14J08j30J17j43l63L45j36K31j11
6211fJ23j20p9Q2o2J02J38j64jk1J67m95M50PrP3o8J58k85R1L4j27q2J14Q1Lj28
6238b4K46j95R6j32j10O7o9J81m15K24K70j33j37K77k33o8L21k98o0K15O9m13
$$ plain form
6260 -321 -111 -84 119 113 -84 304 165 -141 115 -84 -40 -81 -74 -85 80 -23 -133 -63 89 53 36 212 18 72
6284 72 39 6 -54 -86 -55 -144 -126 -82 -97 87 42 -220 72 -122 -73 -111 -196 82 45 -181 140 -129 19 -145 230
6309 230 317 -182 313 -12 79 -9 310 -71 189 62 -233 111 11 180 -149 189 -104 -186 -89 -13 -73 -134 93
6332 93 225 154 46 -249 121 -300 113 -244 -176 -83 -83 -136 -116 60 -143 33 92 -3 46 -168 -232 -111 -94 63
6356 63 -138 -1 -128 222 -171 40 -39 126 -131 158 127 -248 25 -25 5 56 -127 114 -179 -186 194 86 157
6379 157 -33 -163 205 143 -5 51 -44 -46 329 102 32 56 -114 -21 76 112 -220 -13 47 86 -41 -3 -166 84
6403 84 -73 55 49 141 23 -195 18 184 64 -67 27 -95 141 92 -194 -119 -52 -63 -112 143 47 -69 103 -85
6427 -85 105 -61 170 68 8 38 14 -46 157 -28 -36 -215 41 17 232 93 123 -28 47 90 -58 22 97 11 138
$$ packed form
6260c21K10K7K03oj97L88j39l06K56j99M4m1Pj1J65j03j10P0J52l6j7J76j94N4
6284G2l3l3o0l2L1q9J8M4j5J84m5k62K92j94M9l8q5K78l7k26L21k69J48j64L75
6309B30Q7m99M95l25R1q8L19l81K60j27k95L44j00J69l29L38k93q2R7P6o0o1K27
6332I3J32p1j08k95L70m21M13l57O8R3%n3K0J76k03J76N9r5M9k14o4J21J7J57
6356F3k01J37j27L50l93K11p9J65k57K89l1l75K73n0L0N1j83K41k93pL80j08P1
6379A57j90j30L68o2j48N6r5kL75k27p0K4j70R3R7L6l32K07O0L9j27L8j63K50
6403H4j57J28oR2j18k18K13J66j20j31R4j22K36m9k86P5O7j1m9K55r6j16J72j88
6427h5J90j66K31j02o0L0k4o0K03j85qj79K56k4K15j39L0j51P5M3j48Q0P5q6J27
$$ plain form
6452 138 11 -91 -36 20 90 -82 104 -93 -208 75 166 -101 122 -110 94 -22 -154 81 -47 129 329
6473 329 280 66 -164 -21 201 74 2 -144 -258 98 -59 -25 144 -209 232 337 89 -46 151 -309 -53
6494 -53 80 76 -59 -291 6 -111 -132 -89 172 -119 -26 106 197 -60 186 -57 111 -120 -112 -152 106 -46 -45 -45 -143
6519 -143 99 82 90 69 93 144 28 71 -21 -122 107 14 -180 -100 -15 204 -95 -43 4 168 -69 -48 262 -357 139
6544 139 -18 58 -92 101 -145 84 -158 -36 -80 36 243 -104 -159 13 486 30 -52 -25 -24 4 12 40 43 160
6568 160 28 -194 -37 -116 159 37 15 45 270 172 -72 79 -70 -112 -88 157 217 73 -61 158 94 -205 129
6591 129 146 -24 -48 -95 -78 -215 -33 -12 64 -83 375 107 -236 -105 12 199 7 -219 -55 23 154 -104
6613 -104 100 41 70 -32 142 121 -51 102 -253 287 -223 -36 171 211 39 82 146 -35 -101 -23 -29 -158 -286
$$ packed form
6452A38j27j02N5N6P0j72J86j97j15K83R1k67K23k32K04j16j32K35j28J76K00
6473C29m9k14k30J43K22j27p2j46j14L56j57L4J69l53M41J05k48j35J97m60K56
6494e3J33mj35k32K97j17k1M3K61k91R3J32R1k57K46k43J68k31Qm0K58j52J%r8
6519a43K42j7Qk1K4N1j16M3r2j01K29r3j94Q0Q5K19k99N2M7J64k37K1L10o19M96
6544A39j57P6j50J93k46K29k42J22m4J16K07l47n5J72M73m56q2K7JK8QK8LJ17
6568A60j32k22J57p9K75j22k2L0K25r8k44J51j49m2K4K45O0j44j34K19o4k99L34
6591A29J7j70k4m7J7j37J82K1P6j47M58k68l43J31J17J87j92k26J64P8J31k58
6613a04K04n9K9j02J74k1j72J53l55N40n10J87K07M0j72M3O4j81o6P8oj29j28
$$ plain form
6636 -286 -146 -4 -331 110 -207 89 -36 206 -147 -86 -26 -19 -3 54 155 250 -151 62 53 -23 240 185 73 202
6660 202 -60 133 -39 72 -101 -84 184 -66 355 98 36 204 -136 -95 -194 75 127 -92 -47 169 -30 -38 -55
6683 -55 -62 -183 -57 -150 30 56 51 27 -42 -139 30 206 82 -20 38 -47 208 148 294 111 72 169 185 72 -52
6708 -52 42 49 74 -52 -17 -20 69 103 120 -199 -23 -173 304 -142 35 -137 -105 55 65 104 -81 -66 66 -292 -1
6733 -1 39 71 38 -3 -151 170 -91 166 78 296 -117 -31 284 294 151 -85 -102 -112 59 -21 14 9 82 9 19 -31
6759 -31 194 -19 -25 80 -34 -70 217 -43 134 -20 -173 56 7 319 128 -45 70 72 214 -39 -18 20 -35
6782 -35 83 -13 -153 175 161 236 -123 -68 36 148 -59 -393 71 -50 -16 -11 111 31 119 114 28 -57 -153 -104 -17 -8
6808 -8 230 199 126 -133 -28 -160 -72 -70 84 65 101 -378 184 196 76 218 -144 -70 -45 -24 52 157 -69 222 122
$$ packed form
6636b86J40J42l27M41l17K96j25K42l53O1O0PJ6N7J01R5m01K13rp6K63n5j12J29
6660B02k62J93j72J11j73J7K68k50M21k57o2J68l40M1r9K69N2k19M5K16j99qj7
6683e5pj21J26r3J80K6nk4o9r7J69J76j24j02N8q5K55o0J46j83l9R7J6j13j24
6708e2R4PK5j26L5lQ9L4J7l19J76j50M77m46J77j72L2J60J0L9j85J5J32l58K91
6733aM0L2l3m1j48L21k61K57q8K18m13Q6L15J0j43k36j7j0J71q0L5nP3p3J0n0
6759c1K25k13oJ05j14l6K87k60J77j54j53K29m9L12j91j73J15KJ42k53K1L8n5
6782c5J18r6j40L28j4P5l59N5J04J12k07l34M64j21L4NJ22q0Q8nq6q5r6M9Q7R
6808hK38l1p3k59J05j32Q8KJ54j9L6m79N62J2j20J42l62P4K5K1P6J05k26K91j00
$$ plain form
6833 122 -217 -152 -43 -33 125 -18 50 117 40 -34 -210 18 46 -75 -166 34 -203 183 -129 0 -88 -137 98
6856 98 -65 129 57 -369 -48 -102 7 83 69 -192 -139 101 -126 -166 -140 89 -53 36 -86 109 -212 102 -374
6879 -374 101 68 -91 25 -229 -66 216 15 -300 105 -43 -109 -89 -132 196 -279 -146 101 228 -242 66
6900 66 67 56 64 -47 -95 140 -121 123 -10 -161 -105 -190 98 -62 43 132 32 15 54 -70 -295 60 149 -117
6924 -117 17 123 -154 101 103 -256 11 -129 27 -9 -75 129 77 56 172 -12 67 -58 -187 -28 136 -55
6946 -55 63 -81 -74 -131 -24 80 120 142 -180 105 63 6 10 -50 -18 64 59 -94 144 33 -9 -137 -360 -246 -204 58
6972 58 -6 -243 -258 -82 4 169 -42 -223 72 -160 -134 -30 -79 182 75 65 102 -102 -102 -14 -97 58 97 -28
6996 -28 -189 181 -98 95 -149 10 -155 -78 58 108 237 -188 -56 100 60 171 40 -14 120 -64 -38 -23
$$ packed form
6833A22l39O5J09J0J58j43O8O7p7p4j76K28K8j21r1K00k37L86l12J29q8m9K35
6856I8j63J94p2m26L21n4J09P6j4k61N3K40k27m0K6K29j42Q9j22J95l21L14m76
6879c74M75l3j59J16k54J63K82k01l15M05j48o6K0m3L28m75J33K47J27m70L08
6900F6Jj1Qj11m8K35k61K44j33j51N6q5K88j60J05Q9j00j7L9j24k25L55Q9k66
6924a17J34J06k77K55Kl59K67j40J56l6o6K04n2k1J16j84P9j25j29J59J64j91
6946e5J18j44Pn7J07J04M0K2l22K85m2n7Mo0L2Q2nj53K38j11m2j28k23J14M2K62
6972E8o4k37j5J76Q6J65k11j81K95k32K6J04m9K61j07j0L7k04%Q8q3J55L9j25
6996b8j61L70k79J93k44J59j65P7J36N0J29m25J32J56m0J11j31n4J34j84K6J5
$$ plain form
7018 -23 44 -54 -33 24 170 28 41 -266 -58 37 -114 18 -49 -13 -109 271 127 -20 -296 -120 19 -27 97 42
7042 42 -45 -104 37 -108 96 -83 -26 -29 -94 -55 124 79 83 -145 -101 -74 -229 127 -32 218 190 -190 8 -156 -8
7067 -8 157 17 158 -40 10 -21 62 8 -24 120 -276 172 -7 -75 176 9 159 -81 -129 -130 80 -188 -242 144
7091 144 -132 124 8 90 -235 -136 142 -339 22 50 -226 -41 26 82 30 -14 152 -129 -51 180 -23 -39 -86
7114 -86 -410 87 1 -107 31 34 333 134 9 34 172 14 96 134 -73 -270 -101 -56 -94 81 32 -93 -68 -39
7138 -39 164 -223 -25 5 -144 -64 -205 133 54 -22 -265 3 -60 -146 -214 -245 -32 -37 103 -16 -70 63 -146 173
7162 173 -28 -291 -36 11 182 -168 103 4 192 164 140 -98 -130 -58 -111 71 -217 -22 201 177 -210 178 -44
7185 -44 43 157 28 88 124 81 -99 146 -104 201 -9 -332 227 -87 75 -57 -68 60 18 180 -16 -254
$$ packed form
7018b3O7r8K1N7J46j42J3l07K08R5j51J32o7L6r6L80j44j47k76J76J39m6J24n5
7042D2q7n9J41j45K04j79N7lo5L9J79m5Mk28M4K7j55L56j59K50k8l80J98j64J48
7067hJ65j40J41j98N0l1Q3n4l2J44l96M48j79o8K51j67J50k40m8jK10k68n4L86
7091A44k76K56j16Q2l25R9K78m81L61K8k76J85O7N6n2m4J66k81P8K31k03j6m7
7114h6l24M97q6j08J38LK99j99j25K5J38j58Q2L8k07j97J69M5l8J75m9j25K5K9
7138c9K03l87J98L0j49Q0j41L38p9p6k43K68o3q6o8l1K13nJ40j19n4J33k09L19
7162A73k01k63K55M7J71l50K71r9J88k8k4k38l2P2n3J82k88J95K23k4l87L88k22
7185d4Q7J14j29O0L6m3j80K45k50L05k10l23N59l14J62j32j1J28m2J62j96k38
$$ plain form
7207 -254 31 -56 0 -122 -69 112 55 49 7 -5 105 85 30 2 59 -10 -110 -128 -451 -152 60 223 123 -107 257
7232 257 -184 7 -58 83 -195 -205 -296 -110 119 -194 138 -262 176 -117 121 -55 100 -126 28 33 -177 -55
7254 -55 -59 -7 246 88 -189 58 128 267 199 85 -116 98 -205 -8 -72 -79 -79 -45 38 56 56 43 1 -66 -29 244 118
7281 118 217 38 -141 -9 -97 42 -45 4 23 31 -115 -272 4 113 21 150 130 48 9 -145 0 -71 215 -76
7305 -76 92 25 106 -136 -87 218 -14 -7 -141 43 223 24 130 -114 -3 -70 74 -84 28 -327 85 -68
7327 -68 -304 -49 -127 54 95 -27 206 36 153 276 15 -332 -363 76 257 -117 -32 -61 -157 58 16 269 76
7350 76 76 -123 -138 -7 -147 -111 -138 -45 -76 108 -29 -309 -59 -22 6 -1 28 18 165 5 16 -43 80 15 -15 -296
7376 -296 -175 -114 -22 -86 -219 217 179 83 7 -186 -128 -17 -69 128 -19 -3 48 2 -18 379 251 77 37 -70
$$ packed form
7207b54K85q7N6j22N3J81n7om2j2J10k0n5k8N7o9j00j8l23K99K12J63j00k30L64
7232B57m41J91o5J41k78j0r1J86K29l13L32m00M38k93K38j76J55k26J54Nk10J22
7254e5mN2K53j58k77K47P0J39o8j14k01K14l03J97o4p%L4Q3J8%j3m2o7L7K73j26
7281A18R9j79j79J32q8J39q7M9J9Qj46j57K76J09r2J29k0q2l9j54J45p1K86k91
7305g6J68o7Q1k42M9L05k32Pj34J84J80j99J06k44J11o7J44j58J12l55M12j53
7327f8k36K55p8J81M1j22K33j70J17J23k61l47l1M39J81l74Q5k9r6K15m2K53j93
7350G6%j99j5J31j40L6k7R3l1J84j37k80K50L7K8pK9j0J47j60J1n9J23o5l0k81
7376b96J21O1R2o4j33M36l8r6p6j93N8J11n2J97j47J6N1m6k0L97j28j74m0j07
$$ plain form
7400 -70 224 -125 -91 -117 -20 64 -55 -118 -166 139 -5 161 51 49 34 107 102 -132 102 -43 -69 -203 -73 -98 171
7425 171 -103 85 -3 94 145 -113 2 -27 -90 -257 -101 124 -62 -165 176 -182 118 311 153 -198 71 34
7447 34 -145 58 -45 -65 -120 -28 271 -141 199 -13 -54 34 -191 -163 -263 112 115 322 -11 -113 -132 -187 3 -313
7471 -313 -31 -286 216 66 85 -57 -81 258 110 -166 -170 57 -69 -181 140 80 26 -108 -288 -145 -112 -20 -125
7494 -125 -127 16 -201 8 -90 153 24 -151 -63 -76 90 -73 -66 4 130 -124 -244 -123 70 238 -15 137 167
7517 167 -39 137 -1 -144 -319 147 219 50 -81 139 39 18 -195 -43 -121 78 -67 50 134 60 -135 -31
7539 -31 42 103 6 156 -86 -155 -167 -183 -42 63 297 33 80 -26 -113 104 131 -301 -122 21 52 -69 13 -103
7563 -103 -221 -326 -131 36 -5 -46 -23 -26 -277 -156 -159 -45 -101 9 -232 60 321 -97 183 206 65 90 76 245
$$ packed form
7400g0K94l49L4k6R7Q4j19o3m8L05j44J66j10kj5P3nk34K34j45k6j34J30k5K69
7425A71k74J88q8R7N1k58J15k9o3j67J56K25j86j03L41l58L00J93j58l51K69l7
7447C4j79K03j03k0n5R2K99m12L40k12m1Q8k25K8j00L75LK07l33j02j9n5J90l16
7471c13K82k55N02j50J9j42k4L39j48k76mK27j26j12L21o0n4j34j80J43L3R2j05
7494a25kJ43k17K09r8K43j29j75Q8j3J66j63PP0J26k54j20J21J93J68k53J52L0
7517A67k06J76j38j43j75M66P2j69j31K20j00k1k13J52p8J99j45J17Q4p4j95J04
7539c1P3O1r7J50k42o9j2j6J41J05K34k64M7j06q7K17K7m32J79J43L1j21Q2j16
7563a03j18j05J95J67m1m1K3lk51J21lJ14n6J10k41K92K61m18K80K3j41K5j4J69
$$ plain form
7587 245 32 33 -9 -21 -27 92 -41 -195 19 65 245 102 259 -135 -96 -112 -124 -241 -216 -24 134 -14 -96 65
7611 65 123 -215 -164 -192 -77 -165 -118 171 7 -12 -108 91 -123 284 31 15 -182 -113 20 148 -260 10 47 -17
7635 -17 -150 -137 -115 -215 -42 -247 192 -152 -91 102 -100 -179 -166 -95 -39 51 55 -9 -213 -80 -21 -141 -30 113
7659 113 -83 -31 -172 34 -148 59 -102 -16 -127 -123 213 10 224 11 118 38 125 -51 -97 109 -18 261
7681 261 131 -64 68 -79 0 165 96 -44 -103 -100 6 -161 124 152 -91 -69 -70 -152 143 13 -283 277 16
7704 16 40 159 -16 -169 179 218 191 14 127 216 219 46 146 -82 133 183 -127 -39 36 77 41 164 24 -57
7728 -57 -207 -198 -11 180 46 -30 91 -11 -63 33 -72 98 236 138 83 96 -201 275 -82 -138 -100 -108 136 -70
7752 -70 89 -109 -175 397 -79 -329 44 -83 61 74 11 106 -12 25 -295 90 -25 -204 48 24 44 -46 49
$$ packed form
7587B45k13Jm2j2oJ19j33j54K14M6J80j43J57l94L9j6j2j17K5J92J58j48q2J61
7611F5N8l38N1k8J15q8M7K89j64j9r6J99k14M07k53j6j97O9J33J28m08K70L7o4
7635a7j33J3K2j00J73k05M39l44O1J93k02p9J3P1N6R0Mo4k04J33N9j20J11J43
7659A13j96N2j41K06j82K07j61Q6j11ML36k03K14k13J07q0Q7j76m6K06j27K79
7681B61j30j95J32j47P9J65o9j40n9LJ06j67K85K8k43K2jq2K95j30k96N60k61
7704A6K4J19j75j53L48L9k7j77J13Q9Lj73J00k28K15N0l10Q8P5M1l6J23j40q1
7728e7j50RJ87J91j34p6J21j02n2R6j05J70J38r8n5J3k97M76l57n6L8qK44k06
7752g0J59j98o6N72m76k50L73j27J44J3o3R5j18L7l20L85j15j79K52k4K0r0R5
$$ plain form
7775 49 -152 69 -307 -163 79 -108 -343 -65 -45 105 -138 -186 186 -73 20 53 -121 120 86 -26 252 179
7797 179 -102 -114 223 98 -69 -90 20 -23 -21 9 -106 -101 -141 26 138 -2 103 -40 -200 10 -69 112 105 255
7821 255 -42 -28 53 -103 35 -5 135 -93 -102 3 -53 155 66 52 155 -35 39 -32 -90 39 -52 -128 -205 197 31
7846 31 198 207 -38 27 149 238 332 13 16 117 30 -225 -187 -34 75 -103 -129 166 -17 -10 -31 -87 -166 -71 -204 184
7872 184 178 74 136 -118 -29 115 138 134 -92 2 -33 -151 -262 248 104 43 35 -51 105 68 -38 -91 -258 -165 -75 -63
7898 -63 -82 -95 -77 7 49 112 116 -220 -191 77 160 241 -33 -53 -51 49 187 -97 32 52 -189 66 176 -101 -21 107
7924 107 17 15 -53 -117 -112 -197 107 -149 39 53 108 -67 42 115 -227 95 67 -141 -1 12 -53 -149 19 -83 91
7949 91 63 -37 -10 14 1 37 -3 -103 -341 3 -104 -198 26 -78 -125 -41 -160 175 -63 0 38 58 -123 56
$$ packed form
7775D9k01K21l76J44K42j87k35K78K0J50k43m8L72k59R3L3j74K41l4j12K78p3
7797A79k81j2L37j25j67k1J10m3KL0j15Nm0J67J12j40J05j43j60K10p9J81pJ50
7821B55k97J4Q1j56J38m0J40k28rJ05n6K08q9j4J03j90P4p1n8J29r1p6p7M02j66
7846C1J67Rk45O5J22Q9R4l19LJ01q7k55L8J53J09j78k6K95j83Pk1n6p9R5j33L88
7872A84oj04O2k54Q9J44K3mk26R4l5j18j11N10j44o1qq6J56l7j06n3j67R3R0J2
7898f3j9j3J8Q4M2O3Ml36K9K68Q3Q1k74k0KJ00J38k84J29K0k41K55J10k77Q0J28
7924A07r0ko8o4Nq5L04k56J88J4N5j75J09P3l42L22k8k08J40J3o5r6J68j02J74
7949I1k8j00K7K4j3L6m0j00k38L44j07r4K24j04m7Q4j19L35k38O3L8K0j81J79
$$ plain form
7973 56 -38 -301 57 20 -184 -63 -192 54 165 -7 -126 119 -46 -82 -86 42 104 -305 27 29 -151 -17 197
7996 197 -88 -361 -5 93 -114 157 211 22 -84 216 42 158 217 -94 -290 -224 191 -73 7 180 -22 -2
8018 -2 14 -242 -269 99 47 54 364 -100 -75 29 31 201 -144 351 -422 -215 -128 162 -47 -56 123 -13 29 -303 -5
8043 -5 -239 17 -52 -118 51 175 37 274 -54 -46 -25 35 165 -214 37 142 -291 204 -11 -181 -214 -83 -153
8066 -153 -38 138 11 176 -21 -209 -135 92 -134 95 137 16 -159 -111 -102 -89 40 40 62 -80 -13 -290 -41
8089 -41 27 -138 -366 -75 2 -91 -237 87 47 -43 -103 -65 65 -178 -43 -64 27 244 -99 27 41 -10 -62 69
8113 69 215 -37 -195 -28 -12 -58 -72 -157 -8 -73 -107 114 -4 86 -100 -208 -164 18 -162 -44 -117 -73 162 -179
8137 -179 -71 -18 39 67 4 136 -27 -208 -7 302 49 106 129 -170 -109 155 -120 62 -19 35 29 -89 40 -173
$$ packed form
7973E6r4k63L58l7k04J21j29K46J11j72j19K45j65l6mJ28O2m09L32Kj80J34K14
7996A97k85k73L56R8k07K71N4j89j06L00j74J16N9l11j96O6M15k64Q0J73k02K0
8018bJ6k56k7L68n2PL10m64K5J04KJ70l45M95p73K07Q7K90k09rJ79j36M2l32K98
8043ek34K56o9o6J69J24j38K37l28QK1O0J30l79K51J05m33M95k15j70l3J31p0
8066a53J15J76j27J65j97j88P4K27k26K29M2j21j75M8RJ3J29%K2j42O7k77K49
8089d1O8j65k28K91P7r3j46L24m0r0o0L8J30k43J35k1R1K17l43J26J4n1n2J31
8113F9J46k52j58J67J6m6j4q5J49o5l4K21j18R0j86j08M4J82j80J18p3M4K35l41
8137a79J08N3N7K8o3J32j63j81K01L09k53N7K3k99O1K64k75J82q1N4oj18J29k13
$$ plain form
8161 -173 -74 -29 -157 -118 34 -82 -74 -21 -39 -132 221 40 -3 -53 321 -29 -70 94 118 87 82 105 168 -175 -151 -109
8187 -109 148 -5 179 97
$$ packed form
8161a73R9M5j28L9J52j16QN3j8r3L53j81m3n0L74l50m1J64K4l1nK3O3l43K4M2
8187a09K57j53J84q2
8191I7
$$ Imaginary data points
##PAGE= N=2
##DATA TABLE= (X++(I..I)), XYDATA
$$ plain form
0 0 0 0 0 0 0 0 0 0 0 0 0 0 0 0 0 0 0 -8 8 -8 8 -8 13 -16 16 -18 24 -24 32 -33 40 -45 52 -57 65 -74 82 -92 102
39 102 -114 128 -140 156 -173 189 -211 232 -255 283 -310 342 -376 416 -459 506 -561 626 -696 782
59 782 -883 1004 -1156 1348 -1602 1957 -2486 3362 -5056 9548 -45856 -113124 -14621 5340
73 5340 -20097 14084 107432 126356 73129 84371 130257 63111 -9553 747 17188 -22314
85 -22314 -61156 -19099 21793 -37964 -67439 -29982 -46121 -110212 -127614 -82855 -66065 -100619
97 -100619 -58218 25861 26412 9269 43814 74353 46493 -1118 22688 53790 10917 -2046
109 -2046 45072 57753 19905 -6670 17413 5796 -71831 -83794 -45836 -67957 -97213 -63960
121 -63960 -11244 -14079 -39615 3897 39347 -2836 -13822 26979 42130 21825 22545 72270 85298
$$ packed form
0@%%%%%%%%%%%%%%%%%qJ6j6J6j6K1k9L2l4M2m8N6o5P3q5R7j09J22j39J56j74J94
39A02k16K42k68K96l29L62m00M43m87N38n93O52p18P92q75R65j067J187j322J478
59G82j665J887k160K504k950L559m443N848q418J4604n5404o7268R8503J9961
73E340k5437L4181R3348J8924n3227J1242M5886o7146p2664J0300J6441l9502
85b2314l8842M2057M0892n9757k9475L7457j6139o4091j7402M4759J6790l4554
97a00619M2401Q4079N51j7143L4545L0539k7860m7611K3806L1102m2873j2963
109b046M7118J2681l7848k6575K4083j1617p7627j1963L7958k2121k9256L3253
121f3960N2716k835k5536M3512L5450m2183j0986M0801J5151k0305P20M9725J3028
$$ plain form
134 85298 42558 48398 73282 39413 -3421 -7253 6048 -18170 -53730 -26681 -5581 -37960
146 -37960 -44556 -21689 -17415 -38186 -45849 -11978 953 -17114 6350 41147 43404 35902 41261
159 41261 61917 52385 22228 36139 48413 24121 13197 22114 25888 2892 -20141 -7205 -12238
172 -12238 -43925 -40326 -23879 -23571 -28426 -21824 4380 3977 -12713 4926 16939 5193 5277 18488
186 18488 33891 28464 22289 41623 36595 11379 8645 3000 -11667 -25111 -29665 -18783 -23434
199 -23434 -29757 -15404 -16032 -24054 -24720 -28875 -25705 -26112 -24699 -5386 4674 13364 29387 32156 35121
214 35121 31971 19450 15661 5426 -2293 816 -3752 1221 6799 -1150 -1786 -8160 -22371 -30792
228 -30792 -42962 -43237 -39018 -40135 -22660 -5868 157 11468 14978 17304 15445 2611 5505 10172
$$ packed form
134H5298m2740N840K4884l3869m2834l832J3301k4218l5560K7049K1100l2379
146c7960o596K2867M274k0771p663L3871J2931j8067K3464L4797K257p502N359
159D1261K0656r532l0157J3911J2274k4292j0924Q917L774k2996k3033J2936n033
172a2238l1687L599J6447L08m855O602K6204m03j6690J7639J2013j1746Q4J3211
186A8488J5403n427o175J9334n028k5216k734n645j4667j3444m554J0882m651
199b3434o323J4353o28q022o66m155L170m07J413J9313J0060Q690J6023K769K965
214C5121l150j2521l789j0235p719L109m568M973N578p949o36o374j4211q421
228c0792j2170k75M219j117J7475J6792O025J1311L510K326j859j2834K894M667
$$ plain form
242 10172 4561 12881 22825 31054 32171 22261 24168 16344 -10970 -19382 -20985 -28680 -32083 -28082 -8568
257 -8568 -2285 -11790 1849 8977 -6835 -14548 -9944 -1379 -5228 -6001 22986 36768 25081 33466
271 33466 43768 32226 9991 -27 8503 -5181 -25008 -6628 6570 -5227 -8955 425 5152
284 5152 -16202 -32174 -15355 -16219 -33875 -21084 3112 11150 5138 13083 36086 24987 1110
297 1110 12855 18682 1505 -7688 5255 20937 5941 -5019 16297 13304 -15146 -20534 -11251
310 -11251 -14503 -35495 -32962 -2863 -6092 -21739 -881 16581 3665 -10974 1465 17943 -2764
323 -2764 -13156 16871 22559 2499 4493 23010 21052 -7561 -10620 10840 -6157 -30672 -14937
336 -14937 494 -12229 -26318 -9380 8786 -14349 -24913 2779 6309 -13195 -9854 14384
$$ packed form
242A0172n611Q320R944Q229J117r910J907p824k7314q412j603p695l403M001J9514
257h568O283r505J3639P128j5812p713M604Q565l849p73K8987J3782j1687Q385
271C3466J0302j1542k2235j0018Q530j3684j9827J8380J3198j1797l728R380M727
284E152k1354j5972J6819q64j7656J2791K4196Q038o012P945K3003j1099k3877
297A110J1745N827j7177r193J2943J5682j4996j0960K1316k993k8450n388R283
310a1251l252k0992K533L0099l229j5647K0858J7462j2916j4639J2439J6478k0707
323b764j0392L0027N688k0060J994J8517j958k8613l059K1460j6997k4515J5735
336a4937J5431j2723j4089J6938J8166k3135j0564K7692L530j9504L341K4238
$$ plain form
348 14384 20153 -1078 4314 31752 18445 -2716 9915 23112 10213 -8825 4141 21014
360 21014 -3990 -17658 3622 4898 -16884 -22700 -2312 4192 -19000 -14037 15378 7095 -10780
373 -10780 790 18216 9387 -9855 6363 28186 8235 -1097 21992 26525 5386 -4964 10851
386 10851 11171 -18868 -18454 5865 -3324 -19600 -8309 10200 1623 -18882 -4974 10387 -10939
399 -10939 -18753 3752 13033 2147 585 23860 30691 5905 6273 22115 9038 -10582 -7398
412 -7398 6685 609 -16800 -2597 11629 -7333 -19013 -9169 -7749 -23983 -34171 -15315 -6143
425 -6143 -20697 -11723 11409 11263 501 2532 16118 8563 -10919 168 13957 2132 -1802
438 -1802 12099 20580 8387 -4559 5957 3136 -21335 -23293 -11836 -14719 -22917 -16679 2004
$$ packed form
348A4384N769k1231N392K7438j3307k1161J2631J3197j2899j9038J2966J6873
360B1014k5004j3668K1280J276k1782n816K0388O504k3192M963K9415q283j7875
373a0780J1570J7426q829j9242J6218K1823j9951r332K3089M533k1139j0350J5815
386A0851L20l0039M14K4319r189j6276J1291J8509q577k0505J3908J5361k1326
399a0939p814K2505R281j0886j562K3275O831k4786L68J5842j3077j9620L184
412g398J4083o076j7409J4203J4226j8962j1680R844J420j6234j0188J8856R172
425f143j4554Q974K3132j46j0762K031J3586p555j9482J1087J3789j1825l934
438a802J3901Q481j2193j2946J0516k821k4471j958J1457k883q198O238J8683
$$ plain form
451 2004 410 -12887 -1613 6108 -7380 -12794 -4572 3414 -1128 -2861 15544 21183 9681 11560
465 11560 16155 9214 -3366 -8813 -1195 -5917 -16007 -5942 2410 -2698 -5406 -2819 1094 -6813
479 -6813 -15188 -5358 -2500 -7307 -290 9732 15666 14378 14024 22332 17784 7220 9446 9444 4748 2122
495 2122 2909 9566 5020 -1569 4144 262 -8423 -9494 -10930 -10540 -12233 -10833 -1315 -162 -9 7171
511 7171 7010 7384 7847 6038 8921 7362 6543 11150 9321 9545 10669 6488 5543 2447 -2732 -3288 -7588
528 -7588 -7885 -6435 -10661 -6878 -3911 -6843 -4512 -3036 -1251 -689 -2587 3331 5754 840 5436 7731
544 7731 5678 4468 2569 4868 2649 -4862 -1729 -915 -7228 -9080 -9304 -7934 -11096 -16357 -8679 -5944
560 -5944 -12206 -7531 -1186 157 -2241 -2165 6763 5429 -2355 4998 9846 5712 3873 6911 11923 5389
$$ packed form
451B004j594j3297J1274P721j3488n414Q222P986m542j733J8405N639j1502J879
465A1560M595o941j2580n447P618m722j0090J0065Q352n108k708K587L913p907
479f813q375R830K858m807P017J0022N934j288l54Q308m548j0564K226km696k626
495B122P87O657m546o589N713l882q685j071j436L90j693J400R518J153J53P180
511G171j61L74M63j809K883j559q19M607j829K24J124m181r45l096n179n56m300
528g588k97J450m226L783K967k932K331J476J785N62j898N918K423m914M596K295
544G731k053j210j899K299k219p511L133Q14o313j852k24J370l162n261P678K735
560e944o262M675O345J343k398P6Q928j334p784P353M848m134j839L038N012o534
$$ plain form
576 5389 -3717 3149 1794 -10660 -12289 -6898 -6115 -13498 -13709 -260 -3040 -13444 -5089 806 -5653
591 -5653 -10183 -3377 6505 593 -2420 12663 15993 6801 6826 12565 11662 -1285 -4465 6944 1747
606 1747 -9232 -1322 6641 811 -7144 -3121 4418 -8148 -16152 -3354 -857 -8488 -5909 6491
620 6491 12453 3093 3266 16820 11000 -2297 2204 9981 5248 -4321 3060 15945 4874 -4091
634 -4091 7660 8135 -6519 -12550 -3726 -1407 -14863 -12707 5262 2579 -6551 583 10026 4982
648 4982 -7280 -1628 9856 -1202 -7525 7630 13593 4287 723 11630 13997 -3845 -6435 5674
662 5674 -1245 -12736 -7560 2958 261 -9777 -1969 8575 -3767 -11257 -1682 1559 -7241 -11459
676 -11459 1424 8777 -4030 -2305 12222 8214 -3326 -1924 7069 2332 -11039 -3317 8142
$$ packed form
576E389r106O866j355j2454j629N391P83p383k11J3449k780j0404Q355N895o459
591e653m530O806R882n912l013J5083L330r192K5N739r03j2947l180J1409n197
606A747j0979P910P963n830p955M023P539j2566q004J2798K497p631K579J2400
620F491N962r360J73J3554n820j3297M501P777m733r569P381J2885j1071q965
634d091J1751M75j4654o031Q824K319j3456K156J7969k683r130P134R443n044
648D982j2262N652J1484j1058o323J5155N963r306l564J0907K367j7842k590J2109
662E674o919j1491N176J0518k697j0038P808J0544j2342p490R575L241q800m218
676a1459J2883P353j2807J725J4527m008j1540J402Q993m737j3371P722J1459
$$ plain form
689 8142 -1908 -7298 2707 7274 -1879 -9242 506 4214 -10045 -9997 3393 2191 -6244 -3003 8979
704 8979 6242 -6490 658 9830 -1154 -6805 1506 6482 -842 -6634 4823 8324 -4566 -3916
718 -3916 4856 2170 -6170 -5751 3725 2000 -8461 -1264 7704 175 -4284 1858 7003 556 -5728
733 -5728 4114 7132 -3606 -2748 5013 3869 -2350 -3323 5473 3542 -6307 -1165 4581 -1414 -5775
748 -5775 -2285 3637 -1443 -7529 1931 5432 -3149 -2320 4303 4384 -1572 -3220 4673 2280 -5214 277
764 277 4935 814 -1383 537 5142 63 -6070 19 564 -5692 -5011 -1399 565 -3103 -3694 3475
780 3475 1425 -4501 -897 547 -2140 -3539 -2274 2318 681 -1105 4479 4514 1551 1002 754 1387
796 1387 -2223 -4559 561 0 -2266 908 1671 1371 -502 -1729 71 -2959 -5281 -1752 -1803 -1425 205
$$ packed form
689H142j0050n390J0005M567r153p363R748L708j4259M8J3390j202q435L241J1982
704H979k737j2732P148R172j0984n651Q311M976p324n792J1457L501j2890O50
718c916Q772k686q340M19R476j725j0461P197Q968p529m459O142N145o447o284
733e728R842L018j0738Q58P761j144o219r73Q796j931r849N142N746n995m361
748e775L490N922n080o086R460L501q581Q29O623Q1n956j648P893k393p494N491
764B77M658m121k197J920M605n079o133O089N45o256O81L612J964l668n91P169
780C475k050n926L604J444k687j399J265M592j637j786N584L5k963n49k48O33
796A387l610k336N120n61k266L174P63l00j873j227J800l030k322L529n1L78J630
$$ plain form
813 205 744 4165 2485 635 2709 568 -833 -148 -933 1148 1753 1629 4516 3515 2863 3023 -314
830 -314 -192 -538 -3386 -1806 -939 -285 1157 281 2542 3030 -1270 368 574 -2203 -1630 -987 1586 2304
848 2304 871 5075 5632 1625 2509 2508 1068 -938 -2345 2191 1465 -2354 1996 3654 789 -1172 -1218
865 -1218 948 -2714 -6357 -1003 -71 -3401 -1156 1565 3236 46 -1462 3604 1230 -4090 -723
880 -723 2020 447 -1611 294 5603 1479 -2774 2598 2625 -3354 -4392 -1149 219 -4808 -5595 2310
896 2310 207 -4952 -1564 1476 -811 -5238 -2938 3276 -1909 -5677 1932 3500 -1116 -2160 2599
911 2599 4446 -2659 -3707 3935 740 -5259 -2018 2113 -212 -5060 -2097 4419 -1781 -5978 970
926 970 2381 -2815 -4676 901 3964 -3037 -3062 5460 3253 -2525 96 4693 2664 -4010 -772 5620
$$ packed form
813B05N39L421j680j850K074k141j401O85p85K081O05j24K887j001o52J60l337
830c14J22l46k848J580Q67O54J442q76K261M88m300J638K06k777N73O43K573P18
848B304j433M204N57m007Q84jj440k006j407M536p26l819M350J658k865j961m6
865a218K166l662l643N354R32l330K245K721J671l190j508N066k374n320L367
880g23K743j573k058J905N309m124m253N372K7n979j038L243J368n027p87P905
896B310k103n159L388L040k287m427K300O214n185l768P609J568m616j044M759
911B599J847p105j048P642l195n999L241M131k325m848K963O516o200m197O948
926I70J411n196j861N577L063p001k5Q522k207n778K621M597k029o674L238O392
$$ plain form
942 5620 -815 -4840 1512 3601 -1178 -4099 1754 4929 -3841 -4115 4050 1406 -4227 -1797 4637
957 4637 3960 -3388 1332 8526 1754 -2449 3214 5749 -44 -4046 2404 5616 -3074 -2812 5028 2559
973 2559 -3270 -2762 2994 897 -7046 -2781 4081 -1732 -4061 2131 5453 1540 -2430 3791 6684
988 6684 -2201 -2002 4732 3528 -1359 -775 5744 4286 -3521 -44 4470 -1897 -5950 -2616 404 -3280
1004 -3280 -6963 -329 3491 -3833 -3185 2645 1716 -3062 -3504 3044 2400 -4265 668 6600 2430 -495
1020 -495 2397 5664 669 -4852 685 1961 -5152 -4444 128 496 -3782 -4643 1532 -84 -6802 -3269
1036 -3269 767 -2485 -4339 -1417 3451 1510 -1869 4158 5608 327 43 2723 3055 -964 -2097
1051 -2097 3147 1901 -3148 -223 2107 -763 -3798 -3668 -92 -3148 -6570 -1599 -16 -2977 -1975
$$ packed form
942E620o435m025O352K089m779k921N853L175q770k74Q165k644n633K430O434
957D637o77p348M720P194o772m203N663K535n793m002O450L212q690K62P840k469
973B559n829N08N756k097p943M265O862n813k329O192L322l913l970O221K893
988F684q885J99O734j204m887N84O519j458p807L477M514o367m053L334L020l684
1004c280l683O634L820p324O48N830r29m778m42O548o44o665M933N932m170k925
1020d95K892L267m995n521N537J276p113P08M572L68m278q61O175j616o718L533
1036c269M036l252j854K922M868j941l379O027J450n281k84K680L32m019j133
1051b097N244j246n049K925K330k870l035J30L576l056l422M971J583k961J002
$$ plain form
1066 -1975 1158 2753 -151 -1345 3771 2460 -975 1492 3066 2675 1013 1636 4751 2213 -1524
1081 -1524 1892 1359 -1687 -2323 -1555 -48 -2662 -3536 479 -79 -2551 -682 -94 87 -1224 -992 2301
1098 2301 611 118 2513 2499 2187 2001 1777 2980 717 -626 1496 -115 -1185 -497 -1184 -336 -1386
1115 -1386 -1696 47 -1288 -1697 -318 -1307 -490 -306 -679 1004 804 790 1987 1264 2052 1806 400 1653
1133 1653 640 -501 633 -586 -378 -322 -1830 -163 -739 -2071 -924 -1442 -1528 -1634 -2384 371 402 -1490
1151 -1490 1330 1653 1290 1035 751 2416 1168 -736 1702 1140 -569 120 509 1118 -942 -2325 643
1168 643 -917 -3792 -1882 -905 -1619 -2761 -1520 2255 -49 -1239 2428 2427 108 322 1911 2930 621
1185 621 -137 3875 2440 -209 1036 1965 683 -2361 -2426 1016 -2707 -4666 -786 -96 -2160 -2317 -219
$$ packed form
1066a975L133J595k904j194N116j311l435K467J574l91j662O23L115k538l737
1081a524L416n33l046o36P68J507k614q74M015n58k472J869N88J81j311K32L293
1098B301j690m93K395j4l12j86k24J203k263j343K122j611j070O88o87Q48j050
1115a386l10J743j335m09J379r89Q17J84l73J683k00j4J197p23P88k46j406J253
1133A653j013j141J134j219K08N6j508J667n76j332J147n18q6j06p50K755L1j892
1151a490K820L23l63k55k84J665j248j904K438n62j709O89L89O09k060j383K968
1168F43j560k875J910R77p14j142J241L775k304j190L667jk319K14J589J019k309
1185F21p58M012j435k649J245R29j282l044o5L442l723j959L880O90k064j57K098
$$ plain form
1202 -219 1286 -2563 -2620 2127 613 -1735 566 3128 2908 241 1559 5507 1730 -865 1911 2502
1218 2502 -752 -3135 -65 1859 -3175 -3465 1221 -570 -3697 -2973 -342 -954 -4833 -2121 2602 -909
1234 -909 -2084 2304 3347 1197 -606 2410 4416 -1027 -1413 3306 1892 -1500 -862 2274 1214 -3960
1250 -3960 -1951 1556 -2902 -5141 -1909 -23 -2068 -4214 -107 2427 -2082 -1886 2945 1968 -752
1265 -752 -394 3565 3386 -1444 1230 5063 1465 -850 1502 2945 -253 -3603 128 1402 -3633 -3521
1281 -3521 410 -21 -2532 -3017 1370 934 -3908 -830 3085 -236 -1884 957 3778 1351 -1373 2887
1297 2887 4320 -402 -385 2783 2211 -1015 -1941 1887 1317 -3305 -781 1854 -310 -2212 -812 2135
1313 2135 -179 -3224 1099 2897 -1006 -857 2407 2678 -42 -844 3199 2124 -2098 -205 2006 -96
$$ packed form
1202b19J505l849n7M747j514k348K301K562k20k667J318L948l777k595K776N91
1218B502l254k383L070J924n034k90M686j791l127P24K631o12l879K712M723l511
1234i09j175M388J043k150j803L016K006n443l86M719j414l392O38L136j060n174
1250c960K009L507m458k239L232J886k045k146M107K534m509J96M831r77k720
1265g52L58L959j79m830K674L833l598k315K352J443l198l350L731J274n035J12
1281c521L931m31k511m85M387m36m842L078L915l321j648K841K821k427k724M260
1297B887J433m722J7L168n72l226r26L828n70m622K524K635k164j902J400K947
1313B135k314l045M323J798l903J49L264K71k720q02M043j075m222J893K211k102
$$ plain form
1329 -96 -2307 -1299 1776 -935 -3808 -160 1014 -2284 -2729 -266 803 -1709 -2463 2310 1631 -1445
1345 -1445 888 2900 1556 -283 582 2866 603 -1775 1120 1637 -572 -1142 -181 740 -1601 -3137
1361 -3137 55 -723 -3251 -1609 -615 -938 -2148 -1035 1670 131 -1288 1437 1569 246 -111 98
1377 98 1830 13 -623 1628 688 -880 -588 -285 -416 -2172 -2417 -236 -1496 -2406 -241 -73 -492 -667
1395 -667 55 1309 -246 -18 1474 962 880 1236 1701 2220 1043 494 1923 453 -437 -86 -1222 -611
1413 -611 -1752 -2005 -715 -1733 -1695 -689 -1476 -1013 -1204 -1121 -16 -186 -136 1324 988 1862 1995 1718 2504
1432 2504 1718 1033 1920 798 755 433 -198 631 -124 -731 -137 -812 -813 -1270 -1530 -535 -1127 -1375 336 9
1452 9 -221 613 500 1420 485 -16 1726 727 -271 877 640 585 -207 -391 786 -588 -1656 -240 -572
$$ packed form
1329i6k211J008L075k711k873L648J174l298m45K463J069k512p54M773o79l076
1345a445K333K012j344j839Q65K284k263k378K895N17k209n70R61R21k341j536
1361c137L192p78k528J642R94l23j210J113K705j539j419K725J32j323l57K09
1377I8J732j817o36K251r40j568K92L03j31j756k45K181j260r10K165J68m19j75
1395f67P22J254j555K28J492n12q2L56M65N19j177n49J429j470q90L51j136O11
1413f11j141k53J290j018L8J006p87M63j91Q3J105j70N0J460l36Q74J33k77P86
1432B504p86o85Q87j122m3l22o31Q29p55o07N94o75jm57k60R95n92k48J711l27
1452Ik30Q34j13R20r35n01J742r99r98J148k37n5p92j84J177j374j068J416l32
$$ plain form
1471 -572 -1305 -1377 -806 399 -825 -993 1432 336 -563 475 765 1221 -71 51 1817 362 -488 1286
1489 1286 907 -226 -939 -116 621 -1935 -2082 361 -603 -2071 -1082 61 165 -1501 -833 1478 -170
1506 -170 -900 1055 1167 508 -604 1052 2336 -225 -490 1774 668 -1001 -754 473 238 -2311 -1240
1523 -1240 1390 -1126 -1939 -33 715 -638 -1650 379 1612 -559 -768 2108 1275 -67 198 2100
1539 2100 1759 -936 391 1950 -118 -1417 -242 817 -722 -2522 -226 947 -2350 -2029 640
1554 640 -52 -1721 -1400 1035 1105 -1741 170 2519 732 -84 891 2295 1136 -1008 1301 2190 -910
1571 -910 -664 991 792 -1107 -1657 841 187 -2629 -1557 736 -946 -2194 -825 1138 165 -1624
1587 -1624 773 2201 -393 -428 1292 1485 -109 -586 2098 1789 -1134 8 1632 161 -1306 -785
$$ packed form
1471e72p33p2N71J205j224j68K425j096q99J038K90M56j292J22J766j455q50J774
1489A286l79j133p13Q23P37k556j47K443r64j468R89J143J04j666O68K311j648
1506a70p30J955J12o59j112J656J284k561k65K264j106j669K47J227k35k549J071
1523a240K630k516q13J906P48j353j012K029J233k171k09K876q33j342K65J902
1539B100l41k695J327J559k068j299J175J059j539j800K296J173l297L21K669
1554F40o92j669L21K435P0k846J911K349j787q16R75J404j159k144K309Q89l100
1571i10K46J655j99j899n50K498o54k816J072K293j682j248J369J963r73j789
1587a624K397J428k594l5J720J93j594m77K684l09k923J142J624j471j467N21
$$ plain form
1603 -785 776 -682 -2626 -399 536 -1655 -1309 297 619 -958 -1588 1008 821 -1411 194 1586
1619 1586 954 -342 365 2264 1030 -1036 1085 1559 -596 -917 430 928 -835 -1688 751 697 -1584
1636 -1584 -619 326 -77 -1234 -750 1090 -37 -1218 504 1300 148 -419 344 1419 -458 -1115 1186
1653 1186 812 -836 -380 345 353 -798 -388 853 -287 -1282 260 376 -22 -736 45 1212 201 -414
1671 -414 1273 972 -122 316 493 565 -598 -310 699 -105 -982 7 -234 -528 -1061 -594 173 -1040 -1243
1690 -1243 322 -509 -680 -545 -76 930 -389 -20 1201 53 150 550 452 452 -148 325 801 -276 -294
1709 -294 210 20 -137 -633 -581 22 -705 -493 170 -185 -430 -46 5 689 136 72 508 -113 -31 657 -44
1730 -44 604 287 -268 308 -144 -294 -343 -857 -342 -595 -841 38 -384 -621 42 -324 277 44 -97 855 253
$$ packed form
1603g85J561j458j944K227R35k191L46J606L22j577o30K596j87k232J605J392
1619A586o32j296P07J899j234k066K121M74k155l21J347M98j763q53K439n4k281
1636a584R65R45m03j157M84J840j127j181J722P96j152n67P63J075j877o57K301
1653A186l74j648M56P25Qj151M10J241j140r95J542J16l98p14P81J167j011o15
1671d14J687l01j094M38J77P2j163K88J009q04q77R89k41k94n33M67P67j213k03
1690a243J565q31j71J35M69J006j319L69J221j148R7M00r8%o00M73M76j077j8
1709b94N04j90j57m96N2O03p27K12O63l55k45L84N1O84n53o4M36o21Q2O88p01
1730d4O48l17n55N76m52j50m9n14N15k53k46Q79m22k37O63l66O01k33j41R52o02
$$ plain form
1751 253 320 807 473 1065 763 458 1079 695 116 651 277 -30 -113 136 434 -761 -680 80 -260 -612 -598
1772 -598 -431 -167 -542 -702 317 -118 -668 576 607 221 -199 361 1168 -206 -323 1323 739 -174 143
1791 143 604 501 -485 44 927 -302 -405 230 126 -4 -435 351 865 -724 -493 815 281 -605 -422
1810 -422 436 327 -1101 -140 859 -645 -910 -237 306 -183 -1185 -26 628 -648 -480 709 264 -90
1828 -90 -315 647 588 -902 -283 945 -324 -451 276 713 411 -995 578 909 -517 -583 463 300 -156
1847 -156 -816 379 594 -921 -455 837 -229 -703 -197 724 182 -1032 228 781 -729 -569 624
1864 624 540 -449 -908 604 626 -1069 -325 653 -306 -865 -290 840 76 -1195 376 862 -660 -673 529
1883 529 816 -211 -811 897 1085 -678 313 1120 447 -453 -169 1037 157 -1197 116 558 -657 -694
$$ packed form
1751B53O7M87l34N92l02l05O21l84n79N35l74l07q3K49K98j195Q1P60l40l52J4
1772e98J67K64l75j60J019m35n50J244L1l86m20N60Q07j374j17J646n84r13L17
1791A43M61j03r86N29Q83j229j03O35j04j30m31P86N14j589K31J308n34q86J83
1810d22Q58j09j428R61R99j504k65O73N43m89j002J159O54j276J68J189m45l54
1828i0k25R62n9j490O19J228j269j27P27M37l02j406J573L31j426o6J046j63m56
1847a56o60J195K15j515M66J292j066m74N06R21n42j214J260N53j510J60J193
1864F24q4r89m59J512K2j695P44R78r59n59N75J130p64j271J571M86j522j3J202
1883E29K87j027o00J708J88j763R91Q07o73r00K84J206q80j354J313M42j215l7
$$ plain form
1901 -694 -168 547 -609 -1292 334 151 -1136 -326 410 189 -612 -162 910 427 -478 737 1195 300
1919 300 185 805 943 38 -921 722 822 -702 -122 473 302 -1161 -753 547 -287 -1228 55 122 -309
1938 -309 -804 -274 722 -424 -673 618 669 -182 -20 477 896 -185 171 963 200 -275 283 117 -47
1957 -47 -555 -183 18 -567 -670 279 -231 -682 -578 -222 287 -405 76 784 244 -8 192 675 334 -264
1977 -264 -186 755 -72 -331 347 -14 -248 -288 -140 112 -281 -268 245 -416 -422 -236 -65 174 -516 75 816 -55
1999 -55 -248 151 -9 51 14 61 726 -399 -227 214 -436 -22 -371 -228 317 -658 -387 338 -147 -60 -3 -264
2021 -264 269 121 37 396 194 -137 584 26 385 141 -134 463 -78 -190 -141 -487 -212 -253 -418 29 -253
2042 -253 -273 -84 -315 -82 -190 53 508 23 109 481 -3 359 377 294 536 289 303 245 56 -275 74 -466
$$ packed form
1901f94N26P15j156o83J626j83j287Q10P36k21q01M50J072m83r05J215M58q95
1919C00j15O20J38r05r59J643J00j524N80N95j71j463M08J300q34r41J283O7m31
1938c09m95N30R96j146k49J291N1q51J62M97M19j081L56P92p63m75N58j66j64
1957d7n08L72K01n85j03R49n10m51J04L56N09o92M81P08n40k52K00M83l41n98
1977b64P8R41q27k59O78l61k34m0J48K52l93J3N13o61oJ86J71K39o90N91P41q71
1999e5j93L99j60O0l7M7O65j125J72M41o50M14l49J43N45r75K71P25m85Q7N7k61
2021b64N33j48q4L59k02l31P21n58L59k44k75N97n41j12M9l46K75m1j65M47k82
2042b53k0J89k31K33j08K43M55m85Q6L72m84L62J8q3K42k47J4n8j89l31L49n40
$$ plain form
2064 -466 51 -599 -451 122 -533 -515 12 -264 -85 -36 151 519 -46 -53 722 241 157 193 473 510 -76 -139 744
2087 744 -4 -137 96 -44 -94 -352 -467 40 -434 -401 304 -31 -468 -342 -55 350 -140 -1 543 297 93
2108 93 488 626 260 -63 262 718 -239 -185 472 -135 -300 -641 -156 -17 -902 -228 103 -285 -440 -400 190
2129 190 196 -683 268 499 -376 28 340 270 -90 -153 447 583 -468 -202 514 259 -91 -209 409 144 -622
2150 -622 181 298 -417 -406 319 276 -230 -552 472 751 -405 178 164 276 -45 -184 636 77 -685 84
2170 84 710 -313 -304 -315 255 -393 -917 158 273 -626 -222 589 59 -101 -144 637 235 -294 363 829 61
2191 61 -45 -17 330 -113 -582 391 112 -500 -192 310 112 -209 -340 432 119 -763 72 298 -454 -211 274
2212 274 513 132 -237 404 138 -421 -185 358 589 -247 -461 525 -406 -897 -43 45 -153 -516 -427 544 -92
$$ packed form
2064d66N17o50J48N73o55J8N27k76J79M9J87L68n65pP75m81q4L6K80L7n86o3Q83
2087G44p48j33K33j40n0k58j15N07m74L3P05l35m37J26K87M05m90J39N44k46k04
2108I3L95J38l66l23L25M56r57N4O57o07j65l41M85J39q85O74L31l88j55M0N90
2129A90Oq79R51K31q75M04L12p0l60o3O00J36j051K66P16k55l50j18O18k65p66
2150f22Q03J17p15J1P25m3n06l22J024K79j156N83j4J12l21j39Q20n59p62P69
2170H4O26j023Rj1N70o48n24J075J15q99M04Q11n30j60m3P81m02n29O57M66p68
2191F1j06K8L47m43m69R73k79o12L08N02j98l21j31P72l13q82Q35K26p52K43M85
2212B74K39l81l69O41k66n59K36N43K31q36k14R86r31m91Q54Q8j98l63Q9R71o36
$$ plain form
2233 -92 -466 512 382 -168 -52 169 266 -124 -68 735 256 -96 334 493 316 -214 -79 510 -146 -443 6
2254 6 -297 -321 -641 -308 83 -295 -575 383 113 -386 204 275 323 -140 -37 606 299 -81 564 288 355 18
2276 18 169 605 -256 -293 244 -86 82 -211 -33 -14 -269 -281 80 -196 -428 -15 -116 175 -87 19 464
2297 464 -24 -83 202 20 164 -198 171 357 60 -212 398 19 -44 24 -125 -106 -468 -470 81 -254 5 143
2319 143 16 -220 -326 -69 263 -91 291 181 -15 199 -151 164 60 -262 -45 245 -49 152 -252 -29
2339 -29 77 -183 9 194 -100 89 22 -228 -187 -255 103 315 -73 73 333 -4 90 -74 -97 61 -193 -354
2361 -354 -64 -316 -49 -523 -320 132 -57 -164 436 -139 -76 288 318 410 -173 17 297 -244 -21 141 115
2382 115 364 -175 -125 293 -476 -447 340 -114 -164 -92 158 62 -298 -193 58 -359 -72 179 221 426 47 355
$$ packed form
2233i2l74R78j30n50J16K21R7l90N6Q03m79l52M30J59j77n30J35N89o56k97M49
2254Fl03k4l20L33L91l78k80R58k70m99N90P1M8m63J03O43l07l80O45k76O7l37
2276A8J51M36q61l7N37l30J68k93J78J9k55j2L61k76k32M13j01K91k62J06M45
2297D64m88n9K85j82J44l62L69J86k97k72O10l79o3O8j49J9l62kN51l35K59J38
2319A43j27k36j06K57L32l54L82j10j96K14l50L15j04l22K17K90k94K01m04K23
2339b9J06k60J92J85k94J89o7k50M1o8L58K12l88J46K60l37R4j64k3J58k54j61
2361c54K90k52K67m74K03M52j89j07O00n75O3L64L0R2n83J90K80n41K23J62k6
2382A15K49n39N0M18p69K9P87m54n0P2K50r6l60J05K51m17K87K51M2K05l79L08
$$ plain form
2404 355 239 59 -89 255 144 145 -334 -117 169 -477 -264 395 -332 -88 -365 -91 147 -409 -134 86 -258
2425 -258 107 -106 80 109 -115 115 -30 -86 -8 476 270 38 224 315 169 -368 72 451 -222 -386 -160
2446 -160 146 -6 -364 -49 246 -442 -66 144 -33 -20 -189 313 149 -57 110 274 73 -73 32 177
2466 177 -109 -130 669 304 -316 -106 -44 212 -92 -457 331 73 -632 140 297 117 -147 -172 103 44 -88
2487 -88 327 226 -170 -25 40 189 -188 -156 570 -99 -410 113 166 -62 -160 -82 244 -103 -451 134 -42 -144
2509 -144 2 413 62 -317 -348 -51 37 -498 -62 84 -62 -73 -342 149 51 -262 90 22 -222 -197 -89 289
2531 289 -47 -391 243 8 117 63 -26 243 118 -115 107 63 -89 93 166 -140 14 146 33 -423 -275
2552 -275 252 -139 -223 -79 112 296 -93 -137 359 -98 -36 289 261 276 -2 -127 263 83 -136 285 -5 14
$$ packed form
2404C55j16j80j48L44j11Jm79K17K86o46K13O59p27K44k77K74K38n56K75K20l44
2425b58L65k13J86K9k24K30j45n6P8M84k06k32J86R1j46n37M40L79o73j64K26
2446a60L06j52l58L15K95o88L76K10j77J3j69N02j64k06J67J64k01j46J05J45
2466A77k86k1P99l65o20K10O2K56l04l65P88k58p05P72J57j80k64k5K75n9j32
2487h8M15j01l96J45O5J49l77L2P26o69l11N23N3k28r8P8L26l47l48N85j76j02
2509a44J46M11l51l79l1K97Q8n35M36J46j46j1k69M91r8l13L52o8k44K5J08L78
2531B89l36l44O34k35J09n4q9K69j25k33K22m4j52J82P3l06J54J32j13m56J48
2552b75N27l91q4J44J91J84l89m4M96m57O2L25k8J5k78j25L90j80k19M21k90J9
$$ plain form
2574 14 -9 -73 -32 -427 76 3 -254 -202 -167 62 229 -58 -98 228 -195 -95 104 256 45 123 237 155 162 -26
2598 -26 -36 -306 -121 105 -238 -46 -165 -58 3 -12 -190 -90 -81 -347 36 -31 -196 -119 -3 216 -63 29 157
2621 157 -37 257 1 114 -23 79 -213 -6 -80 53 -97 -127 -37 -294 76 -201 -76 -191 -100 -111 119 80
2643 80 38 -24 251 41 90 -258 26 77 -17 109 -184 -20 -48 -56 180 -91 -134 254 -76 72 39 126 49 -25 -42
2668 -42 423 -279 114 23 -200 138 -116 -1 100 18 -17 50 -75 174 43 -12 297 -162 -76 217 16 -144
2690 -144 -107 -55 95 5 216 236 -347 -131 5 115 88 -347 -44 113 -323 54 166 -44 -149 -3 203 102
2712 102 -8 -400 186 -261 -258 103 28 95 -62 28 -60 274 -94 36 -52 -201 -148 248 -160 23 140 277 -183
2735 -183 -243 29 111 24 -117 26 124 -231 -171 146 -66 -178 -53 45 96 -171 -194 152 16 47 -39 229 -204
$$ packed form
2574A4k3o4M1l95N03p3k57N2L5K29J67k87m0L26m23J00J99J52k11P8J14q2Pj88
2598b6j0k70J85K26l43J92j19J07O1j5j78J00Rk66L83o7j65P7J16K19k79R2J28
2621A57j94K94k56J13j37J02k92K07p4J33j50l0R0k57L70k77J25j15R1j1K30l9
2643H0m2o2K75k10M9l48K84N1r4J26k93J64k8qK36k71m3L88l30J48l3Q7p7p4j7
2668d2M65p02L93r1k23L38k54J15J01q2l5O7j25K49j31n5L09m59Q6K93k01j60
2690a44L7N2J50r0K11K0n83K16J36J10k7m35L03J57m36L77J12k10j05J46K06j01
2712A02j10l92N86m47LL61p5O7j57R0q8L34l68J30q8j49N3L96m08J83J17J37m60
2735a83o0K72Q2q7j41J43R8l55O0L17k12j12J25R8N1k67k3L46j36L1q6K68m33
$$ plain form
2758 -204 -81 124 357 -197 -67 81 -43 24 -42 -1 26 -176 243 133 -192 105 -13 198 -72 -96 178 194
2780 194 144 -40 4 305 15 -367 105 190 -336 38 -23 44 144 65 -60 -164 -94 134 181 -270 -154 -202 35
2803 35 -201 -310 137 -180 -210 -274 129 29 -129 -18 152 20 -82 267 30 -172 175 -165 327 -41 48
2824 48 -96 65 -209 13 -153 194 22 -470 -72 159 11 132 146 156 11 -150 210 -156 -358 53 -111
2845 -111 54 -128 141 -47 -266 -171 222 108 -99 162 158 148 -37 180 574 218 109 -62 -200 -49 -208
2866 -208 149 -63 -109 -153 204 -94 8 97 -69 -50 -51 -101 -6 -209 -45 -39 210 -20 -18 -141 3 9 -191 -97 118
2891 118 -139 -21 -43 -41 -284 114 33 201 -281 -92 -99 110 -24 -119 -32 -178 -141 137 183 -105 47 27 -300 110
2915 110 124 201 9 -262 -75 99 141 -194 -122 254 -84 -153 6 -203 15 -220 -168 -193 -54 -81 -23 -304 -39
$$ packed form
2758b04J23K05K33n54J30J48j24O7o6M1K7k02M19j10l25K97j18K11k70k4K74J6
2780A94n0j84M4L01k90l82M72Q5n26L74o1O7J00p9j25j04P0K28M7m51J16m8K37
2803C5k36j09M47l17l0o4M03j00j58J11J70j32j02L49k37k02L47l40M92l68Q9
2824D8j44J61k74K22j66L47j72m92L98K31j48J21J4J0j45j61L60l66k02M11j64
2845a11J65j82K69j88k19R5L93j14k07K61mj0j85K17L94l56j09j71j38J51j59
2866b08L57k12m6m4L57k98J02Q9j66J9jn0R5k03J64OK49k30Kj23J44Ok00R4K15
2891A18k57J18k2Kk43L98q1J68m82J89pK09j34r5Q7j46L7K78M6k88J52k0l27M10
2915A10J4P7j92k71J87J74M2l35P2L76l38o9J59k09K18k35N2k5J39k7N8k81K65
$$ plain form
2938 -39 -126 -104 185 2 -87 -55 -25 105 32 -140 -158 -54 -53 158 -150 -159 30 -260 -174 -169 -215 93 20 -24 40 45 -20
2965 -20 -91 -66 81 58 -94 108 122 58 300 37 68 -12 -240 78 -30 247 17 4 -24 -113 76 -195 -18 -140
2989 -140 -61 -19 32 -96 -70 157 -190 134 203 75 114 102 46 -25 -77 -126 161 -38 -11 25 4 136 30 23 -114
3014 -114 -1 100 -8 129 79 166 238 101 -105 29 60 -26 124 177 -46 246 -186 -34 203 -3 15 14 -112
3037 -112 66 -202 -119 60 -243 218 -11 -140 88 393 65 104 47 64 37 -80 -84 -249 173 40 -120 102
3059 102 88 -26 -228 18 -1 -154 -65 80 -127 113 -7 29 -121 28 -141 -29 68 -163 196 130 41 -29 191
3082 191 -174 111 5 123 40 -107 -45 -52 -133 18 104 119 -220 -296 -215 105 -467 107 110 119 -105 -106 227 -18 103
3107 103 119 118 165 -11 23 -202 62 -134 143 -69 157 -70 -139 107 -390 -104 192 -96 -275 -62 298 6
$$ packed form
2938c9q7K2K89j83q9L2L0J30p3j72j8J04JK11l08rJ89k90Q6Nm6L08p3m4O4No5
2965b0p1K5J47k3j52K02J4o4K42k63L1q0k28L18j08K77k30j3k8q9J89k71J77j22
2989a40P9M2N1j28K6K27l47L24O9j28L9j2n6p1n2m9K87j99K7L6k1J32j06pj37
3014a14J13J01j08J37n0Q7P2j37k06J34L1q6J50N3k23K92m32J52K37k06J8jj26
3037a12J78k68Q3J79l03M61k29j29K28L05l28L9n7J7k7j17mj65M22j33j60K22
3059A02j4j14k02K46j9j53Q9J45k07K40j20L6j50J49j69J12R7k31L59o6q9p0K20
3082A91l65K85j06J18q3j47O2pq1J51Q6J5l39p6Q1L20n72N74LRk24jL33k45J21
3107A03J6jM7j76L4k25K64j96K77k12K26k27o9K46m97K86K96k88j79K13L60k92
$$ plain form
3129 6 -295 -222 -44 26 -38 124 -88 -1 -306 196 217 -264 -209 27 157 -64 -77 172 -398 -166 -200 9 269
3152 269 134 -43 -33 -104 139 -34 19 124 46 156 261 -28 105 -123 11 -16 -39 169 -190 -53 -21 162
3174 162 -31 -139 176 70 -24 -247 0 219 -15 107 58 43 -153 416 9 41 0 200 -136 289 119 86
3196 86 -85 6 -16 -23 88 -4 25 -307 204 -336 -240 -73 73 -170 32 -216 -285 -121 49 101 94 -71 -243 -65
3220 -65 -14 64 66 -149 -87 314 -40 66 97 -99 -88 117 -191 -99 99 101 59 4 -29 51 126 -85 -210 52 -95
3245 -95 -33 46 126 -51 133 167 -182 -6 -40 -124 -56 89 -165 44 -115 -151 -14 171 -7 54 -26 63 110 107 -153
3270 -153 -5 54 28 -67 -47 -108 61 -97 -122 63 -45 47 54 340 -142 126 -168 -246 48 31 3 -122 -37 53 -29
3295 -29 192 201 -63 -38 314 29 -6 17 112 138 -180 56 150 126 8 -47 -45 39 -212 73 157 -321 -173 250 0
$$ packed form
3129Fl01P3J78P0o4J62k12Q7l05N02K1m81N5K36J30k21j3K49n70K32l4K09K60
3152B69j35j77J0p1K43j73N3J05p8J10J05k89J33k28J34k7k3K08l59J37L2J83
3174A62j93j08L15j06r4k23K47K19k34J22m9j5j96N69m07L2m1K00l36M25j70l3
3196H6j71R1k2pJ11r2K9l32N11n40R6J67J46k43K02k48o9J64J70N2pj65j72J78
3220f5N1P8Kk15O2M01l54J06L1j96J1K05l08R2J98Km2n5l3Q0P5k11j25K62j47
3245i5O2P9Q0j77J84L4l49J76l4q4O8J45k54K09j59l6J37J85j78O1q0Q9M7lk60
3270a53J48N9k6r5K0o1J69j58k5J85j08R2PK86m82K68k94p8K94j7k8j25Q5R0q2
3295b9K21Rk64K5L52k85l5K3R5K6l18K36R4k4j18n5KQ4k51K85Q4m78J48M23k50
$$ plain form
3320 0 123 -82 -58 149 -214 -82 5 82 -99 -4 -130 -47 -103 75 -204 73 84 -45 60 348 -278 61 17
3343 17 -260 66 -91 14 58 -192 119 223 105 -45 92 33 -173 102 -154 259 -113 44 194 -35 36
3364 36 84 36 19 36 -128 -232 106 -140 -97 168 66 -75 -174 145 51 26 78 -144 -43 65 -45 -178 -64
3387 -64 5 66 -128 -115 -56 65 -182 -419 109 74 -348 -44 138 -7 114 -89 -53 -211 85 -5 57 -93 -58
3410 -58 -228 -150 7 -68 79 39 134 66 127 115 4 -61 -135 -288 53 -193 -71 -33 292 166 -13 -35 -145 -66
3434 -66 138 150 -85 112 106 133 -229 -53 -161 29 -60 72 -190 -53 -96 72 290 23 92 -25 73 12 118
3457 118 -169 -37 -63 88 27 182 48 -55 -44 -78 -134 128 -232 -167 -106 -138 -145 188 -104 -124 24 -319 -121 -138
3481 -138 -155 -259 96 93 7 -241 81 -107 157 367 -59 -77 -99 149 -27 133 0 214 -22 -109 -253 2
$$ packed form
3320@J23k05K4K07l63J32Q7P7j81R5j26Q3n6J78k79K77J1j29J05K88o26L39m4
3343A7k77L26j57J05M4k50L11J04j18j50J37n9k06K75k56M13l72J57J50k29P1
3364C6M8m8j7J7j64j04L38k46M3K65j02j41r9L19r4k5N2k22J01J08j10j33J14
3387f4O9O1j94J3N9J21k47k37N28l5m22L04J82j45J21k03L6j58K96r0O2j50L5
3410e8j70P8J57p5J47m0R5o8O1j2j11o5p4j53L41k46J22L8L25j26j79k2j10P9
3434f6K04J2k35J97oK7l62J76j08J90q9J32k62J37m3J68K18k67O9j17R8o1J06
3457A18k87J32k6J51o1J55j34j03J1l4n6K62l60O5O1l2pL33k92k0J48l43J98j7
3481a38j7j04L55lq6k48L22j88K64K10m26j8k2K48j76J60j33K14k36q7j44K55
$$ plain form
3503 2 -16 -198 -163 -144 -83 -50 -182 241 -140 -32 139 176 255 81 85 -139 -126 113 63 140 -63 43 -32 69 77 -107
3529 -107 -26 50 37 54 38 2 281 -80 -19 183 191 -121 -73 -54 69 60 111 46 -126 10 -129 9 33 -33 113 172
3555 172 -76 -260 -63 76 -1 8 -212 -158 151 104 10 43 63 -168 23 180 -209 -88 136 -117 -37 120 -83
3578 -83 -2 -111 81 -154 -150 -155 24 -20 232 260 -87 -41 -184 89 304 -234 -271 -34 -94 -194 -182 -138 -155 -4 48
3603 48 -47 260 -53 -93 109 -41 140 59 -113 147 86 -241 -41 70 -59 28 13 -93 -134 160 -112 28 253
3626 253 -171 143 -52 1 40 -237 -98 -73 -65 -18 -107 132 101 -148 -182 -84 -39 -101 166 224 64 -32 -72 -402 -191
3651 -191 89 -7 -89 146 71 140 121 71 -34 26 77 -47 212 -86 129 -116 -9 76 41 5 -85 -133 -247 9
3675 9 -247 171 69 -18 90 128 -128 53 -84 144 12 12 141 -49 -53 45 97 18 -76 52 170 141 -113 -141 -192
$$ packed form
3503Bj8j82L5J9O1L3j32M23l81J08J71L7P9j74Mk24J3K39n0P7k03J06p5J01Qj84
3529a07Q1P6j3J7j6l6K79l61O1K02Ql12M8J9J23rN1o5j72J36j39J38K4o6J46N9
3555A72k48j84J97J39p7Rk20N4L09m7r4L3K0k31J91J57l89J21K24k53Q0J57k03
3578h3Q1j09J92k35MnJ79m4K52K8l47M6j43K73K15n38l7K37o0j00J2M4j7J51N2
3603D8r5L07l13m0K02j50J81q1j72K60o1l27K00J11j29Q7j5j06m1K94k72J40K25
3626B53m24L14j95N3L9k77J39K5QM7q9K39l1k49l4R8M5o2K67N8j60r6m0l30K11
3651a91K80r6q2K35p5O9j9n0j05O0N1j24K59k98K15k45J07Q5l5l6r0m8j14K56
3675Ik56M18j02q7J08L8k56J81j37K28j32%J29j90mR8N2p9r4J28J18k9k54k8n1
$$ plain form
3700 -192 138 -307 88 3 -28 9 67 48 -250 -100 -142 81 3 -40 -24 -165 16 -154 86 236 -165 251 -92
3723 -92 15 218 -150 -357 -57 -188 -38 118 -377 126 191 -125 -24 104 267 -109 103 263 -62 131 -51
3744 -51 -65 -318 299 295 100 150 290 -119 146 -96 194 200 27 7 -171 -408 -95 122 -157 -138 -205 -128 138 240
3768 240 -217 -133 234 47 -197 89 -224 77 5 -213 64 -132 -124 -121 -38 -210 96 -111 -212 -2 -166 139
3790 139 -107 -283 -183 5 207 -58 40 -50 -277 -145 115 -264 -92 82 109 -98 -32 93 -61 13 -16 18
3812 18 -30 -99 -31 178 -52 -99 -185 190 -17 123 108 12 -101 -14 74 -10 -136 -217 -180 -64 86 57 100 127 -145
3837 -145 -34 68 -147 73 43 21 60 -141 -186 -148 -7 -160 69 17 115 -67 -225 136 -127 45 36 -189 -208
3860 -208 -77 -98 136 -140 7 67 129 -97 109 -63 -100 92 -239 6 115 -150 -73 133 11 119 135 260
$$ packed form
3700a92L30m45L95q5l1L7N8j9k98J50m2K23p8m3J6j41J81j70K40J50m01M16l43
3723i2J07K03l68k07L00j31J50J56m95N03O5l16J01J28J63l76K12J60l25J93j82
3744e1j4k53O17mj95N0J40m09K65k42K90Oj73k0j78k37L13K17k79J9o7P7K66J02
3768B40m57Q4L67j87k44K86l13L01p2k18K77j96QLQ3j72L06k07j01K10j64L05
3790A39k46j76J00J88K02k65R8r0k27J32K60l79J72J74K7k07O6J25j54P4k9L4
3812A8m8o9O8K09k30m7q6L75k07J40j5r6j13Q7Q8q4j26q1L7J16J50k9M3K7k72
3837a45J11J02k15K20l0k2L9k01m5L8J41j53K29n2R8j82j58L61k63J72rk25j9
3860b08J31k1K34k76J47O0O2k26K06j72l7J92l31K45J09k65P7K06j22J08J6J25
$$ plain form
3882 260 18 -37 -106 -89 183 138 -35 -66 131 128 -63 48 -18 45 57 77 69 -270 67 -53 -101 -51 8 56 -42 -45 -290
3909 -290 112 -125 -111 61 167 100 242 23 28 37 -58 -312 22 33 106 68 -75 3 331 14 82 385 106 -27
3933 -27 -50 4 253 0 1 -112 -231 394 -170 1 -99 3 -81 201 -70 136 -165 75 -161 -168 -251 -161 62
3956 62 190 -258 142 -33 -29 -105 109 54 -162 -205 -38 -288 -172 -192 184 157 98 216 168 41 -194 -93 175
3979 175 104 -75 -48 -58 -34 -212 62 -70 -196 77 155 239 -20 -143 -95 174 -151 236 122 94 62 -41 -118
4002 -118 -168 73 257 -63 110 29 209 -181 110 33 -16 175 -62 -1 -82 35 38 -15 -15 151 140 -217 -50 220
4026 220 -78 -12 117 92 -148 49 239 52 7 71 114 37 -10 -61 65 -22 93 -63 0 -6 -56 -87 90 -117 76
4051 76 466 94 -140 -31 2 131 73 102 -79 33 41 -44 -97 -23 55 -61 110 -72 236 -200 62 -212 24
$$ packed form
3882B60k42n5o9J7K72m5j73l1J97lj91J11o6O3J2K0ql39L37j20m8N0N9M8r8lk45
3909b90M02k37J4J72J06o7J42k19NRr5k54L34J1P3l8j43P8L28l17O8L03k79j33
3933b7k3N4K49k53Jj13j19O25n64J71j00J02q4K82k71K06l01K40k36pq3R0K23
3956F2J28m48M00j75Mp6K14n5k16m3J67k50J16k0L76k7n9J18m8j27k35J01K68
3979A75p1j79K7j0K4j78K74j32j26K73P8Q4k59j23M8K69l25L87j14k8l2j03p7
4002a18n0K41J84l20J73q1J80l90K91p7m9J91k37O1q1J17Ln3%J66j1l57J67K70
4026B20k98O6J29k5k40J97J90j87m5O4M3p7m7n1J26q7J15j56O3on0l1J77k07J93
4051G6L90l72k34J09L3J29n8K9j81J12Qq5n3P4P8j16J71j82L08m36K62k74K36
$$ plain form
4074 24 -40 -279 93 -201 67 61 -106 -36 178 -283 -377 -40 37 294 13 82 21 -116 -1 127 -133 -81 117
4097 117 269 116 -80 -12 0 355 67 -141 85 -69 -61 162 29 153 22 -14 239 -130 245 -62 129 -221
4119 -221 56 30 2 21 -54 73 86 -86 79 -38 14 91 55 286 55 78 46 106 78 -76 -18 -238 56 -11 -107
4144 -107 168 48 -102 -50 187 -31 73 -160 -220 57 84 -137 -144 -18 54 136 -10 237 149 -172 4 65 -108
4167 -108 8 -91 21 -44 -89 177 57 92 33 -235 16 -5 107 -267 1 -87 26 218 162 66 129 132 -85 -81 -86
4192 -86 123 -197 47 -5 -93 132 -112 28 22 -88 -21 -49 -312 -188 -168 13 -126 131 112 -62 92 -273 221
4215 221 -359 -114 1 10 126 121 -78 142 13 9 196 173 -23 -189 26 -159 133 -140 328 63 155 -126 -88
4238 -88 -61 244 104 -14 -9 -320 97 64 65 142 -65 -22 23 101 -164 -411 -111 0 108 20 291 -7 -373 77
$$ packed form
4074B4o4k39L72k94K68oj67P0K14m61r4L37P7K57k81O9o1j37J15J28k60N2J98
4097A17J52j53j96O8J2L55k88k08K26j54QK23j33J24j31l6K53l69L75l07J91l50
4119b21K77k6k8J9p5J27J3j72J65j17N2P7l6K31k31K3l2O0k8j54N8k20K94o7r6
4144a07K75j20j50N2K37k18J04k33o0K77K7k21pJ26P2Q2j46K47q8l21J76O1j73
4167a08J16r9J12o5m5K66j20L5n9k68K51k1J12l74K68q8J13J92n6r6O3Lk17Mn
4192h6K09l20K44n2q8K25k44J40oj10O7k8k63J24K0J81j39K57j9j74J54l65M94
4215B21n80K45J15RJ16nj99K20j29mJ87k3j96j66K15j85K92k73M68k65R2k81L8
4238h8K7L05j40j18Nl11M17l3JP7k07M3M5P8k65k47L00J11J08q8K71k98l66M50
$$ plain form
4262 77 -100 -20 -150 47 -82 -95 -72 110 31 60 -74 -80 -108 -84 -70 18 163 2 152 -49 -199 50 74 -145
4286 -145 -40 326 13 -240 -156 98 70 -77 156 -134 25 -96 43 107 -31 52 -136 -69 114 46 -188 -206
4308 -206 -159 -129 -121 -274 76 168 262 157 3 -159 11 -82 -132 -52 -139 -25 274 41 186 -147 24 -182 82
4331 82 195 -399 288 -35 -5 -144 -95 116 -25 -91 -160 -23 -166 -102 68 11 226 -8 25 29 77 150 86 -1 -16
4356 -16 -189 26 -40 -79 151 -310 -46 -26 -39 8 33 -140 -87 -99 41 105 -150 -79 -64 -193 138 -170 -79 -116 120
4381 120 -253 -87 -68 -265 46 -56 198 52 356 -194 -17 86 88 -69 26 229 220 -234 -88 67 -136 97
4403 97 195 101 -21 54 -18 24 63 -205 -15 128 -20 200 -185 106 148 3 -29 102 -95 58 -20 -42 92 282
4427 282 214 128 -96 103 101 50 -144 -15 147 91 249 123 -62 -20 38 -58 -48 44 91 -41 120 38 65 -16 -142
$$ packed form
4262G7j77Q0j30J97j29j3K3J82p9K9j34ok8K4J4Q8J45j61J50k01j50K49K4k19
4286a45J05L66l13k53Q4K54k8j47K33k90J59j21J39O4j38Q3j88O7J83o8k34j8
4308b06M7L0Qj53L50R2R4j05j54j62J70r3n0Q0q7J14K99k33J45l33J71k06K64
4331H2J13n94O87l23L0j39M9K11j41o6o9J37j43O4J70n7K15k34L3MM8P3o4q7j5
4356a6j73K15o6l9K30m61K64K0j3M7K5j73N3j2J40O4k55P1J5j29L31l08R1l7K36
4381A20l73J66J9j97L11j02K54j46L04n50J77J03Kj57R5K03rm54J46J55k03K33
4403I7R8r4j22P5p2M2L9k68J90J43j48K20l85K91M2j45l2J31j97J53p8k2J34J90
4427B82o8q6k24J99kn1j94J29J62n6J58j26j85M2N8r6J0R2M7j32J61q2K7q1j26
$$ plain form
4452 -142 -76 314 -122 204 86 124 92 236 167 37 40 33 317 -87 60 -120 329 -12 174 -3 -108 32 -25
4475 -25 -99 -63 -26 358 101 324 -125 -84 16 102 123 43 -90 225 90 -128 43 -164 34 -170 325 213 2
4498 2 116 -168 80 -153 -48 134 -159 -24 67 40 160 -286 -243 32 9 153 70 78 50 -139 -48 156 -131 73
4522 73 184 11 99 -50 185 112 -147 12 -17 -320 -382 127 52 -104 57 97 -62 -57 -193 -166 86 35 177 -176
4546 -176 -39 -115 51 152 66 267 97 -12 135 -238 198 -50 -144 -119 108 148 159 119 147 -136 142 176 45
4569 45 -360 -49 233 95 195 -150 0 35 -122 167 41 -193 87 -7 160 160 28 -133 -10 -241 -77 13
4591 13 -16 156 46 101 143 -55 -136 117 -165 231 -118 -26 -232 170 -111 99 -48 197 -6 48 509 29
4613 29 -14 285 -29 -133 -17 108 7 116 218 -63 61 167 87 58 -120 162 101 -166 -71 -89 385 -272
$$ packed form
4452a42O6L90m36L26j18L8l2J44o9j30LpK84m04J47j80M49l41J86j77j05J40n7
4475b5p4L6L7L84k57K23m49M1J00Q6K1q0j33L15j35k18J71k07J98k04M95j12k11
4498BJ14k84K48k33J05J82k93J35R1k7J20m46M3K75k3J44q3Qk8j89R1K04k87K04
4522G3J11j73Q8j49K35p3k59J59k9l03o2N09p5j56J61M0j59Nj36K7K52n1J42l53
4546a76J37p6J66J01q6K01j70j09J47l73M36k48r4K5K27M0J1m0K8k83K78L4j31
4569D5m05L11K82j38J00l45J50L5j57K89j26k34K80r4J67%j32j61J23k31J64R0
4591A3k9J72j10N5M2j98q1K53k82L96l49R2k06M02k81K10j47K45k03N4M61m80
4613B9m3K99l14j04J16J25j01J09J02k81J24J06q0k9j78K82o1k67R5j8M74o57
$$ plain form
4635 -272 -88 65 -229 240 56 -77 213 -20 -3 57 94 76 87 275 -6 -22 -18 -230 -50 131 -49 -23 175
4658 175 -227 -77 -174 122 39 155 -156 35 88 83 -428 -192 79 -137 29 -186 -50 -81 35 46 -55 51
4680 51 -205 -135 -84 -98 56 109 -166 -113 -101 -43 5 -81 -170 36 -21 -252 109 -72 -64 -116 -22 41 -109 48 -107 -102
4706 -102 -137 22 230 84 48 134 -66 287 -7 -56 102 -195 -158 -27 -133 74 -257 -248 -213 19 -136 98 -59
4729 -59 107 15 -290 -47 -26 -143 141 202 77 37 21 8 -15 178 -173 179 206 64 -115 -98 177 19 -73 106
4753 106 63 48 5 10 -36 -168 190 -301 -91 -80 -172 -140 185 191 -66 -31 140 196 60 36 278 -22 42 -202 160
4778 160 80 -340 109 -69 -42 75 224 88 -70 3 4 169 -249 184 102 137 -144 -154 -67 250 -146 -40 120
4801 120 109 -45 -111 -41 219 25 34 -153 81 -69 185 43 117 80 -86 140 -69 -65 20 232 103 -214 -35
$$ packed form
4635b72J84J53k94M69j84j33K90k33J7O0L7j8J1J88k81j6Mk12J80J81j80K6J98
4658A75m02J50r7K96q3J16l11J91N3nn11K36K71k16J66k15J36l1J16J1j01J06
4680E1k56P0N1j4J54N3k75N3J2N8M8q6q9K06n7k31L61j81Qn2R4O3j50J57j55N
4706a02l5J59K08j46l6Q6k00L53k94m9J58k97L7J31j06K07l31RL5K32j55K34j57
4729e9J66r2l05K43K1j17K84O1j25m0j6j3k3J93l51L52K7j42j79J7K75j58r2J79
4753A06m3j5m3Nm6j32L58m91K10J1r2L2L25Ok57L5J71N6j36k4K42l00O4k44L62
4778A60q0m20M49j78K7J17J49j36j58P3JJ65m18M33q2L5k81j0Q7L17l96J06J60
4801A20j1j54o6P0K60j94Rj87K34j50K54j42P4l7j66K26k09MQ5K12j29l17J79
$$ plain form
4824 -35 41 125 43 -93 -78 -44 119 52 -25 58 -20 79 -156 215 -1 -82 127 -133 -17 -156 -43 -167 148 209
4848 209 116 110 9 -14 78 -77 -3 181 -192 -34 -41 56 -256 -155 -18 -81 60 71 -137 257 -221 34 -13 163
4872 163 218 -294 -28 -108 -62 74 3 -115 88 -123 -148 32 -345 -81 156 -28 -209 60 -40 -254 -45 -32
4894 -32 15 -152 39 0 80 145 -34 -52 73 -218 18 40 -111 -99 -268 135 24 76 140 35 -263 -259 -27 19
4918 19 59 -133 -113 -106 67 -127 -48 28 120 -20 -93 90 244 -32 103 39 28 -176 43 -21 -3 -159 174 -180
4942 -180 -236 277 30 103 12 -50 -18 176 -94 -7 -95 73 -113 -275 -124 5 157 -195 -54 -110 83 29 207
4965 207 136 10 -209 -95 271 141 -242 -210 -112 -117 165 -154 112 -130 -319 -53 -51 -144 -326 50 -4 224 57
4988 57 -30 157 -119 219 273 5 206 -64 132 25 54 190 -94 17 -234 -143 -82 34 -33 18 -181 -61 -202
$$ packed form
4824c5P6Q4q2j36J5L4J63o7p7Q3p8R9k35L71k16q1K09k60J16j39J13j24L15O1
4848B09r3oj01k3R2j55P4J84l73J58pR7l12J01J37o3J41J1k08L94m78K55m7J76
4872A63N5n12K66q0M6J36p1j18K03k11k5J80l77K64K37j84j81K69j00k14K09J3
4894c2M7j67J91l9Q0O5j79j8J25k91K36K2j51J2j69M03j11N2O4j05k98MK32M6
4918A9M0j92K0PJ73j94P9P6R2j40p3J83J54k76J35o4j1k04K19o4J8j56L33l54
4942a80n6N13k47P3r1o2L2J94k70Q7q8J68j86j62J51J29J52l52J41n6J93n4J78
4965B07p1j26k19J14L66j30l83L2R8nK82l19K66k42j89K66Kr3j82L76n4K28j67
4988E7q7J87k76L38N4k68K01k70J96j07K9J36k84J11k51R1O1J16o7N1j99J20j41
$$ plain form
5011 -202 -179 159 -201 -203 -148 156 67 21 -3 4 202 -14 -205 130 185 -163 -144 66 -100 197 -43 -14 132 204
5035 204 -137 8 122 -115 -100 175 -124 136 -2 -160 -57 -160 46 -283 -197 49 174 -128 39 -28 160
5056 160 -71 -163 151 35 -227 228 -209 144 163 -68 -43 212 203 -248 -114 -47 -117 -185 84 -108 -77 -151 -14
5079 -14 -80 -2 54 -174 -53 -58 -218 -163 -66 -41 -37 25 27 -277 -2 196 259 -117 62 -188 48 -223 -65 -64 -16 65
5105 65 -98 104 -18 26 -18 260 44 -23 -106 -103 -168 76 22 -23 -45 -95 -45 32 139 215 70 3 110 -307 -71
5130 -71 -29 -43 -270 -249 -97 -172 -113 -132 -57 327 -156 157 -61 6 -9 -327 -116 -79 6 -7 83 -135 -189 -33 -48
5155 -48 -45 233 -65 32 282 -47 111 -29 194 108 -2 123 22 -222 -40 -216 58 -255 -171 428 -46 -148
5177 -148 48 -215 -34 109 -121 152 64 40 198 -91 -85 140 -42 43 -93 -58 259 -170 284 -93 -307 -125
$$ packed form
5011b02K3L38l60kN5L04q9m6k4PJ98k16j91L35N5l48J9K10j66K97k40K9J46P2
5035B04l41J45J14k37J5K75k99K60j38j58J03j03K06l29Q6K46J25l02J67o7J88
5056A60k31r2L14j16k62M55m37L53J9k31K5K55rm51J34O7p0o8K69j92L1p4J37
5079a4o6P8N6k28J21nj60N5R7K5MO2Kl04K75J98O3l76J79k50K36k71J58JM8Q1
5105F5j63K02j22M4m4K78k16o7q3Lo5K44n4m5k2n0N0P7J07P6j45o7J07m17K36
5130g1M2j4k27K1J52p5N9j9P5L84m83L13k18O7j5l18K11L7Q5j3R0k18n4J56j5
5155d8LK78k98R7K50l29J58j40K23q6j10J25j01k44J82j76K74l13Q4N99m74j02
5177a48J96k63J81J43k30K73q8k4J58k89OK25j82Q5j36L5L17m29M54l77k14J82
$$ plain form
5199 -125 -157 -46 -61 -80 221 74 -293 -175 108 -61 18 -6 58 49 56 -271 -96 -47 37 -18 -39 49 11 74 6 77
5225 77 -83 -18 34 124 -143 261 205 -76 130 43 -156 81 162 -49 166 -67 -155 46 -104 113 -61 -209 164
5248 164 14 153 -79 -103 24 33 78 -6 167 -15 -202 -116 43 -100 12 -42 179 -10 -30 -191 -60 4 83
5271 83 -10 87 256 66 108 184 -104 75 -202 -396 99 -92 41 150 -3 179 109 -9 67 -117 37 -92
5293 -92 114 -277 31 -142 -220 -88 252 74 -1 55 -44 -96 -201 -2 41 37 -41 -14 153 -211 53 89 -170 434
5317 434 56 57 -173 -55 117 121 115 -206 -139 41 138 -72 337 111 -57 122 -11 -177 34 61 -241 85 -265
5340 -265 160 -181 21 -140 -135 -99 -70 70 95 -154 -99 113 112 -139 192 13 -105 -94 4 -83 75 154 -4 169
5364 169 65 149 129 -180 114 -143 -82 -194 115 134 -158 -200 -106 -2 283 122 276 76 122 17 12 -12 28 9
$$ packed form
5199a25l2J11j5j9L01j47l67J18K83j69P9k4O4rPl27J75M9Q4n5k1Q8l8O3o8P1
5225G7j60O5N2R0k67M04n6k81K06q7j99K37Q1k11K15k33q8K01j50K17j74j48L73
5248A64j50J39k32k4J27RM5q4J73j82j87Q6J59j43J12n4K21j89k0j61J31O4P9
5271H3r3R7J69j90M2P6k88J79k77j94M95j91J33J09j53J82p0j18P6j84J54j29
5293i2K06l91L08j73p8J32L40j78p5N6r9n2j05J99M3mp8K7J67l64K64L6k59O04
5317D34l78Jk30J18J72Mol21O7J80R7k10M09k26j68J79j33j66K11K7l02L26l50
5340b65M25l41K02j61NL6K9J40K5k49N5K12jk51L31j79j18J1R8q7J58P9j58J73
5364A69j04Q4k0l09K94k57O1j12L09J9k92m2R4J04K85j61J54k00M6j05nk4M0j9
$$ plain form
5388 9 -97 -146 105 208 -42 -53 90 -159 -326 -265 -16 156 -95 -84 -211 -135 -5 -34 -114 82 -139 246 56
5411 56 -15 -20 -59 -3 -58 -137 -115 -208 100 134 -10 -87 17 -27 146 -29 88 56 249 35 218 1 228 196 -43
5436 -43 -213 0 212 121 185 -151 -306 -180 -99 -64 -20 114 -72 -1 201 62 174 53 85 94 163 -81 166 -183
5460 -183 -109 47 118 210 -159 73 216 175 165 -216 209 -266 72 -147 115 -20 -249 103 1 178 -151 144
5482 144 -30 -9 -43 118 -193 230 -69 -121 93 153 222 51 121 173 4 -51 -39 62 41 92 5 -102 339 -146
5506 -146 54 37 101 -154 -69 -14 -76 -75 186 19 -81 2 -31 -94 47 -99 -117 -248 176 -68 25 -259 -87 1
5530 1 -154 -66 -29 -245 -252 -54 -16 -295 -18 150 -154 -8 -16 230 -254 83 -98 29 116 -112 43 -42 103 66
5554 66 -156 -38 -275 92 -91 -147 -112 135 -96 -64 -422 -161 -52 -19 -221 -76 75 87 -132 -87 -116 28 -50
$$ packed form
5388Ij06m9K51J03k50j1J43k49j67O1K49J72k51J1j27P6J30k9q0J96k21L85j90
5411E6p1nl9N6n5p9K2r3L08L4j44p7J04m4J73j75J17l2J93k14J83k17K27l2k39
5436d3j70K13K12r1O4l36j55J26Q1L5M4J34j86P1K02j39J12j21L2RO9k44K47l49
5460a83P4J56P1R2l69K32J43m1j0l81M25m75L38k19K62j35k29L52j02J77l29K95
5482A44j74K1l4J61l11M23k99n2K14O0O9j71P0N2j69n5J2J01k1N1q7j07M41m85
5506a46K00j7O4k55Q5N5o2JK61j67j00Q3l3o3J41j46j8j31M24k44R3k84J72Q8
5530Aj55Q8L7k16pJ98L8k79K77J68l04J46qK46m84L37j81J27Q7k28J55q5J45l7
5554F6k22J18k37L67j83n6L5K47k31L2l58K61J09L3k02J45J51J2k19M5k9J44p8
$$ plain form
5577 -50 -56 356 -177 1 -55 -159 23 -102 64 -152 35 85 22 -43 97 186 79 -143 -258 125 -192 183 98
5600 98 36 -46 175 -36 -259 -213 -143 11 -98 -9 141 19 -36 -73 308 83 -139 45 9 -234 -8 -188 -324
5623 -324 -210 -11 -50 119 -245 -187 -48 -32 -93 -90 -186 -210 127 11 -23 298 98 179 -223 1 52 -89 159 -41
5647 -41 -99 -22 -204 144 137 -25 -84 41 184 39 87 251 136 135 -99 -55 56 136 141 136 95 6 -102 -178 210 -46
5673 -46 -89 152 369 -56 74 197 193 159 0 194 371 -215 -82 376 -18 75 20 -29 -105 3 44 -16 -136 -125
5697 -125 -177 -81 -44 102 -66 94 36 33 54 73 -52 -334 -64 -57 -60 -25 -22 -119 -54 -234 17 197 -202 -193 34 66 -55
5724 -55 -326 -23 114 1 -273 137 -280 209 140 52 -104 95 -9 -412 -32 -110 29 61 3 54 224 192 -137
5747 -137 -54 146 -311 -44 138 -143 -85 61 -141 155 -73 -78 -43 154 33 62 146 53 116 113 128 94 -6 16 -45
$$ packed form
5577e0oM12n33J78n6j04J82j25J66k16J87N0o3o5J40Q9j07k22j15L83l17L75q5
5600I8o2q2K21k11k23M6P0J54j09Q9J50j22n5l7L81k25k22J84l6k43K26j80j36
5623c24J14J99l9J69l64N8J39J6o1Lr6k4L37j16l4L21k00Q1m02K24N1j41K48k00
5647d1n8P7j82L48pj62n9J25J43j45M8J64j15jk34M4J11Q0Nnm1q9j08p6L88k56
5673d6m3K41K17m25J30J23ml4j59J94J77n86J33M58l94R3n5m9p6J08M1o0j20J1
5697a25n2R6L7J46j68J60n8lK1J9j25k82K70PlL5Lr7O5j80K51J80l99RK27L2j21
5724e5k71L03J37j13k74M10m17M89o9q8j56J99j04m03L80p8J39L2n8N1J70l2l29
5747a37Q3K00m57K67J82k81N8J46k02K96k28nL5J97j21K9Q4r3O3lJ5l4j00K2o1
$$ plain form
5772 -45 74 -191 -54 328 -62 -78 -96 -189 -91 157 -110 -105 -165 22 -62 -127 65 125 2 309 233 -210 -49 -88
$$ packed form
5772d5J19k65J37L82l90j6j8r3R8K48k67No0J87q4o5J92O0j23L07p6m43J61l9
$$ [...]
8191B7
##END NTUPLES=NMR FID
##END=
