##TITLE=1H_Pr 2740
 CDCl3
 8 sc, 
 9.2.2023
##JCAMPDX= 6.0         $$ Bruker NMR JCAMP-DX V2.0
##DATA TYPE= NMR FID
##DATA CLASS= NTUPLES
##ORIGIN= UXNMR, Bruker Analytische Messtechnik GmbH
##OWNER= root
$$ XWIN-NMR		Version 3.5
$$ Thu Feb  9 14:48:11 2023 Russian Standard Time (UT+4h)  she@DPX200
##.OBSERVE FREQUENCY= 200.13135
##.OBSERVE NUCLEUS= ^1H
##.DELAY= (6, 6)
##.ACQUISITION MODE= SIMULTANEOUS
##.ACQUISITION SCHEME= undefined
##.AVERAGES= 8
##.DIGITISER RES= 18
##SPECTROMETER/DATA SYSTEM= spect
##.PULSE SEQUENCE= zg30
##.SOLVENT NAME= DMSO
##.SHIFT REFERENCE= (INTERNAL, DMSO, 0, 15.7039)
##AUDIT TRAIL= $$ (NUMBER, WHEN, WHO, WHERE, WHAT)
$$ ##TITLE= Audit trail, XWIN-NMR		Version 3.5
$$ ##JCAMPDX= 5.01
$$ ##ORIGIN= Bruker BioSpin GmbH
$$ ##OWNER= she
$$ F:/spectra/data/she/nmr/H-F/1/audita.txt
$$ ##AUDIT TRAIL=  $$ (NUMBER, WHEN, WHO, WHERE, WHAT)
(   1,<2023-02-09 14:47:05.39 +0400>,<she>,<DPX200>,
      <created by zg, POWCHK disabled, PULCHK disabled
       configuration hash MD5:
       00 E9 B6 7A A2 85 ED C7 34 08 36 98 17 FE 4E 26
       data hash MD5: 16K
       CF 8A 57 FF 77 4E 4F FE 2F 7C 1F B7 FF C4 67 6E>)
$$ ##END=
$$ 
$$ hash MD5
$$ 19 66 E6 9E 85 57 82 E2 30 3F 3C F7 53 77 9F 0F
##$RELAX= 
##$RELAX= 
##$RELAX= 
##$RELAX= 
##$RELAX= 
##$RELAX= 
$$ Bruker specific parameters
$$ --------------------------
##$DU= <F:/spectra>
##$EXPNO= 1
##$NAME= <H-F>
##$PROCNO= 1
##$TYPE= <nmr>
##$USER= <she>
##$AMP= (0..31)
100 100 100 100 100 100 100 100 100 100 100 100 100 100 100 100 100 100 
100 100 100 100 100 100 100 100 100 100 100 100 100 100 
##$AQSEQ= 0
##$AQ_mod= 1
##$AUNM= <au_zg>
##$AUTOPOS= <>
##$BF1= 200.13
##$BF2= 200.13
##$BF3= 200.13
##$BF4= 200.13
##$BF5= 200.13
##$BF6= 200.13
##$BF7= 200.13
##$BF8= 200.13
##$BYTORDA= 1
##$CFDGTYP= 0
##$CFRGTYP= 5
##$CHEMSTR= <none>
##$CNST= (0..31)
1 1 145 1 1 1 1 1 1 1 1 1 1 1 1 1 1 1 1 1 1 1 1 1 1 1 1 1 1 1 1 1 
##$CPDPRG= <>
##$CPDPRG1= <>
##$CPDPRG2= <>
##$CPDPRG3= <>
##$CPDPRG4= <mlev>
##$CPDPRG5= <mlev>
##$CPDPRG6= <mlev>
##$CPDPRG7= <mlev>
##$CPDPRG8= <mlev>
##$CPDPRGB= <>
##$CPDPRGT= <>
##$D= (0..31)
0 1.2 0 0 0 0 0 0 0 0.06 0 0.03 0 0 0 0 0.0002 0 0 0 0 0 0 0 0 0 0 0 0 
0 0 0 
##$DATE= 1675939624
##$DBL= (0..7)
120 120 120 120 120 120 120 120 
##$DBP= (0..7)
150 150 150 150 150 150 150 150 
##$DBP07= 0
##$DBPNAM0= <>
##$DBPNAM1= <>
##$DBPNAM2= <>
##$DBPNAM3= <>
##$DBPNAM4= <>
##$DBPNAM5= <>
##$DBPNAM6= <>
##$DBPNAM7= <>
##$DBPOAL= (0..7)
0.5 0.5 0.5 0.5 0.5 0.5 0.5 0.5 
##$DBPOFFS= (0..7)
0 0 0 0 0 0 0 0 
##$DE= 6
##$DECBNUC= <off>
##$DECIM= 32
##$DECNUC= <off>
##$DECSTAT= 4
##$DIGMOD= 1
##$DIGTYP= 9
##$DL= (0..7)
0 120 120 120 120 120 120 120 
##$DP= (0..7)
150 150 150 150 150 150 150 150 
##$DP07= 0
##$DPNAME0= <>
##$DPNAME1= <>
##$DPNAME2= <>
##$DPNAME3= <>
##$DPNAME4= <>
##$DPNAME5= <>
##$DPNAME6= <>
##$DPNAME7= <>
##$DPOAL= (0..7)
0.5 0.5 0.5 0.5 0.5 0.5 0.5 0.5 
##$DPOFFS= (0..7)
0 0 0 0 0 0 0 0 
##$DQDMODE= 0
##$DR= 18
##$DS= 0
##$DSLIST= <SSSSSSSSSSSSSSS>
$$ [...]
##$SUBNAM2= <"">
##$SUBNAM3= <"">
##$SUBNAM4= <"">
##$SUBNAM5= <"">
##$SUBNAM6= <"">
##$SUBNAM7= <"">
##$SUBNAM8= <"">
##$SUBNAM9= <"">
##$SW= 18.05172834244
##$SWIBOX= (0..15)
0 0 2 0 0 0 0 0 0 0 0 0 0 0 0 0 
##$SW_h= 3612.71676300578
##$TD= 16384
##$TD0= 1
##$TE= 0
##$TE2= 300
##$TE3= 300
##$TEG= 300
##$TL= (0..7)
0 120 120 120 120 120 120 120 
##$TP= (0..7)
150 150 150 150 150 150 150 150 
##$TP07= 0
##$TPNAME0= <>
##$TPNAME1= <>
##$TPNAME2= <>
##$TPNAME3= <>
##$TPNAME4= <>
##$TPNAME5= <>
##$TPNAME6= <>
##$TPNAME7= <>
##$TPOAL= (0..7)
0.5 0.5 0.5 0.5 0.5 0.5 0.5 0.5 
##$TPOFFS= (0..7)
0 0 0 0 0 0 0 0 
##$TUNHIN= 0
##$TUNHOUT= 0
##$TUNXOUT= 0
##$USERA1= <user>
##$USERA2= <user>
##$USERA3= <user>
##$USERA4= <user>
##$USERA5= <user>
##$V9= 5
##$VALIST= <valist>
##$VCLIST= <CCCCCCCCCCCCCCC>
##$VD= 0
##$VDLIST= <DDDDDDDDDDDDDDD>
##$VPLIST= <PPPPPPPPPPPPPPP>
##$VTLIST= <TTTTTTTTTTTTTTT>
##$WBST= 1024
##$WBSW= 4
##$XGAIN= (0..3)
0 0 0 0 
##$XL= 0
##$YL= 0
##$YMAX_a= 528591
##$YMIN_a= -462303
##$ZGOPTNS= <>
##$ZL1= 120
##$ZL2= 120
##$ZL3= 120
##$ZL4= 120
##$ABSF1= 10
##$ABSF2= 0
##$ABSG= 5
##$ABSL= 3
##$ALPHA= 0
##$AQORDER= 0
##$ASSFAC= 0
##$ASSFACI= 0
##$ASSFACX= 0
##$ASSWID= 0
##$AUNMP= <proc_1d>
##$AZFE= 0.1
##$AZFW= 0.1
##$BCFW= 1
##$BC_mod= 2
##$BYTORDP= 1
##$COROFFS= 0
##$CY= 11.3945322036743
##$DATMOD= 1
##$DC= 2
##$DFILT= <>
##$DTYPP= 0
##$F1P= 2.36226072786647
##$F2P= -0.459571619588291
##$FCOR= 0.5
##$FTSIZE= 0
##$FT_mod= 4
##$GAMMA= 1
##$GB= 0.15
##$INTBC= 1
##$INTSCL= 1
##$ISEN= 128
##$LB= 0.24
##$LEV0= 0
##$LPBIN= 0
##$MAXI= 10000
##$MC2= 0
##$MEAN= 0
##$ME_mod= 0
##$MI= 1.114404
##$NCOEF= 0
##$NC_proc= 0
##$NLEV= 6
##$NOISF1= 3.799351
##$NOISF2= 2.8
##$NSP= 1
##$NTH_PI= 0
##$NZP= 0
##$OFFSET= 15.70392
##$PC= 1
##$PHC0= -19110.1
##$PHC1= 5.800783
##$PH_mod= 1
##$PKNL= yes
##$PPARMOD= 0
##$PSCAL= 0
##$PSIGN= 0
##$REVERSE= no
##$SF= 200.130013532006
##$SI= 16384
##$SIGF1= 3
##$SIGF2= 2
##$SINO= 400
##$SIOLD= 16384
##$SREGLST= <1H.CDCl3>
##$SSB= 0
##$STSI= 0
##$STSR= 0
##$SW_p= 3612.71676300578
##$SYMM= 0
##$S_DEV= 0
##$TDeff= 0
##$TDoff= 0
##$TI= <>
##$TILT= no
##$TM1= 0
##$TM2= 0
##$TOPLEV= 0
##$USERP1= <user>
##$USERP2= <user>
##$USERP3= <user>
##$USERP4= <user>
##$USERP5= <user>
##$WDW= 1
##$XDIM= 8192
##$YMAX_p= 0
##$YMIN_p= 0
$$ End of Bruker specific parameters
$$ ---------------------------------
##NTUPLES= NMR FID
##VAR_NAME=  TIME,          FID/REAL,        FID/IMAG
##SYMBOL=    X,             R,               I
##VAR_TYPE=  INDEPENDENT,   DEPENDENT,       DEPENDENT
##VAR_FORM=  AFFN,          ASDF,            ASDF
##VAR_DIM=   8192,          8192,            8192
##UNITS=     SECONDS,       ARBITRARY UNITS, ARBITRARY UNITS
##FACTOR=    0.0002768,     1,               1
##FIRST=     0,             0,               0
##LAST=      2.2672688,     0,               0
##MIN=       0,             -462303,         0
##MAX=       2.2672688,     528591,          0
$$ Real data points
##PAGE= N=1
##DATA TABLE= (X++(R..R)), XYDATA
$$ plain form
0 0 0 0 0 0 0 0 0 0 -8 0 -8 8 -16 16 -19 24 -32 40 -48 56 -64 80 -96 112 -129 153 -177 208 -240 273 -313 357
32 357 -406 460 -519 584 -656 735 -823 917 -1021 1135 -1260 1396 -1540 1707 -1880 2075
48 2075 -2285 2520 -2775 3056 -3370 3717 -4108 4548 -5049 5624 -6293 7079 -8026 9185
62 9185 -10646 12552 -15161 18955 -25026 36323 -64710 299213 426695 135168 423069
73 423069 373366 54541 -59713 258109 287705 26916 -2295 218082 89280 -229045 -312283
84 -312283 -196269 -298658 -462303 -337343 -99824 -92906 -78999 77495 165468 76225 30591
95 30591 85807 56581 -29597 66575 186586 151596 149068 268504 268084 73017 -48869 3655
107 3655 -86580 -321070 -312635 -116203 -107458 -220452 -116444 111455 56343 -151706 -81498
$$ packed form
0@%%%%%%%%qQqJ6k4L2l5M3n6P2q8J04j20J44j76K08k41K82l30L85m48N13n86O70
32C57p63Q66r79J103j240J391j558J740j938K156k395K656k936L247l587L955
48B075m360M805n295N831o426P087p825Q656r597J0673j1917J3372j5105J7211
62I185j9831K3198k7713L4116m3981O1349j01033L63923J27482k91527K87901
73D23069m9703l18825j14254L17822K9596k60789k9211K20377j28802l18325q3238
84c12283J16014j02389j63645J24960K37519O918J3907J56494Q7973q9243m5634
95C0591N5216k9226q6178R6172J20011l4990k528J19436m20j95067j21886N2524
107C655r0235k34490Q435J96432Q745j12994J04008K27899n5112k08049P0208
$$ plain form
118 -81498 82663 -22609 -159796 -2122 231875 201441 107612 255203 377853 213091
128 213091 28227 38794 55818 -92393 -222998 -142654 -49976 -110807 -158722 -109616 -85974
139 -85974 -163095 -257856 -260144 -224275 -218185 -188620 -113844 -2242 103846 129375 126681 161110
151 161110 173353 115390 36385 43493 106326 86584 45380 98946 155453 104849 -1258 -40354
163 -40354 -38590 -126468 -228853 -207271 -137198 -116082 -113323 -57297 28729 38912 -8815 -19984
175 -19984 -5791 468 -19097 -30885 36853 118551 119605 88006 103613 137506 69099 -69738
187 -69738 -89470 -33221 -86575 -175950 -121749 9734 -2017 -107811 -56542 55697 -23365
198 -23365 -151286 -88182 40009 5259 -68910 56058 208536 146229 59756 133569 185561
$$ packed form
118h1498J64161j05272j37187J57674K33997l0434r3829J47591J22650j64762
128B13091j84864J0567J7024j48211j30605Q0344R2678o0831m7915M9106K3642
139h5974p7121r4761k288L5869O090K9565P4776J11602J06088K5529k694L4429
151A61110J2243n7963p9005P108O2833j9742m1204N3566N6507n0604j06107l9096
163d0354J764q7878j02385K1582P0073K1116K759N6026Q6026J0183m7727j1169
175a9984J4193O259j9565j1788O7738Q1698J054l1599J5607L3893o8407j38837
187f9738j9732N6249n3354q9375N4201J31483j1751j05794N1269J12239p9062
198b3365j27921O3104J28191l4750p4169J24968J52478o2307q6473P3813N1992
$$ plain form
209 185561 65381 -48677 8926 57822 -37574 -75481 14123 36923 -43701 -78219 -45803
220 -45803 -78702 -164325 -156069 -109986 -130313 -112821 -22579 18586 -2056 28137 98625 63777
232 63777 -22107 27372 101532 30992 -24012 82606 166457 65778 -16194 89163 118440
243 118440 -63127 -142374 -18514 4081 -146916 -164279 15625 47282 -106723 -95226 60820
254 60820 35741 -116333 -94126 56554 39904 -74774 -300 140401 94513 -2605 44663
265 44663 109016 24494 -71866 -23339 15646 -56001 -75421 -10747 76 -47024 -46046 -9881
277 -9881 -42872 -88355 -43075 -12521 -52840 -32456 57328 77713 25478 48031 133776 97564
289 97564 -4197 33580 111848 47540 -39277 23864 110372 28565 -69858 2982 57114 -56320
$$ packed form
209A85561j20180j14058N7603M8896r5396l7907Q9604K2800q0624l4518L2416
220d5803l2899q5623Q256M6083k0327J7492R0242M1165k0642L0193P0488l4848
232F3777q5884M9479P4160p0540n5004J06618Q3851j00679q1972J05357K9277
243A18440j81567p9247J23860K2595j50997j7363J79904L1657j54005J1497J56046
254F0820k5079j52074K2207J50680j6650j14678P4474J40701m5888r7118M7268
265D4663O4353q4522r6360M8527L8985p1647j9420O4674J0823m7100R78L6165
277i881l2991m5483M5280L0554m0319K0384Q9784K0385n2235K2553Q5745l6212
289I7564j01761L7777P8268o4308q6817O3141Q6508q1807r8423P2840N4132j13434
$$ plain form
301 -56320 -137788 -59588 -837 -85683 -132765 -21809 40382 -36655 -60212 26485 62067 -6722
313 -6722 -32228 46156 77392 25841 25015 79086 91977 53886 29268 43938 39324 2495 -15980
326 -15980 -17929 -12202 -6406 -22311 -29774 -9686 1210 -15851 -38085 -18609 16212 -2431 -21763
339 -21763 19698 58857 43637 15869 40226 74413 38751 -4309 16983 38221 9865 -24335
351 -24335 -13366 14850 -7397 -44660 -38649 -20563 -27001 -51873 -57124 -19181 2074 -18293 -20504
364 -20504 18175 52125 28874 -1368 41478 83550 42925 8090 51997 95513 48017 -10107
376 -10107 34326 73934 699 -56807 -7503 30086 -35169 -85726 -19550 23374 -48301 -79630
388 -79630 -9707 17983 -40926 -58236 14574 41341 -11094 -4710 57514 56870 15418 20422 51602
$$ packed form
301e6320q1468P8200N8751q4846m7082J10956O2191p7037k3557Q6697L5582o8789
313f722k5506P8384L1236n1551q26N4071J2891l8091k4618J4670m614l6829j8475
326a5980j949N727N796j5905p463K0088J0896j7061k2234J9476L4821j8643j9332
339b1763M1461L9159j5220k7768K4357L4187l5662m3060K1292K1238k8356l4200
351b4335J0969K8216k2247l7263O011J8086o438k4872n251L7943K1255k0367k211
364b0504L8679L3950k3251l0242M2846M2072m0625l4835M3907M3516m7496n8124
376a0107M4433L9608p3235n7506M9304L7589o5255n0557O6176M2924p1675l1329
388g9630O9923K7690n8909j7310P2810K6767n2435O384O2224o44m1452N004L1180
$$ plain form
401 51602 33888 -1126 17053 30528 -1967 -5583 18925 951 -34006 -21284 3929 -35269
413 -35269 -70767 -16392 16992 -38116 -46240 32798 56600 -15363 -25877 64145 67227 -29015
425 -29015 -18542 78560 65464 -27993 -9651 85510 47929 -63402 -35220 42647 -17033 -107503
437 -107503 -61388 17021 -33910 -100758 -33316 28306 -33402 -75032 -15842 22145 -27051 -45138
449 -45138 22898 48755 8285 19349 64369 52595 15531 21903 37469 959 -24137 8597
461 8597 8717 -35204 -25168 13139 -11989 -64233 -45609 -3892 -48677 -96456 -38591 13742 -30256
474 -30256 -54677 17163 63903 95 -35976 35862 58065 -20323 -40303 34073 54556 -15039
486 -15039 -28627 42391 39771 -40492 -51929 -5363 -16424 -74535 -72319 -14037 -9201 -42710 -22854
$$ packed form
401E1602j7714l5014J8179J3475l2495l616K4508j7974l4957J2722K5213l9198
413c5269l5498N4375L3384n5108q124P9038K3802p1963j0514R0022L082r6242
425b9015J0473R7102j3096r3457J8342R5161l7581j11331K8182P7867n9680r0470
437a07503M6115P8409n0931o6848O7442O1622o1708m1630N9190L7987m9196j8087
449d5138O8036K5857m0470J1064M5020j1774l7064O372J5566l6510k5096L2734
461H597J20m3921J0036L8307k5128n2244J8624M1717m4785m7779N7865N2333m3998
474c0256k4421P1840M6740o3808l6071P1838K2203p8388j9980P4376K0483o9595
486a5039j3588P1018k620q0263j1437M6566j1061n8111K216N8282M836l3509J9856
$$ plain form
499 -22854 17524 14366 -9800 -7483 15109 14665 4318 17759 33500 42290 50091 42586 33357 32440
513 32440 23223 -1768 -27905 -23118 -10211 -31944 -45233 -18479 -2101 -23367 -43927 -26872
525 -26872 -9468 -37055 -53084 -17758 11036 4765 3256 35104 63666 45521 23264 34101
537 34101 40217 21522 -267 2382 25942 24492 1551 1892 18019 12495 -24275 -45440 -22218
550 -22218 -14451 -46754 -48095 -2066 25768 1509 -9599 37260 53483 1890 -15711 28259
562 28259 41524 -2041 -10870 45368 58337 3593 -5284 31840 17100 -40991 -53165 -18085
574 -18085 -23580 -60936 -42280 258 -5585 -23939 -8943 10072 -5604 -21312 -295 10081
586 10081 -596 19348 47396 41225 33344 52228 56619 16022 -7273 20398 13064 -36805 -32003
$$ packed form
499b2854M0378l158k4166K317K2592m44j0347J3441J5741Q790P801p505r229r17
513C2440r217k4991k6137M787J2907k1733j3289K6754J6378k1266k0560J7055
525b6872J7404k7587j6029L5326K8794o271j509L1848K8562j8145k2257J0837
537C4101O116j8695k1789K649K3560j450k2941L41J6127n524l6770k1165K3222
550b2218P767l2303j341M6029K7834k4259j1108M6859J6223n1593j7601M3970
562B8259J3265m3565q829N6238J2969n4744q877L7124j4740n8091j2174L5080
574a8085n495l7356J8656M2538n843j8354J4996J9015j5676j5708K1017J0376
586A0081j0677J9944K8048o171p881J8884M391m0597k3295K7671p334m9869M802
$$ plain form
599 -32003 16181 10087 -39828 -30535 21783 -5842 -73694 -50170 6113 -23958 -71007 -21291
611 -21291 49658 17536 -28541 27285 72268 13464 -31433 16017 48712 -5605 -32626 29189
623 29189 52633 -1560 -15840 25071 21926 -33467 -44804 -6715 -13845 -45620 -21402 15009
635 15009 5715 -4489 18888 29156 1526 -5306 21671 12950 -10736 14396 45136 26747 5581
648 5581 32347 49806 945 -32167 3039 9411 -42348 -51555 2557 17846 -31710 -33767 25295
661 25295 19713 -40762 -34946 17005 10356 -34712 -13479 48418 40537 1091 23158 59557 34800
674 34800 -8427 632 28398 6196 -21775 1124 23407 8177 -7217 747 6318 -12263 -26926
687 -26926 -21683 -21264 -21148 -10850 -5637 726 12735 18967 11791 1491 7461 12518 -6222 -13331
$$ packed form
599c2003M8184o094m9915R293N2318k7625o7852K3524N6283l0071m7049M9716
611b1291P0949l2122m6077N5826M4983n8804m4897M7450L2695n4317k7021O1815
623B9189K3444n4193j4280M0911l145n5393j1337L8089p130l1775K4218L6411
635A5009r294j0204K3377J0268k7630o832K6977q721k3686K5132L0740j8389k1166
648E581K6766J7459m8861l3112L5206O372n1759r207N4112J5289m9556k057N9062
661B5295n582o0475N816N1951o649m5068K1233O1897p881l9446K2067L6399k4757
674C4800m3227R059K7766k2202k7971K2899K2283j5230j5394P964N571j8581j4663
687b6926N243M19J16J0298N213O363J2009O232p176j0300N970N057j8740p109
$$ plain form
701 -13331 7338 17879 5434 -1363 16957 24385 -5540 -21786 -5729 -5539 -27468 -33118 -9611
714 -9611 6515 -6505 -9713 11105 16943 1073 -11049 -3870 9387 384 -9925 5823 23822
727 23822 20812 5012 4352 19172 7501 -23716 -25309 -6600 -8660 -31297 -28841 5431 6318 -25646
741 -25646 -21927 6044 -1264 -33383 -28638 8151 7621 -18171 810 35438 27072 1862 8947
754 8947 29539 12764 -15110 -2247 14511 -36 -8729 4906 12596 -1414 -10875 -2695 -10677
767 -10677 -26481 -18330 -11312 -21027 -17869 3034 8884 -8206 -4791 20564 8935 -21451 -7722
780 -7722 19839 3830 -23121 1123 36608 9473 -24661 6474 30032 -11923 -42031 -6154
792 -6154 19344 -21172 -39775 11414 30189 -13062 -22419 19967 27756 -16900 -22809 22105 23069
$$ packed form
701a3331K0669J0541j2445o797J8320P428k9925j6246J6057J90k1929n650K3507
714i611J6126j3020l208K0818N838j5870j2122P179J3257r003j0309J5748J7999
727B3822l010j5800o60J4820j1671l1217j593J8709k060k2637K456L4272Q87l1964
741b5646L719K7971p308l2119M745L6789n30k5792J8981L4628q366k5210P085
754H947K0592j6775k7874J2863J6758j4547q693J3635P690j4010r461Q180p982
767a0677j5804Q151P018r715L158K0903N850j7090L415K5355j1629l0386J3729
780g722K7561j6009k6951K4244L5485k7135l4134L1135K3558m1955l0108L5877
792f154K5498m0516j8603N1189J8775m3251r357M2386P789m4656n909M4914R64
$$ plain form
805 23069 -13391 -2745 33990 26909 -3988 3186 26008 5223 -20981 -5509 4671 -14603
817 -14603 -19302 -1124 1239 -16733 -13810 3594 -10951 -28944 -10317 2530 -15703 -21417 8572
830 8572 22653 -4870 -8048 28350 25951 -11914 -8543 25920 19639 -18215 -6288 34348 18244
843 18244 -19099 -1064 28457 5619 -29410 -11221 18829 -4751 -30192 -1772 21532 591
855 591 -17105 4216 20522 -3477 -17427 3571 10925 -4836 -7388 6461 11802 1135 -1610
868 -1610 5521 712 -5845 -3561 -6023 -8042 -3721 402 -1609 -5254 3876 10276 -2979 -6714 7105
883 7105 9011 -3182 -5130 12070 18079 962 186 18251 15929 -1659 -4312 8370 9075 -8172
897 -8172 -9739 5840 6190 -6022 -8584 1033 5536 -7737 -14498 -2970 2198 -5179 -11139 -2281
$$ packed form
805B3069l6460J0646L6735p081l0897P174K2822k0785k6204J5472J0180j9274
817a4603m699J8178K363j7972K923J7404j4545j7993J8627J2847j8233n714K9989
830H572J4081k7523l178L6398k399l7865L371L4463o281l7854J1927M0636j6104
843A8244l7343J8035K9521k2838l5029J8189L0050k3580k5441K8420K3304k0941
855E91j7696K1321J6306k3999j3950K0998P354j5761k552J3849N341j0667k745
868a610P131m809o557K284k462k019M321M123k011l645R130O400j3255l735J3819
883G105J906j2193j948J7200O009j7117p76J8065k322j7588k653J2682P05j7247
897h172j567J5579L50j2212k562R617M503j3273o761J1528N168p377n960Q858
$$ plain form
911 -2281 11110 3956 -7427 2346 14158 5846 -7872 -2020 15702 7194 -9855 1820 18182
924 18182 8034 -8761 -961 16079 3627 -15744 -2597 11683 -1360 -13179 -1404 11738
936 11738 -353 -12061 1186 7712 -5526 -8820 255 2558 -4858 -4809 4414 608 -4919 3475
950 3475 3497 -6322 -4274 5213 1219 -11144 -3317 13387 542 -14207 3997 17058 -2360 -15977
964 -15977 5159 19874 -6641 -18969 12249 20973 -9147 -15106 15743 21551 -12635 -16198 18504
977 18504 15173 -18474 -13083 17163 10829 -18800 -10635 17555 4095 -21437 -7021 11124 -4093
990 -4093 -20026 -5940 9068 -7190 -15509 3234 6117 -8552 -6356 6450 3127 -8606 344
1003 344 13013 720 -5603 13263 16598 -1493 -2019 17056 14867 -9492 -4792 19734 7746
$$ packed form
911b281J3391p154j1383R773J1812q312j3718N852J7722q508j7049J1675J6362
924A8182j0148j6795P800J7040j2452j9371J3147J4280j3043j1819J1775J3142
936A1738j2091j1708J3247O526j3238l294R075K303p416M9R223l806n527Q394
950C475K2r819K048R487l994j2363P827J6704j2845j4749J8204J3061j9418j3617
964a5977K1136J4715k6515j2328L1218Q724l0120n959L0849N808l4186l563L4702
977A8504l331l3647N391L0246o334k9629Q165K8190j3460k5532J4416J8145j5217
990d093j5933J4086J5008j6258q319J8743K883j4669K196J2806l323j1733Q950
1003C44J2669j2293o323J8866L335j8091n26J9075k189k4359M700K4526j1988
$$ plain form
1016 7746 -16045 -2957 18750 3517 -21513 -5000 17029 -6516 -27473 -3799 12606 -9708
1028 -9708 -23946 386 16401 -8759 -18483 6713 13499 -8488 -13408 7087 12511 -6441 -7501
1041 -7501 11666 10086 -4084 -2247 6545 3742 -6228 -4042 3012 -2123 -3987 2105 707 -1708
1055 -1708 1608 3753 -501 -4366 3168 6201 -3742 -2544 9085 8102 -1504 -1519 9598 7451 -8305
1070 -8305 -6650 5233 -386 -12655 -9194 2155 -236 -13433 -9404 1987 -3853 -13303 -10222 -911
1084 -911 -357 -8438 -5544 6843 7707 1350 428 8398 11843 2236 -2279 7459 11042 2946 -1672 5160
1100 5160 12401 1849 -8489 620 5222 -6247 -14653 -5655 3692 -6738 -13655 -18 6193 -5425
1114 -5425 -9306 85 4933 -4730 -8183 3990 6107 -1326 510 6628 6079 108 -69 3314 -2372
$$ packed form
1016G746k3791J3088K1707j5233k5030J6513K2029k3545k0957K3674J6405k2314
1028i708j4238K4332J6015k5160r724K5196O786k1987m920K0495N424j8952j060
1041g501J9167j580j4170J837Q792k803r970K186P054n135j864O092j398k415
1055a708L316K145m254l865P534L033r943J198J1629r83r606j5J1117k147j5756
1070h305J655J1883n619j2269L461J1349k391j3197M029J1391n840r450L081R311
1084i11N54q081K894J2387Q64o357r22P970L445r607m515R738L583q096m618O832
1100E160P241j0552j0338R109M602j1469q406Q998R347j0430o917J3637O211j1618
1114e425l881R391M848r663l453J2173K117p433J836O118n49n971j77L383n686
$$ plain form
1129 -2372 -5206 1211 -898 -6289 -862 5070 -283 -6797 1328 8609 -4879 -10282 6153 10390
1143 10390 -3663 -4661 13912 17909 -3229 -4381 17159 12560 -11111 -7762 12966 7563 -15361
1156 -15361 -8553 14670 2503 -19096 -7179 8947 -4590 -21638 -8378 9338 -4875 -14752
1168 -14752 3540 13128 100 -5582 8344 13328 -1585 -2586 12144 9141 -1234 5373 13251
1181 13251 5421 -2671 5064 7820 -7181 -9090 3904 -17 -12625 -6461 7224 1523 -13420
1194 -13420 -3096 12357 -2174 -15274 1222 13510 -1644 -11818 8175 20012 -2007 -9386
1206 -9386 11401 13696 -7827 -13017 6025 8418 -12271 -12028 7884 5020 -11563 -9065 5318
1219 5318 2081 -12980 -7359 6759 1230 -5747 2775 10536 6206 1558 6892 9249 1838 1685 5550
$$ packed form
1129b372k834O417k109n391N427N932n353o514Q125P281j3488n403J6435M237
1143A0390j4053r98J8573L997k1138j152K1540m599k3671L349K0728n403k2924
1156a5361O808K3223j2167k1599J1917J6126j3537j7048J3260J7716j4213r877
1168a4752J8292R588j3028n682J3926M984j4913j001J4730l003j0375O607P878
1181A3251p830q092P735K756j5001j909J2994l921j2608O164J3685n701j4943
1194a3420J0324J5453j4531j3100J6496J2288j5154j0174J9993J1837k2019p379
1206i386K0787K295k1523n190J9042K393k0689K43J9912k864j6583K498J4383
1219E318l237j5061N621J4118n529o977Q522P761m330m648N334K357p411j53L865
$$ plain form
1234 5550 2076 -456 3080 3840 -831 -3918 807 -233 -10600 -9711 -2210 -5513 -12055 -8191 2517
1249 2517 90 -8695 -1938 8259 956 -5806 731 8672 4237 -3421 4753 12513 5653 -471 3560
1264 3560 7760 2708 -6463 -3171 2560 -2290 -6973 -3908 1478 983 -5828 -5509 1319 -252 -5420
1279 -5420 -5080 1517 5386 -782 -1713 7414 8709 681 -1310 4708 6135 -3468 -5818 3206 3132 -4639
1295 -4639 -4442 1463 1911 -5484 -6874 -381 -1958 -6914 -3708 710 381 -323 2649 5164 2213 2260
1311 2260 5809 2196 -570 4254 5147 300 -1507 5252 6193 -4685 -5244 4271 66 -11342 -8924
1326 -8924 2488 31 -12844 -6355 8666 978 -11291 -1807 10218 953 -10970 782 13726
1339 13726 1297 -7364 6459 13665 629 -6832 4333 9435 -5681 -9924 3507 3651 -7570
$$ packed form
1234E550l474k532L536P60m671l087M725j040j0367Q89P501l303o542L864J0708
1249B517k427q785O757J0197p303o762O537P941m435p658Q174P760o860o124M031
1264C560M200n052r171L292N731m850m683L065N386m95o811L19O828j571n168
1279e420L40O597L869o168r31R127J295q028j991O018J427r603k350R024p4p771
1295d639J97N905M48p395j390O493j577m956L206M418l29p04K972K515k951M7
1311B260L549l613k766M824Q93m847j807O759R41j0878n59R515m205j1408K418
1326h924J1412k457j2875O489J5021p688j2269R484J2025r265j1923J1752J2944
1339A3726j2429q661J3823P206j3036p461J1165N102j5116m243J3431J44j1221
$$ plain form
1352 -7570 -7032 3316 2066 -8516 -4566 4166 -2340 -7455 697 4375 -1761 -2116 6816 7581 -1845
1367 -1845 814 9289 2501 -5881 160 7511 -965 -9500 1065 8218 -5980 -11343 2173 4494
1381 4494 -9747 -12739 3163 5707 -9722 -7184 9537 7495 -6180 -2231 11989 8264 -5979
1394 -5979 -124 12826 5558 -5061 1836 10441 2994 -6610 -89 5176 -4477 -9156 -2450 -947
1408 -947 -5695 -7049 -1093 -285 -5364 -2204 1547 -1626 -1939 2076 3422 862 1007 7152 7047 381
1424 381 3199 8093 3040 -2935 319 4790 -490 -7204 -985 3679 -3806 -7369 -1653 1964 -4099
1439 -4099 -8567 -1016 3418 -2688 -3622 2810 6102 2036 -699 4278 7260 1797 -271 2625 4086
1454 4086 1601 -2261 -100 2755 -1029 -4507 -3406 -1362 -1923 -6575 -5777 -185 -1272 -4359 -2492
$$ packed form
1352g570N38J0348j250j0582L950Q732o506n115Q152L678o136l55Q932P65r426
1367a845K659Q475o788q382O041P351q476q535J0565P153j4198n363J3516K321
1381D494j4241k992J5902K544j5429K538J6721k042j3675L949J4220l725j4243
1394e979N855J2950p268j0619O897Q605p447r604O521N265r653m679O706J503
1408i47m748j354N956Q08n079L160L751l173l13M015J346k560J45O145j05o666
1424C81K818M894n053n975L254M471n280o714O219M664p485l563N716L617o063
1439d099m468P551M434o106r34O432L292m066k735M977K982n463k068K896J461
1454D086k485l862K161K855l784l478J101K044n61m652P98N592j087l087J867
$$ plain form
1469 -2492 2359 3055 -1234 -169 5424 4156 56 2250 5917 5087 1026 1819 5373 2315 -1361 264
1485 264 24 -2341 -2975 -2544 -2298 -3919 -2840 -793 -3786 -3151 486 -220 -2985 -1620 3361 3474 -2534
1502 -2534 864 7968 3337 -2575 1717 7607 2047 -6242 105 6936 -2167 -8065 195 5051 -3929
1517 -3929 -8921 569 5257 -5814 -7781 3409 5332 -3838 -4036 6555 7268 -2829 -853 8247
1531 8247 4841 -2724 1115 6370 2082 -4327 664 4535 -2741 -4689 254 -128 -5751 -4988 798
1546 798 -1104 -7106 -1901 4139 -1844 -4890 2491 5951 -1164 -3724 5796 7583 -2729 -2417 7718
1561 7718 6137 -4444 -2951 6877 3488 -8604 -4002 5348 -923 -9392 -3709 4667 -950 -8942
1575 -8942 -1259 5969 -2077 -5977 1837 6148 -216 -3029 4691 7069 -518 -331 5630 3920 -1070
$$ packed form
1469b492M851O96m289J065N593j268m100K194L667q30m061P93L554l058l676J625
1485B64k40k365o34M31K46j621J079K047k993O35L637p06k765J365M981J13o008
1502b534L398P104m631n912M292N890n560q289O347O831r103n898Q260M856q980
1517c929m992R490M688j1071j967J1190J923r170j98J0591P13j0097J976R100
1531H247l406p565L839N255m288o409M991L871p276j948M943l82n623P63N786
1546G98j902o002N205O040n983l046P381L460p115k560R520J787j0312L12J0135
1561G718j581j0581J493R828l389j2092M602R350o271q469N683Q376n617p992
1575h942P683P228q046l900P814M311o364k813P720K378p587J87N961j710m990
$$ plain form
1590 -1070 -682 2854 341 -3963 -1014 948 -3678 -4304 -1256 -1257 -4574 -4080 476 -1016 -5360 -819
1606 -819 3395 -285 -2257 1880 5557 918 -1903 3819 5885 -233 -1456 3464 4281 -1349 -3462
1621 -3462 2317 2391 -4107 -4268 255 34 -3286 -4240 192 1081 -2903 -2151 1616 2119 204 -468 2302
1638 2302 3911 967 542 2296 3090 2007 -434 329 2355 -377 -2395 -1723 -48 -1190 -4054 -2763
1654 -2763 80 -1997 -3502 -1208 321 -278 -1739 -125 2241 901 199 2327 2536 2040 1668 2302
1670 2302 2032 590 1207 1519 -1326 -986 1307 -1276 -3176 -1724 811 -1206 -4830 -810 2213 -1819
1686 -1819 -3805 1029 4000 -334 -3109 3029 6056 -931 -2350 4474 4929 -1943 -3323 3778 3781 -4646
1702 -4646 -3774 3120 476 -5687 -4100 1809 -82 -6463 -2470 3215 -870 -3851 703 4247 489
$$ packed form
1590a070L88L536k513m304K949J962m626o26L048jl317M94M556j492m344M541
1606h19M214l680j972M137L677m639k821N722K066o118j223M920Q17n630k113
1621c462N779P4o498j61M523k21l320r54M432Q89l984P52L767N03j915o72K770
1638B302J609k944m25J754P94j083k441P63K026k732k018O72J675j142k864J291
1654b763K843k077j505K294J529n99j461J614K366j340p02K128K09m96l72O34
1670B302k70j442O17L12k845L40K293k583j900J452K535k017l624M020L023m032
1686a819j986M834K971m334k775O138L027o987j419O824M55o872j380P101Lq427
1702d646Q72O894k644o163J587N909j891o381L993N685m085k981M554L544l758
$$ plain form
1717 489 -1864 3489 4617 -855 23 4701 2515 -1410 885 3572 156 -3960 267 2313 -3730
1732 -3730 -4979 622 1392 -4377 -4186 2355 1861 -5197 -2139 5247 1905 -4000 -57 6939 2479 -4022
1748 -4022 2259 7299 608 -3833 2048 5098 -1618 -5309 1389 3239 -4203 -4959 649 1403 -4115
1763 -4115 -4413 1314 978 -4235 -1453 3258 990 -1213 1303 4355 1771 -11 3153 3865 -260 602
1779 602 3048 1435 -1146 -208 2296 -440 -3877 -395 1299 -2685 -4240 -880 1294 -2777 -3678 1646
1795 1646 2065 -2565 -1507 2858 2613 -1391 -381 4030 2859 -1232 410 3230 1753 -1257 -965 1906
1811 1906 530 -3250 -1496 306 -1073 -2397 -1928 -282 -219 -2006 -903 76 176 122 -325 1133 2107
1828 2107 957 741 1515 1825 1187 -202 712 1621 -325 -981 -300 -298 -602 -1847 -1692 -638 -1901 -2073
$$ packed form
1717D89k353N353J128n472Q78M678k186l925K295K687l416m116M227K046o043
1732c730j249N601P70n769J91O541m94p058L058P386l342n905L943O996m460o501
1748d022O281N040o691m441N881L050o716l691O698J850p442p56N608P54n518
1763d115k98N727l36n213K782M711k268k203K516L052k584j782L164P12m125Q62
1779F02K446j613k581R38K504k736l437L482J694l984j555L360K174m071r01N324
1795A646M19m630J058M365k45m004J010M411j171m091J642K820j477l010K92K871
1811A906j376l780J754J802j379j324M69J646O3j787J103R79J00n4m47J458R74
1828B107j150k16P74L10o38j389R14R09j946o56O81Kl04j245J55J054j263j72
$$ plain form
1846 -2073 -737 -1176 -830 -360 5 284 432 1432 1325 161 1487 3132 516 -111 1467 2295 284
1863 284 -1580 1264 1887 -1882 -2668 351 481 -2946 -3974 657 1018 -3791 -2565 2231 1520 -2470
1879 -2470 -1203 3740 2012 -2893 700 4515 1823 -1625 1212 4086 718 -2722 461 2863 -1614
1894 -1614 -3129 265 851 -2574 -2857 654 383 -3315 -962 1710 -454 -1620 1011 3313 582 -941
1910 -941 3199 3585 -801 108 3417 2035 -2322 -1353 3420 65 -4865 -1409 2586 -2057 -5418 -1588
1926 -1588 1740 -2721 -5413 383 2846 -2358 -2927 2525 3786 -805 -1317 4441 4221 -1049 272 4608
1942 4608 2840 -1277 -101 3349 527 -3127 -346 1105 -2055 -3300 -1235 -56 -2293 -3095 417
1957 417 -148 -2467 -663 1437 229 -1221 830 2919 386 -1245 2543 2912 -470 -863 1692 1747
$$ packed form
1846b073J336m39L46M70L65K79J48J000j07j164J326J645k616o27J578Q28k011
1863B84j864K844O23l769p86L019J30l427j028M631L61m809J226M796p11l990
1879b470J267M943j728m905L593L815k692l448K837K874l368l440L183K402m477
1894a614j515L394N86l425k83L511k71l698K353K672k164j166K631K302k731j523
1910i41M140L86m386R09L309j382m357R69M773l355m930L456L995m643l361L830
1926a588L328m461k692N796K463n204n69N452J261m591n12N758k20n270J321M336
1942D608j768m117J176L450k822l654K781J451l160j245K065J179k237q02L512
1957D17n65k319J804K100j208j450K051K089k533j631L788L69l382l93K555N5
$$ plain form
1973 1747 -2021 -2313 1569 209 -3381 -1843 980 -233 -3119 -1540 1567 79 -2192 179 2608
1988 2608 857 -710 979 3193 1297 -141 1632 2411 295 -133 486 1106 31 -1336 -598 -725
2004 -725 -1599 -1701 -1834 -1145 -1073 -1905 -1058 -527 -331 -48 -259 604 1059 854 844 1037 1574 1427 666 942 1338
2025 1338 457 354 606 -271 -299 -432 -951 -677 -935 -192 -654 -1508 26 112 -1243 -333 925 1111 -231
2044 -231 -766 1620 1739 -987 -449 1950 685 -1451 -990 1509 354 -3147 -1187 1221 -860 -3003
2060 -3003 -1065 1415 -334 -2902 544 2213 -506 -1076 1732 2931 511 -586 2568 2776 -318
2075 -318 128 2458 1391 -907 -658 1501 -268 -2511 -562 599 -2195 -2799 -575 -104 -2316 -2262 1034
2092 1034 502 -2473 -428 2264 800 -1493 500 3583 685 -1714 2152 3293 -391 -1304 1561
$$ packed form
1973A747l768k92L882j360l590J538K823j213k886J579L107j488k271K371K429
1988B608j751j567J689K214j896j438J773P79k116m28O19O20j075j367P38j27
2004g25q74j02j33O89P2q32Q47N31J96K83k11Q63M55k05j0J93N37j47p61K76L96
2025A338q81j03K52q77k8j33n19K74k58P43m62q54J534Q6j355R10J258J86j342
2044b31n35K386J19k726N38K399j265k136M61K499j155l501J960K408k081k143
2060c003J938K480j749k568L446J669k719n70K808J199k420j097L154K08l094
2075c18M46K330j067k298K49K159j769k243J949J161k794o04K224M71k212N4L296
2092A034n32k975K045K692j464k293J993L083k898k399L866J141l684r13K865
$$ plain form
2107 1561 2763 -1572 -2468 2142 1428 -2952 -1964 1450 512 -2737 -1585 2322 541 -2467 89 2507
2123 2507 321 -1402 701 2880 238 -1648 1657 1955 -1251 -1026 1042 367 -1908 -1313 621 -695
2139 -695 -2651 -570 402 -1325 -2115 182 1295 -877 -1077 1830 1765 -736 382 2492 1779 -408 428
2156 428 2890 1139 -1514 536 2102 178 -1734 -339 1138 -1177 -2610 -306 466 -1611 -1724 -335
2172 -335 475 -1131 -1451 554 387 -743 -185 478 910 40 -493 952 648 -291 263 32 140 -358 -447
2191 -447 -147 -69 -387 67 -293 -89 386 -68 200 352 327 676 204 411 809 578 625 274 117 471 -73
2212 -73 -336 -167 -385 -477 -1056 -1527 -132 -590 -1733 -859 -296 -289 -1282 -500 592 92 -976 341 1697
2231 1697 796 -274 513 2146 743 -665 1190 1927 188 -920 753 1214 -734 -1563 490 805
$$ packed form
2107A561J202m335q96M610p14m380R88L414r38l249J152L907j781l008K556K418
2123B507k186j723K103K179k642j886L305K98l206K25K068o75k275N95J934j316
2139f95j956K081R72j727p90K297J113k172k00K907o5k501J118K110p13k187Q36
2156D28K462j751k653K050J566j924j912J395J477k315j433K304P72k077j13J389
2172c35Q10j606l20K005j67j130N58O63M32q70n33J445l04r39N54k31J08m98q9
2191d47L00P8l18M54l60K04M75m54K68J52k5L49m72K07L98k31M7l51j57L54n44
2212g3k63J69k18r2n79m71J395m58j143Q74N63Pr93P82J092n00j068J317J356
2231A697r01j070P87J633j403j408J855P37j739j108J673M61j948q29K053L15
$$ plain form
2247 805 -1600 -1284 90 372 -1539 -1290 871 201 -1201 -274 1110 227 -499 511 1781 -133 -1052
2264 -1052 1108 1000 -839 -432 996 511 -1438 -637 1307 -458 -2146 -199 1175 -790 -1592 410
2280 410 1692 -694 -1487 1683 1771 -1082 -328 1966 1861 -1340 -326 2925 866 -1631 81 1810
2296 1810 -116 -2330 -447 1262 -904 -2509 8 617 -1337 -1944 142 965 -1061 -1181 963 562
2312 562 -1385 149 1446 640 -536 525 1780 188 -291 1115 1155 -306 -375 599 726 -1223 -778
2329 -778 1149 -119 -1511 -582 823 -240 -1548 -309 1413 -637 -1434 866 1081 -239 -994 639
2345 639 1474 -651 -729 962 643 -849 -633 655 709 -908 -741 806 34 -764 -97 405 182 -505 38
2364 38 960 -13 101 590 592 279 262 345 662 162 -36 561 -440 -213 -147 -246 -83 -608 -793 -72 -814 -745
$$ packed form
2247H05k405L16J374K82j911K49K161o70j402R27J384q83p26J010J270j914r19
2264a052K160j08j839M07J428m85j949Q01J944j765j688J947J374j965q02K002
2280D10J282k386p93L170Q8k853P54K294j05l201J014L251k059k497J712J729
2296A810j926k214J883J709k166j605K517O09j954o07K086Q23k026j20K144m01
2312E62j947J534J297q06j176J061J255j592m79J406M0j461o9R74J27j949M45
2329g78J927j268j392R29J405j063j308J239J722k050p97K300K15j320p55J633
2345F39Q35k125p8J691l19j492K16J288N4j617J67J547p72p98O67N02k23o87N43
2364C8R22r73J14M89Kl13j7Q3L17n00j98N97j001K27O6r9J63n25j85P21p42O9
$$ plain form
2386 -745 108 -417 -271 -363 -332 277 108 -283 214 536 112 148 108 1188 438 -517 888 613 333 -452 101
2407 101 830 -377 -1041 31 457 -446 -785 -77 438 -540 -889 717 747 -508 -165 700 830 -632 -375
2426 -375 1072 502 -829 -114 667 5 -789 -656 579 -469 -1356 -134 268 -865 -848 -148 441 -860
2444 -860 -852 767 482 -362 513 1489 412 -238 617 1738 42 -459 1098 1084 -302 -523 703 1018 -1334
2463 -1334 -1354 836 62 -1872 -584 516 -240 -1952 -640 1042 -548 -1571 266 1171 -356 -895
2479 -895 413 1516 -319 -625 1207 763 -710 -390 742 666 -1184 -491 900 -384 -1175 73 575
2496 575 -454 -729 293 948 -565 -681 1019 604 -502 221 1262 821 -573 292 1344 -156 -1019
2513 -1019 386 543 -513 -1400 80 648 -964 -1136 579 -111 -918 -642 439 633 -796 -436 876
$$ packed form
2386g45Q53n25J46r2L1O09j69l91M97L22m24L6m0J080p50r55J405k75k80p85N53
2407A01P29j207o64J072M26r03l39P08N15r78l49J606L0j255L43Q65J30j462K57
2426c75J447n70j331P15P81o62p94J33J235j048q87J222M02j133J7P00N89j301
2444h60QJ619k85q44Q75R76j077o50Q55J121j696n01J557j4j386k21J226L15k352
2463a334k0K190p74j934J288J100p56j712J312J682j590j023J837R05j527n39
2479h95J308J103j835l06J832m44j473L20J132p6j850O93J391j284p91J248N02
2496E75j029k75J022O55j513j16J700m15j106P23J041m41j394Q65J052j500q63
2513a019J405J57j056q87J480N68j612j72J715o90q07K76J081J94j429L60J312
$$ plain form
2530 876 394 -369 31 950 597 -378 402 1128 421 -213 180 401 11 -345 -56 240 -465 -617 164 -332
2550 -332 -356 -262 -44 -46 -437 156 611 65 9 128 388 342 42 276 454 -315 -188 369 -192 -54 -447 -321
2572 -321 -41 -672 -387 -297 -255 -476 -221 116 339 -133 -102 645 639 262 447 493 725 409 103 687 173 -610
2594 -610 -396 225 63 -954 -748 -68 -553 -1210 -431 74 -63 -745 -354 544 -263 -673 400 685 174
2613 174 9 320 1010 66 -424 920 472 -160 -157 457 -39 -672 -282 468 -456 -1189 70 162 -491 -773
2633 -773 225 436 -683 -141 959 326 -663 -33 893 763 -716 -262 1047 -207 -956 474 740 -221
2651 -221 -953 -261 584 -862 -1277 288 412 -886 -522 864 486 -744 -395 1000 403 -367 566 965
2669 965 184 -311 614 948 144 -534 656 323 -394 -536 200 595 -877 -438 547 -197 -557 -10 279
$$ packed form
2530H76m82p63M00R19l53r75P80P26p07o34L93K21l90l56K89K96p05j52P81m96
2550c32k4R4K18kl91N93M55n46n6J19K60m6l00K34J78p69J27N57n61J38l93J26
2572c21K80o31K85R0M2k21K55L37K23m72L1P47ol77J85M6K32l16l06N84n14p83
2594f10K14O21j62j017K06O80m85o57P79N05j37o82L91Q98q07m10J073K85n11
2613A74j65L11O90r44m90J344m48o32LO14m96o33L90P50r24p33J259R2o53k82
2633g73R98K11j119N42J100o33r89O30R26j30j479M54J309j254p49J430K66r61
2651b21p32O92Q45j446m15J565J24j298L64J386l78j230L49J395n97p70R33L99
2669I65p81m95R25L34q04o78J190l33p17j42P36L95j472M39R85p44l60N47K89
$$ plain form
2688 279 -262 -877 222 532 -461 -659 445 631 -373 -545 434 755 -632 -218 578 351 -353 -178 403
2707 403 38 -790 -22 552 3 -330 367 359 37 -530 334 383 -229 -181 607 245 -54 -254 153 312 -473
2728 -473 150 344 -167 -138 -178 -207 -158 -683 -135 112 -237 -168 86 58 73 -23 647 213 -236 -102 502 97 131
2751 131 158 434 306 -157 27 320 -232 46 60 -52 60 -388 -58 132 -349 -428 -538 -20 -130 -519 -304
2772 -304 151 91 -305 -51 18 14 -346 59 650 155 -263 94 321 -58 -410 18 334 -234 -322 292 -64 -278
2794 -278 -428 90 211 -493 -232 431 43 -165 394 358 85 -373 301 709 -190 -86 323 301 -414 -388 493
2815 493 355 -343 -132 431 -204 -591 -101 216 -200 -727 -38 410 -327 -614 614 330 -175 -195 625 697
2835 697 90 57 987 477 -197 256 457 236 -501 396 484 -353 -749 103 362 -196 -655 189 343 -720
$$ packed form
2688B79n41o15J099L10r93j98J104J86j004j72R79L21j387M14P96k27p04J75N81
2707D03l65q28P68N74n49l33O97ql22n67Q64M9o12M8P88l62k99k00M07J59p85
2728d73O23J94n11K9m0k9M9n25N48K47l49O9K54k8J5r6O70m34m49J34O04m05L4
2751A31K7K76j28m63J84K93n52K78J4j12J12m48L30J90m81p9j10N18j10l89K15
2772c04M55o0l96K54O9ml60M05N91m95m18L57K27l79l52M28L16n68q8O14l56k14
2794b78j50N18J21p04K61O63l88k08N59l6k73m58O74M08q99J04M09k2p15K6Q81
2815D93j38o98K11N63o35l87M90L17m16n27O89M48p37k87J228k84n05k0Q20P2
2835F97o07l3R30n10o74M53K01k21p37Q97Q8q37l96Q52K59n58m59Q44J54j063
$$ plain form
2855 -720 -413 471 -116 -417 -91 239 93 -465 176 721 -124 -348 601 244 -153 -537 356 453 -482 -283
2875 -283 673 -103 -325 -392 324 197 -853 190 578 -76 -240 308 334 127 -410 268 479 -183 -175 304 287
2896 287 -83 -389 109 103 -529 -393 208 30 -345 -332 66 -69 -252 336 35 112 -53 279 205 -56 -112 350
2918 350 189 -268 -22 387 -50 65 173 272 338 -624 123 59 -380 51 -36 29 51 -184 9 126 142 -221
2940 -221 88 226 127 -9 74 -32 -111 -152 -189 -76 21 -335 -80 -326 -239 -168 -76 68 112 -320 32 172 -106
2963 -106 8 -76 154 -81 28 370 313 -19 390 168 185 248 55 178 297 -432 143 43 -175 -316 -130
2984 -130 -10 -255 -497 -61 95 -299 -182 375 -49 -300 -85 559 -125 -432 708 412 -46 -132 499 419
3004 419 -449 -473 300 123 -164 -331 365 -16 -294 -493 314 -148 -721 78 414 28 -140 11 503 -72
$$ packed form
2855g20L07Q84n87l01L26L30j46n58O41N45q45k24R49l57l97l84Q93R7r35J99
2875b83R56p76k22o7P16j27j050J043L88o54j64N48K6k07n37O78K11o62QM79j7
2896B87l70l06M98oo32J36O01j78l75J3L98j35j83N88l01P7j65L32p4k61n6M62
2918C50j61m57K46M09m37J15J08R9O6r62P47o4m39M31q7O5K2k35J93J17J6l63
2940b21L09J38r9j36Q3j06p9m1l7J13R7l56K55k46Q7P1R2J44M4m32L52J40k78
2963a06J14q4K30k35J09L42n7l32M09k22J7O3j93J23J19p29N75j00k18j41J86
2984a30J20k45k42M36J56l94J17N57m24k51K15O44o84l07J140k96m58q6O31q0
3004D19q68k4P73j77k87j67O96l81k78j99Q07m62n73P99L36l86j68J51M92n75
$$ plain form
3024 -72 -167 260 424 -29 -29 475 422 -176 -274 330 -14 -291 -97 292 -556 -502 -165 184 -363 -344 90 136 -388
3047 -388 18 334 515 -147 -249 523 243 -229 -46 412 151 -189 -168 491 -18 -677 -18 115 -490 -354
3067 -354 195 95 -354 -409 321 291 -253 13 493 184 -32 -114 219 -228 -125 36 212 -373 -197 31 122
3088 122 -80 -597 -111 293 -461 16 102 119 -316 -204 379 256 8 169 420 -78 -320 68 378 -79 -185
3109 -185 -113 285 -241 -158 -251 194 -188 -534 -175 97 -352 -93 299 -33 -86 -24 57 107 -42 -119 67 -9 219
3132 219 -164 269 119 -47 227 100 -98 -175 -214 -174 257 -212 254 263 -244 -282 -68 38 -353 -205 267 485
3154 485 28 208 81 -28 -114 59 25 232 -149 -79 130 -127 -101 149 -7 -245 -470 -146 419 -175 -351
3175 -351 8 86 -226 -250 43 511 -294 31 363 157 -197 -170 281 188 -173 -57 231 -92 -326 -221 277
$$ packed form
3024g2r5M27J64m53%N04n3n98r8O04l44k77J94L89q48N4L37L49n47J9M34M6n24
3047c88M06L16J81o62j02P72k80m72J83M58k61l40K1O59n09o59O59J33o05J36
3067c54N49j00m49n5P30l0n44K66M80l09k16q2L33m47J03J61J76n85J76K28R1
3088A22k02n17M86M04p54M77Q6J7m35J12N83j23k48J61K51m98k42L88L10m57j06
3109a85P2L98n26Q3r3M45l82l46L59K72m49K59L92l32n3O2Q1N0j49p7J86p6K28
3132B19l83M33j50j66K74j27j98p7l9M0M31m69M66Rn07l8K14J06l91J48M72K18
3154D85m57J80j27j09q6J73l4K07l81P0K09k57K6K50j56k38k25L24N65n94j76
3175c51L59P8l12k4K93M68q05L25L32k06l54K7M51r3l61J16K88l23k34J05M98
$$ plain form
3196 277 -192 -350 27 121 -234 -325 241 267 -151 -185 614 264 -48 -77 172 90 -235 186 117 -173 -503 493
3218 493 186 -457 -189 -1 211 -269 -256 442 184 -508 251 329 -3 -284 -155 136 -277 -330 200 534 101
3239 101 -121 34 56 -138 -133 179 -16 -269 -306 35 153 -271 -347 248 8 -202 8 200 -223 -170 207 343
3261 343 55 -142 302 275 -101 -228 5 267 -131 -224 262 140 -145 219 199 -146 -328 -261 90 -243 -222 37
3283 37 -130 -451 41 -57 262 -33 -241 258 65 -262 90 299 329 147 -218 288 148 -328 -162 -2 22
3304 22 148 -177 -28 26 -134 129 -14 -72 82 133 108 136 -112 70 -42 -328 321 217 185 3 -307 -203
3326 -203 -7 -310 -157 292 6 -46 -253 104 -129 -70 63 -330 -45 31 -224 130 111 -144 135 230 -77 -51
3348 -51 80 120 98 -123 139 110 -293 5 298 78 -210 -209 314 57 -94 -225 297 -35 -263 68 260 -180
$$ packed form
3196B77m69j58L77R4l55r1N66K6m18l4P99l50l12k9K49q2l25M21o9k90l30R96
3218D93l07o43K68J88K12m80J3O98k58o92P59P8l32k81J29K91m13n3N30L34m33
3239A01k22J55K2j94NL12j95k53l7L41J18m24p6N95k40k10K10J92m23N3L77J36
3261C43k88j97M44k7l76j27K33K62l98r3M86j22k85L64k0l45j82O7L51l33K1K59
3283C7j67l21M92r8L19k95k08M99j93l27L52K09L0j82l65N06j40m76J66J60K4
3304B2J26l25J49N4j60K63j43n8J54N1k5K8k48J82j12k86O49j04l2j82l10J04
3326b03J96l03J53M49k86n2k07L57k33N9J33l93K85P6k55L54j9k55K79R5l07K6
3348e1J31M0k2k21K62k9m03K98K93k20k88JN23k57j51j31N22l32k28L31J92m40
$$ plain form
3370 -180 -259 237 74 -75 -114 148 -16 -135 -409 333 -83 -192 -31 424 367 -231 -331 548 305 -257 145
3391 145 251 -250 -66 -75 289 23 -421 220 -16 -280 -11 321 -146 141 24 54 134 -204 -82 243 76
3412 76 -121 137 56 -364 -237 390 203 -272 -19 -85 178 -101 -141 407 -85 -219 -137 331 -51 -117 -101 160
3434 160 -137 -158 299 281 48 -107 -7 286 32 -232 284 13 -281 307 33 252 39 -13 343 -183 -118
3455 -118 202 114 -38 -30 2 202 4 -228 250 -20 -13 -57 -148 36 -271 164 -150 250 -261 95 -22 -157 -183
3478 -183 143 285 -18 -40 -204 54 31 82 -226 92 162 -217 152 107 -5 -11 205 301 151 9 282 190 33
3501 33 125 10 -10 -2 50 84 83 -172 122 75 61 -71 -88 41 131 -273 26 -69 -81 235 307 88 -98 -136 172 -59
3527 -59 5 -92 64 145 -71 -52 -17 66 -294 110 -92 -27 -428 217 83 -40 -163 249 112 139 -126 -7 288
$$ packed form
3370a80p9M96j63j49l9K62j64j19k74P42m16j09J61M55n7n98j00Q79k43n62M02
3391A45J06n01J84rL64k66m44O41k36k64K69L32m67K87j17L0Q0l38J22L25j67
3412G6j97K58q1m20J27O27j87m75K53o6K63k79m0N48m92j34Q2M68l82o6J6K61
3434A60k97k1M57j8k33j55J00K93k54k64N16k71k94N88k74K19k13n2L56n26O5
3455a18L20q8j52QL2K00j98k32M78k70Pm4r1J84l07M35l14M00n11L56j17j35k6
3478a83L26J42l03k2j64K58k3N1l08L18P0l79L69m5j12oK16R6j50j42K73r2j57
3501C3R2j15k0QN2L4jk55K94m7j4j32j7J29R0m04K99r5j2L16P2k19j86l8L08k31
3527e9O4r7J56Q1k16J9L5Q3l60M04k02O5m01O45j34j23j23M12j37K7k65J19K95
$$ plain form
3550 288 -150 -119 159 289 -101 -85 74 281 -282 -67 571 -286 -385 10 -107 -141 -140 -130 267 -28 -151 174
3572 174 24 -82 19 131 146 -204 -77 312 141 -217 157 285 -74 -29 7 507 -12 -214 169 -76 -122
3593 -122 -237 3 160 -175 -165 57 77 -249 104 56 87 -46 167 320 -3 -292 -73 -92 -87 -25 31 260 -299
3616 -299 137 88 -29 -89 -111 38 239 -5 -30 61 -165 -432 98 -7 128 77 44 262 -324 -302 -28 125 147
3639 147 61 104 131 -121 -266 207 134 -124 146 199 206 -106 -27 296 -81 -114 199 -5 25 6 -50 50 -168 28
3663 28 -37 -140 62 128 -232 47 -146 80 -16 41 180 231 -239 162 -218 310 236 -152 124 -208 -98 36
3685 36 -167 94 95 -313 -119 140 178 -373 -17 -160 44 -224 11 -31 129 -211 50 87 110 220 -111 261
3707 261 -84 -18 167 90 -38 -26 -39 305 -78 -655 302 138 -176 0 -174 91 -62 -143 -187 336 186 -128
$$ packed form
3550B88m38L1K78J30l90J6J59K07n63K15O38q57r9L95j17l4JJ0L97k95j23L25
3572A74j50j06J01J12J5l50J27L89j71l58L74J28l59M5L6N00n19k02L83k45m6
3593a22j15K40J57l35J0K22K0l26L53m8L1j33K13J53l23k89K19j9NO2N6K29n59
3616b99M36m9j17o0k2J49K01k44k5R1k26k67N30j05J35n1l3K18n86K2K74J53K2
3639A47q6M3K7k52j45M73p3k58K70N3Pl12P9L23l77l3L13k04L0j9n6J00k18J96
3663B8o5j03K02O6l60K79j93K26r6N7J39N1m70M01l80N28p4l88K76l32J10J34
3685C6k03K61Jm08J94K59L8n51L56j43K04k68K35m2J60l40K61L7K3J10l31L72
3707B61l45O6J85p7j28J2j3L44l83n77R57j64l14J76j74K65j53q1m4N23j50l14
$$ plain form
3729 -128 159 -93 -267 -130 199 -140 -252 163 134 -43 63 148 126 -97 -188 512 -43 -13 -176 -14 28 -439
3751 -439 43 145 73 -140 26 -26 -219 29 -90 203 -128 31 -164 121 151 -21 60 55 -66 -116 -68 79 -577
3774 -577 -328 -100 -215 -222 -231 205 -164 -77 58 96 123 -145 58 171 -195 -155 39 -112 -402 -5 10 153 -146
3797 -146 -238 20 74 -329 111 287 219 69 -16 139 -211 -40 68 98 -121 -11 282 248 -185 -27 -76 60
3819 60 145 -7 -18 228 -218 187 82 47 -52 149 149 -67 -28 206 191 -63 -16 -13 148 281 35 55 283 41
3843 41 -45 -41 140 -143 180 -67 -1 -39 -210 170 -436 6 275 54 241 -122 261 262 -212 -13 306 227 -25
3866 -25 98 150 266 35 -50 373 30 -102 -132 101 313 -129 -11 256 -182 -174 -12 97 -26 -135 -22 138
3888 138 -122 -223 181 119 195 -412 21 189 -150 -291 217 219 39 85 23 154 -337 -181 42 -118 -121 6 43
$$ packed form
3729a28K87k52j74J37L29l39j12M15k9j77J06Q5k2k23r1P00n55L0j63J62M2m67
3751d39M82J02p2k13J66n2j93K48j19K93l31J59j95K85L0j72Q1nj21n0M8J47o56
3774e77K49K28j15prM36l69Q7J35L8K7k68K03J13l66M0J94j51k90L97J5J43k99
3797a46r2K58N4m03M40J76o8j50q5J55l50J71J08L0k19J10K93l4m33J58m9J36
3819F0Q5j52j1K46m46M05j05l5r9K01%k16L9K34j5k54M7LJ61J33k46K0K28k42
3843D1q6MJ81k83L23k47O6l8j71L80o06M42K69k21J87l63L83Jm74J99L19p9k52
3866b5J23N2J16k31q5M23l43j32l0K33K12m42J18K67m38QJ62J09j23j09J13J60
3888A38k60j01M04o2P6o07M33J68l39j41N08Kj80M6o2J31m91J56K23j60lJ27L7
$$ plain form
3911 43 -177 6 87 -19 75 12 222 10 149 95 -1 267 71 -95 117 -45 -118 -149 305 -425 -41 49 7
3934 7 181 162 139 1 -71 156 140 -1 -115 -96 110 -116 5 -179 -210 78 -325 82 301 -201 -147 218 55
3957 55 -98 50 4 -70 5 206 137 372 -28 -29 -6 78 -410 -14 291 110 -265 -89 -27 403 -174 41 -47 1
3981 1 -139 90 9 -139 -76 -150 101 -275 6 68 -80 60 34 57 -82 51 240 405 -50 -209 259 264 -173
4004 -173 13 -88 134 21 104 145 100 -9 -45 92 -21 -202 70 -38 -15 11 -101 -142 367 -252 -148 -9
4026 -9 -130 206 106 -33 -186 105 98 126 -54 154 -106 70 -34 59 -93 -79 -98 -57 38 -381 -191 209 -8
4049 -8 -177 -179 9 288 -126 29 -174 80 -142 -217 -38 156 54 -15 62 21 8 -87 268 78 -114 -21 280 95
4073 95 -70 30 55 97 -138 -131 166 -38 -308 -98 42 3 -124 -171 14 -178 -246 110 209 -110 -283 182 -127
$$ packed form
3911D3k20J83Q1j06R4o3K10k12J39n4r6K68j96j66K12j62p3l1M54p30L84R0m2
3934GJ74j9k3j38p2K27j6j41j14J9K06k26J21j84l1K88m03M07K19n02N4L65j63
3957E5j53J48m6p4P5K01o9K35m00jK3Q4m88L96L05j81l75J76O2M30n77K15q8M8
3981Aj40K29q1j48O3p4K51l76K81O2j48J40k6K3j39J33J89J65m55j59M68Nm37
4004a73J86j01K22j13Q3M1m5j09l6J37j13j81K72j08K3K6j12m1N09o19J04J39
4026ij21L36j00j39j53K91pK8j80K08k60J76j04R3j52J4j9M1R5m19J90M00k17
4049hj69kJ88K79m14J55k03K54k22p5J79J94j02o9P7m1j3r5L55j90j92R3L01j85
4073I5j65J00K5M2k35PK97k04k70K10J40l9j27m7J85j92o8L56R9l19j73M65l09
$$ plain form
4096 -127 -404 143 35 -135 -138 -9 8 66 -101 127 105 -87 210 112 254 131 -119 -66 51 -23 28 76 -102
4119 -102 -88 35 -74 45 -321 -3 173 -168 -239 -116 327 37 -60 112 118 -73 151 129 215 -128 -49 -38 197
4142 197 -316 239 193 -75 -28 -8 74 -18 -51 -27 -56 -14 44 -150 20 -61 49 -17 -11 -180 -77 -51 -9 -95 -221 290
4168 290 4 142 -129 -81 -115 -125 -60 -162 114 -96 114 -267 -227 243 82 47 143 -38 64 74 -56 -79 150
4191 150 -104 48 194 20 78 110 145 189 131 -31 175 86 16 -270 123 62 -300 -257 33 -90 128 -152 93
4214 93 70 -84 16 -53 38 -99 133 55 68 56 195 111 257 -23 41 150 225 -214 11 143 -179 114 -54
4237 -54 -34 -30 -107 -43 87 -46 6 65 -7 -151 52 275 -116 -244 -62 185 61 150 111 269 -47 17 -108 71
4261 71 -231 -20 -17 119 80 -270 37 -103 -134 119 86 183 187 -133 285 264 -371 97 -53 66 -21 22 71 12 -221
$$ packed form
4096a27k77N47j08j70lJ29J7N8j67K28k2j92K97r8J42j23k50N3J17p4N1M8j78
4119a02J4J23j09J19l66L18J76l41p1J23M43k90r7J72Oj91K24k2Q6l43P9J1K35
4142A97n13N55m6k68M7K0Q2r2l3K4k9M2N8j94J70q1J10o6Oj69J03K6M2q6j26N11
4168B90k86J38k71M8l4j0O5j02K76k10K10l81M0M70j61l5R6j81J02J0j30k3K29
4191A50k54J52J46j74N8L2L5M4n8j62K06q9p0k86L93o1l62M3K90j23K18k80K45
4214I3k3j54J00o9R1j37K32p8J3j2J39q4J46k80O4J09P5m39K25J32l22K93j68
4237e4K0Mp7O4J30j33N2N9p2j44K03K23l91j28J82K47j24Q9l9J58l16O4j25J79
4261G1l02K11LJ36l9l50L07j40l1K53l3R7Ml20M18k1o35M68j50J19q7M3M9n9k33
$$ plain form
4286 -221 233 71 -352 291 20 29 -98 -15 80 -10 -456 -151 0 -56 -40 -245 121 84 -154 290 242 -162 -217
4309 -217 75 200 -38 112 257 -9 84 -270 -23 -118 -63 85 211 65 -75 251 57 -76 43 89 -204
4330 -204 -193 -209 54 258 -12 -157 -98 102 133 103 169 90 -50 -45 174 15 99 -89 88 -78 38 104 -28 -325
4354 -325 -86 97 -40 92 90 282 142 -26 88 -65 -22 62 66 139 81 82 42 -64 7 -53 -63 31 87 -60 -107 -15
4380 -15 -52 64 -11 -101 203 -81 235 138 -71 51 49 34 229 -13 259 -25 -273 -117 58 -33 -28 164 142 -100
4404 -100 -247 -75 -38 -206 -48 35 147 -20 -8 -38 175 66 41 -31 -251 -71 49 82 181 -64 90 36 -250
4427 -250 -114 -142 -85 -175 -175 -74 54 74 37 -3 43 -57 -83 -95 163 -33 185 43 -9 100 -1 193 378 -74
4451 -74 -93 -78 -23 -15 -263 -20 79 -119 221 43 -101 72 -124 -148 120 -45 -160 44 101 -55 -9 58 261 188
$$ packed form
4286b21M54j62m23O43k71Rj27Q3R5r0m46L05J51n6J6k05L66l7k38M44m8m04n5
4309b17K92J25k38J50J45k66R3l54K47r5N5J48J26j46j40L26j94j33J19M6k93
4330b04J1j6K63K04k70j45N9K00L1l0O6p9j40NK19j59Q4j88J77j66J16O6j32k97
4354c25K39J83j37J32kJ92j40j68J14j53M3Q4MP3n8Jm0j06P1o0j0R4N6j47m7R2
4380a5l7J16p5r0L04k84L16r7k09J22kj5J95k42K72k84k48J56J75r1NJ92k2k42
4404a00j47J72L7j68J58Q3J12j67J2l0K13j09k5p2k20J80J20L3R9k45J54n4k86
4427b50J36k8N7r0%J01J28K0l7m0M6j00k6j2K58j96K18j42n2J09j01J94J85m52
4451g4j9J5N5Qk48K43R9j98L40j78j44J73j96k4K68j65j15K04N7j56M6O7K03p3
$$ plain form
4475 188 138 -50 -13 -14 93 -264 -339 -101 45 -46 316 636 172 -66 22 133 46 34 52 13 -8 -213 -21 35
4499 35 19 -247 -110 -96 -200 -47 47 158 -52 -34 -246 230 -60 -78 39 228 45 -108 19 64 -187 -87
4521 -87 286 24 -98 61 155 -12 223 71 -208 -41 -157 100 81 98 -185 180 -83 -139 -259 26 24 102 262
4544 262 169 178 -42 -374 190 96 -152 114 107 -56 133 63 126 -14 148 183 428 -238 -8 -63 65 151 -166 25
4568 25 -37 41 -74 -113 165 42 -315 13 10 148 18 123 141 -85 -63 179 282 -149 48 190 -80 150 -173
4591 -173 -31 -31 -248 132 -144 -254 -180 -244 -353 1 -39 72 99 -51 185 -160 -27 181 158 96 -185 71 205
4614 205 22 -130 39 -179 3 -177 169 139 -267 -198 63 -50 -106 290 -151 -57 4 -64 49 61 146 -113 -55
4637 -55 -168 14 -185 184 -72 -65 198 -132 -102 -116 -147 255 -11 4 -66 -103 -167 -112 159 163 -104 -186 278 -117 -306
$$ packed form
4475A88n0j88L7jJ07l57p5K38J46r1L62L20m64k38Q8J11q7j2J8l9k1k05J92N6
4499C5j6k66J37J4j04J53R4J11k10J8k12M76k90j8J17J89j83j53J27M5k51J00
4521h7L73k62j22J59R4j67K35j52k79J67j16K57j9J7k83L65k63n6j20K85kP8J60
4544B62r3Rk20l32N64r4k48K66pj63J89p0O3j40J62L5K45o66K30n5J28Q6l17J91
4568B5o2P8j15l9K78j23l57L28lJ38j30J05J8k26K2K42J03m31J97J42k70K30l23
4591a73J42%k17L80k76j10P4o4j09L54m0J11K7j50K36l45J33K08k3o2k81K56J34
4614B05j83j52J69k18J82j80L46l0m06O9K61j13n6L96m41R4O1o8J13J2Q5k59N8
4637e5j13J82j99L69k56PK63l30L0j4l1M02k66J5p0l7o4N5K71Mk67q2M64l95j89
$$ plain form
4662 -306 112 115 48 -85 -95 -74 -173 134 62 -21 -65 181 279 -11 145 -114 46 65 -178 -35 -4 202 -65 -38
4686 -38 -54 448 -83 -84 197 -128 52 -62 42 121 65 -40 86 -31 -44 -199 210 -46 -181 161 101 37 -44
4709 -44 -93 -34 -313 10 215 135 -26 54 187 61 -115 -185 48 -79 -24 -99 -159 -89 1 137 -192 -227 -61 7
4733 7 -20 -242 177 43 222 -71 43 65 223 -172 117 349 159 43 -79 -24 -231 237 63 31 -270 -32
4755 -32 12 133 -77 33 169 -70 -171 -190 33 -130 62 10 -34 7 -193 67 -78 34 -226 97 -18 -73
4777 -73 -98 0 18 -194 -273 30 -56 33 -79 34 -158 -26 4 162 -64 -190 -235 -109 183 -91 91 -208 211
4800 211 32 138 258 -33 -304 54 -85 -145 342 44 114 19 -33 93 -76 -205 47 53 116 -289 -104 33
4822 33 73 -108 85 -121 156 -294 125 -66 -259 -60 -125 198 -205 318 161 -56 93 -135 29 41 7 -87
$$ packed form
4662c06M18Lo7j33j0K1r9L07p2q3m4K46R8k90J56k59J60J9k43J43L1K06k67K7
4686c8j6N02n31jK81l25J80j14J04P9n6j05J26j17j3j55M09k56j35L42o0o4q1
4709d4m9N9k79L23K05q0j61Q0J33j26j76p0K33j27N5p5o0P0R0J36l29l5J66O8
4733Gk7k22M19j34J79k93J14K2J58l95K89K32j90j16j22N5k07M68j74l2l01K38
4755c2M4J21k10J10J36k39j01j9K23j63J92n2m4M1k00K60j45J12k60L23j15n5
4777g3k5R8J8k12p9L03q6Q9j12J13j92J32L0J58k26j26m5J26K92k74J82k99M19
4800B11j79J06J20k91k71L58j39o0M87k98P0r5n2J26j69j29K52OO3m05J85J37
4822C3M0j81J93k06K77m50M19j91j93J99o5L23m03N23j57k17J49k28J64J2l4r4
$$ plain form
4844 -87 87 97 118 -48 118 -193 -78 339 -54 -47 -63 163 201 -47 -15 57 -4 43 -95 -15 196 34 -57 346
4868 346 -35 -332 -26 248 0 -58 -122 30 204 -100 71 75 -35 -75 -176 -229 -75 -141 -77 -82 -205 23 56 124
4892 124 4 139 23 -159 144 -83 49 122 -36 -174 -64 -48 -296 96 25 -41 -1 160 -49 -260 -182 94
4914 94 69 -112 -116 -133 4 -34 -193 161 192 -318 -86 -21 -33 -69 104 -1 132 7 123 33 92 93 -148 -75 49
4939 49 328 3 2 50 235 -133 -94 -142 109 18 -237 -136 163 124 -203 9 -230 -30 106 -12 464 -60 306
4962 306 171 26 -125 -18 -105 15 -116 30 58 -107 -93 -308 -171 111 164 86 313 30 -104 8 40 31 -151
4985 -151 -121 230 -93 -89 -21 121 66 -179 -44 264 -10 -46 111 -294 63 32 9 220 17 -369 225 189 86
5008 86 -12 -196 -119 -316 -147 176 -359 -192 99 24 -168 117 271 -26 -236 66 -163 -78 -65 -14 -100 -13 -171
$$ packed form
4844h7J74J0K1j66J66l11J15M17l93Pj6K26L8k48L2P2o1M7j38Q0K11j62r1M03
4868C46l81k97L06K74k48n8o4J52J74l04J71Mj10m0j01n3J54o6O4nj23K28L3O8
4892A24j20J35j16j82L03k27J32P3j58j38J10J6k48L92p1o6M0J61k09k11P8K76
4914I4k5j81mj7J37l8j59L54L1n10K32O5j2l6J73j05J33j25J16r0N9Jk41P3J24
4939D9K79l25jM8J85l68L9m8K51r1k55J01K99l9l27K12k39K00J36j18M76n24L66
4962C06j35j45j51J07q7J20j31J46K8j65J4k15J37K82N3p8K27k83j34J12L2rj82
4985a51L0L51l23MO8J42n5k45J35L08k74l6J57m05L57l1k3K11k03l86N94l6j03
5008H6r8j84P7j97J69L23n35J67K91p5j92K85J54k97k10L02k29Q5J3N1q6Q7j58
$$ plain form
5031 -171 -55 59 -125 261 -103 91 306 144 61 51 144 94 -293 -25 -207 -103 -288 28 -206 224 -24
5052 -24 -218 108 -146 141 14 73 -59 44 77 202 221 181 175 94 92 -148 283 -19 -70 131 68 127 108 -361 -135
5077 -135 -117 -34 -100 69 69 -5 70 -131 -185 59 -111 -74 5 152 277 -156 -31 -80 283 -175 3 4 68 56 -185
5102 -185 195 -193 -175 -149 -118 -78 -239 -78 171 -53 41 37 -27 37 83 -166 89 -98 -193 -143 -17 -60 -34 73 -156
5127 -156 -146 74 49 -73 -18 -65 -128 34 5 -130 78 193 193 265 31 -40 -85 -62 -145 18 -125 76 -65 -161 168
5152 168 -24 225 117 154 19 83 137 168 6 -8 -77 70 -171 -282 228 77 -190 -98 -167 180 -162 -185 155
5175 155 324 -103 -147 198 289 -87 -20 -147 249 -48 99 92 -143 224 153 -240 -18 -29 -76 -40 -69 92 162 235
5199 235 154 -75 -68 139 -283 -153 130 -88 213 161 101 -92 -129 -193 21 -41 -124 94 -148 66 -64 -234 328
$$ packed form
5031a71J16J14j84L86l64J94K15j62q3j0R3n0l87K68j82J04j85L16k34M30k48
5052b4j94L26k54K87j27N9j32J03L3J25J9m0oq1kk40M31l02n1K01o3N9j9m69K26
5077a35J8Q3o6J69%p4P5k01n4K44j70L7P9J47J25m33J25m9L63m58J78JO4j2k41
5102a85L80l88J8K6L1M0j61J61K49k24R4mo4O4M6k49K55j87r5N0J26m3K6J07k29
5127a56J0K20k5j22N5m7o3J62k9j35K08J15%P2k34p1m5K3q3J63j43K01j41r6L29
5152A68j92K49j08L7j35O4N4L1j62j4o9J47k41j11N10j51k67R2o9L47l42k3L40
5175A55J69m27m4L45R1l76O7j27L96k97J47pk35L67p1l93K22j1m7L6k9J61P0P3
5199B35q1k29PK07m22J30K83k18L01n2o0j93l7o4K14o2q3K18k42K14j30j70N62
$$ plain form
5222 328 215 360 -110 47 143 45 234 240 -99 -60 18 77 47 -101 19 -38 -68 -236 -15 -248 153 161 -12 55
5246 55 12 42 68 -103 -155 29 62 -35 106 -68 154 -47 -312 182 -94 -107 -89 61 171 -112 -105 13 46 254
5270 254 -80 -272 -23 -111 169 -4 66 185 26 -179 95 369 -71 162 -124 84 -66 37 8 -57 114
5291 114 -82 -234 -74 31 -117 105 -16 -266 49 199 94 -73 -278 -156 8 -27 215 -69 6 99 -147
5312 -147 -105 -66 48 59 87 -162 173 170 190 102 -162 172 69 38 143 -3 88 -103 -143 -152 70 -77 36 -71
5336 -71 164 -36 61 20 298 -61 -95 -181 -198 186 -65 -129 328 -47 51 65 -93 -74 84 108 348 50 -63 243
5360 243 -136 -36 -6 -151 -93 -5 -206 273 -78 -92 -147 85 -54 -264 -184 -98 -97 79 149 73 68 -151 94 34 -78
5385 -78 239 203 -117 -57 28 233 96 -37 216 -31 -100 88 -199 19 -80 -107 -135 17 -222 30 151 32 -7
$$ packed form
5222C28j13J45m70J57R6r8J89Ol39L9P8N9l0j48J20n7l0j68K21k33M01Qj73O7
5246E5m3L0K6j71n2J84L3r7J41j74K22k01k65M94k76j3J8J50J10k83PJ18L3K08
5270B54l34j92K49q8K80j73P0J19j59k05K74K74m40K33k86K08j50J03k9o5J71
5291A14j96j52J60J05j48K22j21k50L15J50j05j67k05J22J64l5K42k84P5R3k46
5312a47M2L9J14J1K8k49L35lK0q8k64L34j03l1J05j46R1j91m0rK22j47J13j07
5336g1K35k00R7m1K78l59l4q6j7L84k51o4M57l75R8J4j58J9J58K4K40k98j13L06
5360B43l79J00L0j45N8Q8k01M79l51j4n5K32j39k10Q0Q6JJ76P0p6nk19K45o0j12
5385g8L17l6l20O0Q5K05j37j33K53k47o9J88k87K18r9k7k8J52k39K52J21j19l9
$$ plain form
5408 -7 -139 -21 124 33 198 150 -347 26 40 58 48 68 -82 -28 152 -47 129 -354 82 30 -52 -228 -234 42
5432 42 -250 -205 54 -102 9 59 7 171 5 6 -105 -40 141 223 -35 134 329 -151 72 -49 22 -80 -196
5455 -196 3 124 -162 -154 248 79 105 -70 -185 128 -10 2 -200 -20 -131 289 216 75 -73 -141 243 -74
5477 -74 68 254 64 -62 -95 161 0 0 54 36 74 204 10 -4 122 -188 8 31 -230 40 -224 -202 -113 -100
5501 -100 107 -59 -184 11 -11 -58 -168 244 -120 -89 -86 103 -54 53 30 48 7 35 25 38 19 210 168 -58
5525 -58 52 -22 -167 -169 -292 -1 -4 -170 159 -56 -56 131 -55 -406 25 4 -212 -223 -1 195 33 100 92 150 0
5550 0 -138 -87 -197 124 -190 -273 -1 166 8 -53 24 -7 -191 -77 -28 23 -107 265 164 217 207 -275 -121 -232
5574 -232 55 -76 -25 120 -35 52 99 17 268 77 -90 -205 85 71 4 -4 -42 119 75 143 -216 -225 182 -139
$$ packed form
5408gj32J18J45r1J65m8m97L73J4J8j0K0j50N4J80j99J76m83M36n2q2j76oK76
5432D2k92M5K59j56J11N0n2J64j66Jj11O5J81Q2k58J69J95m80K23j21P1j02j16
5455a96J99J21k86QM02j69K6j75j15L13j38J2k02J80j11M20p3j41j48o8L84l17
5477g4J42J86j90j26l3K56j61%N4j8L8J30j94j4J26l10J96K3k61K70k64K2Q9J3
5501a00K07j66j25J95k2m7j10M12l64L1LJ89j57J07k3J8m1K8j0J3j9J91m2k26
5525e8J10p4j45kj23K91lj66L29k15%J87j86l51M31k1k16j1K22J96j62O7qN8j50
5550@j38N1j10L21l14q3K72J67j58o1P7l1j84J14M9N1j30L72j01N3j0m82J54j11
5574b32K87j31N1J45j55Q7M7q2K51j91j67j15K90j4o7ql8J61m4O8l59rM07l21
$$ plain form
5598 -139 179 -96 -51 86 -108 -61 14 -89 100 31 66 -50 -106 -22 210 212 168 48 -90 -124 -139 156 7 -28
5622 -28 -258 70 44 -292 49 -79 -197 -42 -124 -113 -36 107 -204 -87 54 -340 45 67 154 187 -44 -17 -15 31
5646 31 121 58 306 -162 40 47 64 -118 25 208 -3 -99 184 275 34 15 -87 82 -111 -265 -98 343 -177
5669 -177 43 53 102 -21 -102 67 141 -125 273 -38 103 -125 -96 -34 -202 -460 -85 19 -96 46 -174 -89
5691 -89 -64 -61 50 46 -157 -142 6 150 -269 -89 -73 270 107 99 59 30 -219 -44 169 -12 16 33 -172 102 -171
5716 -171 -167 137 -49 -248 -5 -93 45 113 -151 -195 188 -98 -84 7 -165 -9 5 -65 -91 -379 -153 65 89 205
5740 205 -107 182 -45 118 -173 114 83 47 37 99 186 -78 6 -20 -164 -138 167 5 54 -164 138 -172 -149
5763 -149 164 -8 -56 413 -191 -380 171 -158 -101 93 -157 -14 12 -18 -190 -195 -131 19 64 -11 -52 -51 -118 -109 -22
$$ packed form
5598a39L18k75M5J37j94M7P5j03J89o9L5j16n6Q4K32Km4j20j38l4j5K95j49l5
5622b8k30L28k6l36L41j28j18J55q2J1P7J43l11J17J41l94L85K2Q7L3k31K7KM6
5646C1R0o3K48m68K02PJ7j82J43J83k11r6K83R1k41j9j02J69j93j54J67M41n20
5669a77K20J0M9j23q1J69P4k66L98l11J41k28K9O2j68k58L75J04j15J42k20Q5
5691h9K5LJ11mk03J5J48J44m19J80J6L43j63qm0k9k49J75K13j81K8J7k05K74k73
5716a71ML04j86j99K43q8J38O8k64m4L83k86J4R1j72J56J4p0k6k88K26K18K4J16
5740B05l12K89k27J63k91K87l1l6j0O2Q7k64Q4k6j44K6L05j62M9k18L02l10K3
5763a49L13j72m8M69o04j89N51l29N7J94k50J43K6l0j72nO4J50M5p5m1Jo7RQ7
$$ plain form
5788 -22 -27 -171 200 -80 19 -113 -294 18 69 -193 -90 143 29 -31 -239 -371 -30 151 -220 -308 -44 -17 -277
5811 -277 -145 -80 -52 141 -27 177 171 -193 103 143 210 131 -86 1 -136 -160 -286 -73 33 -306 -240 -56 -118 -67
5835 -67 76 -176 -81 16 97 -35 -15 -112 49 -17 -117 -26 -61 -100 -67 48 -79 -169 -43 27 132 -58 -135 207 18
5860 18 69 -51 -94 198 69 -236 52 70 -126 -74 207 55 101 278 62 51 95 220 -59 142 20 70 -45
5883 -45 40 183 -159 -219 -101 123 -98 -25 -39 -104 -79 100 -7 208 7 -301 68 118 240 20 -150 85 3
5906 3 123 119 61 -9 -256 48 -124 61 89 -42 -80 -189 123 42 132 -312 134 -69 34 409 -170 -170 78 202
5930 202 -178 151 -334 -165 -91 -169 261 -96 -37 -93 -264 166 -134 -14 174 -218 -22 -33 -57 -102 66 198
5952 198 113 -79 0 360 129 27 33 123 6 -117 -10 31 -73 -118 -66 241 1 7 75 -37 -50 -223 -2 222
$$ packed form
5788b2nj44L71k80R9j32j81L12N1k62J03K33j14o0k08j32L41J81l71q8K64K7k60
5811b77J32O5K8J93j68K04ol64K96M0O7p9k17Q7j37k4j26K13J06l39O6J84o2N1
5835f7J43k52R5R7Q1j32K0r7J61o6j00R1l5l9L3J15j27r0J26P0J05j90p7L42j89
5860A8N1j20m3K92j29l05K88J8j96N2K81j52M6J77k16j1M4J25k79K01j22N0j15
5883d5Q5J43l42o0J18K24k21P3j4o5K5J79j07K15k01l08L69N0J22k20j70K35q2
5906CJ20mn8p0k47L04j72J85K8j31l8j09L12q1R0m44M46k03J03L75n79%K48J24
5930B02l80L29m85J69P4p8M30l57N9n6j71M30l00J20J88l92J96j1k4m5J68J32
5952A98q5j92P9L60k31j02OR0j17j23J07M1j04m5N2L07k40OO8j12j3j73K21K24
$$ plain form
5976 222 59 130 68 -54 67 7 252 83 141 66 0 -15 117 119 63 67 152 98 192 -43 171 179 -105 21 155 115
6002 115 39 186 273 -323 -131 111 -101 112 -134 -194 188 151 -139 84 110 -104 177 136 183 -122 -379 48
6024 48 238 -90 -61 -16 8 -56 25 4 136 -123 -137 81 191 40 -127 176 17 -88 -75 -97 66 -185 -149 327
6048 327 22 37 -17 40 20 45 105 86 251 138 -221 -25 -5 272 -109 272 186 48 230 53 -16 11 11 -5 -151
6073 -151 156 -57 -9 -88 -89 12 -34 -3 53 -76 -130 60 222 -125 162 26 -63 -7 -166 -116 65 -69 -102 10
6097 10 -233 -58 -49 -101 -53 96 20 -27 60 216 -141 139 200 -81 -13 -17 -99 66 -92 -232 67 -53 -181 362
6121 362 -119 -120 174 -23 19 -2 122 156 -78 -88 140 -76 128 108 -176 79 79 56 164 62 -14 -114 118 -109
6145 -109 44 119 270 307 224 133 -123 -132 -2 30 -151 -115 68 63 244 306 55 230 -58 -22 -69 21 61 -1 -123
$$ packed form
5976B22j63P1o2j22J21o0K45j69N8p5o6j5J32Kn6MQ5n4R4k35K14Qk84J26J34m0
6002A15p6J47Q7n96J92K42k12K13k46o0L82l7k90K23K6k14K81m1M7l05k57M27
6024D8J90l28K9M5K4o4Q1k1J32k59j4K18J10j51j67L03j59j05J3k2J63k51L6M76
6048C27l05J5n4N7k0K5O0j9J65j13l59J96K0K77l81L81q6j38J82j77o9K7%j6j46
6073a51L07k13M8p9jJ01m6L1N6j29n4J90J62l47K87j36q9N6j59N0J81j34l3J12
6097A0k43J75Rn2M8J49p6m7Q7J56l57K80O1k81O8mq2J65j58j40K99j20j28N43
6121C62m81jK94j97M2k1J24L4k34j0K28k16K04k0k84K55%k3J08j02p6j00K32k27
6145a09J53P5J51L7q3r1k56rJ30L2j81L6J83nJ81O2k51J75k88L6m7R0M0o2j22
$$ plain form
6170 -123 -63 -70 -375 -294 2 134 -228 48 -122 -61 205 25 79 212 -90 154 -205 323 95 -330 -151 41
6192 41 94 -23 82 146 -50 234 41 186 -20 -195 -4 13 -27 -201 21 58 -236 41 77 112 50 84 -127
6215 -127 -202 -46 307 -54 88 87 -25 17 172 87 -3 -60 65 74 -202 71 -128 -18 86 -48 128 189 -163
6238 -163 -38 58 -92 65 40 -92 -65 -102 40 157 -47 -19 -83 -107 -74 11 144 19 -27 39 -30 91 120 -74
6262 -74 13 18 50 58 -278 0 -61 3 -43 -81 -201 0 251 -255 -91 57 -41 179 164 89 369 51 -108 249 6
6287 6 241 -182 -28 144 -45 27 -7 305 160 -307 53 244 -112 259 394 49 -346 113 -99 -29 167 41
6309 41 129 -23 125 203 -79 158 65 -46 22 -27 -196 -40 -19 -26 160 -68 53 83 -89 137 48 275 -18 17
6333 17 45 99 65 46 91 -136 88 22 212 149 371 -190 -106 -143 259 -79 128 224 -89 -60 159 -140 359 -106
$$ packed form
6170a23O0pl05Q1K96J32l62K76j70O1K66j80N4J33l02K44l59N28k28m25J79J92
6192D1N3j17J05O4j96K84j93J45k06j75J91J7m0j74K22L7k94K77L6L5o2L4k11
6215a27p5J56L53l61J42jj12M2J55q5r0n7J25Rk76K73j99J10J04j34J76O1l52
6238a63J25R6j50J57k5j32K7l7J42J17k04K8o4k4L3Q5J33j25m6O6o9J21K9j94
6262g4Q7NL2Ql36K78o1O4m6l8j20K01K51n06J64J48r8K20j5p5K80l18j59L57k43
6287FK35m23J54J72j89P2l4L12j45m67L60J91l56L71J35l45l95M59k12P0J96j26
6309D1Q8j52J48P8k82K37r3j11O8m9j69J56K1pJ86k28J21L0j72K26q9K27k93L5
6333A7K8N4l4j9M5k27K24o6J90o3K22n61Q4l7M02l38K07R6l13K9K19k99M99m65
$$ plain form
6357 -106 -20 -88 -240 -81 56 -290 -120 -96 17 131 -114 260 67 -22 106 36 -259 -63 -328 -11 33 43
6379 43 219 -164 53 133 -202 57 29 46 -218 -3 -323 61 122 -73 73 -229 313 66 106 67 -12 145 91
6402 91 -42 -165 166 110 3 -109 261 88 -4 164 158 -35 -184 149 -114 140 -140 121 202 20 -89 160
6424 160 74 163 -63 -125 -146 -149 180 74 92 57 -55 -90 40 192 -105 -218 -111 112 -44 35 34 92 157 13 -221
6449 -221 264 -135 -162 53 29 103 120 -59 74 -40 -142 197 -8 -12 -69 -186 -191 -172 -132 108 305 163 291 128
6473 128 221 -104 -93 6 -5 -42 180 119 -341 -30 -66 26 -225 -35 134 110 -79 276 -35 52 -220 -147 40 -70
6497 -70 44 130 -164 25 38 -137 -31 262 -17 5 153 45 164 -117 69 100 135 -140 192 -176 -230 24
6519 24 43 -107 20 -138 -110 103 210 15 -117 25 -12 -6 -311 -178 -27 -190 -18 -23 -109 8 48 62 -144 -82
$$ packed form
6357a06Q6o8j52J59J37l46J70K4J13J14k45L74j93q9J28p0k95J96k65L17M4J0
6379D3J76l83K17Q0l35K59k8J7k64K15l20L84O1j95J46l02N42k47M0l9p9J57n4
6402I1j33j23L31n6j07j12L70j73r2J68oj93j49L33k63K54k80K61Q1j82j09K49
6424A60q6Q9k26o2k1lL29j06J8l5j12l5J30J52k97j13J07K23j56P9jN8O5j44k34
6449b21M85l99k7K15k4P4J7j79J33j14j02L39k05mn7j17nJ9M0K40J97j42J28j63
6473A28R3l25J1R9j1l7K22o1m60L11l6R2k51J90J69k4j89L55l11Q7k72P3J87j10
6497g0J14Q6k94J89J3j75J06K93k79K2J48j08J19k81J86L1L5k75L32l68n4K54
6519B4J9j50J27j58K8K13J07j95j32J42l7Ol05J33J51j63J72nq6J17M0J4k06O2
$$ plain form
6543 -82 -33 102 128 17 41 -143 20 -110 -51 78 14 -119 -4 -107 208 202 18 -84 -27 -142 -128 249 54
6566 54 203 -193 -222 -228 110 19 0 133 -297 -103 77 86 40 103 -88 52 -104 -30 25 -141 27 44 -324 -169
6590 -169 -28 -188 10 107 -108 -42 -116 241 126 218 7 -62 276 -10 25 -228 152 74 6 -41 118 -126 204
6613 204 230 96 154 -49 155 -29 -152 185 -274 44 42 -212 111 9 55 -188 148 -86 -55 -71 -225 -35
6635 -35 231 1 134 147 -45 -127 50 -77 -322 -43 -3 -5 -127 -94 -67 -285 -103 -137 -158 -89 -228 -9 -136 -173
6659 -173 21 65 -142 -231 86 -98 122 -50 -41 -25 -223 -180 117 62 1 -116 94 -40 224 -102 59 143 165
6682 165 -23 -106 159 -31 43 -83 4 -104 -291 -81 -79 39 8 -236 121 -87 57 -60 222 -6 -72 -8 -37
6705 -37 22 -132 46 -104 76 170 -89 28 35 -44 236 -74 -81 22 130 132 183 192 -115 26 -99 -6 111 66 122
$$ packed form
6543h2M9J35K6j11K4j84J63j30N9J29o4j33J15j03L15oj84j02N7j15J4L77j95
6566E4J49l96k9oL38r1j9J33m30J94J80Rm6O3j91J40j56P4N5j66J68J7l68J55
6590a69J41j60J98R7k15O6p4L57j15R2k11o9L38k86L5k53L80p8o8m7J59k44L30
6613B04K6j34N8k03K04j84j23L37m59L18kk54L23j02M6k43L36k34L1j6j54J90
6635c5K66k30J33J3j92q2J77j27k45K79M0kj22L3K7k18J82l4k1O9j39K19j27l7
6659a73J94M4k07q9L17j84K20j72RJ6j98M3K97n5o1j17K10j34K64l26J61Q4K2
6682A65j88q3K65j90P4j26Q7j08j87K10KJ18l1k44L57k08J44j17K82k28o6O4k9
6705c7N9j54J78j50J80R4k59J17Pp9K80l10pJ03J08KN1Rl07J41j25R3J17m5N6
$$ plain form
6730 122 52 -54 133 33 -56 331 60 13 -37 148 -112 80 80 -264 241 322 81 94 -56 145 -283 -67 -125
6753 -125 -50 81 -126 235 -121 109 158 205 177 -142 45 260 156 -60 -3 -144 126 -55 -25 68 -2 1 -183
6776 -183 351 -215 -63 -79 -230 16 88 249 17 100 -64 17 -40 44 218 -298 -1 -176 -33 106 -30 96
6798 96 -16 44 -160 174 -110 154 -29 -8 108 2 86 -34 -5 33 31 -107 112 -66 37 0 -121 96 243
6821 243 -39 384 -8 -13 -25 12 -52 125 186 230 -34 80 -289 41 -96 26 -19 21 89 175 -25 -228 91 -229
6845 -229 89 -105 -101 13 -142 103 -130 217 40 -75 58 183 -218 -114 -35 166 -85 -143 -73 -298 6 -189
6867 -189 160 13 128 -42 112 75 19 68 -39 -12 98 4 32 -184 -222 -31 -58 -20 -35 75 268 214 -110 -89
6891 -89 -116 214 -10 -132 32 -81 75 157 150 71 194 230 -55 -269 -189 48 217 -136 -131 -248 -37 3 -118 30
$$ packed form
6730A22p0j06J87j00q9L87k71m7n0J85k60J92%l44N05Q1k41J3j50K01m28K16n8
6753a25P5J31k07L61l56K30M9M7k8l19J87K15j04k16N7j41K70j81L0R3p0Lj84
6776a83N34n66J52j6j51K46P2J61k32Q3j64Q1n7Q4J74n16K97j75J43J39j36J26
6798I6j12O0k04L34k84K64j83K1J16j06Q4j20K9L8kj38K19j78J03l7j21K17J47
6821B43k82M23l92nj2L7o4J77O1M4k64J14l69L30j37J22m5M0O8Q6k00k03L19l20
6845b29L18j94MJ14j55K45k33L47j77j15J33J25m01J04P9K01k51n8P0k25L04j95
6867a89L49j47J15j70J54l7n6M9j07K7J10r4K8k16l8J91k7L8j5J10J93n4l24K1
6891h9k7L30k24j22J64j13J56Q2pp9J23L6k85k14Q0K37J69l53Nj17K11M0j21J48
$$ plain form
6915 30 -60 -37 -39 -239 -156 -102 105 -136 28 -75 111 166 -69 41 -134 -24 68 28 92 -34 1 178 44 -59
6939 -59 -63 9 78 -211 -172 122 -224 210 106 36 16 246 -254 -181 11 90 100 -127 182 -68 208 3 89 218
6963 218 163 -89 -43 -20 163 -146 -311 140 -280 -106 -176 63 143 178 -243 -89 -103 80 -21 -58 -65 -53 -214 144
6987 144 -19 -128 -362 -67 112 181 3 67 -216 7 -245 -7 54 -40 -123 -224 256 -27 264 40 167 -55
7009 -55 142 -166 21 -32 129 271 -182 68 54 -154 86 15 -70 -54 -54 260 114 -38 55 271 103 165 -26
7032 -26 -75 -13 61 225 -104 -234 -66 47 23 171 5 -105 218 -162 145 -69 79 185 165 -2 -7 -83 -215
7055 -215 -57 205 326 -228 188 -99 238 -62 -38 -15 -102 18 -265 -190 -154 27 194 37 30 50 45 -13 -158 135
7079 135 75 108 -88 76 -114 136 -110 7 -104 -192 128 -120 37 -39 -216 92 151 -15 -238 -159 -63 -18 -168
$$ packed form
6915C0r0K3kk00Q3N4K07k41J64j03J86N5k35J10j75J10R2m0O4j26L5J77j34j03
6939e9mP2O9k89L9K94l46M34j04p0k0K30n00P3J92P9J0k27L09k50K76k05Q6J29
6963B18n5k52M6K3J83l09j65M51m20J74p0K39Q0L5m21J54j4J83j01l7pJ2j61L58
6987A44j63j09k34K95J79O9j78O4k83K23k52K38O1r4q3j01M80k83K91k24J27k22
7009e5J97l08J87n3J61J42m53K50j4k08K40p1q5J6%L14j46j52R3K16j68O2j91
7032b6m9O2P4J64l29j30J68J13k4J48j66j10L23l80L07k14J48J06k0j67np6j32
7055b15J58K62J21n54M16k87L37l00K4K3q7J20k83P5L6J81J67j57pK0nn8j45K93
7079A35o0L3j96J64j90K50k46J17j11q8L20k48J57p6j77L08N9j66k23P9R6M5j50
$$ plain form
7102 -168 38 110 -19 -249 30 -26 118 82 41 -115 -24 -179 -38 -122 -4 -55 -221 -277 -206 177 287 -44 -330
7125 -330 187 -25 -40 128 -83 40 -341 125 133 -129 -92 -41 170 -2 -10 22 66 106 -342 138 -5 199 -222
7148 -222 95 91 99 -122 35 328 22 100 -103 63 207 38 137 135 131 84 215 239 6 -156 -79 75 -262 -168 -172
7173 -172 -171 210 -69 -234 99 67 192 184 5 -106 -113 191 122 100 -56 -41 163 -170 34 140 -157 50 179
7196 179 191 232 -22 56 163 75 -111 95 -32 49 -93 -115 119 138 14 -17 -267 43 111 -272 104 49 -193
7219 -193 15 119 205 74 230 -164 90 116 337 -60 71 138 82 -70 -312 5 -111 162 -54 72 -91
7240 -91 27 21 77 -3 85 -27 -31 93 53 28 26 -81 114 -63 131 228 -31 -274 -5 110 206 -83 -167 -25 -283
7265 -283 113 -121 39 75 -263 232 -241 -27 -16 35 144 -159 67 99 66 -28 -54 -69 -112 210 -106 143 -41
$$ packed form
7102a68K06P2j29k30K79n6J44l6m1j56R1j55J41q4J18n1j66n6P1L83J10l31k86
7125c30N17k12j5J68k11J23l81M66Qk62L7N1K11j72qL2M4M0m48M80j43K04m21
7148b22L17mQk21J57K93l06P8k03J66J44j69R9kmm7J31K4k33j62P7J54l37R4m
7173a72JL81k79j65L33l2J25qj79j11pL04o9k2j56J5K04l33K04J06k97K07J29
7196A79J2M1k54P8J07q8j86K06j27Q1j42k2K34J9j24l1k50L10O8l83L76n5k42
7219a93K08J04Q6j31J56l94K54K6K21l97J31O7n6j52k42L17j16K73k16J26j63
7240i1J18oN6q0Q8j12mJ24m0k5kj07J95j77J94R7k59k43K69J15R6k89q4J42k58
7265b83L96k34J60L6l38M95m73K14J1N1J09l03K26L2l3r4k6j5m3L22l16K49j84
$$ plain form
7288 -41 20 -271 -21 -98 30 65 -48 208 -43 -30 46 -258 33 164 100 -39 -319 154 196 8 -22 279 -81
7311 -81 194 -137 61 -464 193 -41 -15 1 -1 185 -47 50 -60 49 -37 14 -145 -249 -48 22 -60 77 190
7334 190 -57 16 199 201 179 -285 -50 -151 -40 42 -90 -4 -70 -102 -11 -97 -131 57 -65 90 147 -54 162 -45
7358 -45 -149 115 -41 170 -238 -8 115 -65 -151 107 -71 -29 -265 -93 -10 51 167 221 179 76 118 123 22
7381 22 20 75 -15 14 -203 -179 145 81 -109 165 74 8 -68 -49 -12 -3 -3 19 -36 -145 271 -49 39 -121 265 -105 -44
7408 -44 -212 69 -29 79 195 -14 -38 161 -168 26 219 -36 -71 23 311 -261 -81 -154 -59 259 -258 47
7430 47 -12 -101 40 -145 152 26 50 63 159 -27 75 71 -33 88 239 -41 -92 -43 -293 161 76 -176 99 -114
7454 -114 -60 -88 -92 100 16 2 -189 -25 157 167 -73 182 -136 -58 74 13 125 -2 -357 90 143 60 -43 166
$$ packed form
7288d1O1k91K50p7J28L5j13K56k51J3P6l04K91J31o4j39k80M73M2j88l0L01l60
7311h1K75l31J98n25O57k34K6J6kJ86k32R7j10J09q6N1j59j04K01P0q2J37J13
7334A90k47P3J83Kk2m64K35j01J11Q2j32Q6o6l2R1q6l4J88j22J55N7k01K16k07
7358d5j04K64j56K11m08K30J23j80q6K58j78M2k36J72Q3O1J16N4m2j03M2Nj01
7381B2kN5r0K9k17K4L24o4j90K74r1o6p6J9L7R%K2n5j09M16l20Q8j60L86l70O1
7408d4j68K81r8J08J16k09k4J99l29J94J93k55l5R4K88n72J80p3R5L18n17L05
7430D7n9q9J41j85K97j26K4J3R6j86J02mj04J21J51k80n1M9k50M54q5k52K75k13
7454a14N4k8mJ92q4j4j91J64J82J0k40K55l18P8J32o1J12j27l55M47N3q3j03K09
$$ plain form
7478 166 -19 -46 -250 198 -113 -30 137 -41 44 -62 -5 -137 -119 -68 34 1 -217 65 -244 -58 -77 17 312
7501 312 -27 -112 266 -3 181 147 29 -205 -23 -47 9 22 -156 -209 108 274 90 74 3 79 -81 -275 -81
7524 -81 160 187 -141 227 -108 -36 93 -118 37 -42 -183 376 52 36 29 -255 -61 -78 -63 -128 80 -311 -19
7547 -19 -61 39 -80 -50 79 -64 50 -18 -25 -260 -29 -23 50 80 -41 -9 34 250 27 63 117 128 -240 -105 76
7572 76 -51 12 104 59 -15 95 -197 -162 -187 -119 203 -5 210 -119 58 -215 -164 0 5 97 238 71 -54 -13
7596 -13 -2 162 -167 -35 50 -48 1 212 177 -12 -195 -93 233 -73 -74 60 -107 326 134 -49 -119 164 33
7619 33 82 -19 174 -129 52 -139 86 241 68 -162 -14 -13 -221 59 91 -53 273 174 143 -296 37 -227
7641 -227 69 93 -154 73 -178 105 -272 -173 -52 120 1 -20 -62 204 110 -221 -96 -214 -189 62 -121 -13
$$ packed form
7478A66j85k7k04M48l11Q3J67j78Q5j06N7j32J8N1J02l3k18K82l09J86j9R4K95
7501C12l39q5L78k69J84l4j18k34J82k4N6J3j78n3L17J66j84j6p1P6j60j94J94
7524h1K41K7l28L68l35P2J29k11J55p9j41N59l24j6pk84J94j7J5o5K08l91K92
7547a9m2J00j19L0J29j43J14o8pk35K31OP3L0j21L2M3K16k23L6N4J1l68J35J81
7572G6j27O3R2m5p4J10k92L5k5O8L22k08K15l29J77k73N1J64NR2J41j67j25M1
7596a3J1J64l29J32Q5r8M9K11l5j89j83J02L26l06jJ34j67M33j92j83p0K83j31
7619C3M9j01J93l03J81j91K25J55j73k30J48Jk08K80L2j44L26r9l1m39L33k64
7641b27K96K4k47K27k51K83l77R9J21J72j19k1m2K66r4l31J25j18K5K51j83J08
$$ plain form
7663 -13 -166 125 81 -40 -15 20 12 115 305 120 -250 99 225 64 -47 110 -125 180 -21 85 -11 -51 -124
7686 -124 43 130 10 -203 -177 -184 329 10 39 -45 -127 -42 -129 -167 -69 45 95 -9 8 -70 171 167 -49 60 -51
7711 -51 -25 -175 52 -124 58 29 132 124 -25 -130 -57 -109 9 -120 5 79 -21 -135 -4 151 -30 -3 286
7734 286 -206 109 -61 -178 -213 -147 112 28 55 -23 30 78 -39 147 284 -43 -31 -77 -33 241 -75 -64 -173 71
7758 71 -184 -15 44 -63 160 220 185 101 193 96 -12 95 47 -27 128 38 -69 -182 129 10 144 307 122
7781 122 -223 -2 -106 -104 18 -163 479 34 -223 211 189 263 23 -89 120 113 150 74 274 161 23 -174 75
7804 75 -241 72 -74 -77 44 -136 -38 44 97 -280 -87 22 -99 -203 -127 -251 144 181 53 -95 -11 -47 7 -1
7828 -1 -31 -111 -30 -205 70 134 320 19 9 164 364 -65 55 -140 26 241 42 -69 -111 -143 -3 -224 264
$$ packed form
7663a3j53K91m4j21K5L5qJ03J90j85l70L49J26j61j11J57k35L05k01J06r6m0p3
7686a24J67Q7j20k13K6pN13l19K9q4q2Q5q7l8R8J14N0j04J7p8K41mk16J09j11
7711e1K6j50K27j76J82k9J03qj49j05P3n2J18j29J25P4j00j14J31J55j81K7K89
7734B86m92L15j70j17l5O6K59q4K7p8N3M8j17J86J37l27J2m6M4K74l16J1j09K44
7758G1k55J69N9j07K23O0l5q4R2r7j08J07m8p4J55r0j07j13L11j19J34J63j85
7781A22l45K21j04KJ22j81O42m45k57M34k2P4k40j12K09pL7p6K00j13j38j97K49
7804G5l16L13j46lJ21j80R8Q2N3l77J93J09j21j04P6j24L95L7j28j48Q4l6N4q
7828al0q0Q1j75K75O4J86l01j0J55K00m29J20j95J66K15j99j11m2l2J40k21M88
$$ plain form
7851 264 -48 167 -102 288 -180 -217 -46 116 279 112 -133 -227 36 -145 149 -263 -70 46 64 -147 -56
7872 -56 67 -218 -122 130 103 -19 70 204 88 -32 92 19 9 -37 -37 -28 -127 93 -177 82 -41 164 355 9
7896 9 -77 -90 53 -105 1 -130 39 32 -144 -84 47 -72 341 -236 -143 139 -34 259 61 87 -19 -237 -47
7919 -47 -183 -135 -24 97 165 60 89 -69 -13 -31 143 -115 -64 227 -152 -4 175 -128 301 27 66 20 112
7942 112 -164 -40 83 213 147 200 175 57 77 25 -46 -220 196 56 -187 31 -167 223 -172 -48 29 82 75
7965 75 -62 156 149 23 255 -293 -106 0 94 19 -5 89 -200 28 335 181 334 -22 -133 26 -98 68
7987 68 51 220 18 131 -29 148 156 128 28 109 6 297 110 -2 79 171 -79 100 158 13 38 53 -188 -256
8011 -256 120 -221 100 133 77 38 -42 -130 -98 261 -11 -101 50 34 -65 -79 -32 44 -150 27 -135 94 53 -170
$$ packed form
7851B64l12K15k69L90m68l7J71J62J63j67k45r4K63j81K94m12J93J16J8k11R1
7872e6J23k85R6K52k7j22Q9J34j16j20J24p3j0m6%Rr9K20k70K59j23K05J91l46
7896Iq6j3J43j58J06j31J69pj76O0J31j19M13n77R3K82j73K93j98K6j06k18J90
7919d7j36M8J11J21O8j05K9j58N6j8J74k58N1K91l79J48J79l03M29k74L9m6R2
7942A12k76J24J23J30o6N3k5j18K0n2p1j74M16j40k43K18j98L90l95J24P7N3p
7965G5j37K18pj26K32n48J87J06R4p5k4R4k89K28L07j54J53l56j11J59j24J66
7987F8j7J69k02J13j60J77Qk8j00Q1j03K91j87j12Q1R2k50J79N8j45K5J5k41o8
8011b56L76l41L21L3n6l9q0q8L2L59k72r0J51j6r9j4M7P6j94J77j62K29m1k23
$$ plain form
8035 -170 -90 53 263 99 -226 55 136 -139 119 35 -173 196 -27 -29 -68 -25 118 134 -117 -127 58 214 235
8058 235 99 -92 -8 83 -37 39 254 -19 -97 -65 -86 80 10 44 -71 -323 -45 224 162 -179 240 -88 0
8081 0 -19 114 61 73 248 -5 8 83 -10 270 -117 -139 35 286 222 -173 161 -145 -54 32 -68 222 -57 -357
8105 -357 23 77 90 344 -41 -200 14 -140 208 128 -162 127 20 47 -134 -157 -136 16 288 132 -102 282
8127 282 -5 55 35 -19 -24 -47 -102 -80 239 77 -139 -20 220 -103 -147 -62 -170 156 -80 -131 273 47 60 -156
8151 -156 -10 151 -110 -72 -72 89 -345 -160 -31 -7 -210 3 -21 107 -51 165 95 11 -229 -233 50 -252 38
8174 38 -285 -144 -212 58 51 89 -66 -82 -121 256 160 -13 232 173 -55 62 6
$$ packed form
8035a70Q0J43K10j64l25K81Q1k75K58q4k08L69k23kl9M3J43J6k51j0J85J56K1
8058B35j36j91Q4R1j20P6K15k73p8L2k1J66p0L4j15k52K78K69o2l41M19l28Q8
8081@j9J33n3J2J75k53J3P5r3K80l87k2J74K51o4l95L34l06R1Q6j00K90k79l00
8105c57L80N4J3K54l85j59K14j54L48q0k90K89j07K7j81k3K1J52K72j56k34L84
8127B82k87O0k0n4nk3n5K2L19j62k16J19K40l23m4Q5j08L26k36n1M04k26J3k16
8151a56J46J61k61L8%J61m34J85J29K4k03K13k4J28j58K16p0q4k40mK83l02K90
8174C8l23J41o8K70pL8j55j6l9L77r6j73K45n9k28J17n6
8191F
$$ Imaginary data points
##PAGE= N=2
##DATA TABLE= (X++(I..I)), XYDATA
$$ plain form
0 0 0 0 0 0 0 0 0 0 0 0 0 -8 8 -8 8 -16 16 -16 24 -24 32 -38 45 -53 61 -71 82 -94 110 -124 142 -161 184 -207
34 -207 233 -264 296 -331 369 -413 459 -508 563 -623 688 -760 838 -925 1019 -1123 1235 -1362
52 -1362 1504 -1658 1835 -2031 2261 -2523 2829 -3190 3632 -4178 4874 -5797 7081 -9006 12189
67 12189 -18396 35032 -174620 -453844 -58970 93437 -75686 -24989 400681 528591 281043
78 281043 236955 450766 329155 -6721 -60571 96214 34393 -141070 -65039 106966 957
89 957 -157808 -138362 -153970 -317473 -399786 -320384 -267757 -276904 -132500 54113 59221 53166
101 53166 164917 174695 16315 -56269 57637 69234 -76991 -27678 183797 163647 -24175
112 -24175 -28493 76807 -69866 -352001 -334198 -166404 -250245 -368409 -187843 52957 16093
$$ packed form
0@%%%%%%%%%%%qJ6j6J6k4L2l2M0m8N6p0Q3r8J14j32J53j76K04k34K66l03L45l91
34b07M40m97N60o27P00p82Q72r67J071j186J311j448J598j763J944k142K358k597
52a362K866l162L493l866M292m784N352o019O822p810R052j0671J2878j6087K1195
67A2189l0585N3428k09652k79224L94874J52407j69123N0697M25670J27910k47548
78B81043m4088K13811j21611l35876n3850J56785o1821j75463P6031J72005j06009
89I57j58765J9446j5608j63503q2313P9402N2627r147J44404J86613N108o055
101E3166J11751R778j58380p2584J13906J1597j46225M9313K11475k0150j87822
112b4175m318J05300j46673k82135J7803J67794q3841j18164J80566K40800l6864
$$ plain form
123 16093 -101148 25509 163677 28000 -100317 16497 150557 111880 74266 215180
133 215180 339054 254298 148874 149473 115109 -18052 -143356 -159631 -128879 -147089 -158316
144 -158316 -125561 -88010 -73984 -121607 -181155 -172457 -152150 -169585 -168800 -81328 54443 103261
156 103261 100813 174586 238764 184119 88830 70094 100656 55648 -14395 29977 104715 88103
168 88103 34461 20952 27196 -32077 -132998 -163963 -139905 -122274 -112349 -86846 -4470 80552
180 80552 75165 38212 55245 89226 49165 -37113 -8951 97410 86867 18961 70723 165985
192 165985 109587 -43883 -53070 18514 -80449 -222759 -159411 -28860 -63719 -146673 -48667
203 -48667 84109 2940 -105818 -25137 56575 -21108 -79411 37137 149834 98914 72497
$$ packed form
123A6093j17241J26657J38168j35677j28317J16814J34060l8677l7614J40914
133B15180J23874q4756j05424N99l4364j33161j25304j6275L0752j8210j1227
144a58316L2755L7551J4026m7623n9548Q698K0307j7435P85Q7472J35771M8818
156A03261k448P3773O4178n4645r5289j8736L0562m5008p0043M4372P4738j6612
168H8103n3642j3509O244n9273j00921l0965K4058J7631R925K5503Q2376Q5022
180H0552n387l6953J7033L3981m0061q6278K8162J06361j0543o7906N1762R5262
192A65985n6398j53470r187P1584r8963j42310O3348J30551l4859q2954R8006
203d8667J32776q1169j08758Q0681Q1712p7683n8303J16548J12697n0920k6417
$$ plain form
214 72497 173764 196144 92437 36983 60932 31787 -55616 -57525 -5599 -32681 -57205 -11446
226 -11446 -13165 -81587 -100839 -65393 -98482 -171385 -112322 -5172 -35225 -65664 53503 146352
238 146352 60772 -14890 89890 145936 -1902 -58400 93939 143051 3846 -23051 130725
249 130725 139596 -51315 -85740 47890 9445 -155133 -134011 21946 15228 -103784 -42795
260 -42795 100572 50127 -59941 -5925 80712 23650 -48075 29381 109167 55656 29739 95394
272 95394 98457 26605 990 19662 -16686 -75444 -47743 -15638 -62345 -65572 1769 3947 -62904
285 -62904 -59383 15671 -3491 -86100 -30947 79906 48931 -12240 67480 165255 98331 2648
297 2648 74652 142189 35146 -44103 39430 97301 5010 -61973 22586 63377 -46716 -102892
$$ packed form
214G2497J01267K2380j03707n5454K3949k9145q7403j909N1926k7082k4524M5759
226a1446j719o8422j9252L5446l3089p2903N9063J07150l0053l0439J19167R2849
238A46352q5580p5662J04780N6046j47838n6498J52339M9112j39205k6897J53776
249A30725Q871j90911l4425J33630l8445j64578K1122J55957o718j19012O0989
260d2795J43367n0445j10068N4016Q6637n7062p1725P7456P9786n3511k5917O5655
272I5394L063p1852k5615J8672l6348n8758K7701L2105m6707l227O7341K178o6851
285f2904L521P5054j9162q2609N5153J10853l0975o1171P9720R7775o6924r5683
297B648P2004O7537j07043p9249Q3533N7871r2291o6983Q4559M0791j10093n6176
$$ plain form
309 -102892 -31938 -10399 -88552 -116094 -33311 8546 -43188 -43153 23881 41566 6289 -4733
321 -4733 27596 44169 21772 19256 39091 49541 51036 33197 15344 22122 17251 -14446 -41826
334 -41826 -33244 -8500 -29363 -56684 -22323 10853 -12386 -38918 -13175 25717 4491 -26334
346 -26334 13085 53899 35999 14729 35511 65746 44823 2920 8307 24784 6671 -24711
358 -24711 -35102 -13227 -7562 -45204 -62296 -36886 -22189 -51629 -81461 -42126 4029 -26873
370 -26873 -52478 3198 54038 20074 -21727 31119 86849 30466 -16411 45436 90083 28803
382 28803 -22132 34039 71044 -11370 -60999 -842 17707 -54238 -81835 -19371 2843 -58838
394 -58838 -66550 -4228 -3955 -49071 -38877 4882 3659 -20660 5483 38982 17830 11985 41213
$$ packed form
309a02892P0954K1539p8153k7542Q2783M1857n1734L5O7034J7685l5277j1022
321d733L2329J6573k2397k516J9835J0450J495j7839j7853O778m871l1697k7380
334d1826Q582K4744k0863k7321L4361L3176k3239k6532K5743L8892k1226l0825
346b6334L9419M0814j7900k1270K0782L0235k0923m1903N387J6477j8113l1382
358b4711j0391K1875N665l7642j7092K5410J4697k9440k9832L9335M6155l0902
370b6873k5605N5676N0840l3964m1801N2846N5730n6383m6877O1847M4647o1280
382B8803n0935N6171L7005q2414m9629O0157J8549p1945k7597O2464K2214o1681
394e8838p712O2322K73m5116J0194M3759j223k4319K6143L3499k1152n845K9228
$$ plain form
407 41213 29358 -5168 2645 24604 -8154 -46375 -6177 23076 -38504 -64196 -1683 9784
419 9784 -67747 -86016 -2711 9699 -76428 -62574 45909 45105 -39238 -15928 84468 61272
431 61272 -41595 -8124 86338 39704 -46230 2943 81336 26364 -56747 -8706 43769 -34098
443 -34098 -96128 -43328 -8505 -63129 -89340 -25872 3156 -44658 -44322 5989 977 -32048 -14590
456 -14590 20853 10141 -1453 42418 61881 25085 29848 66494 40267 -13804 -3072 33832
468 33832 -5490 -58007 -10516 35942 -19492 -59654 -4842 28048 -40425 -82141 -9535 26480
480 26480 -40228 -48885 39160 70152 7969 -4003 68278 73256 -6822 -14599 44104 39036 -16116
493 -16116 -14214 39059 34683 -19530 -20149 7257 -13587 -51424 -52097 -27869 -23345 -32096 -14017 10626
$$ packed form
407D1213j1855l4526P813K1959l2758l8221M0198K9253o1580k5692O2513J1467
419I784p7531j8269Q3305J2410q6127J3854J08483q04q4343K3310J00396k3196
431F1272j02867L3471R4462m6634q5934M9173P8393n4972q3111M8041N2475p7867
443c4098o2030N2800L4823n4624k6211O3468K9028m7814L36N0311n012l3025J7458
456a4590L5443j0712j1594M3871J9463l6796M763L6646k6227n4071J0732L6904
468C3832l9322n2517M7491M6458n5434m0162N4812L2890o8473m1716P2606L6015
480B6480o6708q657Q8045L0992o2183j1972P2281M978q0078p777N8703n068n5152
493a6116J902N3273m376n4213o19K7406k0844l7837o73K4228M524q751J8079K4643
$$ plain form
507 10626 18211 24466 23252 19551 28085 31280 23261 19452 37296 60145 47154 30310 48955 52734
521 52734 15902 -16143 -11028 -3064 -33670 -56040 -25320 -2785 -21970 -33746 -13886 3514
533 3514 -18772 -41397 -20330 1478 -3327 -5690 15394 48071 53000 30906 30743 45251 34180
546 34180 41 -17097 5917 16023 -16449 -23836 11928 21532 -18028 -43182 -12314 -655
558 -655 -50029 -63037 -7966 16534 -14871 -15127 43716 62447 10056 -208 44164 38133 -11757
571 -11757 -13086 31364 33124 -6849 13 33593 11260 -29594 -29910 -21152 -42989 -63647 -43778
584 -43778 -25187 -34765 -21250 7201 957 -10528 6931 17713 -6836 -15539 25487 40976 8158
597 8158 19714 71049 63290 9480 8447 49323 20492 -50121 -32247 25242 -5348 -57927 -18749
$$ packed form
507A0626P585O255j214l701Q534L195q019l809J7844K2849j2991j6844J8645L779
521E2734l6832l2045N115P964l0606k2370L0720K2535j9185j1776J9860J7400
533C514k2286k2625K1067K1808m805k363K1084L2677M929k2094j63J4508j1071
546C4180l4139j7138K3014J0106l2472p387L5764R604l9560k5154L0868J1659
558f55m9374j3008N5071K4500l1405k56N8843J8731n2391j0264M4372o031m9890
571a1757j329M4450J760l9973O862L3580k2333m0854l16Q758k1837k0658J9869
584d3778J8591r578J3515K8451o244j1485J7459J0782k4549q703M1026J5489l2818
597H158J1556N1335p759n3810j033M0876k8831p0613J7874N7489l0590n2579L9178
$$ plain form
610 -18749 39815 -1693 -62795 -19416 26153 -30306 -70338 -10773 36289 -4096 -25506 39782
622 39782 70204 12506 -7912 35970 36424 -15973 -24860 19365 20183 -17310 -3181 28254 6329
635 6329 -21623 -11422 -5882 -33603 -42623 -11347 -6130 -24118 1836 36596 20083 -1312 22035
648 22035 41442 3768 -22526 19967 40856 -1980 -9318 42257 51102 -6464 -23676 22672
660 22672 11949 -55995 -54576 -377 -6429 -52371 -34902 22756 11665 -37818 -20395 18900
672 18900 -3093 -38698 -17737 23807 14724 -7938 19757 46844 26202 4825 10540 14727 -3822
685 -3822 -19673 -10361 -4549 -8305 -3570 -1808 -5638 -4044 -7577 -19583 -28530 -22210 -11238 -19267
699 -19267 -19739 6929 20631 7801 1230 15725 21086 -5463 -20379 933 7874 -11631 -13894
$$ packed form
610a8749N8564m1508o1102M3379M5569n6459m0032N9565M7062m0385k1410O5288
622C9782L0422n7698k0418M3882M54n2397q887M4225Q18l7493J4129L1435k1925
635F329k7952J0201N540k7721r020L1276N217j7988K5954L4760j6513k1395K3347
648B2035J9407l7674k6294M2493K0889m2836p338N1575Q845n7566j7212M6348
660B2672j0723o7944J419N4199o052m5942J7469N7658j1091m9483J7423L9295
672A8900k1993l5605K0961M1544r083k2662K7695K7087k0642k1377N715M187j8549
685c822j5851R312N812l756M735J762l830J594l533j2006q947O320J0972q029
699a9267m72K6668J3702j2830o571J4495N361k6549j4916K1312O941j9505k263
$$ plain form
712 -13894 8015 18180 -2600 -16303 -2567 -2140 -23766 -33278 -21372 -5223 -8408 -15159 3006
725 3006 21218 14899 -141 1225 16180 11356 -11870 -5501 20720 21399 2074 2524 27976 23495
739 23495 -16397 -20648 3854 -6315 -38674 -33332 2040 1834 -27888 -15737 16211 3399 -25234
752 -25234 -16465 8390 -2 -20297 -51 27594 17627 8026 23159 30539 14099 1755 9270
765 9270 7403 -8156 -1479 9077 -1194 -3402 10149 9263 -11682 -15901 3963 -4032 -31800 -16881
779 -16881 15503 4195 -18260 4360 37670 13108 -22840 6109 33218 -4989 -32499 6042
791 6042 33661 -4423 -27884 17141 33843 -17140 -33958 6360 12848 -30605 -36832 10828 17911
804 17911 -20158 -11505 27904 20787 -10873 -2806 25093 12385 -11112 8902 28404 11502 4779
$$ packed form
712a3894K1909J0165k0780j3703J3736M27k1626r512J1906J6149l185o751J8165
725C006J8212o319j5040J366J4955m824k3226O369K6221O79j9325M50K5452m481
739B3495l9892m251K4502j0169l2359N342L5372k06k9722J2151L1948j2812k8633
752b5234Q769K4855q392k0295K0246K7645r967r601J5133P380j6440j2344P515
765I270j867j5559O677J0556j0271k208J3551q86k0945m219J9864p995k7768J4919
779a6881L2384j1308k2455K2620L3310k4562l5948K8949K7109l8207k7510L8541
791F042K7619l8084k3461M5025J6702n0983j6818M0318O488m3453o227M7660P083
804A7911l8069Q653L9409p117l1660Q067K7899j2708k3497K0014J9502j6902o723
$$ plain form
817 4779 22067 22953 2174 -2403 11366 -1531 -22686 -7614 5846 -13127 -22112 1322 11719
830 11719 -16799 -26386 6256 7401 -28764 -23035 15728 14205 -18139 -6774 35016 22352 -16980
843 -16980 -355 31698 10176 -22349 -3470 29212 8299 -20164 5524 28757 2584 -19237
855 -19237 52 15929 -6863 -22735 1612 13713 -3544 -6212 9649 13779 2078 -2970 5807
868 5807 4040 -3731 33 1473 -828 2692 4869 767 -4315 -772 2901 -9573 -16114 -2429 722
883 722 -11204 -11650 4237 10207 -6039 -8457 10541 9910 -6826 -6244 9541 12828 -1463 -2420 15245
898 15245 15468 447 -2135 6797 8954 -4529 -11550 139 4831 -5331 -10454 -3199 6074 -2351
912 -2351 -15779 -7082 4431 -4315 -16167 -8536 8773 3069 -13608 -2131 15610 4529 -11505
$$ packed form
817D779J7288Q86k0779m577J3769j2897k1155J5072J3460j8973q985K3434J0397
830A1719k8518r587L2642J145l6165N729L8763j523l2344J1365M1790j2664l9332
843a6980J6625L2053k1522l2525J8879L2682k0913k8463K5688K3233k6173k1821
855a9237J9289J5877k2792j5872K4347J2101j7257k668J5861M130j1701n048Q777
868E807j767p771L764J440k301L520K177m102n082L543L673j2474o541J3685L151
883G22j1926m46J5887N970j6246k418J8998o31j6736N82J5785L287j4291r57J7665
898A5245K23j5021k582Q932K157j3483p021J1689M692j0162n123P255R273q425
912b351j3428Q697J1513q746j1852P631J7309n704j6677J1477J7741j1081j6034
$$ plain form
925 -11505 -2639 13911 4324 -14423 -1164 16088 2515 -9915 1654 13954 1624 -12028
937 -12028 463 9165 -4922 -9502 1684 4396 -3234 -4541 3909 2133 -6044 21 2503 -7344
951 -7344 -5673 3547 560 -9682 -4216 10772 283 -15566 -52 13016 -6211 -18834 961
964 961 15759 -7541 -20968 9179 19609 -10652 -17413 12847 18758 -13105 -17803 17184 18185
977 18185 -16165 -10627 21576 15968 -13165 -6894 22183 11006 -17008 -3429 17976 2804 -14767
990 -14767 -1020 14309 -1704 -14478 1980 6783 -11219 -12231 592 -2423 -14622 -8377 4694
1003 4694 -5675 -14642 2497 7767 -9963 -10260 8881 9122 -11152 -6611 19641 12456 -11131 2405
1017 2405 24878 10579 -12913 1637 24539 3503 -19455 3477 21314 -2640 -18762 2814
$$ packed form
925a1505Q866J6550r587j8747J3259J7252j3573j2430J1569J2300j2330j3652
937a2028J2491Q702j4087m580J1186K712p630j307Q450j776q177O065K482r847
951g344J671R220k987j0242N466J4988j0489j5849J5514J3068j9227j2623J9795
964I61J4798k3300j3427L0147J0430l0261o761L0260N911l1863m698L4987J001
977A8185l4350N538L2203n608k9133O271K9077j1177k8014J3579K1405j5172j7571
990a4767J3747J5329j6013j2774J6458M803j8002j012J2823l015j2199O245J3071
1003D694j0369q967J7139N270j7730k97J9141K41k0274M541K6252p185k3587J3536
1017B405K2473j4299k3492J4550K2902k1036k2958K2932J7837k3954j6122K1576
$$ plain form
1029 2814 17531 -8057 -22389 2610 9794 -13804 -18495 2710 8959 -9685 -12094 8081 8115
1042 8115 -8454 -5933 5112 3243 -6021 -3629 5303 1574 -3045 2572 2127 -2952 -1029 -185 -4144
1057 -4144 -7181 -1293 3261 -5354 -5341 7228 6695 -3273 -1738 8622 8406 -4580 -2304 12724 9257
1072 9257 -2699 2091 13075 9443 -4363 -3128 7874 914 -11637 -8122 109 -1160 -10510 -10197
1086 -10197 668 -778 -10385 -10565 -3269 -203 -6597 -9184 2231 8381 1375 -726 7703 14649
1100 14649 5865 -3118 6732 13838 2622 -3884 5888 13576 3266 -6447 4683 9882 -4714 -10336
1114 -10336 -1496 2633 -6338 -10091 1388 5681 -3811 -2633 4820 3375 -2169 -1657 3133 841 -2025
1129 -2025 4614 5040 -1146 2589 6910 169 -6689 -1597 4442 -6780 -13523 1986 6841 -7579
$$ packed form
1029B814J4717k5588j4332K4999P184k3598m691K1205O249j8644k409K0175L4
1042H115j6569K521J1045j869r264K392Q932l729m619N617m45n079J923Q44l959
1057d144l037N888M554q615J3J2569n33r968J535J0360k16j2986K276J5028l467
1072I257j1956M790J0984l632j3806J235J1002o960j2551L515Q231j269r350L13
1086a0197J0865j446r607j80P296L066o394k587J1415O150p006k101Q429O946
1100A4649q784q983R850P106j1216o506R772P688j0310r713J1130N199j4596n622
1114a0336Q840M129q971l753J1479M293r492J178P453j445n544N12M790k292k866
1129b025O639M26o186L735M321o741o858N092O039j1222o743J5509M855j4420
$$ plain form
1143 -7579 -9325 7825 11176 -7843 -10399 12241 11479 -10282 -4720 18516 15285 -6065 7 22852
1157 22852 12049 -12129 -1598 15182 1352 -16670 -4717 12093 -2535 -17717 -1716 7239
1169 7239 -8988 -17021 -3717 2515 -10978 -12726 4512 4911 -5976 936 10895 4178 -3068 4533
1183 4533 10554 -1112 -3839 10396 9054 -4487 -442 11650 4565 -11235 -5525 8958 -4420
1196 -4420 -19205 -2917 9636 -5127 -15451 3046 15236 -5259 -14292 7598 12627 -7729
1208 -7729 -10281 10106 14656 -5329 -6552 13790 10333 -9354 -7840 5757 1721 -13926 -10477
1221 -10477 4066 -1350 -11771 -4247 3014 -2813 -8331 -3192 1769 -3560 -3474 4661 4197 2402 7430
1236 7430 9424 5931 3261 7121 7129 -1624 -1403 6181 3049 -5130 -2537 4756 598 -10824 -7635 1405
$$ packed form
1143g579j746J7150L351j9019k556K2640p62k1761N562K3236l231k1350O072K2845
1157B2852j0803k4178J0531J6780j3830j8022J1953J6810j4628j5182J6001Q955
1169G239j6227q033J3304O232j3493j748J7238L99j0887O912R959o717p246P601
1183D533O021j1666k727J4235j342j3541M045J2092p085j5800N710J4483j3378
1196d420j4785J6288J2553j4763j0324J8497J2190k0495r033K1890N029k0356
1208g729k552K0387M550j9985j223K0342l457j9687J514J3597m036j5647L449
1221a0477J4543n416j0421P524P261n827n518N139M961n329Q6Q135m64j795N028
1236G430J994l493k670L860Qq753K21P584l132q179K593P293m158j1422L189R040
$$ plain form
1252 1405 -6484 -14254 -7063 1759 -2498 -8846 -995 8262 1208 -4541 1800 7203 3398 -2944 1476
1267 1476 9551 5381 -623 2976 6946 3913 -3283 -4240 1220 -711 -7122 -6209 -296 1916 -3680
1282 -3680 -6310 2621 3990 -4319 -5139 2200 4957 -1708 -3197 7002 8412 -76 174 5970 5183
1297 5183 -2823 -4637 1515 406 -6398 -3505 584 -1526 -4530 -3192 -1184 -3993 -5380 -1060 -2107
1312 -2107 -4286 1605 4560 1099 895 6746 8546 -308 -1628 8275 5729 -5155 -2233 8316 5474
1327 5474 -7748 -4625 8852 569 -14155 -6046 5629 -3238 -14976 -4252 9620 -1680 -11387
1340 -11387 2755 11272 -1554 -8346 3861 11105 -1973 -6296 8299 10507 -2388 -2659 7424
1353 7424 5416 -6295 -4954 4444 -1823 -9036 -1583 2670 -3655 -5689 1797 3749 -5244 -3930 6062
$$ packed form
1252A405p889p770P191Q822m257o348P851R257p054n749O341N403l805o342M420
1267A476Q075m170o004L599L970l033p196r57N460j931o411R13N913K212n596
1282c680k630Q931J369q309q20P339K757o665j489J0199J410q488K50N796p87
1297E183q006j814O152j109o804K893M089k110l004J338K008k809j387M320j047
1312b107k179N891K955l461k04N851J800q854j320R903k546j0884K922J0549k842
1327E474j3222L123J3477q283j4724Q109J1675q867j1738J0724J3872j1300r707
1340a1387J4142Q517j2826o792J2207P244j3078m323J4595K208j2895k71J0083
1353G424k008j1711J341R398o267p213P453M253o325k034P486J952q993J314R992
$$ plain form
1368 6062 1789 -5856 1924 10244 3629 -3877 5564 13252 -379 -7220 5971 8444 -6113 -9690
1382 -9690 4233 6702 -9729 -10238 5917 3164 -12049 -8969 4796 2200 -10941 -5414 9592
1395 9592 4193 -5800 2062 11747 5413 -3389 3455 11056 2126 -3196 5278 6629 60 -2045 2042
1410 2042 1792 -4980 -4848 -734 -4708 -7058 -2933 -1987 -4410 -4323 927 1715 -4031 -1300 5504 2058
1426 2058 -2404 2193 7923 4276 -1709 4168 9585 1644 -3661 1767 4378 -2105 -7257 -1051 2716
1441 2716 -4838 -7483 -776 1174 -3265 -6550 -1251 2956 -1987 -3292 1959 4649 3004 839 3232
1456 3232 6842 3614 34 1759 3482 2029 -2048 -2468 2229 216 -4892 -4027 -848 -1823 -6138 -6095
1472 -6095 -562 -1329 -5576 -2369 2204 2080 -763 596 5309 3499 460 3222 4611 3067 1911
$$ packed form
1368F062m273p645P780Q320o615p506R441P688j3631o841J3191K473j4557l577
1382i690J3923K469j6431n09J6155k753j5213L080J3765k596j3141N527J5006
1395I592n399r993P862R685o334q802O844P601q930n322Q474J351o569k105M087
1410B042k50o772J32M114l974k350M125R46k423Q7N250P88n746K731O804l446
1426B058m462M597N730l647n985N877N417p941n305N428K611o483n152O206L767
1441B716p554k645O707J950m439l285N299M207m943j305N251K690j645k165K393
1456C232L610l228l580J725J723j453m077m20M697k013n108Q65L179r75m315M3
1472f095N533p67m247L207M573j24k843J359M713j810l039K762J389j544j156
$$ plain form
1487 1911 2765 3222 1257 648 1636 -1581 -3151 -422 -1578 -5020 -3934 -261 -557 -5391 -3160 3776
1503 3776 487 -5448 -182 6127 1784 -4569 1593 9666 1769 -5067 3618 8647 -677 -6509 1452
1518 1452 6260 -5000 -8967 1885 3569 -6475 -7753 1850 3132 -6734 -5878 4755 2290 -5278
1532 -5278 -845 6524 3324 -2258 2293 7837 1507 -1981 4338 4503 -1802 -1694 3149 1358 -5350
1547 -5350 -2620 3072 -3153 -7561 -1170 1988 -4836 -7737 1310 4174 -5258 -4927 6173 5346 -4116
1562 -4116 -2153 7903 6067 -5280 -989 9534 3415 -6304 -417 7209 674 -8251 -1692 5192
1576 5192 -3731 -8992 -1102 2955 -3938 -6971 414 4110 -3166 -3461 3838 3498 -1001 141 4846
1591 4846 3736 -327 2541 5515 1297 -170 2928 2394 -1815 -2018 1250 -140 -5072 -2414 1056
$$ packed form
1487A911Q54M57j965o09R88l217j570K729j156l442J086L673k96m834K231O936
1503C776l289n935N266O309m343o353O162Q073p897o836Q685N029r324n832P961
1518A452M808j1260l967J0852J684j0044j278R603J282r866Q56J0633k465p568
1532e278M433P369l200n582M551N544o330l488O319J65o305J08M843j791o708
1547e350K730N692o225m408O391L158o824k901R047K864r432L31J1100q27r462
1562d116J963J0056j836j1347M291J0523o119r719N887P626o535q925O559O884
1576E192q923n261P890M057o893l033P385L696p276k95P299l40m499J142M705
1591D846j110m063K868K974m218j467L098n34m209k03L268j390m932K658L470
$$ plain form
1606 1056 -2662 -5592 -1368 1450 -2385 -5284 212 3863 -2034 -2518 3622 5069 213 -1152 4255
1621 4255 5557 -978 -1271 3619 2928 -1668 -2393 1533 1720 -3117 -3397 -29 -559 -3079 -3387 -632 1015
1638 1015 -1646 -1647 1305 1914 1467 142 1450 4131 2144 89 1894 3057 1967 -621 49 2627
1654 2627 225 -3003 -1111 -215 -1997 -3449 -2917 -411 -2096 -3091 -763 -540 -1091 -424 446 675 318
1671 318 916 2494 741 1015 3511 1824 -236 831 2243 620 -3138 -748 2391 -2214 -4946 -402
1687 -402 1878 -2197 -5358 45 3521 -2793 -4403 3016 4511 -1846 -2235 4742 6146 -1901 -1594 6096
1703 6096 3721 -3286 -1543 4258 1871 -4903 -2275 3169 -1282 -5849 -1301 1219 -2645 -4996 -749
1718 -749 1937 -2626 -2424 3199 1904 -1174 1035 4474 2274 -1657 2548 5440 3 -1634 3321
$$ packed form
1606A056l718k930M224K818l835k899N496L651n897m84O140J447m856j365N407
1621D255J302o535k93M890o91m596p25L926J87m837k80L368n30k520l08K755J647
1638A015k661jK952O09m47j325J308K681j987k055J805J163j090k588O70K578
1654B627k402l228J892Q96j782j452N32K506j685r95K328K23n51O67Q70K29l57
1671C18N98J578j753K74K496j687k060J067J412j623l758K390L139m605k732M544
1687d02K280m075l161N403L476o314j610P419J495o357l89O977J404q047L07P690
1703F096k375p007J743N801k387o774K628N444m451m567M548K520l864k351M247
1718g49K686m563K02N623j295l078K209L439k200l931M205K892n437j637M955
$$ plain form
1733 3321 3689 -2384 -3075 2654 1888 -5818 -3890 3054 -318 -6683 -2450 4008 505 -5936 73 6374
1749 6374 104 -4302 2597 6500 516 -2855 3631 6465 -631 -2444 3301 3555 -2517 -3331 1600
1764 1600 1174 -5013 -3697 1312 -1239 -4673 -1920 639 -1418 -3541 125 1871 -1462 -636 2732
1779 2732 2291 177 1236 4058 2360 -1246 1758 3928 -287 -2223 1207 2094 -2135 -3781 893
1794 893 1225 -3964 -3941 617 135 -3663 -3050 1431 1606 -2559 -879 3052 1867 -715 78 2999 2352
1811 2352 -1215 130 2573 1012 -870 -617 811 60 -2337 -1568 -810 -1367 -1760 -1933 -933 138 -1276
1828 -1276 -1192 351 564 208 -301 1003 2479 972 516 2039 1686 1193 481 610 1616 -180 -1145 -125
1846 -125 -583 -898 -1140 -1237 -1264 -1501 -1286 -848 -1898 -999 1168 -408 -744 1410 2277 919 -482 2026
$$ packed form
1733C321L68o073o91N729p66p706J928O944l372o365M233O458l503o441O009O301
1749F374o270m406O899L903n984l371O486K834p096j813N745K54o072q14M931
1764A600m26o187J316N009k551l434K753K559k057k123L666J746l333Q26L368
1779B732m41k114J059K822j698l606L004K170m215j936L430Q87m229j646M674
1794H93L32n189K3M558m82l798O13M481J75m165J680L931j185k582P93K921o47
1811B352l567J345K443j561j882K53J428p51k397P69P58n57l93j73J000J071j414
1828a276Q4J543K13l56n09J304J476j507m56J523l53m93p12J29J006j796r65J020
1846a25m58l15k42r7k7k37K15M38j050Q99K167j576l36K154Q67j358j401K508
$$ plain form
1864 2026 3867 -89 -820 2458 2509 -630 -1672 2085 2503 -2719 -2888 1847 469 -4073 -2806 1296
1880 1296 315 -4517 -1667 2936 276 -2602 248 3457 1171 -1959 1357 4331 282 -1396 2541
1895 2541 2881 -754 -1716 1689 1137 -3095 -1949 1094 -1498 -3502 -1046 722 -1575 -2938 592 2004
1911 2004 -2186 -1122 3020 2327 -1244 305 4857 3115 -1963 1096 4941 650 -3027 580 3319
1926 3319 -1150 -5119 245 2252 -3821 -4978 132 808 -3859 -4685 893 1809 -3240 -2074 3406 2155
1942 2155 -1113 365 3888 2622 -1043 1533 4162 1057 -786 1579 2241 -523 -2002 704 611 -2968
1958 -2968 -2150 328 -1246 -2851 -1236 792 -832 -2629 853 2114 -986 -1048 2094 2081 -559 -372
1974 -372 3025 2305 -1640 -244 2542 312 -2350 -1285 1067 -239 -3326 -1398 1002 -1224 -2619
$$ packed form
1864B026J841l956p31L278N1l139j042L757M18n222j69M735j378m542J267M102
1880A296r81m832K850M603k660k878K850L209k286l130L316K974m049j678L937
1895B541L40l635r62L405n52m232J146L043k592k004K456J768k297j363L530J412
1911B004m190J064M142o93l571J549M552j742n078L059L845m291l677L607K739
1926C319m469l969N364K007o073j157N110O76m667q26N578R16n049J166N480j251
1942B155l268J478L523j266l665K576K629l105j843K365O62k764j479K706r3l579
1958b968Q18K478j574j605J615K028j624j797L482J261l100o2L142j3k640J87
1974c72L397p20l945J396K786k230k662J065K352j306l087J928K400k226j395
$$ plain form
1989 -2619 -992 1008 161 -1819 643 2358 354 -42 1874 2487 1743 538 1527 1901 558 358 291
2006 291 275 24 -1125 -736 -628 -1262 -1265 -1566 -1593 -1005 -1270 -1465 -394 -409 -156 -410 144 952 510 732 1257
2027 1257 981 850 1011 324 425 544 485 138 -817 60 381 -1361 -1335 183 -40 -1056 -1289 850 1086
2046 1086 -1230 -594 2084 1274 -880 -245 2435 1788 -1706 -158 2536 50 -2107 -609 1168 -821
2062 -821 -3158 -1100 1255 -1835 -3362 -334 773 -1372 -2325 1014 1851 -1434 -589 2305 1885 -113
2078 -113 730 2798 1966 -319 1510 2936 -54 -712 1286 1106 -1109 -1644 1021 80 -3282 -1956 996
2095 996 -949 -3028 -1266 1618 -237 -3158 845 2868 -879 -1806 1933 2890 -659 -1806 2364 2859
2111 2859 -1598 -1118 2369 1551 -2141 -1459 2049 491 -2963 -1169 1708 -771 -2266 -101 1735 -15
$$ packed form
1989b619J627K000q47j980K462J715k004l96J916O13p44j205R89L74j343k00o7
2006B91j6k51j149L89J08o34ll01k7N88k65j95J071j5K53k54N54Q08m42K22N25
2027A257k76j31J61o87J01J19n9l47r55Q77L21j742K6J518k23j016k33K139K36
2046A086k316O36K678q10k154O35K680o47l494J548K694k486k157J498J777j989
2062h21k337K058K355l090j527L028J107k145r53L339Q37l285Q45K894m20j998
2078a13Q43K068q32k285J829J426k990o58J998j80k215n35K665r41l362J326K952
2095I96j945k079J762K884j855k921M003K023l747r27L739R57l549j147M170M95
2111B859m457M80L487q18l692O82L508j558l454J794K877k479j495K165J836j750
$$ plain form
2127 -15 -1742 1285 2307 -332 -637 1856 1635 -658 -236 1966 958 -1529 -5 1277 -1109 -2003
2143 -2003 -230 548 -1692 -2698 -41 -72 -2499 -1508 730 529 -1555 -848 2009 993 -1313 622
2159 622 2728 840 -600 893 2518 739 -887 1270 2083 -643 -1031 520 678 -949 -1793 -91
$$ packed form
2127a5j727L027J022k639l05K493k21k293M22K202j008k487J524J282k386q94
2143b003J773P78k240j006K657l1k427R91K238k01k084P07K857j016k306J935
2159F22K106j888j440J493J625j779j626K157Q13k726l88J551J58j627q44J702
$$ [...]
8191A9
##END NTUPLES=NMR FID
##END=
