##TITLE=1H_Pr 25mg
 CDCl3
 8 sc, 
 17.10.2022
##JCAMPDX= 6.0         $$ Bruker NMR JCAMP-DX V2.0
##DATA TYPE= NMR FID
##DATA CLASS= NTUPLES
##ORIGIN= UXNMR, Bruker Analytische Messtechnik GmbH
##OWNER= root
$$ XWIN-NMR		Version 3.5
$$ Mon Oct 17 15:54:22 2022 Russian Standard Time (UT+4h)  she@DPX200
##.OBSERVE FREQUENCY= 200.1313499994
##.OBSERVE NUCLEUS= ^1H
##.DELAY= (6, 6)
##.ACQUISITION MODE= SIMULTANEOUS
##.ACQUISITION SCHEME= undefined
##.AVERAGES= 8
##.DIGITISER RES= 18
##SPECTROMETER/DATA SYSTEM= spect
##.PULSE SEQUENCE= zg30
##.SOLVENT NAME= CDCl3
##.SHIFT REFERENCE= (INTERNAL, CDCl3, 0, 15.7039)
##AUDIT TRAIL= $$ (NUMBER, WHEN, WHO, WHERE, WHAT)
$$ ##TITLE= Audit trail, XWIN-NMR		Version 3.5
$$ ##JCAMPDX= 5.01
$$ ##ORIGIN= Bruker BioSpin GmbH
$$ ##OWNER= she
$$ F:/spectra/data/she/nmr/H-F/1/audita.txt
$$ ##AUDIT TRAIL=  $$ (NUMBER, WHEN, WHO, WHERE, WHAT)
(   1,<2022-10-17 15:53:12.01 +0400>,<she>,<DPX200>,
      <created by zg, POWCHK disabled, PULCHK disabled
       configuration hash MD5:
       00 E9 B6 7A A2 85 ED C7 34 08 36 98 17 FE 4E 26
       data hash MD5: 16K
       67 58 E5 DC 8D 3A 78 74 6D C6 A1 AB 33 9B B4 4D>)
$$ ##END=
$$ 
$$ hash MD5
$$ 06 3D 7E 88 BA BA 59 E4 D2 06 5C 7A AA 85 26 21
##$RELAX= 
##$RELAX= 
##$RELAX= 
##$RELAX= 
##$RELAX= 
##$RELAX= 
$$ Bruker specific parameters
$$ --------------------------
##$DU= <F:/spectra>
##$EXPNO= 1
##$NAME= <H-F>
##$PROCNO= 1
##$TYPE= <nmr>
##$USER= <she>
##$AMP= (0..31)
100 100 100 100 100 100 100 100 100 100 100 100 100 100 100 100 100 100 
100 100 100 100 100 100 100 100 100 100 100 100 100 100 
##$AQSEQ= 0
##$AQ_mod= 1
##$AUNM= <au_zg>
##$AUTOPOS= <>
##$BF1= 200.13
##$BF2= 200.13
##$BF3= 200.13
##$BF4= 200.13
##$BF5= 200.13
##$BF6= 200.13
##$BF7= 200.13
##$BF8= 200.13
##$BYTORDA= 1
##$CFDGTYP= 0
##$CFRGTYP= 5
##$CHEMSTR= <none>
##$CNST= (0..31)
1 1 145 1 1 1 1 1 1 1 1 1 1 1 1 1 1 1 1 1 1 1 1 1 1 1 1 1 1 1 1 1 
##$CPDPRG= <>
##$CPDPRG1= <>
##$CPDPRG2= <>
##$CPDPRG3= <>
##$CPDPRG4= <mlev>
##$CPDPRG5= <mlev>
##$CPDPRG6= <mlev>
##$CPDPRG7= <mlev>
##$CPDPRG8= <mlev>
##$CPDPRGB= <>
##$CPDPRGT= <>
##$D= (0..31)
0 1.2 0 0 0 0 0 0 0 0.06 0 0.03 0 0 0 0 0.0002 0 0 0 0 0 0 0 0 0 0 0 0 
0 0 0 
##$DATE= 1666007591
##$DBL= (0..7)
120 120 120 120 120 120 120 120 
##$DBP= (0..7)
150 150 150 150 150 150 150 150 
##$DBP07= 0
##$DBPNAM0= <>
##$DBPNAM1= <>
##$DBPNAM2= <>
##$DBPNAM3= <>
##$DBPNAM4= <>
##$DBPNAM5= <>
##$DBPNAM6= <>
##$DBPNAM7= <>
##$DBPOAL= (0..7)
0.5 0.5 0.5 0.5 0.5 0.5 0.5 0.5 
##$DBPOFFS= (0..7)
0 0 0 0 0 0 0 0 
##$DE= 6
##$DECBNUC= <off>
##$DECIM= 32
##$DECNUC= <off>
##$DECSTAT= 4
##$DIGMOD= 1
##$DIGTYP= 9
##$DL= (0..7)
0 120 120 120 120 120 120 120 
##$DP= (0..7)
150 150 150 150 150 150 150 150 
##$DP07= 0
##$DPNAME0= <>
##$DPNAME1= <>
##$DPNAME2= <>
##$DPNAME3= <>
##$DPNAME4= <>
##$DPNAME5= <>
##$DPNAME6= <>
##$DPNAME7= <>
##$DPOAL= (0..7)
0.5 0.5 0.5 0.5 0.5 0.5 0.5 0.5 
##$DPOFFS= (0..7)
0 0 0 0 0 0 0 0 
##$DQDMODE= 0
##$DR= 18
##$DS= 0
##$DSLIST= <SSSSSSSSSSSSSSS>
$$ [...]
##$SUBNAM2= <"">
##$SUBNAM3= <"">
##$SUBNAM4= <"">
##$SUBNAM5= <"">
##$SUBNAM6= <"">
##$SUBNAM7= <"">
##$SUBNAM8= <"">
##$SUBNAM9= <"">
##$SW= 18.0517283424941
##$SWIBOX= (0..15)
0 0 2 0 0 0 0 0 0 0 0 0 0 0 0 0 
##$SW_h= 3612.71676300578
##$TD= 16384
##$TD0= 1
##$TE= 0
##$TE2= 300
##$TE3= 300
##$TEG= 300
##$TL= (0..7)
0 120 120 120 120 120 120 120 
##$TP= (0..7)
150 150 150 150 150 150 150 150 
##$TP07= 0
##$TPNAME0= <>
##$TPNAME1= <>
##$TPNAME2= <>
##$TPNAME3= <>
##$TPNAME4= <>
##$TPNAME5= <>
##$TPNAME6= <>
##$TPNAME7= <>
##$TPOAL= (0..7)
0.5 0.5 0.5 0.5 0.5 0.5 0.5 0.5 
##$TPOFFS= (0..7)
0 0 0 0 0 0 0 0 
##$TUNHIN= 0
##$TUNHOUT= 0
##$TUNXOUT= 0
##$USERA1= <user>
##$USERA2= <user>
##$USERA3= <user>
##$USERA4= <user>
##$USERA5= <user>
##$V9= 5
##$VALIST= <valist>
##$VCLIST= <CCCCCCCCCCCCCCC>
##$VD= 0
##$VDLIST= <DDDDDDDDDDDDDDD>
##$VPLIST= <PPPPPPPPPPPPPPP>
##$VTLIST= <TTTTTTTTTTTTTTT>
##$WBST= 1024
##$WBSW= 4
##$XGAIN= (0..3)
0 0 0 0 
##$XL= 0
##$YL= 0
##$YMAX_a= 195659
##$YMIN_a= -257091
##$ZGOPTNS= <>
##$ZL1= 120
##$ZL2= 120
##$ZL3= 120
##$ZL4= 120
##$ABSF1= 10
##$ABSF2= 0
##$ABSG= 5
##$ABSL= 3
##$ALPHA= 0
##$AQORDER= 0
##$ASSFAC= 0
##$ASSFACI= 0
##$ASSFACX= 0
##$ASSWID= 0
##$AUNMP= <proc_1d>
##$AZFE= 0.1
##$AZFW= 0.1
##$BCFW= 1
##$BC_mod= 2
##$BYTORDP= 1
##$COROFFS= 0
##$CY= 11.3945322036743
##$DATMOD= 1
##$DC= 2
##$DFILT= <>
##$DTYPP= 0
##$F1P= 2.36226072786647
##$F2P= -0.459571619588291
##$FCOR= 0.5
##$FTSIZE= 0
##$FT_mod= 4
##$GAMMA= 1
##$GB= 0.15
##$INTBC= 1
##$INTSCL= 1
##$ISEN= 128
##$LB= 0.24
##$LEV0= 0
##$LPBIN= 0
##$MAXI= 10000
##$MC2= 0
##$MEAN= 0
##$ME_mod= 0
##$MI= 1.114404
##$NCOEF= 0
##$NC_proc= 0
##$NLEV= 6
##$NOISF1= 3.799351
##$NOISF2= 2.8
##$NSP= 1
##$NTH_PI= 0
##$NZP= 0
##$OFFSET= 15.70392
##$PC= 1
##$PHC0= -18043.29
##$PHC1= 22.80069
##$PH_mod= 1
##$PKNL= yes
##$PPARMOD= 0
##$PSCAL= 0
##$PSIGN= 0
##$REVERSE= no
##$SF= 200.130013532006
##$SI= 16384
##$SIGF1= 3
##$SIGF2= 2
##$SINO= 400
##$SIOLD= 16384
##$SREGLST= <1H.CDCl3>
##$SSB= 0
##$STSI= 0
##$STSR= 0
##$SW_p= 3612.71676300578
##$SYMM= 0
##$S_DEV= 0
##$TDeff= 0
##$TDoff= 0
##$TI= <>
##$TILT= no
##$TM1= 0
##$TM2= 0
##$TOPLEV= 0
##$USERP1= <user>
##$USERP2= <user>
##$USERP3= <user>
##$USERP4= <user>
##$USERP5= <user>
##$WDW= 1
##$XDIM= 8192
##$YMAX_p= 0
##$YMIN_p= 0
$$ End of Bruker specific parameters
$$ ---------------------------------
##NTUPLES= NMR FID
##VAR_NAME=  TIME,          FID/REAL,        FID/IMAG
##SYMBOL=    X,             R,               I
##VAR_TYPE=  INDEPENDENT,   DEPENDENT,       DEPENDENT
##VAR_FORM=  AFFN,          ASDF,            ASDF
##VAR_DIM=   8192,          8192,            8192
##UNITS=     SECONDS,       ARBITRARY UNITS, ARBITRARY UNITS
##FACTOR=    0.0002768,     1,               1
##FIRST=     0,             0,               0
##LAST=      2.2672688,     0,               0
##MIN=       0,             -257091,         0
##MAX=       2.2672688,     195659,          0
$$ Real data points
##PAGE= N=1
##DATA TABLE= (X++(R..R)), XYDATA
$$ [...]
2185B36J164k176p03J845Q54j709p35J358J215j400j133J948Q86k033m57J521
2201F81N93j732l48J526L78j655k67J543p0j659m39K005N60k179l85J814P95j818
2219f57n56J574N83j567l08J611L28j822L48J659j75j806O9J844j0k231N01J632
2237A017l6j966J66J652k49j594J66J961p44j671L34J775m56j451N14J643m82
2254E79j983J027J582n22j583N37J651r41j350N85J882p82j750P03J560r14j518
2271a237O63J700r65j312P74J574j165j391J092J512r29j695J097J190p65j618
2287a475J352J458j289j003Q31J751j406r71P61J359j201j273J292R98j380j162
2303a358J619J140j795j099J335J178j490p42J369Q52j293r37J285Q38j339p57
$$ y = [236, 1400, -776, -1479, 366, 1220, -489, -1224, 134, 1349, -51, -1184, 764, 1650, -383, -840, 681, 1274, -458, -806, 720, 1098, -557, -824, 719, 649, -1010, -1449, 556, 1116, -1063, -1448, 366, 1161, -657, -1213, 361, 944, -623, -931, 680, 1008, -814, -466, 1193, 1018, -788, -719, 1125, 1115, -1116, -615, 1017, 981, -985, -819, 833, 584, -1010, -844, 1117, 373, -1298, -964, 811, 355, -1096, -582, 1061, 579, -1404, -377, 1205, 683, -900, -363, 1288, 347, -1003, -418, 1464, 682, -1068, -365, 1195, 281, -1237, -574, 1126, 161, -1151, -377, 1197, 32, -1359, -267, 1245, 316, -1379, -282, 908, 143, -1475, -123, 1335, 46, -957, -126, 1625, 219, -752, 9, 1368, 167, -1106, 186, 1184, -196, -1358, 261, 1401, -394, -1493, -158, 1020, -470, -1212, 157, 1009, -284, -1221, 64, 902, -437, -1194]
2319a194J456J035j769o58J854O35j479q60J488N77j546l01J219R19j893m03J451
2336E31L44j535m53J484O50j925j96J486L80j511l60J622L73j553k61J446N28
2353A050j594Q6J450j58j621p7J873M4j737Q9J394J19j877L97J466k84j435L6
2371g79J505k16j523M22J578n77j357K16J564m84j493O30J592p86j299N60J287
2388H40l54j325K73J528m50j514Q98J399o36j598Q54J159j051j001N34J347p45
2405A58j376P58J285o97j525J015J437r88j004P13J195q97j139R38J200r44j111
2422i82J167J033j244q31J097J104j516q18J034J183j247q05R43N79j086r57J496
2439A50P56j195o46P17J171j297r02J371O65j088o07J347M77j010p55J534M56
$$ y = [-1194, 262, 1297, -472, -1130, 724, 1359, -120, -980, 508, 1085, -461, -762, 457, 1376, -517, -920, 531, 875, -660, -1113, 371, 1021, -904, -1100, 386, 766, -745, -1105, 517, 890, -663, -924, 522, 1050, -544, -458, 992, 834, -787, -864, 1009, 1053, -684, -595, 799, 918, -959, -562, 904, 620, -815, -779, 726, 510, -1013, -591, 987, 410, -947, -731, 833, 349, -1144, -514, 1078, 292, -1007, -447, 840, 486, -839, -566, 962, 512, -1002, -104, 1295, 659, -939, -85, 1074, 23, -978, -444, 903, 158, -1218, -460, 825, 128, -1397, -382, 1055, 67, -937, -224, 971, 74, -1065, -127, 1073, 129, -982, 185, 1218, -26, -857, 240, 1344, -172, -990, 44, 1227, -20, -825, 118, 697, -389, -1346, 150, 906, -289, -935, -218, 953, -344, -1246, 125, 790, -298, -905, 442, 919, -91, -846, 688, 1144]
2456A144j339o54J312J053j994n00J572M4r42m52J159M41j804k14J676N5j086
2473e29l66J385k7j179l87J632K82j600j20J464N8j059L2J152l9j354L25J146
2491H16r7j419J07J415k65j437K93J326k79j240o1J642l42j199j7J466k99j365
2509i55M21J040k30j248M46R58J7j381N42J498p24j304Q77Q87n22j116N24J566
2527A296j020j211R86R84r21j127P38J248r11j240Q42J251r06j284J138J025q87
2544Ar93Q10J011r47p79P87J026q28q40J068R03j214r36R21Q01p16q45Q38P22
2563G90o90j042J141P85j285p72J163P97j011q62Q36J106j338m61J161L69r95
2580c08l01Q58P59j176p40J332K97j091j64R45N06j360k40J209J95j201k04J134
$$ y = [1144, -195, -849, 463, 1516, -478, -978, 594, 638, -304, -756, 403, 844, -960, -1174, 502, 557, -529, -895, 490, 463, -716, -1103, 529, 811, -789, -909, 555, 613, -446, -414, 738, 699, -655, -330, 816, 719, -700, -593, 822, 557, -880, -587, 739, 460, -780, -841, 801, 459, -740, -757, 709, 410, -955, -534, 506, 276, -972, -526, 432, 449, -932, -390, 1108, 384, -920, -43, 844, 322, -794, -270, 1296, 276, -935, 51, 1035, 114, -1013, -275, 973, 62, -1178, -336, 915, 9, -1275, -137, 888, 1, -992, -182, 829, -118, -897, -110, 916, 88, -752, 316, 1219, 5, -931, -10, 791, 75, -770, 68, 790, 100, -942, 199, 984, -301, -1073, 90, 887, -124, -986, -150, 956, -382, -843, 318, 687, -308, -609, 249, 1008, -168, -908, 424, 721, -370, -534, 411, 917, -443, -683, 526, 721, -480, -684, 450]
2598D50J85j114n23J233N14j506m3J137K75j411oJ325J00j226Q7J336L3j221q6
2617d61J240p1j234J29J171k26j261L76R11k27j107M12J133j95j513K96J242l63
2635B52j112J93J455m85j084N17J020m82j163P21J051o87r27L94J249l82j191
2652f61L38R54j75j056K60J162n56j190O81J085n92j483Q50J149p33q73N18J061
2670G39q88o45Q70Q79r63o98N98J134j027n93O60O61o49o64P62P49j192l20J018
2689D31L37o29o94M78Q34q59r53J388L36r85n87R80M89r71m79J258N80j342n76
2708i64J471K03q22n58J015N45j020n89J142N57j033o88J098L55r95o86J118L75
2726E24r95j29Q37K89j105j80J138O8r27l04J258K05j042J07R18j25j061J64R29
$$ y = [450, 635, -479, -1002, 231, 745, -761, -804, 333, 608, -803, -809, 516, 616, -610, -523, 813, 846, -375, -461, 779, 708, -526, -397, 774, 548, -713, -337, 574, 347, -760, -348, 785, 590, -923, -627, 615, 252, -860, -667, 788, 303, -781, -264, 756, 274, -889, -168, 883, 196, -731, -337, 912, 530, -661, -323, 631, 456, -600, -340, 822, 266, -924, -243, 842, 250, -1233, -383, 766, 33, -840, -322, 739, -149, -794, 76, 955, -8, -706, -108, 1026, -1, -594, 66, 727, 78, -586, 176, 925, -267, -587, 431, 768, 139, -555, -77, 757, -102, -1055, 333, 669, -316, -903, 77, 566, -405, -884, 374, 954, -388, -964, 507, 710, -112, -670, 345, 890, -130, -719, 423, 980, -53, -741, 357, 712, -283, -969, 149, 524, -471, -600, 237, 526, -579, -759, 379, 447, -480, -784, 474, 679, -363, -256, 662, 537, -524, -360, 569]
2745E69j52j037K05J201l85r21Q0J153k69j179K66R92k96r21rJ313k30r80K37
2764c63R47j10j090K55Q39j71r60M79J050p24p34N80R63p34r66Q53J056r77o32
2783d39K13R85n01j095N22R65m59r02K42J303p65j130P84J116r26p63M25R98o13
2802d0o54R03L55n30o82P92O74p29p42Q97P68j178n56Q60Q35r05n28O67M30j025
2822c88k43O24M69q77o50J211N77r70n72J036L21q34l34J144K29j065m76R75O27
2841H04j046k81J230K75j235m56J180J71q54l53R89J45j127j96J231k11p86l04
2859h24J090Jo53j62R97k8j019J13R33o6o76j40R01j11j048M55P28N4q85J09R08
2880F77j77r81J6R98j39r55K89P57j72j233N16Q92m15q02L98R94n37n62J83P11
$$ y = [569, 417, -620, -415, 786, 401, -520, -440, 713, 444, -735, -469, 523, 227, -694, -703, 610, 380, -600, -363, 584, 474, -616, -361, 478, 307, -653, -174, 876, 152, -582, -2, 961, 227, -739, 114, 1170, 193, -439, -226, 759, 258, -837, -315, 650, 191, -711, -469, 834, 69, -1061, -277, 839, -87, -850, -425, 573, -40, -694, 209, 564, 34, -648, 144, 818, 89, -653, 244, 1012, -166, -722, 138, 973, 68, -460, 207, 637, -388, -631, -7, 462, -415, -1065, 146, 723, -247, -819, 217, 538, -296, -630, 514, 743, -322, -798, 177, 804, -242, -523, 707, 982, -253, -709, 471, 642, -212, -565, 424, 569, -558, -754, 477, 266, -520, -824, 266, 267, -386, -548, 449, 421, -598, -485, 448, 382, -294, -434, 467, 356, -692, -237, 491, 545, -340, -231, 677, 500, -481, -465, 533, 394, -561, -272, 485, 313, -920, -404, 488, 73, -729, -331, 663, 126, -436, -253, 458]
2900D58k37p38M10N75k48p94N11P86m74p91L89J055m73j120N32R69p06p19N93
2919b2M76l27p53L69Q34m29j032R00N01n61n60O61L60n19o39M61P87n56n18P15
2939A48P39r21o01P34L71m75l17L93P02j040l40Q44Qm05m04L39P84p67p83R15
2959g6N51o08o08P84O32r50j71N15N77p88l05P79K38r03j21Q14L42r11k34R66
2979E23K77j101R7L06L37q35k86J108k34l67k70R31j4q44j78J054j62n54k22Q88
2999D54K40j105R8J011r4r38J29R36j58j109L04O01J54r10K77M73j11p86J22R48
3019E36l85r10L48Q53k82p84L25O33n7q33M18P51l57q58N78O95k90r87O42Q21
3039H57n27n75J87P52o17o34N65P02n73o80M64M82o10k50L76L73k13n95O04J56
$$ y = [458, 221, -517, -107, 468, 220, -574, -63, 723, 249, -542, -153, 902, 429, -691, -159, 810, 104, -615, -22, 454, 127, -626, -257, 577, 148, -884, 16, 517, -44, -604, 57, 417, -102, -741, -280, 507, -49, -567, 148, 887, -34, -635, 99, 470, -5, -322, 71, 773, -267, -607, 237, 245, -160, -564, -225, 559, -208, -991, -76, 475, -133, -741, 43, 675, -275, -446, 69, 646, -142, -447, 332, 570, -333, -454, 360, 702, -209, -443, 523, 800, -301, -204, 102, 439, -396, -682, 426, 192, -175, -445, 486, 472, -372, -550, 504, 342, -212, -434, 454, 694, -411, -313, 698, 604, -334, -205, 731, 573, -536, -232, 369, 523, -387, -110, 363, 252, -534, -412, 536, 151, -759, -411, 442, 160, -624, -299, 334, 277, -556, -138, 613, 256, -602, -24, 671, 381, -606, 36, 857, 330, -245, -58, 694, 77, -557, 8, 710, 137, -543, -79, 403, -207, -457, -81, 292, 79, -516, 88, 244]
3059B44m69o51J039O55j152n82J229L15o89l88N11O47o81m66P66O27j165k48N93
3078A35L93n73m16O72K22q44mM13M84n01n20P78K48q66N2M64N37j193p8Q53J58
3099D14l64k10N03J11j019l5R45J91r09j6R73rj014j48Q13J98r40j49R98j48n44
3120c59l76R87J43q32Q3P14j00r49K97J012L8j125M62O64l45o09p1J012k24p41
3140c19J19P95l59n20nO91k08p98K74N07M1p10J91Q73l85q80M58O64j54q84J13
3161d96J205m82q82N60N77k06p60L67J298j052p29P94L94o35l73L15N77m84r42
3180i54Q84N79p70m16M99J028q15o03O10N07n87m09L33O99o49n43P26O31j053
3199c03k1O45K28o41l71Q41M19j088l85R24J11m67o16R17pl53l97N94N58q62l84
$$ y = [244, -225, -876, 163, 818, -334, -916, 313, 628, -61, -449, 62, 709, 28, -438, 328, 955, -210, -458, 135, 528, -45, -461, 211, 433, -411, -415, -2, 482, -19, -539, 239, 487, -379, -327, 137, 674, -519, -597, 256, 414, 50, -160, 343, 454, -565, -600, 345, 536, -373, -389, 584, 575, -439, -587, 226, 424, -516, -665, 333, 185, -359, -735, 252, 395, -437, -354, 360, 260, -689, -392, 620, 658, -467, -5, 659, 314, -295, -366, 646, 422, -319, -200, 595, 236, -284, -289, 402, 194, -604, -330, 177, 218, -492, -301, 572, 187, -693, -235, 429, 275, -609, -496, 709, 227, -655, -95, 482, 276, -484, -117, 1181, 129, -600, 194, 588, -47, -420, -105, 472, -12, -954, -70, 509, -261, -677, -178, 850, 35, -568, 42, 549, -38, -447, -114, 585, -64, -607, 119, 750, -303, -324, 321, 549, -92, -463, 378, 797, -291, -676, 248, 359, -108, -724, 193, 186, -167, -564, 30, 588, -274, -658]
3220f58Q95k3o28L5O21K52n94l23P49K53q31j50R87J24j290K06N56L64q59j88
3240e02P37M64j094M4O87K7p33p8Q43j50m53k3M49l9n23k6Q62l51o44L84N65j45
3262C01o60n5R66r7q06K17R06l47q06J73M76j4l98k21Q92m41o51M58K13Jo90L19
3284b64P59l67o28J37J211q14m26J11O17j39o44M34P49n54r12M86R12m51p94N50
3304b7O93p02l30L48M04k40n95M36L26n58l86L43P52m81m57N19L95n20n50N97
3324c3O14n75m82O10L38n42k29O02K24p33k77Q55J63p76j79N89K69o89j08N71
3344B12o3n40k12O90J68n39k94N49L98n12n6M51L33n52n36N56N76q31k24Q68R7
3365E39p47p7O15j41m75K7N85Q2n53j14N10j23m39J18L96J7p43o8R52J79r89K49
$$ y = [-658, 237, 214, -414, -379, 242, 494, -100, -423, 326, 579, -252, -402, 585, 709, -581, -375, 181, 545, -314, -502, 235, 699, -395, -351, 336, 363, -370, -448, 395, 245, -208, -231, 218, 179, -344, -370, 492, 141, -503, -119, 446, 301, -359, -414, 552, 455, -351, -134, 772, 425, -381, -208, 268, 254, -144, -365, 527, 86, -565, -107, 106, 107, -583, -264, 495, 128, -500, -363, 848, 34, -392, -281, 336, 197, -447, -13, 736, 182, -730, -244, 668, 217, -577, -27, 666, -36, -366, -18, 386, 146, -449, -13, 313, -245, -631, -288, 464, -17, -474, 45, 440, -80, -630, -33, 581, 6, -476, 134, 472, -70, -299, 303, 527, -206, -483, 372, 535, -241, -420, 169, 438, -251, -359, 212, 149, -391, -603, 87, 255, -284, -578, -29, 369, -143, -199, 252, 585, 33, -503, 53, 629, -202, -426, 442, 539, -208, -285, 330, 189, -286, -259, 326, 408, -145, -259, 251, 128, -311, -193, 203, 220, -523, -591, 361, 540, -449, -200]
3387b00N37l5r30M50N58l1o37L79M34j25p56L78N89m45o56L15N81m65l75M89K56
3408C11l21n03L23M31r9o87K41P53l58m95L93N17j55r62O71N22o56k67J67P94
3428F20n47l27L92L54l79m48K06M08l67l08L04M39m55k38M14K45m70m82P73M10
3448E44n26n03L32P37o77q8L83J88n30m56R29K62o12l76O54P4m16l57O96jo59
3469d02q4N62K07o15n3O14K71q51J32O82M3r25k13Q72K23o74k27R21K09j081L99
3490A0L63o1n08J8M10R6l25j36N24J49q27l5L67N63q01j55O39j11m55j01N93j01
3512A16n06J81N49n8q19K79J112o04n78J67N78l09l20j5M47j68n91M11M77l64
3532a5m19K60N15k02o98M66L54l54m87N12O25m83m78N50M47o69k35N51M85k22
$$ y = [-200, 337, 302, -628, -178, 380, 349, -288, 91, 525, 400, -356, 22, 611, 166, -490, -175, 406, -59, -434, 55, 311, -10, -513, -190, 241, 142, -545, -304, 449, 91, -404, -11, 506, 351, -611, 60, 582, -74, -341, -174, 620, 73, -254, 138, 492, 113, -335, -129, 279, -88, -396, -92, 347, -108, -346, 68, 313, -157, -639, 134, 544, 18, -485, -153, 584, -93, -181, 202, 390, -140, -596, 333, 595, -17, -393, 261, 335, -81, -438, 258, 257, -402, -486, 76, 283, -332, -385, 229, 500, -351, -219, 463, 506, -419, -632, 240, 463, -211, -438, 483, 692, -389, 10, 373, 312, -196, -178, 232, 328, 3, -133, 391, 540, -287, -322, 45, 608, -193, -348, 291, 180, -275, -376, 217, 116, -390, -209, 340, 282, -537, -258, 854, 250, -328, -161, 417, 108, -212, -227, 220, 52, -539, -128, 349, -15, -434, -174, 341, 139, -559, -93, 261, -93, -580, -68, 557, 74, -404, 146, 593, -76, -311, 240, 725, 503]
3552E03n95Q3M54l77k89L24L36k73j93L9N01m56o05O54L69m00n96O05K80n79l06
3573e21O02L74n50l41O96J50m44m23O79J98l52m03O67L74p75j16M03o0l33l17
3593d92Q52L86r97L5K28L07o23L8O22k14l37P2K13M76q23K0L93K36n71k26N38
3614A33J23l91k47O39M2p32K24M66J47o57J3P63l50o99K60M71L64q84J7M42j20
3635B4l03k16Q46l02m77J60M85j37l95K04K67L9p09L24O52k84m51Q6O64k21o96
3656d40N08K04qm97l3O94m23n09M75M22k86l94J05Q17o55l57L19K88m28k03K17
3677a84P50o27m61L78L17n8l82L65J88j36m72L53L87l25l17R9O67o12m76N00N14
3698D68m29o24O28L08m33l22O77L17p42o13Q97L46n87k03M85M32o16m19O48K37
$$ y = [503, -92, -9, 445, 68, -221, 103, 439, 166, -27, 12, 513, 57, -548, 106, 475, 75, -521, 84, 364, -215, -521, 81, 455, -95, -436, 260, 410, -34, -457, 222, 420, 68, -335, 332, 706, -69, -185, 218, 158, -175, -492, 360, 746, -251, -216, 12, 319, -304, -266, 356, 142, -195, -123, 90, 566, -257, -237, 156, 392, -179, -405, 133, 256, -135, -382, 257, 299, -433, -209, 257, 404, -253, -240, 523, 173, -526, -266, 205, 569, -315, -298, 144, 24, -279, -495, 351, 49, -428, -268, 217, 80, -315, -111, 156, 195, -514, -190, 462, 178, -273, -187, 477, 256, -440, 68, 272, 264, -233, -266, 428, 5, -504, -29, 393, 107, -287, -182, 635, -20, -377, -58, 230, -198, -401, -184, 566, -61, -522, -144, 173, 115, -267, 98, 286, 150, -322, 31, 418, 93, -224, -125, 542, -70, -546, -46, 468, 39, -585, 43, 351, -82, -404, 273, 590, -152, -765, 132, 478, -109, -312, 173, 605, -11, -430, 218, 455]
3718D55m80l39L80L25n97r5P54J8l73l48M40M16r12j90M89N84p25j58N80j59m02
3739c37r3P81j49m91M3M13j8n15pQ19k33l87n0O12p6n46P2N87j35l73j32O13r9
3762B99n37K81L68l79m34J80N90k5q00L12N28l79l50M63L80k80m62J22O81l53
3782B05p05L96M40k92l09L53K02k46m78M81M19k92o22M81L18j55m67L13L88m22
3802Hj94J39M95n62k23Q2N53l56k12J77M34m17l02L64N08m04l51K97K55l24l11
3823c44O81O9n07k4j38R46o58l51M85J67n88k81O09O5l07n6K57L07k48k80M74
3844B78J50m60k29M23R2n31l8M30L0j81m01O15J42m81j13M17L25p43j10L27J58
3865A00l06p1M59om99K66K83K36o35L7O69l64l87j07M60J09l41L2M56j0l60k32
$$ y = [455, -25, -364, 16, 341, -256, -351, 403, 421, 48, -300, 140, 556, -356, -546, -57, 527, -198, -356, 224, 65, -337, -430, 351, 202, -289, -246, 167, 149, -366, -373, 446, 213, -174, -224, 388, 312, -234, -162, 425, 290, -83, -215, 398, 299, -238, 43, 411, 32, -402, -222, 368, 343, -457, -145, 383, 4, -346, 117, 497, 217, -245, -123, 558, 205, -500, -104, 336, 44, -265, 88, 290, 44, -434, 47, 466, 174, -448, 33, 351, 196, -271, 42, 430, 8, -186, -47, 448, -114, -337, -255, 298, -58, -270, -93, 341, -76, -378, -14, 494, 90, -261, 36, 291, -33, -344, 337, 406, -101, -125, -263, 683, 25, -326, 159, 326, -262, -543, 66, 131, -176, -232, 25, 332, 84, -196, 278, 428, -32, -261, 162, 254, -277, -315, 115, 145, -36, -437, 178, 320, -161, -274, 143, 468, -275, -385, -58, 100, -206, -277, 182, 176, -323, -57, 226, 462, -173, -136, 533, 169, -218, -325, 135, 244, -97, -65, 391, 381, 21, -211]
3887b11L36j6l20o4N79J44q67K41K61K40n14j15N38k56m57J99O27k26m56M1M19
3908A23j76j92M37K0l59k59M14M62l02m09K58M19l03m06J74K60k38n22K98N74
3928B73k82j17K27K7j81k94L54K86m12k03K09M72n17j12K88J35N9n56L25K81j05
3949A57n85N77J9r9m25J76N14m45k60M14P4l71J8K82K37l51l15M07M30n63m66
3970e75O87M69p77M1L80Q1q48K2N75J48m87K25j43O60l16m23M16J53o33o8L92
3991b1m9j87n6M59N3k94l87Q84j16o67J4O24p5m06m8O87j38m63n6N40j34m05q4
4014c25N88p1l79J84K47k44k26J84J27J05o08K20M94k84k39J03L97m5m87K40L26
4035C07j72k79RL87j28l64J60M90m32M8J12L34m97l10O08l6l83k27J93N95l33
$$ y = [-211, 125, 109, -211, -275, 304, 448, -419, -178, 83, 323, -191, -306, 232, -24, -481, -282, 345, 119, -337, -296, 123, -53, -245, 192, 212, -147, -406, 8, 470, 168, -241, 17, 436, 133, -273, -99, 161, -77, -599, -301, 273, -9, -126, 101, 128, -53, -347, 7, 293, -119, -322, -113, 359, -158, -270, 18, 153, 212, -344, -19, 262, 157, -428, 149, 168, 69, -356, -180, 334, -111, -371, 43, 117, -254, -236, 46, 283, -68, -383, 24, 454, -109, -575, 112, 581, -196, -155, 225, 306, -542, -520, 55, 203, -284, -59, -202, 458, 142, -281, 135, 288, -345, -413, -21, -70, -257, -313, 146, 199, -95, -482, 402, 286, -381, -367, 257, 182, -224, -272, 415, 277, -186, -242, 298, 164, -241, -325, 263, 192, -187, -3, 244, 0, -226, -42, 85, 190, -418, -198, 296, 12, -227, -124, 273, 228, -259, -19, 307, 135, -144, -135, 252, 124, -240, -80, 410, -22, 26, 138, 472, -25, -335, 273, 237, -146, -373, -180, 415, 82]
4056H2l94K69L05j74o21K63L31j68k88K93M66m02k41M48K95n82m9L70K64n87j92
4077c12L09L45k29k45R3L88o96L0K65K78n40j99M49M84p17j79M62K04j7o63L46
4098a44K69k31k15O46K2m74J27q9M72m45j56L15K49n33J1J70K82m04j3L48J10
4119C17n57l1K07K0k62J31K65J69n03n2O11l16l38L00K81J56l46j55M40n6n82
4140c01J4M49n1m66J66N41j04o43J94N76m54l62N10J37l4n74K32M26j17m76K65
4161g2J28k41nK9M00j79k02Q9K95l1n24J88P51n38k72R4R5l9l14M97K9l52j18
4184b92L28K60m20j97L33K08o9o76M16M71l85l95L23M36k41n82O69J56l11p5l0
4205g3L25l61k25L05oK9pJ56O9k83j54L07J65m46m53O45J57l97Q9L87J97p26Q2
$$ y = [82, -312, -43, 262, 88, -533, -270, 61, -107, -395, -102, 364, -38, -279, 169, 464, -118, -167, 203, 467, -120, -312, -3, 342, 113, -132, -39, 349, -347, -317, -52, 226, -314, -513, -64, 420, -297, -476, -14, 190, 173, -490, -144, 125, -106, -321, 325, 347, -127, 0, -89, 383, -62, -218, 97, 346, -187, -176, -6, 276, -128, -141, 207, 317, -240, -271, -64, -44, -306, -175, 90, 259, -244, -296, 315, -1, -339, -39, 242, 398, 52, -103, 337, 281, -301, -287, 162, 111, -355, -189, 352, 248, -395, -201, 375, -79, -441, 69, 206, 172, -402, -170, 256, 139, -337, -72, 56, -185, -190, -161, 239, 60, -142, -53, 242, 211, -313, -125, 626, 88, -184, -90, 5, -34, -348, 149, 178, -174, -292, 36, 296, -124, -321, 12, 220, 151, -525, -109, 362, -23, -418, -95, 341, 100, -482, 187, 343, 32, -43, -73, 252, -109, -334, -29, -35, -6, -13, 143, 212, -71, -225, 82, 247, -199, -652, -7, 150, -247, -158, 229, 426, -300, -218]
4228b18N7N31k73k64L02R3j04l00L59om59j27O24O6n14j50O46J3o26L51J15O6
4250A82k34j1J46J3l09J21L85k85m05K3M99J55n64L38L22k21k14j89N07rn60J18
4272a92N44l4o68N28J29k00l12L34P3j09k32K60K31l47m36K43O25l45l08OL93
4293A83j49m50N23P2j82l72M64pq6m04L59K39k60l50M54K18k8l86L2N91n15j02
4315a56K18K44n15k98M28M05m44n30M61N47n13j86J14L08N0l06L92j46q5l05L67
4336E0L21n59j50L76R4k34k10L77J5l58Q6J58K71k87j61J63J68l50j20K65M62
4357C77n09J19o9O4l37K24L10J4k01k26L34J86m23o5M07j61k66l13R10l33l77
4378c35K02J76Q7n47p2R02m86k77QN12Rl21j59L98J56n11KM50j2j92r4N18k23
$$ y = [-218, -161, 370, 97, -167, 135, 228, 124, -176, 183, 177, -282, -409, 215, 281, -233, -383, 263, 276, -350, 1, 116, 182, -52, -63, 83, 96, -213, -92, 293, 8, -397, -374, 125, 280, -284, 54, 376, 155, -59, -248, 259, 250, -310, -192, 352, 318, -350, 178, 307, 107, -205, 129, 202, 93, -139, 121, 352, 5, -431, -188, 437, 92, -216, -210, 183, 34, -416, 107, 179, -3, -375, 89, 82, -4, -408, -49, 190, -70, -420, 34, 252, 224, -162, -130, 461, -54, -156, 62, 306, -209, -507, -79, 326, -118, -648, -187, 360, -153, -339, -225, 83, 133, -173, 219, 73, -12, -317, 50, 371, -188, -338, 38, 132, -102, -312, 65, 80, -278, -192, -34, 237, -50, -211, -48, 120, -230, -350, -85, 377, -132, -13, -82, -18, -355, -131, 179, 193, -8, -234, 100, 286, -137, -202, 205, 44, -222, -535, 375, 42, -335, -133, 43, 130, -417, -489, 413, -73, -350, -342, 170, 179, -142, -301, 97, 253, -258, -256, 194, 182, -10, -104, 414, 191]
4401A91k83RK34n0k89P7L43M6n26K41J94k70j54m3M65j32n24L17L60j64l29J85
4423a02K76jj64QJ42k04r8L09J78j49n91N37J77l52l11N87j18O9m79J85M18m25
4445a08m44N47L92l61k79L65J44k99k24K10K88m36J9M33O9o05L21O8L35l82j15
4466f2O9K03n68j49M90P7k30J88k75M26j68n10P26K91r53J62L30L10o32n1N00
4487A74j74k11K91J35N3k65j15L09o1m71o1O31j69l28M9J63J70j39m4P5L24m79
4509a43k06N16O9p26L93K49j17j37N5K75r7m12J38K79Q3l20n1M49n38K8Q6M67
4531C40l37l12m6M31q5m73M27J93K8n96J38M81j34k76J14M18l33k00N4N43n38
4552a63k12L34J43K33n03R1M12k44m75M44J18m10N9P3L05j13m70L53N6l12J02
$$ y = [191, -92, -83, 151, 101, -188, -111, 232, 278, -248, -7, 187, -83, -237, -280, 185, 53, -471, -154, 206, 42, -287, -102, 174, 173, 9, 17, 159, -45, -143, 166, 344, 195, -396, 141, 318, -34, -345, 242, 124, 193, -286, -101, 317, -108, -552, -5, 387, 26, -253, 112, 256, -43, -267, -57, 231, -205, -186, 247, 316, -289, 32, 100, 435, 53, -62, 7, 210, -358, -507, -17, 60, -170, 18, -257, 169, 1, -509, 217, 508, -445, -283, 47, 357, -275, -326, 174, 0, -211, 80, 215, 268, 3, -112, 197, 136, -335, -396, 235, 66, -262, -213, -50, 120, -19, -63, 12, 336, -143, -349, 167, 236, -490, -97, 152, 35, -102, -47, 228, 131, -281, -143, 136, 219, -101, -152, 297, -241, -213, -127, 340, 3, -309, -355, 76, -9, -482, -55, 138, 166, -430, -292, 189, 55, -221, -107, 311, -22, -222, -168, 375, -163, -375, -41, 102, 335, -168, -77, 335, 91, -384, 60, 178, -232, -173, -100, 205, 92, -378, -25, 31, -281, -179]
4573a79N0M25k84m1l0J89k33O6K24K47m80J9R1o7j28j6K18L44n17L0L00j46j9
4596F3m31O31O7n21L0M13J61n75j09M02j48J27l47L05m1j34k17O22l62j30J12
4617h2J39K68n99J08L63M5m11J80L14l93N2j62J40L99n25j29M72q7m94j94R06
4638C10l59l3J57OR2j02o2L47l13l09M54r5R3m47J83L26m7j98r1K16r8j48o3L44
4662A63j28l92K35M57l94k18J24O28m33j01J32J1K33n42K28R0q2m00L44K80l40
4683a05j01N5K41R9m10L23L0L6l19L49K30m57l56L47M58n45J4K7L37j69k97J21
4705i2K56M9k43M5O8N2n79N21J26k54j10K63j25k29O9K32K39m58j92N71J1m41
4727b21k7L33J55n23j15L66J47m64K76K95n1p26M04L33k17j78k07M94M06l26l65
$$ y = [-179, -129, 296, 12, -29, -59, 130, -103, -37, 187, 434, -46, -27, 64, -3, -131, -147, 71, 415, -102, -72, 228, 82, 63, -368, 263, 330, -191, -161, 252, 413, -162, -271, 131, -17, 110, -237, 68, 27, -107, -324, 298, -64, -194, -82, 57, 325, -274, -166, 197, 242, -169, 11, 325, -68, -16, -178, -38, 361, -164, -293, 179, 92, -402, -596, 310, -49, -82, 75, 81, 173, 71, 9, 356, 43, -266, 188, 93, 186, -261, -78, 248, 201, 3, -88, 128, 30, -118, -181, 163, 35, -357, -122, 335, -59, -277, -153, 475, 42, -59, 73, 84, 317, -225, 3, 93, 11, -389, -45, 235, -105, -206, -151, 90, 189, -221, 102, 132, 168, -151, 198, 428, -29, -385, -38, 420, -125, -111, -84, 253, 84, -213, -92, 164, 213, -30, 15, 83, 135, -444, 77, 203, -51, -161, 102, -23, -252, -183, 49, 288, -170, -362, 209, 220, -221, -248, 85, 240, -283, -398, -32, 115, -349, -73, 222, 171, -555, -151, 182, -35, -213, -420, 74, 480, 154, -211]
4748b11K70L10l72k71M32j5l28n5M66Jl46q9N76k30k86O2L97k13l01N1K72J2k98
4771a66Q7J05Q6k13J99j38J21k26J57J56j84j37K66J10j65l04R7L28j04j92J17
4792@N5J23k58K6M26l71j29J54L2J58k25O5J38L5n13L80J74r3m05L46N2l62NK59
4816G2R5k04n3p7M11r0l17K22K79n25j03M16K18l41j88J33J72j76k58K39M27j71
4838A81m21J37M86o58J28L35J96m47o6K55J21m75M6N77k13m55j35L86L34l69k10
4859b67K04J24j25M6K35j15m86N7M06n1j47k5J06L00o37L45Q4K85m69J13K28P4
4881B85n08j1N21J6o92J70L62j52l8M5L43k86k27L33r9j18j66O4L27j30l69j0
4903c40N21J6l79r8K02K60m09L25J54l12l72K82K22P4l14M9N92n80j61L05L58
$$ y = [-211, 59, 369, -3, -274, 158, 143, -185, -240, 226, 227, -119, -208, 368, 138, -148, -86, 311, 98, -203, -152, 120, 132, -166, -79, 26, 112, -101, 98, -40, 81, -145, 12, 168, -16, -153, 113, 223, 58, -246, -149, 179, 75, -117, 0, 55, 178, -80, -54, 372, 1, -128, 26, 58, 216, -9, 56, 194, 229, -284, 96, 270, 177, -228, 118, 170, -192, -187, 72, 167, -37, -90, -167, 244, 154, -163, 59, 338, -187, -290, 126, 344, 3, -185, -52, 120, -56, -314, -75, 352, 181, -240, -103, 383, -275, -147, 188, 384, -63, -129, 126, 247, -228, -182, 395, 182, -273, -408, -22, 312, -57, -267, -63, 61, -64, -18, 217, 102, -384, -327, 79, 28, -119, -144, -38, 262, -375, -30, 54, 339, -130, -17, 211, 285, -223, -234, 287, 303, -389, -219, 143, -9, -47, -2, 341, 55, -172, 161, 62, -56, -222, -158, 169, 39, -330, -340, 181, 197, -182, -280, -78, 182, -227, 98, 252, -60, -432, -150, 72, 146, -168, -119, 473, -107, -268, 37, 395]
4924C95j02m97K32l9J48m62J64K99j46k89L12J62k80j01K55Q8j31k52K07K84m46
4945a99QL20%l3l72L31K57l92L9L30j65k16k87L32L92l67q3L89J69m42q7J12M6
4968H2k51R9J40R8N0k42K7L39l80N1J75K86l91l65N50K6m26j20N47J77n60l10
4990c98L44K19k03j98K46J70l41P3K68o0m21J34K37K70l67J04J58j96r5M4J39
5011A27L7l91K18K26l1o35K96J77j14J26k87N17j93l69L05L14k06l53Q0L42J9
5032B05k76m7K00J84o05J26N69k72k08J24L69k43l83J18R6J04k49K71J31o9k23
5053g8k15O57l40m08M62J2J19m73J1L00k69j55N24k43N0o3%J87j48k01J04N85
5075D18m80j04L38M11n48j42N2L63l07k13K72Ln5m6K87j49k86J18L20k58j01k12
$$ y = [395, 293, -204, 28, -11, 137, -325, -161, 138, -8, -297, 15, 177, -103, -204, 51, 139, 8, -244, -37, 247, -199, -191, 129, 129, 96, -276, 55, 312, -80, -41, 289, 124, -92, -379, -47, 345, -22, -105, 284, 453, 11, -76, 36, 82, -169, -70, 70, 168, 218, -24, 3, 342, -38, 13, 188, 474, 83, -282, 268, 294, -132, -252, 295, 472, -88, -398, -54, 165, -38, -236, 10, 180, -161, -88, 180, 120, -301, -167, 70, 340, -27, 77, 235, 39, -56, -12, 127, 164, -227, -9, 217, 186, -449, -153, 24, -90, 36, -251, 266, 73, -296, 9, 323, 117, -236, -156, 186, 205, -71, -118, 82, 266, -339, -213, 356, 84, -124, 0, 369, 126, -257, -139, -43, 61, -188, 83, 214, 145, -78, -293, 364, 24, -384, 78, 90, 209, -264, -253, 47, -222, -377, 147, -96, -46, -109, -109, 78, -70, -271, -167, 418, -62, -166, 172, 583, 35, -107, -55, 308, 1, -212, 60, 63, 8, -38, 249, 100, -186, -68, 252, -6, -107, -319]
5097c19L52Q0m40J48L70j45l33K1L48J81n42K77L06o4k96j71O63j96m28RP60l30
5119B51l93m2K76K3j18k37L42K0j32l16N33k56j82M3K11L67m77J12j2J89m70J82
5141h6N00l08k54r4N51j63k17K5J13j3m21M65J86k64N9m2L82j92l17j12J10J43
5163E1j17k37L08L89q25N94J99l11k77K07J63K0m67K70K46k87j62K07K23n7m63
5184c26N98k48o9J0J05J62j56l00J39L69l33k15K02L43l16l96L35L68j05l92K23
5205bN26o13j61K20K18k90p5L5J61P0k79K27j16q3j75L60K15m38j20L26p7J3j89
5228b47M23O0k27l02K72L05l14k99N78j46K5l93K59J29l01L9J22j7j56J9J00M82
5250D11p89K35J45j8l41R3L02j9j71l3N20k37m01J34L33K87o19N5K43n3k65J28
$$ y = [-319, 33, 113, -327, -179, 191, 46, -287, -266, 82, 263, -279, -2, 304, 240, -56, -227, 436, 240, -188, -179, 581, 251, -142, -184, 92, 115, -3, -240, 102, 122, -10, -326, 207, -49, -231, -188, 23, 390, -87, 25, 13, 202, -268, -86, 414, 106, -148, -242, 309, 146, -71, -46, 67, 54, -367, 98, 284, 20, 79, 37, 419, 227, -90, -202, -92, 51, -66, -303, 5, 394, -431, 163, 362, 51, -226, -19, 144, 164, -303, -33, 213, -74, -236, -29, 194, 137, -326, 272, 24, -45, -35, 70, 232, 76, -224, -85, 284, -49, -264, -62, 281, -35, -431, -96, 272, 167, -225, -2, 524, -89, -250, -30, 188, -102, -177, -142, 19, 89, -190, 37, -79, -162, -337, 23, 238, -200, -320, 6, -71, -58, -247, 176, 236, 9, -293, -21, 284, -30, -329, 249, 103, 128, -265, -6, 123, -178, -139, -17, -34, -190, -171, -71, 411, -378, -143, 2, -16, -357, -264, 38, 19, -152, -185, 335, 98, -303, -169, 164, 451, -168, -113, 130, 77, -188, -60]
5272f0L53K1l74K06J52j70l81N0K76pj78p0K41M7l65kL54J51m80O7J03K15Q7l31
5296i5L73j54m83M54K25j35p7k05L37l7l46o6L23k10l85L32K93m1o7k0K88j77
5318A27k77L6K34m71K85L17l3k14k14L37p2K5q2J98o5k51j95J21O37l94l93L32
5340a2K47k22j78J73l4m07J44L02J00k14k26J25L88k41o0L37J40l14k59M07J0
5361B06r3l53L14l9j79p7K04K07n7k47J81K27m22l6J2L06k95PK72k6n4n42N96
5384A12n4j74O0q4nj80K1K18K74L7l49K78K5j39k23M12N6n22O3M32k49j6j81M29
5408B41l30l9l09P56k43j63J8L1L99p38M65J40J70o79K21M19l26nk45M99j56l94
5430b68L43J38j0j19k01L50j26k27J64K8k25j90J20M77k01l84L35J36Ql59k06
$$ y = [-60, 293, 314, -60, 146, 298, 128, -253, -203, 73, 66, -112, -182, 59, 106, -259, -261, 93, 244, -236, -169, -66, 149, 236, -95, 278, 124, -359, 95, 320, 185, 108, -97, 240, 203, -143, -209, 114, -96, -481, -149, 144, 103, 36, 16, 304, 127, -150, -114, 120, -351, -66, 251, 218, 4, -210, 127, 55, 80, -2, 196, 131, -120, -315, -194, 443, 49, -344, -12, 235, 13, -165, 8, -26, -433, -289, 13, 113, -101, -327, -202, 186, -55, -115, 222, 362, 48, -211, 196, 206, 113, -240, 74, 35, -144, -221, -17, 190, 133, -114, 67, 294, -128, -164, -152, 154, -141, -134, 138, 112, 58, -484, 112, 58, -116, -56, -140, -145, -325, -304, -86, 188, 225, -124, 154, 179, 40, -183, 229, 285, -237, -174, 258, 9, -7, -188, 241, -89, -128, -437, 319, 76, -87, -69, -38, 361, -377, 88, 228, 398, -281, -60, 359, 33, 28, -217, 282, 126, -268, 75, 213, 203, 84, -117, 233, 107, -120, 44, 72, -153, -343, -223, 254, 53, -331, 4, 140, 148, -211, -417]
5451d17N52ml99M14J41m49j26L21J09k62J4K52N6k43j00J8N00k1m29M65j45k64
5473a7j86K57K26k51k72J54J27k43J50Q2J89k91l68L48K99l07k0P7J51k96j92
5494c83K91K74l43j24J89K78k18j56K59K97n53l1K57J41k86k22K97j7r0R6K19
5515A75O1l58j64L57q5k19N8M09o4l10J81M26l08Qj79j55M18l80l5J75J05k23
5537a07l6L44k4j79j00K57p8j83J02n5L45m30J16J55j26oj98M54N4n03M08j29
5559H1M7l96L07K3k44o7M5K72j09k86Q9K84J32m29L18or4j32MN75l91j23qL12
5583B04k97n3N3L01L2m06K34J15k38kJ3M92n03P5J8J6k00k22L14K24J29n82O3
5606b20M62j21k93K57m9Q0k68K37j70J56k78K14Q5j57m1L31J51n70N8K40LJ24
$$ y = [-417, 135, 131, -268, 146, 287, -162, -288, 33, 142, -120, -106, 146, 202, -41, -141, -123, 377, 356, -73, 392, 247, -17, -203, 54, 280, 29, -243, -89, 38, -205, -55, 27, 216, -75, -443, -95, 204, -103, -123, -46, 105, -191, -383, -92, 182, -161, -285, -96, 182, -36, -192, 67, 364, -189, -220, 37, 178, -108, -330, -33, -50, -140, -44, 175, 236, -122, -286, 71, -14, -233, -175, 234, 170, -140, 41, 467, 159, 167, -12, -167, 251, -129, -164, 11, 116, -107, -143, 201, 177, -2, -102, 155, 77, -106, -4, -59, 286, -144, -28, 127, 1, -5, -203, 251, 305, -198, 210, 81, 128, -268, 39, 62, -182, -249, -204, 68, -41, -327, -238, 46, 178, -251, 67, 61, -33, -165, -161, 414, 23, -100, -108, 204, -93, -146, -93, 208, 240, -166, 68, 183, -55, -57, -44, 448, -55, 20, 38, 54, -146, -368, -54, 170, 299, -283, -220, 242, 121, -172, 85, 36, 116, -152, 85, -85, 71, -207, 7, 92, -65, -106, 225, 376, -194, -136, 104, 107, 231]
5628B31l7j83J79q1n07M75k6J5m64O62R8l39l54L33J35j11j19Q1l2j22O7M9J69
5651A19k53p2K20K52k87ML25j71m07M2O36l68k03R2Q9L1l49J50K69j48k32Q8J17
5674e6J24l36M0L72j50k21K01o5K87k19oj0R2K3l45M54Pl39OM06l2k12j13J97
5698A05j32k35K76J61l75q2L36K02k5o33K33M02l31j85K52L05k09n22L28L77l5
5719B13l42K12n0J5l58L70K07l1l36J33KN0m79M16K40l68r3J45J90j16j68O8L68
5742B88r7l03K78J55m79N0M5L39l64j13K31K53j75l29L53n1j10r6J67Q9l60J67
5764f2K6M30l69QN3P7j57K4R8J4k22r4K62K76k29m16L52L3l74K06J42J46l02J43
5788F5o4K39k33j68J74K10k28L1K43j02k68rK87k91l6j84L57N1k88J16K07Ll44
$$ y = [231, 194, 11, 190, 109, -398, 77, 51, 66, -398, 264, 362, 23, -331, 2, 137, 26, -93, -12, -44, -166, -99, -50, 119, -134, -206, 14, 266, -21, -17, 308, 137, -270, -228, 408, 40, -163, -71, 18, 49, -300, -150, 119, -29, -261, -173, -56, 68, -268, -228, 144, -6, -227, -26, -91, 196, -23, -29, -39, 53, 76, -269, 185, 192, -147, -141, 265, 233, 21, -92, 105, -27, -262, 14, 175, -200, -282, 54, 256, 231, -402, -169, 233, -98, -283, -31, 274, 65, -457, -129, 248, 213, -129, 83, 33, 48, -310, 60, 267, 236, -100, 33, 35, 85, -394, 22, 262, -106, -199, -54, 136, 20, -148, -80, 288, 191, -112, 166, 321, -158, -108, -63, 276, -88, -201, 30, 283, 108, -221, 132, 81, -29, -125, 42, 131, -229, -62, -36, 394, 25, 33, 86, 163, 6, 30, 128, 142, -80, -174, 88, 364, 135, -281, 71, 104, -270, -64, 78, 224, -78, 65, 1, 240, 7, -161, 13, 223, -5, 26, 269, 167, -101, -110, 177, -114, -150, -334, 23, 74, -214, -98, 109, 112, -232]
5811b32L01j8L7l04J62M23j79l80M54j29l1j50R2o2R5k22j6L39ql54r2M76k70
5834f8K4J24J05j67q6J90K17j10m69J64M40k17m15K76L28n07j79M15K0l1m47K17
5856a76N00m42j13K55K46l78r9K68J05j68j92K68J07l45N2rK13jj70L20rl94O6
5879i6L40j32k90l5J80K0j11J2K62M8j15l72M48J61l94J56L4O4j27n35M51M3l41
5902c29K81J52j17j60n1K50K03o97J80L51K35j71l02K63j07J76j56L33j49l72
5922a87R6J82m6j69L28j77J37k45q3M36l27k01L1J54j6k15K28M53j16m37K42L76
5944D44j48m87L41J7j09j39J54Q8K10m64JJ79j47k83L10J20p8k68K69K06k59j83
5966b26K17M5J74m40K54J90k18M3j16M49o29J64L2M14k53l44L23K66o11O0L93
$$ y = [-232, 69, 51, 88, -216, -54, 369, 190, -190, 264, 135, 104, -46, 46, -16, 79, -143, -159, 180, 172, -182, -274, 202, -68, -44, 80, 185, 18, -68, 122, 339, 229, -240, -76, 364, 147, -268, 8, 336, -171, -350, 65, 85, 54, -393, -176, 324, -118, -231, 24, 270, -108, -207, 61, 166, -2, -194, 74, 181, -164, -112, -121, 92, 91, -79, 241, 232, -162, -96, 244, 112, -178, -213, -33, -13, -124, -112, 150, 198, 83, -289, 159, 320, -74, 82, 116, 180, 53, -482, -31, 12, -329, -48, 104, -13, -173, -224, 26, 229, -468, -288, 63, 298, 127, -175, 88, -19, 157, 1, 334, 185, -187, -91, 91, 45, -124, 204, 27, 164, -81, -164, 272, -55, -256, -225, -71, -87, -302, -74, 379, 263, -174, 68, 444, 296, -191, 150, 167, 58, -81, 73, 161, 371, -93, -92, 87, -60, -343, -33, 87, 9, -259, 10, 216, -43, -226, -9, 36, 210, -230, 24, 214, -4, 39, -77, 372, -257, -93, -61, 353, 100, -244, 79, 345, -266, -206, 187]
5987A87j31L61l74K72q3l26j43L86J37k32k79K38O9j69l63J88O05l73j30K39J53
6008B32j17j61rK44j49j77rL96m31K3J49M06m42j27J06K33m92M4M27k53K21m48
6030c34J92N06j86m74L46P9r6k12K25M0l00q3N91j82l21L99k11o8q1M00k55M4
6052A9l83K30K47k0j05jj68L52l14j77P11l31l11J95L99l70N2l07L53o9k06n1
6074b55K11L12m69k9L05j30k99K43R8Q0q6J32k77J63l87K8M76k2k07j33L83m5
6096I2l84K86M7ML6j37K80l30l20M40K89k37o29M50M43l74j17J23j49M71k62l66
6118c44N95k29k07K89l8k91l8L90K0m2k44P5lQ5j43L49m7j95k8K61j24j85p4L0
6142a38K74j64k56K45J78k15j71J62L59l49k00M49P3m91L1K05K16l19l11N64J9
$$ y = [187, 56, 417, 43, 315, 232, -94, -237, 149, 286, 54, -225, 13, 82, -87, -450, -262, 343, -30, -160, 79, 232, 115, -46, -55, 189, 40, -137, -146, 250, -181, -158, -9, 397, -45, -172, -66, 167, -325, -281, 146, -107, 114, -334, -142, 364, 178, -296, 50, 129, 33, -179, 46, 86, -214, -297, 294, 112, -209, 190, -21, -89, -170, 230, -25, 19, -364, -134, 113, 93, -12, -13, -181, 171, -143, -320, 391, 60, -251, -56, 343, -27, 25, -282, 71, 2, -204, -255, -44, 268, -201, -230, 75, -55, -354, -111, -13, 67, -19, 113, -164, -1, -388, -360, 116, 94, -113, -246, 137, 92, -292, -6, 41, 45, 81, -56, 224, -106, -426, 14, 303, 66, -563, -113, 330, -44, -161, -38, -187, 284, 22, -344, 251, 22, -185, 104, 66, -225, -263, 127, 147, 105, -139, -64, -67, 18, -125, 224, 177, -18, -46, 215, 91, -94, -168, -138, 136, -28, -284, -39, 139, -76, -247, -85, 274, -75, -275, 174, 247, -244, -213, -8, 208, -111, -422, 142, 161]
6163A61j67l06M05R8m01K16K10O4k80J17k27L27qm03R2J84jk57L31M2m3k01L72
6186C25k10l32Q0K27R5l81r2M87k77mK46P3k54M8j1K3K43k73K6J19N5l41L7R1
6210@Q3l78M75oQl74m1L79P7n61M20K37l04k71K26L47j71m16J56L47k0k57M1K57
6234B54m47J53j79L74O0l41K72J67j33m84M43J05l37pk62L16p8j71l9M63M1k79
6256a09J29K87Pn33K03J68j90j46Q8J82j07L9j94L87l16p3Q2J69k64l2L04N7k09
6279g1O7k4j3n2q0Q2K32j24j58K64K5o7l21L8L74l6l04K01J58j32j99J49J41k42
6303i2k39K94J78j77q1O7K67m57L1K28J85j99j28L14Jm06K0K07J28k49k20P00
6325C72j73m38K64J10j42j44M21q9j45K2k13K62q5j03j6p6L96j77j36J46j06K2
$$ y = [161, -6, -312, 93, 191, -210, 6, 216, 280, 0, 117, -110, 217, 209, -194, -102, 82, 81, -176, 155, 197, 154, -47, 325, 115, -217, -137, 90, 185, -196, -288, 199, -78, -82, 164, 237, -17, 31, 20, 43, 286, 13, 39, 158, 213, -128, -91, 0, 83, -295, 180, 174, 182, -192, -233, 146, 223, -338, 82, 319, 15, -256, -30, 317, 146, -270, -114, 233, 213, -44, -3, 254, -193, -40, -219, 155, 215, -126, 146, 313, 180, -304, 139, 244, -93, -100, -362, -46, -124, -295, -334, 129, 170, -109, 20, 307, 314, -219, -16, 152, -38, -184, -96, 86, -21, 18, -176, 211, -105, -178, -96, 73, -191, -223, 81, 138, -71, -4, -28, -41, -93, -173, -91, 141, 17, -141, 123, 148, 81, -240, -202, 172, 136, -168, 33, 191, 59, -140, 9, 150, -92, -331, -37, 141, -36, -117, -50, 217, -240, -209, 19, 204, 5, -123, 191, 192, -214, -194, 13, 141, -108, -328, 372, 199, -239, 25, 135, -7, -151, 270, 181, 36, 58, -155, 107, 22, -81, -97, -173, 223, 46, -90, 56, -50, -28]
6347b8j28J24M0k79R8L41j50o5nJ88J76n27K27J46j4m71J65L07l20J01J81o8l0
6370Ij30k14N73l0n75k3P39l16l26J51L33j95R7J90k3l06o5J50j0o7j38K97k12
6393i1K3j20J86R8p3m32L34M24m50l0K58N3m31M3J01J88j56J85p8r9n0j77M73
6416A79O2k71j28j30L62P1j29p2K37j61j96J73J89l44L20j18N6j95m96Q67j50
6437A26r4j71N70j60m88j42L32R0j63k5J95j3j51j04K43o9N9j15K57j8k79J3J68
6460F1M1j81O9M3k4k91O3K79j92K0j2J59R9l17%N06k88q7k93O05j97r4O0J28r6
6485F1k98K44N0P1l19K51J87k76q1J66J56l15K30n0P7N2m66PK26J13j75P8O9L04
6509C62n46J63K89j69l74K97J82m94R8jK95j64j76K84l7RJ26j96J20L1l24L76
$$ y = [-28, -156, -32, 8, -271, -173, 168, 18, -47, -52, 136, 312, -215, 12, 158, 144, -327, -162, 145, -175, -74, 107, 39, 9, -121, -335, 238, 208, -367, -390, 349, 33, -293, -142, 191, -4, 93, 283, 260, -46, -111, 39, 29, -38, -176, 121, -91, -68, -188, -2, 96, 23, -409, -75, 349, -101, -131, 127, 180, -251, -208, -107, 81, -75, 110, 32, -67, -117, -294, 179, 241, -30, -158, -288, 74, 145, 16, -56, 181, 20, -176, -3, 186, -158, 162, 44, 100, -95, -591, 276, 126, 32, -139, 431, 271, -217, -359, -27, 63, -100, -125, 70, 57, -94, -198, 45, -24, 35, -80, 177, 159, -120, -107, 61, 102, -79, -10, 33, 9, -282, -219, 60, -132, -112, -124, 35, 134, -183, -183, 323, 35, -52, -345, 260, 63, -31, 29, 157, 61, -237, 7, 57, 128, -191, 60, 247, -29, -110, 56, 212, -103, 127, 77, 154, 206, -260, -253, -27, 86, -89, -11, 58, 362, -184, -21, 268, 99, -275, 22, 204, -290, -192, -193, 102, -62, -238, 46, 9, 18, 144, -52, 68, 99, -225, 151]
6531A51K69k76l07J61J36l81J63n2K50k4j25j4L06k97K00l93K88J4m58M27L10
6552C48m70j08J36L4ro8K48K14m89J70J9J04j73k81M37k1l17l4L93n2k73P6K22
6575A06L1l17j20M62j03K7l78J57K90J49m73L49K33o91L08K25j19l93N3M37Q6
6596C19o2k07p5M5l07j14M13J3j32J2J39l8k82M04p6l2j53pK02J20j23l7j32K46
6620A36j53J19L32m71j65P7K82r3r8j28K00J55l62K26l7J94k94L3J61J13k02r7
6642g2M04k71k71K42Q5K2n12M01j9N1j27J18J72n5k29R3M9J3k92J88n3L8rL2j9
6667b1r1Q5J63j23k30L40j21K74l09m34M73M2m73L40K5l2L5Q7J47L17m42j47K88
6690A93l42O5j6N4K31k37l2L10O7m30M9M02j89j57j03L52P5j99p8J31R1n10L54
$$ y = [151, 420, 144, -163, -2, 134, -247, -84, -136, 114, 90, -35, -49, 257, -40, 160, -233, 55, 69, -389, 38, 348, -122, -230, -94, -60, -69, -137, 111, 325, -164, 6, 25, 129, -44, -325, 112, 91, -226, -260, 133, 81, -192, -116, 106, 137, -180, -300, 162, 59, 86, -292, -135, 155, 304, -169, 180, 413, -278, 30, 255, 136, -257, -204, 233, 319, 257, 50, -25, 20, -287, -401, 12, 25, -107, -95, 44, 6, -276, 128, 52, 20, -133, -140, 62, 182, 59, 22, -110, 136, -17, 102, 434, -37, -202, -125, 157, 64, -34, -162, 38, 193, -169, 57, 20, 214, -80, -47, 114, 227, 25, -72, 332, 61, -210, 32, 117, 139, -373, 28, 9, 60, -67, 51, 223, 168, -61, 32, 81, 94, -198, -10, -63, -25, -34, -2, -21, -112, -27, 136, 13, -217, 123, 2, 276, -33, -467, 6, 48, -425, -85, -60, -92, -57, 30, 177, 494, 52, -95, 193, -149, -84, -100, -46, 185, -52, -84, 226, 293, -137, -88, 314, 125, -32, -135, 217, 292, 93, 15, 146, 237, -273, 81]
6713H1J44j10k31r3OL03j17l95Q45j99l76Q1Q6j63J06o3k1L40l29K89j34P2k54
6736a32R8j09J67j24K71j30L3m4r1K31j08j47K66j12k8p5l1J02k3k48R7J08J90
6759A61k54J14K80k18m9j51L95n68J10J67P8p9j83q6P37m57j76K10L7j37q3J12
6781d0L78k37j81J13J84rl38J10Nm3P9j24L25j34j74J56L13k95j88L3J57l57L02
6804C5n5K85l08k3KL02q2l12L87P0k76j59J11j26K21j72N7r4j8OQO1j2K13o5L8
6830I4k26j49J76M43m38%j6O2L1k8K69j76o90P10q4J37r6L9o3J81l22J16K72o1
6854A81m94J71K98q7K42k63L09j65k40j12J06N7j42K10K83m08MK91Q4m20J4k35
6876c16L07N3m31L22K52R0l43J99m6n7l55L74K37j42l58P6L21k25j50o8L77j08
$$ y = [81, 225, 115, -116, -209, -203, 100, -17, -412, 433, 234, -142, -61, 25, -138, -32, -95, -116, 224, -105, 184, 50, 122, -132, -34, -143, 24, -100, 171, 41, 74, 30, -61, 170, 62, -85, 181, 69, 41, -34, -65, 37, 14, -234, -137, -29, 161, -93, 21, 301, 83, 34, -117, 278, -290, -180, -13, 65, -14, -197, -283, 454, -3, -179, 31, 68, -69, -152, -40, 338, 101, -80, 33, 217, 208, -130, -20, -15, -58, 21, -103, 222, 88, -86, 70, 383, 88, -100, -67, 90, -267, 35, -20, 265, -43, -66, -64, 238, 156, -156, 231, 301, 25, -134, -23, -149, 72, -100, -43, -137, -155, -149, -141, -80, -92, 121, 56, 94, -132, -281, -105, 338, -100, -100, -116, -54, -23, -51, 218, 42, -648, 62, -22, 115, 19, 58, -5, 176, -146, -30, 242, 181, -313, -142, 156, 69, 311, 48, 357, 192, -48, -160, -54, 3, -139, 71, 354, -54, -50, 241, 325, -95, -81, -316, -9, 44, -387, -65, 187, 277, -66, 133, 87, 30, -325, 49, 286, 144, -214, -138, 183, -42, -192, -260, 117, 9]
6898Il27L13K4O5k42J71O3o5k0J57mj83j01k40M13J91n84M79j04m5mJ41o2Q9n03
6923c69L96j00R9K7P2J04m83K80l23M39l13J00L23k70j6j08q0K87J20k29J22J27
6945B05j63j49J58R7k73n1L34J80o21J83K35K43m99j78K63K31k61q8J62J15N8
6966A81m3l99N86l81P9J6J8O8l58L75j16j33p3K26Q1j27J87j71J62k74J92o6N1
6989H1j26L4J20j49R7p2j03K7J87qp2n3n1l7M18k90o0J3J12L7j42m4K38j22j15
7014h0LJ68O4l99K48Lqq7J76j69nq5J96j27qJ13m15L27J13p6j41N99n38n1J22
7039e7J47j03q1K6O7J23m60M97J60k61k62P1K98j35m4m36O26j76k96K55m4Q2j09
7062a12j09K84k67K20j24M82n34L5K13m9R7l77J91K17q8j6J24k66J09Km3Q0j13
$$ y = [9, -318, -5, 19, 84, -158, 13, 76, 11, -9, 148, 144, -39, -140, -380, 33, 224, -360, 119, 15, -30, -34, 107, 45, 134, -369, 27, -73, 26, 53, 125, 229, -254, 26, -297, 142, -171, -71, 252, -18, -34, -142, -222, 65, 185, -44, 78, 205, 42, -107, 51, 148, -125, -176, 158, 338, -283, -100, 135, 378, -121, -299, -36, 195, -66, -154, 8, 123, 181, 138, -261, 325, -56, 23, 39, 57, 125, -233, 142, 26, -107, -180, 46, 127, 0, 187, 16, 178, -96, 96, 30, 81, -45, -11, 109, -40, 57, -15, -118, -91, 96, 88, 16, -37, -88, -125, 293, 3, -57, -44, 68, 105, -37, -81, 157, 35, -80, -77, 91, 155, -244, 4, 7, -1, -88, 88, -81, -86, -171, 25, -102, -110, 3, -412, -85, 28, -48, -189, 410, -128, -179, -57, 90, -13, -94, -68, -1, 122, -338, 159, 319, 58, -204, -133, 165, 30, -14, -450, 176, 0, -296, -41, -85, -3, -112, -221, 63, -204, 16, -108, 374, -160, -125, 88, 39, 136, -241, -50, 167, 79, 63, 187, -79, 30, 32, -11, 69, -44]
7085d4OJ94l04J54k43K73j45p5j48K92M14n64P8K38P3k73J25J03O0l29J73j2K0
7108F6J12j96J14L9k24R0K78m82J40k3J11j09P1l04N67j12l08J8L81j88k78J20
7130a17J52J4J7l1j36J31k21L10k2N4l17j57M47J09m68m9M97o7k31J00j71J29
7152b7L0J05L81k63n87qN45j68r5J68m0j95K10j80J71K1O2k27J11J98j81j10L02
7175B23k52j76N23j43k61J2o2L79j81l61R0K41J82l57r6K35km88N76j13j15q0
7197b26j19O34n97K96j55L37j47j54K58p5J17l67L68R0k47k74K81p8p2m5K75K7
7219A27l44K45mK44m01M6J3J87l5l24M63n1p5l9J51l17J66K0J7P4l68P6J31R9
7243A01k94K27k9K62n31L41J25k50j96N02k70K74k74j99L22j22M9l78M85k29K33
$$ y = [-44, -38, 156, -148, 6, -237, 36, -109, -184, -332, -40, 374, -190, -112, 126, 199, -74, 51, 154, 214, -115, 58, 46, 66, 178, -18, 96, 135, -89, 1, 279, -203, -63, -86, 25, -84, -13, -317, 250, 138, -170, -152, 229, 41, -237, -117, 35, 49, 66, 35, -101, 30, -191, 119, 97, 151, -166, -323, 124, 233, -235, -284, 213, 146, -85, 15, -156, -27, 3, 108, 489, 226, -361, -369, 176, 8, -87, 81, 41, -154, 56, -124, 47, 68, 130, -97, 14, 212, 31, -79, 223, -29, -205, 318, 175, -86, -74, -136, 243, 62, -299, -209, 32, 214, -143, -239, -4, -6, -494, 82, -31, -146, -226, -345, 289, -308, -12, -167, 170, 23, -131, 127, 52, 169, -198, 170, 260, 13, -261, 20, -58, -130, -175, 100, 127, -217, 28, 24, 268, -133, -87, -74, 113, 78, -246, 217, 166, 91, 52, 203, -114, 52, 72, 89, 163, -205, -129, 2, 101, -193, 34, 5, 267, -264, 77, 202, -48, -244, 258, -12, 262, -12, -211, 111, -11, 38, -340, 145, -84, 149]
7264A49j19j14J60k38J56R4o1n3K9l3J07q0j53J58P0r2N4K3J6m11J03L41p2p1
7288c7j24L15j69r2o9M13j31j84j09K71Ok10k2K76n1k68L06R1p7o7k06L23k65
7311h0k14j1K30K70m68O95l93P8m05K89M8k4j54Q0R4l11O8M18qr1r6L12k54r6
7335b3j5m1M2J57J3j52K00k23J21m0n4P0j26O3j7j08o9K26j7K4L09n01K66k52
7359a47J37K17q8J24q0J00k90K3N3J10j77M4k15J52p0j75L12M7J70k84n6jl3j80
7383c07K40L81k22k04P1K08rl92J19L2L78m32kL94j51j88J26r1J32N7j85J30K3
7406A08l92J12M42q4j22j44K02k4j02m22N38k86J69j57K70j20j18K6J85k0r6M5
7428A0j56O5K53m89M64m5m7q0p3L98m87N7K25O9j7j36J16o1J16j80P3j80K66j13
$$ y = [149, 30, -84, 76, -162, -6, 88, 27, -26, 3, -30, 77, -3, -156, 2, 72, -20, 34, 57, 73, -338, -235, 106, 34, -37, -161, 154, -15, -107, -176, 237, 106, -78, -187, 84, 90, -120, -142, 134, 83, -185, 121, 212, 135, 68, -138, 185, -80, -294, -305, -75, 195, -273, 422, 29, 107, -298, -9, 39, 15, -139, -59, 35, -276, -208, 210, 202, 111, 15, 327, 73, -23, -38, -79, -37, 120, 133, -19, 181, -42, 79, 39, -15, 55, -71, -8, -25, -133, -202, 24, 7, 31, 340, -161, 105, -147, -10, 207, 119, 243, 163, 263, -27, -4, 49, 159, -18, 26, -189, -37, -107, -282, 30, 77, 247, -37, -93, -94, -127, -307, -67, 314, 92, -112, -41, 167, 158, -234, -115, -83, 295, -137, -139, 255, 104, -84, 42, -49, 83, 140, -45, 85, 108, -284, -172, 270, 186, 64, -80, 122, 98, -4, -426, 112, -174, -5, -162, 108, -12, -130, -104, 81, 61, -35, 10, -146, -81, 172, -317, 147, 102, 55, -25, -98, 300, -187, -130, 95, 164, 147, 11, 127, 66, 182, 2, 75, -105, 161, 48]
7452D8j76L53m05J80J75k35J25j62K39j64j38J28Nj92J39L3P7N8j9M6K1L2l07
7475a39J63K53l31Rq1p4Q1K95m4l41O0J22j24Q4P0j73J58L30l02k17J37QL4l2
7499e4K05J22m50L1K49N4O1k96K29K6q1j8j61J52p0L00k09j5L7k87J90J60q2q7
7523Fo1N8k30L69k28P9M2J90l10K63j73k15L93j41j18J37r1k7k75K74J16J63k62
7546d1j6J73j99oP2M89l74p1l18M86j37j21OJ6R1k58J39M6o6P5q1M13l09r3j77
7571b61J53K62q3p3Q2j15j37L30j96R6Qj29O5k59J68M8j11K50l60N74j13o1p8
7594F0j71J69J11k95K41ll26P4J91j41lJ07q7J99j25j28J43jj50J00K36j79J08
7617A30j15Q4k75j14L21J55qj06l32L94k04J76j41j08K42l03J49nP5l2p1j57J61
$$ y = [48, -128, 225, -180, 0, 175, -60, 65, -97, 142, -22, -160, -32, -27, -219, -80, -47, 30, 88, 69, 115, 136, 168, -139, 24, 277, -54, -45, -126, -200, -119, 176, 132, -209, -149, -27, -151, -67, 3, -170, -12, 318, 16, -201, -64, -56, -22, -54, 151, 273, -177, -146, 103, 157, 218, -78, 151, 177, 96, 78, -83, 69, -1, 299, 90, 75, 112, -175, 15, 175, 93, 6, -55, 3, -227, 142, -86, -7, 35, 225, -85, 178, 5, -210, 183, 42, -76, 61, -30, -57, -332, -58, 58, 221, -41, -57, 116, -83, -89, -17, 472, 98, 27, -291, 195, 58, -63, -57, -41, 50, -208, -69, -23, -89, -14, -95, 318, 9, -84, -261, -108, 154, 71, -2, 80, -35, -172, 158, -38, 58, 66, -63, 2, -257, -89, -41, -152, 98, -262, 312, 199, 138, 60, -111, 58, 169, -126, 115, 112, -214, -140, 51, -90, -93, 14, -73, 126, 1, -127, 16, 15, -135, -35, 201, 22, 130, 15, 99, -176, -290, 31, 186, 178, 72, -260, 134, -70, 106, -35, -143, 99, -204, -55, -60, 15, -17, -88, -245, -84]
7640h4M2j13M48l16K9j44M1q5K23j19L10j51o9j43K00j36K33j88q7R2j22j60K55
7663d4L4j72J08Q3o1j44J87J33o0Q6n1o6m9J30K02k62Q4k37J84K06o6n2j15J64
7687B22j4m20K9L97Lj65N3k06J12k34K54K28l73m2K44k48K31l25M51k57K79k19
7709@K4J78l43J6j01K58l1M2q0N4K0l03J76L94l63k14J11J0O2K4K29k0Rj6j98
7734f2J12r0k27L44P9q1m29K54L22k17j03J51J34k76J50j53L49l20m9m8K31r2
7756b1Lp5j6J37k11M35j98q1k52K28J77l70L32l48L35j48RJ30j18M1j16K29L6
7779A38Nm21J58k4J15L2Km6L04k31j11K13q8J85m05K61m34L62J76l07R0q3J02
7802gk01K76k83L77M9k63j09L81k98m1M0L11j19j75J65p3Q8m6p1N6j32o4O6K91
$$ y = [-84, -42, -155, 293, -23, 6, -138, -97, -182, 41, -78, 232, 81, 12, -131, 69, -67, 166, -22, -109, -17, -139, -299, -44, -10, -182, -74, 9, -52, -196, -9, 124, 64, 150, 99, 33, -16, 114, 316, 54, 138, -99, 85, 291, 225, 173, 58, 222, 208, -212, -183, 214, 217, 52, 105, -101, 11, -223, 31, 259, -114, -156, 88, -160, 71, -254, 197, -60, 219, 0, 24, 202, -141, -125, -226, 32, 1, 43, -37, 17, 37, -266, -90, 304, -59, -273, -162, -152, -90, -66, 163, 143, 152, 136, -62, 50, -40, -267, 77, 156, 75, -354, -100, 222, 5, -98, 53, 187, -89, 61, -92, 257, -63, -112, -160, 71, -21, -18, -93, -109, 28, -183, 252, 54, -27, -279, -51, 126, -244, 88, -260, 75, -73, -64, 66, -52, -11, -127, 102, 138, 143, -278, -120, -144, -29, 3, 5, -41, 263, 32, -79, 134, 46, 231, -174, 87, -347, 15, 191, -116, -26, -109, -7, -208, 68, -215, 162, 211, -52, -161, 220, -78, -119, -79, 232, 113, -62, 103, 30, 118, 72, 1, 57, -75, -139, -73, 218]
7826B18j7j95L2j55J58j6j52L60k00n1J23Q9k72l30L23L50j87l14L68N1r4O7r1
7849F5K41j71m40N6K21M1j37KJ65R6l02L06O8L3j63Jrj17K6m0k81M08j29J8R0
7874D8O3j86J80Rk08j06L13r4M9l3r8l34L88J11p1L0n2k18J79J65k11Q1q5R9O9
7899H8k98L19j89j82J93J4l4j1K17p6k0K8J42j43j07RO9J45P3k58L26m12K78j75
7923dk95L77J3O3l02P0J47p6q5J68j8k37J9Q1P3J83j50J9j97J61Q2Lj36j80J60
7948f1K91r3j59j8K21k37j22P0J8PJ44N6o2L79l99m9o6M72o50K39o2J40o6J08
7972A01J58J8m49J11L5J25j87J13J06j79O7j23K4K03l4k56J34J71l28J39o6r9
7994b16L16p9j30j88K27o2K46k57J14q6L05n4j47K13o5r8k52L85l3j05j78J86
$$ y = [218, 201, 6, 38, -117, 41, 25, -127, 233, 33, -18, 105, 194, -78, -408, -85, 265, 78, -236, 132, 183, 89, 156, 65, 306, 135, -305, -249, -28, 13, -124, -122, 43, 139, -163, 143, 211, 244, 81, 82, 73, -44, -18, -58, -339, 69, -60, -42, 48, 111, -75, 105, 114, -94, -200, 113, 19, 68, 35, -63, -397, -9, 102, 31, 61, 9, -209, -30, 135, -76, 5, -80, 19, 88, -210, 109, -80, -262, -69, -55, -89, -100, 117, 41, 21, 49, 191, 48, -59, -50, 19, 164, 237, -21, 305, -107, 171, -4, -299, 78, 91, 154, -148, -78, 69, -7, -92, 76, 58, -179, -160, -79, -6, 177, 27, 46, -151, 10, 92, 95, -41, -221, -61, 230, 137, -22, -40, 181, -56, -178, -108, -90, -83, 61, 117, 55, 434, 35, -14, -80, 392, -258, -19, -81, 59, -7, 101, 259, 277, -172, -61, -26, 99, -88, 25, 131, -48, 19, -104, -80, 123, 89, -167, -33, 138, -190, -51, -117, -216, 100, 21, -109, -297, -70, -132, 114, -143, -29, -115, 190, 136, -11, 202, 137, 39, -213, 172, 139, 34, -144, 42]
8016D2j4o0j60K11L25l19q4P9K92p38L96Q3K35n98L52J09k8O4n43M31M7p9k02
8039a59K87N1r8p1O0P1j58q2J83l5M3r5jl09K52j27m0L13m0J0j39O7k4k9P1L7
8065C8j32J31j72M86r0k71k4j10J32k46M40n5j92K34l32J06K24l51J1K4K30j05
8087b4L7J68j39J61o1k27J12J25rk98q5m8J20L48j65km6L92l15k79J61j2k4J57
8111D7k57O6J60k8Q3L8J16k42K0M8L9j19J96m82L47j44M7j24L12k72J12K22k44
8134e9N3L0K41p7l13M48m18Q4J53j44j07q5J55J40j77j69J69J61r5j93L88K0k02
8157Cj17j68M94k40K44l61J58k21L90r4j02Mj37J28J25j08j61K26J73n50K32O
8179g6J26j48Q0j27Q6j63J84j40L84k79J57J61
$$ y = [42, 28, -32, -192, 19, 344, 25, -59, 20, 312, -426, -30, 53, 288, -310, 42, 151, 123, 187, -356, 75, 122, 43, -159, 128, 179, 81, 10, 70, 141, -17, -99, 84, 49, 92, -3, -4, -313, -61, -188, -228, 85, 45, 55, -84, -17, -41, -70, 1, 38, -94, 37, -135, 351, 261, -10, -34, -144, -12, -258, 182, 127, -65, 169, -163, -57, 167, -184, -173, -149, 81, -24, 13, 181, 42, 203, 142, -85, 27, 152, 143, -155, -240, -288, -168, 180, 15, 13, -33, 359, 44, -235, -74, -86, -110, 47, -210, -144, 16, -12, 71, 109, 225, -17, 3, 51, 90, -29, 167, -315, 32, -112, -65, -189, 123, -149, -37, 185, -59, -6, 24, 265, 188, -125, 323, -95, -11, 142, -2, -109, -194, -39, 101, -76, -245, -76, 85, -10, -203, 185, 205, 3, -114, -282, 212, -28, 216, -145, 13, -208, 182, 88, -14, -10, -147, -19, 106, -2, -163, 63, 236, -314, -82, -76, 50, -98, -18, -145, -59, -222, -38, -178, 206, -73, 84, 245]
8191B45
$$ Imaginary data points
##PAGE= N=2
##DATA TABLE= (X++(I..I)), XYDATA
0@%%%%%%%%%%%%%%Qj6J6j6J6j9K7l2L4m2M9n7O9p7Q8j04J20j36J53j74J96k20
36a17K46k74L06l41L81m24M69n19N75o35O99p72Q52r38J034j139J256j386J532
55H05j698J886k103K357k656L018l465M032m780N812p331R788j4408K5942j05929
70h8730j68361K98649J54101j95781j31220J24140O4197n7063q993K6556m5664
81b8169m379P6004k525j07176N289J27229R964j40613l1906J25223N4296r1131
93g894n9862M0360M8866O763k2514l9792k220N6942K3080n6842k7652M7576K3411
106C0222k7501m665P818j8218J0287M8760k0802p7670K1178R9345j2773j11270
118e5289m015J06470J6859q9520k2170N9478J2348l1330O579R720l2283J40N1878
$$ y = [0, 0, 0, 0, 0, 0, 0, 0, 0, 0, 0, 0, 0, 0, 0, 8, -8, 8, -8, 8, -11, 16, -16, 18, -24, 25, -32, 37, -40, 48, -56, 64, -72, 81, -93, 103, -117, 129, -145, 161, -180, 201, -223, 246, -273, 302, -333, 366, -406, 446, -492, 542, -597, 659, -727, 805, -893, 993, -1110, 1247, -1409, 1609, -1856, 2176, -2604, 3208, -4123, 5665, -8743, 17199, -88730, -257091, 41558, 195659, -122, -131342, -7202, 56995, -68, -9061, 17495, -28169, -32548, 43456, 40931, -66245, -60956, 66273, 76237, -64376, -96282, 28941, 83237, -7894, -67756, -27396, 21470, 28233, 5719, -34073, -36293, 20649, 43729, -13113, -40765, 6811, 30222, 2721, -1944, 5874, -12344, -2057, 46703, 25901, -51769, -30591, 68754, 55981, -55289, -59304, 47166, 64025, -25495, -47665, 11813, 24161, -7169, -590, 9130, -23153, -23013, 28865]
131B8865k097o1628K914O4782l617o2984M333O2251P55n7302r093M6048J9831
144C3058k7603k4754O155K2360Q238j5855j4790Q131J1374p841o610R944J657
157C464j4215K45J5860k330j6147N124J7278p970j7186J1699J9433j2914j6943
170a4602J6682J5345j9687j1931K5145J0805k8043j0977K7903J1111k5108j0255
182a3612K0163O642j8198n221J6029M003j7142p534J7418J1176j6510j5518J3734
195d570J8006r551j7340O453J6264l992j3045N340J2230o667j1483J0284J1778
208A3707j2573j0883J4888Q542j9502o719K4269M458l0882n359L3804P035l5943
221a5158r599L3196J0034l0133q348K6000N859k1841j735K0249j743j8127O296
$$ y = [28865, 26768, -34860, -31946, 32836, 29219, -33765, -29432, 32819, 33574, -23728, -32821, 13227, 33058, 5455, -19299, -13144, 9216, 17454, 1599, -13191, -5060, 6314, -1527, -8137, 1807, 3464, -10751, -10506, 5354, 3024, -13123, -7999, 9279, 1309, -15877, -4178, 15255, 2341, -14602, 2080, 17425, -2262, -14193, 10952, 21757, -6286, -17263, 10640, 21751, -3357, -13612, 6551, 13193, -5005, -10226, 5803, 9806, -7336, -14870, 2548, 13724, -2786, -18304, -4570, 13436, 3885, -13455, -7002, 9262, 5270, -7775, -2435, 9795, 3128, -8355, 1929, 13707, 1134, -9749, 5139, 13681, -5821, -12540, 11729, 16187, -14695, -20054, 13750, 20785, -15158, -24757, 8439, 18473, -11660, -20008, 5992, 11851, -9990, -11725, 8524, 6781, -11346, -5050]
234e050J9228q402j9260R432K0759p468j9518M552J6747j838j3520k2R698o34
248D704q088k3N865j57o517n12P374k30j0171P66J3473j245j7495J574K2859o53
264A1524k5022n4K7021L062k6602m136K5589N144k2992l887K0402P17j9319L768
278d785J8308r881j8982J3490J8907j7375j9842J8405J8828j8669j8319J7222
290b693J7422j5311j6073J4292J4780j2508j2434J2986J1053j1793r003J3105
302C823P910j2997o442J2908O265j2589o930J1060P618j0676r745R029J0418q596
316A056j2234P762J1475q166j1156Q842J0276r877r684J1852J0155j2427j0085
329a2211J3504J1620j3168j1540J4151J1770j4067j0905J4542J0742j5792r290
$$ y = [-5050, 14178, 5776, -13484, -4052, 16707, 9239, -10279, -5727, 11020, 9182, -4338, -4360, 5338, 4704, -3384, -3407, 2458, 2301, -4216, -4728, 2646, 2416, -7755, -6989, 6484, 5239, -12256, -10682, 12177, 11524, -13498, -13552, 13469, 16531, -10071, -14207, 11382, 16526, -6466, -10353, 10049, 10766, -8553, -4785, 13523, 3642, -15340, -1850, 17057, -318, -20160, -1755, 17073, -1596, -19915, -2693, 14729, -582, -16655, -2363, 12417, -91, -12525, 461, 11514, -279, -9282, 3823, 11733, -1264, -7706, 5202, 11467, -1122, -8052, 3008, 10626, -50, -9795, -766, 9652, 1056, -11178, -3416, 8059, -107, -11263, -2421, 7855, -2022, -11706, 146, 10301, -2126, -12211, 1293, 12913, -255, -11795, 2356, 14126, 59, -10846, 3696, 14438, -1354, -10644]
341a0644J5594P882j7263o412J6727M570j8342l909J8693K849j9440l073J8723
354E955L615j8371l307J7479L524j5505k640J5374J942j3488p22J3970n36j3097
368e807J685J3798k749j3873L103J3379k652j4445J188J4059n78j4691j110J3991
382E298R67j3885q62J3031J45j2646J242J2498k356j1670M022J2348l652j2698
396h218M033J4191k605j4668J954J5301j187j5674J287J4626k645j3273L081J1594
410G797n280j1395O346J0672p937j1818P724J3311p695j4871P971J6188p379j6291
424a2657P617J6080o399j3959O591J2110o040r739O751Q387p754p467R413P398
438A0332j1543q915J2560R551j3781j1133J2868J0998j1874j1347J0230R837q686
$$ y = [-10644, 4950, 12832, -4431, -10843, 5884, 10454, -7888, -11797, 6896, 9745, -9695, -12768, 5955, 9570, -8801, -12108, 5371, 8895, -6610, -9250, 6124, 8066, -5422, -6144, 7826, 7290, -5807, -4122, 9676, 6927, -6946, -3843, 9536, 6884, -7561, -6373, 7686, 7108, -7583, -8693, 5298, 6265, -7620, -8482, 4549, 4694, -7952, -6710, 5788, 3432, -8238, -4216, 8132, 4480, -8218, -4185, 10006, 7401, -7267, -5313, 9988, 8801, -6873, -5586, 9040, 6395, -6878, -3797, 7797, 2517, -8878, -2532, 8140, 203, -11615, -3891, 9420, 1725, -13146, -5175, 11013, 3634, -12657, -5040, 11040, 4641, -9318, -2727, 9383, 3343, -6396, 355, 8742, 988, -6479, 2934, 10332, -1211, -10126, 2434, 11985, -1796, -12929, -61, 10937, -937, -12284, -2054, 7783, -903]
451i03q003P415P081p289n155Q300M794q753m364J0962N079j1334n669J1403P656
466A1220j0789q900R645R349q858r513P621Q337q158p664Q417N889j0393n314
480i111J2254M339j4282m901J6349N794j6551p201J7203Q813j6045q502J5289
493C448Q016j3132n838J2382K923j1266k34J2154l179j3168M238J4406m872j6362
507a0484L212J6666j763j7105o02J5663J216j3431j731J1173J233q787P05P462
521C427j497o941L794Q076m616r540N119J3239m580j5822L424J7469j140j8269
535g857j139J6413J894j4721k091J1787l15j0187K916Q614n780r162Q628J0170
549I170j0385j1971J1772J4298j1552j4800J0968J5662q716j4706P234J2770n128
$$ y = [-903, -8906, -1491, 5590, -1699, -6854, 1446, 6240, -2513, -6877, 4085, 9164, -2170, -7839, 3564, 11220, 431, -8469, 1176, 10525, 1667, -7846, -225, 8112, -46, -7710, 707, 6596, -3797, -9111, 3143, 7482, -6800, -11701, 4648, 10442, -6109, -13310, 3893, 12706, -3339, -11841, 3448, 11464, -1668, -7506, 4876, 7799, -3467, -3701, 8453, 5274, -7894, -3656, 10750, 5878, -10484, -7272, 9394, 7631, -9474, -10076, 5587, 6803, -6628, -8359, 2814, 4047, -4740, -4035, 3427, 1930, -5011, -1217, 6859, 2243, -7297, -2178, 11061, 6481, -9341, -5917, 11552, 10412, -7857, -8996, 7417, 9311, -5410, -7501, 4286, 3971, -6216, -3300, 5314, -466, -9628, -1000, 9170, -1215, -13186, -1414, 12884, 1332, -13468, -2500, 13162, 4446, -10260, -3026, 9744, 4616]
562D616j0221N146O908n712m691O927L095r395l772J1154M525j2980o877J2905
576A628Q561j2351j0030J0132J1090q360j0118O706Q814m962o954N636N595n761
590c74l626P678K923r667k441J1590K993j2654m448J2920N266j3263o231J1752
604B418O284j0761o348Q780N317q116m940P657M003p696k007P982J301q195r36
619e257R886J038r795p92R889K277j0059k524J0260K634j0061k827R823K199j0685
634c994j773J0404J016j1296j234J1136O90j1212q84J1271M18j0449j79J0445
648D359j00j0137J232J0430j428j0052K596J0373k676r573K166R991k848q821
662d488J977Q566j911q816J821Q028k570q256K572P550l106q026K953Q473k842
$$ y = [4616, -5605, -459, 6449, 737, -3954, 2973, 6068, -3327, -7099, 4055, 8580, -4400, -11277, 1628, 10189, -2162, -12192, -2060, 9030, 670, -9448, -2742, 6072, 1110, -5844, -208, 5387, -374, -4000, 3678, 6601, -3066, -5507, 6083, 9076, -3578, -8026, 4894, 10160, -3103, -9334, 2418, 8702, -2059, -8407, 373, 5690, -2426, -7366, 291, 4294, -3402, -5409, 2573, 3874, -4321, -5257, 4629, 5667, -4128, -4920, 4969, 7246, -2813, -5337, 4923, 7557, -2504, -5331, 4492, 6691, -3994, -5767, 4637, 5653, -5643, -6877, 4259, 4949, -6263, -7147, 4124, 4542, -5907, -6086, 4359, 4259, -5878, -4646, 5784, 4356, -5696, -3100, 7273, 4597, -4976, -2810, 7181, 4333, -4488, -2511, 6055, 4144, -4672, -2851, 5177, 2607, -5649, -3077, 4473, 1367, -6659, -3706, 4767, 1925]
677A925q958L044R739k882j0031L082J0687k241j0286K210J0182j796r304K412
691b217Q830l344p755M182P422o441p546P036P714q079q965P833R416q108r589
706i611P783Q566o785q086O412P224n608o284O323N207n473l930N874M398o908
721h98l933Q259L791q361m884Q593N272q584n848P208O038o830o400N810O001
736E234n931n581N940M569o510m138P310L983p931l136Q724L652q816l509R601
751C461L786q751m358R323M317r096m302Q969L544q833l192Q333K210q777j852
766e218Q627Q78r042q55Q792O31r070m05R417N20r584k06R927L36r345r2R333
783D644j46q012M57Q204r19q018J287P978j624p931J065Q469k239q489K097Q034
$$ y = [1925, -7033, -3989, 5750, 2868, -7163, -4081, 6606, 4365, -5921, -3711, 6471, 4675, -4629, -2217, 6613, 3269, -4486, -304, 7118, 677, -6869, 167, 7881, -198, -9163, -1330, 8086, -22, -9611, -1828, 6738, -47, -8133, -1721, 5503, -105, -6389, -66, 5141, -332, -4262, 1612, 6010, -898, -4831, 3428, 7219, -1142, -6026, 2567, 7839, -745, -6593, 615, 6653, -177, -6577, -767, 5234, -697, -6278, -338, 4231, -2279, -6417, 893, 4876, -3055, -6191, 2533, 6185, -2631, -6140, 3461, 7247, -1504, -5862, 3461, 7778, -1318, -5620, 3349, 6893, -1940, -5132, 3201, 5411, -3366, -5218, 3409, 4287, -4755, -5610, 3182, 3813, -5257, -5662, 3755, 4275, -5309, -5515, 4412, 4748, -4597, -4689, 4644, 4498, -3514, -3057, 5147, 4228, -3790, -2503, 5475, 3851, -4080, -3015, 5454, 3215, -5274, -3177, 4857]
799D857k507q592K507Q046j985q539J879Q443j286q205J718P818j501p389K564
814b172P408k591p097L617O680l476o676L951O927m802p319M669P628m837q336
829f426M465Q240m862q285M276P552m267p005M224O149m239m998M487N153m651
844a87n027O032M953n888n130O718N332o851n427P192N429p236n142O065N369
859F202o190n368N444M735n832m265N428L582o193l147O922K734o962k636P332
874A786K670o919k840P586L266p090l329P155L484o400l711O783L043o605k841
889c962O712K099p367j390O725Q59o971j637P279J680p831j723P802J624p831
904c932j468P935J710p352j028P319J067p144q1O905Po953M57P588j111p558J248
$$ y = [4857, 2350, -6242, -3735, 4311, 2326, -6213, -4334, 4109, 2823, -5382, -3664, 4154, 2653, -4736, -2172, 5236, 2645, -4452, -835, 5845, 2369, -4307, -356, 6571, 1769, -5550, -881, 6747, 1910, -6426, -1961, 6279, 1417, -6868, -2592, 4960, 693, -6312, -2088, 4061, -178, -5176, -689, 4464, -187, -5214, 818, 5771, -117, -5247, 1471, 6803, -48, -5475, 1717, 7146, -90, -5232, 833, 6202, 12, -5356, 88, 4823, -1009, -5274, 154, 3736, -2457, -5604, 1318, 4052, -2910, -5546, 1786, 4456, -2463, -5303, 2283, 5549, -1541, -4870, 2285, 5769, -631, -4342, 2441, 5484, -1121, -3962, 2750, 4849, -2518, -3908, 2817, 3676, -3295, -4932, 2347, 4027, -3804, -5527, 2275, 3899, -3932, -5400, 2535, 4245, -3107, -4135, 3184, 4251, -2893, -2974, 3931, 3938, -3015, -2558, 5030, 3919, -3639, -2391]
921b391P335j348p927R59P985j197q247J212P524j245p613J319O723j475o314
936d700J824O167j630o041K442O075k196o008K847O161k391o399K704O549k514
951B890p018K671O771k771o820K567O261l055o338K692O296l261o330L231O255
966D041l641o159M177O630m696n936M792N966m473n604N012N644m943n213N387
981I84N225n415n558N572N298o096n284O029M501o143m831O154M126o008m226
996e672N422M123n468l565N425L883o077k921O599K779o221k719O798K939o851
1011a526k466O826K896p148k600O712K090o274k637O315K189o997j745O887R65
1026C487o992q59O907N60p042l73O985K78o642j70O800N28o613j69O758L73o541
$$ y = [-2391, 4944, 3596, -4331, -3372, 4613, 3416, -4831, -3619, 3905, 2660, -4953, -3634, 3089, 1614, -4700, -2876, 3291, 1661, -4380, -1938, 4137, 1941, -4067, -1220, 4941, 2550, -3849, -1145, 5404, 2890, -4128, -1457, 5314, 2543, -4277, -1710, 4551, 1496, -4842, -2150, 4146, 885, -5445, -2214, 4041, 400, -5759, -1582, 5048, 352, -5584, -792, 5174, 701, -4903, 109, 5753, 810, -4403, 984, 6209, 794, -4764, 808, 6106, 10, -5274, 755, 5256, -887, -5718, 436, 4562, -1446, -5672, -250, 3873, -1595, -5160, 265, 4148, -1929, -4850, 1749, 4528, -1693, -4412, 2386, 5325, -1526, -3992, 2834, 5730, -1418, -4018, 2694, 4784, -1490, -4127, 2188, 4377, -2620, -4365, 2522, 3487, -3505, -4364, 2543, 3103, -3939, -4312, 2673, 2951, -3691, -3861, 2939, 3467, -3146, -3315, 3443, 3816, -2725]
1043b725K46O745q53o195P02O329j221o411J042O150r07o529N99O250j057o268
1059d103P65O470j444n964J113O273j740n342K065N238k085m869K261N506k221
1074A923n574K973N741k828o153L252N465k630o241L120M778k995m512K557M271
1089C147k680m711L055M240l011m714L466M704l565m408L864M614l875m350L870
1104c54M456l303l865K871M536l497l898L189M401l895m134L952M068m636m171
1119d280M363L805m542l767L852M048m502l490M204L424m077l348M993K894n024
1134a447k703N658K692n470k291N623K518n392k448N432K337n264k599N154K276
1149D076m979l073N417J954n432j805N227J221n046j148N236Q06n306r18N778
$$ y = [-2725, -2479, 4266, 3413, -2782, -2080, 4249, 3028, -3383, -2341, 3809, 2902, -3627, -3028, 3222, 2165, -4103, -3338, 3132, 1688, -4276, -3163, 3110, 1370, -3972, -1907, 3331, 1246, -3623, -1362, 4144, 1923, -3651, -678, 5063, 2235, -3918, -666, 4799, 2169, -4072, -952, 3826, 831, -3681, -1124, 3147, 467, -4244, -1189, 3051, 40, -4674, -1208, 3496, -69, -4477, -613, 4001, 126, -4224, -354, 4102, 799, -3066, -195, 4341, 844, -3054, 135, 4536, 641, -3493, 459, 4527, -109, -4280, 83, 3888, -654, -4421, -569, 3479, -1023, -4513, -309, 3115, -962, -4310, 683, 3577, -1447, -4150, 1508, 4200, -1270, -3561, 2062, 4580, -812, -3260, 2172, 4509, -755, -3354, 1800, 4076, -903, -3976, 1441, 3395, -2037, -3842, 1385, 2606, -2440, -3588, 1648, 2454, -2852, -3770, 2008]
1164B008J213n404j088N321J429n523o31N575O07n441k01N448j62n148j31N411
1180C283k34n608l01N856k01o117L08N554l44n741O65M956l71n197R32N048r10
1197A578m984J620N230j614m938J604N478j410n949K095N627j999n221J797N036
1212C950j981m829J399M883k228m709J930M512k603m122K289M433k750m330L414
1227g42L981l080m148L205M685l097m319K929M698l200l848L197M063l525l964
1242c165L572L469l692l921L893L535l978l707M203L138l844l598L898L299m136
1257a034k950M147K795m140k362M374K473m504k020M513K701m615k612M962K296
1272D024m475k630M553K292m346k563M439J865m366k010M455J496m891j285M703
$$ y = [2008, 3221, -2183, -3271, 2050, 3479, -2044, -2675, 2900, 3507, -1934, -2135, 3313, 3151, -1997, -2128, 3283, 3049, -2559, -2860, 2996, 2795, -3322, -3014, 2540, 2196, -3545, -2880, 2076, 1705, -3492, -2560, 2488, 1578, -3406, -1786, 3444, 1830, -3108, -1504, 3974, 2564, -3385, -1290, 4337, 2338, -2883, -1086, 3950, 1969, -2860, -1461, 3422, 1194, -3515, -1585, 2927, 324, -3798, -1509, 2924, 174, -4156, -742, 3239, 159, -3989, -784, 3901, 804, -3515, -586, 4112, 912, -2936, 261, 4324, 799, -3165, 407, 3876, 184, -3737, 156, 3691, -287, -3994, 209, 3347, -497, -4095, -197, 3102, -1034, -3984, 163, 2958, -1182, -3544, 830, 3303, -1201, -3221, 1292, 3993, -622, -3234, 1728, 4024, -451, -3081, 1472, 3764, -582, -3145, 1294, 3159, -1207, -3217, 1238, 2734, -2157, -3442, 1261]
1287A261J328n172j010N289R62n027o91N013J129m886q77M636J085m827j91M678
1303B700N27m938j84N044l13n124J14M804l45m774m40N415m90m861K17M351qm741
1321c046N00M589m73m465N36N006q12m714J390M799j572m540J664M876j244n101
1337b607J357M589j214m779J194M477j311m667J523M029j770m177K033L954k394
1352B37l841K453M036k680l904K628M274k459m210K806M324k494m230K497M336
1367C773k386m023K677L492l030l103K633L340l426l102L264L062l852l242L778
1382a45L075l934k887L802K980l607k854L702K409k798k532L459K387l503k190
1397b636L961K212l826k406M324J614l689k345L927J957l922k146L835J741l591
$$ y = [1261, 2589, -2583, -3593, 1696, 2658, -2369, -3060, 1953, 3082, -1804, -2681, 1955, 3040, -1787, -1978, 2700, 3227, -1711, -1895, 3149, 2836, -2288, -2174, 2630, 2285, -2489, -2929, 2486, 1996, -2865, -2648, 1703, 1695, -3046, -2546, 2043, 1570, -2895, -2359, 2647, 1835, -2879, -1489, 3310, 1738, -2802, -1138, 3738, 2494, -2607, -1250, 3339, 2125, -2654, -1460, 3017, 1706, -2961, -1438, 2591, 821, -3356, -1323, 2631, 237, -3604, -1151, 2885, 205, -3699, -1071, 3203, 744, -3466, -660, 3664, 1170, -3060, -563, 3773, 1387, -2636, 41, 3533, 503, -2600, 33, 3373, -53, -3155, 109, 3171, -681, -3923, -145, 2930, -1004, -3891, -89, 2891, -716, -3570, 132, 2541, -257, -2789, 670, 3057, -446, -2636, 1325, 3537, -289, -2695, 1629, 3243, -446, -2791, 1136, 3093, -829, -2975, 860, 2601, -990]
1412i90k158L725J695m047j342M063J468m694o64M594J043m949p62M740J134m378
1428a522o86M469Q73m484p64M336Q48m562l76M323m33m123M31L684k66m274M57
1445b069L745qm606L64M401k47m470M23M676n11m282R56M316r08l775R65L976
1462B946j208l865J177M343j445m296J438M045j375m352J450L841j570l840J342
1477a369L448j856l225J682L492j966l382K408L455k560k963K286L581k256l656
1492b881K374L868k614l251K393L280k167l219K278L042k601k994K475K645k882
1507b54k482K847K597l496k503L166K706l252k713L256K797k855k727L139K189
1522B415k682k293L468K044l290j831L308J943l608j775L688J359l415j703L238
$$ y = [-990, -3148, 577, 2272, -1775, -3117, 946, 2414, -2280, -2944, 1650, 2693, -2256, -3018, 1722, 2856, -1522, -2208, 2261, 3134, -1350, -2114, 2222, 3070, -1492, -1868, 2455, 2022, -2101, -1670, 2014, 1748, -2526, -2069, 1676, 1668, -2938, -2574, 1827, 1580, -2890, -2467, 2209, 1698, -2584, -1628, 2688, 1780, -1995, -1030, 2946, 1738, -2127, -950, 3393, 1948, -2348, -910, 3135, 1760, -2592, -1142, 2699, 1129, -2711, -1369, 2079, 223, -3002, -1320, 2172, 206, -3176, -768, 2687, 127, -2836, -550, 3031, 775, -2881, -507, 3361, 747, -2504, -111, 3169, 1002, -2217, 61, 3103, 502, -2492, -17, 2628, -254, -2736, 111, 2708, -788, -3291, -125, 2581, -671, -3384, -128, 2669, -186, -2913, 226, 2415, -267, -2560, 908, 2952, -338, -2169, 1139, 3082, -526, -2301, 1387, 2746, -669, -2372, 866]
1537H66J523l363j610L247J716l520j660L348J322l395q96L247J006l424o76L585
1553A316J138l556j098M103Q82l877j124M281Q40l715j202L859N64l638n83L521
1569A711L06l811J01L123j4l541N6L409K31l715j44M166l65l917N25L698k15l275
1587a671K42L497k82l336O46L144m96l461Q37L266q06l439Q46L262q72l694J019
1604a298L354j210l304R10L487j265l356J488L241j557l273J862L062j397l097
1619b353J682L249j906l072K322L043k137k899J700K944j819l020K120K300k151
1634Ck135K185K232k669k104K524K158k487k591K687K260k784j832K539K266k394
1650a42k506L207J959k677j700K500J634k488j484K727J843l416j467K938J458
$$ y = [866, 2389, -974, -2584, 663, 2379, -1141, -2801, 547, 1869, -1526, -2422, 825, 1831, -1593, -2269, 1316, 2454, -1102, -2200, 1903, 2785, -1092, -2216, 2065, 2905, -810, -2012, 1847, 2411, -1227, -1810, 1711, 2017, -1794, -1693, 1430, 1416, -2125, -2069, 1340, 1571, -2144, -2288, 1878, 1513, -2404, -1879, 1819, 1604, -1671, -1429, 2068, 1786, -1550, -904, 2240, 1744, -1717, -880, 2386, 1580, -1859, -1013, 2249, 1377, -2317, -1298, 2056, 846, -2458, -1548, 1939, 674, -2682, -1194, 2047, 490, -2783, -921, 2141, 744, -2353, -671, 2578, 672, -2400, -78, 2965, 828, -2071, -371, 2573, 754, -2266, -146, 2154, 3, -2132, 53, 2285, -384, -2488, 36, 2194, -293, -2884, -197, 2063, -721, -2553, -14, 2252, -142, -2648, 559, 2518, -159, -1859, 641, 2275, -213, -1697, 1030, 2873, -543, -2010, 928, 2386]
1665B386k982j792L051J591k938j776K785J281k807j466L157J296l395p72L373
1680I92R59l317q02L423J024l308o94L417N86l524l62L167P83l247q58L138O58
1697B035l489j70L109l07k934J53K727o3l122K87L054M1l420K00L473j18l094
1714a638k39L822m24l132N12L094l28l057O17L084r89k804P23L208j537k756P32
1731a112L128j043l058P82K945p76l557J523K760j162k596J348K535j314k575
1746b172J656K512j550k533J611L322j950k805J797K600j438k855J634K436j572
1761F93k429J591K146j654k498J848J958j745k300K178K032k296k259K744J939
1776A948k070k138K080K480k482j809K278J984k337j719K431J479j978j455K020
$$ y = [2386, -596, -2388, 663, 2254, -684, -2460, 325, 1606, -1201, -2667, 490, 1786, -1609, -2381, 992, 1951, -1366, -2168, 1255, 2279, -1029, -1723, 1694, 2280, -1244, -1606, 1561, 2344, -903, -1761, 1377, 2035, -1454, -1624, 1485, 1178, -1756, -1603, 1124, 1061, -2061, -1774, 1280, 1321, -2099, -1899, 1574, 1456, -1638, -1877, 1945, 1521, -1611, -1099, 1995, 1667, -1390, -773, 2311, 1322, -1482, -759, 2449, 912, -1844, -1112, 2016, 973, -2085, -1303, 1642, 866, -2691, -1168, 1592, 430, -2166, -818, 1717, 403, -2172, -516, 1996, 446, -2087, -476, 2846, 896, -1909, -112, 2488, 1050, -1805, -171, 2265, 693, -1736, -145, 2001, 347, -2151, -303, 1655, -90, -2390, -212, 1820, -476, -2735, 9, 1948, -122, -2260, -180, 2300, -182, -1991, 287, 2271, -66, -1785, 646, 2125, 147, -1308, 712]
1791G12J108k127j174K190J241k750j095K543J076k519j586K511J529k540j453
1806b334K630J529k834r07K547J417k679j122K867O83k639n36K699J004k989j000
1822a664L024N17k937n13K910N24k909o04K776J84k952q2K722R8k561m7K499J59
1840A144l247L36L463p10k420N3L029l53k546J69K794m28k621P58K402q67k303
1857a347O83K361p90k564N25K714j030k431O79K677j040k355Q52K410q82k583
1873b121J163K743j120k321J108K273j122k065J227K327j458k180J368K360j440
1888G42k255J224K040j559k103J380K228j886j916J782J829j835j814J923K109
1903A889k458j497J993J955j870j864J789K136k102j665K018J745k347j219J959
$$ y = [712, 1820, -307, -1481, 709, 1950, -800, -1895, 648, 1724, -795, -2381, 130, 1659, -881, -2334, 296, 1825, -1009, -1916, 631, 2048, -631, -1753, 1114, 1797, -842, -1378, 1321, 2325, -664, -1664, 1360, 1877, -1060, -1573, 1337, 1861, -1048, -1652, 1124, 1308, -1644, -1726, 996, 1094, -1467, -1514, 985, 1144, -2103, -1767, 1696, 986, -1434, -1381, 1648, 1295, -1251, -1082, 1712, 1284, -1337, -579, 1823, 956, -1347, -664, 1697, 907, -1657, -1132, 1582, 552, -1879, -1200, 1477, 437, -1918, -1066, 1344, 462, -2121, -958, 1785, 665, -1656, -548, 1725, 603, -1462, -235, 2092, 634, -1546, -178, 2182, 742, -1513, -289, 1751, 192, -1911, -531, 1697, -189, -2105, -323, 1506, -329, -2143, -220, 1889, -569, -2066, -73, 1882, 12, -1852, -63, 2073, -29, -1694, 324, 2069, -278, -1497, 462]
1918D62J534k015j305J828J306k216j526K507J184k346j434K207J153k294j178
1933b133K697P72j984j233K425Q33k230m78K365N74k525p03K824O85k614o83K538
1950A130L90k491l40K507N23k493m18K051M55k528p0K279k32k197J18K300k05
1967G79k705M02K625L9k681L67K459O3k522L78K075j56k068K66K112m81j926L93
1985e81K107p18k306Q69J837n51k541R48K299j060k336J039K233m40k460O66J988
2002I93n83j750O54K002r48j819J262J917j291j626Q86K147j504j826J525J942
2018A981j469j969J477J814j430j948J283J701j365j992J546J470j191j532J372
2033b52J680j670j513J799J649j745j369J557J734j978j219J462J602j776j081
$$ y = [462, 1996, -19, -1324, 504, 1810, -406, -1932, 575, 1759, -587, -2021, 186, 1339, -955, -2133, 564, 1336, -648, -1881, 544, 1377, -853, -1331, 1034, 1608, -917, -1620, 1204, 1889, -725, -1408, 1130, 1520, -971, -1311, 1196, 1719, -774, -1192, 859, 1314, -1214, -1284, 995, 763, -1434, -1316, 984, 779, -1926, -1524, 1101, 1140, -1541, -1174, 1285, 1348, -1174, -796, 1279, 1123, -945, -679, 1433, 952, -974, -581, 1526, 808, -1498, -629, 1208, 657, -1884, -936, 1363, 303, -2033, -994, 1239, 799, -1661, -995, 993, 410, -1340, -686, 1316, 368, -1451, -189, 1728, 437, -1189, -303, 1844, 340, -1486, 39, 1981, 512, -1457, 20, 1834, 404, -1544, -261, 1440, 75, -1917, -371, 1099, -92, -1624, -252, 1428, -242, -1755, 44, 1693, -52, -1421, 136, 1870, -108, -1327, 135, 1737, -39, -1120]
2048a120J542J256j757j273J727R98j916j168K275O84j814r82J790J157k283j075
2064a959K249Q75j682r99K150P97j605r35J847P13k072n55K225O54j932p12K129
2081A188L18k229m44K179M90k360o17K027M07k099l20K170K53k153k48K138P0
2098G70j866R6J891j19j578k24K325J36k329K04K074k47j915K08K168n83k058
2115a047J98K199o31k142L94K103l93k111M64K147p55j891P29J853p40j752O74
2132g01J764m55j961Q97J865o62k035J251J816j293j591P03K050r73k089J056
2148c58J915j294j543J252J497j324j508R14J699j282j608J122J650j000j768
2163a636J568J472j590j287J455J778j791j254J635J178j201j271J357R87j406
$$ y = [-1120, 422, 1678, -79, -1352, 375, 1373, -543, -1711, 564, 1248, -566, -1548, 242, 1399, -884, -1959, 290, 1165, -517, -1516, 634, 1431, -174, -1109, 738, 1451, -621, -1176, 1049, 1703, -229, -941, 1188, 1506, -723, -1167, 1012, 1502, -858, -1475, 552, 959, -1140, -1460, 710, 963, -1190, -1438, 700, 770, -1096, -1000, 891, 772, -806, -1030, 1295, 1431, -898, -694, 1380, 1133, -782, -574, 1594, 1011, -1047, -849, 1350, 719, -1423, -1029, 1074, 681, -1430, -966, 1181, 426, -1465, -736, 1117, 377, -1375, -701, 1063, 608, -1353, -456, 1409, 747, -1288, -37, 1779, 486, -1105, -402, 1648, 675, -1414, -358, 1557, 263, -1280, -28, 1469, 145, -1363, -449, 1250, -32, -1640, -518, 1132, 132, -1636, -68, 1404, -186, -1473, -18, 1760, -31, -1285, 350, 1528, 327, -944, 413, 1400, -6]
2178fq82J600N79j730r55J879P79j760q79J698Q06j676j059J827R22j802p29J632
2196B44Q78j466q66J691P17j917l05J925K31j519n31J627P04j963o08K093L44
2213A279k053p07K395M55k286l37J955K41j918j64J728nj642J30J909r8j892K5
2231i85K046k07j637QJ920k73j973L83J805o0j714OJ821m21j662K20J566k73j529
2250i59q6K150m48j800J71K014n73j883P75J823m14k254P82J754m42j561N61J698
2268A308r17j302P01J589r53j614J066J443j104j463Q52J682r60j710R24J493
2284A035r40j498R19J608j108j355J241J033q05j617J643J140j494j153J438J236
2300A323j417j338J856J048j457j316J618R39j243j078J022J349j456j085J618
$$ y = [-6, -888, 712, 1291, -439, -1394, 485, 1264, -496, -1375, 323, 1129, -547, -1606, 221, 1143, -659, -1388, 244, 1122, -344, -1210, 481, 1198, -719, -1024, 901, 1132, -387, -918, 709, 1413, -550, -1158, 935, 1279, -774, -1481, 914, 1369, -917, -1254, 701, 942, -976, -1140, 588, 583, -1059, -929, 980, 882, -1010, -985, 1061, 854, -783, -775, 1145, 872, -1101, -718, 1087, 1027, -687, -681, 1140, 719, -943, -723, 843, 570, -959, -1045, 1105, 657, -1143, -972, 1042, 469, -1414, -639, 1184, 770, -1484, -702, 1052, 610, -951, -390, 1308, 391, -911, -210, 1379, 426, -1188, -122, 1321, 217, -1246, -394, 1288, 328, -1382, -458, 1035, 95, -1403, -484, 1124, 16, -1339, -98, 935, 130, -1487, 156, 1296, -198, -1351, 87, 1323, -94, -1432, 424, 1472, 15, -1301, 317, 1256, 13, -1065, -43, 1306, -150, -1235, 383]
2315C83O79j545q94J645P13j439p25J359O54j626m58J551O81j380q19J874O09
2332A262j782k40J387R27j945l17J487L18j834l75J944M4j796L5J554K85j719
2349g65j03J309L16j578l61J720J9j322j44J612K1j573j61J951j45j385J52J476
2367A039j63j738J74J736Q2k015L26J710l91j938O72J345l11j455L64J363n46
2384B54j267M95J366n53j288M98J302m41j168L79J622q74j094R03Q50p78r66O79
2402h1J468r50j279O92J368r71j384Q82J280o16j620R29J133r58q76Q97M34l21
2420B7j391J059J166p86j301J308J225j530q51J346J079j196q58J224N98j221
2436a02q35R59J110j212r35J288P28j341p47J201Q73j520q62J864L87j540m19
$$ y = [383, 1062, -483, -1377, 268, 981, -458, -1183, 176, 830, -796, -1254, 297, 978, -402, -1221, 653, 1262, -520, -760, 627, 1554, -391, -708, 779, 1097, -737, -1112, 832, 876, -920, -885, 669, 954, -765, -868, 441, 757, -821, -1182, 538, 557, -765, -909, 703, 724, -849, -1010, 941, 796, -589, -437, 1039, 876, -862, -688, 1048, 1130, -885, -559, 1151, 760, -1178, -506, 839, 528, -927, -563, 800, 254, -1013, -518, 848, 295, -993, -495, 807, 366, -802, -423, 1199, 325, -769, 134, 984, 206, -760, -81, 1387, 437, -842, -150, 1218, 247, -1137, -255, 1025, 409, -1211, -282, 851, -107, -983, -86, 348, 27, -1364, -305, 861, 75, -1226, 82, 1307, -223, -1074, 272, 1351, 155, -703, 521, 1119, -102, -937, 22, 1132, -80, -1015, 273, 1001, -340, -1087, 114, 987, -533, -1395, 469, 856, -684, -1103]
2453a103J543O69j550n87J441O38j489l77J603M47j393n22J397M7j075m34J346
2470F01L06j786J42J434J25j438k92J646pj526k5J614q0j796O47J025m0j136j72
2489g58J751k63j395R2J559k61j281J36J439m55j338K12J661m70j251J10J242
2506G30n13j227L11J634o15j489N18J094l56j380P52J215n19j110O21J226m26
2523D66j397O88J341o92j067N79J255p81j348R45R09q06r68Q03J017o93j241P69
2541b21J146j028j172R21J278r43j262J151J135j007q41O73R47j037n23J171M83
2558H71q47p45Q94R80j245o26R69P19j078o93J022Q55j319p84J209O30j198m48
2576h34R89O85j381n49J170M80j003n38J246M88j172l30J268K82j185k90J331
$$ y = [-1103, 440, 1109, -441, -1028, 413, 1051, -438, -815, 788, 1235, -158, -680, 717, 764, -311, -745, 601, 907, -879, -737, 697, 822, -616, -908, 738, 731, -795, -820, 794, 714, -1082, -435, 590, 550, -586, -758, 993, 730, -665, -573, 986, 725, -556, -420, 1019, 564, -774, -562, 1099, 629, -622, -512, 730, 217, -1010, -699, 935, 320, -1169, -651, 443, 87, -1293, -541, 674, 155, -955, -334, 892, 466, -931, -243, 1098, 406, -661, -82, 1173, 392, -956, -11, 898, 92, -876, -73, 944, 251, -990, -221, 925, -103, -1275, -354, 924, -19, -1281, -130, 1005, -2, -843, -170, 777, -260, -783, 388, 871, 24, -721, 173, 1153, -92, -718, 251, 970, -108, -801, 221, 1076, -243, -1027, 182, 812, -386, -834, 155, 840, -541, -1090, 80, 560, -443, -981, 265, 753, -419, -749, 519, 801, -384, -674, 657]
2593F57L92j498j69J265L9j174j27J252Oj095l83J296J38j279l85J461L62j358
2611f00l7J122j21r45K90R48m47j067O50P29jj232M60R16k37j035L75J096l15
2630E49j123J43J210m04q15j16J447m35j388L38J204l10j054M29Q92k25j128M91
2648b95R51m63j235R55J050n75j004N05R09l75r86M70J054m43r97M90Q57p45r93
2667h70P90R24p34j075P34Q96m33j424R33J037o82r92O75Q80p79o58J046O03p11
2686A60j087J254O53j046n49Q50N23r05o22J087K87o81o92P70P36q41q54Q95O44
2705E82r53l81Q65P90j288m40J150K02j164j04R05O72j139l79J221K63j099l31
2723f28J084M08j100l75J133J69j394M79R41o3j137j09R66K86j142j71J121Or84
$$ y = [657, 1049, -449, -618, 647, 686, -488, -615, 637, 643, -452, -835, 461, 599, -680, -1065, 396, 758, -600, -637, 485, 364, -581, -291, 657, 210, -857, -207, 522, 521, -711, -251, 665, 428, -607, -232, 864, 549, -574, -431, 779, 375, -440, -556, 891, 456, -932, -594, 610, 300, -754, -325, 567, 342, -786, -295, 656, 193, -1042, -87, 963, 388, -616, -111, 798, 423, -563, -93, 961, 518, -479, 11, 868, 123, -870, -80, 844, 110, -965, -231, 665, 232, -1192, -259, 778, 96, -896, -221, 659, -120, -778, 268, 871, 160, -927, 327, 980, -66, -615, 235, 758, -147, -769, 318, 605, -76, -768, 2, 738, -103, -957, -62, 582, -371, -752, 113, 903, -385, -825, 325, 527, -637, -741, 164, 836, -303, -682, 539, 802, -297, -628, 456, 864, -236, -611, 522, 691, -703, -224, 717, 654, -483, -592, 374, 660, -482, -653, 468, 474, -510]
2742e10m0Q35L08j254m9J179Q6j311L98J141l18r35J87J033j92j217L39J156j79
2761F57j353M06J116p11p92L88Q98k03j252N18R54n16q42M14Q29n49r29R44Q02
2780G79o75q85O56J047o17j021O40P77m52j066P28Q27o40p13L90R74l00j139P65
2799G5O02o66q10N76J029q85n76O23P15q29m83O34Q19p68q30P94Q40j045k18N05
2819A02Q45q60p95Q61P32p68n94Q69K55r86l46R25L34q18p46J172L42r22k60Q42
2839A84K72q70k63J045P8p86j8Q60L0o89l12P04J9k63o58J116L80j449o4J152
2859D68K57j168m5J012l02n72K9Q81j29q30j39R62j8j081J75Q38L7r69O7J169
2879F42l30j031N66R76m06r03K68Q36j70q66J49Q60l63q48L31O20J2q05pJ238
$$ y = [-510, -550, 285, 593, -661, -710, 469, 555, -756, -358, 783, 465, -470, -283, 750, 558, -659, -320, 836, 657, -696, -290, 826, 115, -677, -289, 609, 406, -846, -328, 626, 110, -732, -318, 511, -38, -967, -23, 779, 104, -781, -125, 922, 305, -716, -76, 701, 249, -817, -89, 738, 98, -615, -225, 749, 449, -690, 75, 677, 11, -799, -223, 806, -79, -655, -32, 683, -146, -629, 5, 824, 56, -774, 20, 860, -185, -403, 102, 947, 87, -708, 153, 885, 117, -477, 392, 647, -339, -685, 240, 574, -244, -990, 182, 524, -398, -658, 184, 456, -414, -677, 368, 446, -340, -358, 502, 532, -157, -469, 235, 254, -9, -667, 449, 829, -620, -684, 468, 725, -443, -488, 524, 222, -350, -321, 560, 431, -399, -538, 424, 406, -675, -500, 338, 375, -594, -527, 642, 312, -719, -153, 823, 417, -486, -218, 618, 448, -418, -269, 591, 228, -620, -289, 331, 343, -462, -469, 769]
2899G69n84r12L28Q86n87o41K84R11k56p50O94M90l67q69M45Q01l84p76O24P17
2919H23o16p11N65N65n20q42Q06L73l89q92N39Q86o98n33Q10L33o40n55O34O70
2939F08o92l32L90O98q04n47R14M67o77n42N96O36o74n59N77K40q6r37R41N64
2959G81q97m00O16K71n37m31Q73J83p63j49P49K08o88n04J081K57r50l47R64M28
2979G45r92k78Q55K27o41l78R20k5r44pP16M13r41k33J004j97q16J83Q44J47j180
3000e78J01Q63k78o51j36J035J55q19k29J146n2j017K4J012k2j069L46Q09l97
3019B43o34K94O42k65q99L60Q25n12o80J60R97n03n23K62O96l74o11L24Q06p85
3039a77k85L81N63l98n59N27O89l78q67N68L58k05n59M04P46o78p00N32O66n67
$$ y = [769, 185, -727, -399, 487, -100, -741, -457, 454, 198, -552, 142, 632, 265, -604, -159, 642, 258, -518, 106, 823, 207, -504, 61, 626, 106, -736, 70, 443, 54, -838, -299, 587, -111, -644, 166, 499, -141, -696, -62, 608, -84, -416, -26, 672, -132, -679, 235, 702, 25, -517, 79, 715, 41, -518, 59, 299, 213, -724, 217, 781, -116, -516, 100, 371, -166, -597, 276, 459, -304, -453, 296, 504, -184, -688, 393, 650, -300, -647, 317, 745, -247, -525, 330, 557, -84, -462, 458, 433, -511, -518, 198, 611, -330, -563, 441, 244, -572, -389, 455, 602, -578, -477, 386, 108, -543, -679, 356, 511, -308, -537, 609, 557, -460, -436, 576, 554, -515, -169, 640, 243, -391, -97, 545, 280, -619, -259, 566, 54, -626, -466, 531, 28, -495, -233, 463, 89, -522, -198, 608, -177, -462, -81, 482, 84, -475, 52, 741, 363, -504, 64, 422, 217, -342, 62, 808, 130, -570, -38, 628, 61]
3059F1o01N09N65o18o56N43P95j027n26Q10P40p15l57O04M05m52m63P00M25q59
3079a17l56R58K55r83k73R65J44q09l06O42K25q86j71R46M18r64k22O28J87o36
3099c55J92L64K31o93l33J082j47m54m18R80L98j130j48Q99M2p32j43O76M26j035
3119b98J48N62k9p96L6N82J13n87j10O96m2j025L78J093l74n74n9O06l7p50J14
3140c53Q33k71n43J62O79k9q46J55P83k76q09M30P19m94p03L93N25m13m56K02
3160c12R41n04q57N04P33l78n44M20M56m8q46M21O12n62m22M27O52n96n22J59
3180b66J320q27n61K48P45o60r40P63O53o51n43N27Q66p87n53N47P74q02m56O75
3200G2O18o23n49M18N76o52k13N62N47p77l70M88P08q19l80O44K48n96p11R80
$$ y = [61, -540, -31, 534, -84, -740, -197, 598, -429, -955, -145, 595, -120, -477, 127, 532, 80, -383, 317, 742, -117, -473, 485, 740, -243, -516, 449, 593, -216, -522, 120, 345, -541, -712, 234, 652, -312, -534, 94, 281, -355, -163, 201, 432, -261, -594, 488, 341, -113, -531, 449, 847, -283, -431, 468, 510, -222, -365, 311, 737, -298, -150, 412, 383, -413, -377, 205, 318, -269, -379, 317, 275, -750, -372, 721, 347, -227, -286, 320, 283, -467, -353, 480, 209, -334, -172, 507, 478, -368, -213, 570, 294, -515, -85, 634, 140, -563, -170, 355, -58, -514, -312, 629, 125, -732, -228, 505, 127, -417, 3, 459, 411, -435, -14, 598, 36, -386, 41, 693, 97, -425, -266, 1054, 227, -334, -86, 659, -1, -941, -178, 475, -176, -719, -192, 674, -113, -666, -119, 655, -147, -603, 72, 690, 67, -482, -64, 512, -140, -353, 209, 756, -21, -391, 97, 805, -14, -394, 250, 498, -98, -809, 171]
3220A71M65r56m45J041J52o00l04O43K8o87j06R33Rp32K84K76M24r22o2P32M5
3241C89q87J63N67Q0m63j49O97l32l41j25M57J44m62Q9K46J87m58n4O24j18m91
3262b37Q2N41l21n97L00M92J27j106M86N06K45j104N06O76l16p59L36M91k9m83
3282a64j01P52l57l60K20J95L5q06M60N79l80n99J90P40l45n92M07M50k90k07
3302a73L83L19l79l62m9R02o62j62J58L88m42n68N57L58o4q38L71Q81q88k53M60
3323f3N82o02m14N19N72q37l05O10N61o23l24M84K35k87n21N01M91n49k34M60
3343B56M08q76k07R32k01n43l27Q21J13m54l53P24K21p86l40Q95Rp37J42P42J4
3364D53p53p8P95j28n24j30P31K38j056L12N06K2n40k70O17J23o82j37Q14j87
$$ y = [171, 636, -320, -765, 276, 428, -172, -476, 167, 195, -492, -598, 335, 344, -388, -104, 172, 596, -326, -388, 344, 389, -498, -335, 232, 312, -151, -300, 397, 65, -276, -401, 56, 200, -262, -173, 73, 260, -198, -252, 372, 254, -237, -155, 386, 65, -532, -232, 260, 387, -719, -233, 273, 518, -586, -80, 596, 280, -479, -143, 348, 319, -164, -265, 487, 130, -230, -10, 185, 220, -586, -126, 453, 73, -526, -336, 404, 59, -533, -126, 324, 34, -173, 210, 529, 150, -212, -261, 641, -21, -183, -25, 363, -79, -647, -90, 268, 204, -634, -263, 618, -270, -523, -63, 519, -83, -497, 22, 594, -243, -548, 62, 623, 0, -324, 160, 395, 108, -413, 88, 579, 30, -204, 256, 664, -212, -419, 513, 312, -231, -558, 263, 376, -78, -431, 293, 514, -272, -612, 283, 292, -445, -303, 439, 453, -300, -378, 417, 289, -235, -365, 366, 604, -452, -140, 366, 388, -152, -422, 195, 318, -364, -501, 313, 126]
3384A26o25N3R44l90o53K33P39m64m66L07N64l10o49N29O94l77m94J98O70l48
3404B81l57r9L93j70n58L97M98m73l55M62O28o12m23J11P40l44m81M06K0k67l59
3425e62L78N43l20m31O25M46n81n60M65O49m70p73O44L65m47k64N2P70o36l60
3445d67K18N14k54m44N82j5J9o44O07J15j67n44O35K63o27j47L54M70l70n25O61
3466B34L01n70k67P88o5n86j79P35P1o19k2K93J26m23j46P25p4p02J58N03K60
3487E41p31j73O84k82l28k11P88p0n27J2N19J17p39P5M30K80n04o1O37l54m16
3508c13K14O10l58l44k14O10J81p83L28J80j19m57L26O24j18m43p8N81j67o77
3528d17O40K38k25k39j8N16l65k50N6M01m35l69L81N30m03k10J4M30Nr21L43N88
$$ y = [126, -499, -446, 498, 108, -545, -312, 427, -37, -503, -196, 368, 58, -591, -62, 632, 255, -239, -41, 629, 281, -76, -175, 218, 48, -510, -113, 385, -88, -443, 19, 647, 35, -388, -277, 463, 119, -362, 44, 64, -203, -562, -184, 359, 39, -392, 233, 679, 98, -462, 3, 652, 182, -591, 53, 418, -29, -293, -241, 529, -107, -467, -249, 265, 11, -433, 149, 134, 153, -491, 116, 231, 64, -480, 155, 418, -209, -356, -2, 468, 98, -427, 234, 535, -35, -302, 486, 421, -165, -344, 391, 462, -157, -179, 114, 240, -183, -329, 396, 322, -380, -222, 281, 541, -190, -363, 321, 39, -289, -500, 288, 218, -309, -297, 222, 339, -400, -325, 105, 385, -119, -180, 457, 103, -313, -99, 511, 153, -191, -405, 205, 386, -397, -69, 111, -8, -465, -139, 485, 367, -76, -154, 427, 260, -417, 223, 461, 236, -3, -21, 495, 130, -120, -64, 337, -98, -467, -86, 444, 41, -169, -155, 275, 280, -641, -298, 290]
3550B90r6q09N08K75r4n92M72K06l64j61L28N51m07l53L55L13n94KL67J02j53
3571A46n04K82M25p21k09M90M75n82j39L36K28l28k33L31M67m69l42P22m6n70
3591b41RO14M2m34m15O91J27o43l4O49j36k78R4L96j04o52l0N02K2l31k30N70
3613A88R6m77k84N25K82o74P0K39J95l55M7K64Q2l09j09N22M9o01K32K75l06m48
3635d97L80M86l28k37j0M52O6p63O3O60Q5m81M8M21l09n20K08O93k84k97mN02
3657C34j66n04L84M32m14m41L86L05r5l65M8L17No91M62L89l00l58m9N70r7n38
3679c86L52L49k44n09M03L36j65m66L32M14k61m13L31N12o38k7J56J35l91l99
3699e79O01L70k51m01L58M02o25k88M49J60m47l61N91L22l55m30M87L52n53k21
$$ y = [290, 194, -615, -107, 168, 74, -518, -46, 160, -204, -365, -37, 514, 107, -246, 109, 422, -172, -170, 197, 299, 146, -358, -76, 349, -372, -581, -91, 384, -198, -337, -1, 227, -101, -334, -3, 464, -5, -347, 375, 329, -241, -232, 382, 424, -10, -425, 266, 393, -250, -284, 365, 229, -49, 45, 441, 337, -315, -345, 157, 179, -152, -382, 188, 284, -193, -477, 48, 330, -344, -274, -35, 160, -195, -148, 116, 198, -111, -220, 302, 351, -250, -18, 257, -49, -497, -117, 369, 41, -196, -206, 246, 312, -451, -388, 272, 357, -124, -76, 345, 36, -484, -276, 417, 133, -164, -168, 334, 168, -336, 48, 480, 66, -375, 11, 316, 221, -144, -96, 221, 226, -465, -3, 386, 86, -272, -321, 249, 152, -386, -34, 315, 71, -438, -35, 301, 136, -330, 2, 416, 155, -258, 73, 585, -53, -80, 76, 211, -180, -579, 22, 392, 141, -260, 98, 500, -125, -413, 36, 196, -251, -612, -21, 301, -54, -484, 3, 355, -198, -419]
3719d19O36P9n41rM13M3m21L0P55n43j85k69M87M10m95j51N28J4o04Q0K93J51
3741B82m24l00M77rl70j25O23K88o04k01K53M65n13n4N26j44k85j20P86k11n31
3762a91J32M61j98o02J61O68k05p45K88M59r3n96K07P04k98n63K59L71m5n89K96
3783a19K92k30m4K13J76j00l83J11M92k36o49N63L19k98k32P5M40l38m11L32M20
3804C93k97m21K37L04l16j72NR98p59k36L71L39m61k30N21J75n60J0M26O7j77
3825B17m29J61K45k46m45N34K74o44J91P4K80l52k38J85O67p26l3K34L75n18K0
3846a74J11M65l83n34O31Q3j39o4L15j60l70P7J84M35o48j71L18L34o35n3M01
3867B3N4m34l7N65l6l41P1M10L0p86J43P49k88j58j57N61p7l85m4M67r5n65J97
$$ y = [-419, 217, 296, -245, -254, 159, 202, -219, -189, 566, 23, -162, -431, 56, 466, -29, -180, 348, 362, -242, -162, 131, 282, -142, -442, 35, 26, -344, -469, 154, 442, -162, -363, -110, 355, -158, -212, 314, 170, -115, -235, 551, 340, -191, -59, 402, 204, -398, -237, 431, 226, -519, -231, 228, 135, -461, -254, 450, 152, -411, -152, 219, 174, -415, -119, 173, -57, -101, 112, 288, 188, -195, -84, 408, 172, -477, 86, 405, 107, -125, -50, 390, 52, -359, -27, 393, 96, -325, -88, 216, -100, -272, -267, 731, -28, -264, 107, 446, -15, -245, 276, 451, -109, -99, 327, 394, 217, -212, -51, 194, -52, -497, 37, 311, -333, -142, -68, 212, -140, -378, -193, 474, -252, -285, -51, 324, -194, -174, -63, 402, 19, -515, 116, 199, 60, -4, 311, 151, -219, -142, 42, 477, -171, -342, -24, 310, -325, -378, 23, 77, -357, -394, 171, 135, -206, -135, 275, 305, -481, -338, 411, 123, -35, -192, 369, 292, -93, -137, 330, 235, -330, -133]
3890a33N02k07m61L10K43j95k48L10N6J61m35j66L85L5m11M8K59R6o61L56K79
3911A23j35n89N60K07r6l84J40N80j79n90L12K43n8j95M9K82j81m18L67J86p2
3932A52l82K10L14m50k12M39K50l12l81J92N25k57n74N48K27l36l67K30O33m66
3952a7m27L79N64n83l09N40L38m74k58L5M33m13j40L81l5j91j86N46j53k34j31
3973c35L99O3l13l27O50K41m22k60M75P4p21L82L88J30n00j9N5K77l17p5J50K48
3995B43o24L42L33n2o50J22N70J94n24j98O69j63o82K66N72k51l60N2K17J74m32
4016a82J73K62q8o86J82Q69n61j27K8K83j30m98K86O49q5q24K14L78j69j80J55
4037e1K61k28k98K99N4K96o90K54L67j67k53M1L94l8o93N35L06j83n10K40L34
$$ y = [-133, 369, 162, -299, 11, 254, 59, -189, 121, 177, 338, -97, -263, 122, 157, -254, -206, 53, 149, -512, -156, 123, -12, -601, -41, 166, 70, -314, -174, 406, 227, -363, -51, 192, 134, -61, -12, 270, 89, -329, 38, 224, 152, -230, -20, 294, -156, -368, 71, 321, 9, -372, -180, 345, 88, -486, 62, 289, -47, -414, -184, 449, -17, -444, -65, 499, -84, -393, 147, 485, 11, -247, -212, 221, -192, -332, 49, 14, -177, -363, 183, 30, -204, -335, 64, 127, -186, -513, 137, 378, -44, -304, 171, 245, -476, -94, 294, 424, -76, -95, -40, 237, -80, -155, -5, 243, -381, -39, 294, 242, -408, -286, 284, 478, -46, -244, 425, 262, -420, -154, 418, 167, -193, -141, 76, 250, -182, -9, 253, 165, -521, -339, 530, -31, -158, -130, 153, 23, -475, -189, 460, 375, -449, -235, 143, -26, -206, -51, 210, -18, -316, -17, 37, 333, -357, -103, 264, 97, -156, -115, 279, 241, -452, 83, 389, 206, -304, -64, 270]
4058B70l28l98M40J88k06l21K20L71k84k30P7N03k55m48M80K77k93m13O12K59
4078E21l37k68J00N37o03l48O57P1m60j59K70N15n71l85N45K84m09m13O89Ln21
4099b82p8M78J14j62l44K03L02j02m93N55J13l40j18M43J25o52J86L06ol34m67
4120e53P12N8o17K80L50k49q9j87M30J64n12pM13J0m82mM13J85n32K02L00K2m45
4143a38j12P04k43l57o0L37J03l56j9L87k16k6j11L62j35k55J09J09J63q42K14
4164c82K72P6m55L95N43l67l19M29K58l63o22K32N46j11o00N25J74l07j37L79
4184A66j0j39k88M13Q4j71n42L82P39l61o40J63M95l16j35l6L28k26l27L73O11
4205E63n83j26K36J01l09k5L81K52n57Q4J92K26n40k45N21J56l97k88M28J71j95
$$ y = [270, -58, -456, -16, 172, -34, -355, -135, 236, -48, -278, -201, 302, 47, -401, 79, 356, 63, -350, 262, 521, 184, -84, 16, 553, -50, -398, 259, 330, -130, -289, -19, 496, -75, -460, 85, 369, -40, -453, 236, 239, -282, -360, 118, 232, 70, -274, -71, 231, 129, -364, 191, 304, -36, -154, 289, 414, -238, -52, 254, 248, -86, -553, 159, 217, -400, -120, 230, -19, -108, -295, 135, 299, -213, -220, 193, 203, -279, -283, 130, 315, -217, -15, 285, 307, -138, -250, 454, 211, -146, -206, 131, 234, -122, -141, 246, 30, 4, -107, 255, 120, -135, -26, 83, 246, -596, -382, -110, -34, -489, -94, 449, 82, -237, 192, 450, 87, -535, -303, 243, 132, -468, 57, 231, -76, -213, 166, 156, 17, -271, 142, 226, 55, -487, -105, 634, 273, -367, -204, 291, -25, -160, -196, 132, -94, -421, -48, 563, -20, -146, 90, 191, -118, -143, 238, 490, -67, 17, 209, 435, -105, -350, 171, 327, -70, -358, 70, 241, 46]
4226D6l44K84N6l83N5M65p7l42K93J26J75n06M2J29J27m72J42M99k39j65OK81
4248A98N1n59K30K08j08k30j66O18j19k86J31M94k75m96j31N05J26o75M39J45
4268A00J57m02PM26j09m04J44L25q0l01J52L54j52m23J62K56j00k40JM34m93J5
4290a71L8K31O2n71J07L85m2l32K4L37N7j62K78K04k46m00N6O07l66o26O15K00
4312B85p8o33M28L19k65k51L09J48l43n53L46K99K2m54M96L11m14k95M35P1l01
4333a18J29N5J48jl08L27m3k31j71K94L18o40J98J37R6l79p2M46J69o30j9O17
4355C22j50m69r8N29L00o71o0K20K2k06J20K94K34p14M6M40J07m03J16M14j93
4376B00j41r4J58J5m00J94K89l0m15K12K08n5k78JK90P5n82L71J91R2l51J3N23
$$ y = [46, -298, -14, 42, -341, -286, 179, 102, -240, 53, 179, 354, -152, -110, 19, 146, -326, -184, 315, 76, -89, -83, 198, 249, -310, -80, 128, 20, -210, -376, 242, 123, -163, -32, 462, 187, -309, -440, 65, 191, -484, -45, 100, 257, -145, -138, 288, 179, -225, -81, 244, 164, -137, 15, 369, 217, -206, -44, 212, 112, -128, -127, 307, -186, -171, -133, 98, 160, -411, -304, 81, 39, -293, -269, 68, 125, -37, 241, 445, 199, -201, -145, 462, 96, -530, 85, 285, 207, -426, 2, 321, 56, -195, 114, 262, -81, -634, -288, 11, 33, -421, 75, 386, -28, -323, 112, 183, -118, 11, 66, 214, 213, -95, 232, 189, -42, -213, 81, 399, -241, -43, 94, 190, -189, -261, 185, 354, -276, -295, 322, 172, -297, -395, 134, 434, -237, -297, -77, -55, -261, -141, 153, 387, -327, -281, 159, 266, -137, -21, 393, 200, 59, -35, 123, 138, -262, -68, 221, 191, -224, -12, 196, 141, -137, -136, 154, 229, -353, 18, 209, 301, -50, -37, 486]
4399D86l65n57L91J90l2j79j20N61N6n79M5L59j68l15K39M94m44l27L44j5p1l06
4421c13M01L3l69M7r9M60k29j53J73L21k14m28N05J67m02k19J62M42l93L3J96
4442A21n2p4l23L31J63J93n70K02M18l75l66L65M15q05p7M35O6k2K4K8K47k87
4464E7j54Q0L21n95J26J55K31l22j57N09J42n10j35L59J81o04n7M50J21m09oM09
4486A92J3l76j98M96K01k81m59M83Rj87j2O7J73k66J38L17k22j29o1N1K63j31
4508H1k56M87O6o10j30N99k12k12K2L18j38l92N33K74o29J85l81Q28m50k57K13
4529f1K44m2k70p1M42j29j85K14PO5o13K00K95o5j32J42M9n1l81R3M64j11l57
4552b53K49K44j03l78J96M25m26k53M38Mq0m79N72J1k43j84J14L51k36k21L11
$$ y = [486, 121, -436, -45, 145, 113, -66, -186, 375, 431, -148, -103, 256, 88, -227, 12, 506, 62, -265, 79, 64, -7, -313, 88, 121, -248, -201, -300, 160, -69, -222, -49, 272, 58, -370, 135, 302, -100, -319, -157, 285, -108, -75, 121, 69, -5, -328, 3, 166, 359, -211, -9, 409, 34, -332, 33, 448, -357, -434, 1, 67, 45, 69, 97, 344, 57, -97, -17, 304, -291, -165, -10, 221, -101, -258, 251, 393, -117, -252, 107, 288, -316, -373, 77, 198, -211, -217, 192, 205, -171, -369, 127, 328, 47, -412, 71, 80, -107, -119, -52, 121, -145, -7, 310, 88, -41, -102, -51, 212, 81, -175, 312, 378, -232, -362, 237, 25, -187, -165, 153, 15, -377, 156, 430, -199, -14, -395, 433, -17, -274, -61, 183, 141, -129, -200, 242, 113, -72, 142, 149, 214, -399, -199, 96, 31, -101, 41, 90, 39, -342, -249, 215, 104, -253, -4, 240, 137, -241, -45, 380, -46, -299, 139, 143, 63, -416, 156, 167, -76, -260, -146, 205, -31, -252, 59]
4573E9J01J05m40P8L47l95J33p8K10k44l05O41j62k36k5K19O2k91j13N67K09n71
4595a29J3K28K37n59m6K04K91n16p6L85K97l27p0J54k25j06j1L48p4j32N8L51
4617B95k92Q6k6N2Lk85P0K49j09l3j79M21M7n96K69L15j30j5l43L54o9l36o2N54
4641B40nn84J69L38n2k36q3M87l53j20J17K90j44j39k07N99k38k92K41J02l25
4662a95j4L12J86j4m64J10M27q0l53j3J54P2k65K3M61m52k53J62L88J43o54J49
4684a70L39k45p1r5O93l93j78K78p1j66j93L15L23m14j03K85M03l71m13L58J1
4705A22j07n1J09j42k57nK07J86j24j02M37J92l12l55N44j02n33kO44l05j02j30
4727a88L26o3Jj53L78Nn01j28O59k11l08J06N4K68l09o2J13K77m97J2M79j77k5
$$ y = [59, 160, 265, -175, -97, 250, -145, -12, -90, 120, -124, -429, 212, 50, -186, -211, 8, 70, -221, -334, 233, 442, -129, -116, 112, 349, -210, -256, -52, 239, -277, -353, 32, 329, 2, -68, 86, -139, -245, -256, 92, 18, -114, -56, 295, 3, 89, 63, 115, 118, -167, -97, 152, 43, 10, -169, 252, 299, -297, -28, 287, 157, 142, -201, 153, 84, -252, -314, 240, 235, -349, -180, 158, 106, -130, -213, 274, -79, -199, -82, 208, 64, -75, -282, 317, 79, -213, 28, 130, -195, -209, 103, 289, 275, -189, -79, 348, 268, -85, -98, 56, 128, -137, -114, 347, -105, -358, -196, 192, 335, -319, -170, 169, -76, -147, -242, 451, 58, -120, 158, 87, -79, -272, 43, 366, -48, -151, 134, 537, 166, -247, 111, 122, 15, -36, 73, -69, -326, -331, -124, 62, -62, -164, 273, 465, 153, -202, 342, 240, -293, -295, 349, 44, -58, -188, 138, 75, 76, -77, 301, 306, -195, -323, 336, 125, -183, -77, -23, 245, -64, -126, -13, 264, -233, -221, 258, 81, 56]
4750E6m96P17l72q1M3L16q2k58k3M30k5k49j49L09K46m80J4K76k61k38K78J79
4772A50l4k69%N89n10l71L24L03k22k01Q4J88Rj18JK12Q7m63K68L54l89j29oM94
4796C51k07q5K06k21J71n21J20K23j36j85M15jp3j99J76K25l45m14M45J13j07
4817d9j71J83K71k31j97K90J47k22k44K30P2q1r4m7K50j30k47K88K01j99k24J50
4839e4K28m94J10M06R1l84k24J47L24l56P2J48K12m36n6L91j28l66R0O08j18l66
4861a55k4K87K40l83k06L25J61n70J83L15L9m09L52q5J81j67j57L27l3m47J95
4882c1K58J24n92J56J67Nk64o0O21j35o00OP34k91k89J04L50j55k25n6J57Oj95
4905b05K97k18j0k34p5L94m6p2K5J55J71l23K64p8J70k06k65N10l03n2J61K00
$$ y = [56, -440, 277, -95, -176, -133, 183, 101, -157, -180, 250, 225, -24, -173, 136, 382, -98, -84, 192, -69, -307, -29, 150, 116, -153, -153, 436, -74, -445, -121, 182, -40, -241, -157, 31, 40, -78, -77, 135, 222, -241, 27, 381, -8, -137, -143, 351, 144, 59, 265, 44, 215, -306, -186, 37, -99, -284, 131, 130, 57, -142, 34, 259, -86, -500, -55, 58, -49, -220, -37, 234, 3, -194, 96, 243, 21, -223, 7, 79, -2, -96, -143, 107, -23, -270, 18, 219, 20, -204, -54, 174, -320, -210, 196, 287, -97, -321, -174, 150, -206, -134, 14, 226, -210, -266, 125, -3, -369, -279, 329, 211, -155, -179, 108, 348, -35, -241, 84, 245, -325, -142, 173, 212, -197, 155, 70, 251, 84, -73, 254, 221, -226, -31, 227, 351, -241, -85, 82, 87, -177, -237, 384, 249, -351, -345, 389, 98, -191, -87, 263, 108, -117, -173, -16, -10, -205, 92, -126, -136, -370, -445, -51, -97, -169, -144, 11, 182, -141, 123, 45, 215, 9, -256, 254, -49, -101, 60, 260]
4927B60k70l42K69J39k12J02K0K15j44m63L53M26l31J0j32K72l33q4K95M47l75
4948A22n26L32K18j14m14M47L21m21LK00m2K3n33L86L20m34m1N10j59n75J14K00
4970f3L66k99j16L9J84m4m88O24K4l58J77r0L88m64P7K53n0l38K97o3j3j59m0
4993a56M37k6j87j63Q3p5Jl66K57J76l13q2M92O4l79Q5L61k39k12nL67K85n20
5016a15j67M46j03k86R4K64r0j37J24K39j35k91n4L52j4l22k7O15m62j18pM13
5038B19Nn56K84L75m51o3R7J10J94l85j84R13m93l11K82L57l27l78N79k03q4k15
5060b35K91R4K1n59M60j2J6n35M73P0l49j91Q7N58j75k25L07J95l89k83M69K37
5082C25j56m04K82L22l82K7M8J59m26O3L36J99p22j1L92K73n68m1L00L5k05J2
$$ y = [260, -10, -352, -83, 56, -156, -54, -34, 181, 37, -426, -73, 353, 22, 32, -100, 172, -161, -245, 50, 497, 122, -404, -72, 146, 32, -382, 65, 386, -35, -32, 168, 126, 149, -384, 2, 322, -112, -153, 357, 198, -377, -263, -63, 303, 4, -112, -73, 111, 67, -421, 203, 227, -131, 46, -44, 344, -120, -43, 210, 160, -178, 119, 56, 43, -116, -156, 281, 255, 68, -95, -12, -87, -86, -452, -195, -19, -332, -414, 78, 142, -237, -152, 209, -30, -242, -247, 120, 405, -115, -282, 164, 61, -225, -131, 133, 43, -94, 30, 269, 134, -157, -211, 141, 127, -195, -222, 393, -69, -187, -194, 219, 224, -332, -48, 327, -124, -187, -90, 20, 214, -171, -355, 558, 65, -246, 36, 393, 66, -312, 267, 64, -20, -235, 56, 150, 171, -388, 72, 60, 76, -459, 14, 84, -265, -456, -369, 189, 14, -211, 96, 291, -98, -381, 88, 325, 169, -235, 47, 369, -13, 14, 62, 221, -205, -142, 194, 393, -329, -340, 52, 325, -243, -284, 16, 51, -154, -142]
5104a42K39j58j00j7L32j21R2n99P93j46m28j80O22pl63K65k30M70n83L30M10
5125D79m51j94N5K3M2m7j62N67j04l16o9J53J12j82j25M38J31l40j67M25j20m41
5147b93J30N6K06j14k05L76j65n6r2L24p2j53j13L88j11k47p1L23k66J2J04K40
5169B01l52k19M68K34j85k28l9J72l7l28M03M02m86k04L3J60K67m66L37J0K74
$$ y = [-142, 97, -61, -161, -178, 154, 33, 125, -474, 319, 173, -255, -435, 187, 180, -183, 82, -148, 322, -261, 69, 479, 28, -166, -111, -88, -46, -93, -255, 312, 208, -108, -177, -24, 88, -94, -219, 219, 350, 10, -157, 268, 148, -293, -163, -107, 99, -15, -220, 156, -9, -65, -157, 167, 95, -58, -171, 217, 106, -141, -212, 111, -155, -143, -39, 201, -151, -370, 98, 332, 147, -81, -120, 52, 15, -313, 90, 492, 6, -198, -165, -5, 262, -204, 133, 143, 417]
$$ [...]
8191a04
##END NTUPLES=NMR FID
##END=
