##TITLE=1H_Pr 2596
 CDCl3,8 sc, 
 4.03.2021
##JCAMPDX= 6.0         $$ Bruker NMR JCAMP-DX V2.0
##DATA TYPE= NMR FID
##DATA CLASS= NTUPLES
##ORIGIN= UXNMR, Bruker Analytische Messtechnik GmbH
##OWNER= root
$$ XWIN-NMR		Version 3.5
$$ Thu Mar  4 10:28:45 2021 Russian Standard Time (UT+4h)  she@DPX200
##.OBSERVE FREQUENCY= 200.1315066352
##.OBSERVE NUCLEUS= ^1H
##.DELAY= (6, 6)
##.ACQUISITION MODE= SIMULTANEOUS
##.ACQUISITION SCHEME= undefined
##.AVERAGES= 8
##.DIGITISER RES= 18
##SPECTROMETER/DATA SYSTEM= spect
##.PULSE SEQUENCE= zg30
##.SOLVENT NAME= CDCl3
##.SHIFT REFERENCE= (INTERNAL, CDCl3, 0, 15.7039)
##AUDIT TRAIL= $$ (NUMBER, WHEN, WHO, WHERE, WHAT)
$$ ##TITLE= Audit trail, XWIN-NMR		Version 3.5
$$ ##JCAMPDX= 5.01
$$ ##ORIGIN= Bruker BioSpin GmbH
$$ ##OWNER= she
$$ F:/spectra/data/she/nmr/H-F/1/audita.txt
$$ ##AUDIT TRAIL=  $$ (NUMBER, WHEN, WHO, WHERE, WHAT)
(   1,<2021-03-04 10:27:35.87 +0400>,<she>,<DPX200>,
      <created by zg, POWCHK disabled, PULCHK disabled
       configuration hash MD5:
       00 E9 B6 7A A2 85 ED C7 34 08 36 98 17 FE 4E 26
       data hash MD5: 16K
       4A BB DA 3E 56 AD BB 7C DD 00 45 95 C1 D0 5F E5>)
$$ ##END=
$$ 
$$ hash MD5
$$ E5 8B F5 97 7D 84 05 77 E2 FF 34 F1 E8 DD F6 83
##$RELAX= 
##$RELAX= 
##$RELAX= 
##$RELAX= 
##$RELAX= 
##$RELAX= 
$$ Bruker specific parameters
$$ --------------------------
##$DU= <F:/spectra>
##$EXPNO= 1
##$NAME= <H-F>
##$PROCNO= 1
##$TYPE= <nmr>
##$USER= <she>
##$AMP= (0..31)
100 100 100 100 100 100 100 100 100 100 100 100 100 100 100 100 100 100 
100 100 100 100 100 100 100 100 100 100 100 100 100 100 
##$AQSEQ= 0
##$AQ_mod= 1
##$AUNM= <au_zg>
##$AUTOPOS= <>
##$BF1= 200.13
##$BF2= 200.13
##$BF3= 200.13
##$BF4= 200.13
##$BF5= 200.13
##$BF6= 200.13
##$BF7= 200.13
##$BF8= 200.13
##$BYTORDA= 1
##$CFDGTYP= 0
##$CFRGTYP= 5
##$CHEMSTR= <none>
##$CNST= (0..31)
1 1 145 1 1 1 1 1 1 1 1 1 1 1 1 1 1 1 1 1 1 1 1 1 1 1 1 1 1 1 1 1 
##$CPDPRG= <>
##$CPDPRG1= <>
##$CPDPRG2= <>
##$CPDPRG3= <>
##$CPDPRG4= <mlev>
##$CPDPRG5= <mlev>
##$CPDPRG6= <mlev>
##$CPDPRG7= <mlev>
##$CPDPRG8= <mlev>
##$CPDPRGB= <>
##$CPDPRGT= <>
##$D= (0..31)
0 1.2 0 0 0 0 0 0 0 0.06 0 0.03 0 0 0 0 0.0002 0 0 0 0 0 0 0 0 0 0 0 0 
0 0 0 
##$DATE= 1614839255
##$DBL= (0..7)
120 120 120 120 120 120 120 120 
##$DBP= (0..7)
150 150 150 150 150 150 150 150 
##$DBP07= 0
##$DBPNAM0= <>
##$DBPNAM1= <>
##$DBPNAM2= <>
##$DBPNAM3= <>
##$DBPNAM4= <>
##$DBPNAM5= <>
##$DBPNAM6= <>
##$DBPNAM7= <>
##$DBPOAL= (0..7)
0.5 0.5 0.5 0.5 0.5 0.5 0.5 0.5 
##$DBPOFFS= (0..7)
0 0 0 0 0 0 0 0 
##$DE= 6
##$DECBNUC= <off>
##$DECIM= 32
##$DECNUC= <off>
##$DECSTAT= 4
##$DIGMOD= 1
##$DIGTYP= 9
##$DL= (0..7)
0 120 120 120 120 120 120 120 
##$DP= (0..7)
150 150 150 150 150 150 150 150 
##$DP07= 0
##$DPNAME0= <>
##$DPNAME1= <>
##$DPNAME2= <>
##$DPNAME3= <>
##$DPNAME4= <>
##$DPNAME5= <>
##$DPNAME6= <>
##$DPNAME7= <>
##$DPOAL= (0..7)
0.5 0.5 0.5 0.5 0.5 0.5 0.5 0.5 
##$DPOFFS= (0..7)
0 0 0 0 0 0 0 0 
##$DQDMODE= 0
##$DR= 18
##$DS= 0
##$DSLIST= <SSSSSSSSSSSSSSS>
$$ [...]
##$SUBNAM2= <"">
##$SUBNAM3= <"">
##$SUBNAM4= <"">
##$SUBNAM5= <"">
##$SUBNAM6= <"">
##$SUBNAM7= <"">
##$SUBNAM8= <"">
##$SUBNAM9= <"">
##$SW= 16.9725356469052
##$SWIBOX= (0..15)
0 0 2 0 0 0 0 0 0 0 0 0 0 0 0 0 
##$SW_h= 3396.73913043478
##$TD= 16384
##$TD0= 1
##$TE= 0
##$TE2= 300
##$TE3= 300
##$TEG= 300
##$TL= (0..7)
0 120 120 120 120 120 120 120 
##$TP= (0..7)
150 150 150 150 150 150 150 150 
##$TP07= 0
##$TPNAME0= <>
##$TPNAME1= <>
##$TPNAME2= <>
##$TPNAME3= <>
##$TPNAME4= <>
##$TPNAME5= <>
##$TPNAME6= <>
##$TPNAME7= <>
##$TPOAL= (0..7)
0.5 0.5 0.5 0.5 0.5 0.5 0.5 0.5 
##$TPOFFS= (0..7)
0 0 0 0 0 0 0 0 
##$TUNHIN= 0
##$TUNHOUT= 0
##$TUNXOUT= 0
##$USERA1= <user>
##$USERA2= <user>
##$USERA3= <user>
##$USERA4= <user>
##$USERA5= <user>
##$V9= 5
##$VALIST= <valist>
##$VCLIST= <CCCCCCCCCCCCCCC>
##$VD= 0
##$VDLIST= <DDDDDDDDDDDDDDD>
##$VPLIST= <PPPPPPPPPPPPPPP>
##$VTLIST= <TTTTTTTTTTTTTTT>
##$WBST= 1024
##$WBSW= 4
##$XGAIN= (0..3)
0 0 0 0 
##$XL= 0
##$YL= 0
##$YMAX_a= 736903
##$YMIN_a= -475880
##$ZGOPTNS= <>
##$ZL1= 120
##$ZL2= 120
##$ZL3= 120
##$ZL4= 120
##$ABSF1= 10
##$ABSF2= 0
##$ABSG= 5
##$ABSL= 3
##$ALPHA= 0
##$AQORDER= 0
##$ASSFAC= 0
##$ASSFACI= 0
##$ASSFACX= 0
##$ASSWID= 0
##$AUNMP= <proc_1d>
##$AZFE= 0.1
##$AZFW= 0.1
##$BCFW= 1
##$BC_mod= 2
##$BYTORDP= 1
##$COROFFS= 0
##$CY= 11.3945322036743
##$DATMOD= 1
##$DC= 2
##$DFILT= <>
##$DTYPP= 0
##$F1P= 15.9154993809931
##$F2P= -4.1035820241983
##$FCOR= 0.5
##$FTSIZE= 0
##$FT_mod= 4
##$GAMMA= 1
##$GB= 0.15
##$INTBC= 1
##$INTSCL= 1
##$ISEN= 128
##$LB= 0.24
##$LEV0= 0
##$LPBIN= 0
##$MAXI= 10000
##$MC2= 0
##$MEAN= 0
##$ME_mod= 0
##$MI= 1.114404
##$NCOEF= 0
##$NC_proc= 0
##$NLEV= 6
##$NOISF1= 3.799351
##$NOISF2= 2.8
##$NSP= 1
##$NTH_PI= 0
##$NZP= 0
##$OFFSET= 15.70392
##$PC= 1
##$PHC0= -10759.79
##$PHC1= 10.00094
##$PH_mod= 1
##$PKNL= yes
##$PPARMOD= 0
##$PSCAL= 0
##$PSIGN= 0
##$REVERSE= no
##$SF= 200.130013532006
##$SI= 16384
##$SIGF1= 3
##$SIGF2= 2
##$SINO= 400
##$SIOLD= 16384
##$SREGLST= <1H.CDCl3>
##$SSB= 0
##$STSI= 0
##$STSR= 0
##$SW_p= 3612.71676300578
##$SYMM= 0
##$S_DEV= 0
##$TDeff= 0
##$TDoff= 0
##$TI= <>
##$TILT= no
##$TM1= 0
##$TM2= 0
##$TOPLEV= 0
##$USERP1= <user>
##$USERP2= <user>
##$USERP3= <user>
##$USERP4= <user>
##$USERP5= <user>
##$WDW= 1
##$XDIM= 8192
##$YMAX_p= 0
##$YMIN_p= 0
$$ End of Bruker specific parameters
$$ ---------------------------------
##NTUPLES= NMR FID
##VAR_NAME=  TIME,          FID/REAL,        FID/IMAG
##SYMBOL=    X,             R,               I
##VAR_TYPE=  INDEPENDENT,   DEPENDENT,       DEPENDENT
##VAR_FORM=  AFFN,          ASDF,            ASDF
##VAR_DIM=   8192,          8192,            8192
##UNITS=     SECONDS,       ARBITRARY UNITS, ARBITRARY UNITS
##FACTOR=    0.0002944,     1,               1
##FIRST=     0,             0,               0
##LAST=      2.4114304,     0,               0
##MIN=       0,             -475880,         0
##MAX=       2.4114304,     736903,          0
$$ Real data points
##PAGE= N=1
##DATA TABLE= (X++(R..R)), XYDATA
0@%%%%%%qJ6j6J6k4L7m5N6p2Q8j12J42j74K08k49K98l54M19m88N68o58P59q73
29d66J002j145J302j477J672j888K123k380K663k974L312l681M087m527N007n532
45b902O106o734P418q167Q989r897J0899j2007J3240j4623J6184j7956J9992k2360
59a1818K5147k8483L2560l7664M4250n3101O5653q4862J18054j90587N97155K0467
71D96771o81359N14425m27883O14921n81588L50368k56116j98205R05569p49589
81a2686K18547k03983K85436J85389o11741M49121n90928N51508j81468l33451
91b44256K48931m80555P42535m32645l6597J0930j1847N94332p81984M76532k13689
102a28313j6030M00000m82450J92804m22545O80109k18952m68502N43550l65352
$$ y = [0, 0, 0, 0, 0, 0, 0, -8, 8, -8, 8, -16, 21, -24, 32, -40, 48, -64, 78, -96, 112, -137, 161, -193, 226, -262, 306, -352, 407, -466, 536, -609, 693, -784, 888, -1000, 1123, -1257, 1406, -1568, 1744, -1937, 2150, -2377, 2630, -2902, 3204, -3530, 3888, -4279, 4710, -5187, 5712, -6295, 6945, -7678, 8506, -9450, 10542, -11818, 13329, -15154, 17406, -20258, 23992, -29109, 36544, -48318, 69736, -120851, 476304, 496771, -184588, 329837, -98046, 516875, -64713, 285655, 29539, -168666, 736903, -12686, 205861, 1878, 287314, 472703, -139038, 310083, -280845, 270663, 89195, -244256, 4675, -475880, 266655, -165990, -202587, -191657, -203504, 390828, -391156, 85376, -128313, -144343, 255657, -226793, -33989, -456534, 223575, 4623, -463879, 79671, -285681]
112b85681M61236k51872R0230o8022r0380O90098p26625K04122l3823O1963J77843
123B29089m98515L64054l87198M07098k7916l68301L30064k87790N46735l36483
133b9163j02330J80865j13327L81423n50138K66166j27941k8882L51683n02859
143b74503J95809j32872L90896j60789l02263M69839l37799L71262j65594j08199
153e4213N5928o4713M18751o12445J82716N8875o6225J99484l85164K69632j91281
164a88655K79108k625l47921L12210j73694L18057k85315j06709K02630j52249
174a45163K63704l85402J49881j9635J9270K58630m42844K45187l00J72289q8242
185B7375k14448L36600k53379K78077j50664j71131J66179l6218K25784m19032
$$ y = [-285681, 175555, -76317, 13913, -54109, -144489, 545609, -181016, 23106, -10717, 51246, 229089, -269426, 94628, -292570, 114528, 86612, -281689, 48375, -239415, 307320, -29163, -131493, 49372, -63955, 317468, -232670, 33496, -94445, -123327, 228356, -274503, -78694, -211566, 179330, 18541, -283722, 186117, -151682, 219580, 53986, -54213, 1715, -62998, 355753, -256692, -73976, -15101, -81326, 118158, -267006, 2626, -188655, 90453, 87828, -260093, 52117, -121577, 196480, -88835, -195544, 7086, -145163, 118541, -266861, -116980, -136615, -117345, 141285, -301559, -56372, -56672, 115617, 27375, -187073, 149527, -103852, 174225, 23561, -147570, 18609, -17609, 208175, -210857]
195b10857J84201R7304p5015J81734k94362J99532p2874J68878m5080k98178K83289
206A18572j23478J54778k18719p4163J95620j35841K00076k76445Q0446P5069
216d085J3910J25669l50536K33457J1762K4936n3349j76203K22265j49898J87149
227H5077j58581j31243K27013l8892J10783k66382J54847R2308p0906J27136k49679
238a18519J47597j40P0961p0399k11919K56299p5669O6514j32299k8761J71852
249G5517q3560J35270k12520N7805J14492k0453K0698k40467K01926m040k4150
260B0518k3958j36263J74172n4265J01373j44239n7570K18730n9761L0814j67114
271i7563J06615O4752n8605M9884j96020J29362L3651J1785q0574j09008K18637
$$ y = [-210857, -26656, 70648, -4367, 177367, -116995, 82537, 9663, 178541, 133461, -164717, 118572, -4906, 149872, -68847, -143010, 52610, -83231, 116845, -159600, -79154, -4085, 9825, 135494, -215042, 18415, 30177, 55113, 1764, -174439, 47826, -102072, 85077, -73504, -204747, 22266, -16626, 94157, -172225, -17378, 74930, 4024, 131160, -118519, 29078, 28938, 99899, 29500, -182419, 73880, -1789, 64725, -67574, -96335, 75517, -8043, 127227, -85293, -27488, 87004, 66551, 87249, -153218, 48708, 44668, 20518, -3440, -139703, 34469, -19796, 81577, -62662, -120232, 98498, 38737, 69551, -97563, 9052, 73804, 15199, 65083, -130937, -1575, 32076, 43861, -36713, -145721, 72916]
282G2916n6675K3380q7846m140J30980n3397N7861j77325O6861J07994n3345k8632
294a368j30508J64411r987j6345k2497q7064J49794j1817K5757j28369J1555J56468
306A00030p6846m679j10674Q7304M3817l6400j346j30696J40210L1352k0643p6079
318e4650k9624J65566n8610L67p5261J6282R5617l5512l615j30422J04420P2025
330F6583n8803l6892n1220J34996j9788k152m9174l8559J32976k3167j8412j04157
342f7769O1442R4267p5678p774p3821Q9013K7471k4353l3471p1044J38934n331
354E1886l7123o8916J6437J09864o7454j583p7543M5532P0390l9491k7876q5692
366a11569J28528J9832n5810l1030k1103J12490l6713l551o6589M902J16038m9958
$$ y = [72916, 16241, 39621, -48225, -52365, 78615, 25218, 83079, -94246, -27385, 80609, 27264, -1368, -131876, 32535, 22548, 6203, -16294, -103358, 46436, 34619, 60376, -67993, -56438, 100030, 23184, 18505, -92169, -4865, 38952, 2552, 1206, -129490, 10720, 42072, 21429, -54650, -84274, 81292, 22682, 23049, -52212, -35930, 59687, 24175, 20560, -109862, -5442, 66583, 7780, -29112, -80332, 54664, 34876, 32724, -16450, -55009, 77967, 54800, 36388, -67769, -6327, 87940, 12262, 4488, -69333, 19680, 47151, 22798, -10673, -81717, 57217, 51886, 14763, -54153, -37716, 72148, 4694, 3111, -74432, -28900, 41490, 1999, -25877, -111569, 16959, 36791, -19019, -50049, -71152, 41338, 4625, 1074, -65515, -60613, 55425, 5467]
378E467k7679p1395R2219M8633o5648r68n6321J02637P481k6452m3885k7519J36087
391G2657m6529k9154m8496L9410Q2144p0020R038p0444P4184N1862n6628k3102
403a5078n0543J29675k5268m6527j9091j2866J03410n4700n474o4375L5504R5734
415G0401q2915j2811n0679R2689J5972o9177N521n2260J08406j7078m2349l2797
427f7077k012J20959p8400j6578l0409M2035O7848p9584J2511n8954Q9732L0404
439C0475p5700R46k8087J21411m6784l6875L433p712J04025o7586n815l9336N0417
452B812P6898j01859J0789k8496Q2334L779o6988J8533l8417J11486l6477m9947
464a5553k616Q776R8567r5769m831j4352L2410N9393r4431J5238l6666Q4333J0921
$$ y = [5467, -22212, -93607, -1388, 47245, -18403, -19371, -75692, 26945, 34426, 7974, -35911, -63430, 72657, 26128, -3026, -51522, -12112, 70032, 12, 9050, -61394, 12790, 64652, 8024, -15078, -65621, 64054, 38786, -7741, -26832, -39698, 63712, 9012, 3538, -60837, -25333, 70401, -12514, -25325, -76004, 16685, 32657, -36520, -30999, -83259, 25147, 8069, -34280, -67077, -69089, 51870, -26530, -43108, -73517, -31482, 36366, -43218, -30707, -89661, 71, 30475, -45225, -44279, -72366, 49045, 2261, -34614, -31181, -38893, 65132, -2454, -8269, -47605, 2812, 79710, -22149, -11360, -39856, 42478, 46257, -20731, -2198, -40615, 70871, 34394, -15553, -18169, -9393, 89174, -6595, -11426, -25778, 6632, 66025, -28406, -13168, -49834, 34499, 45420]
477D5420q9347K5110j6573R8383n6942l9645J5647q785R1135q4792j1737j3856
489d5982M5315N2792j09901L0235j3392O5316N33p0154L0337k3308R8133n0902
501I022n3249K7682O052P3887r2335K927P100K6764N3125r3730K6218m434O9759
514E8788j014q4231M6886n792P2247n5452l8813L1095l853P3858q9220p051J7962
527A5410L3343L3632j01162M0293j164M3773n235p8599L6424j0695O4835o2265
539H590n1132M3121l97M6548q3729L873K1868J8009L4577r1042K9735J1956M2169
552C4146j7247p5564N4836m932M5327m8417l5793M5790M607N1327p9587O002M1868
565B2363J7560J8182q1243M1361J1096K7286j4723o9662M7805K719L7986n6033
$$ y = [45420, -43927, -18817, -35390, 62993, 6051, -33594, -17947, -26732, 64403, -20389, -32126, -45982, -667, 52125, -57776, -27541, -40933, 24383, 24916, -45238, -14901, -38209, 59924, 9022, -44227, -16545, -10493, 63394, -28941, -26014, -18914, 7850, 60975, -32755, -6537, -10971, 58788, 57774, -26457, 20429, 14637, 86884, 31432, -7381, 23714, 19861, 93719, 4499, -2552, 15410, 48753, 82385, -18777, 21516, 20352, 64125, 58890, -19709, 16715, 6020, 70855, 8590, -42542, 579, 182, 46730, -36999, -33126, -11258, 6751, 41328, -49714, -19979, -8023, 34146, 16899, -58665, -3829, -8761, 36566, -11851, -47644, -1854, 2753, 54080, -25507, -19505, 22363, 39923, 58105, -23138, 18223, 29319, 56605, 41882, -27780, 20025, 22744, 60730, 4697]
577D697l3790N6449J028K6896o9123Q629L2391P183J3704q2295L0585K1309J5103
590C2766k8038n8240N6229k504K4926l9807l0082N2946P883K0980o9301J3609
602a8633M2261k436K947o5931L3528J9065J1456k3369n0844N5576P686J6791m3510
615a5413k0449N7969PN310n7240J3180L3885k692k280o5459L4854L1148j723k8687
629a7590l1492N5426K125J2303l4279k1608N6086N121o807n3551K2222L5146j1608
642A1494k867m8894L4151K9345n70k7206k5734N4046M674N27l6638j2009N0168
655C0487m071j4869m3260J8737K9038p299j1614m5102L9331L1067j5199k7994
667b0748j1155M4524j035j386l5637j1673N2610k974k5858l2502L0277K6145r994
$$ y = [4697, -29093, 27356, 28384, 55280, -13843, -5214, 27177, 34360, 48064, -34231, -3646, 17663, 32766, 4728, -53512, 2717, 213, 25139, -14668, -44750, 8196, 16079, 37059, -32242, -18633, 23628, 21192, 24139, -41792, -8264, 10801, 22257, -1112, -51956, 3620, 11306, 28097, -15413, -35862, 22107, 22114, 27424, -29816, -16636, 17249, 14557, 12277, -53182, -18328, 12820, 11097, -17590, -49082, 6344, 8469, 20772, -13507, -35115, 20971, 26092, 19285, -34266, -12044, 23102, 11494, 8627, -40267, -6116, 23229, 22659, -4547, -30281, 23765, 28439, 28966, -7672, -19681, 30487, 26416, 11547, -31713, -12976, 16062, 8763, -2851, -47953, -8622, 22445, 7246, -20748, -31903, 12621, 11586, 10200, -25437, -37110, 15500, 12526, -13332, -45834, -15557, 10588, 594]
680E94q235l2200L9080K9872j4945k9460l721M4107k782r218l2449P57M4695p378
694A8717k4166k3261K8083K3169o831j7553k5458M2200K0295k5163k5741L920
706a1789L0260l259j0091l4218N992M5661j1382k9945j1574L2498J5186q011j6587
719g259k0290M0588J7077k7529k7015J1074L0766p543j2525k7496J6207L7685
731B3740j2583k5625q391L3162J2413r794k3361j0787M1170M993k8129k0469J4600
744i061K2537l898j3319k7126K4244L3549j7898k5175J69K9772M504q460k3682
757a3844p191L9695O60k8265j8667K0844K2059r269j2440k0872K8475K5132j8831
770G486k2029j373L2440R88j2799k4340K856L8003q376k2259j3887K2496J9683
$$ y = [594, -7641, -39841, -761, 29111, 14166, -15294, -19015, 25092, 22310, 13092, -19357, -18600, 26095, 18717, -5449, -28710, -627, 22542, 15711, -1842, -27300, 14900, 35195, 10032, -15709, -11789, 18471, 15212, 5121, -29097, -23105, 22556, 11174, -18771, -30345, 2153, 17339, 9328, -7259, -27549, 13039, 30116, 2587, -24428, -13354, 17412, 9869, -2656, -30152, -13945, 23740, 11157, -14468, -22859, 10303, 22716, 12922, -10439, -21226, 19944, 24937, -3192, -23661, -9061, 13476, 9578, -3741, -30867, -6623, 26926, 9028, -16147, -15978, 13794, 18298, 9838, -13844, -21035, 18660, 19320, -8945, -27612, -6768, 15291, 6022, -6418, -27290, 1185, 26317, 7486, -14543, -15916, 16524, 17512, 4713, -19627, -16771, 21232, 12856, -9403, -23290, -794, 18889]
783A8889p825j4610j8305L5454J6392k2814j7826K957K8366l615j1527k2501N288
796a1677L6823j2293k1645j0736K4446J6401j5038j2105j4661L2586R321k3693
808b271j6176J365L1331q806j4553j7561J1196L3194j8816j3523r409K4744J6568
821A7283j7805j1458r853L7076K675k4229q554M418L0663r703j3039j3153J5053
834f26L2173k2386j2126n066K4429J2271k2483p599q205L2199n72k5525o203L418
848f301L0746j6105j5279p041J3467K5687k5931r222n939K2916J1025k7131n578
861a4686l429L1649n979k3898l31M784K9942j7350j4032k858J5373K4361k9279
874e733o447j12K1571P910k7903m09q59K8751o238k5089L400O463K7192k2024
$$ y = [18889, 11064, -3546, -21851, 13603, 29995, 7181, -10645, -7688, 20678, 17063, 5536, -16965, -11677, 25146, 12853, -8792, -19528, 4918, 21319, 6281, -5824, -20485, 12101, 21422, -2271, -18447, -17082, 14249, 5443, -9110, -26671, -15475, 17719, -1097, -14620, -24029, 715, 17283, -522, -11980, -21833, 15243, 17918, -6311, -14865, -10447, 20216, 10513, -2526, -15679, -626, 31547, 9161, -2965, -8031, 16398, 28669, 6186, -1413, -9618, 22581, 22009, -3516, -9719, -6301, 24445, 8340, -6939, -13980, -513, 25174, -757, -9979, -15918, 6998, 18023, -9108, -14686, -18115, 13534, 7555, -16343, -16674, -11890, 18052, 702, -13330, -16188, -815, 23546, -5733, -12180, -12292, 9279, 17189, -10714, -11123, -11982, 16769, 10531, -14558, -11158, -4695, 22497, 473]
888D73j2958L026J1009K0755l0269m248J034K0216O435l0219M097J575K6618r731
902G813k2737Q237N001K5276k2080j2125N442J2513J7161l1749p52M993J7626
915A4619L223k9013O086K642K3662j1728k4699J1597N283J8964k4616j0782Q442
928f320Q394J4519l3181O61P574J4362J029l0098J0201L984J9840j3553k1512
941b4100J5357L682J7873k3243q257J1706R845J2441l2343O910R821J1215J555
954A2462k6890J1768N455J8411j5248k0558K0044K134J3474k2644p241J3399O757
967A1323R131l3228Q129J0443O733j540k7546J3897N542J3216j7766j8142K1512
980A704o10J1579k3214n700J5881N845N074l1495J3087J0042L081J08k5347J5429
$$ y = [473, -12485, -9459, 1550, 22305, -7964, -12212, -11178, 9038, 15473, -14746, -10649, -9074, 17544, 7813, -14924, -6687, -1686, 23590, 1510, -10615, -5173, 7340, 24501, -7248, -8000, -3007, 14619, 17842, -11171, -5085, -2443, 21219, 9491, -15208, -3611, 1672, 20636, -3980, -14762, -6320, 2074, 16593, -16588, -15927, -8353, 6009, 7038, -23060, -12859, -8875, 10965, -2588, -24100, -8743, -5061, 12812, -10431, -18688, -6982, 2863, 15304, -17039, -10129, -308, 10907, 12462, -14428, -2660, 2795, 21206, 5958, -14600, 5444, 7578, 21052, -1592, -8833, 4566, 11323, 20454, -12774, -4645, 5798, 12531, 10991, -16555, -2658, 2884, 16100, -1666, -19808, 1704, 1094, 12673, -10541, -16241, -360, 5485, 10559, -20936, -7849, 2193, 5274, 5382, -19965, -4536]
994d536P291J0582j8433j4212K5350l353R051j9868m496J7421L867L018k9976
1007a8294J5364J0331m29K4k4646J7772O131P118j8435j1482K5797o151Q175k0127
1021h852l561K0077R19o46k6757J8130Q328k457N38k3877J9146P801K312j8318
1035g217p615K6009q494O594j7841l409K1249j691k898k3609J9651O945n136J303
1049C841k2834K0700O443j577j5446n862K5494j0667O392j7454j479K3258n989
1062D820m037j8894J9856N139n458J328k1315K2613O309n977j3468j885K3404
1075A2435j1126N006j5830l29K4027q944n367j4881J9377M815q624K233j9515
1088a6723K3018M434r092j0061j261K2288j1808L122j4754J830K3337j2438m620
$$ y = [-4536, 2755, 13337, -5096, -19308, 6042, 2689, 11740, -8128, -12624, 4797, 8664, 11682, -18294, -2930, 7401, 6972, 6996, -17650, 122, 6253, 13371, -5064, -16546, 9251, 3100, 11275, -8852, -12413, 7664, 8583, 7937, -18820, -690, 7638, 5181, 5719, -18158, 988, 8789, 11101, -7217, -14832, 11177, 2683, 9277, -8564, -11973, 9276, 7585, 4687, -18922, 729, 7674, 2538, 3841, -18993, 1707, 8150, 6573, -8873, -14735, 10759, 92, 6484, -10970, -12449, 10809, 4820, 783, -18111, 1745, 6884, 1426, 2754, -18561, 4052, 10361, 4384, -9084, -10969, 12435, 1309, 6315, -9515, -9844, 14183, 5239, -128, -15009, 4368, 9183, 559, 2792, -16723, 6295, 10729, 1637, -8424, -9685, 12603, 795, 3917, -10837, -9007, 14330, 1892, -2728]
1101b728j1308J8036L316p957Q19j7212K4423J728j1479o209N05J9797j1841K299
1115B189j2898L266K2768j4707n365o141J5961L041r195L40j3347K3740r9j3096
1129c543l399J363J7962j1690K87j0433M983K0844j7416k651m704J4123L218j0553
1143a609M92j0807K2708k198j3675l62J352J5395j0653j131q572O437J7770j7715
1157b568k818j496J2708J958j0881J89p520K1044m230j3737J892J922J4058j1231
1171g10k460n011P468J4463j8355p39j59J1170J897j1990J19l361J8737o748j2323
1186h002L525K289J2427j0899l052l179Q689J1423j8374O91J205R304N68j1596
1200d981J026j483J5875o828j1515M622K780J0335j0402l635n34Q265Q465j7487
$$ y = [-2728, -14036, 4000, 7316, -641, 178, -17034, 7389, 9117, -2362, -8571, -8066, 11731, -110, 2189, -10709, -7443, 15325, 618, -4747, -10888, 5073, 8114, -1081, -741, -14088, 9652, 9553, -3543, -6942, -5579, 12383, 693, 980, -9453, -4470, 16374, -1042, -3693, -8397, 5726, 8944, -1609, -1117, -11924, 10784, 8586, -5089, -5451, -4099, 11296, 643, -488, -9060, -2623, 15147, -2568, -5386, -6882, 5826, 7784, -3097, -2908, -10428, 10616, 6386, -7351, -5459, -3537, 10521, -710, -3170, -8181, -713, 13750, -4605, -5344, -5503, 5667, 7564, -4426, -4307, -7668, 11069, 4321, -8002, -4477, -2188, 10239, -660, -3712, -6891, 1798, 13221, -5153, -4462, -3257, 6047, 6615, -4981, -3955, -5438, 10437, 3609, -7906, -3284, -504, 9831, -571, -4206, -4740, 3525, 11990, -5497]
1214e497J441J594Q651j25j2410J925J187J3954r035r806O377K600Q746j0829
1228a227l757J592P884N254j6647K438K954P343j606j1065K305K584J1530r400
1242A82q174O653K990O947j0997l019K842P057L249j5479L225L475N842j468j0904
1257g579L667L504R279r886o689P137K738N158j0899k406M093O807J76j3922M614
1272d208M039N023k831r324M668M358O960j0463n033P561K351L418j0389j679
1286e549M940N893j210j2464N322M368M090l699q456N166L878N020j0547l612
1300f860P442R94K265j0184m02N556M846k875j0594O542L774K807m259p098N175
1315b871M646K757j0754j442P146J256Q76q807K89O006M492m022q382P022L631
$$ y = [-5497, -4056, -2462, 6189, 6064, -6346, -4421, -3234, 10720, 1685, -8121, -1744, 856, 9602, -1227, -4984, -3392, 4492, 9746, -6901, -4463, -1509, 5834, 4228, -6837, -4532, -1948, 9582, 182, -7992, -1339, 1651, 8598, -2399, -5418, -2576, 4481, 7730, -7749, -4524, -1049, 4793, 3325, -7579, -3912, -408, 8871, -1015, -7704, -567, 2171, 7329, -3570, -5976, -1883, 4924, 5100, -8822, -4208, -169, 4854, 2023, -7301, -2633, 1725, 8685, -1778, -6811, 750, 3101, 6519, -3870, -5549, -609, 5284, 4074, -8390, -3068, 1300, 5390, 1691, -6765, -1599, 2279, 7299, -3248, -6860, 582, 1576, 3841, -6343, -6745, -1189, 3657, 782, -9812, -3270, 504, 3311, -948, -8046, -2871, 1775, 4532, -6222, -7664, -518, 738, 1614, -7193, -6904, -898, 3594, -428, -8810, -1788, 1843]
1330A843J769m435o383O054M227J060j0168m09P194N23K16q020J041O786L360
1345D658m941p757P749K235J293n003n371O139L859o20r744J853O706J18j17p261
1361f204K294O508K070n876n761P794J769J32n094m288O719L294j625q736L080
1376c924O452o37m82p118L624N953Q25o253m875Q331M06k34n098l434P320K518
1392C374k300p727M640N427q92q26o409M127N214l44o363l078Q200k07p35m772
1408b671j981P522J697k578o750N243N218k322r88o104N041M560k266n288k181
1423c848Q037j043n13m370j184Q086k03k993n247N300L908k636j149n904N728
1438A969L859l160m726q95P566j202j079l857k22Q030j389l425l926M996L450
$$ y = [1843, 3612, -823, -7206, -1152, 3075, 4135, -6033, -6442, 752, 1275, 1491, -6529, -5488, 1298, 4658, -283, -8040, -291, 1944, 3237, -1766, -7137, -998, 2861, 2241, -7503, -5650, 1056, 1174, 1057, -6204, -3910, 2598, 4668, -1208, -6969, 825, 2594, 2726, -2368, -6656, 63, 3357, 1732, -7004, -3924, 2528, 1891, 1409, -5709, -2085, 3868, 4693, -1560, -6435, 1896, 2302, 2068, -3030, -6464, 856, 3374, 1074, -6653, -2013, 3414, 2522, 1696, -4713, -586, 4628, 4284, -2079, -5157, 3043, 2836, 2101, -2671, -4652, 2870, 4567, 1989, -4761, 482, 5700, 3378, 2390, -3714, 1327, 5887, 3621, -1667, -3848, 4189, 3146, 2633, -1737, -2921, 5165, 4962, 1969, -3278, 2022, 5930, 3294, 2145, -3759, 1969, 5828, 2668, -2058, -2953, 4613, 3411, 2332, -1525, -1747, 6283, 4894, 1469, -2457, 2539, 5989]
1453E989l671j133m763N664L584m267l562l27P635j620j617l023j93Q065k726
1468D035l427l460N218K764m076j187l874O595K454m685k274L5P255k259k259
1483H55k250M40P482m069l461j599M210K892m517o65k676N873K406n289j301O29
1499a040O112k194k741j492N65O543m434k730r26L817K606m976j70j871N900J514
1515D483n873k29R85N301k384l588o65J168N463m648l176P65L356K568n015n02
1531a991o04N092J249o249P46J030M091k381l660N25Q48N078m707k605J801K565
1547H28K494n198O0L08M341L46o145J210J461L504k612l641J253J502M176m814
1563i27k717L163J974J733n002J53Q00L598J3o473J915K113K051j879l635J758
$$ y = [5989, 2318, 1185, -3578, 2086, 5670, 1403, -2159, -2486, 5149, 3529, 1912, -1111, -1304, 6761, 4035, 608, -2852, 2366, 5130, 1054, -133, -4007, 2588, 5042, 357, -1917, -1882, 5373, 3114, 855, -1395, -955, 6527, 2458, -1003, -2602, 1608, 4500, -17, -682, -3358, 2515, 4921, -368, -1669, -1040, 5072, 2878, 137, -1355, -790, 5753, 1319, -1411, -2337, 1480, 4086, -890, -1060, -2931, 2969, 4483, -1390, -1619, -634, 4667, 2283, -1305, -1970, -802, 4661, 13, -3163, -2398, 958, 3526, -1489, -1991, -2595, 2497, 3746, -2503, -1757, -727, 3364, 983, -2677, -2152, -1304, 3774, -933, -3538, -1737, 828, 3322, -1876, -1816, -1508, 2833, 3179, -2966, -1756, -295, 3209, 597, -3044, -1791, -289, 3887, -927, -3644, -481, 1493, 3226, -1776, -1623, -823, 2775, 2788, -3685, -1770, 343, 2394, 515, -3120, -1362]
1579a362J599L584m602k521L684J664P84m241l50J786K669m89n769K258K373J218
1595B285j841l326K012J776K404m360k044M417K98O09l812p51K801J774r59n288
1611d005K799K756k16r90l595K589K164J145m075k070N015l39J01k959j021L148
1627D47J753j429m760L445K537r15n03l332K320K481K53l823j506M987p10j87
1643A058k532j038L962P82j874l577L306K519j838N8l354K426K891p96l687p45
1659b439M802j346m54j844j269M334N78k397l007L313K094j895K60l402K674K632
1675B634k031k650k71M609j390r30r48j302M726n19k801j769L066J975k466M27
1691C60k752K638K787l003j881K61M083j552l21j279j275M984j062k779r54K781
$$ y = [-1362, 237, 3821, -781, -3302, 382, 2046, 2830, -1411, -1761, 25, 2694, 2205, -3564, -1306, 1067, 2285, 444, -2882, -870, 906, 3310, -1050, -3094, 1323, 1621, 2230, -1582, -2333, 468, 2242, 1283, -4005, -1206, 1550, 1334, 344, -3251, -662, 1502, 2647, -1428, -3498, 1517, 1178, 1279, -1680, -2701, 447, 2200, 771, -3989, -544, 1993, 1078, 575, -2757, -437, 2044, 2297, -1526, -3032, 1955, 1245, 1058, -1474, -2512, 1450, 2232, 358, -3219, 87, 2606, 768, 826, -2528, -102, 2789, 1993, -1694, -2439, 2363, 1017, 563, -1281, -2550, 1784, 2362, -35, -3042, 271, 2365, 470, 730, -2672, 2, 2634, 603, -2047, -2318, 2291, 901, -29, -977, -2279, 2447, 1928, -873, -2642, 424, 2399, -67, 360, -2392, 246, 3033, 30, -1851, -1590, 2493, 941, 620, -659, -1934, 3050, 1988, -791, -1745, 1036]
1707A036J410k427N84k831K779L104m021q70M05L419j489r18n95j098N073j842
1723A719k905K67J942J653k664P78k610L038K477m377j92O67K828j449q98n19
1739b45p11M670k690k502J046J555J468k744K26j671L135J636m608O28Q94J656
1755A743r95j348k30l01M407l243k043J645P79J504k553j58j180L150J300m762
1771b285J222M35K153j131j704K8k50M385l449j693J862N75J507k785k61m11K814
1788A012M52m187J603M93J748j117j830K36M77L069l232j311J756M48J441k777
1804a719j84L81J959M00m322K074L61J469q77j917M72O96K513l067r63J850K30
1821f44R12k616PO88K022n42l564K215K33J397j243j921J150Q73J630l094n58
$$ y = [1036, 2446, 19, 603, -2228, 551, 3655, -366, -1236, -831, 2588, 1099, 181, -414, -1512, 3561, 1719, -1186, -919, 1023, 2676, 12, 790, -1820, 1218, 3695, -682, -874, -207, 2621, 1172, 274, -245, -956, 3714, 1024, -1478, -432, 1123, 2591, -153, 73, -1598, 1537, 3173, -1435, -807, 87, 1743, 748, -600, -830, -1131, 3276, 33, -2010, -365, 414, 1918, -635, -793, -1973, 1177, 2477, -2285, -1063, -628, 1525, 394, -1310, -1282, -1532, 2853, -596, -2289, -427, 148, 1655, -1130, -1391, -1802, 1012, 1464, -2723, -1120, -627, 1121, 4, -1826, -1590, -1113, 1956, -1276, -2587, -831, -383, 1058, -1719, -1903, -1522, 437, 837, -3485, -1411, -1050, 419, -458, -2375, -1903, -1207, 1306, -1761, -2724, -874, -644, 268, -2348, -2341, -1653, 369, -173, -3737, -1522, -1289, 108, -1135, -3056, -1906, -1033, 597, -2497, -3055]
1838c055J807M39O30k671M52R15J728r05k734J971K14J129j386j416J440Q03J079
1855D40k876RJ615J08Q36k908P58J129J172p43k585K130K15J237j967j147J818
1872g59O34O50k560K64J447M68L85k855J354R90P34j009j783J902K55J005j990
1889h68q09J810J59N43k442P11Q53N53N3k620J603Q04P53j454j380K016M1R29
1907A255k202l78J572K76M12k353Q01R23O27l63k491K162L82P98j337j033J565
1924F16L24P30j999l09J871l7J75k452J436P38M9L8k622K329L46K44j237j116
1942h76K156m69N71k180J72J834k04K05k557J803M84K8j11k060K584l45N47j674
1960i2p39K386q10R27k128L19J768q24O50k506J857O43l51j37k241K601l68L73
$$ y = [-3055, -1248, -809, -179, -2850, -2398, -1483, 245, -660, -3394, -1423, -1209, -80, -1466, -2882, -1442, -639, 440, -2436, -2427, -812, -704, 132, -2776, -2018, -889, 283, -460, -3045, -915, -700, 537, -1430, -2577, -759, -125, 525, -2035, -1771, -324, 144, 529, -2326, -972, 18, 752, -257, -2040, -138, 117, 1122, -868, -1677, 133, 292, 835, -1607, -896, -43, 510, 563, -2057, -454, 350, 1103, -351, -1731, 285, 326, 1255, -947, -1325, 247, 523, 935, -1418, -617, 306, 933, 570, -1921, 241, 623, 1421, 84, -949, 616, 940, 1670, -329, -638, 1233, 1196, 1371, -1081, 355, 1093, 1142, 1180, -1442, 887, 1233, 1477, 240, -876, 1280, 811, 1382, -798, -626, 1208, 1004, 1209, -1348, 455, 939, 967, 856, -1204, 1380, 1035, 1582, -92, -831, 1555, 745, 1672, -456, -137, 1631, 807, 1457, -1049, 808, 1451, 1100, 963, -1278, 1323, 955, 1328]
1978A328j537p64K469j334P81k169N15K039j211P39k889K495L91m50K5k266K815
1995I77q50M19j317n03K545j456O89j743Q47J958j188N48k429K476M22j044M22
2012G73k423K981m66k42q51q72K703j727P62j457L92K004j697P06k045K322K4
2029H87j072Q76k608L106q97j67p30n94K990k239R98j388M00K147j860P65k003
2046a389K247L72j801J052k274L089r87m89k39m88L026k478J032j234J41K185
2062A765k101N46j616K326j61j698J169k205K883m15q89J07p07K857k523J011
2078C49o71l33K333k560J043j523J968l2j511J485k046K979j006o70N10q88K457
2095A884k320P18m17l87K514k888J133j200J697J56j841J597j901K570o08j125
$$ y = [1328, -209, -973, 1496, 162, 943, -1226, -711, 1328, 117, 856, -2033, 462, 853, 403, 428, -1838, 977, 127, 546, -771, -1274, 1271, -185, 504, -1239, -392, 1566, 378, 926, -1503, 973, 1395, 351, 773, -1650, 1331, 865, 623, -228, -1100, 1603, -124, 638, -819, -427, 1577, -120, 586, -1459, 863, 887, -185, 691, -1917, 1189, 292, 125, -605, -1199, 1791, -448, 550, -838, -438, 1709, -151, 614, -1389, 858, 1230, -571, 481, -1793, 1296, 309, -180, -419, -907, 2119, -359, 673, -561, -420, 1765, -336, 210, -1406, 920, 759, -939, 230, -1975, 908, 493, -396, -289, -996, 1861, -662, 349, -322, -655, 1678, -882, 161, -1362, 606, 574, -937, 548, -1498, 1481, 475, -195, 315, -573, 1884, -436, 282, -135, -522, 1992, -896, 237, -963, 734, 890, -951, 646, -1255, 1315, 707, -418]
2111d18O20q02K375k409J057q12n8K350l073J139p21J452K98k174J828j799K280
2128A133p06j304J232j203K343k231L34p9p3K035k848J203m71R10N97k095J625
2145D02j266K017o65j555J327j014J954j837K52K45l02J892k462J082j52P47P02
2162A367k270J835j610J943q49j385J330j001J984j892J70O38m67J884k459J227
2178D45J35nP33k073J502q73J333n94j525J859j106J896j766R5J008q24J864k531
2196d27J047K84j96O44k128J657j002J139l22j721K290j264J071q85l99J306j011
2213H3J581k419P61O44n88R90k156J709m87O64j33j630J966q01J291j183l24J673
2231A641j205J266j859O60P18n93P48k026J783m37M58L3j523J981j039O43q00
$$ y = [-418, 202, -600, 1775, -634, 423, -389, -447, 1903, -1170, -31, -752, 700, 998, -1176, 652, -1147, 1133, 427, -877, 355, -848, 1495, -736, -402, -481, -554, 1481, -1367, -164, -635, 275, 872, -1223, 402, -864, 1153, 488, -1067, 260, -754, 1200, -637, -385, -140, -442, 1450, -1012, 70, -82, 665, 1367, -903, 932, -678, 1265, 416, -969, 361, -640, 1344, -548, -378, 260, -207, 1677, -782, 445, 580, 575, 1308, -765, 737, -136, 1197, 603, -922, 937, -169, 1727, -39, 56, 1064, 240, 2104, -427, 620, 904, 708, 1352, -776, 881, -121, 1018, 696, -1025, 1265, 1, 1072, 187, -212, 1094, 83, 1664, -755, 6, 650, 62, 1052, -1104, 605, 118, 782, 649, -981, 985, 184, 1475, 292, -32, 1641, 436, 1702, -157, 503, 1221, 628, 1376, -650, 1133, 696, 1154, 1187, -336, 1645, 606, 1249, 449]
2248D49p99J644q98N23j552Q65P51j233J113j686J014J21j65R9j350K167q40K17
2266D40l47q78J712j067M39j124M44J184j165J164j625J167M77n54L45j571J869
2283I10q13n3Q3j077J785j072L61r82K99J031r11O44j127O89Q82j100L18j105
2301a238J473o92j09K39j069J675q76R7l94M3J485j328P17q94M38R93j085K88
2319b37p35J307k98n84L27j302K019o84m00op4J128j121L76o21L00J001j356M40
2338e20r26R69J0m33M67q68J590m55o79K64j04R16j119N42m56K13J117j564M89
2357e47N2M90k7n86Q29j278J920o61j141R14k31O08j007L01j55O7P56j433L24
2376h05L47L04K6o24L66r13J775m79j461J215m09O08n89K16j05J2J181j621N47
$$ y = [449, -350, 1294, 396, 919, -633, 232, 983, -250, 863, -823, 191, 312, 147, 246, -1104, 1063, 223, 440, 93, -785, 927, -140, 299, -825, -381, 803, -362, 802, -823, 344, 821, 267, 612, -959, 910, 97, 44, 127, -950, 835, -237, 124, -858, -559, 472, -439, 205, -922, -233, 649, -451, -133, -1238, 235, -457, -566, -327, -1396, 279, -597, -500, -894, -851, 634, -694, 23, -871, -433, 560, -525, -237, -972, 335, 37, -547, -220, -1522, 497, -187, -587, -593, -667, 461, -660, -284, -905, -605, 396, -960, -520, -1446, -477, -467, -900, -433, -1301, 289, -166, -845, -581, -685, 231, -888, -346, -802, -589, 528, -1036, -547, -495, -5, -32, -618, 211, -1067, 853, 192, -949, -35, -266, 342, -665, -364, -519, -452, 304, -1129, -805, -458, -154, -128, -752, -386, -1299, 476, -3, -1464, -249, -658, -50, -639, -423, -528, -516, 665, -956, -409]
2395d09N48j52L89p18N08n60J014k97j174J359p94M96M1m47K88j33J129j719M97
2414a34P28q89R99r25K79m58J184m88j439J602n99K80k07k30L45o4P07j320M87
2433a42N96p74N65p47N62j14L87j02j373J949j002K16J79p42P04l28R36j458O41
2452d7N57j072J176j062M09J13K21k54j114J784j006N36J03j154J200m00M92j151
2470f69K40J020j272J174r35J05P92l30J64j147J674r62Q1N04j065J180n56L18
2488C16q79L93Q25j123J188j019J28P22p61L10p81J300n82k9M34j476J637n53
2506E0K24n84j21J392j734J260r58K5J282j157L66p60J006j99m97Q41j611J738
2524E63o32k04K23m10J202j560R82r09L16J051j196Q11q03J208m42o57Q41j493
$$ y = [-409, 139, -13, 376, -342, 166, -394, 620, 323, -851, 508, -286, 210, 251, -196, 92, -41, 1088, -631, -134, 594, -295, 704, -221, 58, -400, 784, 296, -1143, 459, -140, 140, -67, -297, 48, -16, 691, -629, -142, 454, -320, 245, -502, 60, -54, 333, 231, -1142, 807, -195, 21, 200, -542, 162, -166, 770, -688, -47, 510, -562, 614, -448, -39, 74, 295, 41, -1073, 711, -295, 241, 344, -810, 390, -10, 482, -669, -429, 591, -681, 493, -442, -337, 455, 125, 289, -858, 816, -146, -65, 439, -626, 554, -2, 316, -563, -170, 655, -468, 720, -299, -171, 551, -210, 100, -681, 619, 37, 8, 442, -1034, 603, 50, 274, -310, -431, 961, -773, 487, -471, -446, 836, -321, 45, -715, 291, 92, -405, 436, -1175, 563, -69, -273, -50, -460, 742, -818, 164, -745, -429, 622, -574, 237, -566, 642, 200, -457, 384, -1109]
2542a109J916p70j36L60o35J431j537P79o50R4J394j548N17l64Q40j27r78J099
2560E76j342J889r70l66L32m16J384j578R47p25j32J316j355Q27p37O18Q1j000
2578f51J146j294J342l06j005Q77n09R08j320P74k86j31J255j649M90j8M77R7
2596A97r19J052j359J476m85j044J264r07J338j094M96K05p99J681j714O83m1
2613C0J05K20j153J591j452J220j18j021Q50p66J073o77K81K1q77J885j785Q56
2631B83k33k25M47j048J252j120J106j47j138J320r10Q16p04J35M53p29J404j887
2649i25N27O69p35O87q35Q84p48P21O6j349J770r91M73m67j4L69l62J037j459
2668f82O00L75r36Q90p92Q25p64P90K36j527J977q33J68j0m99N52n10J131j664
$$ y = [-1109, 807, 37, -99, 261, -374, 1057, -480, 299, -351, -257, 1137, -411, 106, -258, 582, 455, -523, 576, -766, 1123, 153, -213, 119, -297, 1087, -491, 456, -269, -401, 915, -440, 387, -350, 268, 349, -651, 495, -799, 543, 237, -768, 109, -400, 508, -812, -38, -324, -455, 800, -849, -359, -377, 100, 197, -722, 330, -1029, 447, -38, -1082, 182, -725, 613, -481, 15, 220, -579, 1102, -612, 71, 30, 135, 355, -798, 793, -659, 561, 443, -578, 272, -494, 579, -98, 183, 204, -673, 1212, -573, 283, 50, -175, 272, -776, 476, -644, 462, 315, -823, 497, -413, 403, -301, -166, 287, -442, 962, -925, -398, 271, -464, 223, -612, 272, -476, 245, 311, -1038, 732, -259, 214, -253, -267, 102, -260, 777, -682, -82, 293, -643, 247, -545, 280, -484, 306, 542, -985, 992, 159, 327, 317, -182, 370, -140, 991, -673]
2687f73P54N26o56O86r02R15n82M85q5j029J341o64m6K97o90M53n05J096j217
2706d96L89O43j008R14q24M26j81R0L01j071J368o62O6K77n17P21o80Q87j198
2725e55O88N48r44Q73q14L28L27JL0r87J443q26OL89o88O67l44M89j057N74L69
2746E17q65Q26n57J04J81p2j14n41J014o78j53O45j082J115k98l1m85L03Q00j231
2766f02R73n30P9L01k62R5m07R54n97m5N41p73O50o5k11q2J33O16j128P83l37
2787H6k45M25k76m1m22J085p56J08N31r09O69k09j8m18Q9N39o79O44n13J23M51
2808B64n67L34l11Q48o22K69J82o92N97k26l06J20j7L63p06O22n0n39O14n52K38
2829a37j64M28r3n86N02n31O02p2k28K91j03K24k98K42l33K99L63o05L3M90k3
$$ y = [-673, 81, 607, -49, 637, -265, 650, 68, 553, 468, -561, 780, 116, 70, 367, -323, 130, -375, 721, -496, -107, 536, -472, 442, -382, 44, -137, -47, 254, -817, 551, -111, -45, 232, -285, 436, -244, 643, -555, 133, 681, -263, 610, -204, 124, 451, 452, 482, -505, 938, 112, 118, 507, -181, 486, 142, 631, -426, 148, 517, -348, 478, -79, 25, 206, 134, 20, -521, 493, -185, -338, 307, -775, 340, 42, 11, -474, -171, 629, -602, 371, -159, -80, 221, -41, 54, -353, 601, 4, -41, 500, -273, 377, 312, 101, 19, 152, 768, -360, 423, 86, -159, 266, -10, -51, -473, 612, -144, -36, 495, -414, 255, 46, 28, -390, -301, 238, -441, 203, -310, -187, 264, -303, 31, -280, 568, -54, 215, 397, -295, 302, 76, -230, -110, -127, 236, -470, 152, 102, -437, 177, -375, -137, -301, 127, 34, -552, -50, -581, 21, -51, -279, 12, -91, 133, -165, 77, -256, 43, 406, -199, -166, 324, 301]
2850C01j65j80N25n78L45k1r1O9j02K23l93M11j53m03M45j60L6M9J70l32J40K4
2872A60l01J67k35j50L31m0K17l77O6J27j54L15n31K27K17J10k11RJ7k59N04j99
2894A0l52M76R4j70j93k2mJ85J99j84r5J84l09K88J22k16J17J34k90r4R7r6l6
2917a55k13K80n1K20M4m08J34o7K36r1K9J72j74K11k76Q3K53j33l04N04l68L4
2939d0K39jj74O7J77k10m8K28l18K63n6m60K29L94k72K2j8j04p5L64l96n7M79
2962B33l24q2j45K33k2l12O15n60M47n4%j85K58L22o15N41l79l91M38o5P1k26
2984b02L49l04K10J75n85J82N09m19Q3O0p9l5P48p43k48Q89n05l4j10K06m16O93
3006D24rq47M60K51o19O50rk71n2N72m61o77J077o50m1L36p3k37L60R2o86N89
$$ y = [301, 136, -44, 481, -97, 248, 227, 136, 205, 103, 326, -67, 344, 191, -212, 233, 73, 109, 158, 328, -4, 136, 160, -141, 26, -209, -359, -28, -68, 149, -228, -162, -35, -189, 126, -405, -178, 39, 149, -62, -53, -36, -295, 209, 10, -342, 134, 228, 58, -135, -157, -161, 24, 223, 39, -56, 128, -181, 107, 229, 13, 130, 264, -26, -120, -23, -119, -155, -368, -88, -139, 81, 125, -283, -149, -216, 20, -71, -42, 130, -44, 167, -109, -26, 227, 94, -210, 294, -74, -40, 199, 198, 24, 91, 268, 58, 10, 238, -80, 183, 127, -333, -104, 290, 18, 40, 22, -82, -157, 207, -189, -246, 233, -91, -173, -318, -85, -107, -419, 196, -364, 83, 29, 29, -156, 102, 424, -191, 350, -29, -420, 18, -47, 24, -202, 147, -157, 53, 228, -357, -175, 334, -85, -2, 58, -21, -56, 692, -51, -299, 590, 85, 51, -59, 147, -269, 424, 415, -432, 28, 279, -340, 310, 301, 30, -22, 550, 89, -588, 489, -161, -202, 134, 61, -176, 184, 276, -410, 179]
3028A79j03l90L38nk84O1Q28r41j47P56o61J05M18k47j21L50j49n59O91L71j033
3049e43O89j9l00L17J18o11J65N17m19K81K60l75P7L89k09o63P01L1o36R06n96
3070H0r5N55k13o04K06P98r70J18O57n99J47J84k1o12P52on40N48o12J16M16q0
3092B25m06P4O90r32N40J11n50K35M66n16j53M53j06k49P28q29J8O98m65l10N67
3113B89K63p87M21K26o21P04k5n92J08Q04n72k06Q24q75K01N20m67M2O8J36o90
3134b29N71K10r23O06j77K5P9Q2j12j41O44o71n8Q49q11K31K51J25p18L49J39
3155C21p56Q15l94J7O40l77J13o08O95m39j08O30r04P01m43J70K3l5L36o32Q41
3176F06n21l3J91m07L78j29L18l03q6N41q27P23n60J74k92J44M05p09P68m59l3
$$ y = [179, 76, -314, 24, 19, -265, -204, 624, -317, -464, 292, -369, -264, 154, -93, -214, 136, -13, -572, 119, 490, -543, 146, 127, -173, 144, 262, -349, -184, 333, -86, 195, 455, 80, 157, 546, 337, -326, 375, 406, -230, 676, 80, -15, 540, 327, -277, -71, 727, -243, -125, 532, -67, 80, 264, 243, -369, 383, 377, -163, 385, -227, -111, 305, 225, -181, -107, 583, -349, 191, 302, -248, -13, 453, -63, -216, 237, 131, -118, 610, -219, -201, 497, 32, -278, 289, 552, -235, 186, 412, -209, 495, 470, -122, -14, 790, 218, 12, 836, -39, 162, 682, 215, 257, 325, 461, -229, 342, 552, -371, 235, 58, 83, 162, 244, 132, -9, 635, -36, -94, 755, -56, 175, 426, 551, -167, 182, 321, -435, 380, -14, 3, 643, 266, 379, -229, 466, 27, -81, 549, -355, 346, -97, 73, 96, 61, 397, -235, 606, 85, 52, 243, -164, 214, 85, 403, 100, 14, 555, -272, 451, -109, 65, -227, -83, 322, -387, 381, -78, -111]
3197a11J88m16M79n88M78k07j04M48m96M53o42N66k62k21J07k5M44l18K3K38o96
3218f62R44n26J84k17J07N26r33P15o51M80j5m35O57p19P29l11l2L47q35J076
3238D29p22J30J56k95N02q23P04o44L83M31j152J185o85J91l0oL21o39O41o91
3258f14N50p5m14M46l43J59rJ95q3m39R38n95O0K11l19L39n62P62p14J21P04q81
3280e63O92p01O56l09J31K61q17R81q61M62J55l53M34o10Q66p42K27J37m01O13
3300B58m72K38O4L4K84n19O19r17N35J76n85N50n75O58q25L54K91p84J057o94
3320b53M26k21N0K03p23Q68p66K90N72q20O71m97K15m15L86J75p72O29q3K29o1
3341A03k6K97o96N20m50J67K27n69L99p46Q29l66M45J71n90R02p06P6J40l00K62
$$ y = [-111, 77, -339, 140, -448, 30, -177, -281, 167, -329, 124, -518, 48, -214, -435, -328, -353, 91, -227, -204, 34, -662, 282, -244, -60, -277, -170, 356, -577, 138, -513, -33, -48, -483, 174, -545, 184, -127, -159, 188, -647, 429, -293, -163, -7, -302, 200, -623, 81, -563, -180, 251, -901, 284, -401, -210, -240, -246, 75, -564, 77, -614, -64, -139, -553, -107, -450, -291, -300, -105, -188, -627, 311, -284, -224, -13, -332, 7, -555, 207, -507, -386, 318, -563, 129, -572, 84, -225, -94, 167, -650, 331, -530, -68, 87, -266, 168, -442, 424, -318, -91, 46, -355, 258, -214, 24, 88, 122, 406, -113, 506, -411, 124, 300, -285, 265, -310, 348, -477, -123, 168, -616, 441, -253, 173, -48, 2, 205, -518, 350, -416, -126, 446, -374, 297, -200, 15, -400, -14, 161, -611, 18, -65, 164, 103, 77, 374, -322, 198, -252, -85, 142, -427, -28, -774, 55, -311, 134, 305, -285, 617, -89, -13, 127, -173, 89]
3362H9m23M60l46j96M83o28O62l13J29J62k00J74m06P53l01j40J65j03Nm86Q46
3383C86q54K29L83p43Q22l78J14J22J38J83p34P76o12J57Q1m11M77o33P16p80
3403e61O11K57n77M47r8k5lJ94l7p05M87k82j64N25o66J76J26K59l18L89J87p65
3425e43N11J46R3p3j64om56L80l80K51M74m39J00jM26k60R0N9n54Q56n57o2J27
3448A8P8m3m80O98n78N7N48k86K26r8J16k70J57n4k06L42m08R5n1j47K39j59M97
3471B91n11J68K80l76K82k14M16l94L17l08l55L07j97j94J93p4J15r7N00o09N72
3492A12L33m77K32l50K08k10M2j96k51O42k99j18J69K9J5m2M75n50O95k15m75
3513b31K02q0k0k99n1L44o79R35m26L7K88l2J02k42L92m71N28j49n23L86k88j37
$$ y = [89, -334, 126, -220, -416, 67, -561, 101, -212, -83, 79, -121, 53, -353, 400, 99, -41, 124, 21, 26, -460, 386, -468, -239, 144, -599, 223, -155, -41, 81, 219, 402, -332, 444, -168, -11, 70, -341, 136, -497, 219, -561, 50, 307, -270, 177, 79, 54, 51, 245, 208, -497, -10, -292, -456, 69, -597, -421, -295, -36, -354, 35, 222, -543, -32, 114, 207, 134, -30, -36, -492, -112, -492, -241, 233, -206, -106, -107, 319, 59, 149, 208, -346, 510, -47, -109, 18, 96, 53, -427, 271, -307, -250, 298, 12, 238, 140, 256, -14, 143, 89, -117, 225, -183, -88, -139, -286, -47, -206, 291, -220, -52, 228, -148, 134, -80, 336, -58, 259, -49, -404, -97, -294, -488, -295, -369, -254, -351, 149, -460, 112, 445, -32, 200, -150, 58, -152, -110, -306, -557, 85, -214, -332, -163, -134, -119, -161, 314, -236, 459, 244, -231, -29, -109, -129, -428, -479, -135, -814, 121, -305, -268, 20, -12, 90, -152, 240, -231, 297, 148, -375, 11, -277, -414]
3535d14p7K34R0k70N07m85J75J38j18K52p3L21l55j6K7k81K05k60J38r5j0L95
3557B8k50L08q0jj4j01J7j19L38l80J30O5k45J48l13M80l59M22K9j57L80l04K28
3580B50k42K00jl79J73j02P3R5j12M12m84M10l48K13K21k73K75j95J20j16r9M1
3602A32m95O47l96K58j52L0L37j51K85l36M61J66o65L02j37m4j89L01n05j65R98
3623F82m82nK93j9M5p1R7l86K93Q1k89J19k27O7k34L95j66m15J017q25P5O36l17
3646C64Q6j01L28p03N37R3p89M14k01k6qK80P5n09Q30o42K92L33l52N3j69J06
3668B91m65M20m6n34P72j52l78K46L37m08J59P10p84O6L21m73Q5J16K4m58M90
3689C39j93n89J119n45k57M20L7m21J81O65j014M57J89n71L30l9q9l76O71k84
$$ y = [-414, -491, -257, -167, -437, 70, -415, -240, -102, -220, 32, -41, 280, -75, -91, -64, -345, -140, -400, -262, -357, -367, 28, -222, 86, 6, 5, -9, -110, -93, -212, 126, -254, -124, -59, -304, -156, -469, 11, -348, 74, 103, -54, 326, 22, 250, 8, 208, 207, -172, 1, -101, -28, 67, -45, 367, -117, 293, -55, 158, 379, 106, 381, 186, 306, 190, 91, 132, -363, 284, -112, 146, -6, 24, 361, 210, 495, 159, 620, 786, 121, 423, 286, 242, 53, 354, -151, -316, 682, 200, 195, 488, 469, 514, 443, 540, 154, 447, 528, 239, 358, 131, 198, -36, 359, 193, -222, 795, -30, 45, 681, 364, 450, 349, 677, -26, 511, 604, -185, 229, 28, 2, -6, 274, 349, -160, 670, 28, 320, 653, 301, 354, 185, 291, -174, 246, 200, -334, 438, 286, -92, 154, 491, 83, 242, 952, 168, 234, 555, 82, 167, 283, 307, -151, 339, 146, -443, 676, 131, -126, 294, 331, -90, 91, 756, -258, 199, 388, -183, 147, 108, 19, -357, 314, 30]
3709C0m15Q78m29j47j3L64l57M8M93j058O43K21o12K35j44L69p20P07P8o39J114
3730F46r28J97M03J5m09K5M56q75M48N10q91L84m1k47R7O76m78k51Q65q16K70
3751E6J37k84m40N62L3q20P51K54o09O02l30P7q3O20p27k64J060r08L00L32o62
3772c43K8K16J92o47Q45k40k57L19j81Q2j06N46p45J13Q15j099L38K68l84l58
3792e98P06k58l66J026l74k48N04j52l12O8J71j50l49O11o33K80M27o89L75Q1
3812A20q0L7K50k40m62O80k72K4p1J35k06L36J07q87Q12o4l13O5L14l55m2L27
3834B15L1m09M70l56N0j72k9o6K31M03o32L85j23j47L46N2j44j87K48k00j73K26
3856A9j30J27j44J23m09L64N2l04M29m9k16n4L96j66l02J57j05m9K84q2j33J24
$$ y = [30, -385, 493, 64, -83, -96, 268, -89, -41, 452, -606, 37, 258, -354, -119, -263, 106, -614, 93, 171, -468, 646, -282, -85, 318, 333, -76, -51, 405, -470, -22, 488, -403, -19, -60, -307, -210, 466, -12, -263, 602, -214, 56, 193, -91, -531, 31, 64, -756, -5, 249, -360, 242, -88, -11, -94, 526, -201, -465, 595, -313, -13, 319, -343, -315, -99, 93, -554, 291, 51, -206, 113, -68, 14, -92, 454, -291, -178, 637, -462, -124, 144, -240, -598, 108, -150, -516, 510, 136, -112, 392, 240, -72, -4, 167, 17, -332, 279, -354, -74, 353, -336, 39, 120, 40, 77, 327, 87, -375, 305, 33, 57, -14, 121, -85, 251, 358, -529, 283, 219, -94, -29, 285, -70, -112, 215, 246, -163, 307, -49, 1, -171, -200, -266, -35, 368, -264, 121, -2, -149, 197, 249, 105, -82, 166, -34, -207, 19, -111, 16, -128, -5, -414, -50, 2, -302, 127, 78, -138, -192, 204, 38, -264, -107, -212, -261, 23, -59, -192, -68]
3878f8L33l72J01jk65k6N01l67QK03j14N6N8l5o1L22l31j18N4R6N9Q0R5k91K99
3903B16j06j49O0q8m5o8L49m5l0k55J65qJ19k9k96j9P8m1J31RJ2R3L9m4j82M94
3929C60k81pJ06k81K26j47J1j66K85k04k12N87l01l0M6j9j16M29j63k88J04L99
3951C38m06Q5m5O3j16J61J39m13M33j93J66k64J52k32M0PJ94j77MMJ3k8R6q1L13
3976B53j80k67N09p20M19J39p6k34J27J21l95K40O5k77L25r2k03K50N4j26k25
3997b93M08k12o7J74j79R4j10nj54K67R7n7Mj48K4K76l67K75l59K37m89L51J90
4020d3n62O41k05P1k76M10j34k81O39l32%k13Q8J64m24M20l40J82R9n26N71k67
4042c18K54j1j05K56k78L11l33Q4K64l14K23q6l5l00K78J51k70K89m28L02J39
$$ y = [-68, 265, -107, -6, -7, -272, -298, 203, -164, -156, 47, -67, -11, 47, 12, -49, 273, -58, -176, -122, -26, 33, 113, 208, -83, 216, 110, -39, 21, -67, -112, -180, 169, 124, 94, -161, 4, -4, 115, 86, -210, -229, -151, -192, -61, -52, -40, 53, 92, 48, -134, 360, 79, 72, 178, -103, 123, -24, -13, -179, 106, -98, -310, 277, -24, -54, -8, -27, -143, 286, 123, -165, -61, 338, -68, 17, -28, 35, -81, 80, 219, -194, 239, 46, 212, -52, 100, -132, -92, -85, 109, -68, -64, -60, -47, -75, 21, -60, 253, 73, -194, 315, -405, 14, 153, 77, -157, -30, 91, -304, -64, 1, -276, 49, -43, -246, 4, 58, -68, -293, 115, -97, -164, 10, -169, -75, -185, -190, -344, -77, 20, -37, -33, -181, -157, 119, -248, 27, -332, -95, -584, -233, -43, -605, 36, -169, -98, -374, 36, -98, -379, 260, -72, -72, -285, -197, -33, -457, -37, -377, -195, -96, -622, -51, -318, -64, -75, -180, 76, -202, 109, -224, -140, 124, -190, 33, -53, -88, -388, -110, 41, -229, 60, -368, -66, 73]
4063G3n9j1l24M56k90K72j15k39K00l2j52q1K32L26n39J89o1J22J04j97K19p26
4085f33O25k91K63q7j76L80l80K52j80L86K94p54N69l65p7K41k49J27j71M19m38
4106b45J66M54o20L97k78J95O4k6K76o60M90k81P7J43l94J27J31L01l38L8K40
4127B57n02L63l2R0j26k89L85k67M29k50k45L31m15M69k82L29l37K86K28m27N82
4148E77n94J15R9m99N95l35J40k97j26L79k11K27j09K82q7k57L62m11M38k88j33
4169a33J77l27M43k74J73q5j74L68k57J86k7r1J82l91L99r5o5L9k4O0n16M42M7
4192E7J91j54K6L20n39M42m9r6J28m31L41l02L60l16k21P14o55M40k64J7l0j61
4214a82N11n50O76k61k54L48o77P62n61L09k11m12Q59q11O53k67j14M30m58L87
$$ y = [73, 14, 3, -321, 135, -155, 117, 2, -237, -37, -69, -221, -302, -70, 256, -283, -94, -155, -33, 71, -126, 93, -633, -8, -299, -36, -123, -299, 81, -299, -47, -227, 159, 453, -301, 268, -97, -174, 67, -182, -55, -226, 193, -245, -79, 375, -245, 152, -126, 69, 133, 107, 383, -277, 213, -68, 9, 152, -242, -115, 16, 317, -21, 17, 257, -245, 118, 86, 176, 50, -239, 146, -121, 308, 58, -187, 144, -271, 198, -84, 245, -92, 194, 422, -5, 577, -17, 98, 197, -302, 293, -42, 98, -199, -325, 54, -157, 70, -39, 243, 156, -101, 261, -150, 288, 0, -133, 44, -283, 160, -114, 59, -26, -200, 168, -89, 97, 70, -21, 161, -230, 169, 74, 9, 48, 24, 84, -432, 10, 57, 248, 94, 120, 440, -99, 343, 294, 198, 326, -105, 236, -66, 294, -22, -243, 471, -184, 256, -8, 9, -21, -182, 329, -221, 455, 194, -60, 288, -389, 373, -188, 121, -90, -502, 357, -454, 199, -68, -182, 248, -210, 177]
4234A77l77K27lj55K44n18K67j9N7K37p01J020n74M20k51k07M04m54L45k63K96
4255A72j58m24O67m08L91l87J59J27l58M69n97O21j6n77P94o32L76l03J57R7q4
4276H6K56p71N39j49O1N2m1L57n71N00k10r7J77o25N08k09K44J42m54O70o40K23
4298D8J21k02K88k46K44l66L20r8l45M99n46M42j12J28n7n82N28l84O03j35n02
4319c54M43l29P89p70K41K94m99P61r54K89k5p8L75n66R26p74L87k64j76M83k75
4340g6L50m64L13j75k00P38p81N53j67j13L17l92M75o25J04K39n42P09j77J29
4360B15k67j4L62p56R33n95J56J31k53L57n78M59j73L6P6k72M65p21N60r7l0K43
4382B37p22Q60n76L77N9l63N56q18O57l48K00J9m87O21j98m3k13K26J82l15M93
$$ y = [177, -200, 27, 24, -131, 113, -405, -138, -157, -100, 137, -564, 456, -118, 302, 51, -156, 248, -206, 139, -124, 172, 14, -410, 257, -151, 240, -147, 12, 139, -219, 250, -347, 274, 258, -319, 475, -157, 219, -84, 73, 170, 86, 342, -429, 110, -39, 22, 74, 33, 390, -181, 319, 109, 12, 189, -436, 72, -137, 107, 249, -205, 465, -175, 48, 169, -33, 255, 9, 253, -113, 207, 109, -236, 263, -283, 159, 47, 175, 118, -464, 64, -320, 283, 148, -354, 89, -240, 549, -221, 20, 314, -185, 576, -378, -89, -114, -192, 183, -383, 543, -231, 156, -108, -284, 199, -76, 274, -190, 123, -52, -252, 486, -295, 258, 91, -22, 295, -97, 378, -247, -143, 96, -446, 263, 86, 215, -52, -66, 296, -460, 473, -122, 34, 165, -88, 269, -309, 150, -23, 13, 89, -183, 282, -439, 121, 24, -6, 237, -485, 375, -201, 176, 235, -128, 428, -390, 267, -81, 119, 138, -349, 272, 74, 31, -182, 44, 226, -89, 404]
4403D04o67J00L04k94L04k19J48r1J9K14n19N07m56M69j65k42L20m98M10l33O1
4424b24O14n68O79n54J72q7m4N33p46L98k32O2J33n49O76n35P34o20q9M97n67
4445c17N60n28K86n7j79O33o52M31j81Q1J82o08P83n93K15j33j59K63k31M87n59
4466b76N64k94j05K67l45L78l41K47j07m68M48O3J23j97n4N15o30K91j72R9J11
4487A17l26M55l87L57j82N5J73l34N47p35M58r7l20K92j50K08k51L84k54j0K75
4508B75m40M4o7K18J30l37K84j22j05J39j23O3Q2ol87K27J18m31O27m26J81L4
4530b2j52K72j80J00j52J86K7j27K00l43L22k69J08Q5O3j08j54K72j44P8n9J03
4552A06M1l63J44J9J18j27rj6L6K17P8l39K16l89K06j61J86J09j81N6j26K24k65
$$ y = [404, -263, -163, 141, -153, 151, -68, 80, -11, 8, 222, -297, 210, -246, 223, 58, -184, 136, -362, 48, -285, -224, 390, -178, 501, -53, 119, 32, -12, 521, -225, 173, -59, 3, 136, -413, 263, -272, 462, -158, -247, 250, -317, 243, -285, 1, -56, -235, 398, -254, 177, -4, 77, 259, -349, 434, -159, 56, -77, -236, 27, -204, 283, -276, 288, -6, -111, 156, -189, 189, -152, 95, -12, -480, -32, 31, 154, -43, -97, 418, -212, 79, -93, 6, 117, -209, 246, -141, 216, 34, 89, 262, -72, 475, -260, 198, 101, -219, 73, -77, 131, -120, 264, 10, 0, 275, -165, -121, -188, 30, 160, -177, 107, -15, -120, 19, -104, -41, 41, 35, -352, -125, -7, -438, 189, -237, -56, -22, -174, 98, -82, 18, -134, 52, 79, -48, 152, -191, 131, -138, -30, 55, 118, 10, -144, 128, -16, 62, 3, 106, 147, -216, -72, -53, 65, -62, -71, -87, -51, 166, 244, -95, 121, -268, -62, -223, -37, 72, -109, -53, -179, 45, -220]
4575b20J71k2K4j18K3K40o7j88K23l16K94K7j23M4j41J57q9J48k57L27l21R6K7
4598f1J12J00M6k30n1j02K17j60lL29k73R3j89J45q1J08K47j42j97o5L22j02J72
4621B35r7j23L09m40J11K5o4R7n4J02l39M69l17o6K24j32J67k50J61j45l1M45
4643B87m00Q9m4O2q0J19K13j65K9O1l11K47l9q6J6N7j53r7O53j92k43K13j74J08
4667A70k46P9q1J35j34k25N16l91K40j53K17j89L7K42m56M48O1m21K73m08O00
4688C14n15M25n74L43K23j28K30l87K16k50R3J62j76J56j47M7L16n67L86l58K97
4709A06L0l77K57o6J60r7J86j92j06K72m18L88j71j12L33l03Q6j33J92l2N8K73
4731C34l80M56l1m15K93l37K93m58M97j5k71J55j06J07j94N33m17%P2j64J23j4
$$ y = [-220, -49, -71, -47, -165, -142, 98, 31, -157, 66, -250, 44, 71, -52, -8, -149, 8, -81, 67, -190, 137, -184, -88, -61, 51, 151, 197, -33, -84, -186, 31, -129, -132, 197, -76, 17, -172, -27, -108, 0, 247, 105, -92, -157, 165, 63, 235, 138, 15, 324, -116, -5, 20, -44, 53, -1, 101, -238, 231, -86, -152, 72, -60, 107, -143, 18, -127, -158, 287, -113, -24, -68, -6, -86, 33, 246, 81, 110, 171, -140, 107, 68, -18, -2, 55, -98, -195, 458, 266, 23, 236, 62, 170, -76, 3, -78, 57, -77, -302, 214, -177, 63, -90, 127, -62, -25, 217, -239, 209, 270, -151, 122, -286, 314, -201, 224, -350, -7, 216, 88, 318, -69, 147, -103, -10, 152, -24, 132, -15, 32, 348, -219, 167, -191, 106, 136, -241, 16, -50, 110, 13, 199, 7, -99, 173, -245, 143, -28, -140, 193, -110, -24, -157, 35, 3, 61, 334, -46, 410, 379, -36, 257, -80, 213, -245, 252, 237, -34, 121, 15, 122, -72, 461, 44, 44, 116, -48, 75, 61]
4753F1l3J26k25L75m39R6k14J37K94m49K15J21j34q0K7K50l19K88N4k33M6l5J03
4776C2j83J42o6K8K01o68N11K3q4M9j31L66m61L76j58j37L74l06K28j83K6P9k55
4799a97L93k92R6n3L9j18R8j14J93P8j45Q4L0j20J41j42n5L2M0P0j62K41p7J5
4823G5r2j01J48l37K77J39k52J71n2J03l90L17j26J97M1l26K34k0o6k8j76M80
4845B16m47L94m27J19K67j80L02l69L5L68k84k8L1P3O9p8K09m53K44k6O1m6j81
4868a31L00j87K09k44K3J17pk9k16J80k05K15N2n26L14J24K14j08k14L66k07K91
4890C31l59J6K58l00o1K15m9l5qM5k74L32j72N5j83L4J38j46J15L3P7j72m3N9
4914i4j5K32r5l25K06j29L39k60j0N2L13p3l42L13r4n3J19l9J38K0k36J8q9L28
$$ y = [61, 28, 154, -71, 304, -135, -39, -253, -116, 178, -271, -56, 65, -69, -149, -122, 128, -191, 97, 151, -82, -36, -71, 32, -151, -9, -75, -47, 154, -514, -3, 20, -64, -15, -146, 220, -241, 135, -23, -160, 214, -92, 136, -47, -21, 58, -197, 196, -96, 0, -53, -14, -132, -34, -148, 45, 123, -22, 62, 92, -28, 113, -29, -84, -52, -12, 58, -104, 137, 60, 75, -17, -118, 30, -307, -30, 109, -143, 28, -24, 79, -311, 6, -120, 77, 118, -208, 26, 6, -60, -88, -264, 216, -231, 163, -264, -145, 122, -58, 244, -125, -90, 278, -6, -34, -3, 70, 139, 61, 270, -183, 61, 35, 96, 50, -131, 169, -18, 191, -53, -30, 87, 80, 51, -165, 15, -190, 25, 77, -449, -135, -11, 203, 95, -119, 247, 40, 331, -28, -12, 246, -54, -115, 100, 51, 16, 8, 53, -221, 111, -61, -6, -189, -155, -17, -163, -48, -15, 62, -110, -153, -94, -109, 123, 28, -297, -91, -220, 119, -141, -151, -99, 214, 141, -201, 112, 18, -35, 84, 45, 183, 203, -33, -15, -104, 224]
4938B24k07K83l72K98k95P2j52j16L83m56L48J89j76k3k02K93j91J71j62M9L7
4959ej02Mm8j1K76j50P4j96M07j74j41J69q4J35k97K57j44K35L4m2m3k33J73m1
4983E3n3rk85L46j76O9K42p3o2p1K63k81m5n1q0J37j9J08k09J9O7L9l8J63J38
5008A92l53J20J28q6jj49K72n4r6P5J46pj50k11K73l27N07l81Jo7j5J79j49K80
5032A27l81K56j03RN7j06L48m4k65J72N0P1l33J29K2p8J65l35L68j33K70q3o6
5055A17J36l63K90Pl05P9o9J50L2j46L21j45o9k42K21q1K51J80m88J90m39L79
5077FR6j74J13j68L40Kn6j31l31K93k48K03K8p2J44k25L26j60J84R8m73L44j37
5100BK41l15L7J43n6J40k43K23r6k88L27k98M40l00Q7n6qk11o6O32m46L5R3j45
$$ y = [224, 17, 300, -72, 226, -69, 3, -149, -265, 118, -338, 10, 199, 23, 0, -202, 91, -100, 71, -91, -42, -5, -107, -103, -151, -162, 114, -36, 38, -158, 249, 75, -66, 103, 19, 154, -143, 114, -30, 205, 239, 197, 154, -79, 94, 53, 0, -9, -294, 52, -124, -55, 187, 114, 52, -19, 244, -37, -82, -133, -213, -76, -95, 13, -196, -177, -110, -71, -109, 54, 192, -161, -41, 87, 1, 0, -149, 123, 69, -27, 48, 194, 187, 37, -174, 99, -228, 279, -102, -101, -168, -183, -4, -153, 127, -254, 2, -101, -92, -35, -141, 207, 163, -102, 70, 120, 191, -142, -13, 9, -69, 96, -239, 129, -4, 266, 183, 117, 253, -110, 180, 187, -118, -39, -108, 42, 74, -72, 249, 104, 35, -207, 14, -67, 184, 364, -124, 66, -373, 6, 102, -72, 41, -127, 213, 215, 159, 28, -303, -10, -258, -55, -27, -99, 45, -180, 146, -14, 170, 268, -205, 139, 2, 243, -72, -35, 108, 52, 192, -51, 172, 76, -212, 115, -183, 257, -43, 44, -12, -20, -231, -297, 335, -111, -76, 17, -128]
5124a28J46j22J49j87p6M60m97J87r4K54j52k43L29oO4j67J45n0RP1j62KJ48m0
5148D0m0l3J81l8K01l26j58N39m09K64k49L6j41L9K93l04J0J97k08J71l01N34
5170B98m12K59j89rK97l17K09R2j64L8j98K98l05P0J72k43M22l14q4J07J3O9m17
5193c08N76k55Q1j48k9l7J02L21m37M12k66j25L43k43J40k82%L61k29L27m79L11
5215A36j0k17L11n32L06r8J52l3q1K14m25M73q9j37K40l74L87l01l0J09J16K73
5237C90l45L7k11M29k00j91J96k46M92l40P0J93m29J82p4q0P1k2K16j96K86j29
5259I9n5O7j97J40k07L96j74K0j80m3N99o43R1N3n3J92l18L96k66J59j06n3K4
5282e9k72K54K04J4l40J84Q2k17J16J51j31P3j36L34l34O6J25j44J07l83N99j68
$$ y = [-128, 18, -104, 45, -142, -218, 242, -255, -68, -162, 92, -60, -303, 26, 20, 84, -83, 62, 12, 21, 92, -70, -68, 80, 40, 0, -33, 148, 110, 311, -15, -173, 366, -43, 221, -28, 8, -133, -94, 199, -105, -95, 102, -106, 65, -236, 298, -114, 145, -44, -53, 244, -73, 136, 228, 64, 102, -96, 202, -103, -33, 139, -104, 318, 4, -80, 27, 40, 109, -308, 268, 13, 94, -54, -83, -120, -18, 303, -134, 278, 12, -113, 230, -13, 127, -155, -155, 206, -23, 304, -175, 136, 126, -91, 220, -312, -6, -104, 48, 15, -66, 148, -277, 196, 107, -30, 210, -164, 223, -78, -108, 1, 117, 390, 45, 82, -129, 300, 100, -91, 105, -141, 351, 11, 81, 274, -155, 27, -47, -127, -56, -78, 138, -58, 228, 99, 44, 111, -86, 54, -153, 243, 69, 89, -91, -134, 465, -178, -87, -34, -87, 105, -213, 183, -83, 76, -30, -83, -59, -331, -77, 127, 141, -199, -15, 67, -150, -34, 117, -14, 59, -77, 257, -77, -11, 114, -30, 77, -306, 293, 125]
5304A25k2j97O5O4k57J53r1J94j02J94q5r0L09k03n7J3o9J67j33k27J48J6J48
5327F3J06j09oJJ28k65K75k00J8m2nJ01k03L70j53m4j49N9N37n67J28k37P9L88
5351B73l94K04p7j02j27L24q1l88M85kk33J31M5j9j01K7j72Q1J59l3J37k04n3
5374a20J67J53k09j58L02k87J73Ooq2j47K04J16Mrj76qK90l47J04Q5p7k06L80
5398A52m23J31K77j10j20J24k9n2K3K23m80N67k96r1k8Q0J69k84L70k90j29M77
5420B61n02J07K72j19l0O0J7l41L28K4j93L25k44J7j91J95k4J7J29k63L17k53
5442i1J4O7j4J7m7P0k05nJ91k64L63j62J38%l7jl58M61k74J77j60J9N3j36K96
5467A12j58j3k9P1Q0j75J86r0j41L83l57K06k2j95K43m9j25p1L10l05j50L37q1
$$ y = [125, 103, -94, -29, 35, -222, -69, -160, 34, -68, 126, 41, -49, 260, 57, 0, 13, -56, 111, -22, -249, -101, -85, 63, 169, 60, 54, 55, 183, -82, 193, -7, 11, -31, -36, 65, -138, 232, 79, 35, -114, -55, 482, -85, 43, -194, -115, 273, -121, 83, 6, -96, -223, 101, 20, -368, 117, 115, -118, 13, 58, 39, -62, -35, -207, -126, 33, 0, 137, -67, -120, 47, 200, -9, -167, 135, -152, 21, 27, 21, -61, -208, -4, 112, 116, 107, -69, -77, 213, -134, -30, 55, -22, -228, 152, -271, -140, 137, 27, -93, 31, 2, -50, -27, 196, -284, 283, -13, -104, -132, -52, 117, -167, 203, -87, -216, 261, -241, -134, 138, 19, -11, 49, 66, -275, 53, 77, -116, 209, -35, -18, -209, -14, -38, -21, 108, -155, 162, -91, -77, -10, -24, -7, -54, 16, -189, -194, -3, -267, 96, -66, 72, 72, 35, 34, -324, 137, -137, 40, -120, -101, -48, -184, 112, -46, -59, -88, -17, 63, -112, 74, -16, -157, 226, -131, 75, 53, -142, 101, 52, -73, -144, 166, -139, -289, 48, -33]
5490c3J84k96L07k49j76J05k43K61l7L82l88J56pk32L41O0q4m9j16M26l44m7J15
5513C6kL51k72O9j27j36J40k64L43l18J16J27j21j71l3L65l11L23j87j14J71k14
5535b29L16k48J68k05J31L24m51J49P2p8Jq1L03j71L5L0k52M59m15K08Q8j43J11
5558A22j62K78p0R6k41j42N9K2K49m32L06j37j12J71k2j51j71L9J13J76k73J00
5580a82jP3Q4n3L6p0J58P0l07K30j7o6K67o4n7K5n1P8l87K03J9J44J41l76K58
5605A55m06J61L4M8Q8m49M37j3n3o7M0j59j2L00k31R2k07K71Q3q3j46P8R5o9J03
5630I0K12k85J16R0k69L06j66o9k13L03j1k07P1N7M4l00K86jj67R8j77J57J44
5653A09j58L8k3L4m4J0J49M6k63oj06K49l3J91m2M2J31l44j81M90l95M0K01l09
$$ y = [-33, 151, -145, 162, -87, -263, -158, -401, -140, -177, 205, -183, -27, -34, -266, 75, 135, 51, 2, -114, 312, -32, -79, 36, 34, 385, 113, 182, 55, -81, 59, -205, 138, -180, -64, 63, -58, -229, -262, 103, -208, 115, -72, -186, -15, -229, 87, -161, 7, -198, -67, 257, -194, -45, 27, -51, -50, -131, 172, 1, 36, 66, -186, 273, -142, 66, 154, 11, 122, -40, 238, 168, 264, 23, -119, -60, -38, 211, -221, 85, -52, -164, 7, -15, -166, -337, -298, -185, -9, -282, -182, -183, -110, -26, -79, -43, -113, 45, 115, -192, 38, 21, -45, 222, 158, 101, 126, 75, 153, -234, -31, -12, 132, 273, -103, 155, -251, -90, -56, -8, 80, -369, 68, 55, 2, -65, -25, -184, -196, 104, -127, -35, -242, 29, 112, 29, -117, -39, 56, -13, 90, 302, 17, 133, 223, -46, 260, 94, 25, -188, 115, 104, -103, -32, 25, 69, -231, 55, 54, -113, -15, -192, -35, 109, -49, -11, -34, 0, -44, -34, 115, 161, -102, -108, -214, 35, 2, 193, 151, 193, 324, -20, -201, 289, -106, -66, 135, -174]
5677a74L22k4k68J15J95j47p7L4O2Q8j51M0R1k90J96Q7j99K2l4O5o5Q3O5O2L6
5702A34k35K13m1J9J24l97L25j87J55Q9k01L27l24k9J16k12J99j78K75m23J58
5723i3O2j61K14l8R7k18J52N7r6p3L07l63K61o2R2k36L99l35On6P2M0k39Q6J13
5748a2N3r1J23n9l96K47K01j89K27j78K39L1k26J40k85L39k10J38j43j51L13r
5770A02j31P8LJ02j92Q5l50K31k3J37J33k53L37k52L50k43J01j64N9J4j07J38
5792A55k50L2LL1J37j54N4J50l33N07n72K57j31K12J99m69J98On0N9J28j28j91
5815a50k3O3K82l81K47oj71K96oj81J93j95q0J54oJ40k00L0L9j03N9j04l2J91
5839E6M6m2j52K57j09o5M8N9k29M1K19k19K70pP3l16K9M21k66r1K34q2j3l01K82
$$ y = [-174, 148, 124, -144, -29, 166, 19, -58, -24, 38, 126, -25, 15, 106, -184, 12, 99, -100, -78, -112, -47, -112, -29, 36, 98, 134, -101, 112, 71, 90, 214, -183, 142, -45, 110, 199, -2, 325, 1, -28, 88, -124, 75, -103, 172, -251, -93, -31, -192, 22, -16, 81, -137, 15, 72, -24, -97, 210, -153, 108, 46, 138, -98, 301, -34, -28, -84, -12, 28, -211, -125, -12, 41, -50, 73, 14, -382, -135, 66, -123, 104, -74, 165, 196, -30, 110, -175, 164, -46, 92, -51, -202, 111, 102, -29, 49, 52, 154, -38, 47, -303, -72, -95, 42, 175, -78, 259, 7, 357, 114, 215, 51, 110, 124, 17, 155, -95, -63, -60, -29, 108, -46, 8, 158, -175, 332, -240, 17, -114, 98, 297, -172, 26, 32, -18, 41, 169, 41, -150, -173, -110, 172, -209, 38, 32, -139, 157, 151, -30, 163, -32, -112, 42, 36, 176, -24, 6, 45, -58, 1, -103, -135, 56, 102, 60, -92, 165, 56, -9, 39, 98, -131, -90, 129, -90, 180, 173, 246, -70, -41, 380, 114, 23, 257, 175, 162, -139, 143]
5864A43l68K73l0PJ82j42j04J00N1L6l32K88k67r5J30R6k6l0K04j0m7j26r8L60
5888A95j32j83J14K42K4l66K95k84K33l06J68J61l43J96k02N98l63J16Q8l62K87
5909A76o3r0O8J06m31j01L22N9K4j26kK57k12kj77J19J10NJ95l47J50Oj46J41
5933D1j81K55J40l43K09j73k4K13m4K53k20k54jM3J79j84n6j62M28n0N0j14k37
5956b32K17R9j35k0n1J37j31K47r6Q9l09M62m8k99K02k78K82J3r8j2KR9k25J11
5980B6M9j23K00j30k50J72J67j40K57j58O6m6L22k67j24K43l33R6j07J71l41L30
6002H0J16j35n6J87l5m5k11J1J37K2m8m6N9q5K37l60K45o7p3J17j21P8l8Q8j31
6027g4mJ54j06K5M3l61L51K3R4n59O91j74J7q5j68M0J34J5J39k09p0l0m9K8q7
$$ y = [143, -225, 48, 18, 25, 207, 65, -39, 61, 112, 148, -184, 104, -163, -258, -128, -32, -58, -88, 116, 106, 59, -67, -165, 195, 63, -120, -6, 236, 260, -106, 189, -95, 138, -168, 0, 161, -182, 14, -188, 410, 47, 163, 251, -111, 176, 113, 23, 91, 197, -234, -335, -13, 46, 70, -56, -58, 199, -13, -15, -192, -73, 37, 42, 237, -110, 40, 46, -100, 41, -140, 115, 255, -88, 121, -52, -76, 137, 93, 346, 126, -128, -129, -86, 93, -91, -147, -309, 119, 69, 119, 5, -232, -15, 84, -51, -71, -122, 15, -116, 131, 35, 124, -185, 277, 229, -70, 132, -146, 136, 149, 51, 39, 41, 140, -85, 26, 75, -48, 152, 22, -228, -56, 111, -29, 228, 70, 136, 90, 412, 145, 21, 264, -69, 27, -80, 91, -250, 80, 196, 61, 5, 192, 157, 112, -99, -88, 49, 71, 23, -23, 36, -49, 188, -172, 73, 6, -67, 50, -71, 7, -31, 57, -74, -78, 76, -30, -5, 38, -323, 28, 51, 145, -414, 277, 103, 120, 35, -133, -93, 41, 56, 195, -14, -84, -114, -163, -135, -222]
6052b22M28K9j66j42m5N9KJ43k5j36K0L3j7j30LL04k31N6K01k21j19L57m97K55
6076f1L6L3L7k09K81j45R5J4j73K86l15J62kJ38k4l02L33k3k06J36n3M7k78K56
6100F3M5j83J15o3K53k47MJ86l75K63k29L16j38l4L2Qm7q0J66j53J80k5K26k80
6124CL0O9n8n6P5j57l6K4K0j06j98O36k21ql00K11P4l01O21m89L18j30k29J58
6148e0K12k9j34P6o4j97L19j06n1K41j57j31M6J05mk2K8p2j69J02J55N5j64J69
6172A58l10K63Q2k63J81k62L34k61J09k15L62k37P4K83l77K6n2k7J38k0R5k85
6194b04P1jJ30P3j61L42k04l3ok13K22J26J6k36K2K63l12K29j71J90j32J85r3
6217A03qj50OO5P8q3J12j86K31pj64M6O0j07J51k2q0j13N5J30k63P0l4J11O3N0
$$ y = [-222, 206, 235, 69, -73, -118, -59, -57, 86, 61, -75, -55, -22, -39, -169, -166, 138, -93, -37, 164, -57, -176, 181, -316, -61, -25, 8, 45, -164, 117, -28, 67, 81, -92, 194, -121, 41, 39, 177, 153, -149, 184, 161, -45, 91, 38, 85, -193, 63, 108, -75, 40, -23, 230, -17, -13, 173, -202, 61, -168, 148, 10, -24, 8, 16, -31, -111, 55, -98, 82, 57, 283, 3, 33, 102, 44, -12, 63, -94, -130, -106, -86, -192, -390, 246, 25, 17, -283, -72, 2, -299, 322, -167, 151, 21, -208, -50, 162, 133, -1, 75, 11, -186, 133, 27, -24, 217, 60, -71, -25, 80, 76, 54, 82, 10, -159, -57, 98, 153, -11, 158, -152, 111, 193, -70, 111, -151, 183, -78, 31, -184, 178, -59, 15, 298, -79, -53, -105, -132, 6, -14, 81, -204, -133, -134, -4, 69, -92, 250, 46, 13, 7, -206, 16, 142, 158, -78, -56, 207, -105, 124, -47, 143, 11, 196, 103, 95, -55, -49, 16, 94, 11, 123, -63, 168, 161, -3, 43, 103, -4, 147, 125, 45, -68, -13, 117, -146, -76, -110, 1, 64, 114]
6243A14l23J97j51JJ19O0K68l81K39k93J7Q5K2j89K85q4k80K84j10K63j56P4l7
6266B4J68j33J9J5l6O0j73Q3P0J7q1Kk2J00m4J32j93n8K96k71o3J68j89r0J79
6291b0R7j67K95j25j09p3L9n3J16j68K59j44k9J04j11R3k25K89M7q0p3L1K03n3
6315A43j80N2J0J3p3K17j99m9rK52j47N6l43L17L1q8l7J84m32J48J77n9N1q0m8
6340i3O9O8j50J42K3k19J15J92k03J29n4J53j59Q4n8p5R7N7o3P6mj49J26k34J81
6365E1p2J15K0l91K66K80k61N6k90J36m7j31K35K9q2J68j58M38n53P0J48M6J28
6388B01k75K81l46L59k79J76O0m1j71K06l2l13M75j35k48R0j27M56l63J9o5Q0
6410HK2l4q8J62j58O1m8J71p6K7k37M62l86J64M5l12P3K91l26L17k48J93n0J92
$$ y = [114, -209, -12, -163, -162, -43, 17, 285, -96, 143, -150, -133, -48, -26, -215, 70, -14, -294, -10, -120, 143, -13, 61, 24, 192, 59, 78, 93, 57, 117, -56, 27, 97, 114, 33, 35, 13, 113, 69, 201, 8, -50, 246, -25, -88, 80, -109, -199, -20, 77, -90, 205, 80, -29, -102, -63, -116, 0, -168, 91, -53, -82, 22, -89, 4, -221, 68, 115, 35, -38, -7, 196, 143, -37, 15, 25, 38, -35, 182, -17, -66, -75, 177, 30, 86, -257, 60, 91, 3, -34, 150, -282, -134, 43, -16, 35, -45, -93, -24, 44, -106, 36, 59, -160, -45, 147, -56, 73, 19, 172, 13, 97, 39, -36, 61, 118, 55, 131, 127, -22, 104, -130, 51, -21, 94, 114, -277, -11, 269, 8, 64, -226, -90, -137, -268, -33, -4, -86, 82, -76, 362, -191, -121, 27, 73, 201, -74, 207, -139, 220, -59, 117, 177, 136, -35, 171, 139, -174, 301, 166, -82, 8, -119, 337, -26, -7, -72, 8, 30, -4, -92, 70, -88, -27, -75, 96, 20, 47, -190, 272, -114, 50, 95, -217, -144, 147, -179, 138, -110, 83, 33, 225]
6434B25R9l64M4k05K21R8m74O19k89K95l18N4L0k07o4J51K4j09M3J15j53K87k19
6457i7K4rJ77m9j78l9K03k24M47l27K7kj79J96j11L42k78K21l37J99l0l6J39J28
6481B07k63Q9P1R5l30K39o1J2J01k57J86q6Lj23J34J09j50O1j16PJ60l45J78j26
6505b05K85r9J3J86k34R6Nm9k53K54J7r5J93j23J85j94k45L76j73K74j73j1rj49
6529a28M8J1k5K7j89M28j59n5K80k46q1r0K62k63K71o6k3j0q4J68j43j10J96m7
6553b8p9n5K74j81j63K74j93K71k52J62j7q6K48l51L81k63j40oK39J16l28J14
6575f3J53n9J52l38K04P1j61J6j42O6o8J43j03K8K09l25K78M8K4j75j50J37k4
6598g9%J01K6Q9j57J53j58K48k68q5L90k94R9l7j1j57J04J76j17N8N6k6r7k22
$$ y = [225, 324, -40, 4, -201, 20, 118, -356, 263, -26, 269, -49, 5, 35, -172, -236, -85, -61, -170, -127, -12, -165, 122, -97, -73, -82, 95, 46, -132, -171, 32, -192, 255, -72, -45, -47, -226, -30, -141, 201, -77, 144, -193, 6, -24, -60, 79, 207, -56, 33, 104, 199, -131, 108, 47, 59, 160, -97, 89, 3, 6, -117, 17, 126, -24, 37, -79, -72, 88, -257, -79, -205, 80, -19, -6, 180, -54, 42, 47, -2, -255, -1, 16, -79, 114, -9, 176, -18, -263, 113, -60, 214, 41, 30, 21, -128, -80, -69, -94, -67, -256, 172, 13, -42, 238, -8, -89, -179, 83, -180, 91, 25, 2, -8, -92, 76, -67, -177, 19, -28, -107, -162, 112, -69, -232, 42, -151, 120, -132, 30, 13, -73, 175, -176, 205, -58, -198, -204, 35, 151, -177, -63, 90, 31, 183, -155, 49, 120, -41, -25, -167, -101, -169, -26, -129, -101, 108, -217, 61, 109, 133, -42, -192, -55, -79, -79, 22, 48, 137, -20, 133, -25, 223, -45, -130, 260, -34, 65, 28, 17, -140, -36, 140, 23, 81, 137, 111, 14, -208]
6622b08J69P6K36k54q6J33k05M14k60j18J25l2M6j03Q1k30L41k29M5R1J63O0m31
6645a76K92k06J23j70M5N7J97k21J42M4j3l2n6j60Q2J2r6J11J7O6j48j17K71J5
6669G9p9K04j9k28K35k08M4k4L7j7l4K02l40K68j59K30j60k11K0K0J98j33P9j13
6693a09N4p2J2J99k22K32N7j33j59J53L0j25O9J67j66J21j98J32k10K75Nj13K42
6716B41j94J19k62J14m4Ml4j88L40k16K85j41J65q8m19N75k51j43M4L46j17k06
6738g0K34r2K0o6%q3J39j51l1K5rj07J29j10K55l43L02p0L8J41j55K1O0J08k27
6763d2kK0j2j56J96j19O2l5J52Q2J51l55PK24k49J44o8k04K11J34M2j51J8j74
6787a24K67Oj67%j62K24p2r2J73n9J27K2j48N6Ll2J4p7k30K0K57K46k98J33j37
$$ y = [-208, -39, 37, 273, 19, -67, 66, -139, 275, 15, -103, 22, -10, 36, -67, 14, -216, 125, -104, -59, 32, 195, 255, -176, 116, -90, 33, -137, -92, -35, 162, -59, 83, 127, 114, 82, 26, -134, -52, -40, -136, -25, -8, 58, -90, -207, 64, 79, 0, 204, 185, -43, 192, -16, 28, 4, 41, 24, -10, 192, -148, 120, -39, 191, 31, -180, -160, -140, 58, -75, 4, -109, -55, -127, -115, 84, -138, 94, 151, 18, -141, 12, 42, -83, -14, 153, -13, 108, -90, 42, -168, 107, 112, -1, 241, 47, 166, -96, 18, -26, -22, -56, -244, 96, -120, 165, 24, 189, 101, -318, 257, 6, -137, -93, 253, 136, -70, 164, 72, 92, 26, 26, -57, 82, -69, -100, -75, -84, -191, -62, -172, 83, -260, 42, -28, 10, 151, -4, 17, 77, 185, -42, -44, -24, -36, -192, 4, -115, -53, -88, 64, 146, 297, -58, -51, 173, -76, 68, 0, -204, 7, 141, 183, 32, 50, -124, 143, 149, -18, -18, -180, 44, -28, -120, 53, -6, 121, 143, -5, 51, 54, 22, 36, -41, -271, -251, 6, 252, -46, 87, -50]
6812e0l6k1K46J26k82J35L4r1j69J24j01q5K19Mj28K67j07j44J54L1l12J28N6
6835bPm5J14K6r6r9K25J64j86L2q2k21K57j50j76K28KK14k96K27l29L22l11Q7
6859h8K73j92Q9j11J93p7j33Q0k34K28j38PJ45o9J78k56K8M%m0K52k39kJ75M0
6884A13l09K15m2k1J63K2j80mL37l94J46Jrl20J53K5QP4K4K09L3k88m2J22m5j12
6910a21J45N1j58k24M84n1j35j42J67%J5k63K95l05J74Q4LL4M6j79o1J08Jk63
6934b95p1O41j76r6O2p8o4m8O4Q5jj6L8j97j03K77j02K38n5k03L38j15j93L3j23
6959a60M9K93p4j25J01j3l3p8k7K27l35Q9J01j46J5P9K37m0K5J06l0k77q0%J8
6984g8j12L68m4l00K14k1n5K7j30J98j45R4R4J30j53o9n1N6J7k4r7J42j10l5j05
$$ y = [-50, -86, -107, 139, 265, -17, 118, 152, 61, -108, 16, -85, -170, 49, 53, -75, 192, 85, -59, 95, 126, -186, -58, -2, 5, -40, 74, 100, 4, -95, 130, 294, 108, 140, 58, -163, 94, -56, -232, -4, -2, 212, -84, 143, -186, 136, -175, -88, 185, -7, 82, -29, 164, 87, -46, 34, -200, 28, -110, -103, 42, -27, 151, -105, -77, -73, -73, -113, 139, -100, -102, 73, 113, -196, 19, -23, -44, 119, 141, -39, -43, 294, -100, 46, 47, 38, -282, -129, -104, -96, -22, 2, 211, 244, -44, -86, 36, -9, -121, 24, 75, -83, -307, 177, 126, -9, -151, 16, 16, 31, -232, 63, -242, -68, 16, 19, 53, 99, -80, -141, -33, -32, -295, -366, 275, 99, 3, 65, -13, -77, -125, -61, 24, 23, 7, 45, -152, -255, 22, -80, 158, 103, -100, 238, 123, -70, -37, -160, -111, 182, 108, -17, 84, 71, 38, -40, -67, 160, -175, -86, 15, -131, -116, -37, 200, 160, 185, 291, 261, -16, -96, -96, -78, -190, 178, 134, -166, 48, 27, -28, -1, -131, 67, -78, 16, 110, 240, 87, 18, -33, 23, 40, 16, -81, 61, -49, -84, -189]
7009a89K10j18J04J79l62l5L74j07j52J9k4J05m5Q4j59R3o1J08%J55j64M7j97
7032a35J89K4k4j12L5m5J32q4j42P7p2K30O1q8n8J19m04K10J21P2J76j93k16j36
7056b63K92Q4n8r8J46j63J09l8p5J01j5q4j04J53P1p8R0r7L5J48j47R4j71MO2
7081bO3r0q3j11J56j25L39n6O9k38N2K21j81J93l18N2k2j29L64l06J30j27J38
7104a1K27j97j6l6l0Ll7K81k43j10J81J04k62k5L40j94k42L35o0K20m80K76j46
7127a22P7j16K25K3n1Q6q0n9j6m2M03p0l44q7Q6J70j45j5K35l7j20k9Q1k41J98
7152A0p1J58p7R3O3k14N0J44k17K11j10j01O0n2j30K88l28K15o7O1K12k67J32
7175F3J45j27l7k43J37j32K12j36R5K43j05j42k11L49j18j19K56k16Q2k0r8J65
$$ y = [-189, 21, -97, 7, 186, -176, -211, 163, 56, -96, -77, -101, 4, -41, 43, -116, -23, -84, 24, 24, 179, 15, 62, -135, 54, 78, 54, -58, -23, -68, 64, -20, -162, -85, -157, 73, 134, 46, -12, 107, -297, -87, 34, 106, 282, 89, -127, -263, 29, 113, 55, -43, 103, -60, 49, 11, -64, 37, 22, -62, -166, -13, 58, -20, 70, -27, 8, 156, 9, 103, -68, -64, -2, 61, -29, -112, -223, -67, -192, 147, 91, 160, -78, -26, 195, 14, 207, -111, -59, -81, -210, 154, -152, -22, -149, -11, 216, 19, 3, -33, -63, -60, -97, 184, -59, -169, 12, 116, -146, -171, 169, -25, -267, 68, 8, 228, -252, 24, -122, -45, -161, 64, 87, 36, 122, 42, -17, -33, -75, 328, 258, -86, -173, -87, 83, -62, -77, 158, 121, 1, -28, 53, -188, 10, -61, 97, 20, 113, 176, -38, 12, 156, -61, 150, 40, -61, -1, -53, -183, 105, -223, -8, -75, -14, 198, -69, 63, 208, 81, 44, -199, -62, -194, 18, -118, -23, 220, 115, -27, -238, 111, -7, -126, 130, -86, -4, -24, -122, 43]
7197D3k21K24R6q7j00Q6l3K4j7k7o8J72k00J53L1k16K26k62M95l76O1L22k73j86
7221a33J52LN3l25L55k75K4K14r8Q4q9K38k0k58j26L28l31J15Q9K96l56J34j20
7244d6J5M0L7q3j82K44j87J4K09j4j60J18j05p0J04J87l30K60r9J42q3M2j02N4
7268EQ6j07K62l21J81j45m4N7l4J56j04k4J6K4J35j37Q9r2Kl60K64L05k22l1K33
7293A94k81j12J49m4K48j86k7J37j20K45r5j51L72j16k39k04J42j06N0J6J44n4
7315c8q5q0M47n14K88p5m2J25M9j31j25K94J06l02J10L9j26J26j43P4RM96l78
7338A24J68Lk49r3O9J63o9j72L38l24K70j67j62K45k46Q2j3R5k1J9Q6m1j10k0
7362b5j23J13L48k21r5k00J98J64j45M5N8l90K49k3j9J16m9L00R4m55PM1R9k34
$$ y = [43, -178, 46, 142, 55, -45, 41, 8, 32, 15, -12, -80, 92, -108, 45, 76, -140, 86, -176, 319, -57, 4, 326, 53, -133, 19, 22, 75, -250, 105, -170, -146, 68, -30, 54, -35, 203, 183, -75, -201, 127, -204, -89, 0, 296, -60, 74, -46, -31, 9, 46, -37, -219, 25, -162, -148, 61, 47, -113, 5, -100, -170, -66, 121, -209, 51, -48, 94, 11, 53, -49, 5, 91, -16, 246, -75, 106, -39, -83, -26, -60, 96, -8, -32, -16, 8, 143, 6, 95, 3, 5, -355, -91, 214, -8, -39, 194, -87, -199, -50, -94, 154, -32, -59, 78, -42, 203, 108, -43, 329, 213, -26, -230, -88, -194, -144, -128, 16, -38, -123, -203, 244, -270, 18, -57, -99, 26, 75, -56, -181, 113, 219, -83, 27, 66, -60, 66, -77, -3, 6, 502, 124, 292, 295, 46, -47, 22, 185, 116, -56, 282, -42, 228, 61, -101, 144, -102, -20, -33, 62, 41, 60, 146, 105, -5, -25, -148, -35, 313, 92, -3, -203, -5, 159, 14, 59, 117, -273, -24, -47, -66, 50, 1, 301, 395, -60, -53, -12, 87, -147]
7386a47kJ34j92L81j80J69q8m2J38k15J03o4J97Ol8k20kM6k78N02j19R8k68L4
7410d7j30q9J90J12M9r9Pn2k4J28rJ18k53J78N2l55J26lJ01K06j79N5r0q2K47
7435A57j95j08J0K40j4r3j61J75O6l06J06M95k61l36K19p7J95j90K95k05J15l9
7457H8r8L16k96K07j15J0j40j12K07j05J33k29L0J46k7J04k79L39j60q6J48p7
7479DM7j46J46j40J38k28J19j13K83k3L3j03R0k4k45N09m57n0J51J02j48J47R4
7502A86l89J50J01n0k1J94J08l43K54Jj1l49n6K79l8P3j05q3J66k01K13j07k67
7525b95N74m33L11l89M67j20p2L96m01k7Q5j18K8M5j40J91O1n31M36p4j05O6l
7548d8J77j24L5n6j52K92r8l6j44K65M6k31K34j52R1K7Ok60O7q1P1j52J65nn1
$$ y = [-147, -149, -15, -207, 174, -6, 163, 75, 33, 171, -44, 59, -5, 192, 198, 160, -60, -62, -16, -294, 208, 89, 187, -81, -47, -177, -266, -76, 36, 85, -14, -7, -59, -83, 45, 36, 154, -99, 79, 131, -224, -98, -101, 0, 206, 27, 82, -8, -90, 157, -38, -146, -136, 104, 90, -3, -164, 11, 77, -229, -123, 372, 111, -225, -6, -83, 112, -78, 217, 12, 127, 88, -10, 306, 10, 217, 102, 112, -28, -140, 67, -38, 95, -134, -104, 42, 15, 119, -160, 179, 19, -67, 81, 4, 51, -95, 51, -89, 49, -179, -60, -173, 110, 87, 120, 17, 107, 83, -162, 347, -110, -160, -9, 93, -55, 92, 186, -203, -53, 48, -2, -23, 171, 279, -64, 190, 191, 180, -169, -225, 54, 16, 89, -16, -99, 67, -134, 79, -28, -295, 279, -154, 157, -232, 235, 115, 43, 439, 38, 11, 96, -22, 6, 51, -89, 102, 163, -368, 68, -6, -111, -45, -48, 129, 5, 40, -16, -168, 124, 26, -10, -154, 111, 157, -74, 160, 8, 99, 126, 132, -128, -61, -142, -71, -223, -58, -63, -114]
7573a14L25l9l67J22j28jR8K26Q5m00J73M6n8j39K99l99L58j12jn0mK34k0k51
7597a17J52rn7m9o6j5J11K36k36K54j73j78j3p0K87q4R0j24q5JK08k15M4J83k99
7622b24O9n3J09J22qo3n3J61r7J92j56J06k26K13m7j13l7P7MP7R2j73O8N6m8n
7648D3J52j55Q7j16k9K39j83q1n4L29n37K55M1O3J53j48M3k28J84k7M0r3K38j91
7672B5O7pm7nj07p2K27j63K76j02n3J15k65M4O3k31J17J83n8pL13l58RM2j55P4
7698g5J61k3j70J40MK5j2m2R2P3j02R5k05L9J14N6o5j92n6K56r7j3L2j37q3K74
7724H9n8j88L04m65L39j54K08p8M5K5j40M0J28j4p7J06k85K92mMj99J60J39j69
7748D8j56L05k82M8K45j29MJ30k04r6J48k76K08m1P8q6nj18J56Mj09Om6J71J01
$$ y = [-114, 211, 172, -195, -73, -201, -202, -104, 122, 207, -193, -20, 26, -32, -171, 128, -271, 87, -25, -26, -76, -80, 154, 134, -117, 35, 26, -31, -80, -146, -161, -50, 186, -50, 204, 31, -147, -160, -230, 57, -27, 63, -61, -146, -145, 63, -152, -108, 75, -224, -155, -208, -99, 23, 15, -48, -101, 60, -37, 155, -1, 105, -121, 92, 45, -68, -105, -28, -24, 53, 145, -28, 40, 96, 48, 43, 195, 40, 127, 11, -18, 221, 38, -43, -97, 232, -305, -50, -9, 54, 207, 59, 102, -126, 58, 31, 71, -22, 216, 25, 92, 85, 38, 33, -74, -146, 81, -82, 194, 92, 39, 154, -111, -67, -4, -235, -118, 65, 7, 0, 313, -45, -36, 6, -149, -75, 86, 63, -107, 33, 37, 62, 50, 8, 100, 173, 71, 166, -39, 0, 114, 170, 105, -87, -143, 113, 16, 3, 35, -102, -185, 89, 31, -157, 147, -318, 21, -133, 75, -3, 42, 67, -73, -33, 95, 81, 4, 110, -175, 117, 113, 117, -82, 78, 217, 48, -108, 197, -85, -37, 208, 79, 83, 213, 9, -87, 61, -215, -7, -48, 30, -56, -61, -179, -23, -19, -128, -122, -168, 3, 104]
7773A04j60j5J99j80l58J50L30j9j32O3J3p1K73r7N7M0M6j86o4J34l2m4P1k95
7797a73J84m7J7M3j91K16j56j9J07M9O4j65J79l54k9L71l0m9j4NL2j58P2J40j39
7822d5N3j30o9P8J89j74r3J70J94k13k19K80K1o3J89m9k16JO1J82k46J9K5Q0r8
7847g3J1J23L6k28J92o9L9O5O3j94k5J87l3j54J21k37R7%M0L01m20L88j46j38
7871e4J04j69K98j18n1J05j0K5Q6J47n34K58J48j61j01j92K13k6O0J98l85J18
7893d1J80m3J2qk1k2M6j75j2K11j35Jk35M53r9J30j67P7j64J06rk8K43j06l82
7918a88J76K32l6j25J47nj59KL3l9k91L24K0j30J60j44m2J11p0oO7k60J25K39
7942A41j19K0M1J13j31J02j71KJ9L3O6k7j4J9r8J38p0LL0j35j36J66K7P3j18M5
$$ y = [104, -56, -71, 128, -52, -410, -260, 70, 51, -81, -18, -5, -76, 197, 100, 157, 197, 243, 57, -7, 127, 95, 51, 122, -173, 11, -36, -19, 24, -167, 49, -107, -126, -19, 30, 94, -71, 108, -246, -275, 96, 66, 17, 3, 8, 40, -118, -46, 94, -45, 8, -122, -191, -113, 76, -98, -191, -21, 173, -40, -259, 21, 42, -21, 168, 119, -97, -96, -35, 147, -99, -80, -55, 25, -73, -62, 61, 97, -131, 61, -8, 31, 96, 159, -35, -60, 127, 94, -60, 61, -176, -79, -79, -39, 262, -158, 230, 84, -54, 50, -119, 179, 61, 10, 115, 105, 130, 216, 363, -171, 87, 235, 74, -27, -219, -6, -32, 28, 226, -159, -41, 139, 96, 108, 100, 79, 57, 103, -72, -84, 127, -8, -7, -242, 211, 112, 242, 75, 152, -12, 94, 85, 57, 300, 194, -188, -12, 220, 184, 59, 206, 201, 42, 44, 77, 38, -253, 71, 91, -39, 121, -23, -65, 46, -24, -30, 37, -223, -98, 141, 22, 42, 83, 196, 65, 167, -4, -2, 17, 50, 116, 89, 75, 94, -4, 134, 64, 67, 97, -38, -174, -8, 19, 92, -26, 19]
7968A9J88j43j16K64l10J31K38l19L12k13K8j7kJ03j36l9J14j15n8rL03l55K6
7991a06o8J35j72J53K55j06Rk14J07k0k4M6j29J0J89j90K29j57L9l2q1K26J33
8014B32k06O1J1m4k82J90N8N7j45j56K63o1k30J93J38L6J1j17r7q6N4K98l26J33
8038a5M3jj87K27k27K04M4l21M59Pp0n3j24qo5m3K42j42k35K41P9J77k69o5J87
8063H5J36o2r4j04J59L4k10L63m10K26r0J02k56P6k12J40J14J6R2R2j70R1J16
8086B34l44J66k44mJ44L0J04L4k39J09j2N9r4J32q0J00j2j01P3J6N7k13ro5J91
8111C2J44l10J3K12j64m8l4J57J02j83j57M10q2k04j07K06J5j13L12l2p6l69N
8134b71K24L09j45k17J01n2L1L13k38j13p1M1J21m6J3J38m3L8q7J27L9j61p9L19
$$ y = [19, 207, 64, -52, 212, -98, 33, 271, -48, 264, 51, 79, 62, 60, 163, 27, -12, 102, -13, -71, -80, 223, -132, -106, -174, -39, -211, -58, 197, 91, 100, -114, -7, -27, -51, -5, -134, -124, 65, -125, 104, -53, -14, -46, -127, 99, 232, 26, 87, 98, 54, -228, -38, 20, 77, -68, -224, 39, -22, -252, -59, 79, 115, 126, 9, -88, -174, -120, 178, -148, -15, 28, 27, -160, 67, -160, 44, 88, -233, 226, 233, 163, 110, -14, -22, -87, -130, 112, -30, -265, -24, 55, 232, -37, -102, 85, 221, 159, 65, -39, 120, 154, -56, 307, -103, 123, 33, 135, -121, -45, -257, -117, -3, 13, 105, 197, 27, 118, 234, -110, 56, -188, -192, -48, -18, 86, 120, -119, -10, -22, 37, -57, 75, -5, 95, 83, -18, 55, 71, 128, -85, -94, -159, 32, 176, -134, -121, 91, -73, -121, -155, 2, 104, -79, -236, 174, 92, -112, -219, -13, 2, -111, 201, 169, 93, -276, -271, -47, 262, 117, -100, 1, -51, -20, 293, 55, -58, -129, -88, 33, -13, 0, 138, 95, 133, 46, 173, 212, 51, -28, 291]
8158B91l92J21J67j52P1j85J93J53l82QK62l00J04L39k57O0QJ13k74r2L93k19
8180C0J29r5J80j21k00k56L98k29l0L0K25
$$ y = [291, -101, 20, 187, 35, 106, -79, 114, 267, -115, -107, 155, -145, -41, 298, 41, 101, 109, 222, -52, -144, 249, 30, 159, 64, 244, 123, -77, -333, 65, -164, -194, -164, 61]
8191F1
$$ Imaginary data points
##PAGE= N=2
##DATA TABLE= (X++(I..I)), XYDATA
0@%%%%%%%%qJ6j6K4l2M0n6P2q8J12j39J67k05K50l00L57m25N02n88O87p96R18
30D92j056J211j385J576j788K026k290K577k894L239l616M032m486M979n519O112
46C210o758P462q230R072r995J1007j2120J3347j4709J6227j7927J9844k2029
59a1599K4542k7466L0924l5085M0216m6733N5360o7485Q6267j21941L24035m55961
71b04926M99065n3234O0345l7994m27576M38783p11046Q84097n24533l20497L99909
82B393j78421N08861o89604L49625j7638k2173M40147p65353N04880l30169L24903
93A27451L6481n91880M68473k66809N51746m98148l7008M93137m57305O39832
103D65970m45056O8335J1059J47620K96910q84986O14031j52596k0173J10529
$$ y = [0, 0, 0, 0, 0, 0, 0, 0, 0, -8, 8, -8, 16, -16, 24, -32, 40, -48, 64, -75, 92, -113, 137, -163, 194, -231, 271, -317, 370, -426, 492, -564, 647, -738, 838, -950, 1076, -1214, 1363, -1531, 1708, -1908, 2124, -2362, 2617, -2902, 3210, -3548, 3914, -4316, 4756, -5239, 5768, -6352, 6995, -7714, 8513, -9414, 10430, -11599, 12943, -14523, 16401, -18684, 21532, -25201, 30159, -37326, 48941, -73000, 251035, -204926, 294139, 240905, 301250, 263256, -164320, 274463, -436583, 447514, -77019, -397516, 2393, -176028, 332833, -356771, -7146, -24784, -46957, 393190, -372163, 132717, -197452, 127451, 163932, -427948, 40525, -226284, 325462, -172686, -209694, 283443, -173862, 465970, 20914, 89249, 100308, 247928, 544838, -340148, 273883, 121287, 101114, 211643]
113B11643l76863L29550l27024O07865m01641k53105N26710k79887L54579m89902
123i8075J94410K6999j13111L44230o64389L67375j11224J27341O1408m89018
133c54054M95680j81059K79183k57598q8000L71422l49275M40763m17419k9323
143h9680J81383l3762J35080n74291M92159j23462l4713J92131l84541L20627
153H0931j34103L21659l17667j79620M70223l28100K25830l18272O5754J09864
163c501j12962K48492m88579L15267L2343J9438N2340l33802M28359j50519J28204
174A35080j41709j22575K95093k35385K75315l53116K1752K64336j30485J03826
184A12132l26408L54426n9736k7955J47511l53000K98747n7588Q6634k26633j00795
$$ y = [211643, -165220, 164330, -162694, 445171, 43530, -209575, 317135, 37248, 391827, -98075, 96335, 123334, 10223, 354453, -309936, 57439, -53785, 73556, 134964, -354054, 141626, -39433, 239750, -17848, -105848, 265574, -83701, 357062, -60357, -89680, 91703, 57941, 193021, -381270, 110889, -12573, -47286, 144845, -239696, 80931, -53172, 268487, -49180, -228800, 241423, -86677, 139153, -179119, -113365, -3501, -116463, 132029, -356550, -41283, -8940, 10498, 62838, -270964, 157395, 6876, 135080, -6629, -129204, 165889, -69496, 205819, -147297, -125545, 138791, 8306, 112132, -214276, 140150, 80414, 52459, 199970, -153030, 145717, 88129, 174763, -51870, -152665]
195a52665L51993k86834J52435k05511L0248J55328r6734J44917l49827K74727
205A8077N4548q0346K3943k34045L19338j42234M0581q5460j27199K68771j46872
216i0898J32188k41971Q4252K44239j70249Q6489j89351K25193j3400m0428N6361
227H2425k69922K86392m2642k8188j18191k9034K71027k05286J13044j31466L0720
238d1121J75689j02318N4479k29592K22243L8683j30319J4580j40762K26451r8984
249a0971R741n7840p8788K46166j07003K9814j43916J05159J57743j76262N8804
260C2647j32613J39367J6327o6487m789j53929K52994n0351o6938l9010J1864
271f0918J86558j40370N3825j00801M4622J40519j15061q384j26585J85626N628
$$ y = [-152665, 199328, -87506, 64929, -140582, -110334, 44994, -51740, 93177, -256650, 18077, 72625, -7721, 16222, -217823, 101515, -40719, -138, -85598, -212797, 55974, -90898, 41290, -200681, -116429, 127810, -42439, 44050, -145301, 79892, 66492, 26064, 82425, -187497, 98895, 56253, 28065, -90126, -119160, 151867, -53419, 59625, -71841, -41121, 134568, 32250, 86729, -142863, 79380, 118063, -12256, 2324, -138438, 88013, -10971, -1230, -59070, -137858, 108308, 1305, 31119, -112797, -7638, 150105, -26157, 32647, -99966, 39401, 55728, -10759, -15548, -169477, 83517, 33166, -33772, -72782, -60918, 125640, -14730, 39095, -61706, -17084, 123435, 8374, -10, -126595, 59031, 64659]
282F4659j19082K1062o5711J72321o2037p595n1495j7830J98633j11136k5444
293c655p0863R7920P4645j38816L4414q7804J17017K6040p2194k6096m4262J98583
305A04929p5195n7162j1715K7592J16108j08684J1923q0045P4645R1349j16326
316b2581j8298m3977J56956k5320q4366J9220j9329J30748n5306k8336n2936M0383
328c142J28465j22855k7491k5772R5704J9254r2340J6522n0826J24938m809p3990
340a6342k4181J5397J34408j02290l3497j0821L7300O9212r2300l513n2010J01308
352B2671L5620j04497m409n04J23482n9653m9093M558L587J04812p4644k8241
364b6311l7595P7659P0005j21295N201o717R3270q817o6515R575k1179J24696
$$ y = [64659, -54423, -33361, -99072, 73249, 11212, 3617, -47878, -65708, 132925, 21789, -3655, -74518, 23402, 98047, -40769, -6355, -94159, 22858, 48898, -23296, -49392, -93654, 104929, 29734, -27428, -39143, -11551, 104557, -4127, 7796, -72249, 2396, 93745, -22581, -40879, -84856, 72100, 46780, -37586, -18366, -37695, 93053, 37747, 9411, -43525, -3142, 125323, 2468, -25023, -50795, 44909, 64163, -28177, -11655, -62481, 62457, 57648, -16342, -40523, -25126, 109282, 6992, -26505, -37326, -26, 69186, -23114, -26627, -78637, 22671, 58291, -46206, -50615, -51119, 72363, 12710, -36383, -31825, -28238, 76574, 1930, -26311, -63906, 13753, 83758, -37537, -32336, -39053, 54217, 45400, -21115, -11540, -32719, 91977]
376I1977m8332o4085o113M3901Q7337j11589j767j0855N3955M5691r0374L565
388f689k7986J12125j5321r3308J9742N860R6096q1427k7383K59J5008Q7821r9682
401a4885j3198j6245Q1152K2744j15671L1948j3346Q3877l1694o2844J2711q248
413d3699J12460q6578m2873J7325L8545O0313j14249K2501r205N7004K9480j00886
425e9862K3001p693J01995m7107p5317M7107K867Q4090q6160j2395J3178K4412
437H116P4153j16723J3711N066O6134J373j06278N7300j6093P5131l9447o2525
449d0082L5239o02R1269j04943k1823L7204J7943M0245j11128L2565o068M8509
461A8328J1406j08718M7635L87P3689o0758o0887O3788j1364O8267r0956j3054
$$ y = [91977, 43645, -20440, -26553, 17348, 104685, -6904, -8671, -19526, 34429, 80120, -10254, -6689, -34675, 77450, 62129, -31179, -11437, -5577, 90519, 9092, -18291, -18032, -3024, 84797, -14885, -28083, -44328, 36824, 59568, -56103, -24155, -37501, 46376, 14682, -48162, -35451, -43699, 68761, -17817, -60690, -43365, -4820, 55493, -58756, -36255, -45460, 11544, 41024, -59862, -36861, -44554, 57441, 10334, -64983, -17876, -15009, 69081, -17079, -29474, -16296, 8116, 82269, -34454, -20743, -15677, 50457, 51830, -54448, 2852, -13241, 61890, 22443, -40082, -4843, -5445, 85824, -19119, -40942, -3738, 14205, 54450, -56678, -24113, -30181, 18328, 29734, -78984, -31349, -30962, 42727, -18031, -78918, -15130, -26494, 41773, -49183, -62237]
473f2237L1432J4820N0845j22532L3283K1193L9019n631r4544P1095j0721O0677
485B6699m2790o0350N9182P0O3399j03913k331N2796l24L4634r9032M2719J2887
498a6354L8125L928r9133P3553P576M2907n2910m6713P2957j7309M9454q3460
510b7379q190N1971K664K9081j05644M8499L0829J2786q806q1176P1716p917L4742
523D3176n0117n7238P2059j0836K9337r0959P538N7246j6946K4554q6669M3374
535c5481K7884J2776j0324q2281P9185L708J2398m4606l4450P4153j6046L0233
547A7149o7503M965O6606o059J4165p8264N8630L2697p676n848o3993P0103N3
560C5025J1029m4131l6637Q1892j6053Q717o1514J6578N7783k2051Q916p1087
$$ y = [-62237, -30805, -15985, 34860, -87672, -54389, -33196, 5823, 192, -94352, -23257, -33978, 26699, -16091, -76441, -17259, -17189, 46210, -57703, -60034, -7238, -7562, 27072, -71960, -29241, -16354, 21771, 25699, -73434, 119, 7695, 50602, -2308, -49021, 23936, 6627, 56081, -27379, -35569, 16402, 19066, 48147, -57497, -8998, 21831, 34617, 25811, -55365, 16351, 8434, 43176, -6941, -64179, 7880, -2956, 26381, -64578, -57040, 206, -16740, 7814, -78855, -35481, -7597, 5179, -5145, -87426, -8241, -4533, 7865, -36741, -71191, 2962, -13084, 17149, -50354, -45389, 21217, 15158, 29323, -48941, 9689, 42386, 34710, 28862, -35131, 34972, 35025, 46054, 1923, -34714, 47178, 31125, 39842, -21672, -5094, 52689, 30638, 39554, -31533]
572c1533M5383K8930j3626k0707o1450P3499j851j0058l5673k0629P0984j7947
584E322R440n2476J2162O4000k1943o515n5482N3235K3159k4639q121m7740O4312
597A4714P073r652l4350j1514P6994k1360k977l8808J6577N2126k6736q029n0763
610c6705M7252K3955k7748j6400l5012O7502J455k0217k3498k138O3119k0522
622B1043n772l8144J6719N5223l2893k0525k9323M9100J4543k7230o698k8211
634c2168O1301Q922k6444k4377Q682N7673l0347j1520k6990J4119M3226l2053
646A0024k0761k5362M7000J3940l0479j1006j5392N6734j606k9499j8075J0373
658a4109M4142k5657j5653k6801K2661M2925l6944k1381l836M4747P320k3355
$$ y = [-31533, 13850, 42780, 29154, 8447, -53003, 20496, 18645, 8587, -27086, -47715, 23269, 5322, 14762, -37714, -25552, 38448, 16505, 9990, -45492, 7743, 30902, 6263, -1858, -49598, 14714, 21787, 12135, -22215, -33729, 43265, 21905, 18928, -19880, -3303, 48823, 22087, 14058, -36705, 10547, 34502, 6754, -9646, -44658, 22844, 24299, 4082, -19416, -21554, 41565, 21043, 15271, -22873, -6154, 49069, 16176, -4349, -33672, 15428, 29971, 2741, -3957, -32168, 29133, 38055, 11611, -12766, -4084, 53589, 23242, 11722, -15268, -1149, 42077, 10024, -10737, -36099, 10901, 24841, -5638, -16644, -32036, 24698, 23092, -6407, -24482, -14109, 30033, 4376, -11277, -38078, -15417, 27508, -9436, -30817, -34653, 10094, 17414, -5941]
670e941p041j1287N6238L95l8365j3571K2491L5281l0837j2501j6980K3232L6509
683C7623l3721k1579J621M4682R97k7355r251j985M5606j0854l6078j0671K0562
696d03K5898k6282j6266j4179L1439K7698l7451j6448J2362L4166m095k0722j3042
709a7325J931M5010j4987l9258j560K8953J6362k4875j0436q603L3140K3449l6579
722d778j6663J7113L3833j2225k2659j0044Q712L6416k0825l1471L34K9376J3234
735B0353k3773j2671k733L7160R902l6478j0213J8416K4541j3758j8552j3733
747b1539J5258L3682k6272k7243Q403K9745M559k0272q812k059L6518M009l6755
760a0778q040K0874K2715k0741j6514p741J8950K7342k8142j9075P668L1012L095
$$ y = [-5941, -12982, -24269, 31969, 32364, -6001, -19572, 2919, 38200, 7363, -5138, -22118, 1114, 37623, 3902, -17677, -16056, 28626, 29623, 2268, -6983, -8968, 36638, 25784, -10294, -20965, -403, 25495, -787, -17053, -31232, 207, 27905, -9546, -25994, -13632, 20534, 16439, -4283, -17325, -15394, 29616, 14629, -24629, -26189, 2764, 19126, -5749, -16185, -24788, 8352, 31801, -4778, -21441, -4328, 29505, 17280, -5379, -15423, -6711, 29705, 8880, -22591, -22257, 7119, 20353, -3420, -16091, -18824, 18336, 28238, -8240, -18453, -37, 24504, 10746, -7806, -21539, -6281, 27401, 1129, -26114, -17711, 12034, 16593, -3679, -12491, -14550, 21968, 25977, -10778, -18818, 2056, 24771, 4030, -12484, -20225, -1275, 26067, -2075, -21150, -13482, 17530, 20625]
773B0625k3923p998L258L6147q893l1658k382J7838K0090k0703j4637p529K5199
786E434K1951l3323j2593J0913K6737l174k2538o778K978L3510j3748l1007J322
799b0316J8745J7742k5122j0372j013K3136J7275l2735o609R468K7613n269k6081
812a3538l8P235L0938j9573k3059P198J6194J9981k6216q612L673K5302J1220
825C0705l5923M76R787K2184q168k5686J685P038K7965k3697k2308J0308J4713
838I079J4631k9475o018N632J8989P328l6272J813Q759K1053j0775k7814R462
851a3608P739K3079k3566j6725J4087J1892J6375l0947l391J1053J8074L046l4894
864a7786R486R034J8137j0881k5663J3264R135K0508k5999j4628J8159R574J0716
$$ y = [20625, -3298, -11296, -8038, 28109, 19216, -12442, -14824, 3014, 23104, 2401, -12236, -19765, 5434, 27385, -5938, -18531, -7618, 19119, 15945, -6593, -13371, -10393, 23117, 9369, -21638, -20316, -1571, 16171, -8951, -19323, -20336, 2800, 20075, -12660, -19269, -9801, 17812, 12543, -13538, -13576, -6341, 24597, 5024, -18035, -10837, 5357, 25338, -878, -9490, -5817, 19485, 30705, -5218, -4742, 5045, 27229, 19061, -6625, -4940, 2098, 30063, 6366, -15942, -5634, 9079, 23710, -5765, -11783, -6151, 12838, 20166, -16106, -14293, -5534, 15519, 4744, -23070, -13608, -5869, 17210, -6356, -23081, -8994, 2898, 19273, -11674, -15065, -4012, 14062, 17108, -17786, -8300, 734, 18871, 7990, -17673, -4409, 4726, 25234, -765, -15393, 2766, 12340, 23056]
877B3056l1539k44J1698J2591J421l4739J0725J0752J4469j3385k4638J9163O489
890E819J5231k4384j2130J9468O808R877l2538K896J5012Q766l61l2141J5726
903a951R354J0931j2666k3419K1102N519J1736k6268j0225K2256K714N066l0713
916a6564M437J4855N981k688l2320J8489J0717N398j3689k0356K3812L221Q388
929I681k3876q242K5343N24M516k8600Q327J8243K697k289k7968K2429R313L306
943A3404j1030j8267K5271K953N899k4328l487K5545m038K248k5106Q081J6557
956A3702o6n302k7635K4409O969l153j0716j6689K4687k25K507k3066k858K7343
970I907q115Q14k3411J0908J7061m020n273k3650K6952N172m391q452j4384K7498
$$ y = [23056, -8483, -8727, 2971, 15562, 16983, -17756, -7031, 3721, 18190, 4805, -19833, -670, 5819, 21050, -3334, -15464, 4004, 10812, 20689, -11849, -8953, 6059, 14825, 14464, -17677, -1951, 7403, 18334, 5668, -17751, 3351, 8870, 20606, -5662, -15887, 6369, 9083, 14149, -16564, -12127, 2728, 8709, 6021, -26299, -7810, 2907, 8305, -5384, -25740, -1928, 1293, 9681, -14195, -22437, 2906, 3430, 7946, -20654, -12327, 5916, 8613, 6324, -21644, 785, 10098, 13404, 2374, -15893, 9378, 12331, 18230, -6098, -9585, 15960, 11922, 14170, -10936, -2855, 13702, 13636, 8334, -19301, 5108, 12077, 8924, -1792, -18481, 6206, 5981, 8488, -14578, -17436, 9907, 1792, 2606, -20805, -9897, 7164, 3144, -2129, -25779, 1173, 6345, 1954, -6498, -20882, 6616]
984F616n94j64k0911K999K6453j1309K287k0033J0856J7279n720p337j9540K8541
998I423J785p680n697j2654K6155k169k608j9271M637K5506j5100J637j8051J1416
1012b671J6863r602o703j6631K9046p93q920l959j1848K7625l897o213j5577P754
1026e526K2961j7881L151j6572J1678J7307j2573p564j1742K8764m204j0008j128
1039c337j0706K6670n197q757j2349R272K0859j9839L935j3741J1313J6864j5701
1052g14n132q697K6871n380j0132M26j0150K7554p841j0253p185J0094J7235k0008
1066c312M861j2713J2174J6268j8894m348l995K4161p561j0354J582q985K6728
1079A5612r713j2464l086R875J4938k0707M511r612J1383J4841k1559j321j876
$$ y = [6616, 6022, 5858, -15053, -12054, 14399, 3090, 5377, -14656, -3800, 13479, 7759, 422, -19118, 9423, 11208, 3528, -2169, -14823, 11332, 9163, 6555, -12716, -8079, 17427, 2327, 3964, -14087, -2671, 14192, 4590, -2113, -18744, 10302, 9509, 589, -3370, -15218, 12407, 8510, 2297, -13280, -5526, 17435, -446, 2705, -13867, -2189, 15118, 2545, -5019, -16761, 12003, 7799, -2209, -3337, -14043, 12627, 7430, -1327, -13676, -4404, 16455, -3384, 551, -13190, -1877, 14987, -714, -5846, -14543, 12328, 6948, -3184, -2758, -12908, 14646, 6805, -3448, -10633, -539, 16696, -3312, 1549, -11164, 1010, 17278, -1616, -5964, -9959, 14202, 6641, -3713, -2131, -11116, 15612, 5899, -6565, -9651, 224, 15162, -5545, -1034, -10646, 737, 15578, -5981, -7302, -9178]
1092i178K0997p498j0665K528o689K5819j2503j1698R03Q699J2805j9885M909
1105a456q586J2771J2671k3307J719Q97J7216p884r991L293n089K4033j3708j2386
1119i807M817P998R607j8201L423m990J2085R531k3209L462K404J4517p753j0710
1133f826M413l175K1575j6056j0395P460N433R006j8018L071k608J1626O841k3343
1147a0996O267L464J0672o989j0182M587p95J8153j6447q550R217M784O236j6666
1161g245L182l87J0664M403k2244Q080L941Q539o901j0860O629P40J4443j6209
1175c225o736J0584L166N261j5521K338K347R597O47j9859R408L729O544p451
1189H29r392O968K282J1213j6549m352J1157K165L819j4482K812L591P501j367
$$ y = [-9178, 11819, 4321, -6344, -3816, -10505, 15314, 2811, -8887, -7984, 715, 13520, -6365, -1456, -10042, 2729, 15400, -7907, -6188, -5291, 11925, 4041, -5950, -2657, -7746, 16287, 2579, -9807, -4990, 3008, 12615, -5586, -2163, -7153, 4932, 14463, -8746, -5284, -2880, 11637, 3884, -6826, -2413, -5588, 15987, -69, -10464, -3004, 2429, 11435, -6583, -3512, -6120, 5506, 12347, -10996, -4729, -1265, 9407, 2418, -7764, -3177, -3972, 14181, -2266, -10816, -1599, 3185, 9421, -7245, -4063, -4450, 6214, 10617, -11627, -3547, 394, 8933, 2032, -8828, -2199, -1459, 12984, -3225, -9961, 623, 3789, 9050, -6471, -4133, -1786, 7811, 8458, -11401, -1993, 1736, 8280, 829, -8563, -1595, 687, 11900, -4649, -9001, 2156, 4321, 8140, -6342, -3530, 61, 7562, 6195]
1203F195j7602J0025L999M166o918q803Q058K836Q288j5759k469J1164J180K131
1217F491j3780L370N101N722l227j5567J1325L197K915o789p783R136L298N077
1231H486j4790l14J0757K13M01j2282L755O123M264m847j2916J1334L329J495
1245E008o456n944R163K657L193j3546O32J0528r88j74j1392M487O378K518n445
1260F19j0325J1371K912R21o571m711R218K488O31j2667K680R701j894j358j0035
1275g020N610O159J564o378q192J2151J852r65o419l455R396J358j356j1305L619
1290c381Q785k581k106q177N766N948N1o529n933J1566J137j985n852k807R482
1305C384R59l047r589N322P561k612k272o750O394N446l75p028l510J1162m04
$$ y = [6195, -11407, -1382, 2617, 6783, -135, -8938, -880, 1956, 10244, -5515, -7984, 3180, 4360, 6491, -7289, -3919, 1182, 6904, 3677, -11890, -565, 2632, 5547, -1242, -9025, 111, 3409, 8486, -6304, -6618, 4139, 4352, 4753, -7529, -3774, 2349, 6613, 1766, -11150, 184, 3513, 5008, -1448, -7392, 1771, 4428, 7621, -5925, -5293, 5235, 4247, 4073, -7319, -2832, 3546, 6064, 619, -9706, 1665, 4577, 5498, -1073, -5784, 3434, 5922, 6553, -6114, -3434, 6267, 4373, 3015, -7020, -1410, 4749, 6313, -65, -8257, 3894, 5746, 4781, -1638, -5093, 4303, 5661, 4305, -7000, -3381, 5404, 2823, 717, -7460, -1694, 4254, 4305, -2224, -8157, 3409, 4546, 2561, -3291, -6098, 3384, 4343, 1296, -8293, -2971, 4590, 1978, -294, -7044, -650, 4796, 4421, -2607, -6117, 5045, 4641]
1320D641k337n546j337Q917K49l929q426O376O843l812k042n719O945M953k392
1335C384o910k011J0231j570k663n336l63Q580o53m656o597P346N419m034k151
1350a984m447P212L677l222o808l09R686k561l010m578J139P848j247m677m957
1365h238P978M118m345k428l356O945K859m002o488J027Q963l600k483l997J825
1380e222Q063k675m505l541Q401K685m921j625l454P436J906m863n187K359Q233
1395C090m330j818l229K978P141l162m479k419Q537R03m829j495k632P539M66
1410B261n079m231L185P528m771j745k164K986O652m830l763j209P582J94n341
1425b745r91k209Q008n12n395k072L615O529n455j000j992L600N775n656l333
$$ y = [4641, 2304, -3242, -4579, 4338, 4587, 658, -7768, -1392, 5451, 1639, -403, -6122, 823, 5776, 3384, -3526, -5537, 4694, 3124, 461, -4875, -5238, 3342, 2689, -1967, -8564, -1218, 4201, 167, -1984, -6431, 781, 4458, 1236, -5572, -5881, 3805, 1244, -1766, -6344, -5205, 2643, 1396, -3281, -8238, -260, 3858, -487, -2915, -6271, 674, 3533, -469, -6957, -5930, 3033, -567, -3050, -7047, -5222, 2841, 166, -4339, -7880, 521, 3206, -1715, -3340, -6794, 642, 2548, -2315, -7502, -5143, 3090, -1240, -3058, -6287, -3309, 3832, 670, -3809, -6228, 2309, 3212, -1617, -3112, -5744, 1795, 2261, -2818, -7049, -3864, 3664, -1107, -2852, -5016, -2030, 4622, -208, -3971, -5180, 2402, 2596, -2745, -3736, -5945, 2063, 1551, -3844, -5916, -2301, 4228, -1227, -2227, -4219, -619, 5156, -500, -3833]
1440c833j69O871o77n149m25j039P487j209n265p56L609N687n327j566j019L335
1456E55N246p039k445R47N855o67n543Q30o03P288j864n485M29L600M670n825
1472e1j295m77L509M052p255j522J771N061j077n348J377L56O463k485n552J804
1488f69L040L500n475j731N93K854L491p428q48K585M228r19n451K123L87N528
1504E808l199n188K631K122K970n802j392J198K833K574p245L11K767L027q73
1519B542n012K182J055L940l255n055L431K181J593n069j454K857J796K189o847
1534b926Q64L526K246j330n337K814J431K892l053n154M605J495J196m583j300
1549b614L096J708J448o359R21M252P50j224m933K684K138J505l263m481M844
$$ y = [-3833, -4002, 2869, 2192, -2957, -3382, -4421, 3066, 1857, -3408, -4164, -555, 5132, -195, -1761, -2780, 555, 5801, -1238, -3683, -2736, 3119, 2452, -3091, -2261, -2864, 4424, 2560, -2925, -2496, 1104, 5774, -51, -1346, -1823, 1686, 5738, -1517, -3039, -1268, 3793, 2716, -2632, -1255, -899, 5564, 3079, -2473, -669, 2371, 5871, 396, -1335, -742, 2112, 5603, -1825, -2673, -88, 4140, 3221, -2230, -107, 280, 5808, 2609, -2579, 52, 2174, 5144, -658, -2050, -852, 1981, 4555, -2690, -2379, 388, 3415, 2542, -2470, -288, 767, 4707, 1452, -3603, -172, 2009, 3602, -1467, -2921, -64, 1732, 3921, -2926, -2062, 1464, 3710, 2380, -2957, -143, 1288, 4180, 1127, -4027, 578, 2073, 3269, -1314, -2614, 482, 2190, 3638, -2721, -1800, 2452, 3202, 1978, -2955, -271, 1867, 3372, 109, -4372, 472]
1564D72J604J13l949p93L477J293O49n784J398M338n10j309m302K730K196R38
1580B561l189l834N565J194q58l094p58L797R51k76n199J628M282j300j494l093
1596c117K347K457K10k893l322N672J085j783k113q48L967O75j161m361J519M914
1612C248k753j049k024J778L136r80k515k147N261P40k503j230q48L854M38j849
1628E57l602K128M374k998n75j753J579L258j608k507j412M987J36k661l05j608
1644b010L993N48k889k390J968M202l532n49j153J344L570k447k353p47N045o12
1660A988l136L49j412M014K52l558j479K541L296l666k9q65Q77L879k989k503
1676b441M16M268q95k979R24j588M040M04m278J0K285K937l792q7k46O53M125
$$ y = [472, 2076, 2189, -1760, -2553, 924, 2217, 2866, -2918, -1520, 2818, 2308, 999, -3303, -573, 1623, 2561, -628, -4462, 1103, 2297, 1439, -1655, -2413, 1384, 2335, 2059, -3140, -1512, 2770, 1470, -24, -3117, -770, 1687, 1897, -996, -4318, 1354, 2439, 656, -1457, -2305, 1662, 2337, 1176, -3185, -1666, 3248, 495, -554, -2578, -800, 2336, 1356, -1159, -3306, 1955, 2695, 192, -1038, -1886, 1968, 2406, 557, -3045, -917, 3457, 459, -116, -1869, -290, 2968, 1360, -1147, -2559, 2428, 2564, -97, -402, -2010, 1983, 2531, -358, -2748, -780, 3422, -110, -659, -1812, -468, 3102, 655, -1698, -2445, 2600, 1988, -1148, -799, -2211, 1803, 2055, -1503, -2982, -441, 2855, -811, -840, -1705, -828, 3051, 62, -2441, -2025, 2243, 1348, -1631, -707, -2295, 1745, 2149, -2129, -2119, 166, 3103, -689, -776, -1022, -369, 3756]
1693C756m020j900J175L235q43k725Q31j470M197j40m358Q24K000K299l299k31
1709f69k10Q97L424m249j274J885K386q08k820J612j112L604p70m251K036J599
1725A280J487l322j28L76P92L366m982m65K380J503q54k593J503o07L391j134
1741A993m640L064J299P80k546k83P80M31K936n245K42K489P28k85k526J387m05
1758A99K863j139m126L095P15R19k016n44R11P98K170m899O56K657j25n4k532
1775d52J280J66K597j908l477L615J16O88k161n01J493Q14J251m540J035K419
1791B435o67N09l056J327P99J598j841l072L926j85L05j803q91K087L27R80m224
1808a446J300K534j020j10k475J739O46R24j778k264L413l32J04j964k82K104
$$ y = [3756, -264, -2164, -989, 2246, 1403, -1322, -491, -1961, 2236, 2096, -2262, -1438, 562, 2861, -438, -669, -879, 18, 3442, -807, -2081, -196, 2190, 1382, -1438, 174, -938, 2666, 1896, -2355, -319, 1280, 2767, -555, -683, -307, 485, 3851, -1131, -1596, 784, 2287, 1433, -1160, 343, -264, 3127, 1993, -2647, 417, 1716, 2496, -50, -333, 447, 878, 3814, -1431, -1189, 1300, 2028, 1743, -783, 604, 199, 3062, 1923, -2203, 892, 1607, 2526, 510, -34, 877, 1675, 3845, -1054, -398, 2259, 2134, 2080, -452, 828, 994, 3591, 1683, -1794, 1821, 1937, 2625, 464, -37, 1456, 2270, 3521, -1019, 16, 2435, 1768, 2277, -779, 548, 1347, 2945, 1104, -1968, 1958, 1773, 2078, 275, -616, 1471, 1798, 2778, -1446, -146, 2388, 1368, 1258, -1217, 522, 1168, 2092, 314, -1950, 1463, 1131, 1235, -729, -1011, 1093]
1824A093J26M12l690J670J637n33j92k404J825R48J98j557j513K697m6J44j618
1841h03p04K503l20k40k713J634J633p03k81k067J819O53J45j748j042K648l34
1858H0K46k091J02J921K4m21k484J736J182m83p13j936K340P29j98j866p9K339
1876D28n60j11j758M32J960q02n51j922J775J026m66p12j628K360O9j68j546j95
1894b369K184n34q0k015J032J745q07n68j331J884N29k88j065r86K736l07l40
1911e80j399J81K132o99R6k269J438J613j190J9j579K192L14n54n97j165K634
1928E87o90k12j299K58K239j550K92j781J417J539j543k8j621K655k74k52o96
1945i59q37K874j006qj607O06K138j452N59k092J814J116j310J54j638K854o12
$$ y = [1093, 1219, 1631, -2059, -389, 1248, 715, 523, -1881, -56, 892, 1090, -467, -1980, 717, 671, 815, -803, -1507, 996, 676, 436, -2277, -643, 990, 287, 6, -2061, -242, 411, 556, -1192, -2234, 414, 80, 326, -1765, -1663, 258, 282, -139, -2623, -887, 295, -188, -901, -2837, -497, 232, 34, -1832, -1911, 428, -132, -243, -2001, -1569, 391, -411, -962, -2884, -1109, -83, -549, -1261, -2889, -529, -460, -628, -2174, -2369, -185, -719, -799, -2814, -1782, -37, -844, -1412, -2743, -859, -330, -618, -1683, -2669, 67, -240, -580, -1979, -1798, 334, -365, -269, -2538, -1100, 513, -677, -658, -2237, -45, 269, -285, -882, -2047, 587, -103, -315, -1614, -1356, 883, -667, -375, -2156, -739, 800, -743, -771, -2392, 263, -11, -263, -959, -1796, 1078, 72, 64, -1543, -937, 1201, -251, 308, -1784, 30, 1146, -164, -10, -1648, 1206, 594]
1962E94o41r1j163K943j392k45j446O46K315j838L90j733J816J032j583K87j536
1979a645K680o11r99Q5j013K987j858O1p63O34J970k217R63j357J401J148j792
1996c26O09j489L079j227o09m9r81K952j952J4o84N05K057k379R04j011J172Q86
2014A471k143J031j491K757j305j108O66j163K936k033j13l74N86K037k965J398
2030A87j176J146J121k250Q38j130K647j092j169P61j055K909j737n29L79J11
2046c9J995k955J354r57J041R02k560J396j144K021j094j165J267j460L205k273
2062d66m5J29J02K005k881J376r66Q21J040k605J355o70J945j100r35J455j354
2079g94K644k002m14O28N4J611l041J829j400R83J259k810J520m42J285o02j335
$$ y = [594, -47, -138, -1301, 1642, 250, 5, -1441, -795, 1520, -318, 72, -1661, 155, 1187, -396, -109, -1645, 1035, 424, -575, -490, -1503, 1484, -374, -313, -1076, -442, 1528, -689, 274, -1083, 318, 1466, -326, 283, -1206, 1873, 646, 37, -12, -993, 1959, 7, 21, -663, -158, 1899, -480, 424, -587, 585, 1471, -672, 359, -1132, 1625, 320, -788, -122, -1285, 1651, -382, -495, -869, -283, 1754, -1211, 187, -989, 157, 1278, -972, -134, -1264, 1383, 291, -878, -117, -1172, 1737, 0, -529, -150, -39, 1956, -999, 355, -602, 439, 1341, -1219, 177, -967, 1054, -40, -1205, 62, -1398, 1807, -466, -511, -382, -280, 1725, -1156, 220, -746, 75, 1115, -1490, -135, -805, 1140, 40, -895, 560, -794, 1850, -152, -566, 62, 116, 1727, -1314, 515, -885, 98, 1357, -1453, 67, -375, 910, 308, -1027]
2096a027J712j303K370j762p57J170m03J444l005J368l66P47J038k866J746o05
2112d99J361p32j266K033j494K168k169m96J247o42J330k619J433j39L40J251
$$ y = [-1027, 685, -618, 1752, -10, -767, 403, 0, 1444, -1561, -193, -559, 188, 1226, -1640, 106, -499, 862, 130, -1136, 897, -597, 1571, -598, -1094, 153, -489, 841, -1778, -345, -484, -144, 1107]
$$ [...]
8191a09
##END NTUPLES=NMR FID
##END=
