##TITLE=1H_Pr 2580
 CDCl3,8 sc, 
 1.03.2021
##JCAMPDX= 6.0         $$ Bruker NMR JCAMP-DX V2.0
##DATA TYPE= NMR FID
##DATA CLASS= NTUPLES
##ORIGIN= UXNMR, Bruker Analytische Messtechnik GmbH
##OWNER= root
$$ XWIN-NMR		Version 3.5
$$ Mon Mar  1 12:25:51 2021 Russian Standard Time (UT+4h)  she@DPX200
##.OBSERVE FREQUENCY= 200.1315066352
##.OBSERVE NUCLEUS= ^1H
##.DELAY= (6, 6)
##.ACQUISITION MODE= SIMULTANEOUS
##.ACQUISITION SCHEME= undefined
##.AVERAGES= 8
##.DIGITISER RES= 18
##SPECTROMETER/DATA SYSTEM= spect
##.PULSE SEQUENCE= zg30
##.SOLVENT NAME= CDCl3
##.SHIFT REFERENCE= (INTERNAL, CDCl3, 0, 15.7039)
##AUDIT TRAIL= $$ (NUMBER, WHEN, WHO, WHERE, WHAT)
$$ ##TITLE= Audit trail, XWIN-NMR		Version 3.5
$$ ##JCAMPDX= 5.01
$$ ##ORIGIN= Bruker BioSpin GmbH
$$ ##OWNER= she
$$ F:/spectra/data/she/nmr/H-F/1/audita.txt
$$ ##AUDIT TRAIL=  $$ (NUMBER, WHEN, WHO, WHERE, WHAT)
(   1,<2021-03-01 12:24:50.95 +0400>,<she>,<DPX200>,
      <created by zg, POWCHK disabled, PULCHK disabled
       configuration hash MD5:
       00 E9 B6 7A A2 85 ED C7 34 08 36 98 17 FE 4E 26
       data hash MD5: 16K
       FD ED 36 8E BF 1A 50 2C 2C B8 A0 74 D2 D5 74 9B>)
$$ ##END=
$$ 
$$ hash MD5
$$ 42 FE A8 2A EE 89 90 3F DC 01 40 8B A3 EC 91 FC
##$RELAX= 
##$RELAX= 
##$RELAX= 
##$RELAX= 
##$RELAX= 
##$RELAX= 
$$ Bruker specific parameters
$$ --------------------------
##$DU= <F:/spectra>
##$EXPNO= 1
##$NAME= <H-F>
##$PROCNO= 1
##$TYPE= <nmr>
##$USER= <she>
##$AMP= (0..31)
100 100 100 100 100 100 100 100 100 100 100 100 100 100 100 100 100 100 
100 100 100 100 100 100 100 100 100 100 100 100 100 100 
##$AQSEQ= 0
##$AQ_mod= 1
##$AUNM= <au_zg>
##$AUTOPOS= <>
##$BF1= 200.13
##$BF2= 200.13
##$BF3= 200.13
##$BF4= 200.13
##$BF5= 200.13
##$BF6= 200.13
##$BF7= 200.13
##$BF8= 200.13
##$BYTORDA= 1
##$CFDGTYP= 0
##$CFRGTYP= 5
##$CHEMSTR= <none>
##$CNST= (0..31)
1 1 145 1 1 1 1 1 1 1 1 1 1 1 1 1 1 1 1 1 1 1 1 1 1 1 1 1 1 1 1 1 
##$CPDPRG= <>
##$CPDPRG1= <>
##$CPDPRG2= <>
##$CPDPRG3= <>
##$CPDPRG4= <mlev>
##$CPDPRG5= <mlev>
##$CPDPRG6= <mlev>
##$CPDPRG7= <mlev>
##$CPDPRG8= <mlev>
##$CPDPRGB= <>
##$CPDPRGT= <>
##$D= (0..31)
0 1.2 0 0 0 0 0 0 0 0.06 0 0.03 0 0 0 0 0.0002 0 0 0 0 0 0 0 0 0 0 0 0 
0 0 0 
##$DATE= 1614587090
##$DBL= (0..7)
120 120 120 120 120 120 120 120 
##$DBP= (0..7)
150 150 150 150 150 150 150 150 
##$DBP07= 0
##$DBPNAM0= <>
##$DBPNAM1= <>
##$DBPNAM2= <>
##$DBPNAM3= <>
##$DBPNAM4= <>
##$DBPNAM5= <>
##$DBPNAM6= <>
##$DBPNAM7= <>
##$DBPOAL= (0..7)
0.5 0.5 0.5 0.5 0.5 0.5 0.5 0.5 
##$DBPOFFS= (0..7)
0 0 0 0 0 0 0 0 
##$DE= 6
##$DECBNUC= <off>
##$DECIM= 32
##$DECNUC= <off>
##$DECSTAT= 4
##$DIGMOD= 1
##$DIGTYP= 9
##$DL= (0..7)
0 120 120 120 120 120 120 120 
##$DP= (0..7)
150 150 150 150 150 150 150 150 
##$DP07= 0
##$DPNAME0= <>
##$DPNAME1= <>
##$DPNAME2= <>
##$DPNAME3= <>
##$DPNAME4= <>
##$DPNAME5= <>
##$DPNAME6= <>
##$DPNAME7= <>
##$DPOAL= (0..7)
0.5 0.5 0.5 0.5 0.5 0.5 0.5 0.5 
##$DPOFFS= (0..7)
0 0 0 0 0 0 0 0 
##$DQDMODE= 0
##$DR= 18
##$DS= 0
##$DSLIST= <SSSSSSSSSSSSSSS>
$$ [...]
##$SUBNAM2= <"">
##$SUBNAM3= <"">
##$SUBNAM4= <"">
##$SUBNAM5= <"">
##$SUBNAM6= <"">
##$SUBNAM7= <"">
##$SUBNAM8= <"">
##$SUBNAM9= <"">
##$SW= 16.9725356469052
##$SWIBOX= (0..15)
0 0 2 0 0 0 0 0 0 0 0 0 0 0 0 0 
##$SW_h= 3396.73913043478
##$TD= 16384
##$TD0= 1
##$TE= 0
##$TE2= 300
##$TE3= 300
##$TEG= 300
##$TL= (0..7)
0 120 120 120 120 120 120 120 
##$TP= (0..7)
150 150 150 150 150 150 150 150 
##$TP07= 0
##$TPNAME0= <>
##$TPNAME1= <>
##$TPNAME2= <>
##$TPNAME3= <>
##$TPNAME4= <>
##$TPNAME5= <>
##$TPNAME6= <>
##$TPNAME7= <>
##$TPOAL= (0..7)
0.5 0.5 0.5 0.5 0.5 0.5 0.5 0.5 
##$TPOFFS= (0..7)
0 0 0 0 0 0 0 0 
##$TUNHIN= 0
##$TUNHOUT= 0
##$TUNXOUT= 0
##$USERA1= <user>
##$USERA2= <user>
##$USERA3= <user>
##$USERA4= <user>
##$USERA5= <user>
##$V9= 5
##$VALIST= <valist>
##$VCLIST= <CCCCCCCCCCCCCCC>
##$VD= 0
##$VDLIST= <DDDDDDDDDDDDDDD>
##$VPLIST= <PPPPPPPPPPPPPPP>
##$VTLIST= <TTTTTTTTTTTTTTT>
##$WBST= 1024
##$WBSW= 4
##$XGAIN= (0..3)
0 0 0 0 
##$XL= 0
##$YL= 0
##$YMAX_a= 361643
##$YMIN_a= -302263
##$ZGOPTNS= <>
##$ZL1= 120
##$ZL2= 120
##$ZL3= 120
##$ZL4= 120
##$ABSF1= 10
##$ABSF2= 0
##$ABSG= 5
##$ABSL= 3
##$ALPHA= 0
##$AQORDER= 0
##$ASSFAC= 0
##$ASSFACI= 0
##$ASSFACX= 0
##$ASSWID= 0
##$AUNMP= <proc_1d>
##$AZFE= 0.1
##$AZFW= 0.1
##$BCFW= 1
##$BC_mod= 2
##$BYTORDP= 1
##$COROFFS= 0
##$CY= 11.3945322036743
##$DATMOD= 1
##$DC= 2
##$DFILT= <>
##$DTYPP= 0
##$F1P= 15.9154993809931
##$F2P= -4.1035820241983
##$FCOR= 0.5
##$FTSIZE= 0
##$FT_mod= 4
##$GAMMA= 1
##$GB= 0.15
##$INTBC= 1
##$INTSCL= 1
##$ISEN= 128
##$LB= 0.24
##$LEV0= 0
##$LPBIN= 0
##$MAXI= 10000
##$MC2= 0
##$MEAN= 0
##$ME_mod= 0
##$MI= 1.114404
##$NCOEF= 0
##$NC_proc= 0
##$NLEV= 6
##$NOISF1= 3.799351
##$NOISF2= 2.8
##$NSP= 1
##$NTH_PI= 0
##$NZP= 0
##$OFFSET= 15.70392
##$PC= 1
##$PHC0= -10760.91
##$PHC1= 9.80094
##$PH_mod= 1
##$PKNL= yes
##$PPARMOD= 0
##$PSCAL= 0
##$PSIGN= 0
##$REVERSE= no
##$SF= 200.130013532006
##$SI= 16384
##$SIGF1= 3
##$SIGF2= 2
##$SINO= 400
##$SIOLD= 16384
##$SREGLST= <1H.CDCl3>
##$SSB= 0
##$STSI= 0
##$STSR= 0
##$SW_p= 3612.71676300578
##$SYMM= 0
##$S_DEV= 0
##$TDeff= 0
##$TDoff= 0
##$TI= <>
##$TILT= no
##$TM1= 0
##$TM2= 0
##$TOPLEV= 0
##$USERP1= <user>
##$USERP2= <user>
##$USERP3= <user>
##$USERP4= <user>
##$USERP5= <user>
##$WDW= 1
##$XDIM= 8192
##$YMAX_p= 0
##$YMIN_p= 0
$$ End of Bruker specific parameters
$$ ---------------------------------
##NTUPLES= NMR FID
##VAR_NAME=  TIME,          FID/REAL,        FID/IMAG
##SYMBOL=    X,             R,               I
##VAR_TYPE=  INDEPENDENT,   DEPENDENT,       DEPENDENT
##VAR_FORM=  AFFN,          ASDF,            ASDF
##VAR_DIM=   8192,          8192,            8192
##UNITS=     SECONDS,       ARBITRARY UNITS, ARBITRARY UNITS
##FACTOR=    0.0002944,     1,               1
##FIRST=     0,             0,               0
##LAST=      2.4114304,     0,               0
##MIN=       0,             -302263,         0
##MAX=       2.4114304,     361643,          0
$$ Real data points
##PAGE= N=1
##DATA TABLE= (X++(R..R)), XYDATA
0@%%%%%%%%%%qJ6j6J6j6J7k5L2m0N0n8P2q8J04j20J40j64J92k23K55k90L30l75
$$ 0 0 0 0 0 0 0 0 0 0 0 -8 8 -8 8 -8 9 -16 16 -24 26 -32 40 -48 56 -64 76 -88 104 -119 136 -154 176 -199
33a99M25m81N42o08O82p62Q48r44J050j166J290j425J576j738J915k112K326k563
$$ -199 226 -255 287 -321 361 -401 447 -497 553 -613 677 -748 828 -910 1005 -1107 1219 -1344
51a344K825l112L432l792M197m655N182n796O515p375Q431r755J1469j3795J7146
$$ -1344 1481 -1631 1801 -1991 2206 -2449 2733 -3063 3452 -3923 4508 -5247 6222 -7573 9573
66I573k2409L1917n4454K04942J92074m01546j49891J84524K70662j06129l03052
$$ 9573 -12836 19081 -35373 169569 361643 -39903 -189794 -5270 265392 159263 -143789
77a43789j03714L45128J80649k51378k45338J32264K84048R814k57367j84870
$$ -143789 -247503 97625 278274 26896 -218442 -86178 197870 207684 -49683 -234553
87b34553K12650K46088j52912k78024O048K60606Q9622j58816k12723J14772K69428
$$ -234553 -21903 224185 71273 -206751 -200703 59903 149525 -9291 -222014 -107242 162186
98A62186j0767k40524q5235J94897J33781q8664k24282j0333K14268P5832j74778
$$ 162186 151419 -89105 -174340 20557 154338 65674 -158608 -168941 45327 121159 -53619
109e3619j48588J23904J58243J0426j68758p5744J49117J29803q8186j72932K5865
$$ -53619 -202207 -78303 79940 90366 -78392 -154136 -5019 124784 36598 -136334 -110469
120a10469J23206O1283j12447j13828O7015J44768J8900j28730j9808R1939J07921
$$ -110469 12737 74020 -38427 -152255 -85240 59528 78428 -50302 -70110 21829 129750
131A29750k7382j10251j7564R5998O4060j00189q3941M649Q7997K5518q5094o9039
$$ 129750 102368 -7883 -25447 70551 134611 34422 -49519 -44870 43127 68645 -16449 -85488
143h5488N0043J13936j4851p2399l6310P6017P9986l4474r7284k4832J03384L0555
$$ -85488 -35445 78491 63640 -8759 -45069 30948 110934 76460 -20824 -45656 57728 88283
155H8283o9192r0746K4359R7195K0518q7485p1664Q8102Q5147j9029j03889k1389
$$ 88283 19091 -71655 -47296 49899 70417 -17068 -88732 -630 84517 65488 -38401 -59790
167e9790R0891O0169o3693j17135L1335R4102J8424j02827o4526O4390Q9931j1614
$$ -59790 31101 91270 27577 -89558 -58223 35879 54303 -48524 -113050 -48660 41271 29657
179B9657j18442q305R5813O8070o8199q5407L1159R7413L3073j04600n1044O4909
$$ 29657 -88785 -97090 -1277 66793 -1406 -86813 -55654 41759 74832 -29768 -80812 -15903
191a5903R2032l4200r9242j0378P9397O3257p6670p8754K5774R9464P744q7537
$$ -15903 76129 41929 -57313 -67691 11706 74963 -1707 -80461 -54687 44777 52521 -35016
203c5016l8082N7525Q8311l4494p8909j0360Q6967M1742o5402o0586J8697Q3849
$$ -35016 -73098 -15573 72738 38244 -40665 -51025 35942 77684 12282 -48304 -29607 54242
215E4242k376o7528m2648N7769O2718k9178n6628j0931P1960K8749l9291n8002
$$ 54242 51866 -15662 -58310 -541 62177 32999 -23629 -34560 37400 66149 26858 -31144
227c1144J8945N8595k706m9367m3970M0309L9227p947n4886j0768N1500L0123
$$ -31144 -12199 46396 43690 -5677 -49647 -9338 29889 21942 -32944 -43712 7788 37911
239C7911j8228n0924J4085M2714K0756m3613l9940K4050L6101N323n5390j6503
$$ 37911 19683 -31241 -17156 25558 46314 2701 -37239 -13189 22912 28235 -27155 -43658
251d3658L1692M4834j6930m7953L330M1442L4514m2325l8042Q250N0268M362n4659
$$ -43658 -11966 32868 15938 -32015 -28685 12757 47271 4946 -33096 -24846 25422 29784 -24875
264b4875k5200K7630N1592j9778m4025q581N6382L5406l9126l7431J1533N9091
$$ -24875 -50075 -22445 29147 9369 -34656 -43237 13145 48551 9425 -28006 -16473 42618
276D2618k964m9756l6113L6215M4488k8538m9566p343O2208K0500l3767l9499
$$ 42618 39654 -10102 -46215 -10000 34488 5950 -43616 -50959 11249 31749 -2018 -41517
288d1517K8566O0124o754m8442k4991N0619K7071l0412n3183N330N4502N000m0905
$$ -41517 -12951 47173 40419 -8023 -33014 17605 44676 14264 -38919 -33589 20913 25913 -14992
301a4992l4535M4718M1378j2268m5605k366N1625J4653l3902m4604K7102L6151
$$ -14992 -49527 -4809 36569 24301 -21304 -23670 27955 42608 8706 -35898 -8796 27355
313B7355q913m5570j3636M4238K0393k0250l8388K3712L9551K410l6342j6039
$$ 27355 18442 -27128 -40764 3474 23867 3617 -34771 -11059 28492 30902 -5440 -21479
325b1479L6321J7184j7820m0561J1867L1211J825l1690j7331L3723J8122j1000
$$ -21479 14842 32026 14206 -26355 -14488 16723 18548 -13142 -30473 3250 21372 10372
337A0372l3221J1668K9253J844k8073k0897K8478J4143j1866l2159J0659L0284
$$ 10372 -22849 -11181 18072 19916 -8157 -29054 -576 13567 1701 -30458 -19799 10485
349A0485N472k1815j5618L2820J8729q874l2266P629K7481o43k7616k3473K5557
$$ 10485 15957 -5858 -21476 11344 30073 21199 -11067 -3438 24043 23400 -4216 -27689 -2132
362b132J5869j1765l3276P271L3817P291k2380k0912L0839K1960q277l3719j035
$$ -2132 13737 1972 -31304 -24033 9784 17075 -5305 -26217 4622 26582 18305 -15414 -16449
375a6449K9728O635k4398k8700K2470K3468j876l0928l032L3372J6697j5534k8957
$$ -16449 13279 19914 -4484 -33184 -10714 12754 10878 -20050 -23082 10290 26987 11453 -17504
388a7504J8825K4085J202l2673j4657K2353J3838j2941l4457Q879K2499Q957k3463
$$ -17504 1321 25406 26608 -6065 -20722 1631 15469 2528 -31929 -23050 -551 8406 -15057
401a5057j4596K1548K0152k17k7608L858K0398J3617j6698j8237J2529J4895M241
$$ -15057 -29653 -8105 12047 11830 -15778 -11920 8478 22095 5397 -12840 -311 14584 18825
414A8825k3897k635J1790J3281r940j7400N301Q493P412j6634n051L662J0869
$$ 18825 -5072 -7707 4083 17364 7424 -9976 -4675 3818 11230 -5404 -10455 -6793 4076
427D076p95j0944L138L442J0740o858j367k216M586M070o626l69o091O862j229
$$ 4076 3281 -7663 -4525 -1083 9657 2799 1432 -784 3802 7872 1246 877 -5214 1648 419
442D19L099m401j608P623M076M460j0432K426K010P162p483j3918q11L377N271
$$ 419 3518 -883 -2491 5132 9208 13668 3236 5662 7672 14834 7351 -6567 -7378 -4001 1270
457A270j6821o413K365J4896J347j2465J296J1887J9894r750q971K28J7793M725
$$ 1270 -15551 -21964 -19599 -4703 -3356 -15821 -14525 -2638 17256 7506 -1465 -1237 16556 21281
471B1281j8378j1288L126J9221j0364j6451p302J7695J3028j3234j2044K585K5301
$$ 21281 2903 -8385 -5259 13962 3598 -12853 -20155 -2460 10568 -2666 -14710 -12125 13176
484A3176N84j5395j3184J4230J6940j1792j6789p286K2687N499j2255j6408R781
$$ 13176 13760 -1635 -14819 -589 16351 4559 -12230 -19516 3171 8670 -3585 -19993 -10212
497a0212K2807j547j2536r999K0189J1158n186j8219k81J8272J633j1076j7532
$$ -10212 12595 11048 -1488 -11487 8702 19860 14674 -3545 -3826 14446 16079 5003 -12529
510a2529J0107J0136k64j5596q032J3433O382k028j6587M192R710P676o884j0360
$$ -12529 -2422 7714 7450 -8146 -16178 -2745 3637 1609 -14978 -10786 -1076 6600 -284 -10644
524a0644P945Q738P567j3055k516M430J0203k95j3263k571L050J1823r075r251
$$ -10644 -2699 6039 13606 551 -1965 2465 12668 12373 -890 -3461 -411 11412 2337 -6914
538f914l855J0228Q135r469o582j453J7572N98p948j0091O765J3662m557j1010
$$ -6914 -10769 -541 7594 -1875 -8457 -9910 7662 8260 312 -9779 -3014 10648 6091 -4919
552d919j0159J5116P790n205j5274R80J8593M144q226j4818J1997J5069P33j8285
$$ -4919 -15078 38 7828 2623 -12651 -11671 6922 11066 2840 -11978 19 15088 15821 -2464
566b464q678J7219Q277p362k3415L617J5396O237j7413j5319J5150J5233J05k2966
$$ -2464 -11142 6077 14354 6992 -16423 -12806 2590 8827 -8586 -23905 -8755 6478 6583 -16383
580a6383J23J8602J3673j2484j9769J1257J7920M537k3001o577J3920J4553q284
$$ -16383 -16260 2342 16015 3531 -16238 -4981 12939 17476 -5525 -12102 1818 16371 8087
593H087k1327L368J5404Q901j9858r890J0206J6088j526j9643O97J3174J3089
$$ 8087 -13240 -9872 5532 14433 -5425 -15315 -5109 10979 9453 -10190 -9493 3681 16770
606A6770j4960j1887P020J4341P10j9133o12P682J2675j1413j1283N395J2633
$$ 16770 1810 -10077 -3057 11284 11994 -7139 -7751 -69 12606 1193 -10090 -4695 7938
619G938L536j4262K04O210J1259q759r520L468P211J475j5132j55L745O376p731
$$ 7938 11474 -2788 -2584 3626 14885 6126 -3394 74 7285 8760 -6372 -6527 -2782 3594 -4137
634d137p575N381P499K880j2358L097O950P173r242n788N750O273j230j5563L053
$$ -4137 -11712 -6331 1168 4048 -8310 -5213 1737 8910 -332 -6120 -370 5903 4673 -10890 -7837
649g837P646O602j1643q563J0496R349M51j6641K198J1666R360j3021j3797R584
$$ -7837 -191 6411 -5232 -13795 -3299 6050 6501 -10140 -7942 3724 13084 63 -13734 -4150
663d150J2813k7k0677r14J3480J2960j0891j6609Q950J6891N297k1545n710J2538
$$ -4150 8663 8636 -12041 -12955 525 13485 2594 -14015 -5065 11826 17123 -4422 -10132 2406
677B406J5079r364k1370K977J5894R488k0016j0840J0419J9359j692k0607j254
$$ 2406 17485 8121 -13249 -10272 5622 15110 -4906 -15746 -5327 14032 12340 -8267 -9521
690i521J4717J5925j5662j5922L302J8197L527k0892q207Q837J9116q388j5781
$$ -9521 5196 21121 5459 -10463 -7161 11036 14563 -6329 -14536 -5699 13417 5029 -10752
703a0752k298J7339J1755j4728j0853K525J9455j283j5124j0157J0252J4340q909
$$ -10752 -13050 4289 16044 1316 -9537 -7012 12443 11160 -3964 -14121 -3869 10471 1562
716A562j2745m885J7503O688q195j1382M379J7294N03q912j1077J0677R967j905
$$ 1562 -11183 -16068 1435 8123 -72 -11454 -7075 10219 10722 1810 -9267 1410 11377 9472
730I472j3818o600J2554N559l606j5604K453J0385O798p748j2487P086J0871N994
$$ 9472 -4346 -10946 1608 7167 3561 -12043 -9590 795 7593 -155 -12642 -5556 5315 11309
744A1309j4905o071P149J3323j253j6295k517R707J4462j1044j3132L53J5714
$$ 11309 -3596 -9667 -2518 10805 9552 -6743 -9260 447 14909 3865 -9267 -8914 6800
757F800Q204j5848j0894N020K0151k610j7250q467J4349J6449j1178j6472l232
$$ 6800 15004 -844 -11738 -6718 13433 10823 -6427 -14894 -545 15904 4726 -11746 -14978
770a4978K2812O718j5653j6276Q353K3037k718j8589j2173K0396J6375q895k1416
$$ -14978 7834 14552 -1101 -17377 -9024 14013 11295 -7294 -19467 929 17304 8409 -13007
783a3007l55K5248P363j5153k0416J2806K1383o16k3524j2308K0593J4392r404
$$ -13007 -13362 11886 19249 4096 -16320 -3514 17869 17253 -6271 -18579 2014 16406 7002
796G002k6117K124K1955R376j7750j9664J4658K1117K342k4748o155J9008J7857
$$ 7002 -19115 -16991 4964 14340 -3410 -23074 -8416 12701 15043 -9705 -15860 3148 21005
809B1005r801k5204L475J9744J0843k1859j6829R912K0881Q80k4646o489J5423
$$ 21005 11204 -14000 -10525 9219 20062 -1797 -18626 -8714 12167 13047 -11599 -18088 -2665
822b665K0571j1256k0303J81K0422J1920j9369j5697M934K3119k44k0633j1298
$$ -2665 17906 6650 -13653 -13472 6950 18870 -499 -16196 -11262 11857 11613 -9020 -20318
835b0318J4163K0706q198j7704n297K3481J3154j2532j8215L973K4666K643j7976
$$ -20318 -6155 14551 6353 -11351 -16648 6833 19987 7455 -10760 -6787 17879 20522 2546
848B546j8186J4037J8826n003k3561r933K2641J3122j0262k4987N244K4971Q958
$$ 2546 -15640 -1603 17223 12220 -11341 -21274 1367 14489 4227 -20760 -15516 9455 18413
861A8413j9375j9541J6804K2521K03k8602q119K1632J8442j3088k9258M573K5110
$$ 18413 -962 -20503 -3699 18822 19025 -9577 -17696 3936 22378 9290 -19968 -15395 9715
874I715J2143k5752j9510J4762K7500o71l1871p580K2447K3639j8068k8252L019
$$ 9715 21858 -3894 -23404 -8642 18858 18187 -13684 -21264 1183 24822 6754 -21498 -18479
887a8479K8223J1697k8596j9725J4306L1053m927l0468p958K6145K4556j9785
$$ -18479 9744 21441 -7155 -26880 -12574 18479 13552 -16916 -24874 1271 25827 6042
899F042k5527M050L3717P755k7826j9607J7687L0070j0180k9215r734K9164J7455
$$ 6042 -19485 -15435 18282 26037 -1789 -21396 -3709 26361 16181 -13034 -22768 6396 23851
912B3851k0588k6877O227L2971K789k5062j8549K1839K6180q598k7150n833K9594
$$ 23851 3263 -23614 -17387 15584 18373 -6689 -25238 -3399 22781 14183 -12967 -18800 10794
925A0794J3247j7365k5645R163K6541K229k4042j6733K0670J9475o335k6351k237
$$ 10794 24041 6676 -18969 -9806 16735 18964 -5078 -21811 -1141 18334 11999 -14352 -16589
938a6589K3513J2131j4883k2646R683K0554M380k3201j2641J5301J6969m221k4138
$$ -16589 6924 19055 4172 -18474 -8791 11763 16143 -7058 -19699 -4398 12571 8350 -15788
951a5788r13J7427J3774j3998j7000O589J8582O883j8993r152R303J8593m119
$$ -15788 -16701 726 14500 502 -16498 -9909 8673 15556 -3437 -12589 -3286 15307 11188
964A1188j8856m397J3421J3993j2295j4861o37J7853O222j4319j1454O109J8998
$$ 11188 -7668 -12065 1356 15349 3054 -11807 -12444 5409 11631 -2688 -14142 -8033 10965
977A0965j750j3398r168J3614J4440o589j5181l852J8364O974j0013j6341N121
$$ 10965 9215 -4183 -13351 263 14703 8114 -7067 -10919 7445 14419 4406 -11935 -6814
990f814J7142K263j4786j2354J3981J3240k774j8107l857J7258R852r645j8972
$$ -6814 10328 12591 -2195 -14549 -568 12672 9898 -8209 -12066 5192 15044 5399 -13573
1003a3573N576J7015M812j8691j1388J2350J4689j769k1359j705J5440J3363j2378
$$ -13573 -7997 9018 13830 -4861 -16249 -3899 10790 9021 -12338 -14043 1397 14760 2382
1016B382j6297N849J7264O182j9691r012J0222J7657n996j9612k228J4785J2656
$$ 2382 -13915 -8066 9198 15380 -4311 -13323 -3101 14556 8560 -11052 -13280 1505 14161
1029A4161j4595j3940L924J9537K611j7100q168J0345J7850p935j5372l235J6923
$$ 14161 -434 -14374 -10450 9087 11698 -5402 -13570 -3225 14625 6690 -8682 -11917 5006
1042E006R332j3616j2146L568J8778o36j3647r083J2190J3560p093j3373l326
$$ 5006 14338 722 -11424 -7856 10922 10286 -3361 -12444 -254 13306 6213 -7160 -10486
1055a0486J6547N401r536j2934N293J4460k5j1135r022J1964R452l402j3154j514
$$ -10486 6061 11462 1926 -11008 -5715 8745 8720 -2415 -11437 527 9979 6577 -6577 -8091
1069h091J2546M783o567j2749N509J0003K273j0724o758Q437P994p62j2374r9
$$ -8091 4455 9238 2671 -10078 -4569 5434 7707 -3017 -9775 -1338 6656 5894 -6480 -6579
1083f579P913P310o797r578L149P800M530j1014m737M250R602j252j0318r34O251
$$ -6579 1334 8644 1847 -7731 -4582 3218 7748 -3266 -8003 -3753 5849 4597 -5721 -6655 -404
1098d04Q584o407p140o1R499L934r139n037K545J0491k694p794m178P351P845
$$ -404 8180 1773 -5367 -5428 4071 8005 -1134 -6171 -3626 6865 4171 -3623 -7801 -450 7395
1113G395n918o727j523J1342J723o141p079M453R613k192o815n048R653M634l564
$$ 7395 1477 -5250 -6773 4569 6292 151 -6928 -2475 7138 4946 -1869 -6917 2736 7370 3806
1128C806q398N50R465R55o145p558O155O335j353q630k095Q447L253l185q448
$$ 3806 -4592 -4042 5423 6378 233 -7325 -1170 5165 3812 -4818 -6913 1534 4787 1602 -6846
1143f846M158P171J423p086m367O664L809j286q625J190N562K452n075n534N126
$$ -6846 -2688 4483 5906 -1180 -5547 1117 4926 3640 -4985 -3795 1767 4219 -856 -6390 -1264
1158a264L879J323p334K53M654L298l205n960L456K746J229o602j135K858K776
$$ -1264 2615 3938 -3396 -3143 1511 4809 1604 -4356 -900 1846 3075 -3527 -4662 -1804 972
1173I72j239n205K812K840K577m516J0L119K130k71m529K386J220J604m466r23
$$ 972 -267 -5472 -2660 180 2757 -1759 -1749 1370 3500 3229 -1300 1086 2306 3910 -556 -1479
1189a479K025P58o47m097K581M28K215l564m04K763J130k40l799K728Q78J556
$$ -1479 546 1304 657 -3440 -859 -431 1784 -1780 -2184 579 1709 1469 -2330 398 1276 2832
1205B832l531o81K913K54J55m575K593R77J547l212j429K772J006M80m265K083
$$ 2832 -699 -1380 1533 1787 1942 -2633 -40 937 2484 -728 -2157 615 1621 2101 -2164 -81
1221h1J072J650k786j976K055Q24N20m649J090L89J889k138j870K079J095J931
$$ -81 991 2641 -145 -2121 -66 758 1278 -3371 -2281 -1892 -3 -2141 -4011 -1932 -837 1094
1237A094l124J290J287K259p48j664J060P2J699l164p7r39R77l98k195R68j009
$$ 1094 -2030 -740 547 2806 2058 394 1454 1526 3225 61 -16 -955 22 -376 -2571 -1603 -2612
1254b612K511j187R25q34J165J231m12Q11k021J756p79J203j923q79J029M25J461
$$ -2612 -101 -1288 -363 -1197 -32 1199 787 1598 -423 1333 554 1757 -166 -1045 -16 409 1870
1271A870l142J180M33K590j026k174Q04J367K142m168o74j2L066q99l922m66J311
$$ 1870 -1272 -92 341 2931 1905 -269 535 1902 4044 -124 -798 -810 2256 1357 -2565 -3031 -1720
1288a720L898l900j699k52M508J513m073j238J432N601k295k959j401M540K575
$$ -1720 2178 -1722 -3421 -3673 835 2348 -1725 -2963 -1531 4070 1775 -1184 -2585 1955 4530
1303D530l958l218Q3O153j139m061l521M055M108l359l599j598P097R59k790m278
$$ 4530 572 -2646 -2563 3590 2451 -1610 -5131 -1076 3032 -327 -3926 -5524 1573 2532 -258 -4536
1319d536K608O229j134l875l180N572K597k008n843O10N871M72l715m555M862
$$ -4536 -1928 4301 3167 -708 -3888 1684 4281 2273 -3570 -2960 2911 3383 -332 -4887 -25
1334b5M061k30n251q75M896K104j837n350J663L145R87m402l444L357J987O74
$$ -25 4036 3806 -1445 -2320 2576 4680 2843 -2507 -844 2301 3288 -1114 -4558 -1201 786 1460
1350A460n607O28L597L248j988l609J638L258K415n043j350J508K264k36n261
$$ 1460 -4147 -3519 78 3326 1338 -2271 -633 2625 5040 -3 -1353 155 2419 2183 -3078
1365c078m4J172M720l499k380J8L330K003l463m22p55M069p66j333k879K148L104
$$ -3078 -3122 -1950 2770 -729 -3109 -3091 239 2242 -1221 -1643 -2398 1671 905 -428 -3307 -1159 1945
1382A945j878j843j420L757J230q22l637J220M866j040j890l662L035K839L26
$$ 1945 67 -1776 -3196 561 1791 969 -2668 -1448 3418 2378 488 -3174 -139 2700 3026
1397C026m714j537M776J939j774n679J755K807K532k973m405L370K607J769n470
$$ 3026 -1688 -3225 1551 3490 1716 -3963 -2208 599 3131 158 -4247 -877 1730 3499 -1971
1412a971k68K793K912q90n040J525K746J908m456k340K142L943k85m501o46K728
$$ -1971 -2239 554 3466 2576 -2464 -939 1807 3715 -741 -3081 -939 3004 2719 -1782 -2428 300
1428C00M173m068k894j51L893J786m814l93O94M682j892k964j027L489K425l716
$$ 300 4473 405 -2489 -2640 1253 3039 -1775 -2168 -1474 3208 1316 -1648 -2675 814 3239 -477
1444d77j124m00L931o20j637k134J611L238j694j760j716K902P24o04j131q06
$$ -477 -1601 -2001 1930 1310 -327 -2461 -850 2388 694 -1066 -2782 120 844 240 -891 -1697
1460a697K955p77j52k024J317R97J89j256p20J194k41Q13j543K58j72J599L87
$$ -1697 1258 481 329 -1695 -378 619 808 -448 -1168 26 -215 598 -945 -687 -859 740 1127
1477A127j572N86o32K040j107l67r25P47J367q60p04j541K210N34j5k076J89K636
$$ 1127 -445 141 -491 1549 442 75 -850 -103 1264 404 -300 -1841 369 903 888 -1188 -999 1637
1495A637O6o19l028K259J754K18k835j717K925J065j73m307J216K230J449k147
$$ 1637 1703 1084 -1944 315 2069 2287 -548 -2265 660 1725 1552 -2755 -1539 691 2140 -7
1511gl141K827K371N11m314m60K738K629j719m124J166K609K175m068j794J787
$$ -7 -3148 -321 2050 2561 -1753 -2213 525 3154 1435 -2689 -1523 1086 3261 -807 -2601 -814
1527h14L412j2m730k8K199L404l059l271N56L170J741m224j488J266M445j132
$$ -814 2598 2586 -2144 -2172 27 3431 372 -2899 -2343 827 2568 -1656 -3144 -1878 2567 1435
1543A435l095j351L310L131k920k392q70M385O86k624k859J406M112o90k127k542
$$ 1435 -1660 -3011 299 3430 510 -1882 -2752 1633 2319 -305 -3164 -1758 2354 1664 -463 -3005
1559c005L652J953l54l588p54L667Q82j407m026J415K434P74k647k673K569K375
$$ -3005 647 2600 2246 -1342 -2096 1571 2453 1046 -2980 -1565 869 1643 -1004 -3677 -1108 1267
1575A267J112l894j55K657K596q77m243Q71K248K411l544l067R26L586N01m420
$$ 1267 2379 -1515 -1670 987 3583 2706 -1537 -666 1582 3993 449 -2618 -1692 1894 2395 -2025
1591b025j525J916M875j535l484q61L557L427l553l074m57N390M41m056l541K716
$$ -2025 -3550 -1634 3241 1706 -1778 -2639 918 4345 792 -2282 -2739 2651 3092 -964 -4505 -1789
1607a789N002j656m228j823N359L051k520m627P97O030O57m043m707L736M587
$$ -1789 3213 1557 -2671 -4494 865 3916 1396 -3231 -2434 3596 4253 210 -4497 -761 3826
1622C826j187n565k385N897K824k523o127J547N983J897n071m415M684M733j66
$$ 3826 2639 -2926 -5311 586 3410 887 -5240 -3693 2290 4187 -884 -5299 -615 4118 3952
1637C952o673r96N413L612l325o137J715M999K739o366l572L288N406o46o699
$$ 3952 -2721 -3717 1696 5308 1983 -4154 -2439 2560 5299 -1067 -4639 -1351 4055 3409 -3290
1652c290r11M509M909m086n129O91N802K420o040l317K580N999j082n968j717
$$ -3290 -4201 308 5217 1131 -3998 -3307 2495 4915 -1125 -4442 -1862 4137 3055 -2913 -4630
1667d630M682M997m063m563k7O076K094m574m252K544O380j274m991l390N286
$$ -4630 52 5049 986 -3577 -3604 2472 4566 -8 -4260 -1716 4664 3390 -1601 -4991 295
1682B95M035k697n806p45O481J786l577n471K956N863O62n117l776N443M642j440
$$ 295 4330 1633 -4173 -4918 1563 3349 -228 -5699 -2743 3120 3782 -1335 -5111 332 4974 3534
1698C534o943k03N791K875l691o562K839N199J846o680l101M163N637j289p272
$$ 3534 -3409 -3612 2179 5054 1363 -5199 -2360 2839 4685 -1995 -5096 -933 4704 3415 -3857
1713c857k37N451M660m991n609J970O311J534p176k950L106O914k409o634j034
$$ -3857 -4094 1357 6017 1026 -4583 -2613 3698 5232 -1944 -4894 -1788 5126 2717 -3917 -4951
1728d951O020M782n080n087J098P864Q37o302m204M117O715k918o301k281O714
$$ -4951 1069 5851 771 -4316 -3218 4646 5483 -819 -5023 -906 5809 2891 -3410 -5691 1023
1743A023L824m984n706J552P573L80n308m461N371N784j979o287j403O932K805
$$ 1023 4847 -137 -5843 -4291 3282 3662 -1646 -6107 -736 5048 3069 -3218 -4621 2311 5116
1758E116l812o737K501O447L85n488m356N313M648j003o741q24O132L325l657
$$ 5116 1304 -5433 -2932 3515 3900 -1588 -5944 -631 4017 3014 -3727 -4551 1581 4906 1249
1773A249o211K661N365J751o494l154L892M808o42o554l05M453M257m038n129
$$ 1249 -4962 -2301 3064 4815 -1679 -4833 -941 3867 3225 -3329 -3634 819 5076 1038 -4091
1788d091J835N300K015n885k774K740N605j437n570j216M259L914l707m488L65
$$ -4091 -2256 3044 5059 -826 -3600 -860 4745 3308 -2262 -3478 781 4695 988 -3500 -3135
1803c135N779J354m656l309K466N426j239m532k183M791L452k530m774j47N789
$$ -3135 2644 3998 -658 -3967 -1501 3925 2686 -1846 -4029 762 4214 1684 -3090 -3237 2552
1818B552J131l418m590K724N057o76m713k746M933L178j874n274J99M907K182
$$ 2552 3683 265 -4325 -1601 3456 2780 -1933 -4679 254 3432 1558 -3716 -3517 1390 3572
1833C572l175m791K497M509P38n433k242M077L472j203n868Q87L880L256m284
$$ 3572 397 -4394 -1897 2612 3350 -2083 -4325 -248 3224 2021 -3847 -2960 920 4176 -108
1848a08m198K168M873O53n161k142L509N744l368n345K16M902K598m826k622J221
$$ -108 -4306 -2138 2735 3388 -1773 -3915 -406 5338 1970 -3375 -3159 1743 4341 -485 -3107 -1886
1864a886N133k12m782j208K785M677k552m287o43N145J687m049k941J489N098
$$ -1886 3247 3035 -1747 -2955 -170 4507 1955 -2332 -2975 2170 3857 -192 -3133 -1644 3454
1879C454o40l708k504L597L629k264l849n59M342J189k564l532J586M452m36k983
$$ 3454 2814 -894 -3398 199 3828 1564 -2285 -2844 1498 2687 123 -3409 -1823 2629 2193 -790
1895g90k389L685K297j273l701j01L460J537k195l879K158K762M02l509j418K811
$$ -790 -3179 506 2803 1530 -2171 -2272 1188 2725 530 -3349 -1191 1571 1973 -1536 -2954 -143
1911a43K087n49l800O58K221J974k085k896J519K082J195l404q87J410K743r76
$$ -143 1944 1395 -2405 -1747 474 2448 363 -2533 -1014 1068 2263 -1141 -2028 -618 2125 1149
1927A149k721l00K110K302k496j460Q1K840P24k818j189J293K853j265k129j000
$$ 1149 -1572 -1872 238 2540 44 -1416 -1335 1505 2229 -589 -1778 -485 2368 1103 -1026 -2026
1943b026K488J689k095j496J47L020q2j489j990J738K319j204j989q59L072N13
$$ -2026 462 2151 56 -1440 -1293 1727 1645 156 -1834 -96 2223 1019 -970 -1829 1243 1756
1959A756r98k101J09K775l26j540j808J784J885n43k415m30K274Q14o41k552J464
$$ 1756 758 -1343 -1234 1541 1215 -325 -2133 -349 1536 993 -1422 -1852 422 1236 595 -1957 -493
1976d93J253O72j621j190J785Q08k55k158K2J304J342j561j449J053Q14R93k024
$$ -493 760 1432 -189 -1379 406 1214 959 -1199 -1177 127 1469 -92 -1541 -488 326 1319 -705
1993g05n81J156J399q65j579Q07K84J391j719m02j62J717l36j468J43O29J354
$$ -705 -1286 -130 1269 404 -1175 -368 -84 1307 -412 -814 -976 741 405 -1063 -920 -291 1063
2010A063j101l49l8J236L07j242L62m19J472l38r10q37R15O05j127k56j86J317
$$ 1063 -38 -387 -425 811 1118 -124 238 -181 1291 953 43 -794 121 726 -401 -657 -843 474
2028D74o59K5l71M91J057k91j68r37J223n4k69r52M63L79p76K93o78R73l18K17
$$ 474 -185 -160 -531 -40 1017 726 558 -379 844 790 521 -431 32 411 -365 -72 -750 223 -95 122
2048A22m97oQ45o45L27o31P77k41k66J9n65Q24p55O63q33N83J34p6J82k22M30
$$ 122 -375 -381 464 -181 146 -485 292 51 -215 -196 -761 63 -692 -29 -862 -279 -145 -221 -39 -261 169
2069A69j39P28j013M87L84p1k49o63P22m31R7o57J76L27N5K82q64R02m22J045
$$ 169 30 758 -255 232 616 545 296 -367 355 -76 21 -636 -460 -133 -78 204 -660 242 -180 865
2089H65q78k50N20J64K14r37M01j05N08l77l38J56L35K76q95M19j32Q05p12k71
$$ 865 -13 -263 257 421 635 -302 99 -6 502 125 -213 -57 278 554 -341 78 -54 751 39 -232
2109b32M1M42N34j209O5n9Q16O0r40m24Q44Q79j160j33l03J184J40q68l22L61
$$ -232 -191 251 785 -424 -359 -418 398 458 -482 -906 -62 817 -343 -476 -779 405 545 -323 -645 -284
2129b84J267r01m76l74J210N30j130p02J59J442l51p65o65P95P74o94q04l68J710
$$ -284 983 82 -394 -768 442 972 -158 -860 -701 741 390 -375 -1040 -245 529 -165 -969 -1337 373
2148C73L27o33p79N03J412l49r24r43J417M73o13j252L00J387p9m36j390J075
$$ 373 700 67 -712 -209 1203 854 -70 -1013 404 877 264 -988 -688 699 620 184 -1206 -131
2166a31P09M61j192l32R38L70m4j782M85P95Q35j543m88O04P05O68j764J53N40
$$ -131 578 1039 -153 -485 453 823 779 -1003 -518 277 1112 -431 -919 -315 390 1058 -706 -553 -13
2185a3J085o03j033J47R19Q09j425l36K76M80K53j359J36L4J596q32o33l27R57
$$ -13 1072 469 -564 -417 502 1311 -114 -450 -174 306 559 -800 -664 -630 966 134 -499 -826 131
2204A31P28q50n81j64J505k54p13r13R37R12m58p02q66J606J65l20q56J16J160
$$ 131 859 9 -572 -736 769 515 -198 -1111 -174 738 280 -422 -1288 318 483 163 -693 -577 583
2223E83m1j67j465R99N88Q9j003m55J195K69N1j595N05R44N45r70r01P47O75L45
$$ 583 542 375 -1090 -91 497 586 -417 -872 323 592 643 -952 -447 497 1042 72 -829 -82 593 938
2243I38j584M2O38R28o18j137J73P79J055j211q66M45J214P6j231O6J31J471j248
$$ 938 -646 -604 34 962 344 -793 -620 159 1214 3 -863 -418 796 872 -359 -293 -162 1309 61
2262F1m43l44J041N45j022m91j31J552j86p54n87R08O23l07j025n32J467J01k16
$$ 61 -382 -726 315 860 -162 -653 -784 768 582 -172 -759 149 772 465 -560 -1092 375 476 260
2281B60j181L03J267l08n63q82J077M93k45p20j47J058J56m08r59L28P21K59o26
$$ 260 -921 -618 649 341 -222 -1104 -27 466 221 -499 -646 412 568 160 -799 -471 250 509 -117
2300a17o69O39K25N51j224J00N18O43q2j143K99M33P01q27k24j01Q20J45q64l4
$$ -117 -786 -147 78 629 -595 -495 23 666 584 -559 -260 173 874 47 -177 -278 542 687 -177 -211
2320b11n1J008l78o75l17R58M72q29m4n28J209j69m83n50M54P34k32k78j008Q90
$$ -211 -262 746 368 -307 -624 334 806 -23 -67 -595 614 445 -38 -588 -134 600 368 90 -918 -28
2340b8M70r3r58j0Q92L32l63j046N20O31L15p54q60Q89O18K50j409K47K63J067
$$ -28 442 349 -609 -619 273 605 242 -804 -284 347 662 -92 -952 -63 555 805 -604 -357 -94 973
2360I73j091p39N35N58N87j418l92L28J279j06j089j14O30J084q82o02r2R70L71
$$ 973 -118 -857 -322 236 823 -595 -987 -659 620 514 -575 -689 -59 1025 143 -459 -551 419 790
2379G90j010l03J60J153m26o66o26Q19R72p69m36j96J107K20n30r83J23J378k12
$$ 790 -220 -523 -363 790 364 -302 -928 -109 863 94 -342 -538 569 789 259 -724 -601 777 565
2398E65o74p23O92M93K25j086l47J234K22j95j086P17N21J4m50p55O08N69J46
$$ 565 -109 -832 -140 353 578 -508 -855 379 601 406 -680 37 558 572 122 -633 -25 544 690
2417F90j557J17O92P00m81j118K01Q22Q57j202m23J29J259R1j279J2K94J058n44
$$ 690 -867 -750 -58 642 161 -957 -756 66 923 -279 -702 -573 686 777 -502 -490 -196 862 318
2436C18p58o68R85Q35r10p60m2J768k03o92j064R98J156o83n31q36J648M8l16
$$ 318 -440 -1108 -123 712 -198 -958 -1000 768 565 -127 -1191 -193 963 280 -251 -1087 561 609 293
2455B93j300j5J877k42q64n99J050M71l27j36j040J352N86q97p06K89P09Q31j468
$$ 293 -1007 -1022 855 613 -251 -850 200 671 344 208 -832 520 1106 209 -497 -208 501 1332 -136
2474a36j604J907K87O21k081P56J13P04q14p22P9J765l49q75n04L64J474m06j053
$$ -136 -1740 167 454 1075 -1006 -250 -137 567 -247 -969 -890 875 526 -349 -853 -489 985 579 -474
2493d74k66O84M64l91l36j319J641O74o58n81K57K025j246j141p61J515J087q74
$$ -474 -740 -56 408 17 -319 -1638 3 677 19 -562 -305 1720 474 -667 -1428 87 1174 300
2511C00j341J39J353L01j246r42J083Q95j42p95o86R76R26m54j086l32J795J89
$$ 300 -1041 -902 451 752 -494 -1436 -353 542 400 -395 -1081 -105 821 367 -719 -1051 744 933
2529I33p61j146M79J066K21j320p60J334P73j00j374l11J336P27r39j192P22J116
$$ 933 172 -974 -495 571 792 -528 -1288 46 819 719 -655 -966 370 1097 158 -1034 -312 804
2547H04N22j530p77R52J248n29j514j3R65R71j104r58M65J311O5j091p01O61J278
$$ 804 1326 -204 -981 -29 1219 690 -824 -837 128 1099 -5 -963 -498 813 878 -213 -914 -253 1025
2566A025m56j070o60J373R48j041p79k42J480L36j383o68P35J497n88r26p54J288
$$ 1025 569 -501 -1161 212 1160 119 -660 -902 578 914 -469 -1137 -402 1095 507 -419 -1173 115
2584A15Q84p44j398K20J775J59j196r57P55J149m2j457m70J377N64n71j228J76
$$ 115 999 255 -1143 -923 852 1011 -185 -1142 -387 762 720 -737 -1207 170 734 163 -1065 -889
2602h89J694pp63j068P36J062M0j554j47J111P05m02j447M15R50O89j317p94Q10
$$ -889 805 798 35 -1033 -297 765 805 -749 -896 215 920 518 -929 -514 436 1125 -192 -986 -176
2621a76R50L44j599K9M80J071o88j304K45J288P14j558p85N76J506l86j144n97
$$ -176 774 1118 -481 -452 28 1099 411 -893 -648 640 1354 -204 -989 -413 1093 707 -437 -1034
2639a034J128J186r94p50l00J205M29j024r12N60J313j58r75o15J012N74k09j076
$$ -1034 94 1280 286 -464 -764 441 870 -154 -1066 -506 807 649 -326 -941 71 645 436 -640
2657f40l56J400K62p11j045P97J017j20r72p37J319L49j47j065k23J276L29o35
$$ -640 -996 404 666 -45 -1090 -293 724 604 -368 -1105 214 563 416 -649 -872 404 733 98
2675I8j119P86O77K52j064m86Q54Q82m47j125O5R74R26j442k32K30R03L17j378
$$ 98 -1021 -235 442 694 -370 -856 -2 880 433 -692 -627 347 1273 -169 -401 -171 732 1049 -329
2694c29l38M55J242n86j040k7R14O90r97o08J96J239j72q82k91K73J266r17m94
$$ -329 -667 -212 1030 444 -596 -623 291 981 -16 -624 -428 811 639 -243 -534 -261 1005 88 -406
2713d06k50Q26N30m96r68J43J172k87n25n60O45Q46m56n61l79J072K45n92p16
$$ -406 -656 170 700 204 -764 -621 551 264 -261 -821 -176 670 214 -347 -726 346 591 -1 -717
2732g17K85R14j88o85l55P25L57Q7q43K9N05K42k84p68N65N34K33n27o71Q08K24
$$ -717 -432 482 294 -391 -746 -21 336 423 -420 -391 114 356 72 -696 -131 403 636 109 -562 246 470
2753D70j69p60J02L84N09m17o02K76O39K08q09k48L02O80k19p29J79M49M57o53
$$ 470 301 -459 -357 27 536 119 -483 -207 432 640 -169 -417 -115 565 346 -383 -204 245 702 49
2773D9l76J28M55J59n65k95K53O63l92k20j66O05l7n2m17l66R01K0m02m80L57
$$ 49 -327 -199 256 415 -150 -445 -192 471 79 -141 -307 298 261 209 -208 -574 327 347 -55 -535 -178
2794a78M04j1l29l43M88L18r5o10m9M78L11k28p43P65M1O7n10k48N83pK44p80
$$ -178 226 215 -114 -457 31 349 254 -356 -405 73 384 156 -587 178 219 286 -224 -472 111 104 348 -432
2816d32L17pM50l23k38M04K7J01o17j5L60K61j20m30L38J35J32n26k9K31L09L8
$$ -432 -115 -122 328 5 -233 171 198 299 -318 -333 27 288 168 -262 76 211 343 -183 -212 19 328 366
2838C66p12L64L1R5l16K22k88N89N9n16lJ23L28l68k2j63J85K15j99k50k7O76
$$ 366 -346 18 49 144 -172 50 -238 351 410 -106 -109 14 342 -26 -48 -211 -26 189 -10 -260 -287 389
2860C89l32nj48L5M85n63nO3N4J16K47l82J14j1j52J65n37O24r8j21j44L76k59
$$ 389 57 52 -96 -61 424 -139 -144 -81 -27 89 336 -46 68 57 -95 70 -467 157 59 -62 -206 170 -89
2883h9J31k20k04M83k89K15j48k7J65j60J49k40J93l6M17m15k46K70r2L67k36
$$ -89 42 -178 -382 101 -188 27 -121 -148 17 -143 6 -234 -41 -77 340 -75 -321 -51 -143 224 -12
2904a2q4J50J91rj63j44L20l33k75N08j33J00P1j76j56K49P6j65L2j48L20k49
$$ -12 -96 54 245 236 73 -71 249 -84 -359 149 16 116 187 11 -145 104 180 15 47 -101 219 -30
2926c0k24M41j86L77o14J95o6L49P6m86J33j65L77m23Q8L57j50K64n66M24l69
$$ -30 -254 187 1 378 -236 -41 -107 242 318 -168 -35 -200 177 -246 -158 199 49 313 -253 171 -198
2947a98L73k12k13K16J97k4k78m8lN46n55R7k67J51N67l07k1l41M43J2M7l72j58
$$ -198 175 -37 -250 -34 163 139 -139 -187 -190 356 -199 -102 -369 -218 349 42 21 -320 123 135 182 -190 -348
2970c48L84j54P4k00K20K52k34l31N1N86j88j62j26m9L64r3L2l62M78m3j32l78
$$ -348 36 -118 -44 -244 -24 228 -6 -337 -286 300 112 -50 -176 -225 139 46 78 -284 194 151 19 -359
2992c59J18O72l67R9l16K50j62L87m48J72J79J48l91l21K44K62L14n93r1J23N4
$$ -359 -241 431 64 163 -153 97 -65 322 -126 46 225 373 -18 -339 -95 167 481 -112 -203 -80 -26
3013b6K78n46M2K20K78l12j18K30K13K4j86k69K01o6J7k00R6K40J54l06m6J07
$$ -26 252 -294 -252 -32 246 -66 -184 46 259 283 97 -172 29 -37 -20 -220 -124 116 270 -36 -82 25
3035B5J76j06k46k6o2L14%j18l03N94j0j36j11l48N67Q9m43k59M13K79p9l36k03
$$ 25 201 95 -151 -177 -239 75 75 -43 -346 248 238 102 -9 -357 210 299 -144 -403 10 289 210 -126 -329
3058c29N46J07j99n15M18K49n6q5l11J93L03K6m59k59M02J32J54o41K87M1K44
$$ -329 217 324 125 -390 28 277 221 136 -175 18 321 347 -112 -371 31 163 317 -324 -37 4 248
3079B48n29p4M31%K85o83L4QQ37m00m30j46N66J33l55n4k72P14k78l29J84J79
$$ 248 -281 -355 76 76 361 -322 -288 -280 557 157 -273 -419 147 280 -75 -129 -401 313 35 -294 -110 69
3101F9J13j18k40j00L77p2QJm23N77O1m18k02M14J54j81m9l90O89k13o6j79k0
$$ 69 182 64 -176 -276 101 29 37 38 -385 192 253 -165 -367 47 201 20 -29 -419 270 57 -9 -188 -208
3124b08L46mJ88n22L37n3Q6n00J37K43k3J12m36J98K14J96m44q1l6O10p6o64M00
$$ -208 138 134 322 -200 137 84 170 -330 -193 50 27 139 -297 -99 115 311 -133 -214 -250 360 284 -380 20
3147B0q6M55n11j64J07K21L87m42n7O2M7J81k63M3J32M05l62k13l37K53M32m23
$$ 20 -66 389 -122 -286 -179 42 429 -13 -70 -8 39 220 -43 0 132 537 175 -38 -375 -122 310 -113
3169a13r5Q6K41m9j96j11J67K30j79P0k67K58o0L47m46K8L65M2m46r5J85P7J99
$$ -113 -208 -122 119 70 -126 -237 -70 160 -19 51 -216 42 -18 329 -117 -89 276 318 -128 -223 -38 39 238
3192B38k35j70L27j36Q3l52N9M05K0j25m16K73R5L6l28P3P2M55k09l38J17O9N12
$$ 238 3 -167 160 24 107 -245 -186 219 239 114 -302 -29 66 102 -226 -153 -81 374 165 -173 -56 13 525
3215E25o71L1OK90J35m56o8n1N18j34k65j09L86J33j51l40j90O44J1m36j7L0L02
$$ 525 -146 -115 -109 181 316 -140 -208 -259 259 125 -140 -249 137 270 119 -221 -411 233 244 -192 -209 -179 123
3238A23K93m02l99N16j1j46j86j35O73l30L4l62J43J94J36k60R3O8J35q0m40K57
$$ 123 416 14 -385 131 120 -26 -212 -347 326 -4 30 -332 -189 5 141 -119 -26 42 177 97 -343 -86
3260h6J50J34j53l37J25J17J72j94k35J02K98J0k34l5K63J72K7l03j63K80J19
$$ -86 64 198 45 -292 -167 -50 122 -72 -307 -205 93 103 -131 -166 97 269 296 -7 -170 110 229
3281B29l06l1m1O10k74m55N7L81J14k83o4l11M85J92k53l25K13L96j06m8l66L77
$$ 229 -77 -108 -149 461 187 -268 -211 170 284 1 -63 -374 111 303 50 -275 -62 334 228 180 -186 191
3303A91o4m6j58j74L95o8j09m07L04K62L19m27n32N10PM2p5J%J79m9l94NM22Q5
$$ 191 127 81 -77 -251 144 76 -33 -440 -136 126 445 18 -514 -4 3 45 -30 -29 -29 150 101 -293 -288 134 219
3328B19k09m56K83N01j8n86J6M05Q1l35K1J6K34J97m27l58K10M64k93j06q2J44
$$ 219 10 -446 -163 338 320 -266 -250 155 236 -99 -78 -62 172 369 -58 -416 -206 258 -35 -141 -223 -79
3350g9N77n85l41P1P45n1k81j15J21L23j01l97j89M18J32l37j59j39M17K93j4
$$ -79 498 -87 -428 -357 388 337 56 -59 62 385 284 -113 -302 116 248 -89 -248 -387 30 323 309
3371C09o75L09L23j0k41k40M34r1J56l61RL27o5J85r48N11K78n4m15l03L44L13
$$ 309 -366 -57 266 256 15 -225 209 118 274 -87 -78 249 184 369 -579 -68 210 156 -259 -562 -218 95
3393I5Nn57L75K0L09l55m8P6J64L94p11q9L51L78j80k68j25K94L27n00k90j63
$$ 95 100 -457 -82 -62 247 -108 -156 -80 84 478 -233 -322 29 407 227 -41 -166 128 455 -45 -335 -498
3415d98O48K46m56k98M51J42l71j13j41L77L73l32k51J33L77R3l40l78j31R40
$$ -498 150 396 -60 -358 93 235 -136 -249 -390 -13 360 28 -223 -90 287 380 40 -338 -469 471
3435D71k13k29j07J15J54J38m49j85K65P28n81m09L22K96k19k64k62N60J02o5
$$ 471 258 29 -78 37 191 329 -120 -305 -40 688 107 -302 20 316 97 -167 -429 131 233 168
3455A68m06J8L16Q1j80m54P92j48J63q26K38J26N70j77l55k44K59O25p86j8k05
$$ 168 -238 -220 96 177 -3 -457 335 187 350 -476 -238 -112 458 281 -74 -318 -59 566 -220 -238 -443
3476d43O56l22K1j13K25J060r32n32k93J72P49j86j17m38L07N47q78O15k28k25
$$ -443 213 -109 -88 -201 24 1084 152 -380 -673 -501 248 62 -55 -493 -186 361 -517 98 -130 -355
3496c55Q33L16j065O64K78m66p30L75L55J69j97m52M55j69L05n38J40K64j63j8
$$ -355 478 794 -271 393 671 205 -525 -150 205 374 177 -275 180 11 316 -222 -82 182 19 1
3516Ak95L77J03K96k92j38j46M03m7m35j16L18L30k47j57k45L98K23l47r4j02
$$ 1 -294 83 186 482 190 52 -94 309 262 -173 -289 29 359 112 -45 -290 108 331 -16 -110 -212
3537b12M26k97j42n9M72K63m93j51j53M71J5l74j12R0M68m6m65Q5L73O8l21l50
$$ -212 214 -83 -225 -284 188 451 -42 -193 -346 125 140 -234 -346 -256 212 166 -299 -214 159 227 -94 -444
3559d44j06P41r4j16m06L20L54j38k19k0P1M5J09m47L33K16Q0m05k55L30K65K72
$$ -444 -550 191 97 -19 -425 -105 249 111 -108 -128 -57 -12 97 -350 -17 199 279 -126 -381 -51 214 486
3581D86n17r6K96J34Pl92N1K03j54q2j44L15l3k2l87K01J61L21j43l75M83l14
$$ 486 -31 -127 169 303 310 -82 -31 172 18 -64 -208 107 74 52 -335 -134 27 348 205 -170 313 -1
3603aK69j71j51J13P7J10j48l54J33M19k83j16KJ62P6j67j05KJ15r3K3k13M22
$$ -1 268 97 -54 59 136 246 98 -256 -123 296 13 -103 -101 61 137 -30 -135 -133 -18 -111 -88 -301 121
3626A21n4l0j5k95K93%j58r1j82L25K19j48k61L47j80J44j8j64L13L8k09m2K54
$$ 121 67 37 22 -273 20 20 -138 -229 -411 -86 133 -15 -276 71 -109 35 17 -147 166 204 -5 -47 207
3649B07J17r4m31Ll1J65K77l25L9m7K60j38l1j09J0J18P1l05L26j81j12m3O37
$$ 207 324 230 -201 -198 -229 -64 213 -112 -73 -120 140 2 -29 -138 -128 -10 61 -244 82 -99 -211 -254 383
3672C83l50L70m41J058j087J78M07p41M71m55p8O3K55O9l67O77j15q47Q30J75
$$ 383 33 403 -38 1020 -67 111 518 -223 248 -207 -285 -222 33 102 -265 412 297 -550 280 455
3692D55m62j64n91R65N19j116K48K54J26l82Q0M04l50J66l89L04r89N37J80m1
$$ 455 -7 -171 -762 203 722 -394 -146 108 234 -148 -68 336 -14 152 -237 67 -922 -385 -205 -246
3712b46J85L89j29j40M52j062Q04l02k2NK52o5r5%m93R11j038K39L73j75P83n35
$$ -246 -61 328 199 59 511 -551 253 -49 -71 -66 186 121 26 26 -467 444 -594 -355 18 -157 626 91
3734I1j32m35L74k66o5L30J17K90j79J35l06k99M53k29K93m71O48o4O5k74J49
$$ 91 -41 -476 -102 -368 -433 -103 14 304 125 260 -46 -345 108 -121 172 -299 349 285 350 76 225
3755B25K62Ol08n10M97m54L73o0l76o3K38L00n33Q35l73j73k37L22J79l07L0n19
$$ 225 487 493 185 -325 172 -282 91 31 -345 -408 -170 130 -403 432 59 -114 -351 -29 150 -157 -127 -646
3777f46L65N13l04n12N34K58j86k35K8Q1m76Q35p70L15R8N9k16J73m07K2N95K19
$$ -646 -281 232 -72 -584 -50 208 22 -213 -185 -104 -580 255 -515 -200 -102 -43 -259 -86 -493 -471 124 343
3799C43k14J83J89k48o25P0J88J30n6N0k18K09J63K6l02J14K1j01NO9j73K98o5
$$ 343 129 312 501 253 -372 -302 -114 16 -40 10 -208 1 164 190 -112 2 23 -78 -73 -4 -177 121 56
3822E6l6j81P9J75j51p8o8O9K76n5K1k35K14qJ30k09n7R9L9jk37J30P4N5j98l6
$$ 56 20 -161 -82 93 -58 -136 -204 -135 141 86 107 -128 86 78 208 -1 -58 41 80 79 -158 -28 46 101 -97 -133
3848a33Q6J36l9k33J87j34J96j61k48M8M01k70J56N6j26J68j43J44l54M59J67
$$ -133 -47 89 50 -183 4 -130 66 -95 -343 -295 106 -164 -8 48 -78 90 -53 91 -263 196 363
3869C63k10k55k40L73K0J10m19K05O8J78j48j28K64k91R9k07J80K65k90K33k52
$$ 363 153 -102 -342 31 51 161 -258 -53 15 193 45 -83 181 -110 -11 -218 -38 227 -63 170 -82
3890h2n5J1L10k13q0P3j10J20n2N8pK18k94O2o8j2K81k63Qn7K12j12j79L34j91
$$ -82 -137 -126 184 -29 -109 -36 -146 -26 -78 -20 -27 191 -103 -41 -109 -121 160 -103 -95 -152 60 -52 -231 103 -88
3915h8J02l82K95R4L5J2l7j28o5K50k25K49l65K08J49j46L8j20J03Rj16j1J62
$$ -88 14 -368 -73 21 56 68 31 -97 -162 88 -137 112 -253 -45 104 -42 -4 -124 -21 -12 -128 -139 23
3938B3j47q3K19J98j96J7j2j49q2L94l5m8l20J58L7lKk9O9J63l34J24m7J80j4
$$ 23 -124 -207 12 210 14 31 19 -130 -212 182 147 99 -221 -63 -26 -29 -27 -56 13 176 -158 -34 -81 99 85
3963H5j33M0J29j75K13j47j4j5r3l9K17r0R5j27%j34O4K00o0m5r9J98L3l23j15
$$ 85 -48 -8 121 -54 159 12 -2 -17 -110 -149 68 -22 73 -54 -54 -188 -124 76 16 -29 -128 70 103 -220 -335
3988c35K81P3J14k67O6k36K43R6n1j26J18J37j51o0N9l7J61n5l41L32j74K64q9
$$ -335 -54 19 133 -134 -68 -304 -61 35 -16 -142 -24 113 -38 -98 -39 -76 85 30 -311 21 -153 111 22
4011B2P4k97M2M5k9J54K28k35o0k07J96N4L5p3j71K60O0K3j41k77K01J27P9j28
$$ 22 96 -201 -159 -114 -143 11 239 4 -56 -263 -67 -13 22 -51 -222 38 98 121 -20 -297 -96 31 110 -18
4035a8j5K0J2M8K5j98L95j71k48K82r3M3j15K6k4j01L25l53J05j69K09j19k3J27
$$ -18 -33 -13 -1 47 72 -126 269 98 -150 132 39 82 -33 -7 -31 -132 193 -160 -55 -224 -15 -134 -157 -30
4059c0K01om5l64K10k54K82k47K79k03L92m18l3J39l7o2R3k22J51L81o29O69n70
$$ -30 171 165 120 -244 -34 -288 -6 -253 26 -177 215 -203 -236 -97 -134 -196 -103 -325 -174 207 -422 247 -323
4082c23M92k48j01L96l79K34J02J62o12J61O82n16o31N16n32M51K83l77m59P70
$$ -323 169 -79 -180 216 -163 71 173 335 -277 -116 566 50 -581 -65 -597 -146 137 -240 -699 71
4102G1Q4K28o52O54k29P38o71j351J214O45j046n23P13n4R7j22n71N1K91O72l8
$$ 71 155 383 -269 385 156 894 223 -1128 86 731 -315 -838 -125 -179 -82 -204 -775 -724 -433 239 201
4123B01j52M9j11K60j33J22J70k04m94K69j48M54j81j87J14k13J99Q1M6j28n6
$$ 201 49 98 -13 247 114 236 406 202 -292 -23 -171 283 102 -85 29 -184 15 96 142 14 -42
4144d2j36K63q3J0lJ34j77J00r8J81j17j38P3l0JP3oL5k81M54j24m6k7j37L6J9
$$ -42 -178 85 2 12 9 143 -34 66 -32 149 32 -106 -33 -63 -62 11 5 40 -241 213 89 43 16 -121 -85 -66
4170f6J30p0J73J45j11j65j53K93l14K21q1l2o6L6J20l72O15k87r0j81L15K9j04
$$ -66 64 -6 167 312 201 36 -117 176 -138 83 2 -30 -96 -60 60 -312 303 16 -74 -255 60 89 -15
4193a5R5j87L00r7Q4j15j39K88nn0l16J62L4K45l42n3QL68j26j40k3r0J20J86
$$ -15 80 -107 193 96 180 65 -74 214 209 159 -157 5 39 284 -58 -111 -103 265 139 -1 -24 -114 6 192
4217A92l06K80o0J53k63J04k19M96l91k60L10R1l2k39m3J75N6K88m36J02n2q4
$$ 192 -114 166 106 259 -4 100 -119 377 -14 -274 36 127 95 -144 -187 -12 44 332 -104 -2 -54 -138
4239a38o8J55L9O5R2j74r1k32L81j05J27l32J09K48K09l69m0J87N3k08j33K73
$$ -138 -206 -51 -12 53 145 -29 -120 -352 29 -76 51 -281 -172 76 285 -84 -124 63 116 -92 -225 48
4261D8J74m1l1m43N00J43k34r7j70J84Q7j98j18P6K66j21j76r7M46K99m91%J48
$$ 48 222 181 150 -293 207 350 116 19 -151 33 120 -78 -196 -120 146 25 -151 -248 198 497 6 6 154
4284A54j09J62j93k83K54Q4ll00J58J55j9m0l9M7l9J50j30K5J86k95L16k37n1
$$ 154 45 207 14 -269 -15 69 66 -234 -76 79 60 20 -19 28 -11 139 9 34 220 -75 241 4 -47
4307d7J08P5j46j57L12l8L9k04K14j81J55J89r3k86k36L41j42J36o4o8J31j31
$$ -47 61 136 -10 -167 145 107 146 -58 156 -25 130 319 226 -60 -296 45 -97 39 -25 -93 38 -93
4329i3R8r2k18K88pj35L02L0p4k28r1L17jR1m70J25Q0J83j02k46J38J90k37p0
$$ -93 5 -87 -305 -17 -24 -159 143 173 99 -129 -220 97 96 187 -283 -158 -78 105 3 -243 -105 85 -152 -222
4353b22L80k67J57K07k77J61k5j59K59l25Q1J20p9j7q7K1n3K23q9k12L18j54j
$$ -222 158 -109 48 255 -22 139 114 -45 214 -111 -30 90 11 -6 -93 -72 -125 98 9 -203 115 -39 -40
4376d0J36l02K84j45j85J62o8J81J40k5l14L45l82J40Q3p4O3j8r3j36p3L98p5
$$ -40 96 -206 78 -67 -252 -90 -158 23 163 138 -176 169 -213 -73 10 -64 -1 -19 -112 -248 -321 77 2
4399BL69o80O32M79j071q2O89n95j77M56K2q7J29n0o3O5P2J46l08L01n2j45Q0
$$ 2 371 -309 323 802 -269 -351 338 -257 -434 22 44 -43 86 36 -27 38 110 256 -52 249 197 52 132
4422A32j1l62J78l1J36J27j93o7K65m08J45J46j8J56j13J6p2k9Q3j92qR5J31j29
$$ 132 121 -241 -63 -94 42 169 -24 -91 174 -234 -89 57 39 195 82 98 26 -3 80 -112 -120 -25 106 -23
4446b3p3J00k20K51r3J77j67J3K9J84l58P8k7L36j18j47o0o2K05P8j65P2J29m26
$$ -23 -96 4 -216 35 -58 119 -48 -35 -6 178 -180 -102 -129 207 89 -58 -118 -180 25 103 -62 10 139 -287
4470b87J29L58k74l5J20k55K39J66j44j14rK44j42J99j01o7j27L22j73p1q5P3
$$ -287 -158 200 -74 -109 11 -244 -5 161 17 -97 -106 138 -4 195 94 27 -100 222 49 -22 -107 -34
4492c4Q9p0m0K4Q2j0k29L1K82j4p0j2j19K90o1l20m2L2L62o2j94R0J91j11m1r0
$$ -34 55 -15 -55 -31 51 41 -188 -157 125 111 41 29 -90 200 139 -181 -223 -191 171 109 -85 5 196 85 44 -46
4518d6K96j14l69J34l3K65j9j71J28l4P5k13J88j5J23k69j33k4J64K44l84N5O3
$$ -46 250 136 -233 -99 -132 133 114 -57 71 37 112 -101 87 72 195 -74 -207 -231 -67 177 -207 -152 -89
4541h9P7J21J71k68l6j33L21k49j17J55K39L9k62J86J23k80k34K42J86j77m0K1
$$ -89 -12 109 280 12 -24 -157 164 -85 -202 -47 192 231 -31 155 278 -2 -236 6 192 15 -25 -4
4563dl1K33q6k52k52K60P9J94p0j62M3k1J63j7k67M67j10K12l13l7JR5k72J37
$$ -4 -35 198 112 -140 -392 -132 -53 141 71 -91 -48 -69 94 77 -190 277 167 379 66 29 30 125 -147 -10
4587a0J77J02j76%j59n5J95j71J50j63o5J34J05m5K5k81K52K41m83L17k13P4L2
$$ -10 167 269 93 93 -66 -121 74 -97 53 -110 -175 -41 64 19 44 -237 15 256 -227 90 -123 -49 -17
4610a7L9j67J58j1L09j62q5L6J17l68J54O1k00L23j01L70m07q9m8J82j50L1M2
$$ -17 22 -145 13 2 311 149 64 100 217 -151 3 64 -136 187 86 456 49 -40 -88 94 -56 -25 17
4633A7q5R6J8qk3k3K20l62K02N3l48L02q8P8o1J37j94J96k32J53n9R3r4O6k57
$$ 17 -68 28 46 38 15 -8 212 -150 52 105 -243 59 -29 49 -12 125 -69 127 -105 48 -11 82 -12 54 -203
4658b03K54j60o8J63M7R5M48n39M0J75j18j1o33M60R38p68K59k89m3l11M96k30
$$ -203 51 -109 -177 -14 33 128 576 37 77 252 134 123 -510 -50 888 120 379 90 47 -264 232 2
4680Bn21N15o1m1n24M63O59k61j24k34K38j51j61L47j9L2J88l38k98r6N38J19
$$ 2 -519 -4 -65 -106 -630 -167 492 231 107 -127 111 -40 -201 146 127 159 347 9 -289 -385 153 272
4702B72k42K03j0M14n95L26N42j9p11k54m9J44l3O18n10n0J48J94l63n4J85q5
$$ 272 30 233 223 637 42 368 910 891 180 -74 -123 21 -12 606 96 46 194 388 25 -29 156 71
4724G1j9R8k92K43O41o73j61L41j28K92j44j66l11O06j22j40j76N70q62M09o58
$$ 71 52 150 -142 101 742 69 -92 249 121 413 269 103 -208 398 276 136 -40 530 -332 77 -581
4745e81R01n12L00k74K75M20j49k83J7j44k95R45q97K57j93M76l85K39O30o77
$$ -581 320 -192 108 -166 109 529 380 97 114 -30 -325 620 -277 -20 -213 263 -122 117 747 70
4765G0j59l39OK94N31J4l34rp0m8K03k09J11m8J36m19L46k84j83M01k5J04p9m8
$$ 70 -89 -428 -422 -128 403 417 83 74 4 -44 159 -50 61 13 149 -270 76 -208 -391 10 -15 89 10 -38
4789c8j7J06r4J67M3Q9n74M76J30j44j19J08p3l05K95j27R6k60M38r0j25q4L6
$$ -38 -55 51 -43 124 167 256 -318 158 288 144 25 133 60 -245 50 -77 19 -241 197 107 -18 -102 -66
4812f6k4J00j38J26n7J7J77k95P2J93m5m5J09j04R1l5J0n55N84k6j79R4J06r0
$$ -66 -90 10 -128 -2 -59 -42 135 -160 -88 105 60 15 124 20 111 76 86 -469 115 89 -90 4 110 20
4836B0J59k04K6jJ90jk14j25L14P3j35l15j12P14k81r6K00j79j24P2o3Q7O9nJ22
$$ 20 179 -25 1 0 190 189 -25 -150 164 237 102 -213 -325 389 108 12 212 33 -91 -19 -82 5 74 69 191
4861A91j24j61K37k20m5R0K56k10J26k10nL3K5k16K29J31j96K07k16J40k02M22
$$ 191 67 -94 143 -77 -122 -32 224 14 140 -70 -75 -42 -17 -233 -4 127 -69 138 -78 62 -140 282
4883B82j14l32J24J4j31J58j45K86k16J37k68J52PK2j82K87j55n7R3k7K10k89
$$ 282 168 -164 -40 -26 -157 1 -144 142 -74 63 -205 -53 -46 -24 -206 81 -74 -131 -38 -65 145 -144
4905a44M8L29k12j84QK44P8l02Q1L06l15l7L34m14k1L81k6k05j77M53j94j58L7
$$ -144 -96 233 21 -163 -155 89 167 -135 -54 252 -63 -100 234 -180 -201 180 154 -51 -228 225 31 -127 -90
4928i0m5J83o0K0n2K34j14m04J24K52j37J26Jm4j46K29Rj30l6J7K00j37l8RK05
$$ -90 -135 48 -12 8 -44 190 76 -328 -204 48 -89 37 38 -6 -152 77 86 -44 -80 -63 137 0 -38 -29 176
4953A76J30k43r7J84k77J00j11J39J38J32j09k90j88M43q5J22k35rJ54J32k23
$$ 176 306 63 -34 150 -127 -27 -138 1 139 271 162 -128 -316 127 42 164 -71 -80 74 206 -17
4974a7J98K4l01J11K1m0R1j65P9j55L67k03Q6O6j46j37Q5j76O3J0J13J9Q0m5j77
$$ -17 181 205 -96 15 36 -4 87 -78 1 -154 213 10 96 162 16 -121 -36 -212 -149 -139 -26 -7 73 28 -149
4999a49L87j66o7pj03j5K57p4J01l15K10n8Ll6J59L9m8j15K69l53K04J9l2o6R1
$$ -149 238 72 5 -2 -105 -120 137 63 164 -151 59 1 4 -32 127 166 118 3 272 -81 123 142 110 44 135
5024A35k59L15k58O3L5l0l2r8J87Qj65K86k51K4K08k37j23J4L16j57j79J80J07
$$ 135 -124 191 -67 -4 31 1 -31 -129 58 66 -99 187 -64 -40 168 -69 -192 -178 138 -19 -198 -18 89
5047H9o7J75j93l2L4J09k80Q8K52j69k74K11J81l26K05j01P2j34K31j03l30K68
$$ 89 22 197 4 -28 6 115 -165 -77 175 6 -268 -57 124 -202 3 -98 -26 -160 71 -32 -362 -94
5069i4KK54q3j97J01N8Ro8j23o8K42Jn2%J04N2j63Q4R4LR9j29j03K4j82Q9J37
$$ -94 -92 162 79 -118 -17 41 50 -18 -141 -209 33 34 -18 -18 86 138 -25 59 153 156 255 126 23 47 -135 -46 91
5096I1k97J56M5N1pk20N55k33K5k07j6r3K18j35L54l83P3mQ0o4J05o0J3o1j78
$$ 91 -206 -50 -5 46 39 -181 374 141 166 -41 -57 -150 68 -67 287 -96 -23 -27 53 -11 94 34 47 -14 -192
5121a92K22j21J00k45R1K65k49J43J29k66K1K45j95j05K43j32M4K25k21P3J02
$$ -192 30 -91 9 -236 -145 120 -129 14 143 -123 -102 143 -52 -157 86 -46 -2 223 2 75 177
5142A77j38J28k29L7R2j7J06j10K1j96J28k32L60L6j04j66K46q6k12L06k63J82
$$ 177 39 167 -62 -25 67 50 156 46 67 -129 -1 -233 127 163 59 -107 139 53 -159 147 -116 66
5164F6K30k63k00l2L61k18Q8j26m1L76k75L9J00j82r0J22L9j09L16Ll5k27j46
$$ 66 296 33 -167 -199 162 -56 32 -94 -135 241 -34 5 105 -77 -167 -45 -6 -115 201 204 169 -58 -204
5187b04KL91k14l7K04j82l2rJ26O2j6Pl82K63J66m4J16k13l7nJ16p1N6J7L3j63
$$ -204 -202 189 -25 -62 142 -40 -72 -81 45 107 91 98 -284 -21 145 101 217 4 -33 -38 78 7 63 80 113 -50
5213e0J15nj73l7P5L5K04j42Ko3k0j1J78j47Q1k09J84J34J74l94K27L6N9m7j24
$$ -50 65 60 -113 -150 -75 -40 164 22 24 -39 -59 -70 108 -39 42 -167 17 151 325 -69 158 194 253 206 82
5238H2K27k71o5J13j00p6J44j14j26Q8N67l83k09J83o4K19k06j52R8J34q7k31
$$ 82 309 38 -27 86 -14 -90 54 -60 -186 -98 469 86 -123 60 -4 215 9 -143 -45 89 2 -229
5260b29M04l74L85l06P9K40m62L22L4p6m5P8k05J22l00K03K23q7M7j23Q3j28J20
$$ -229 175 -199 186 -120 -41 199 -263 59 93 17 -28 50 -155 -33 -333 -130 93 6 53 -70 13 -115 5
5283Ej48L32j24m3l5j66J05R7j8L0K33l04l1J6O0k34J91l7m9M69k89K09N0l05
$$ 5 -143 189 65 22 -13 -179 -74 23 5 35 268 -36 -67 -51 9 -225 -34 -71 -120 349 60 269 319 14
5307A4J42o8j65L29k98O5J4J42o3k57N6k0K38j00m9o7j43L62j89L1o6k2J24m3
$$ 14 156 88 -77 252 -46 19 33 175 112 -145 -89 -109 129 29 -20 -87 -230 132 -57 -26 -92 -114 10 -33
5331c3K5R8J9j69J88l16L89l34R4o4QJ5J26k4J19l6j55J27j99j05M02k70j21L02
$$ -33 -8 90 109 -60 128 -188 201 -133 -39 -103 -95 -80 46 22 141 105 -50 77 -122 -227 175 -95 -216 86
5355H6k58J11j25N2l1K78P2j84n7Jj9j29K15O6K83k42l01M13k38J4q8k2l9L91
$$ 86 -172 -61 -186 -134 -165 113 185 1 -56 -55 -74 -203 12 78 361 119 -182 231 -7 7 -81 -103 -142 249
5379B49m76L87L0%k11k16N08j10j41K66l92J43j90K46j03k79K95R9k05J58k07
$$ 249 -227 160 190 190 -21 -237 271 161 20 286 -106 37 -153 93 -10 -289 6 105 -100 58 -149
5400a49L10l6j92q6J64K0K01j84k8j1m7o6K78m26J36J39j91K53P1k90J38j92K59
$$ -149 161 125 -67 -153 11 31 232 48 20 9 -38 -104 174 -252 -116 23 -168 85 156 -134 4 -188 71
5423G1j98J54K33r6k6l3j25q2J27Q3j13J02q8j69N9J29j6J3L1J84j45k02m9k0
$$ 71 -127 27 260 164 138 105 -20 -102 25 108 -5 97 9 -160 -101 28 12 25 56 240 95 -107 -156 -176
5447a76K92l86K91L4L18m29j5K9N41n08M38l68R2j65J58j61J88q6k41Q5L14l98
$$ -176 116 -270 21 55 373 -56 -71 -42 499 -9 429 61 153 -12 146 -15 173 87 -154 -69 245 -153
5469a53k80n2j94N91o4k53N06M3o98J067n41N1m2N85j169L95N29j90K88n04l32
$$ -153 -433 -485 -679 -88 -152 -405 101 144 -554 513 -28 23 -19 566 -603 -208 321 131 419 -85 -417
5490d17O29m30K54l99K12L01J87o17k33J84J32j50k8K37L37K75k57l7l20K57Q8
$$ -417 212 -218 36 -363 -151 150 337 -280 -513 -329 -197 -347 -375 -138 199 474 217 180 -140 117 205
5511B05m14K10p69Q17k50J30J36N88o06n35O93k85K89k48k50P1L07Jj56R5K43
$$ 205 -209 1 -768 49 -201 -71 65 653 47 -488 205 -80 209 -39 -289 -218 89 90 -66 29 272
5532B72l18Q8M4k4r9R0k44k5J86J19k85RK37r2K11j07J03l4l36L50l42M2K90k8
$$ 272 -46 42 86 62 -37 53 -191 -216 -30 89 -196 -187 50 -42 169 62 165 131 -205 145 -197 -155 135 107
5556A07j77O5J21l15J79J08n5J69l76K61k24OM4J30R4q4j42J38J14k39O2K63l16
$$ 107 -70 -5 116 -199 -20 88 33 202 -174 87 -137 -131 -87 43 137 53 -89 49 163 -76 -14 249 -67
5579f7K29oj61N5j49J65j74j52L37J13j11n5j58J95o4j43N6j07K42p3p1J51j54
$$ -67 162 156 -5 50 -99 66 -108 -260 77 190 79 24 -134 61 -3 -146 -90 -197 45 -28 -99 52 -102
5602a02K15j42J84j54K40k78J79n5j56J28j85N5L1R3j27p6j45K84J02q7l5J61
$$ -102 113 -29 155 1 241 -37 142 87 -69 59 -126 -71 -40 53 -74 -150 -295 -11 91 4 -31 130
5624A30K9L6nj89k8J57k26P7q6J34J3j08P4j32J8J13L6n9j51J57J28j21j06L1
$$ 130 159 195 190 1 -27 130 -96 -19 -105 29 42 -66 8 -124 -106 7 43 -16 -167 -10 118 -3 -109 -78
5648g8N0r5R2L0l2Nkk64J54l4J87N7Q9l25J71O5j24j34J67J76J03k55J07j35J70
$$ -78 -28 -123 -31 -1 -33 -28 -30 -294 -140 -174 13 70 159 -166 5 70 -54 -188 -21 155 258 3 110 -25 145
5673A45q6k91rK63k25K10noK20l49L25k78K2M9q6j10J19m5O37n89K80l51N70k27
$$ 145 59 -232 -241 22 -203 7 2 -4 216 -133 192 -86 -64 -15 -101 -211 -92 -137 500 -89 191 -160 410 183
5697A83j67o61R57p98K90m47K76O25l9K05l80O15o89o7J9J67k61J99o2n9j31K15
$$ 183 16 -645 312 -486 -196 -643 -367 258 219 424 44 659 -30 -97 -78 89 -172 27 -35 -94 -225 -10
5719a0o4K92j4k39o0J78l1Ql17L23O6k53J66q7j7l1j11MJ20J68J35k55r8J50o7
$$ -10 -74 218 204 -35 -95 83 52 60 -257 66 132 -121 45 -42 -59 -90 -201 -197 -77 91 226 -29 -127 23 -44
5744d4K4j04J13K10l64J49K5m3j22J35o8P2J2J7o4lP6m32N08j74j1O7K46l29k7
$$ -44 -20 -124 -11 199 -165 -16 9 -34 -156 -21 -89 -17 -5 12 -52 -55 21 -411 97 -77 -88 -21 225 -104 -131
5769a31K93mkj39r3J23O0l7K9o4K4K35j55k37K7O3n6k95N10j79K36l64L76k25
$$ -131 162 158 156 17 -76 47 107 70 99 35 59 294 139 -98 -71 -8 -64 -359 151 -28 208 -156 220 -5
5793eM6j33J63l33M70o29L79l37k27Q10n3m7o35L37K69L37m09k13k78L13O48n97
$$ -5 41 -92 71 -262 208 -421 -42 -379 -606 204 151 104 -531 -194 75 412 3 -210 -488 -175 473 -124
5815a24J04J62p9L70j059N27R2k43N5M57k0n30L21j70K59K61m92M45o64K75k16
$$ -124 -20 142 63 433 -626 -99 -7 -250 -195 262 242 -288 33 -137 122 383 -109 336 -328 -53 -269
5836b69L80j07j31M4K21l75k1J61P9p0L31J15r29M16M9K00o07N78K43r7j38k16
$$ -269 111 4 -127 -83 138 -237 -258 -97 -18 -88 243 358 -571 -155 -106 94 -513 65 308 211 73 -143
5858a43l52M54P9l90M62l50o3K97j03L33j08j74K4O4R7k64mJ69l44K31K74m3r7
$$ -143 -495 -41 38 -352 110 -240 -303 -6 -109 224 116 -58 -34 30 127 -137 -141 28 -316 -85 189 146 49
5881D9l00L77l1j41L8O1j09L74l05j06R8J35j82J33O2k7RJ17j34j50L2o6J30k31
$$ 49 -251 126 95 -46 -8 53 -56 318 13 -93 5 140 -42 91 153 126 135 252 118 -32 0 -66 64 -167
5905a67j61L68pP1J59k54o8J49n6R3j9k32J65J68m12J62J56r6k7K33j26m05N19
$$ -167 -328 40 33 104 263 9 -59 90 34 127 108 -124 41 209 -203 -41 115 19 -8 225 99 -306 213
5928B13j34l04L39l14J4L43Nj57k6P8J81k85q8P2p1J73O2n1O7k55K22l8l2j79
$$ 213 79 -225 114 -200 -186 157 162 5 -21 57 238 -47 -135 -63 -134 39 101 50 117 -138 84 46 14 -165
5952a65J48j44o0n7K53L40j63l1k94L54l32J52K25j94Lq1kj0J8K86l5k27K7M8
$$ -165 -17 -161 -221 -278 -25 315 152 121 -173 181 -151 1 226 32 35 -46 -48 -58 -40 246 211 -16 11 59
5976E9k22R2K29j41K59j75j1J94l51L7L8J49l86J98J09K1J2j08j31L18j12k29
$$ 59 -163 -71 158 17 276 101 90 284 -67 -30 8 157 -229 -31 78 99 111 3 -128 190 78 -151
5998a51J68K1J92l15M4j30O5L52j47j84M0L4L5j74J52o8P6j71M8J50j7Jj08J30
$$ -151 17 38 230 -85 -41 -171 -106 246 99 -85 -45 -11 24 -150 2 -66 10 -161 -113 37 20 21 -87 43
6022D3J63j29j25q9r5L85k21J45l31K00J93n29L97j99J69n2J22q8J15N6j23J93
$$ 43 206 77 -48 -137 -232 153 -68 77 -254 -54 139 -390 7 -192 -23 -75 47 -41 74 130 7 200
6044B00j39l26K65P7J53k50k21K80Q1k52Q3j0J14N7J42l53J65p5j61J12K60k08
$$ 200 61 -265 0 77 230 -20 -241 39 120 -132 -49 -59 55 112 254 -99 66 -9 -170 -58 202 -6
6066fk13K12k52J30N6N5j14j82L23K39j31J59j63m6pK8j35j7K9o6J14q9K8q0K5
$$ -6 -219 -7 -259 -129 -73 -18 -132 -314 9 248 117 276 113 67 60 88 -47 -64 -35 -101 13 -76 -48 -128 -103
6091a03J75n7j74M8J65l49M91l00j12K54P8L0j08K65l19Rp3k60L71j45M5m7J62
$$ -103 72 15 -159 -111 54 -295 196 -104 -216 38 116 146 38 303 -16 -7 -80 -340 31 -114 -69 -116 46
6114D6k2L3k41J88k27L06j43K56l8l88L65R6j71j42k06Q7L20J94m58J33j32K51
$$ 46 24 57 -184 4 -223 83 -60 196 158 -230 135 231 60 -82 -288 -201 119 313 -145 -12 -144 107
6136A07k2p4Jj70J23J66k24K05n3J45j64j86L43l47K70J5J93m18Q1J74l76J45
$$ 107 85 11 12 -158 -35 131 -93 112 59 204 40 -146 197 -150 120 135 328 -90 -9 165 -211 -66
6158f6k05J77J32L1l76L03j27J06J00q2j91L09k42Q5J50l57k3M90k99j90J78n6
$$ -66 -271 -94 38 69 -307 -4 -131 -25 75 -7 -198 111 -131 -46 104 -253 -276 214 -85 -275 -97 -153
6180a53J86Q6q4J5J6l39J23N0O5P2r9o6K09p1O2j07J08m3j74P2O1n9J25n7k7P5
$$ -153 33 119 35 50 66 -273 -150 -100 -35 37 -62 -128 81 10 72 -35 73 30 -144 -72 -11 -70 55 -2 -29 46
6206D6k63J95J46r9J05j87J69j66m5j59J71j84l6J99k14L14J17j63P5j55o4mK28
$$ 46 -217 -22 124 25 130 -57 112 -54 -99 -258 -87 -271 -307 -108 -322 -8 109 -54 21 -134 -198 -202 26
6229B6l17L31J27j76Q0j75K72o8k79p9L0O5L31j14n9l6Q7k0j47J91j03J76lJ01
$$ 26 -291 40 167 -9 71 -104 168 100 -179 -258 -228 -163 168 54 -5 -41 46 26 -121 70 -33 143 140 241
6253B41l58Q6q1K05r8J61k17J29K17k10oj88n3M21j27K5j8j41k2r6J93j20K48
$$ 241 -117 -31 -112 93 -5 156 -61 68 285 75 69 -119 -172 249 122 147 129 -12 -34 -130 63 -57 191
6276A91k84L41j78o3k8m9J6J88j13m2K29k72K5j9J03J43k39K30j41N2L6j57K8
$$ 191 -93 248 70 7 -21 -70 -54 134 21 -21 208 -64 -39 -58 45 188 -51 179 38 90 126 -31 -3
6299crK2JL9q5N7K13l87J53J14j61pj0K04l84L43k16K28l79K41R6J34j22j06N3
$$ -3 -12 10 11 50 -35 22 235 -152 1 115 -46 -53 -63 141 -243 100 -116 112 -267 -26 70 204 82 -24 29
6324B9J74k19NJ73j07K07k31L3M1Qq5O8j10K0j58M3Q8J99j62o1K4K9J06n0J2o2
$$ 29 203 -16 -11 162 55 262 31 64 105 113 28 96 -14 6 -152 -109 -21 178 16 -45 -21 8 114 64 76 14
6350A4P6j85L26K21n19j9K44l54M10j46j33K21k82OM30l70j47J06J10m2O3Q4j0
$$ 14 90 -95 231 452 -67 -86 158 -196 214 68 -65 156 -126 -120 310 -60 -207 -101 9 -33 30 114 104
6373A04k30K67l28J99J46Ok88J82K4j69J76j07r1J83J66l58N7K63k67k10M27J1
$$ 104 -126 141 -187 12 158 164 -124 58 82 -87 89 -18 -109 74 240 -118 -61 202 -65 -275 152 163
6395A63Ql64K86K8Pp3l41K85J37j46j06J73j88J74j25j30K81n8j82K99J41k48
$$ 163 171 -193 93 121 128 55 -286 -1 136 -10 -116 57 -131 43 -82 -212 69 11 -171 128 269 21
6417B1q2N4J03l9j45K25l69K08J02k85J7M12k07R1Pk90M15k29r9n3J16J87q1l06
$$ 21 -61 -7 96 57 -88 137 -232 -24 78 -207 -190 222 15 106 113 -177 238 9 -90 -143 -27 160 79 -227
6441b27K17J05L7J6k25K43r2j66j8R4J51j39J07p3Rj08m2J3L09j67n0r1K85k38
$$ -227 -10 95 132 148 -77 166 74 -92 -110 -16 135 -4 103 30 39 -69 -111 -98 211 44 -6 -97 188 -50
6465e0K23j06J87l23p3P1L15k13k11K06k93K87j93L00p2k44J45j71J94nL2J05
$$ -50 173 67 254 -69 -142 -71 244 31 -180 26 -267 20 -173 127 55 -189 -44 -215 -21 -26 6 111
6487A11j0j94L1K10k68J98o7j31Q4J59p0J1Lj03j21K26J04o1J21k26J62n7r3j12
$$ 111 101 -93 -62 148 -120 78 11 -120 -36 123 53 64 67 -36 -157 69 173 112 233 7 169 112 19 -93
6511i3N2K2K08j05N1j24n3R5N2k54J67j59L8J27o6L25o3l23O4N8J36P4m29M0N
$$ -93 -41 -19 189 84 135 11 -42 53 105 -149 18 -141 -103 24 -42 283 220 -103 -39 19 155 229 -200 -160 -155
6536a55K05J81m41K91k01M05j30j52q6J55j10J18qk1J9p1p2k4K1J54R6j62j31
$$ -155 50 231 -210 81 -120 285 155 3 -83 72 -38 80 72 51 70 -1 -73 -97 -76 78 174 12 -119
6559a19J03K46j79k64M4K15p6O6l1q7l7N4p1J89m3l3J34l08K37p3J44m0o5p3J11
$$ -119 -16 230 51 -213 -169 46 -30 36 5 -82 -119 -65 -136 53 10 -23 111 -197 40 -33 111 71 6 -67 44
6584D4j22%J51j45J46m5J70m02L29j47o9j25L45j98l1P8j02jK87j03k98J51n1
$$ 44 -78 -78 73 -72 74 29 199 -203 126 -21 -90 -215 130 -68 -99 -21 -123 -124 163 60 -238 -87 -138
6607a38L16j0l30P5j9J7Q6M4j06K24j22j24p3J45k85L65N6Q1l22J49j29O8j26
$$ -138 178 168 -162 -87 -106 -89 -3 41 -65 159 37 -87 -160 -15 -300 65 121 202 -120 29 -100 -32 -158
6630a58L89k14L6m5N6M8q9j49Q5J90k50P8J07M5j78K01j66nr0J05J16j66j27L51
$$ -158 231 17 53 8 64 112 23 -126 -41 149 -101 -23 84 129 -49 152 -14 -19 -109 -4 112 -54 -181 170
6654A70m65L78k28J87J0M6k3l58J73K58k25M8L2L58j10k59P8j85J74K05l68rJ89
$$ 170 -295 83 -145 42 52 98 75 -283 -110 148 -77 -29 3 361 251 -8 70 -115 59 264 -104 -113 76
6677G6p0K28k24p7jK7K9M8j23J56Q8l40K30m5k01J5J95m2N5P7J08p0l86K39J9
$$ 76 6 234 10 -67 -68 -41 -12 36 -87 69 157 -183 47 2 -199 -184 11 -31 24 101 209 139 -247 -8 11
6702A1L1j20j04K84k50rP6J02k3k72K68k27L25k0n8J84j40J21m00Q4j25M12l08
$$ 11 42 -78 -182 102 -148 -157 -81 21 -2 -274 -6 -233 92 72 14 198 58 179 -221 -137 -262 150 -158
6725a58J29J9lJ22j62j34J47M0R6L8M0m63K60QLK29l98L26l58J89j01L95l43P6
$$ -158 -29 -10 -13 109 -53 -187 -40 0 96 134 174 -289 -29 -21 -18 211 -187 139 -219 -30 -131 264 -79 -3
6749ck69O77n96O6P0L5l04k03R89p87M03j0J5m05R2j49L9M35j15k29N16j352Q53
$$ -3 -272 405 -191 -125 -55 -20 -324 -527 462 -325 78 68 83 -322 -230 -379 -340 95 -20 -249 267 -1085 -232
6772b32j88M35J19O61j300Q55k42j78K09j54L99k02J2q6k07pK21j52j65M63m36
$$ -232 -420 15 134 795 -505 350 108 -70 139 -15 384 182 194 108 -99 -106 115 -37 -202 261 -175
6793a75J15p1J44k24K58k57M3K34P8J36l08K1K70l63L00Q4l38O0r8L4J50ok03
$$ -175 -60 -131 13 -211 47 -210 -167 67 145 281 -27 -6 264 -99 201 285 -53 7 -91 -57 93 87 -116
6816a16J39K0o0K12k16O6k82k8L17J16o9j21K0l5j85K52p6K45j99L0l8q8J59m4
$$ -116 23 43 -17 195 -21 45 -237 -265 52 168 99 -22 -2 -37 -222 30 -46 199 0 30 -8 -96 63 19
6840A9J45r3k21M3N4M9Kj39k1kK52r5k5j06K08l8p6l4p4L73k53K35k78M01k92
$$ 19 164 71 -150 -107 -53 -4 -2 -141 -162 -164 88 -7 -32 -138 70 32 -44 -78 -152 221 -32 203 -75 326 34
6865C4r4o8Q6J57P0k69J58J13k22Q0j04K26o2j10P6K04l13J4j36M3O2n2J59J46
$$ 34 -60 -128 -42 115 185 -84 74 187 -35 45 -59 167 105 -5 71 275 -38 -24 -160 -117 -55 -107 52 198
6889A98j76Kj32K42j22L5j18J75O0j37k7q9R5o1K39l31J88k09J56K32j85p7on4
$$ 198 22 24 -108 134 12 47 -71 104 164 27 0 -89 6 -55 184 -147 41 -168 -12 220 35 -42 -48 -102
6913a02L5j31n7K07J52j10J82j40J03j2l31K13m8J91k40L6P3J12j65j51N25l70
$$ -102 -67 -198 -255 -48 104 -6 176 36 139 127 -204 9 -39 152 -88 -52 21 133 -32 -183 342 -28
6935b8K31P3k61j95R5Q8q1K69k38R8r7jR1q1K8L9p1J41k58K60j01L7j67J20r2
$$ -28 203 276 15 -180 -85 3 -78 191 -47 51 -46 -47 44 -37 -9 30 -41 100 -158 102 1 38 -129 -9 -101
6960a01J84j41J39J42j17j32p4J87k12K71j21M8m3m3m3K20j43J12O9k17j84J75
$$ -101 83 -58 81 223 106 -26 -100 87 -125 146 25 73 30 -13 -56 164 21 133 202 -15 -199 -24
6982b4P8j35K85j28k6K3j71K90k31M0l7j10Q8J27k9N5j34m7J04j53K47P6j79K0
$$ -24 54 -81 204 76 50 73 -98 192 -39 1 -36 -146 -58 69 40 95 -39 -86 18 -135 112 188 9 29
7006B9O5K2r3k37K04rK38p9n3j45J00k35R9M8j17L35j51o7K0O8j4N7j03J73J5
$$ 29 94 116 23 -214 -10 -19 219 140 87 -58 42 -193 -94 -46 -163 172 21 -46 -26 42 28 85 -18 155 170
7031A70j68P9L3k31J59K3kl55M51j65n9K41j91M1j2k2k14L88j16N5k72k7K43K9
$$ 170 2 81 114 -117 42 65 63 -292 159 -6 -65 176 -15 26 14 -8 -222 166 50 105 -167 -194 49 78
7055G8k23J15K36l52J08j8r7K09R5k68J37k7M1k38M1M14j44jp2r8L17m45J23Q0
$$ 78 -145 -30 206 -146 -38 -56 -153 56 151 -117 20 -7 34 -204 -163 251 107 106 34 -64 253 -192 -69 11
7079A1m4K58l19J76k24L15N2j33K9j07j04K48k15J69K10m02P5R5J60l46j4J64
$$ 11 -33 225 -94 82 -142 173 225 92 121 14 -90 158 -57 112 322 -80 -5 90 250 -96 -110 54
7101E4r2j07J95J9p7ROJ09j32K72J95o68J25J59j2L0k56K73k30RJ25N8M4p3j17
$$ 54 -38 -145 50 69 -8 1 7 116 -16 256 451 -217 -92 67 55 85 -171 102 -128 -119 6 64 108 35 -82
7126h2K62j44P5R6j67L6J95j84k19J87n1N2K8L2j99J3J9J59L6J10m05K57J08j35
$$ -82 180 36 111 207 40 76 271 87 -132 55 4 56 84 116 -83 -70 -51 108 144 254 -151 106 214 79
7150G9m9r7L68m48J39N2j82L8J11j11L0J85j55k8O9r0m1O4lL1r8L1K23j25k2p
$$ 79 30 -67 301 -147 -8 44 -138 -100 11 -100 -70 115 -40 -68 1 -89 -130 -66 -69 -38 -136 -105 118 -7 -29 -36
7176c6R9k29N6J2Q3j23M2N2p5KJ76L1k13K55L6k7j33o3KQ2J79M9l31P0Q3j43K63
$$ -36 63 -166 -110 -98 -15 -138 -96 -44 -119 -117 59 90 -123 132 168 141 8 -55 -53 29 208 257 -74 -4 79 -64 199
7203A99l43M37k82j03K07j55N6m5k2k1R7L8j54R2q6mK5p1J81k02J46q6r9L64o9
$$ 199 -144 293 11 -92 115 -40 16 -29 -51 -72 25 63 -91 1 -85 -89 -64 -135 46 -156 -10 -96 -195 169 100
7228A00O1k57N3k7Q6P5j56P2k8J58j55j19p0M06k69J1Kl0K80j92J03qo1j8j15
$$ 100 161 -96 -43 -70 16 91 -65 7 -21 137 -18 -137 -207 199 -70 -59 -57 -87 193 1 104 96 35 17 -98
7253i8NK48k41J41j09J77L9j60M4j86K83k64M05m57L56o6q2P2j41J71k77J01j90
$$ -98 -93 155 -86 55 -54 123 162 2 46 -140 143 -121 284 -173 183 117 35 107 -34 137 -140 -39 -229
7276b29K65k24J48K18l58j3L13k16K28o6l8k63L43q8j50J21o1K08o1J19k11Q3
$$ -229 36 -188 -40 178 -180 -193 120 -96 132 66 28 -235 108 20 -130 -9 -70 138 77 196 -15 68
7298F8o0n6J87q0M0j01K06j92j40K1o0J01K38k29R4o8Lk08L08o1J2L1p4J55J64
$$ 68 8 -48 139 59 99 -2 204 12 -128 -107 -167 -66 172 -57 37 -31 -28 -236 72 11 23 54 -20 135 299
7323B99l95J03QR2N5j67N2j14K78l38q9J70P1J53k85L8j4O2k30L56j83l8L17q0
$$ 299 -96 7 15 107 162 -5 47 -67 211 -127 -216 -46 25 178 -107 -69 -83 -21 -251 105 -78 -116 201 121
7347A21k03o4K53k99K31L8L2m9j53J76k65K56k02K94k82j78M36j28J44j75K0K05
$$ 121 -82 -146 107 -192 39 77 109 60 -93 83 -182 74 -128 166 -116 -294 142 14 158 -17 3 208
7369B08k04j1k4j82J32J22q8J0Q9j64O3N5j69K18J18k89m5K37J32m1J4m5J08l88
$$ 208 4 -7 -31 -213 -81 41 -47 -37 52 -112 -49 6 -163 55 173 -116 -161 76 208 167 181 136 244 -144
7393a44J18Oj31K05j9k09J80N7M6j61J24k92L54J02j21q6j58K56Ll9j39K45k03
$$ -144 -26 -20 -151 54 35 -174 6 63 109 -52 72 -220 134 236 115 29 -129 127 130 91 -48 197 -6
7416fJ16k74J83J59k42l0K5J36k5k29lK78j13j68K48l63J06J74j55M27k35J27
$$ -6 110 -164 19 178 -64 -94 -69 67 42 -187 -190 88 -25 -193 55 -308 -202 -28 -183 244 9 136
7438A36k1l5K35o55M27j24L7J37k05J65l69K34J87j34q2K76o69M52k83N29l18
$$ 136 115 80 315 -340 87 -37 0 137 -68 97 -272 -38 149 15 -67 209 -460 -8 -291 238 -80
7459h0j78l60O37K33n22N38p59M59N64o70O50j030L41L99J62j091N77K61K80j79
$$ -80 -258 -618 19 252 -270 268 -491 -32 532 -138 512 -518 -177 222 384 -707 -130 131 411 232
7479B32m70L52j50j90l1P80o61N35q3k95J88j96K49k19p1L7p2J27l34K98k33K29
$$ 232 -238 114 -36 -226 -257 523 -138 397 314 19 207 11 260 41 -30 7 -65 62 -272 26 -207 22
7501B2J64l96K48J08P8l54r7K19J9J84K3m82K51K05j88K66j34J85n3j72N4j40
$$ 22 186 -210 38 146 224 -130 -227 -8 11 195 218 -264 -13 192 4 270 136 321 268 96 150 10
7523A0N9R4o4K0Q9j40j89l4L20k75K57l2l6P3J08j76R5o17Q14k20n08J42J48K08
$$ 10 69 163 99 119 208 68 -121 -155 165 -110 147 115 79 152 260 84 179 -438 376 156 -352 -210 -62 146
7547A46m01Q1N4M99j03L2l14J55j05j50p3K79j64N9k5M8j62M23l04J24M9n5J72
$$ 146 -255 -174 -120 379 276 308 -6 149 44 -106 -179 100 -64 -5 -30 18 -144 279 -25 99 148 93 265
7570B65j36M21l39m26K28J02r7K01j93m14L87J37q6n27K33Q42L27j183K89N18
$$ 265 129 550 211 -215 13 115 18 219 26 -388 -1 136 50 -477 -244 598 925 -258 31 549
7590E49q25o5L7K97Q5k54K62M3L00o50N02j63m3k15J45q7k44L97k44j06k30M84
$$ 549 -276 -341 -304 -7 78 -176 86 129 429 -221 281 118 75 -140 5 -82 -326 71 -173 -279 -509 -25
7612b5K9p0J02j42L78n7l22P18o20L32n8k51l94J56P10m70j31k65K22N44M92r90
$$ -25 4 -66 36 -106 272 215 -107 611 -9 323 265 14 -380 -224 486 16 -115 -380 -158 386 878 -112
7634a12j27J37J57o6m18r3J197n83p98L98j7L93n36Q01j55K0l75M82j62m09k25
$$ -112 -239 -102 55 -11 -429 -522 675 92 -706 -308 -325 68 -468 333 178 198 -177 305 143 -266 -491
7655d91j10M23J61l56N77m67j31R29q17N1J81m29M91K68p0J92j21m83L30j68L55
$$ -491 -601 -178 -17 -373 204 -263 -394 535 -282 -231 -50 -479 12 280 210 402 281 -202 128 -40 315
7676C15k15m89M60K8Q25p58q44J278q13K39J35M47p48r3L40j31O3n7J06l09M76
$$ 315 100 -389 71 99 924 166 -678 600 -213 26 161 608 -140 -233 107 -24 39 -18 88 -221 255
7697B55q44M21j74N55R1J96k19q27K83R57p73j09j50L0J40K50K73m86k40J76j03
$$ 255 -589 -168 -342 213 304 500 281 -546 -263 694 -79 -188 -338 -308 -168 82 355 -131 -371 -195 -298
7718b98R7J3K93J54q5m64L72P1L06j54o11O01l47J01K87k25o45O69J23k29J23
$$ -298 -201 -188 105 259 174 -290 82 153 459 305 -306 295 -52 49 336 111 -534 135 258 29 152
7739A52L9o53N7L56K2k77O06j20k05j93J70k04L72J42k43L50m12L92k06n98L01
$$ 152 191 -462 -405 -49 -27 -304 302 182 -23 -216 -46 -250 122 264 21 371 -41 351 145 -453 -152
7760a52M91k03j39k12M58L30o53K0J34j36J29l73L58l5l28O25l57P7n8m4j22M11
$$ -152 339 136 -3 -215 243 573 -80 -60 74 -62 67 -306 52 17 -311 314 -43 34 -24 -68 -190 221
7782B21k8l93K97J13k85r9K21q8O0l1R4l27K96j16p7K10j58J40j77J53L1R9q9
$$ 221 193 -200 97 210 -75 -174 47 -41 19 -12 82 -245 51 -65 -142 68 -90 50 -127 26 57 156 67
7805F7J05k09M1J40r9q7L2M3k3k05K37m3j00j1K82k66K15k3K8q8k8N3j2J38j33
$$ 67 172 -37 4 144 45 -42 -10 33 10 -195 42 -1 -101 -112 170 -96 119 96 124 36 8 61 49 187 54
7830E4j66K63l27K78k90J73j35L26k42N5K01j17J20l32Q5l1O7J84K85m28l54K74
$$ 54 -112 151 -176 102 -188 -15 -150 176 -66 -11 190 73 193 -139 -54 -85 -18 166 451 23 -331 -57
7852e7j63N1L44q0o3N22o73K09J85j88L43n11J08J8Q4k97K23M9K06p54M37Q5m45
$$ -57 -220 -169 175 95 32 554 -119 90 275 87 430 -81 27 45 129 -168 55 104 310 -444 -7 78 -367
7875c67J24M69m20L13K18m34k94qJ44k62K81J4JN64k43j72m03M60j3k71M40m6
$$ -367 -243 226 -194 119 337 -97 -391 -399 -255 -517 -236 -222 -221 343 100 -72 -475 -15 -28 -299 141 95
7897I5k44K48q0L3J76k82J95m21L36O7J4k48J56k12L11k44j1p8n9K65J20j8P1
$$ 95 -149 99 19 52 228 -54 141 -280 56 123 137 -111 45 -167 144 -100 -111 -189 -248 17 137 119 190
7920A90j39j02N2J19k02m5J26M5k02K23k2j86K42M9k66M4J38j5p4j62K91J68j95
$$ 190 51 -51 1 120 -82 -127 -1 44 -158 65 43 -143 99 148 -118 -74 64 49 -25 -187 104 272 77
7943G7k24j60J40J95M3K12k18j54L1P6j2J73k94J50p3k1J63l17J49J45J8k27J27
$$ 77 -147 -307 -167 28 71 283 65 -89 -58 18 6 179 -115 35 -38 -59 104 -213 -64 81 99 -128 -1
7966aJ64l4j82pj06j52L10J19l5k0k53J89k9K14p5K2k99L7P4R2m4j31M0J80o0
$$ -1 163 129 -53 -60 -166 -318 -8 111 76 56 -197 -8 -37 177 102 124 -175 -138 -64 28 -16 -147 -107 73 13
7991A3k6P4n8P7j99p4K31r6K39l34L56j99J23J44p4k83J13j05J49J20q4q8m0L3
$$ 13 -13 61 3 80 -119 -193 38 -58 181 -153 203 4 127 271 197 -86 27 -78 71 191 107 19 -21 12
8015A2n7J59q2K02l02O3J55k97K83J2k15%P4J04l70J31K6j5Q5L96l86k44K75J84
$$ 12 -45 114 32 234 -68 -5 150 -147 136 148 -67 -67 7 111 -259 -128 -102 -117 -32 364 -22 -266 9 193
8039A93m71L07K70k06K1k8Lj24J84n8j27J0J46k33kL73j3l13R9o5O0J20j29o5
$$ 193 -278 29 299 93 114 86 89 -35 149 91 -36 -26 120 -113 -115 258 245 -68 31 -34 26 146 17 -48
8063d8pJ6R0p1R4J23j22k52J85k7J04j70J49l88M69j81L0J70k40k6J52k64RK45
$$ -48 -55 -39 51 -20 74 197 75 -177 8 -19 85 -85 64 -324 145 -36 -6 164 -76 -102 50 -214 -205 40
8087D0l10L53N4l4j50o4K06r6K1K0l0LQj45k4K04Q5l20J2K07K22j39j47KN0j17
$$ 40 -270 83 137 103 -47 -111 95 -1 20 40 10 13 21 -124 -148 56 141 -179 -167 40 262 123 -24 -22 28 -89
8113h9J80m9j89K08j74J91n4p7L0kJ66k05K26Q7J6m30P9M5o9Q8j36J71j09L59
$$ -89 91 42 -147 61 -113 78 24 -53 -23 -25 141 -64 162 249 265 -165 -86 -41 -110 -22 -158 13 -96 263
8137B63n6M2J22p48J86j95M79j31R5R5K0m06M55j47N38n04J68r73j31J252l15
$$ 263 207 249 371 -377 -191 -386 93 -38 57 152 172 -234 221 74 612 108 276 -697 -828 424 109
8158A09N41m19l70J5L8l5L9pj10m09L29o25Q89L86m47N48L45o20l31j1M09j82
$$ 109 650 231 -139 -124 -86 -121 -82 -89 -199 -608 -279 -904 -15 371 -76 472 817 197 -134 -145 264 82
8180H2Q1j98K10k33L11k77O1J13m02O9J31
$$ 82 163 -35 175 -58 253 -24 37 150 -252 -183 -52
8191e2
$$ Imaginary data points
##PAGE= N=2
##DATA TABLE= (X++(I..I)), XYDATA
0@%%%%%%%%%%%Qj6J6j6K4l2L2m0N1n9P2q8J04j23J47j71J95k27K63l00L44l95
$$ 0 0 0 0 0 0 0 0 0 0 0 0 8 -8 8 -8 16 -16 16 -24 27 -32 40 -48 56 -67 80 -91 104 -123 140 -160 184 -211
33b11M47n04N72o44P20q07R03j007J122j246J382j533J693j870K065k276K508
$$ -211 236 -268 304 -340 380 -427 476 -531 591 -655 727 -806 887 -983 1082 -1194 1314
50A314k761L042l353L695m076M506m993N547o183O925p803Q862j0170J1835j4036
$$ 1314 -1447 1595 -1758 1937 -2139 2367 -2626 2921 -3262 3663 -4140 4722 -5448 6387 -7649
65g649J7102k1718K9560m6462J52686j46194j67729L03244J78500j61674l32689
$$ -7649 9453 -12265 17295 -29167 123519 -22675 -190404 112840 291340 129666 -203023
76b03023j5903K95675J49123l30085j98050J94986L00989m9345k46588q3368K51600
$$ -203023 -218926 76749 225872 -104213 -302263 -107277 193712 144367 -102221 -185589 66011
87F6011K35536j95776k73342O1193K57824J9197k35451j67874J19713K55542o9527
$$ 66011 301547 105771 -167571 -106378 151446 170643 -64808 -232682 -112969 142573 73046
98G3046k42663k9944K46019J26344j30884j70612L3804K27819K6877k08855j39690
$$ 73046 -169617 -199561 46458 172802 41918 -128694 -94890 132929 159806 -49049 -188739
109a88739J38699J40566p1841j66228n1814J78732J12882r7824j42365P8927J66770
$$ -188739 -50040 90526 18685 -147543 -199357 -20625 92257 -5567 -147932 -69005 97765
120I7765K6124j08978r7902R4632J18256k8106j56354k7984J07647N7201n4579
$$ 97765 123889 14911 -82991 11641 129897 101791 -54563 -82547 25100 82301 27722
131B7722j16440J6781J06850N5207r8503p1288N8553Q2721J4163j00645m8020
$$ 27722 -88718 -71937 34913 90120 -8383 -79671 -21118 61603 75766 -24879 -72899
142g2899N7959R4869l8545r6568n723P5538P1523n7026p8950L912J10021K7849
$$ -72899 -14940 79929 41384 -55184 -60907 14631 86154 29128 -49822 -45910 64111 91960
154I1960r1744o1524L7872R6717j3231r3499n5995R1999P9615n6217r0774l990
$$ 91960 216 -61308 -23436 73281 60050 -33449 -89444 2555 82170 25953 -64821 -68811
166f8811J08355L6958p2725r6055M9052J06896j2789r9654n0071R0872P3587l1654
$$ -68811 39544 76502 3777 -92278 -43226 63670 50881 -48773 -98844 -7972 65615 33961
178C3961j07578O552J15729L9913p5758q1988N7663Q7436L863j08909m6803Q4777
$$ 33961 -73617 -67065 48664 88577 12819 -69169 -11506 75930 79793 -29116 -75919 8858
190H858O6055m8636j05215J7039Q6662M2213p9961p1841N6472Q8434l235j01402
$$ 8858 74913 26277 -78938 -61899 24763 66976 -12985 -84826 -28354 60080 56845 -44557
202d4557j8167O8895O7498m8058q6883J5856Q1939L3681q2286m6224M0018P6536
$$ -44557 -62724 6171 73669 25611 -61272 -45416 36523 70204 -12082 -58306 -18288 58248
214E8248j1591q0614j9741N7021N7440n1803n8553N187O8104K2634n6803l8463
$$ 58248 46657 -33957 -53698 3323 60763 8960 -49593 -44406 23698 46332 -10471 -48934
226d8934K7503O7518j4339n1104k5616M5006M1151l0675m7544r068N8790J6441
$$ -48934 -21431 46087 31748 -19356 -44972 34 41185 10510 -37034 -46102 12688 29129
238B9129l0428m0378K0800N4352M745l5982l4222M0765L3851r554n2764j6818
$$ 29129 -1299 -41677 -20877 33475 38220 2238 -31984 8781 42632 33078 -19686 -36504
250c6504M1524K2928k3835n4499J5165M4432K2241l8267l3062L3859M6139N399
$$ -36504 5020 27948 4113 -50386 -35221 9211 31452 -6815 -39877 -6018 40121 45520
262D5520n8314j1688L5805L6651l0128n5363M078M3952K6286n2755l0548K7565
$$ 45520 -12794 -24482 11323 47974 17846 -37517 -33439 10513 36799 -15956 -46504 -18939
274a8939N5745j983n3254j0876M1045M5248l9683m8946L981N2994J0923n4196
$$ -18939 36806 34823 -18431 -29307 11738 56986 17303 -31643 -27662 25332 36255 -17941
286a7941k8380K7914N8133j8202m7244n963N4878L1185m2655l7495J1140N5398
$$ -17941 -46321 -18407 39726 21524 -25720 -31683 23195 54380 11725 -25770 -14630 40768
298D0768r256n1539k6606L9459L8000l2233l9003M014N8112J0595l6387k7396
$$ 40768 31512 -20027 -46633 -7174 30826 -1407 -40410 -36396 21716 32311 -4076 -31472
310c1472L2679M3941k3031m0659j1268M4636R941l5354l2815K0313M3178j1579
$$ -31472 1207 45148 22117 -18542 -29810 14826 24767 -10587 -43402 -23089 20089 8510
322H510l1006q658M5006J8354k4009k7442J2190L6263j2805l2621j8158L1256
$$ 8510 -22496 -31154 13852 32206 8197 -19245 -7055 29208 16403 -16218 -34376 -3120
334c120J3018k3506k5090J1570L8638l943j9965r872L5636J9289j8747k2115P106
$$ -3120 9898 -13608 -38698 -27128 11510 7567 -12398 -22270 13366 32655 13908 -8207 -1101
347a101L2295j0202k5964j5807K6456J4905k0392k3408P815L6488n343k2901j2923
$$ -1101 31194 20992 -4972 -20779 5677 20582 190 -23218 -15403 21085 15742 -7159 -20082
360b0082K9741J9358k0773k4373L475L6511n816k6016j6735K8626K3188j7793
$$ -20082 9659 29017 8244 -16129 -12654 23857 18041 -7975 -24710 3916 27104 9311
372I311k4820K686L7366J461k4124k1360K3451K4498j6071k7070n468L4793N883
$$ 9311 -15509 -12823 24543 26004 1880 -19480 3971 28469 12398 -14672 -20140 14653 20536
385B0536k2057k4056J9063K7614r462k5860j2473L0547R142j7584k8089J0018
$$ 20536 -1521 -25577 -6514 21100 11638 -14222 -26695 3852 12994 -4590 -32679 -22661
397b2661K8504k057k0173j3546K8749J8101o172k1912M334K7073L123j6648k1717
$$ -22661 5843 3786 -16387 -29933 -1184 16917 10745 -11167 -6833 20240 23363 6715 -15002
410a5002J5281J1189o204k3384o657J8473N732o579j7426J3483J4495N067j0543
$$ -15002 279 11468 5264 -18120 -24777 -6304 -572 -7151 -24577 -11094 3401 8468 -2075
423b075n946J3394N299R1j6447K929L681L909n565p314N829J786Q874n772K789
$$ -2075 -8021 5373 10672 10763 -5684 -2755 926 4835 -730 -8044 -2215 -429 8445 2673 5462
438E462L84N459L698m125p99p803P029k715k207j0506k256O672Q05j438j2117
$$ 5462 5846 11305 15003 10878 10079 2276 9305 6590 4383 -6123 -8379 -1707 -902 -2340 -14457
453a4457P532Q452O052j0634n180J1470Q168J870j7521K388J0308J1093j1729
$$ -14457 -6925 1527 7579 -3055 -8235 3235 11403 13273 -4248 -1860 8448 19541 7812
466G812j4651P537J1665M977k1999n977P291J4952r098k1332J255J3502J2359
$$ 7812 -6839 698 12363 17340 -4659 -10636 -3345 11607 2509 -18823 -17568 -4066 8293
479H293j9073r903P458K1903P84k0295k731J3417J8895j5856j5884j88J9286N507
$$ 8293 -10780 -20683 -13225 8678 9462 -10833 -13564 -147 18748 2892 -12992 -13180 6106 11613
493A1613k0266r956Q252K3183p116j4508l434J8770J3211j3549j2425n66J9862
$$ 11613 -8653 -18609 -10357 12826 5710 -8798 -12232 6538 19749 6200 -6225 -6791 13071
506A3071l012j5758j2796Q648J3424q316j0811n841J9150P687l567r374N522J7384
$$ 13071 10059 -5699 -18495 -9847 3577 -4739 -15550 -21391 -2241 5446 1879 -7495 -1973 15411
520A5411J742m968j1738R239O950o79j3654p912Q976L023p22j4685J006P618Q915
$$ 15411 17153 12185 447 9686 16636 15957 2303 -5609 3367 6390 5668 -9017 -8011 -393 8522
535H522n123j1326N468P865Q508j2946o303K089J1862J096j5583l770N394J4660
$$ 8522 3399 -7927 -2459 5406 13914 968 -5335 -3246 8616 9712 -5871 -9641 -4247 10413
549A0413p890j0481l280J4021J0808j2443r290Q06J9891j041j2899j1444R589
$$ 10413 2523 -7958 -11238 2783 13591 1148 -8142 -7336 12555 11514 -1385 -12829 -3240
562c240J6207r045j5523p741J9185O750j1996j7195N794K1400n22j3761j2490
$$ -3240 12967 3922 -11601 -19342 -157 6593 -5403 -22598 -16804 4596 4074 -9687 -22177
575b2177K0481J5303o020j8312L11K3548M915j3405j9739J4045J6216k357k1968
$$ -22177 -1696 13607 7587 -10725 -10414 13134 18049 4644 -15095 -1050 15166 12809 -9159
588i159p371K0276Q928q829k0486Q771J8827L955j6686j1165J7344J0902m378
$$ -9159 -16530 3746 12674 3845 -16641 -7870 10957 14912 -1774 -12939 4405 15307 10929
601A0929k1369K151J6342N290j3672j3368J2992J1507k27j7634J143J3042P419
$$ 10929 -10440 -8289 8053 13343 -329 -13697 -705 10802 10575 -7059 -5916 7126 14545
614A4545r583j4079R490Q800K01j5610j955R556M826o471j2421Q526O626K031
$$ 14545 4962 -9117 373 9173 9374 -6236 -8191 1365 6191 -280 -12701 -4175 2451 4482
628D482j2532o82R649L136n080r741Q421M570n89j0281Q09J1633N12n482p193
$$ 4482 -8050 -8732 917 4053 -1027 -10768 -2347 2223 1634 -8647 -7838 3795 4307 -1175 -8368
643h368J0048N850k565j1799J280J1927o15q890j1338J3471P119l659j3943K288
$$ -8368 1680 7530 4965 -6834 -5554 6373 5758 -3132 -14470 -999 6120 2461 -11482 -9194
657i194J6235L827j0024j1583J4354J1207l733j7766j543J7032M141j1929j7459
$$ -9194 7041 10868 844 -10739 3615 14822 11089 -6677 -8220 8812 12953 1024 -16435
670a6435J2053J5065o89j9073m915J9332J0266q488k0091Q200J7032L569j9405
$$ -16435 -4382 10683 9994 -9079 -13994 5338 15604 7116 -12975 -4775 12257 15826 -3579
683c579j2721J6110J2661m971k2604J980J7063J0184j4147j6570J2207J6029K648
$$ -3579 -16300 -190 12471 7500 -15104 -13124 3939 14123 -24 -16594 -4387 11642 14290
696A4290k2153n143J3620J3294r296k0110M164J4505R090j7855r903Q867J6798
$$ 14290 -7863 -13006 614 13908 4612 -15498 -11334 3171 12261 -5594 -15497 -6630 10168
709A0168N4j8692k178J1397J4646j2044j3127J098J4587O007j4803p623M637J7192
$$ 10168 10222 -8470 -10648 749 15395 3351 -9776 -8678 5909 11916 -2887 -10510 -5873 11319
723A1319k818j1789n680J0327J2497q400j0275n163J4342M175q599j1710J768
$$ 11319 8501 -3288 -8968 1359 13856 5456 -4819 -9982 4360 8535 -64 -11774 -10006
736a0006J4653P41p368j1019J0661J2007O91j1886o461J3343P908k499j7448m36
$$ -10006 4647 5388 -1980 -12999 -2338 9669 10360 -1526 -7987 5356 13264 10765 -6683 -7119
750g119J1399P742j1000j6122O507J3180O170j7629p690J1101J6496k580k0415
$$ -7119 4280 12022 1022 -15100 -8593 4587 10757 -6872 -14562 -3461 13035 10455 -9960
763i960p41J4045J4313j5144j6682K896J9546N534k1628r841J0874K3038o822
$$ -9960 -10701 3344 17657 2513 -14169 -11273 8273 13807 -7821 -17662 -6788 16250 9428
776I428j9369l694J9985J6184j6088j7511K073K5190J426k1085j5207J2606K1298
$$ 9428 -9941 -13635 6350 22534 6446 -11065 -8992 16198 17624 -3461 -18668 -6062 15236
789A5236r053k1597p638K4122J2832j4030j9504O020K6994K812j8078j6184J8357
$$ 15236 6183 -15414 -23052 1070 13902 -128 -19632 -13612 13382 16194 -1884 -18068 289
802B89J9667o325k3428o134K3494J0430j3544k3825P955K2220M124k0388j5313
$$ 289 19956 13631 -9797 -15931 7563 17993 4449 -19376 -11421 10799 14923 -5465 -20778
815b0778J8257J7483l123k4627k677J9892J3240j3027k2421P245J8909P989k1426
$$ -20778 -2521 14962 11839 -12788 -15465 4427 17667 4640 -17781 -10536 8373 16362 -5064
828e064j3114J2641J9897j109k3334l598J6347J8637j2452j9437J463K0487J0575
$$ -5064 -18178 -5537 14360 13251 -10083 -13681 2666 21303 8851 -10586 -9123 11364 21939
841B1939k0624j4783O502K3010j943k2278j0868J5178J9915j1590k0547l988K5121
$$ 21939 1315 -13468 -6966 16044 14101 -8177 -19045 -3867 16048 4458 -16089 -20077 5044
854E044J0945j6324j8582P696K7390P03k0730j5478K0071K0720q558k5768n806
$$ 5044 15989 -335 -18917 -11221 16169 16872 -3858 -19336 735 21455 12897 -12871 -18677
867a8677K6687J1474j6681k6567R588K7262L492k5552j7151K2743K2894o172l0968
$$ -18677 8010 19484 2803 -23764 -14176 13086 16578 -8974 -26125 -3382 19512 13340 -17628
880a7628k527K7477J5747j9956k7827J1567K7538N522l0687j5081K2561K5651
$$ -17628 -20155 7322 23069 3113 -24714 -13147 14391 19913 -10774 -25855 -3294 22357
892B2357q256l2252J143K7935J8624k3974k5217J2404K9465K493l4072j2786K0861
$$ 22357 14101 -18151 -17008 10927 29551 5577 -19640 -7236 22229 24722 -9350 -22136 -1275
905a275K5548j5503l0771L96K8859J5488k6893k0576J3277L2106j467k9359j0061
$$ -1275 24273 8770 -22001 -21605 7254 22742 -4151 -24727 -11450 20656 19189 -10170 -20231
918b0231K2988K4669j7479k6051k99K9729Q773k4557j9809J2084K8341n227k4396
$$ -20231 2757 27426 9947 -16104 -16403 13326 22099 -2458 -22267 -10183 18158 12931 -11465
931a1465j1132K3760J8557j3945k2847Q00K7062N924j8396j9622J3139K2001k947
$$ -11465 -22597 1163 19720 5775 -17072 -16272 10790 16714 -1682 -21304 -8165 13836 10889
944A0889k1614j0045K1352J3533q327k1315K290K2106P504j4860j6587J2205J7371
$$ 10889 -10725 -20770 582 14115 5788 -15527 -13237 8869 16373 1513 -15074 -2869 14502
957A4502R94k0032q374J4685J3024o498k0866J090J4634J0059j3442j4666O689
$$ 14502 15496 -4536 -12910 1775 14799 8301 -12565 -11475 3159 13218 -224 -14890 -8201
970h201J6052N256j7401p197R568J6818m095j6927l343J2685J3313j2161j4248
$$ -8201 7851 13107 -4294 -11491 -1923 14895 10800 -6127 -9470 3215 16528 4367 -9881
983i881l6J7691N259j5143j1106O413J9326l239j5226q724J5140J3491q976j6246
$$ -9881 -9917 7774 13033 -2110 -13216 -6803 12523 9284 -5942 -14666 474 13965 4989 -11257
997a1257k075J9758N147j2375j5774Q749J7767j239j6165r022J6732J2341o532
$$ -11257 -13332 6426 11573 -802 -16576 -7827 9940 8701 -7464 -16486 246 12587 6055
1010F055j8241J431J7289Q088j3681j6166J0486J6090J116j9239q227J5748J3319
$$ 6055 -12186 -10755 6534 14622 941 -15225 -4739 11351 12467 -6772 -14999 749 14068
1023A4068p266k0445K984J6313Q613j5613j3755J0033J6196J166k0077m213J3774
$$ 14068 6802 -13643 -10659 5654 14267 -1346 -15101 -5068 11128 12294 -7783 -11996 1778
1036A778J4006r025j7137K840J5080P928j7072j0184P395J6021k389j6891l969
$$ 1778 15784 6759 -10378 -7538 7542 15470 -1602 -11786 -4391 11630 9241 -7650 -11619
1049a1619J1878J3405j0878j2682J184J5982M659j3747q647N938J5285m192j2263
$$ -11619 259 13664 2786 -9896 -8712 7270 11929 -1818 -10465 -4527 10758 6566 -5697
1062e697n451J2005R438q784j0309m4J4742K231q708r267O269J1729k696r404
$$ -5697 -11148 857 10295 1511 -8798 -8842 5900 8131 -577 -9844 -3575 8154 5458 -3946
1076c946o166J0942O402l970j1123J51J1496K815o134r494O556Q057J193j0029
$$ -3946 -10112 830 7232 3262 -7861 -7710 3786 6601 467 -9027 -2471 5586 6779 -3250
1090c250m790Q452O272j853j1719J440P629N602o364q618M474P514L090j0488
$$ -3250 -8040 412 6684 4831 -6888 -5448 2181 7783 1419 -7199 -2725 4789 7879 -2609
1104b609l360M968Q351l047j0074l26O730P267p911o322K165R708K022r301l235
$$ -2609 -5969 -1001 7350 4303 -5771 -6097 633 7900 -11 -6333 -4168 5540 7562 -1739 -4974
1119d974M485R806m752p885k290Q009N154p936n831M34J0245q75o943m453O464
$$ -4974 -489 9317 4565 -3320 -5610 2399 7553 -383 -6214 -5780 4465 3590 -3353 -7806 -1342
1134a342P843m675n961j819R740K276n577o489L223Q528k581n717m358P927L597
$$ -1342 6501 1826 -4135 -5954 3786 6062 485 -6004 -2781 5747 3166 -2551 -6909 1018 4615
1149D615l351o445J051Q160l18m154n475O099M085j753n873j222P058L98k557
$$ 4615 1264 -5181 -4130 4030 3712 -442 -5917 182 4267 2514 -3359 -4581 2477 2875 318
1164C18o158M493L736n10m387j971N990R90r93n292L315L767Qk856k442N146L62
$$ 318 -5840 -1347 2389 1879 -2508 -4479 1511 2501 1508 -3784 -469 3298 3306 450 -1992 3154 3516
1181C516o03m774J937K287o09k926k402M083n62k31l602K234K739j38j259j821
$$ 3516 2913 -1861 76 2363 1754 -1172 -3574 509 -53 -284 -3886 -1652 1087 949 -310 -2131
1197b131M468Lp1l161J343K378j494j712k519L837l86m53l279J591L062r20j145
$$ -2131 2337 2340 2269 -892 451 2829 1335 -377 -2896 941 555 102 -3177 -1586 1476 556 -589
1214e89k013M131j2l32l248O12K641j177j393l241L365N16K0k733Q18L139J6O1
$$ -589 -2602 1529 1517 1185 -2063 -1451 1190 13 -1380 -4621 -1256 -740 -720 -3453 -2635 504 520 581
1232E81k732L580Q18Q14k582m17K360m27J27l798J760j8Q89j899j524J923k21
$$ 581 -2151 1429 2247 3061 479 62 2422 1995 2122 -1676 84 66 955 -944 -2468 -545 -766
1249g66J366k712J548q3J480K13j110J415j171K657j959P84j353P01N47p74K15
$$ -766 600 -2112 -564 -647 833 1046 -64 1351 180 2837 878 1662 309 1010 1557 783 998
1266I98k642K504o59R63k386J39K177K79K33l668K176J097J145l317j663J788
$$ 998 -1644 860 201 1164 -1222 -1083 1094 1373 1606 -2062 114 1211 2356 -961 -2624 -836
1282h36J226j10m721J272J490K951k549k553K845K825K104m725j54K201L782k440
$$ -836 390 280 -4441 -3169 -1679 1272 -1277 -3830 -985 1840 3944 -781 -935 1266 5048 2608
1298B608m685P58K256K297n587k144J186M769m46n214P2L553N031l998k735J01
$$ 2608 -2077 -1319 937 3234 -2353 -4497 -3311 1458 1012 -4202 -4130 -577 4454 456 -2279 -2178
1314b178N627J514n739k102J835N924k997m032j770N069L499m254k998M54P196
$$ -2178 3449 4963 -776 -2878 -1043 4881 1884 -2148 -3918 1151 4650 396 -2602 -2148 5048
1329E048j022l756l336L655M285l211l846j876O053O85l466l776J647N440p44
$$ 5048 4026 270 -3066 589 4874 1663 -2183 -4059 1994 2679 -787 -4563 -2916 2524 1780
1344A780l133l339N128K737j233m382q6M829R46k033m647K655L305O70l680l010
$$ 1780 -1353 -4692 436 3173 1940 -2442 -2528 2301 3247 1214 -3433 -778 2527 3197 -483 -3493
1360c493L705J954n59m853M30K447K055j603m312J917L406J325l467r37M56M744
$$ -3493 212 2166 1607 -3246 -2816 -369 1686 83 -4229 -2312 1094 2419 -1048 -1985 -1529 3215
1376C215J47m004r42J567L965k930k886m91K448K467k684k048P24M219o72k816
$$ 3215 3362 -642 -1584 -17 3948 1018 -1868 -2359 89 2556 -128 -2176 -1452 2767 2095 -721
1392g21k199K526L526j839k533j872L702J282k555k883Q64M876k3k636l129M410
$$ -721 -2920 -394 3132 1293 -1240 -3112 590 1872 -683 -3566 -2702 2174 2151 -485 -3614 796
1408G96J871K62m073j389M585J765j281o127K586K719N96k914l861L882K021P25
$$ 796 2667 2929 -1144 -2533 2052 3817 2536 -3591 -1005 1714 2310 -604 -4465 -583 1438 2163
1424B163m968L24K513L387k906l619K542K781J121m183j886K555L223j489m345
$$ 2163 -2805 -2481 32 3419 513 -3106 -564 2217 3338 -845 -2731 -176 3047 1558 -2787
1439b787J483J893K209l033j885J463K376O19l393j54O16K876j886j736k0J844
$$ -2787 -1304 589 2798 -235 -2120 -657 1719 2338 -1055 -1209 -593 2283 397 -1339 -1359 485
1455D85J467k586j30j021L982j534j029m79P70J725j593K72j742K396j15l65j223
$$ 485 1952 -634 -764 -1785 2197 663 -366 -845 -75 1650 57 329 -1413 983 868 503 -720
1472g20o37J712l86Q05k098P55J13J058Nj325N24j44K154j603r45m93J537J175
$$ -720 -1357 355 -31 774 -1324 -569 -456 602 607 -718 -194 -338 1816 213 -732 -1225 312 1487
1490A487k067l86p07L242m85j325j639J807K704j605j363j834L475O06j361k842
$$ 1487 -580 -966 -1673 1569 1084 -241 -1880 -73 2631 1026 -337 -2171 1304 1910 549 -2293
1506b293L75L472l57j901k893L339K297l00l297o40M230J243j896m199K126K846
$$ -2293 -1918 1554 1197 -704 -3597 -258 2039 1739 -1558 -2198 2032 3275 1379 -2820 -694 2152
1522B152O46l948k816L429K162k02m840O72L386K244k462l619K556L037Q21m443
$$ 2152 2798 -1150 -3966 -537 1625 1423 -3417 -2745 641 2885 423 -3196 -640 2397 3218 -1225
1538a225j415K353K796j075m378N21K354L291l595k061R76L530J181m028n74J124
$$ -1225 -2640 -287 2509 1434 -2944 -2423 -69 3222 -373 -2434 -1458 2072 3253 -775 -1349 -225
1554b25L917j888l049p00K264K192k793j911o42M222M08k088k219J224L705o71
$$ -225 3692 1804 -1245 -1945 319 2511 -282 -2193 -2835 1387 1795 -293 -2512 -1288 2417 1746
1570A746j864k439L307K070j114k931j247M085P23j121m070J241K815J294k926
$$ 1746 -118 -2557 750 2820 1706 -1225 -2472 1613 2336 1215 -2855 -1614 1201 2495 -431
1585d31l272K732K516O93m796n65K814L075j677m585J038L120K937m118k652J590
$$ -431 -3703 -971 1545 2238 -2558 -3123 -309 2766 1089 -3496 -2458 662 3599 -519 -3171 -1581
1601a581M279M67n242j398K523M988k679m423m07N020K831m454l403J424O252
$$ -1581 2698 3165 -2077 -3475 -952 4036 1357 -3066 -3473 1547 4378 -76 -3479 -2055 4197
1616D197m74n263k320L606M934l261m590j636O466K100l970m630K009P040n27
$$ 4197 3723 -1540 -3860 -254 4680 1419 -3171 -4807 1659 3759 -211 -4841 -2832 4208 3681
1631C681m258l807N648M468k194n905j075O244J934m063n987K779N278P32n790
$$ 3681 -577 -4384 1264 5732 3538 -2367 -3442 2802 4736 673 -5314 -2535 2743 3475 -2315
1646b315l561N647M108j045o461K6N507L144m268n597L057M428J688o848k535
$$ -2315 -5876 -229 3879 2834 -3627 -3601 1906 5050 782 -4815 -1758 2670 4358 -2490 -5025
1661e025L962M864j477o477L04M868M289n136m098J909N420J434o270k982K861
$$ -5025 -1063 3801 2324 -4153 -3849 1019 5308 172 -3926 -2017 3403 4837 -1433 -4415 -1554
1676a554N830k194o054j037M763M545m561m400M80P076J247n045l202L179O154
$$ -1554 4276 2082 -3972 -5009 -246 4299 -262 -4662 -4182 2894 4141 -904 -4106 -927 5227
1691E227j696n174k807N798L746l293n666J72O443J376m399n351L739O018k17
$$ 5227 3531 -1643 -4450 1348 5094 1801 -3865 -3693 2750 4126 -273 -5624 -1885 4133 3916
1706C916o376k793O574L746k538o634P11O579K071n173n691M055N727L11p093
$$ 3916 -2460 -5253 1321 5067 2529 -4105 -3394 3185 5256 83 -5608 -1553 4174 4485 -2608
1721b608k583N591N159k764p180J155O133L144o211m929L148O266M46q017k009
$$ -2608 -5191 400 5559 2795 -4385 -3230 2903 6047 -164 -5093 -1945 4321 4767 -3250 -5259
1736e259M817N519l617o692O35O552L478o643m088K693P159o21o566k092N193
$$ -5259 -442 5077 1460 -5232 -4597 1955 5433 -1210 -5298 -2605 4554 3933 -2633 -4725 468
1751D68N364m180n537l85P198K107n843m546K883O710j252n729l049N915M684
$$ 468 5832 1652 -3885 -4270 2928 5035 -808 -5354 -2471 4239 2987 -2742 -5791 124 4808
1766D808l385n556j37P215J632m299n234L152O379q61n768l023N842L348j809
$$ 4808 1423 -4133 -4270 2945 4577 278 -4956 -1804 4575 3714 -2054 -5077 765 4113 2304
1781B304o381O65N659K308m201m965L711M569O59o025k336M172M092j665o375
$$ 2304 -4077 -3412 2247 4555 354 -4611 -900 3669 4328 -1697 -4033 139 4231 2566 -3809
1796c809M30M604L146m444m152K050M977J159n808j712K875N127j947n284l46
$$ -3809 -3379 1225 4371 -73 -4225 -2175 2802 3961 -1847 -3559 -684 4443 2496 -2788 -3134
1811c134M189L682m477l817Q95N430P73m944k650K555N329j908m216j901N342
$$ -3134 1055 4737 260 -3557 -2662 2768 3541 -1403 -4053 -1498 3831 1923 -2293 -4194 1148
1826A148K899l334m142M37N834J77l791l886L371M877j434m218k036N418K305
$$ 1148 4047 713 -3429 -2992 2842 3019 -772 -4658 -1287 3590 2156 -2062 -4098 1320 3625
1841C625k425m887R97N261J072l730m550L692M065O06n747j580M823K647k153
$$ 3625 1200 -3687 -2690 2571 3643 -87 -4637 -945 3120 3726 -2021 -3601 1222 3869 1716
1856A716n579J492M326K357n081k851L206L697o45n394l67L413L980l265m744
$$ 1716 -3863 -2371 1955 4312 -769 -3620 -414 3283 2638 -2756 -3123 290 4270 1005 -3739
1871c739J949M155J704m946k477K305M387j052m635q74L691L395l386l329N88
$$ -3739 -1790 2365 4069 -877 -3354 -1049 3338 2286 -2349 -3223 468 3863 477 -2852 -2264
1886b264M423R63m157j992J904M347j285l513j372L435K709k818k846N7M453n0
$$ -2264 2159 3122 -1035 -3027 -1123 3224 1939 -1574 -2946 489 3198 380 -2466 -2409 2044 1994
1902A994k590k658K447L228j100k699j566L838J311j424l296P11L384O04j828
$$ 1994 -596 -3254 -807 2421 1321 -1378 -2944 894 2205 781 -2515 -1804 1580 2184 356
1917C56k947K307K189Q2l084j042K651J242o13l148P51K349J011k078k161J619
$$ 356 -2591 -284 1905 1987 -1097 -2139 512 1754 1141 -2007 -1256 1093 2104 26 -2135 -516
1933e16K273L70l255n78J641K286j082k907N24J601J815k466j408R66K276K84
$$ -516 1757 2127 -1128 -1706 -65 2221 1139 -1768 -1244 357 2172 -294 -1702 -736 1540 1824
1949A824k581o95J361K601j804j781m38K420O80k396j170M08L007o15j693j103
$$ 1824 -757 -1452 -91 2510 706 -1075 -1513 907 1587 -809 -1979 -1571 1436 821 -872 -1975
1965a975J581K224j556j581k51L040K58j408j449M19K275q44r95j416J672Q64
$$ -1975 -394 1830 274 -1307 -1558 1482 1740 332 -1117 -698 1577 733 -262 -1678 -6 858
1981H58m37j804J38K057K37o10k306K037O43J94j536q30J776N86m20k092Q93J183
$$ 858 421 -1383 -1245 812 1049 439 -1867 170 813 1007 -529 -1359 417 1003 583 -1509 -616 567
1999E67O37j453r61J444Q69j05j665J97J054P00p39r96P38O19J0j505RJ91J205
$$ 567 1204 -249 -1210 234 1103 998 -667 -470 584 1284 545 -451 287 906 916 -589 -580 -389 816
2018H16m44j454P53j16J450j187k52N18L42L61j560N36k99J164q92k66J63L02
$$ 816 372 -1082 -329 -445 1005 -182 -434 84 426 787 -773 -237 -536 628 -264 -530 -367 -65
2036f5L97m89J27q24J297p02r7L4L13K90r18L51k32Q23l35j85J03l04R24p59Q6
$$ -65 332 -157 -30 -854 443 -259 -356 -322 -9 281 -637 -286 -518 305 -30 -215 -112 -416 508 -251 -165
2057a65l57N77J3l77J02j23O73o83M83k66P19k03K12k37j09J85j55J85j126M61
$$ -165 -522 55 68 -309 -207 -330 343 -340 143 -123 596 393 605 368 259 444 289 474 -652 -191
2077a91R0r0K62n10O89m41N27p69P16M09j15m1m86Q20l96K34r19J35K83l2j62
$$ -191 -101 -191 71 -439 250 -191 336 -433 283 692 577 536 50 870 474 708 -211 -76 207 175 13
2098A3q98R17l0K85q07j5Q61L32l63j056R07j88O14q23m62M22M77j21j263O80
$$ 13 -885 32 2 287 -520 -535 326 658 295 -761 146 -42 572 -251 -713 -291 186 65 -1198 -518
2118e18K66J034j165j61P19J91Q21j403l4M04P66q41p01J51N29P05j512J49k16
$$ -518 -252 782 -383 -544 175 366 1187 -216 -250 154 920 79 -622 -471 58 763 -749 -600 -816
2137h16J583l00j028q4P48J514j676m30Q2J130K46r25m85J75J373q55m59n91J121
$$ -816 767 467 -561 -645 103 1617 -59 -489 -407 723 969 44 -441 -266 1107 252 -207 -798 323
2156C23N50q62n97J18J700n76o02r93J029R31q87m27p84J606K2l21r07K97J140
$$ 323 873 11 -586 -468 1232 656 54 -939 90 1021 134 -293 -1077 529 551 230 -677 -380 760
2175G60m94k33j009R34M93M83j236o95J295J65j04j431O68N64M22q56r09J195
$$ 760 266 33 -976 -42 451 934 -302 -997 298 463 359 -1072 -404 160 582 -274 -1183 12
2193A2K98M66j606K95K91Q79l02j218K58N82Q97j142l32P2J231M9j110K25jJ015
$$ 12 310 776 -830 -535 -244 635 333 -885 -627 -45 852 -290 -622 -550 681 730 -380 -155 -156 859
2213H59q06m97l59R72M56p06p50K75J429m84n92n02R27R62p34p13o60J592j88
$$ 859 53 -444 -803 169 625 -81 -831 -556 873 389 -203 -705 222 1184 450 -263 -923 669 481
2232D81l09j108M07J201j32m94j122J203P32j97j058k70J179L61k94j509O06O75
$$ 481 172 -936 -529 672 540 46 -1076 127 859 662 -396 -666 513 874 580 -929 -323 352
2250C52L70q63o47P96M39K41j646K71N76J123o77j252O91M70N70j124l50K99R89
$$ 352 722 -141 -788 8 447 688 -958 -687 -111 1012 335 -917 -226 244 814 -310 -660 -361 628
2269F28l1j296j34P44J045j239k37j4R81M11j323l31N82J027o83l51m62Q00P52
$$ 628 597 -699 -833 -89 956 -283 -520 -534 447 858 -465 -796 -214 813 130 -221 -683 117 869
2288H69q41o27l47J621j1l43j026N58R42l94m30p63J014J35J39r64j66J091J11
$$ 869 28 -599 -946 675 664 321 -705 -147 795 401 -29 -792 222 357 496 -468 -634 457 568
2307E68j24j010M62M23O23q41p18P15K98K16j131J35K58O26j63q72L13K44Q25
$$ 568 444 -566 -104 319 942 101 -617 98 396 612 -519 -384 -126 500 337 -535 -222 22 847
2326H47j044k46K02M83N06r29l25J59R54m93o11j85P37N92q36k48k17J247j51
$$ 847 -197 -443 -241 242 748 -181 -506 -347 607 114 -497 -682 55 647 -189 -437 -654 593 442
$$ [...]
8191a02
##END NTUPLES=NMR FID
##END=
