##TITLE=1H_Pr 250
 CDCl3
 8 sc, 
 7.06.2022
##JCAMPDX= 6.0         $$ Bruker NMR JCAMP-DX V2.0
##DATA TYPE= NMR FID
##DATA CLASS= NTUPLES
##ORIGIN= UXNMR, Bruker Analytische Messtechnik GmbH
##OWNER= root
$$ XWIN-NMR		Version 3.5
$$ Tue Jun  7 14:17:14 2022 Russian Standard Time (UT+4h)  she@DPX200
##.OBSERVE FREQUENCY= 200.13135
##.OBSERVE NUCLEUS= ^1H
##.DELAY= (6, 6)
##.ACQUISITION MODE= SIMULTANEOUS
##.ACQUISITION SCHEME= undefined
##.AVERAGES= 8
##.DIGITISER RES= 18
##SPECTROMETER/DATA SYSTEM= spect
##.PULSE SEQUENCE= zg30
##.SOLVENT NAME= CDCl3
##.SHIFT REFERENCE= (INTERNAL, CDCl3, 0, 15.7039)
##AUDIT TRAIL= $$ (NUMBER, WHEN, WHO, WHERE, WHAT)
$$ ##TITLE= Audit trail, XWIN-NMR		Version 3.5
$$ ##JCAMPDX= 5.01
$$ ##ORIGIN= Bruker BioSpin GmbH
$$ ##OWNER= she
$$ F:/spectra/data/she/nmr/H-F/1/audita.txt
$$ ##AUDIT TRAIL=  $$ (NUMBER, WHEN, WHO, WHERE, WHAT)
(   1,<2022-06-07 14:16:08.31 +0400>,<she>,<DPX200>,
      <created by zg, POWCHK disabled, PULCHK disabled
       configuration hash MD5:
       00 E9 B6 7A A2 85 ED C7 34 08 36 98 17 FE 4E 26
       data hash MD5: 16K
       0B 69 E4 4A 4E 88 80 56 0C FD 88 86 FE AC B2 01>)
$$ ##END=
$$ 
$$ hash MD5
$$ D9 E4 6A 4B C2 79 F8 9A 6D 33 9C C3 AD AA 76 E0
##$RELAX= 
##$RELAX= 
##$RELAX= 
##$RELAX= 
##$RELAX= 
##$RELAX= 
$$ Bruker specific parameters
$$ --------------------------
##$DU= <F:/spectra>
##$EXPNO= 1
##$NAME= <H-F>
##$PROCNO= 1
##$TYPE= <nmr>
##$USER= <she>
##$AMP= (0..31)
100 100 100 100 100 100 100 100 100 100 100 100 100 100 100 100 100 100 
100 100 100 100 100 100 100 100 100 100 100 100 100 100 
##$AQSEQ= 0
##$AQ_mod= 1
##$AUNM= <au_zg>
##$AUTOPOS= <>
##$BF1= 200.13
##$BF2= 200.13
##$BF3= 200.13
##$BF4= 200.13
##$BF5= 200.13
##$BF6= 200.13
##$BF7= 200.13
##$BF8= 200.13
##$BYTORDA= 1
##$CFDGTYP= 0
##$CFRGTYP= 5
##$CHEMSTR= <none>
##$CNST= (0..31)
1 1 145 1 1 1 1 1 1 1 1 1 1 1 1 1 1 1 1 1 1 1 1 1 1 1 1 1 1 1 1 1 
##$CPDPRG= <>
##$CPDPRG1= <>
##$CPDPRG2= <>
##$CPDPRG3= <>
##$CPDPRG4= <mlev>
##$CPDPRG5= <mlev>
##$CPDPRG6= <mlev>
##$CPDPRG7= <mlev>
##$CPDPRG8= <mlev>
##$CPDPRGB= <>
##$CPDPRGT= <>
##$D= (0..31)
0 1.2 0 0 0 0 0 0 0 0.06 0 0.03 0 0 0 0 0.0002 0 0 0 0 0 0 0 0 0 0 0 0 
0 0 0 
##$DATE= 1654596967
##$DBL= (0..7)
120 120 120 120 120 120 120 120 
##$DBP= (0..7)
150 150 150 150 150 150 150 150 
##$DBP07= 0
##$DBPNAM0= <>
##$DBPNAM1= <>
##$DBPNAM2= <>
##$DBPNAM3= <>
##$DBPNAM4= <>
##$DBPNAM5= <>
##$DBPNAM6= <>
##$DBPNAM7= <>
##$DBPOAL= (0..7)
0.5 0.5 0.5 0.5 0.5 0.5 0.5 0.5 
##$DBPOFFS= (0..7)
0 0 0 0 0 0 0 0 
##$DE= 6
##$DECBNUC= <off>
##$DECIM= 32
##$DECNUC= <off>
##$DECSTAT= 4
##$DIGMOD= 1
##$DIGTYP= 9
##$DL= (0..7)
0 120 120 120 120 120 120 120 
##$DP= (0..7)
150 150 150 150 150 150 150 150 
##$DP07= 0
##$DPNAME0= <>
##$DPNAME1= <>
##$DPNAME2= <>
##$DPNAME3= <>
##$DPNAME4= <>
##$DPNAME5= <>
##$DPNAME6= <>
##$DPNAME7= <>
##$DPOAL= (0..7)
0.5 0.5 0.5 0.5 0.5 0.5 0.5 0.5 
##$DPOFFS= (0..7)
0 0 0 0 0 0 0 0 
##$DQDMODE= 0
##$DR= 18
##$DS= 0
##$DSLIST= <SSSSSSSSSSSSSSS>
$$ [...]
##$SUBNAM2= <"">
##$SUBNAM3= <"">
##$SUBNAM4= <"">
##$SUBNAM5= <"">
##$SUBNAM6= <"">
##$SUBNAM7= <"">
##$SUBNAM8= <"">
##$SUBNAM9= <"">
##$SW= 18.05172834244
##$SWIBOX= (0..15)
0 0 2 0 0 0 0 0 0 0 0 0 0 0 0 0 
##$SW_h= 3612.71676300578
##$TD= 16384
##$TD0= 1
##$TE= 0
##$TE2= 300
##$TE3= 300
##$TEG= 300
##$TL= (0..7)
0 120 120 120 120 120 120 120 
##$TP= (0..7)
150 150 150 150 150 150 150 150 
##$TP07= 0
##$TPNAME0= <>
##$TPNAME1= <>
##$TPNAME2= <>
##$TPNAME3= <>
##$TPNAME4= <>
##$TPNAME5= <>
##$TPNAME6= <>
##$TPNAME7= <>
##$TPOAL= (0..7)
0.5 0.5 0.5 0.5 0.5 0.5 0.5 0.5 
##$TPOFFS= (0..7)
0 0 0 0 0 0 0 0 
##$TUNHIN= 0
##$TUNHOUT= 0
##$TUNXOUT= 0
##$USERA1= <user>
##$USERA2= <user>
##$USERA3= <user>
##$USERA4= <user>
##$USERA5= <user>
##$V9= 5
##$VALIST= <valist>
##$VCLIST= <CCCCCCCCCCCCCCC>
##$VD= 0
##$VDLIST= <DDDDDDDDDDDDDDD>
##$VPLIST= <PPPPPPPPPPPPPPP>
##$VTLIST= <TTTTTTTTTTTTTTT>
##$WBST= 1024
##$WBSW= 4
##$XGAIN= (0..3)
0 0 0 0 
##$XL= 0
##$YL= 0
##$YMAX_a= 90893
##$YMIN_a= -182029
##$ZGOPTNS= <>
##$ZL1= 120
##$ZL2= 120
##$ZL3= 120
##$ZL4= 120
##$ABSF1= 10
##$ABSF2= 0
##$ABSG= 5
##$ABSL= 3
##$ALPHA= 0
##$AQORDER= 0
##$ASSFAC= 0
##$ASSFACI= 0
##$ASSFACX= 0
##$ASSWID= 0
##$AUNMP= <proc_1d>
##$AZFE= 0.1
##$AZFW= 0.1
##$BCFW= 1
##$BC_mod= 2
##$BYTORDP= 1
##$COROFFS= 0
##$CY= 11.3945322036743
##$DATMOD= 1
##$DC= 2
##$DFILT= <>
##$DTYPP= 0
##$F1P= 2.36226072786647
##$F2P= -0.459571619588291
##$FCOR= 0.5
##$FTSIZE= 0
##$FT_mod= 4
##$GAMMA= 1
##$GB= 0.15
##$INTBC= 1
##$INTSCL= 1
##$ISEN= 128
##$LB= 0.24
##$LEV0= 0
##$LPBIN= 0
##$MAXI= 10000
##$MC2= 0
##$MEAN= 0
##$ME_mod= 0
##$MI= 1.114404
##$NCOEF= 0
##$NC_proc= 0
##$NLEV= 6
##$NOISF1= 3.799351
##$NOISF2= 2.8
##$NSP= 1
##$NTH_PI= 0
##$NZP= 0
##$OFFSET= 15.70392
##$PC= 1
##$PHC0= -18031.43
##$PHC1= 12.80074
##$PH_mod= 1
##$PKNL= yes
##$PPARMOD= 0
##$PSCAL= 0
##$PSIGN= 0
##$REVERSE= no
##$SF= 200.130013532006
##$SI= 16384
##$SIGF1= 3
##$SIGF2= 2
##$SINO= 400
##$SIOLD= 16384
##$SREGLST= <1H.CDCl3>
##$SSB= 0
##$STSI= 0
##$STSR= 0
##$SW_p= 3612.71676300578
##$SYMM= 0
##$S_DEV= 0
##$TDeff= 0
##$TDoff= 0
##$TI= <>
##$TILT= no
##$TM1= 0
##$TM2= 0
##$TOPLEV= 0
##$USERP1= <user>
##$USERP2= <user>
##$USERP3= <user>
##$USERP4= <user>
##$USERP5= <user>
##$WDW= 1
##$XDIM= 8192
##$YMAX_p= 0
##$YMIN_p= 0
$$ End of Bruker specific parameters
$$ ---------------------------------
##NTUPLES= NMR FID
##VAR_NAME=  TIME,          FID/REAL,        FID/IMAG
##SYMBOL=    X,             R,               I
##VAR_TYPE=  INDEPENDENT,   DEPENDENT,       DEPENDENT
##VAR_FORM=  AFFN,          ASDF,            ASDF
##VAR_DIM=   8192,          8192,            8192
##UNITS=     SECONDS,       ARBITRARY UNITS, ARBITRARY UNITS
##FACTOR=    0.0002768,     1,               1
##FIRST=     0,             0,               0
##LAST=      2.2672688,     0,               0
##MIN=       0,             -182029,         0
##MAX=       2.2672688,     90893,           0
$$ Real data points
##PAGE= N=1
##DATA TABLE= (X++(R..R)), XYDATA
0@%%%%%%%%%%%%qJ6j6J6j6K4l2L2m0M8n6P2q4R3j08J31j52J70j95K25k57K90l28
35a75L69m13M67n23N81o50P24q02Q87r81J086j199J324j460J607j770J950k149
53a127K371k617K893l208L568l980M464n042N740o608P721r202J1285j4451J9889
68A1696l1763J06843r3951j38118J69268K0008n6804M684M6222n0734Q826M6884
80D3061n7058o1504P0948L5983j9357J1904k2940m5981K8026K2097j0352l765
92h938L7859j6802m5120M0995L917n4154M3690M9490n3839j5415N1885k7899n7501
105e1832M8014O7086o4103l6857P3986j8411o2018L1112L4212j7134r695K0064
117A4424j0740l2298J5012K2761j6790J666J2205k264J1233k5050k6071L7598
$$ y = [0, 0, 0, 0, 0, 0, 0, 0, 0, 0, 0, 0, 0, -8, 8, -8, 8, -8, 16, -16, 16, -24, 24, -32, 40, -44, 49, -59, 72, -80, 90, -105, 120, -137, 153, -175, 194, -219, 248, -275, 306, -344, 380, -422, 465, -516, 570, -629, 695, -765, 842, -928, 1022, -1127, 1244, -1373, 1520, -1688, 1880, -2100, 2364, -2678, 3062, -3546, 4175, -5027, 6258, -8193, 11696, -20067, 86776, -7175, -145293, 23975, 43983, -12821, -8137, 38085, -12649, -3823, 43061, -13997, -75501, -4553, 31430, 12073, 23977, 1037, -44944, -16918, 5179, -5173, -8938, 28921, 12119, -33001, 7994, 11911, -42243, 1447, 50937, -2902, -18317, 33568, 5669, -51832, -3818, 63268, -835, -37692, 36294, 17883, -44135, -13023, 21189, 4055, -5640, 14424, 3684, -28614, -13602, 9159, -7631, -5965, 6240, 3976, 15209, -9841, -35912, 1686]
129A686K5054k1193j9869K6660J2143m4194K980L7621j9364q795L1116j4672k7206
142a8033J6141J7502k1149j9293L7212J1774l6771J905O716p231J1577O593q170
155a227n914L082R360m295r363M853J002J4728M441k9800N301K0237j0469o000
169d064J0214Q121j4474q163J7003p681j4692K2866O97k2949J2283J1348j4765
182d256j3976J2483J9707j6053o438J2463q670K17O040p203M707P625m130k284
196B32p5L819l940l927J5282o663j0860J5450m860j2330O943O220l360o381N539
211A089L348j2846N116R419j5392L667J2167r099l839K505N106m7n997O304j28
226A373j711P166q823k855J3674m602n767M228q78Q02k499J468J388p821Q230
$$ y = [1686, 26740, 5547, -14322, 12338, 24481, -19713, -16733, 20888, 1524, -7271, 23845, 9173, -18033, -1892, 15610, -5539, -24832, 12380, 24154, -12617, -10712, -3996, -11227, 350, 6943, -1227, -7141, -4059, 5301, 1006, -8357, -3504, -2502, 12226, 16667, -13133, -7832, 12405, 1936, -4064, 6150, 14271, -203, -8366, 8637, 956, -13736, 9130, 9827, -13122, -839, 10509, -4256, -18232, -5749, 13958, -2095, -8533, 3930, -4740, -4523, 1517, -5686, -979, 6646, 2516, 232, 157, 3976, 36, -3891, 11391, 4728, -6132, 9318, 4458, -7872, -929, 5291, 1931, -4450, 1089, 4437, -8409, -3293, 6126, -9266, -5599, 6568, -2531, -6370, -3865, 1241, 1194, -4803, 1501, 1373, -338, 6828, -1995, -4850, 8824, 4222, -1545, 2683, 1805, 2607, 108, 1576, 2964, -4857, 3373]
241C373K099j2736O055M179o719Q93N57J735q13l756N086j897j934P218n656L59
257a957N739o222M228K220n680K741J208J996j101n763O697r6o146O352l257l980
273c021N856l972K39j80l106M826l194j171M463m670K093J519l542O145k751m471
289d937P758r13j730M43j581N509k626k028N294n946J622M978o429R07P52k033
305i60L696m425q02L553m360K797n62l295N673m868M1N968o183J339L687k607
321a308J767j476J866K742n505M102K372n729M444p88k731L973l663R13Q94l927
337b054L925j472k596K995m169K501J859o342M332J365m723L990q77PJ139k483
353b603M648j396k921N880l251o68M780m251Q64J809k988L364k433r43K242l502
$$ y = [3373, 5472, -7264, -1209, 2970, -3749, -2856, -2299, -564, -1377, -5133, -47, -1944, -3878, 3340, -2316, -1957, 3782, -2440, 1788, 4008, -1672, 1069, 2277, 4273, 3172, -2591, 4106, 4010, -2136, 4216, 959, -3021, 2835, -1137, -898, -1078, -4184, 642, -2552, -3723, 740, -3930, -1837, -318, -3860, 2285, -466, -4937, 2821, 1908, 178, 621, -960, 4549, 1923, -105, 5189, -757, 865, 5843, -586, 321, 1073, -960, 2736, -1689, -2491, 1062, -3298, -501, -1063, -4358, 1315, -3553, -3512, 2456, -3727, -2388, 1299, -1308, 459, -1017, 849, 3591, -1914, 2188, 4560, -1169, 3275, 2487, -244, 3729, 66, 979, 1873, -2054, 1871, 399, -2197, 798, -3371, -870, 989, -5353, -1021, 344, -4379, -389, -1266, -1259, -120, -2603, 2045, 649, -2272, 3608, 357, -311, 4469, 218, 1082, 2891, -97, 3267, 834, -109, 2133, -1369]
369a369L266j003m453N314k515l474N473l495j096K302j225K581k676P8M269m514
385b537K114L352m867L260Q11k282K530j899J285P93l005L505p46k934L965m107
401g62r14M058l922J446j96k754K516j737J287J458m805L506J813l308K784k403
417a933m84M710k140J153L73l440M034n20j014K424l168J371J074k853K771k264
433I4k532M979k404r46P88l013K427n64p27K488l719J498K504m542K723J089k397
450b254L692k96q72L49j324L665k117k365O138k150k011K339m610J433K619j545
466F91N4j903J042J249m369K851j57m320N664O13m252P96j217K393J608j508K274
483A509k265k66L826l736J393L111m558K317K338k428j022k190L407J862l457
$$ y = [-1369, 1897, 894, -3559, 1755, -760, -4234, 1239, -2256, -3352, -1050, -2275, 306, -2370, -2292, 1977, -2537, -423, 2929, -1938, 1322, 2133, -149, 2381, 482, 1767, 2560, -445, 3060, 2314, -620, 3345, -762, -1676, 2382, -1540, -94, -290, -3044, -528, -2265, -978, 480, -4325, -819, 994, -2314, 470, -1933, -2417, 2293, 153, 1306, 1679, -1761, 2273, 1753, 739, 3163, -5, 1366, 2440, -413, 2358, 94, -2438, 2541, 137, -809, -21, -3034, -607, -1171, -1898, 590, -3129, -1631, 873, -3669, -946, 143, -2254, 1438, 1142, 270, 619, -705, 2960, 843, -1522, 4616, 2466, 455, 2794, -1816, -383, 2236, 691, 745, -1158, -116, 1133, -3236, -385, -542, -4862, 802, 1415, -2837, -2041, -3258, -865, 743, -765, 1509, -756, -1022, 2804, -932, 461, 3572, -986, 1331, 3669, 1241, 219, -1971, 1436, 3298, -159]
498a59J740j772k876L825k529m11L722l043Q1M19r26J126k818K476L710m233K372
515G04J225m039J782p6O17L721k281n21l07m26L467m560j596O027k380j488R09
532G78k261J042r82l9K130l362J775J436m366L163Q06k253K497j112l79J104l82
549d05L684k840k820N719j101j799K073l080J415J956o37n39m458K564L471n457
565b254K082J904n152K114K605j402k155j905M259k12k041M650l901k546P573
580C619k628l345K356J273P96j349J679M02o111M150L987o733K154L385m054N49
596A30L4r49j186J389L359n236j969P813m326m180O064j720j780K932J299j834
612a60l094M571J998n589L273J857m912M284J516m718Q78J930L89k590l48L850
$$ y = [-159, 1581, -191, -3067, 758, -1771, -2182, 1540, -1503, -1422, -1003, -1929, -803, -3621, -1145, 2565, -1668, 704, 1929, -2110, -328, -404, 213, 3934, 1653, 1132, 825, 399, 3866, -694, -2290, 3737, 1357, -131, 778, -1483, -441, -1423, -1462, 668, -2694, -919, 517, -3849, -686, 120, -2133, 364, -748, -1127, -23, -405, 3279, 439, -2381, 3338, 2237, 438, 2511, -569, 846, 2802, 2165, 1626, -2832, -268, 3203, -2254, -172, 1732, -3420, -1306, 1299, -103, -2258, -4163, 96, -116, -2157, 2493, -1408, -3954, 3619, 991, -2354, 2, 1275, 2071, 722, 2401, 2803, -3308, 842, 4829, -1904, 250, 3635, -419, 130, 164, -785, -1971, -582, 2777, -2459, -4428, 3385, -941, -5121, 943, -777, -2557, 375, 1674, -160, -3254, 1317, 3315, -2274, 999, 2856, -2056, 2228, 3744, -974, -96, 1834, 2223, -367, -715, 3135]
628C135m775q06N922m453j870L447j840q87J977m39j182m63M023j003m703M991
644A074K01m263M437O43k261J580j30N9j727N18K969l245R80K912m952L13K788
661A896l864M11J684M62n51k573J936q29j602L961j373k317M325j425j803J450
677b12N3J339j172J036J777l998K003K038m129K615J328k770P16n38J53J79j696
694a278K836j788k140L548k056j879K669j207P50L4o57J132j987J427K083k751
710a264J657J591k455J485M1q05J314j094J529p08j999K649j768j183K855j977
726a32m90J307j476M72j283L04J845k787J095J970l245K035N94j406J199k67R89
743G24k3j632K703r15j645L083j540p50J805j582M82o1q20J143j722P27R21k973
$$ y = [3135, -1640, -2446, 3476, -977, -2847, 600, -1240, -2127, -150, -589, -1771, -2234, 1789, 786, -3917, 1074, 1275, -2988, 1449, 2092, -169, 1411, 1281, 1340, -387, 131, 3100, -145, 835, 3747, -1205, -892, 1896, -1968, -1557, 127, 589, 38, -2535, -599, -1428, -3030, 931, -442, -2759, 1566, 141, -1662, -212, -159, 1180, 8, 1044, 2821, -1177, 826, 2864, -1265, 1350, 2678, -92, 624, 86, 239, 418, -1278, 1558, -230, -2370, 1178, -878, -2757, -88, -1295, -545, -511, -1168, -36, -2023, -596, 1487, -1264, 393, 1984, -471, 1014, 1055, 250, 1564, 470, 1999, 1291, -708, 1941, 173, -1010, 1845, -132, -622, 685, -791, -319, -1602, -1298, 547, -2240, -1145, 825, -2420, -385, 209, -1197, 2, -265, 724, 701, -931, 1772, 857, -788, 2295, 755, 5, 1810, 228, 710, 649, -171, 972, -750, -23, 898, -2075]
761b075J964P52l169K688p43j035J339r90Q45l15n98K753j935n72K884j928L26
778A91J541j815J439n04m96J448k104J229L54k061J789p21j540K522k005l54J237
795A50j853J212k51o95J649k021R58J355k401J913P14j620J553m20l58J455j569
812b29J630k14j688K244r51p87J781k306P38P31k187J437l59r43J500j904R96
829e11J61j976K620q32j296K349j412L40J226j391J357m02m74J902j775O26R30
846A442j699J833l77j579K023j289o53J468j901R13k96j325K057j743k54J602
862B22k124J054R83j572J445r22J29J720j625Q92O56j547J975p22r37K360j818
879A69K74J283j977J242l04p86J281j885Q32K66j951J893m32j573J768j045k88
$$ y = [-2075, -111, 641, -2528, 160, -583, -1618, -279, -1269, -424, -739, -1337, 1416, -519, -1091, 1793, -135, 191, 1732, -83, 1356, 852, 356, 1804, -300, 929, 1283, -778, 1011, 290, -1250, 1272, -733, -1087, 150, -1703, -491, -742, -1437, 212, -1809, -851, 504, -1897, 16, 730, -890, 663, 243, -115, 1340, -229, 1401, 1187, -501, 1743, 792, 5, 1786, -520, 218, 949, -1238, 199, -160, -1103, 397, -1507, -511, -350, -2326, 294, -538, -1834, 515, -897, -557, 669, -722, 635, 233, -241, 1661, -114, 512, 1442, -257, 1576, 1199, -380, 1643, 354, -299, 1169, -732, 181, -115, -1440, 617, -1126, -1380, 222, -1902, -848, 135, -1437, 8, -914, -785, 935, -690, 202, 858, -689, 1286, 564, -373, 1987, 169, 443, 1726, -251, 991, 687, -99, 1182, -703, 129, 395, -1556, 337, -95, -1668, 100, -945, -1233]
896a233J378j583J294j21j037J791j064J95J477k135J696O46j901K101n19p34
912B51N87p37J037q1j509J662j512k93J596k082R1J209j426R80o88o05J276j024
930a268J190L57j555J712n93q74J916q73J0J289p42L57n58l84J622j549M17J585
948B059k471P14J38j515J586o77j17N77j310O40n73p13K116j215k21J803k259
965a438M54J020j154J388N92O8M34j979J211J67j339K632m55j918J500r68j29
982H6k45j93J394q12q61J016k146O66J152j636J574K67j378O61p79R11M05r02
1000h20K006k61k021K147r81m71J686j315J464p3p52K05j509O08J828k154P19
1017C06O25j976N87m66K54J011j355P54K01j683J416n15k81K054j227L56Q68j848
$$ y = [-1233, 145, -1438, -144, -265, -1302, 489, -575, -380, 1097, -1038, 658, 1304, -597, 1504, 985, 251, 838, 101, 1138, 1057, -452, 1210, -302, -595, 1001, -1081, -990, 219, -1207, -227, -915, -1520, -244, -1268, -78, 279, -1276, 436, -157, -1031, 885, 12, 22, 1311, 569, 926, 368, -16, 1606, 57, 474, 2059, -412, 302, 440, -1075, 511, -166, -283, 294, -1016, -376, -949, -1662, 454, -761, -982, 821, -1438, -984, 36, -1118, 270, 862, 930, 1364, -615, 596, 763, -576, 2056, 1601, -317, 1183, 215, 86, -159, -352, 1042, 230, -631, 385, -1761, -1095, 57, -1579, -5, 262, -1116, -455, -1234, -323, 82, -820, 1186, 925, -1096, 1051, 70, -401, 1285, -30, 1434, 1361, 609, 814, -695, -87, 1741, -413, 306, 931, -1045, -458, -924, -670, 341, -1014, -260, -59, -1742, -326, -841, -1122, 932, -295, 61, 929, -919]
1035i19J061m88N46J952j664L60Q73k106M86K47m35J227j201M13K66j965J076
1052b71k71q89K126p56n60P17j578R91p9n30J997r65K6O70j572J087L00q73K279
1071A849p46j291J420j109l5N23q59J699j149o02J044j992K06J525j354J325k64
1088A90j373M39q36Q39P93q60J920q84j472J927j515l07K623o55j89L83o20J52
1106E55j707J468J621k181J711K47l045P90R3j86R10m44J019j337j303J981j685
1123a493l05L085j397o68J404j405J49J38J310O1j375J853P7l166K443P33j999
1140e55J806K75r66q00r6J030j726J58K473k155m83J680j983j91J391l32L82m78
1158e70N15m12j344K249L0j346K676p07j817J479l32j78n0O56J135k243L05J387
$$ y = [-919, 142, -346, 200, 2152, 488, 848, 1721, -385, 101, 348, -87, 1140, -61, 352, 618, -1347, -271, -542, -1431, 695, -61, -621, 96, -1482, -491, -570, -1100, 897, -68, -42, 628, -944, 143, 443, -430, 1849, 1103, -188, 1232, 123, 88, 611, -248, 1451, 302, -300, 744, -1248, -1042, 483, -871, 454, 190, -1183, -744, -1580, -741, 52, -808, 1112, 228, -1244, 683, -832, -1139, 1484, 829, 640, 1023, 403, 555, -1152, 316, 1937, -244, 1467, 1714, -1331, -541, -448, -634, 276, -168, 851, -486, -1789, 192, -1493, -1798, 1287, -110, -778, 626, -779, -630, -492, 818, 879, -496, 1357, 1434, -1732, 711, 1444, -555, 1251, 1526, 560, -240, -336, 694, -1032, -874, 1599, -556, -1039, 641, -1342, -1533, -142, -474, -92, -570, -55, -467, -1811, 438, 468, -878, 1798, 1091, -726, 753, 421, 243, 193, 849, 1984, -259, 46, 1433]
1176A433k502O13J875j936L38N23r99j55l60J115p9j274J728l30j513J965o43
1193b01o48J466l45K08k96R7P00j351R32J085k203J125O82j367N17K16m70K59
1211D06r03J185p83j321J773q57m89J375r93j59O78r39J072l28m9R82j255J070
1229D65K37j462J711l17p85J278p89J22K0m60R28q20p43J531j067l43P26r46O03
1248a11l74l96J101j483P72P24j190O51K80o75J368j025J20R70q19Q36k31o18
1266a00J200q68k15J627j723N03K96q45N84n61k75P43j250O00O48j677J489m14
1284b38r91R65m51L85L87r49J300m48k66J268j077N00O60j439J073o4n19J251
1302A347j109J61M44j466J051j5j272J636j209l58R16j030O07o0o02J220j041
$$ y = [1433, -1069, -456, 1419, -517, -179, 344, -655, -810, -1170, -55, -134, -1408, 320, -10, -1523, 442, -201, -849, 617, 272, 480, 184, 281, 981, -370, 562, 1647, -556, 569, 1251, -116, 401, 617, 147, 406, -497, 688, -95, -1416, 357, -500, -989, 386, -607, -766, -88, -1027, 45, -283, -332, 650, -605, 465, 702, -760, 951, 634, -151, 1127, 338, 460, 480, 20, 948, 128, -615, 916, -151, -494, 232, -714, -111, -485, -881, 220, -1263, -491, 233, -957, -306, -26, -701, 667, -358, -238, 732, -87, 749, 518, -100, 1100, 232, 17, 1644, -79, 424, 720, -125, 459, -102, -377, 366, -884, -284, 364, -1313, 176, -238, -1229, -264, -715, -330, 57, -892, 408, -40, -306, 962, -115, 385, 1045, -394, 679, 615, 96, 1347, 238, 399, 843, -623, 428, 413, -859, 777, -432, -790, 126, -904, -297, -357, -959, 261, -780]
1319g80J43P06p76O73N01q74R04l93q2Q92r13M01M29n56N31q72J64J193j623L21
1339a1O34j089N10j5p01J123j295L99N13j246J075j06p01J217q68J23Q98p90P10
1358C80J21o30J142p73M5R34j365Q66K49j196J008n08m26Q67r77M83k13o23P83
1377A67p00m22J081j120M09O65j181J392o37m07J224j000O65K76p21P00J03n03
1395iJ261j029K80M46j234R24m05n38J249r95k80P85j187O96j71o94R51q27r6
1414h73J029q00N5L42k64N56k10m1Q24j045P76M19j180J385m15m82R23q08R7K41
1434E29o87N38k54q97J343j198K93P17j372N46K28o54N99l30M90K12j032J084
1452A55n1m63R65l47l70P98q56O73k01k99O76n36J47O17r68L25K78j208P78R0
$$ y = [-780, -637, 69, -707, -34, 467, -407, 497, 104, 22, 914, 1, 402, 831, 275, 806, -66, 98, 1291, -332, -11, 623, -466, 44, 29, -672, 451, -844, -445, 68, -1178, -103, -209, -910, 307, -561, -438, 460, -330, 380, 501, -129, 1013, 240, 285, 1219, -146, 720, 969, -227, 781, 273, -153, 714, -263, 220, 7, -616, 167, -533, -955, 126, -994, -585, 80, -1101, 291, -346, -753, 471, -529, 136, 412, -309, 391, 494, -9, 1252, 223, 503, 949, -285, 639, 234, -304, 945, -50, -330, 455, -732, -36, -207, -901, 50, -777, -873, 156, -644, -589, -247, -511, 45, -165, -206, 618, -427, 349, 768, -412, 973, 558, 76, 999, 191, 288, 529, -158, 380, 126, -771, 572, -626, -333, 384, -988, -442, -214, -868, -269, -599, -109, 103, -929, 155, 104, -359, 606, 259, -111, 687, -169, 504, 303, 4, 680, 144, 291, 908, -60, 265, 543, -665, 113, 203]
1472B03p97N06m87M99k50o26J093r29k19J416j111K78P34o55M50M1j25P68r19
1491a30N84M95j087O60j01n03P84k24n79N18n54K52l67n70J054q96K6J023j209
1510h24L25N13p71P70m22K43J40p65J242K83j218J529p47l84Q20o55M13J96o38
1529E0O91p53j21O52r57L34K98n41O37m88p06O68o06N43K65q46J023l16q31J340
1549C36o81J81P31r02O73p5k95Q61p17N18L43j444R30K7n36O95l41m19N93j346
1569h68M55L11o48J054r35J22N85r25J81M12l26P71k82K3N25o00K95L64r08J188
1589G94r5o58R03q03j73N14n10P60n28o15Q32j239K04P25q40M71K58q81M36l70
1609h15N16K58p30J310o63q44J532m54n61J167j87J21l51m03R28r06J24J192j452
$$ y = [203, -594, -88, -575, -76, -326, -952, 141, -788, -1007, 409, -702, -424, 310, -345, 105, 146, 21, 789, -130, 454, 949, -138, 522, 421, -82, 702, 478, -101, 417, -137, 115, -252, -822, 232, -664, -638, 385, -824, -499, 14, -757, 13, -409, -166, -26, -791, 451, 734, -484, 1045, 298, -86, 734, 79, 492, 688, 50, 741, -12, -133, 519, -438, -104, 194, -347, 290, -198, -904, -236, -842, -299, -34, -880, 143, -173, -1004, 336, -345, -164, 567, -335, 338, 263, -32, 829, 112, 630, 973, -471, 459, 486, -50, 645, 304, -115, 478, -868, -413, -102, -750, 304, -631, -509, 76, -849, -668, -256, -582, 189, -93, -70, 455, -145, 150, 514, -394, 794, 699, 41, 944, 141, -32, 482, -28, 732, 204, -411, 421, -818, -614, 111, -729, -258, 0, -881, -445, -815, -299, -41, -771, 539, -124, -968, 564, 110, -451, 716, 529, 650, 299, -104, 824, -82, 42, 1234, -218]
1628b18M91L44j553M42M71m58M32l26N98l12q47J111n82l37J131n16m81P48l83
1647b45m9J63J31Q29r91N78M97j728J122O02j330Q33J56l43q1l74M41l88m36J136
1667E23q13k75Q06j010L85L21k71K12k52J48J58p76J040J00o82J166j22r71O54
1686C41L0K73R6l97K80j94p47O42q48M74O50q54M58K5j020L96P2P7l0l35P34k53
1708a30o82O22m48K52J118q39L75k85j46N95m96L25M01n83L37P9p02P53k94o66
1728d14O80n73j9K11n94Q43l16m12J096j104L5M66l52K67J19j05M09l71K74M89
1748F29j000Q64n4k94N12m83K90J11p65O30o2m57J73k97K6K99o41K82L52q42N59
1769a68j73k23O58n41N62K26p79Q57l84k88P14o03M61Ro14O62j75j3O17r05J48
$$ y = [-218, 273, 617, -936, -494, -23, -481, -49, -375, 223, -89, -936, 175, -407, -744, 387, -129, -610, 138, -245, -294, -131, 0, 829, -162, 416, 913, -815, 307, 909, -421, 412, 568, 225, 144, -230, 211, -177, -613, 523, -290, -565, 241, -769, -384, -63, -334, -122, -374, -226, -68, -844, 196, 296, -386, 780, 658, -313, 341, 371, 644, 740, 343, 623, 429, -318, 324, -524, -50, 600, -254, 204, 229, -791, -395, -323, -246, -276, -611, 123, -130, -812, -190, -638, -386, 732, -107, 268, -17, -163, 432, -64, 261, 662, 79, 416, 495, -207, 546, 252, -414, 266, -307, -326, -115, -709, 134, -182, -594, 502, -602, -567, -101, -453, -186, -67, -172, 237, -134, 140, 629, -371, 493, 439, 145, 657, 174, 464, 575, -190, 440, 378, -79, 94, -203, -177, 122, -519, -237, 115, -727, -168, -341, -564, 94, -447, 115, 341, -438, 419, 35, -253, 461, -142, 319, 328, -286, 376, 201, 188, 805, -100, 48]
1790D8N28p68N40n18m25J088r46J83K80r73R05l53l76O79l59K3M46j78M14j71
1810F7l33Q45o10J00N07o70L94K49n73M81m32l4O81q84O02j39o84N14l1l44J29
1831a65l45m9J77l59P17j35QM30o50L13K95p31O92J22k55J83Lk0L31n43L08N5
1853C82q95J275p18q7M27o70K55k71j9L88m87j9M56p81N27J42m08N78l04k66R68
1874D73p42K74K94k22K29k16l2P35j008N50j1o37O62k91k21L37n97K34K67p54
1894f76N48p0l33Q93q77N3N48r05Q48j25k25N43l15K30M62o69M93J07p54Q94m55
1915B15m11Q67o93M62r8p71O98l07j52M66n17l0K83q50O70l03K9N09m02KM91n13
1937c55M22R7l63P59m63J13K72o99P19k44j86Q19o62j30L80o98M65l25o8N51n63
$$ y = [48, 576, -192, 348, -170, -595, 493, -453, -270, 10, -963, -58, -411, -787, -108, -467, -444, 2, -176, 238, 67, -266, 579, -31, 69, 576, -94, 300, 549, -24, 457, 25, -9, 672, -212, 390, 251, -433, 81, 50, -294, -165, -510, -559, -382, -741, -24, -159, -151, 279, -371, -58, 237, -494, 198, 320, 65, 248, 251, 231, 562, 19, 327, 382, -513, 762, 44, -43, 384, -286, -31, -302, -321, 67, -420, -439, 17, -764, -237, -95, -503, 75, -229, -495, 473, -269, 5, 299, 77, 306, 90, 58, 793, -215, 335, 324, -313, 349, 58, -163, 174, -423, -189, 78, -676, -128, -198, -531, 362, -515, -462, 86, -819, 29, -96, -321, 222, -93, 137, 599, -70, 423, 530, -224, 670, 215, -196, 671, -22, 440, 342, -429, 269, -38, -190, 276, -241, -271, 12, -838, -168, -471, -442, 67, -335, -333, 158, -355, 67, 164, -199, 560, 97, 210, 482, -217, 502, 258, 72, 891, 229, 99, 479, -219, 246, -79, -147, 404, -159]
1958a59o2M22j083N89L05m99O30n19j05O35o86K50M60j87N27n67j24P31r59P10
1978C09K83m99O11l29j97J97n54M28L32o36L84q66J78K12m07N87N8l29P8m34j37
1999g31M60k32M15P48j062N58qo62R99m96K67N34m56M3m67j14M11k10J00O98r84
2020a89j29J64l95L25l4K29K83p48J20J8n16Q19k11M64K96q41L13K41m60N45j4
2041B80J63L14q64k04O14n47N70K34n97M77n69l65M62l22L14J27l46M04p04P6
2061d83P86q38O47j8j61N5m45K20M54j53N19Q7o98J87p5m85R58J1J37P8n62j66
2083E5m85J73M47m95M97J83j134K76J83k67L75J38m3L22r56P61k23l98J164n10
2103F3L47K69p66lL18j07L37n55N66J2o80J37L24n19K98M8n37K94k64J44K08m00
$$ y = [-159, -221, 201, -882, -293, 12, -487, 143, -376, -481, 154, -532, -282, 178, -9, 518, -49, -173, 558, -401, 309, 592, 93, 704, 375, 178, 375, -179, 249, 581, -55, 329, -537, -359, -147, -554, 33, 91, -238, -160, -594, -731, -271, -503, -88, 660, -402, 156, 148, -514, 485, -11, 256, 790, 334, 377, -90, -204, 207, -3, 97, 795, -189, -318, -154, -549, -224, -258, -29, 254, -494, -374, -356, -872, -53, -264, 200, 496, -345, -32, 209, -251, 294, 280, 443, 757, -107, -311, 303, -244, 326, 560, -37, 440, -129, -494, -32, -354, -40, 87, -259, 145, -559, -483, 303, -535, 112, 94, -67, -12, -457, -237, 217, 64, 583, 670, -28, 159, 84, -401, 557, 568, 705, 783, 221, 55, -430, -257, 190, -305, 192, 375, -759, -483, -300, -567, -192, -54, -97, 225, -731, 30, -193, -591, 573, 63, 410, 679, -87, -90, 228, 121, 458, -97, 469, 481, -199, -62, 262, -257, 41, 89, -448, -154, -418, -274, -66, -466]
2125d66O58l45l61N33m07K69M05k95M74m41K0P0o36O71N32q81P31oq52M37L4j51
2147gK52m78M96j63o00N92l24j67M93m40J23P1l15N36n11J37M42m96P22np31R44
2169E71k83k66O87p12L74o8l25M32n04R9M31o86Q5K53n41P01m21j29M04m53L43
2190hJ22q30O01J8k40N89k95JM15n93K40m9n1O73n81M9N38o55J97J69m99O39n08
2213e8j00J69l15K65p4o12R06l54l81O85n09r1L18l48O87n20L41L44n67M59L65
2234F10r75N89L08o72O97m20P2M7m50O61k57o74P70n97M4J04m0J43l78Q5M37n28
2256d24J55K71m48L56J14l23M90k6l43O00o0j65o5k32L82k53p1M10n69L65K1m57
2278b72N60n08n7M85o09J87K66m26L53q0l11N32j16l30M51n73P44q5m82P87o10
$$ y = [-466, 192, -153, -514, 19, -388, -119, 286, -9, 465, 24, 44, 114, -522, 149, 681, -200, 531, 525, -327, 110, 144, -7, 245, -233, 263, 100, -500, 92, -232, -399, 94, -346, -223, -152, -467, 69, -442, -305, 137, -359, 363, 358, -373, 571, 288, 22, 709, -3, 371, 303, -22, 410, -94, 5, 436, -250, -165, 88, -453, 248, -173, -302, 102, -351, -8, 114, -716, -115, -97, -337, 252, -43, -42, 373, -220, 20, -29, -80, 593, 12, 61, 599, -56, 141, 310, -189, 450, -58, -158, 11, -304, -39, -113, -725, 181, -173, -554, 131, -378, -469, -151, -499, 188, -332, 9, 353, -214, 245, 610, -365, 224, 532, -140, 557, 137, 209, 256, -194, 467, 210, -464, 306, -291, -247, -143, -183, -40, -418, -333, 104, -424, -269, 2, -446, -90, 24, -299, 191, 165, -178, 422, 362, 197, 132, -100, 282, 29, -42, 368, -201, 164, 185, -272, 288, -220, -277, 208, -401, -214, 52, -374, -21, -101, -412, 120, 4, -326, 125, -448, 296, 211, -271, 516, -94]
2299i4L17K04o60O07j05n69Q29m79K25j51m25L38J8l67L11j17J3Q5l14O6J14m66
2321f20K96J52m2M42m38K13J35n26M97K48j93M36n48L05om47L94k51k07O85l56
2342A69j36J75n42L47j10j12J94m89q2M84k86L44o2k57M40m35N71Q1n05L16L51
2363D56o27M96k01k26P08p10K28J25k67L74m72PM99p30L85j22k03M21m58j17N00
2384F6n04K93P5k86N40l33k45P36n44J63M11o28O48n1n50M31l28K06K95p35N86
2405B46j77k62L93m77O4J08j43J16Q6k33J44J2k72J95k45L78J24j90J17j06J7
2426a05J98l40L47L00o45O86k56j56N48o25L0K85n55L60O8m18N33n61J46J82l59
2447c37K98j04k29M71m51J33L47l10M66k90J32K77j08l02O99p53L22j38l41N20
$$ y = [-94, 223, 427, -233, 374, 269, -300, 529, 50, 275, 124, -301, 37, 55, -312, -1, -118, -105, -20, -334, -268, -154, -620, -324, -172, -214, 228, -210, 3, 138, -388, 109, 357, 164, 600, 52, 357, 351, -96, 298, 47, -160, 525, 169, 33, 208, -334, 13, -97, -209, -15, -504, -586, -102, -388, -44, -106, -363, 77, -358, 213, 294, -211, 105, 456, -171, 325, 124, -102, 606, -104, 124, 249, -18, 356, -116, -109, 390, -340, 45, -77, -280, 141, -317, -434, 66, -438, -145, -70, -356, 184, -149, -394, 342, -202, -39, 372, -256, 392, 341, -209, 222, -106, 100, 395, -340, 246, 69, -193, 200, -277, -213, -105, -248, -132, -46, -279, -135, -123, -395, -200, -445, -67, 57, -133, -16, -122, -105, 93, -247, 100, 400, -245, 441, 185, 29, 577, -48, -18, 267, -288, 72, 140, -278, 255, -306, -160, 22, -337, -39, -143, -372, 99, -352, -219, 128, -182, 284, -6, 126, 403, 295, -7, 692, -61, 261, 123, -218, 302]
2467C02j39l8K57n44J83O4l89N61m24j95L53l26J38K30l63L90k62K3N57p84L30
2488g6K40n22M63N7k56L71k97J33M78n06N34l89m26M92m51kN20l67L19n75l0O7
2510b23N6O6J44l89L16L9n62N93k58j73N73j71J99M4l39K13j79K5N51m21P0N9
2532B33l41O03j51j28J93m50nL8o37P53k89j45N08r9l28K58n44M52K17m6K96o93
2554c05L37p3k71O97p1l40L27j72L6k21j57M12J0K43j07l80j64K86m75J18M58
2575A88j76O9l08n6J17l08M15J33j75L35j79n14M28Q9J30J84n07Q50o59o01R53
2596D08n07J80N21o51q9N3r0L8j60M52o5n14O23k52n40M99J49k74K21j79J24o08
2618f61M69O37o61K42N99o80N8M22o38K76m8K67j42k08K86l03l70M48L6k51K95
$$ y = [302, 163, 125, 382, -162, 21, 85, -304, 257, -167, -362, -9, -335, -197, 33, -330, 60, -202, -179, 378, -406, -76, 164, -358, 105, 162, -94, 277, -20, 113, 591, 85, 619, 230, -196, 296, -155, -157, 363, -4, 315, -260, -290, -223, -167, -101, 43, -346, -30, 9, -553, 40, -218, -391, 182, 11, 210, 254, -85, 128, -51, -26, 525, 104, 174, 233, -108, 495, 344, 216, 409, -41, -46, -8, -645, 108, -181, -326, 182, 83, -245, 13, -531, -79, 138, 92, 388, -305, 32, -41, -312, 385, 314, -26, 301, 129, 165, -56, -213, 199, 209, 452, 345, -35, -199, 87, -388, -270, 188, 12, 81, -227, -283, -166, -474, -59, 74, -101, 234, 55, -459, -31, 58, 188, 372, -135, 715, 56, -545, 408, -99, 81, 602, -49, -138, -85, -175, -137, -297, 155, 90, -424, 199, -53, -593, -94, 55, -219, 2, -177, -53, -661, -192, 445, -216, 26, 625, -55, 3, 425, -213, 63, 15, 282, 140, -68, 218, -85, -455, -7, 29, -222, 73]
2639G3j14l06J09j47L27k06L05o5k94J17M20o11N17K30l95P4R0m5j9p1L67q2m14
2662a40K70k20L3P2JJ37M1m25J11m41J65N86p71Q19j85j78R7q4p6M78m38M05k64
2685gk1O54o43k4O69n92L74m2l33P5k49L01J39j60N1k12l37L77k45k15O16k85
2707a09n5O2l05L73j08j43L09l11K75J93m14K39N17l97J63P8j43j06JR1k04J00
2729A06J84m15k3N16l26qll19L54k90r5K12l29K88K95m84L47J34k70M74m06K61
2751B03rl52O01m31q0L83k86q1O10p54M72l37J59Q4m18K69J27o00N13M5m03L98
2773A13m19K12J56k17J15O6j06K58j93j77O61l77r0M50n23J62M3R2j1k00J13J18
2795B46o22M03L54o10L47k01O6J00m07M48k03n86J024o58N4K35k06L44J18m04
$$ y = [73, -41, -347, -238, -385, -58, -264, 41, -24, -318, -201, 219, -392, 125, 355, -40, 34, 124, 79, 60, -11, 356, 274, -140, 130, -90, -57, 15, 16, 153, 194, -231, -120, -561, -396, 190, -581, 238, 53, -125, -28, -112, -188, 290, -148, 257, -7, -28, 626, -17, -41, 628, 36, 410, 368, 35, 110, -139, 162, 301, 141, 192, -20, -357, 20, -225, -440, 176, -109, -164, -102, -407, -34, -142, -285, 24, -287, -12, 181, -233, 6, 523, 126, 289, 367, 224, 118, 119, 210, 6, 106, 290, -125, -148, 368, 42, 34, 31, -288, 66, -224, -319, -107, -436, -148, 147, -337, 10, 144, -126, 348, -58, 203, 194, -158, 443, 12, -68, 315, 29, -52, 558, -196, 276, -61, 98, 182, -236, 33, 160, -440, 73, 118, -285, 113, -306, -94, 62, -155, -40, 26, -80, 178, -15, -192, 469, 92, 2, 452, -71, 91, 134, 226, 215, 15, 128, 246, -376, 27, 381, -229, 118, -83, -17, 83, -324, 124, -79, -665, 359, -299, -245, -10, -216, 128, 246, -158]
2815a58N73l90Q8J59k04O3J06k59L10l14j92M71l24K63j50q5N6j1K1m4nj87Nn52
2839g60O33j84J72J43l69L61K6k49N19k01RJ58q3L6jk89K93j86j90K96k03q0L96
2862B47n68J80K15l23K91r1l95M52l10M85k07l38M87j81j9M47m95K43j39j8L5
2883bj1L8L07l91J55J04o4q9J3J9O1k49j9J88o24N44k37nL07k63P7J63j33K33
2907A22k24J77J12j70J62j78k98L96n8J0K27k70o1J8R6K74m31q8M68k09j33M9
2929il05K13J16l43M64j79k93L53m27K09M20l78J29K05r3J54l32K18R9l90O45
2950D76l76j77N25m32j25K34k50K83J9j72m2L2k17n0jK44J59l22K07j34R2J70
2972A43j97K95j82r4J19k55J41L71l55K20qk82K64k31R7o3j41L95j4m82L17k65
$$ y = [-158, 415, 25, 113, 272, 68, 131, 237, -22, 288, -26, -218, 253, -71, 192, 42, -43, 13, 2, 23, -21, -26, -213, -208, -760, -127, -311, -139, 4, -365, -4, 22, -227, 292, 91, 100, 258, 175, 211, 210, -79, 214, 28, -162, 134, -69, -149, 247, -321, -141, 74, -249, 42, -49, -444, 8, -302, 183, -24, -362, 125, -56, -75, 372, -123, 120, -19, -37, -2, -13, 25, 332, -59, 96, 200, 136, 47, 60, 79, 140, -109, -128, 60, -564, -20, -257, -262, 45, -218, -141, 22, -111, 122, -102, 75, 187, 17, 179, 1, -297, 99, 41, 51, 278, 8, -53, -35, 61, 335, -96, -184, 284, 75, -58, -9, -314, -101, 15, -328, 136, -43, -336, 17, -410, -201, 219, -159, -30, 175, 82, 236, -96, 122, 221, -169, 476, 100, -77, 448, 16, -109, 125, -125, 158, 177, 5, -37, -5, -222, -272, -273, -29, 130, -192, 15, -119, -27, 143, -54, 241, 59, -35, 84, -171, -30, 341, -14, 206, 198, -84, 180, -51, 46, -17, -158, 237, 223, -259, 58, -207]
2994b07k44N61n4k63J64k6Q6m06K44K49l74K26M09p37M09P0j21K06l17L04Ok98
3016a13K85j83N6L72o28J25L00k61J12j40J99q7l55L84o4j66J21r3k5M27jm05
3038a40K71k04K68k01l2M87n23L08P4k36L4M37l42RK04o03L68n43L13q6k45N04
3060A22n7l75M83k21l99M08k27M10l68N0K46p7j40L43k08P4L16k47r9k8J8K94
3082C18j71m7K71n65L05m78J08K89P5o9l3J02j03r5O7M52p36K54N37p29K46r4
3104i6k18L48j24K58L4l01N47l18m95P57j94j41Kq0j1MN7J15k85K60j09m00K93
3127i7j8m35N35J67k13j43N2J77k34K19K48k08j77M52m66N7K56n8L87l27P3j57
3149I0l85N07N4o19O03k14k96K59o6L2l90K55Q7k45K30J28k77Q3L83l42L2L33
$$ y = [-207, -451, 110, 56, -207, -43, -69, 17, -389, -145, 104, -270, -44, 365, -372, 37, 107, -14, 192, -125, 179, 185, -113, 172, -11, 45, 417, -211, -86, 214, -47, 65, -75, 124, 37, -318, 66, 2, -164, -43, -136, -161, 266, 265, -140, 131, -73, 195, -6, -38, 449, -74, 234, 308, 72, 106, 543, 201, 210, 414, -189, 179, -364, -51, -137, -382, 122, 65, -310, 173, -48, -447, -39, -266, 144, -224, -174, 72, -5, -145, 198, -10, 64, 380, 133, 34, 6, 24, 318, 147, 100, 371, -194, 111, -367, -259, 30, 105, 36, 3, 105, 2, -93, -26, 426, -310, -56, 481, -248, -2, -96, -314, 34, -90, 168, 202, -99, 448, 130, -365, 392, 198, 57, 59, -21, -32, -28, 29, 144, -141, 119, 10, -390, -97, -115, -550, -15, 152, -61, -204, -152, 25, -209, 10, 258, 50, -127, 325, -141, -84, 172, 114, 501, 174, 247, 90, -295, 212, 266, -353, 250, 36, -260, -1, -67, -35, -425, -170, -83, -328, -98, 30, -247, -164, 219, -123, -91, 242]
3171B42l88O16n51M14j87k66P3L32k37K33l10q1R6J61l14K39k04L35k76k60M67
3192A34j41p9%k18L91j88J01O3l24L04K05m06L19J5j81K63q5m4qLK69m84J6J22
3216D7j27l0K80k79k47lJ64J33j29K62Ll16J67p4j62K36J71k48K18j71K51J38
3238B84n01M53k74KM00k31q9m4J5L24k47m6Q4n82M30O5l17L63m37L87o5j09J08
3261b7k8k20L37j35L7K07j70J20o2m80O37k41J25J36k71J50k00K8j37M02n78N76
3283B06k94p3j7Q3r3J56P1M1j99k05L49l70K33K5m3R1J31n5M62o32K62o0q0L54
3307C43k61j22L69l20j35K36j17L3j79K5K0j09j20M31l31L46Ml51L39m40K16J35
3329A2j84K32N6p5K03l25K29K49l76J85n0j88J19k00J75J6q8J98J90n85L63j19
$$ y = [242, -146, 470, -81, 333, 146, -120, -47, 285, 48, 281, -29, -110, -14, 147, -167, 72, -132, 203, -73, -333, 134, -7, -86, -86, -304, 87, -101, 0, 63, -261, 43, 248, -158, 161, 176, -5, 258, 173, 129, 121, 124, 393, -91, -75, 47, -80, -110, 170, -109, -356, -359, -195, -62, -191, 71, 74, -242, -75, -149, -311, -75, 96, -152, 66, -105, 146, 284, -217, 236, -38, -36, 364, 133, 44, 0, 15, 339, 92, 46, 130, -452, -22, 43, -274, 89, -348, 39, -26, -135, -27, -55, -275, 62, -73, -36, 171, 1, 121, 59, -421, 216, -25, 100, 236, -35, 115, -85, -57, -194, 208, -370, 206, -88, -161, -178, -95, -188, -32, 39, 80, -119, -324, 25, -345, -112, -87, -130, -39, 92, 37, 499, -133, 129, 69, -11, 343, 82, -40, 329, 9, -126, 110, -7, 26, -153, -128, -108, -217, -337, 94, -237, 109, 113, -238, 101, -339, -123, 12, -172, 60, 116, 41, 244, -81, 148, 397, 21, 206, 156, -32, 87, -113, 62, 78, -10, 188, 378, -207, 156, 37]
3351C7k74M18m44L7K69k13K20j25k75M13q5j98M41m99L24J60k55L40k61J40R8
3372B68k35k5K66k38q0j48J28J66j92M0J20k74L68l04L6qm46O42j89j45PM01m0
3395A18r3L8K1J13l07J03O7j9J80k49M7J67k68K47m8j93J56k27K17N7j74K05q9
3418F9k91K89k29J65J2k50J99L0j86J29O8J69q3j42O9J87k31K17j85j47J70K0
3440D9K05m48L5K42k44o5N2j65J04j07K56Q0n0J12j77k39L62K1j21M56l31j3K10
3463B24p3p5n5J1J98p1j03R3m1j4J63j09Rj76o6O0O3j15m7j83L82l9n56N19l10
3488c11P7M44k68k03M55m97N61k89K90J93m40R5J28n33N32k13j36K94j5kk52J59
3510F9j50l4N3K05l30K14K05o84K94L3J39q0J09j41J29m8L37k00k22M29J3n80
$$ y = [37, -237, 181, -263, -226, 43, -170, 50, -75, -350, 63, -22, -220, 221, -278, 46, 206, -49, 291, 30, 170, 268, 33, 8, 274, 36, -44, -192, -64, 102, -90, -50, 70, -204, 164, -140, -104, -112, -558, 84, -105, -250, -243, 158, 118, 25, 63, 84, 197, -110, -7, 60, 41, 221, -28, 19, 186, -82, 165, 117, -76, 80, -147, 70, 127, -47, 158, 69, -222, 67, -162, 3, 15, -235, -36, -6, -192, -63, 5, 174, 91, -51, 18, 205, -26, 191, 6, -141, 29, 49, 254, -194, -159, 83, -161, -226, -174, -339, -235, -342, -86, -6, -56, 56, -121, -360, 2, 23, -98, 358, 27, 14, 224, 151, 76, 21, 32, 230, 159, 56, 149, 108, 94, 257, 148, 157, -19, -85, -25, 38, -77, -124, -307, 75, 36, -520, -1, -311, -234, 210, -58, -261, 194, -303, 258, -31, 259, 452, 12, 107, 235, -298, 234, 21, -115, 179, 164, 162, -90, 69, -81, -115, -62, 143, -187, 27, 232, -452, -158, -125, 14, -66, 43, -98, 31, -17, 320, 120, -102, 327, 340, -240]
3532b40J79O0o5K30J02j9l36JK33n76N05K61m10m9K85l15o9K46l8k52K69o9j6
3555h3p3M12k57KK53k24K07l20J1M36m76J30j1m0p8K60n97M90M9J02l5k73K12
3578I7k90K70R4k2j05J34n3j98k9j58K18l00L39K33l27K54N5n18M01M9O1j4j57
3601C4k67J92K1rm2J54J41n56L30p6q1j61J75J1N22o99J89R7l04M16q4q4L12j38
3625I3k00Q1J73J52q8l07K14j20J25r5k08J05Q6J20l07n0J79K71l61J18L0l58
3647c47M89l8l95L84j52L0J75k9o7k70M15k66j89O73j50l36J80J11l03J87j95
3668i3J80k79J63J23k54P7M17n65Q1K74k47k22K30J94j91l00M39N1l99N61J19
3689C59m61J16K69l9k94K58r4mk72M50l07m4L30j54m22L46QJ37n59M15k55j49
$$ y = [-240, -61, -1, -66, 164, 266, 247, -89, -88, 145, -431, 74, 335, -75, -124, 161, -154, -223, 23, -15, -267, 2, -67, -83, -156, 256, -1, 1, 254, 30, 237, -83, -72, 364, -112, 18, 7, -33, -111, 149, -448, 42, 91, 193, 158, -115, 97, -193, 77, 171, 149, 44, 178, 125, -73, -102, -260, -42, -342, -3, 230, -97, 157, 212, -306, 95, 144, 205, 191, 34, -233, -41, -20, -29, -71, 83, 224, -332, -2, -78, -159, -320, -145, -134, 388, -311, -122, -25, -329, 87, 3, -81, 231, 93, -107, -26, 147, 299, 211, -96, 118, -2, 123, 28, -180, -75, 11, 131, -176, -226, -47, 224, -137, -19, 11, -347, 142, 104, -291, 93, -59, -29, 146, 117, 50, -220, 195, -71, -260, 413, 263, -73, 107, 218, -85, 102, -93, 87, -192, -29, 94, -160, -83, 334, -231, -150, 124, -123, -345, -115, 79, -112, -412, 27, 78, -321, 240, 359, -102, 14, 283, 244, -50, 208, 114, 110, -162, 288, -19, -63, 267, 113, -309, 37, 45, 182, -377, 38, -217, -366]
3711c66N42j49k14J89oJ51k07K06l69J16N4J14P0j99K68n4n40N27j57J39j1L6
3733A40J4q9R7j78j87O2J09j99M06j56l09K63N2k82J16P3J30l86K61L78n24J25
3755h4L56k28J27o7j24Rm7Q7M5j1k1j8j21L42l00J2M63m28J14m27L06R2k4j43
3779i0Nk27M14k3j40K17j26O2o8o1K79K5l12K42k43R0J34l49R8m2K11j46J8j7
3803d9J17k02n9K89j88J28O5j88L36k55R5L9r2n5j21L7K45k96J07K25k03R8J20
3826A93m08N41l42J78o2j2o8p0k73K06n8J16J39l85K57j16J48K9k00J0N1L6j4
3849a04J90l66M04o9k90K82j51NK24k27L13j39l08L51j82J19J71j16lj76j4J86
3871A00l31N40j49n56M65k9l32M57Kq7j5k58K74q6n4J52j04L0J66k64J54p7o6
$$ y = [-366, 176, 27, -187, 2, -4, 147, -60, 146, -223, -107, -53, 61, 131, -68, 200, 146, -394, 133, -24, 115, 104, 140, 154, 65, 162, -16, -203, -141, -32, -231, 175, 19, -290, -27, 25, -257, -141, -68, 62, -324, -63, 315, -209, -84, 272, 44, 171, 104, -20, -11, -58, 29, 74, 63, 42, 24, -97, 245, -55, -43, 420, -8, 106, -321, -15, 77, 53, -90, -85, -312, 102, 79, -61, 156, 30, 92, 24, -37, 242, 267, -45, 197, -46, 44, 178, -171, -73, -115, 96, -50, -32, -49, 68, -134, -193, 96, -92, 36, 101, -87, 249, -6, 89, 128, 36, -19, -140, -103, 142, -154, -47, 178, -25, 73, 193, -215, 326, -16, 162, 100, 88, 20, -50, -323, -117, -175, -59, 80, -305, -48, -164, -16, 13, -187, -177, -126, -90, -104, 86, -280, 124, 55, -235, 47, -104, -99, 125, -102, 211, 72, -236, 115, -67, 52, 223, 107, 104, -72, -86, 100, -231, 309, 160, -396, 69, 40, -292, 165, 167, 80, 65, -193, 81, -5, -59, 93, -11, 19, 185, -79, 75, -2, -68]
3894f8L38l10P6L33m16N5P3k77J25o1J69j78J4q0N4J42n5J6j29L69k64J96j52
3917c0R2K2J08q0k1Nm7J65j67J08L7l13J01M3l6L6kK43k05l21K83o3r6K30l91
3942b99L20%k17R7J73P6j76m8K30o3l65K4K42j53K04k34L07j7k20M62m70J17q8
3965i8k00K66J17m09K90N8m3q4o0K17o9j74O06n67J94J23j14J63j86Mr8R4o5J34
3989I9k34J77r6N8l7j72QK25Q9j11j22n2J09L2j36k06J20J10K14j53q7L67j61
4012D1j24No0K02l06K23K26k21O6L2J25k66M7j33K41RM9l8j59J84m95J87J28j46
4036a83J57l4K1R4j92K45j40r1M51l11J22J50k66o2P2LJ67k67K45O5l65K48k4
4059A05m00L56K84m76J06K81k13J77k47J60q6j54J43J46m17L33j20R3N3L8j2l20
$$ y = [-68, 270, -40, 36, 369, -47, 8, 81, -196, -71, -132, 37, -141, -127, -207, -153, -11, -66, -50, -179, 190, -74, 122, -30, 62, 84, 192, 112, 91, 96, 49, 214, 47, 155, 192, -121, -20, 23, -13, 23, 21, 264, 59, -262, 21, -42, -138, 92, -299, 21, 21, -196, -99, 74, 150, -26, -74, 156, 93, -272, -248, -6, -159, 45, -189, 118, 101, -119, 343, -127, -10, -98, -298, -32, 85, -324, -34, 24, -19, -103, -163, 54, -15, -189, 417, -150, 44, 167, 53, 216, 30, 34, -64, 30, -35, 99, -135, 42, -54, 4, -33, -205, -197, 28, 117, 6, -116, -168, -59, -27, -163, -369, -249, -139, 75, -78, -165, 202, 41, -83, -78, -138, 64, -242, -19, 207, -14, 52, 84, 209, -57, -10, -143, 98, 107, 156, 118, -41, 143, -352, -165, -37, -183, -26, -60, -39, 55, -137, 108, -32, -123, 328, 17, 139, 289, 23, -39, 33, 36, 203, -64, 181, 246, -119, 129, 105, -295, 61, 345, -131, -25, 256, 43, 220, -27, 133, 47, -107, 36, 182, -235, 98, -22, 71, 124, 162, 150, -170]
4081a70M49j3l36M95m70j34K45r7m03L46K28j93j3J19l5r4j16K32j31m47O65j48
4103b1k54K69m7J00j07L3Lj09L37j72j34L28J4j83J92l36J98k81N50k90k59J74
4125EM11n64oJ61m13K01J78j54L29j74J31j31O9K11l62J15J75j60o0J42k25L76
4147B55j9J27k00j41j66K73n42M76J05m24L52k03J14n0l18K46j14j41M01j94o7
4168b30L93k06P2L02j84k03j0R0K15m60M23j15K59j86j87lJ96P6j57o2o8r3J45
4191GMJ39j89n8K19k17J99J14k27L6j18K2o5j08K25J63l36N44j79l18R0J90k41
4214a04P7L7K68n74M03P0l31J43l05J76J77R9n1j05k36J33J19k78N73m46k7L60
4236A78k69q4J11J89j09J6l99O65l82o7M00m36N68r4j84p3J8j82N4K84N0l51l7
$$ y = [-170, 279, 266, -70, 425, -45, -179, 66, -31, -434, -88, 140, -53, -66, 53, 18, -76, -192, 40, -91, -538, 127, -21, -275, -6, -53, 47, -60, -27, -24, -133, 204, 32, -102, 226, 240, 57, 249, -87, 111, -170, 380, 90, -169, 5, 416, -148, -154, 7, -406, -205, -27, -181, 148, -26, 105, -26, 43, 254, -108, 7, 182, 22, -38, 104, -121, 255, 236, 363, 163, 22, -144, 129, -413, 63, 168, -256, 96, -107, 7, -43, -361, -115, -229, -370, 31, -163, -230, 163, -43, 29, 331, 147, -56, -66, 24, 239, -221, 202, 87, 346, 160, -27, -30, 166, 242, 85, 23, -45, -138, 7, 11, 150, -39, -97, 122, -95, 104, 218, -9, 27, -91, -69, -134, -242, -17, 146, -190, 354, 175, -143, -53, 137, -104, -27, 10, 278, -296, 107, 177, -154, -11, -316, -140, 37, 136, 85, -20, -256, -123, -4, -282, 291, -155, -182, 178, -91, -175, -64, 125, 16, 32, -367, 298, -84, -151, 249, -187, 381, 287, 103, 30, 48, -134, -80, 204, 254, -97, -134]
4259a34J92k67j58M99j3k24L22k44Q7k06KJ48r9K5J68k91R3K97k03J20q4J36k08
4282d2J2L61k87j19J67k62J22j3j2m9m9J50P3l53L37j00MN9Om1K13k93p1L62m95
4307c20N18j55n2K66j36j06J3N2j85K45m6J48p8M5Oj27J11k57j62L29m92L22K12
4330A51l43J74K5j65l4P4k1M61l55k37N02m51J30J6K7J56k32j2M7k51N25j24j07
4353d4o6K6K45Nl80L8m1J83J5K4m7j07q4J21K5l24L12o7R3K43o5N3k09j10M25
4378B64n45K35j2m0R3K6j18J19Q2k94M4l3L26m13J59P5j4m5J67j07j0k78K31P5
4402a3j61J69J65j66L6J99m97L41J03j79K42k14j63K35k20P9J57m82L95k77j24
4423c75L26J66k37M5PK21k31n8J34k03K25k19J88K14N2r6o5n5k1l0J66J52j33
$$ y = [-134, 58, -209, -367, 132, 119, -105, 217, -27, 60, -146, -144, 4, -95, -70, 98, -193, -100, 197, -6, 114, 30, 166, -42, -30, 331, 44, -75, 92, -170, -48, -61, -73, -122, -171, -21, 52, -301, 36, -64, -60, -1, 5, -36, 177, -116, -187, 175, -320, 198, 43, -9, 257, 121, 15, 28, 80, -105, 140, 94, 242, 164, 209, 215, 88, 199, -58, -220, 109, -383, -61, 151, -192, -18, 7, -158, -192, -118, -139, 322, -33, -270, 232, -219, -89, -73, -46, 110, -122, -134, -87, -338, 187, 63, -44, -110, -84, 161, 166, -214, -176, -217, -34, -19, 5, -42, -149, -233, -112, -87, -411, -99, -166, -73, 170, 105, 158, -51, -161, 264, -281, -46, -58, -98, -5, 21, -97, 22, 104, -190, -146, -179, 147, -266, -107, -32, -46, -91, 76, -31, -41, -319, -88, -13, -174, -5, 160, -6, 30, 229, -268, 73, 176, -3, 239, 25, -138, 97, -123, -44, 113, -369, 26, -251, -375, -49, 117, -120, -75, -68, 153, -78, -136, -2, -205, 20, -199, -11, 203, 255, 159, 94, 39, 18, -12, 154, 306, 173]
4446A73j81J10p4k49J84P3p2qk83M12k87K55j72R4j12J57k63L13n8k27J30L86
4468C01Q1k26k05K48j51q3J73j38N0J13k45N6K75n22N46l12j12J07k64K90k10
4489b28J07K73k08j06J60k12L65k71k5L01j49j39K12J73k71K9R3j7j66j01K91
4510A11l31J47K49l12J45J9l27L24m3j65J91K95m28j04L68Q3n5j22O4l99L59P8
4532A47O4k64M3L57k30k41L42j58Q6j23j90Q0Q1j58L33M7j40J17l07K05k44J41
4554a2J69k86J48j32j14J59M84m20R6J86k74M7j17J4N35k50j34Mj73j4K42m8K24
4577C34o88O09l10k09J89J4n9J51J99l70K38j60J37J16m50K56K1J80J2m24L13
4598I9j12K96j02j88j2L3Lk1N5K5j5K3k58M4J09j9J43p8Kk01K9Q0j73L84r8l33
$$ y = [173, -8, 102, 28, -221, -37, 36, -36, -44, -327, 85, -202, 53, -119, -25, -137, 20, -243, 70, 12, -215, -85, 301, 382, 156, -49, 199, 48, -35, 138, 0, 50, 163, -82, -26, 249, -273, 273, -39, -151, -44, -308, -18, -228, -121, 152, -56, -162, -2, -214, 151, -120, -145, 156, 7, -132, 80, 253, -18, 11, 104, 87, -79, -180, 111, -220, -73, 176, -136, 9, 28, -299, 25, -18, -183, 8, 303, -125, -229, 139, 222, 167, 45, 109, -290, 69, 147, 211, -53, -10, 347, 117, -124, 218, 60, 146, 23, -167, -87, -6, -164, 169, 216, 76, 193, -114, 91, -153, -12, 157, -129, 19, -113, -227, -68, 416, -4, 92, 278, 4, 51, -66, -52, 483, 233, 99, 103, -70, -84, 158, 110, 334, -354, 255, -55, -264, -75, -61, -120, 31, 230, -140, 98, -62, 75, 191, -259, -3, 18, 198, 210, -214, 99, -13, 283, 181, -7, -19, 14, 17, -4, 51, 76, 61, 84, -174, -130, -21, -40, 103, 25, 27, -174, -145, -65, -238, 146, 48, -285]
4624b85M63k11l6o5J03k3K47l10L01k33j6K69k68J2K73o5J70k78j00J12j08R6
4646D8l0L5j16M6k08L14l40J49k39J90J16k31J3N05m24L34n7K05j95J38l39J5
4668g1n6K70k54Q4J10k18j08L71k71rK1o9N8L3j04k0J12L0O3k42k2N32k98ll7
4693i8J87K97j94k26J35M9r1j65K18K8j01j01j20K78l03L23j02J3J61l41N6k15
4715c12Q4L28k2k74R7m6K38k1l0R2k02K39r1M0r4K68l5k04j68O8p5L19j49j21
4739g1J88j86r4J13J02k37J75l4m5K76k38J46j53J1L60j78j73J77r1R4K7l34K73
4762A08k10J33O1j17J10Q9n0k99J50j46R9jQ0J66l81J20j10j11L01o7P1J5j36
4785a25K3m3N4K39k85K32J29k54J42l69J29M13n4j99J89j07q1p0m8K56j48m6K49
$$ y = [-285, 178, -33, -69, -134, -31, -54, 193, -117, 184, -49, -65, 204, -64, -52, 221, 156, 326, 48, -52, 60, -48, 48, 18, 53, -63, -17, -225, 89, -251, -102, -341, -151, -35, -266, -253, 252, -172, 162, 105, 310, 115, 253, -86, -71, -127, 143, -111, -27, 83, -135, -243, 128, -143, -152, -131, -200, -142, -109, -213, -233, -121, -91, -28, -270, -292, 240, -58, -61, -98, 89, 386, 192, -34, 101, 150, 59, -106, 112, 140, 39, -62, -182, 96, -207, 116, 14, 27, 188, -153, -97, -312, -228, 100, 78, -196, -99, -145, 93, 72, 42, 134, -68, 171, 80, 120, 26, 294, 259, 55, -113, -45, -120, 199, 50, -71, 117, -69, -163, -50, 52, -185, -10, -44, -89, 187, -51, 95, -58, -47, 313, 135, -38, 139, 48, 142, 169, -165, 108, -102, 31, 92, -25, 85, 174, 124, -175, -25, -171, -72, -73, 7, 173, -208, -88, -198, -309, -8, -75, -4, 11, -125, -102, -145, -91, 148, -137, 95, 224, -30, 112, -257, -128, 285, 231, 32, 221, 114, 33, -37, -85, 171, 23, -23, 226]
4808B26j80K19k85k31L29q4k64K72J80j31p0r1%M10n80R9J78K32j96J9J08r2j13
4831d5J03k26J37M3k28N26j52q2p1j90J62J80k14J33j06j05K32l32K80k22J13
4852f4ok7K57l14K56q6n0Q5p8o7J83J69j65o7rl04L22p0M6J26l58K22M8p9OJ06
4878H2n9K17k87Q8K7l10L51k72K71j88j5K60k02j82J80P5J7rJ3j28J86k04J85
4901I6R8k87K36k42J99j73n2L0J13k00j17L50j80K93j25j73n2K59k88q8K14L50
4923B61m4l46J87J6L2j35P6k22L37k56k1J88k40J31l9J31K3j84K27j34Rk76J67
4946a12J54k18K12r0o8L07j14p7p0J90j92J94qM6k54Q6Q0q5OL00n90J63L12j72
4970@j66J1j6K87j73o6K35j98L29k12oJ28r3k09K54l01J26K54j83J27p5j32L06
$$ y = [226, 46, 265, -20, -251, 78, -6, -270, 2, 182, 51, -19, -110, -110, 300, -280, -181, -3, 229, 33, 52, 160, 68, -45, 58, -168, -31, 12, -216, 310, 158, 76, 5, -185, -23, 157, -57, 76, -30, -135, 97, -235, 45, -177, -64, -70, -97, 160, -154, 102, 16, -34, 51, -27, -94, 89, 258, 93, 26, 17, -287, 35, -35, 11, 137, -221, 1, 49, -30, -24, 82, 23, 240, -47, 41, 68, -242, 109, -163, 108, -80, -95, 165, -37, -219, -39, 36, 53, 44, 57, -71, 115, -89, 96, 194, -93, 143, -99, 100, -73, -125, -95, 18, -182, -299, 51, -129, 164, 39, -134, -186, 73, -215, -303, -89, 261, 217, -129, 58, 74, 106, -29, 47, -175, 162, -94, -115, 73, -167, -36, -75, 56, 79, -105, 122, -12, -3, -279, -112, 42, -176, 36, -54, -122, 185, 71, -6, -76, 114, -78, 116, 108, 154, -100, -14, 66, -19, -13, 287, -303, -140, 172, 0, -166, -155, -171, 116, -57, -123, 112, -86, 243, 31, 25, 153, 60, -149, 105, -196, -70, 184, 1, 128, 53, -79, 227]
4993B27l37KK17R9j6j04Rk37J43Q6M4k76m5L60p0k2k72O3J33Q5J92k63n8M14m58
5018h4J27p6J50p9r0j43L32p1p3L9k9K7j98J58m5j93J41K16j66l4J88k82J92j48
5042a41m9M34n34K74Q5K30k34L2k64L46k12K03O2j61j4P9m7k54J38M0p8O3oP7
5066F9k4K49m96J48q8K21q4p2j54K53m1K7o9NL2J81k28KK01j64J71J93l05K12
5090B39o1oj13R9L23p56M13j18l06L77k29j1J76q9k21k8M71j21l16K68nk74n6
5113c44L49j31r4J96K87K35n25k32J82J33M8k4k7J6K27l10L5o9q8L21k70M8K89
5136B52k47n9j9r5J96j22L5R0O9k9q3N5K59k73j27N5O8L55l91L85l76J22k23p8
5160a81j2L35k1o6r1k31K80n1p7j03J95mJ11j64Q8j80Q9K43k46r7M16k29j12J48
$$ y = [227, -110, -108, 109, 208, 192, 88, 97, -140, 3, 89, 133, -143, -188, 172, 102, 80, -192, -129, 4, 89, 281, 18, -40, 374, -84, 43, -33, 117, 38, -52, -195, 137, 66, -7, 32, 3, 30, -168, -10, -55, -248, -107, 109, -57, -91, 97, -185, 7, -141, -190, 244, -290, -16, 69, 299, 65, 97, -167, 179, -33, 170, 232, 71, 57, 136, 89, -165, -27, 13, -65, -2, -8, 69, 45, 294, -202, -54, -142, 79, -5, -77, -231, 22, -19, 8, -61, -56, -24, 157, -71, -69, 132, -32, 139, 332, 27, 239, 178, 172, 59, 158, 481, -275, 138, 20, -286, 91, -138, -149, 27, -62, -283, -311, 160, 39, -277, -9, -14, -288, -344, 5, -126, -220, -24, 263, 498, -27, -259, -77, 56, 104, 80, 53, 69, 296, -14, 21, -48, -136, 185, -85, -37, 252, 5, -54, -73, -168, 28, -94, -59, 31, 100, 71, -12, 43, 302, 29, -98, -43, 25, 380, -11, 374, -2, 120, -103, -181, -193, 142, 121, 55, -36, -267, 13, -38, -115, -218, -23, -27, 84, -80, 8, -172, -83, 160, -86, -183, 233, 4, -108, 40]
5184D0j37P8M8NP1j24n6L3j1l4J30m0L2l20J24J56LJ14j07l13M30l31K2K03m8
5209c2J68M5l88J55Q6J34j59rj59J56K63k93Q4n2K99k34j33J37k56R3O1K29j53
5232D2Q0m2P2m00M1K89k85M24k05pn5j62M60m7n42P38j41k52J14l09r4L11r1k1
5256h2O6K25j33l67N42j49l12K75k16M8P2m4m2K49n2r9J23j71K36l25J63Q2k31
5279a42K17n4j16K78j87L4J26k41J06L7n2r1L6J86j62r5o7M6m0L51n03L19l8j44
5303a96L34k56k00K41R0J94N3l78J89l4O6N7j27K32j90j06J50N1r5j30QJ79r3
5326C9l58J94J70m36L94j88J94O1j95J88K25l33K00j45L8K32m10L62l40N7J98
5347A47j73r2J83j33J72J69j18kJ06l47J11q1K6J48j60K00p1j59J48m25L90j19
$$ y = [40, -97, -19, 29, 34, 105, -19, -75, -42, -53, -87, 43, 3, 35, -285, -161, -5, -2, 112, 5, -308, 122, -209, -187, 16, -32, 136, 181, -207, -52, 34, 168, 9, 0, -159, -3, 260, -33, 51, -1, 298, 64, -69, 68, -188, -95, -34, 195, 42, 122, 80, 152, -248, -207, 82, -203, 221, 16, 9, -46, -208, 252, 205, -337, 401, 260, 8, 122, -187, -281, 30, -61, -82, -16, 209, 76, -291, 251, 102, -210, 65, -151, -103, -31, -75, -117, 132, 80, -19, 104, -67, 169, -156, 7, 89, -142, 75, 21, -95, 183, -4, 30, 156, -85, 21, 58, 6, -85, -49, 137, -25, -120, -187, -141, -181, 170, -333, -14, -52, -196, 138, -118, -318, -77, 13, 207, 260, -118, 71, 37, 103, 160, 33, 265, 75, -31, 119, 170, 75, -55, -47, 132, 39, -319, -125, 45, -391, 3, -185, 9, 70, -125, 63, 288, -45, 155, 10, 48, 280, -130, 232, -108, -51, 147, -26, -118, 65, -68, 104, 273, 155, 153, 259, -88, 23, -58, -32, 116, -44, 156, 85, -74, 74, -351, 39, -80]
5369h0L11l42J38J68p2m29L67J97m49K87oj72M90n38L48n3j51J26k4j29J24K8
5391A39j45L7j10q4J58j42J02K54j95K31j80jlk35J76k9Q5J9q9k9j27J36J32M3
5415A43l37L47k83J06J12j45P5r3J45Q6k57J49j05l4k8L28k16o7J99p3k0j21L8
5438e1P0K7J59j45j04L10j72j41J06k14K14L4JK23k21k08L70l45M28l33p7O5J0
5461Fk13L75l41L85k80kk3k6K11r4L9q3J22j18K91l12l3J40k80K68J86k87N5K08
5485A94l49L03j39L0K33l34K88k23j08L57l31j24L78l65j6J47P5J41n9m7Q9l50
5507b10L07k0m9R3k04j9L83j84k34K27j48l6l7k8K93l06J82n0n2J34k38K12n3
5530c7j45J28M9k8N3J50l64M33n58M68j16k0M7p8k56N66k92KJ20k01K55l5m39
$$ y = [-80, 231, -111, 27, 195, 123, -306, 61, 258, -191, 96, 90, -82, 408, -130, 218, 165, 14, 140, 116, -13, 111, 139, -6, 31, -79, -163, -5, -147, -45, 209, 14, 245, 65, 64, 61, -174, 2, -27, 58, 77, -12, -41, -168, -32, 100, 143, -194, 153, -130, -24, 88, -57, 18, -75, 70, 156, -101, 48, -57, -91, -119, 209, -7, -74, 125, 52, 32, -89, -51, 19, 46, 205, 60, -44, 266, 94, -47, 59, -155, 59, 93, 94, 317, 96, -112, 258, -87, 341, 8, -69, -4, 6, -207, 168, -173, 212, -68, -70, -93, -119, 92, -2, 37, -46, 76, -42, 249, -63, -96, 44, -236, 32, 218, -69, -14, 194, -155, 148, 9, 39, 272, -62, 226, 3, -105, 252, -79, -203, 175, -190, -206, -59, 16, 157, 98, 51, 140, -210, 97, 77, 28, 121, -83, -102, 281, 97, -137, 90, -58, -94, -131, -159, 134, -172, 10, -40, -92, 42, -196, 16, -37, -182, -54, -5, -33, 20, 170, -194, 239, -319, 149, 33, 13, 60, -18, -274, 292, 0, 2, 122, -79, 176, 141, -298]
5553b98J08J31N4J21k27k6j16J19k6J47N1J05j81j18L21l77K16JN4j5j91J88J38
5576A79J22j67kK1K4j86K05m13R4k2K71j83q0R0k71L32l41K15K09j51O8K7m0q3
5600h2jJ39n1J44Q8l60J17j4J46K9k11J03r5o7J41N9j28m4J59k92M46j60k63o
5624b03L96l09lK22J68m80M34qm23K16J99k1j16j03K48P2j73k06K19j24j91K68
5646H2P0Jj93J99q6R7j95K9L9R3j78K9l7J39k64J17J6K82l95K29j44K85j93J00
5670A22O1k37K51j72J68j40r5o1M2j19p5K75Q7l34J42J52j49M4M3K27j95J22l49
5693a90J90O0Q8l23J14M9n5K34o6J62r0l17N0K93j65J13k34k9J99l42L45O3l33
5716a84J03j5k52P35k78k35j54M85J17l11j94L9J47j78L23j93J95k3k9j4J06j50
$$ y = [-298, -190, -59, -5, 116, -111, -137, -253, -134, -160, -13, 38, 143, -38, -156, 165, -212, 4, 5, 59, 44, -147, 41, 179, 301, 134, 132, 153, 177, -9, 196, -217, -123, -145, 126, -57, -137, -47, -318, 14, -327, -112, 97, -54, 14, 41, 1, -82, -83, 56, 5, 149, 237, -123, -6, -20, 126, 155, -56, 47, -48, -115, 26, 85, -43, -87, 72, -220, 226, 66, -197, -203, 193, -116, -119, 103, 271, -209, 225, 217, -206, 10, 209, 188, 72, -31, 217, 289, 116, -90, 129, 5, -186, 82, 152, 153, -40, 159, 73, 170, -25, 4, 43, 136, -42, -13, -50, 89, -175, -58, -42, 240, -155, 74, -70, 215, 22, 122, 183, -54, 197, 25, 193, 53, -42, -103, -61, -180, -255, 20, 107, -227, -85, 67, -82, -38, 5, 232, 37, 159, -190, 0, 60, 148, -175, -61, -12, -67, 167, 101, 263, 173, -144, -94, 199, 34, 147, -87, -116, 83, -259, 86, 149, -184, -81, -96, -348, 387, 109, -126, -280, 205, 322, 11, -183, -144, 3, -175, 148, -45, 150, 127, 98, 84, 190, 40]
5738D0P1j35J63Q0k96J59k38J14j22L77k93j70K8J82K87k55q0J71k09K0J74K5
5760I3Mk1k23J90p3O6k8LN04n73K80l58o7L46k72K33Kn5o4j54J48K50k75j3J60
5785A03L7k20P9j16K39K98n47N8n3K0L18k95K85m03J85l3J10j86K47k85K89j47
5807a7R6Q3j40R7o0k35P3J45k05K34l5l53M76k74J38k5J00k68K09L3k44K98P5
5830B01j27j40K61j16K0K76m73J59p4r6K99j96l73L92J12k84J12k02K52L2j89
5851a54J48o8j28N1J13J71lJ14j98l7l46L02J09k94J26J31j25J7p8L02j25J58
5873A86k50r4J52k82L78J52j01j58O1j02K18r8K03j29k82K88k82K67om7r4J47
5895A27r7RR8j15o7O7j78K61J07n96K76J4K28k20l2K17k40l7J1k0J57o6k09N32
$$ y = [40, 111, -24, 139, 219, -77, 82, -156, -42, -164, 213, -80, -250, -222, -40, 247, -8, -88, 83, -126, -106, 68, 93, 97, 76, -147, 43, -30, 36, 8, 11, 515, -58, 222, -136, -203, 143, -129, 104, 106, 51, -13, -167, -19, 231, -44, -57, 103, 140, -80, -1, -117, 122, 420, -127, -69, -122, -102, 216, -79, 206, -197, -12, -45, 65, -121, 126, -159, 130, -17, 79, 162, 22, 119, 59, -176, -103, 42, -163, 71, 36, -317, 159, -115, 23, -2, 98, -170, 39, 72, -172, 126, 201, 74, -66, 195, 79, 99, 375, -98, 61, -13, -109, 190, -6, -379, 13, 125, -159, -47, -249, 3, 35, -154, -6, -74, -202, -151, -38, 133, 130, 244, 46, 9, -337, -35, 74, -220, -94, 37, -88, -71, -149, 153, 28, 186, -64, -158, -6, -288, 90, 242, 141, -17, 44, -58, 160, 62, 265, 136, -146, 142, -140, 127, 121, 74, -20, 127, 30, 39, 137, 22, -45, 22, -156, 105, 212, -384, -108, -94, 134, -86, -118, 99, -141, -178, -167, -187, -30, -96, -305, 227]
5919B27j16K3R5m57K3J11J16k01J15k2O1o6K21j38M0Q9j01J08k50l0Q2J63j01
5942hj89n0J41l9L31j35R3l9J43n14O2L38k42Q0J3P1J66k89J28M9Rk59K41JL4
5967A36o7j17q6QK22p6P8j84o5P6L1M90o38M63l10n6M9n6M7P5M9o9MK0j07j88
5993b71M32j38j04K26l8lk02J85j21j08J08L35l87M3ml03N38m83M93j9k76J71
6015G4n1o8L1J07j99K50j98j21M45m62K19j37J03K05k94J77J69k40r5J98j19L7
6037C1J4l11K68j19J96n8k42o3J77n5L46k38O9J10j81p4m0M9J83j21J76L7R1k75
6061c0j4J12j68M9N2Qr9J25q7Q4Q9k04m2P8L7j34L56q3r2k57J76J68j96M0P2K0
6087F0j2Q0p3J89k53pJ23j94K10j82J15l9P0k93K4J55O2J27q7N1k27m0R3j87L70
$$ y = [227, 111, 134, 229, -228, -205, -94, 22, -179, -64, -86, -25, -91, 130, -8, 32, 121, 20, 128, -122, -152, -70, 93, -8, -197, -247, -106, -145, 186, 51, 144, 105, 248, -266, -204, 134, -108, -28, -15, 56, 222, -67, 61, 110, 119, -140, 101, 102, 136, 69, -48, -134, -126, 96, 20, 98, -86, -151, -75, -44, 446, -192, 271, -39, -95, -46, -102, -55, 20, 69, 0, 4, 24, -83, -271, 161, 23, -81, 145, 107, 104, -98, 87, -34, -142, -34, 301, -86, -43, -47, -350, 188, -295, 198, 179, -97, 74, 23, -45, -14, 93, -106, 144, -54, -175, 270, -192, 27, -110, -7, 198, -96, 81, 250, 10, -85, 113, -6, 31, 45, -266, 2, -117, 79, 21, -221, -284, -107, -162, 184, -54, 15, 125, -56, -130, -170, -121, 62, -59, 117, 154, 245, -30, -44, 68, -100, -51, 1, 9, -90, 35, -52, 32, 121, -83, -125, -47, -10, -144, 212, 129, 37, -220, -44, 124, -72, -32, 40, 60, 48, 128, 55, 244, -9, -16, 107, -87, 123, -59, 56, 17, 87, -206, -182, -27, 35, 162, 75, 126, -101, -141, -48, -235, 135]
6112A35j80J2Jk58L71m1j42J14l6j54L43k49P7J10j96k6K79k50K28j00p4k41M34
6135A57j56J45l26K65n5j74K13j54k9L2j36J90J07M1K1k44L57j28p7k24K95k34
6157a14q8J14K48J9j90k11K82L1Rl03J13Kpo8L28m2p0q5Q4j97J15Mo8j13Q7J97
6183G7n6j25k04Q2J87j51J42N9m6Q0j88O7J9J57l5k18J76Q8l88K23R8l1J81k70
6207g6oK4R5j5L2j08k9L4J23j30k34K25K43j69K5K3J3Kr1m1J12k05M9J54J35j73
6233A2m1K7J38l09L0K9N5l03M32q9J2l03K30J76j11J03j54k18L73K1k25J7j7K23
6257A08j81N5M4k46M29P6o53K81K60l47K07J68j05J26m35K35r3n9o3K61m9J5J86
6280B20j54j9J74j53K9j2NJ33k35J3o2J87k13k14M18q6j97K39l74L44j56k0L60
$$ y = [135, -45, -33, -32, -290, 81, 40, -102, 12, -24, -178, 165, -84, -7, 103, -93, -119, 160, -90, 138, 38, -36, -277, 157, 1, 146, -180, 85, 30, -144, 69, -85, -114, -82, -218, -28, 79, 120, 141, -103, 254, 126, 49, -175, 120, -114, -202, -88, 160, 179, -11, -222, 60, 91, 100, -203, -90, -88, -95, -163, 165, 123, 53, -32, 52, -145, -30, -26, -94, -207, -120, 77, 21, -104, -308, -226, -39, -190, -48, 11, -35, 45, -143, -76, -57, 100, 65, -153, 23, 111, -277, -54, 44, 13, 194, -76, -82, -58, 37, 22, 54, -54, -83, -49, 74, -56, -290, -65, 178, 9, 34, 57, 70, 72, -19, -60, 52, -153, -104, 50, 185, 12, -29, -2, 136, -173, -143, -114, -59, -362, 70, -19, -7, -310, -80, 96, -15, 88, -66, -284, 89, 110, -115, -98, -115, 108, -73, -18, 26, -220, 209, 285, -368, -87, 173, -174, 33, 201, 96, 222, -213, 22, -71, -130, -193, 68, 19, 34, 220, 66, 47, 221, 68, 97, 85, 90, 223, -12, 1, -61, 126, -87, -301, 117, 31, -166, 73, -301, 43, -113, -133, 227]
6303B27l37M3%L6J57N0n24L41j62J40J34K11j77j90P1J00k62L5K45j85J5J83j29
6326B2j87J50j57M07m00K45m4k12K27j11R4j06k29L91j58J86k9L1j18J13l66L48
6348I7J37l26K53l21J04L9r7J05J53JJ51m58J81n8J5J37j2k55RR3n0nmj27R5n8
6374b01N0nJ72J82l10J29L4N3m9j04L4LP4kO3k68J17J67k51M0p6L04j76j38J23
6399c5M3P4j59r6J83m0n9O3O7k60M95j64k84K9kK38j11n6J95k83J31J53k05j37
6423b20K76r8K17k24P4j0p3o0J84j62K54J69m35L16k12k83L09Oj9j53N7M13k65
6446F1K4O3O0k19J42m3M0l18J84q5J59J10Ok49m0J24j05Q3P3l45K48j12J55j20
6470a04J00j4OJ10K00k86N0j6kR8j50k6l4l8J06J75j31J42j30mL78n52N4j72K72
$$ y = [227, -110, -67, -67, -31, 126, 176, -348, -7, -169, -29, 105, 316, 139, -51, 20, 120, -142, -107, 138, -47, -32, 151, 22, -165, -15, -172, 235, -165, 80, 36, -176, 51, -60, 34, -72, -301, 90, -68, 118, 89, 120, 2, 115, -251, 97, 234, -92, 161, -160, -56, -17, -114, -9, 144, 145, 296, -162, 19, -39, -24, 113, 101, -154, -145, -52, -102, -107, -111, -238, -143, -201, -151, -156, 16, 198, -112, 17, 51, 104, 55, -49, -15, -12, 62, 60, 123, -145, -28, 139, -112, -72, -148, 156, -20, -158, -35, 8, 82, -77, -173, 10, -30, -89, -26, 41, -219, 276, 112, -172, -143, -145, 93, -18, -74, 121, -162, -31, 122, -83, -220, 56, -42, 175, -49, 25, 15, -58, -118, 66, -96, 158, 327, -108, 208, -4, -287, 22, 28, 9, -144, -87, 326, 61, 85, 148, 208, -11, 131, 88, 128, -190, -6, -91, 68, 178, 184, -65, -105, 19, -86, -3, 70, -275, -27, -139, 16, -104, -4, -18, -12, 98, 298, 12, 62, 46, 44, 142, -8, -34, -68, -106, 0, 175, 44, 186, 56, 52, 430, -122, -68, -240, 32]
6495C2n8P1n9%K22k09J81m22J88N0j11J70k17J88rk47J03m0K10L4o2K50l03J54
6519A16k91M41k14kk7J05o4n01N47j65J43q9j37m0K56J46j02q2qj02K03p5r6j64
6543b02K57O1k0l08K19k43L99j30K24Q4m52K86L2k42J56j74l4J20j54J17P5j71
6565a00o1J95m1J75j96L5K85k05l42J65N2O3M05l68N4j21q5K34j85O9j57K17j22
6588c4j10J62j99J1J20j30J14K52k4k07R6OK52j76k02O6r7NK52j46l6J11L7P1
6612A94k39J9j17L6n0P6k5Q9j98J20j03K12j81K28M3L1j48J51k99M7K30J35m32
6635a81L62j90J93J43m44K08k63J69k47K99J15q4j9J39k94J75K74l42J24m59M28
6656A06j38j14J78k42L24j15K97n54L02L1j38q2MK4K39k74J59O5j43K9K3j4P9
$$ y = [32, -26, 45, -14, -14, 208, -1, 180, -242, -54, -4, -115, 55, -162, 26, 17, -230, -127, -167, 43, 77, 15, 265, -38, 116, -175, 266, 52, 50, 23, 128, 64, -437, 110, -55, 88, -1, -138, -178, 78, 224, 122, 40, 32, -70, 133, 58, -38, -202, 55, 116, 96, -212, 7, -236, 163, 33, 257, 341, -111, 175, 207, -35, 121, -53, -87, 33, -121, -4, 71, -100, -161, 34, -7, 168, -28, 7, 292, 87, -255, -90, -38, 25, 430, 62, 116, -5, -90, 144, -41, 28, -129, 88, -34, -144, 18, -181, -170, -50, -180, -66, 186, 162, -45, 51, 57, 309, 133, -69, -3, -100, -95, 157, 11, -25, 86, 123, 194, -45, -26, -143, -107, -157, -81, -106, -17, -215, -95, -198, 14, -167, 61, 104, 135, -13, 138, -161, -114, 116, 251, -181, 181, -9, 184, 327, -117, 91, -172, -3, -250, 49, 164, 80, 61, 200, -94, 81, 355, 13, 137, -322, 106, -32, -146, 32, -210, 114, -1, 296, -258, 44, 75, -63, -145, -141, -117, 122, -152, 7, 72, -71, -42, -19, -33, 46]
6679D6j8J12l99L37Q0j44P1l0j21j52N8m9K64j82P8J23Mk29L01j03Q0j48p9L64
6703B64n05K16P1P6j1k87O6M7J89k40j15N7N19k63j86K80n3l04J84R6j43n0J49
6726E7o8j25j27L61J6o3K87m94L10l5k14K04k34P3K73k44r7R9J60j31J76k52P0
6749Bj24P6L26k74p4n4J27J32j80K65o9j18r3J27j61P6p4rJ37j23N8J4k2K37j78
6774B4J2j0J33Q5j44o5R3j65M0J82l6m4j09k51R9M8J6p5k0J25K34j11j30R6J22
6799A49Q8k87o8j91K28P4K14k27J34j71j7K25j93L5r6K51r2J3Nj54j12ol8K47
6823A1j51l7J71L5K0j02K16m78L00p0J94P0r6J56k61O4K20l09n7R7L2l2j94R2
6847a09L3P3k57L93l09M75k15k14J03l8M5mr7l4J84K54n31Q9J98p2M6j17K95j30
$$ y = [46, 28, 140, -259, 78, 158, 14, 85, 55, -66, -218, -160, -209, 55, -127, -49, 74, 78, -151, 150, 47, 127, -21, -100, 264, -241, -25, 46, 122, 111, -176, -110, -63, 126, -114, -229, -172, 347, 84, -102, 178, 125, -179, 5, 101, -42, -92, 57, -11, -136, -263, 98, 114, 51, 338, -156, 154, 119, -95, 109, -125, -52, 221, -23, -120, -21, 139, 8, 184, -68, 2, -122, -46, 280, 6, -68, -122, 5, 137, -43, 222, 153, 35, -58, 69, -92, -16, -90, -99, 38, -85, -27, -13, -35, 202, 24, 36, 26, 159, 244, 100, 35, 128, -37, 3, 185, 149, 105, -4, -255, -156, -108, -92, -167, -187, -62, 172, 61, -69, 27, 149, 237, -50, -118, -309, -81, -7, 207, -20, 114, -57, -74, 151, -42, -7, -103, 148, 56, 69, 74, -80, -192, -198, -236, 11, -140, -177, -6, 29, 49, -53, 163, -315, -15, -85, 109, 179, 83, 239, -22, 42, 262, -47, -104, -7, 25, -7, -201, -109, -76, -3, -260, 133, -176, 299, 84, -130, -27, -65, -20, -24, -121, -155, 29, 283, -248, -159, 39, -33, 13, -104, 191, 61]
6871F1j81L95l75K28j07K5m8J1k7O6k08L21qk40O8P4j03Q5j86J08m4J04L5J5Q4
6896A53j92j81J96k14R9K32m8J2j83r1N24m70K61k39K82j32P2J14O6m33K16j74
6918a30l93O09kqM6j97qK5j18J00K37j12J62j28Q7j99q3K20l48K64J58k97Q2m2
6942g5rK93j08Pl02J92j26L65m08K09m8M9m9J81k21R3M9k78L70l90M10j20j51
6965f7J70j13J79j91L1J88j84J0J0N9k06K61k88O5J54k45L01l14N6K15r5r6q6
6988a86L11k0k54L29j49j4j80L60j38q2J13n4j7J35j27k13K44k01J38k03K19K5
7010C6J14j99j27K56j89J55pj85K6K55j16j35J87r0Q5K25k06l0k00J89j49J41
7032C6J07o0j%K10j18j59m3j33O4kk2J3k6p7K74l65J07L34k18K55P0l10J39j73
$$ y = [61, -120, 275, -100, 128, 21, 46, -2, 9, -18, 48, -160, 161, 153, -87, -19, 55, -48, 37, -149, -41, -85, 19, 54, 69, 153, -39, -220, -24, -238, -139, 93, 45, 57, -126, -217, 307, -163, 98, -141, 141, 9, 81, 195, 261, -172, 44, -130, -523, 86, 84, 76, 122, -75, -83, -58, -176, -76, 161, 49, 211, 83, 170, -29, -112, 108, -240, 24, 182, -115, -33, -75, -84, 209, 101, 108, -194, -2, -128, 237, -171, 38, -10, 39, -10, 171, -50, 43, 92, -186, 184, -206, 204, 84, -67, 103, -10, 169, -22, 9, 197, 13, 23, 33, 92, -114, 147, -141, -76, 78, -167, 134, -180, -124, 91, -4, -100, -186, 125, 105, -149, 180, 31, 17, -163, 197, 59, -23, 90, 36, 19, 154, 27, -186, 58, -143, -5, -208, 11, 36, 150, -49, -176, 80, -109, 46, 39, -146, -120, 135, 19, -116, 71, -19, 66, 291, 85, 55, -145, 44, -105, 36, 143, 83, 82, 82, 292, 174, 15, -28, -161, -97, -99, -121, -108, -134, -211, 63, -302, -195, 139, -79, 176, 246, -64, 75, -98]
7057i8L21k67m7jj9J10k2L0J98k22K08j84M6P6j18J22J7j89K04k29k53J60L4L6
7081h7n7j51M73n4o4r1p1K36oj00R2O5k14j13J04K49k64J85l9k60L52j92j25J48
7105A6j25Ql0L05l22L76k30J18j10k6J30j03l08K50P7J36l35J88O6j16M59o02
7127a78M23l37J51q4r8L18m4k03K12j17j21n8K47k59K9L2p1O3M5j41J25O8K17
7150B19P7l77k0K39j17n7P5j31JK97j49J71k66j48Q7oK55p3O1k57O2L6q3P9K13
7175A88k91J49OJ86k86p8J57o5J33j35p2J67Ql0k14K03J48k11K85p3j51P4j04
7198fO4q8J54O8k00j4r4j88L74o4J02o6m3q7P5J91k49J95mM0j42NK78k81M3J86
7224B49m30K86Q3k20o7J85j35J70k35J46L0k35Nk5K03J3L4k29L08l55L92j24j3
$$ y = [-98, 223, -44, -91, -92, -111, -1, -23, 7, 205, -17, 191, 7, 53, 129, 11, 133, 150, -39, 165, -64, -317, -157, -123, -87, -144, -295, 178, 124, 60, -31, -102, 134, 128, 28, 120, 185, -29, -142, -38, 211, -53, 132, 93, -167, 185, -7, -132, 16, -109, -101, -131, 174, -148, 228, -2, 116, 6, -20, 110, 7, -301, -51, 26, 162, -173, 15, 81, -35, 424, -178, 245, -92, 59, -25, -123, 195, 151, -52, 160, 43, -78, -136, 111, -148, -119, -87, -158, -95, -50, -191, -66, 2, 219, 296, -81, -101, 138, 21, -36, 39, -92, -91, 206, 57, 228, -38, -186, -99, -105, 150, 77, 138, -119, -57, -21, -104, -25, 188, -103, 46, 52, 238, -48, -126, 31, -34, 99, -36, -108, 59, 67, 37, -177, 26, 174, -37, 248, 175, 24, 98, -6, 58, -30, 124, 192, -8, -22, -116, -304, 70, 6, 108, 42, -1, -88, -13, 178, -71, 124, 120, 160, 18, 23, 301, 20, 63, 249, -181, 105, 188, -32, -99, 86, -49, 121, -114, 32, 62, -173, -168, -193, 10, 23, 57, -172, 136, -219, 173, 49, 36]
7247C6L87l62J05Qk55L15m81J60OP6k52L33j04j97J53J78R0l57K94k07r8L07k95
7270a60m56N99j37O2J33N2k6o0p0OJ41m6j45N5P2K85l40R6k63l4L30j57J02P6
7294A15l1qj18j2O5J16j95k2j21J70j51K39J89l95P7M6j9k4j07J27O7j54M37j50
7318A41J0j01K26j99k3k35J06J91j72N8J05j59J04K30l48j47J31J28k25L20j13
7339B8N4n4O6j55J82N5l30K27j1j4L08l31K5j44J09Q7j84P8N0k27p6L04l4Nm07
7364c89L91k54J05L85m24oJ75n2n9J54j74J74p0Q6Kj56j89L41j31K79K37n38K09
7387I6J71m33M70l62J4K40m22K4L14l0n6j24j72L08j55J56K20k40R4l04J02K48
7409A59l02L07J39l67J73k09J05L8k31K62K61l53J25N2j24J35j79J56j88l6n8
$$ y = [36, 423, 61, 166, 174, -81, 234, -247, -87, -81, -5, -257, 76, -28, -225, -72, 106, 196, -161, 133, -74, -172, 135, -160, -616, -17, -154, -92, 41, 93, 67, 7, -63, -57, 84, 38, -107, -52, 20, 305, -35, 61, -202, -236, 94, -63, 39, 115, 84, 76, -42, -54, 11, 127, -68, -90, -211, -41, -192, 47, 236, -159, -82, -36, -55, -79, -186, -59, 8, -146, 291, 141, 151, 50, 276, 77, 54, -181, -75, 116, -56, 2, 107, -52, 52, 282, -66, -213, -82, 46, -179, 141, 28, 82, 28, 94, -61, 121, 176, -154, 73, 62, 48, 356, 25, 50, -94, 15, 102, -82, -4, 46, -181, -257, 47, 13, 18, -389, 2, -252, -147, 238, -186, -192, -17, -69, -128, 26, -148, 26, -44, 42, 44, -112, -301, 40, -91, 188, 425, -113, 96, 267, -166, 304, -58, -44, 196, -226, -202, 112, 82, 26, -98, -270, 38, -117, 39, 259, 19, 113, -191, -89, 159, -143, 164, 303, -64, 109, -100, 5, 43, -188, 74, 335, -18, 107, 159, 35, 170, -9, 147, -41, -77, -135]
7430a35m3O3j76K42qK24k22K8K21l98K27J90q1J80j44J02j95q4J03j15k03M21
7452A97j48qM2O3R3k02j56L49n09K99J51j03m6j16L53m46k7M44oj96J13k39J89
7475I1j6J74m61M04k52J22j17O1p5Q9J39k24R9k51L97k92K82m68K79J12j10P0
7497E3r3J45r9K13n18K56P8j60R3J94p8N9j90J68j94J20J4r8L05k73j30R2j93
7520b36L60k8j47J27j76R5p2j7m6K47l2k12O8mP5k68K38NO1K34k64RJ71k22n6
7545i0J87k43J51P5j18J12o2J65k83Mk43N57j98J56n3k91J98j54j44O55m12J4
7567a7J87n8m3M8J16r4k50J28m3j03m1L1J36N0J12j76Q3l65M87j12m2oj6N3J60
7592B25m16K82j55l6J02j12J26N2j81L20N3k05j42O1k61K59O4p2j5Q5K56l02j24
$$ y = [-135, -178, -115, -291, -49, -57, 167, -55, -27, 194, -204, 23, 213, 132, 312, 168, 270, 75, -9, 94, -21, -224, 197, 49, 41, 83, 146, 239, 37, -119, 230, -279, 20, 171, 68, 22, -94, 259, -187, -214, 230, 224, 28, 141, -98, 91, 75, 249, -212, 192, -60, 62, -55, 6, -69, 20, 159, -65, 34, -217, 180, -112, 170, -298, -19, 93, -17, 53, -40, 105, 6, 219, -299, -43, 35, -125, -32, 162, 84, 143, -47, 121, -73, 47, 61, -37, 268, -5, -135, -43, -236, 124, 96, -51, 76, -100, -5, -77, -94, -140, 107, 75, -137, -69, -73, 2, -266, -28, -23, 38, 272, 8, 17, 188, -34, -90, 97, -146, 5, 80, -38, 74, 12, 177, -106, -102, -345, 212, 14, 170, 117, -174, 24, -130, -274, 381, -31, -17, 170, 112, 69, 117, 233, 139, -111, 17, -26, -129, -170, -139, -3, 47, 159, -17, 66, -299, 188, 76, 34, 28, 12, 65, 225, -191, 91, -64, -100, 2, -110, 16, 68, -113, 207, 260, 55, -87, -26, -287, -28, 36, -36, -51, 34, 290, -12, -136]
7615a36J81m4j47Q0J17P0k66J10k03N0L39Jm72J82n4L36p2Pj9n1k51M52k25K33
7639B18j84k75M77l37o1L98k78L46k88J37k52J89Kj63J40k24j6J18N4P2j9j40
7661h6M2j75L04l41L67j02k03J80r7J45J48n8j70M7OJ51k58K35j72K86j83Kj33
7684f5LK93k05j3j68K80n7mj94L01j26p9r5P0J54j03J50Qk69nK17p2nj23j43N41
7710B91j75k12j7J69P5m25K37L3j0K24j70q8K29k72KJ48k58J91J90j12o1N4j28
7733h5J61j03J12j65L43j13P2k84K4L33j21m41J19J22R1o7o2K7n7k40L42Qj59
7756a43k1K57J35k21k15K42K6j39J6J24j75J86p2k5K89q7o8J17j29k63K14no2
7779a9J19L2K7k27j53L64j22J66j80L7k4j0l7J94k47K5P5kK46k13j5P8mk51M72
$$ y = [-136, 45, 1, -146, -66, 51, 121, -145, -35, -238, -188, 151, 152, -320, -138, -192, 144, 72, 79, 60, 9, -242, 210, -15, 218, 34, -241, 236, -101, -162, 236, -42, 304, 16, 153, -99, 90, 92, -71, 69, -155, -171, -53, 1, 73, 54, -86, -44, -219, 85, -256, 111, 9, -194, -14, -111, 34, 182, 124, -46, 1, 7, 158, -100, 135, -37, 249, 66, 68, -65, -62, 231, 26, 13, -155, 125, 68, 64, -130, 171, 45, -34, -129, -59, 95, -8, 142, 150, -119, -124, 93, 21, 16, -107, -250, 291, 116, -96, -113, 56, 131, -294, -57, -24, -34, 190, 20, -68, 161, -111, -109, 39, -219, -28, 162, 50, -11, 43, -85, 76, -27, 85, -80, 263, 150, 222, -62, -38, 295, 174, -267, -148, -26, 65, -2, -64, -37, -94, -334, 8, 16, -143, -164, 93, 228, 7, -208, 34, 60, -79, -63, 61, -114, 72, 0, -25, 264, 177, 109, 226, 97, -166, 48, 43, -19, 100, 132, 159, -68, -221, 143, 21, 187, 7, 44, 20, 10, -27, 167, -80, -55, 20, 18, 264, 51, 36, 114, 110, -141, 331]
7804C31n74K26nL5Oj6O5j02N5j06M3J43j18J53l15mQ6O9J81m32L87j39m8J05j25
7829i9m6L25l33J97R3j82J70q4m7K49l81R5J8J68K3J64O7l82j15J98r8J9K47M4
7853C10n66J30M9J14j89j2R5K20j80j24J36K43M0k08l2K6Q9p3o9k7j26L97k22
7876B1r4P0K04k56J47l6j81L15p3j21o6L08j16PR1j96n1J45q5j40N8R3q8R7M5
7901I8j67J85k1mj66K52J8k55R4oKj84J77O9j58J10j62J54j40J52n8j41J33J82
7925A64m8J17k86M03Q2n44K59k55J06J93j75N3j65J14k21K71J03K4j58j80K4R5
7947b4J79j51j46K64k45K1J98m42L75j00J00%k06Q4J44K55n60K37J37r8q7o9J89
7970E5q5r1j52L30l6j06J47l75M64k57o1J98j83J51q4J02j83J92j64L85l69L51
$$ y = [331, -243, -17, -22, 13, 19, 3, 68, -34, 21, -85, -42, 101, -17, 136, -179, -183, -97, -28, 153, -279, 108, -31, -79, 26, -99, -145, 180, -153, 44, 137, -45, 125, 41, -6, 243, -138, -43, -25, 143, 166, 330, 397, 15, -100, 98, 0, 19, 266, 310, -256, -126, -77, 37, -152, -164, -69, 151, -29, -153, -17, 226, 266, 58, 26, 52, 141, 68, -1, -28, -154, 243, 21, -73, -3, 201, -55, 92, 56, -125, 190, 117, -4, -70, 238, 122, 129, 220, 24, -27, 118, 33, -107, -49, 44, -44, 53, 98, -69, 116, 95, 91, -75, 177, 195, -60, 34, 28, 30, -154, 23, 92, -66, 44, -118, 36, -104, 48, -10, -151, -18, 164, 116, 233, -53, 350, 432, -112, 147, -108, -2, 191, 16, 69, -96, 18, -203, 68, 171, 195, 37, -143, -119, -24, 155, 4, -142, 122, -123, -102, 96, -346, 29, -71, 29, 29, -177, -93, 51, 306, -254, -17, 120, 22, -65, -134, 55, -30, -121, -273, 57, 21, -85, 62, -313, 151, -106, -167, 31, -152, -1, -85, 17, -166, 26, -138, 247, -122, 229]
7992B29m88J42M09l52k12M07P1l51K24k39L76j07k16J42N3l81M87j66J51j24r3
8013c8K2J27j88Q3J32j20m1M3j3p6K19k09m7J47J88l63R3K83l38O2J33P4j12K
8037F3j92J22J68l79K36j40Q8NN2j67K03l49J86J32q6J29J18k4o2M0k31J58N8
8060A28j74J46o4J09l34K71k72K04k2P7k70L14O8j56j76j5J36K47j82n7q0j4K08
8083I2n3k25J68J95j97M9K75k20j3J9o4j3j66J6N2J30R2J13j94L04k55k7q8o6
8107g6J32j29J54j59K55j96j8m0j1j53k0L48j60L09k22Rr1P3j3P4k23M11l02J83
8131A35j41J2K50l22L94k15j07njk13J67J12J0k31K74q9k9l3j48ON9K16O8o7l38
8156b36O0L56j47k87K57j94K33j81K01k9p6R4q2j56J62J15l65J85K24r8p6M0o7
$$ y = [229, -259, -117, 292, -60, -272, 135, 206, -145, 79, -160, 216, 109, -107, 35, 88, -293, 194, 28, 179, 55, -38, -16, 111, -77, 6, 138, 18, -23, 20, 7, -69, 150, -59, -106, 41, 229, -134, -41, 242, -96, -34, 99, 173, 61, 63, -129, -7, 161, -218, 18, -122, -34, -29, 23, -144, 59, -290, -104, 28, -58, 71, 189, 165, 103, 143, -88, 70, 128, -46, 100, 36, 145, -189, 82, -190, 14, -8, 69, -201, 113, 181, 25, -151, -166, -30, 217, 35, -22, -102, -116, 92, 39, -186, -18, 177, -20, 29, 304, 84, 71, 90, 26, 13, -153, -137, -85, 45, 137, 250, 56, 360, 105, 78, -10, -76, 56, -73, 81, -78, 177, -19, -37, -77, -88, -241, -261, 87, -73, 236, 14, 23, -68, 5, -8, 66, -157, 254, -48, 135, -6, 6, 256, -66, 328, 113, 6, 1, 0, -213, -46, 66, 76, -155, 119, 30, 1, -32, -180, -174, -115, 101, 169, 102, -236, -176, 180, 33, -254, 3, -191, 42, -139, 62, 33, -43, 51, -31, -187, -25, 90, -275, -90, 134, 36, -40, 0, -67]
8179f7J65j69m6J08J11K0j32O4J7o7q8J56
$$ y = [-67, 98, -71, -117, -9, 102, 122, -10, 54, 71, 4, -84, 72]
8191G2
$$ Imaginary data points
##PAGE= N=2
##DATA TABLE= (X++(I..I)), XYDATA
0@%%%%%%%%%%%%%%%%Qj6J6j6J6j6K0k8L2l4M2m8N5o3P2q4R3j05J19j34J50j68
38h9J88k07K30k60K88l15L47l87M27m68N18n70O26o91P65q45R33j034J150j283
58f77J438j623J846k124K481k953L607m578O168r198J6878p0271j23023J98670
72A6641P4252j02794m568N2201l6814j4836M0603k6209o2631P7153N1713n0750
84A3961r896j2374l1398K7008L8143j5984j6213K5227j3047m2128K4039L0632
96A7970m8280K0893N9694n7054l0697N1665o263n0796L8111P0181o0052n3883
108d8511O9243P762o8886K8343N2619k7654j8732J3680k610k6742J0322L3683
120B2517k0114q669J4538p797p06j3130j8082L3185K8986k9821k3135K2449J4767
$$ y = [0, 0, 0, 0, 0, 0, 0, 0, 0, 0, 0, 0, 0, 0, 0, 0, 0, 8, -8, 8, -8, 8, -8, 12, -16, 16, -18, 24, -24, 31, -32, 40, -44, 49, -56, 63, -71, 79, -89, 99, -108, 122, -138, 150, -165, 182, -205, 222, -246, 272, -298, 328, -363, 402, -443, 490, -544, 606, -677, 761, -862, 984, -1140, 1341, -1612, 1995, -2583, 3585, -5613, 11265, -59006, -182029, 16641, 90893, -11901, -16469, 35732, -1082, -15918, 24685, -1524, -64155, 12998, 64711, 13961, 4065, -8309, -39707, -12699, 25444, 9460, -6753, 18474, 5427, -36701, -12662, 17970, -30310, -9417, 50277, -6777, -37474, 14191, 7928, -42868, -4757, 65424, 5372, -48511, 20732, 28494, -40392, -12049, 40570, 12916, -5816, 7864, 5254, -21488, -11166, 22517, 2403, -6266, 8272, 475, -231, -13361, -31443, 1742, 30728, 907, -22228, 221, 14988]
133A4988l2915p585M7280j0621k4446K9141p307k8208J5537K3464j6537j8760
145a5969L0915J4513l9446p201K3092o381L769P956j4668m220K476Q407k886j1762
159a1405P883L843M903K451k4460L41K7422p053j2558J2577N399j0730q964J5896
173E545L548j8650J8435P928k5630P233J4560j3593j2721J3948J7302j5035j4868
186a1998J4014j963q360J0335n455q79R108p089l211Q47L213J10m437J1836m86
201E585j3774J1863L732j5184P950R390n927m926K353O419j0099l66J3309j2650
215b325k445J4265q681q478N632L662j257n939K470M345n787M645k461o864J4077
230D859j081r894O254J300n38m80K9L524n271L472O229j1461J799R634q529k97
$$ y = [14988, -17927, -25512, 21768, 11147, -13299, 15842, 8535, -19673, -4136, 19328, 2791, -15969, 14946, 29459, -9987, -17188, 5904, -477, 3292, 11248, -3420, -7640, -5164, 3243, 357, -11405, -3522, 321, 5224, 7675, -16785, -16444, 10978, 3925, -8633, 3944, 9343, -1387, -10351, 5545, 9093, -9557, 8878, 16806, -8824, -1591, 12969, -624, -13345, 603, 17905, 2870, -11998, 2016, 53, -8307, 2028, -3427, -4306, 4802, -2287, -5498, -4651, -1438, -1328, -5765, 6071, 5585, -8189, 3674, 7406, -7778, 172, 9562, 3635, -1291, 1062, 7481, -2618, -2984, 10325, -2325, -4770, 9495, 814, -7664, -2032, 1630, 373, -5566, -3096, 1249, -4538, 107, -2354, -9218, 4859, 3778, -6116, 138, 1438, 900, 420, 449, 3973, -1298, 2174, 8403, -3058, -1259, 8375, -154, -451]
246d51K858j094M43n028L018J013n344N971k956m059O892m093o84N485o007Q35
262c201M673j645R48m564M087M974p916M800J992o098O350r29l179K376k511K459
278B616j04m775M609k975k300M379m749K868N68o677O648J075n262J790n36L209
294C84L01m725N258j403k266P538m555j695M819k843K623j166l202M943l074j82
310G55J965m749L914j057m393O401m182l089N884l805l61J281j052L051m358J006
326b789N486n993K309L472m374L984o02j892L870l061J568J455m000L596j645
341A384j286L959n843J241M197n957J600J551l287J840k305J550J592n179M712
356b31J96m262N880k248j909M574k896J953O75k826L582j462K24K619m942L421
$$ y = [-451, 2407, 1313, 1756, -3272, -254, 759, -4585, 1386, -1570, -5629, 1263, -2830, -3514, 1971, -4036, -3201, 1472, -173, 775, -3789, 298, 5272, -2644, 2156, 4148, -1950, 4400, 3471, 292, 2668, 157, 2616, 2512, -2263, 2346, -629, -2929, 1450, -3299, -431, 137, -6540, 108, 1183, -4079, -2289, -2825, 384, 685, -4040, 1218, -185, -2451, 5087, 532, -1163, 3656, 813, 3436, 2270, -932, 4011, 937, 755, 2720, -2029, 1885, 828, -3565, 2836, -1346, -4435, 1449, -2356, -2717, -1436, -2488, 563, -3795, -2789, 2697, -3296, -987, 2485, -1889, 2095, 1493, -399, 3471, 410, 1978, 3433, -567, 3029, 1384, 98, 4057, -1786, -545, 3652, -2305, -705, 846, -2441, -601, -2906, -1356, 236, -4943, -231, -35, -4297, 1583, -665, -2574, 2000, -896, 1057, 1732, -1094, 2488, 1026, 1250, 3869, -1073, 2348]
372B348J670n792M685j030l796L215j444N1m83k676L863k856j424N400m642J74
388b737L411l493J831P06j225K776k684J850K636m392L517k32l080M995j870j635
404C74K178k947J656N39k214K443l776J31M054m835Q41P19k552M021j350j933
420b651J930k516K325K155l263K565j010n66L576k533J099J025l376M699j90l638
436c69K471k138Q43J775k767J943k398j247L893l950m11L246l639J653J476l300
452b919J080q34K165O56l194N000l5m534L657j279n11M586j827j029m1j72K278
469C047l448M34K813m364L082K328o358L90O84J57K349l089Q30l08k146M032j812
486a379j408M414l365JM138k990l79J20J944L505m085k38J594l342L772j27k414
$$ y = [2348, 4018, -1774, 2911, 1881, -1915, 1300, -144, -93, -576, -3252, 611, -2245, -3669, 1731, -2911, -2737, 674, -2819, -988, -282, -1507, 1269, -1415, 435, 3071, -1321, 2196, 1964, -1116, 3879, 2009, 374, 2552, -395, 1261, 1800, -414, 2029, -1747, -1616, 2438, -2397, -1556, -837, -3389, 632, -718, -2651, -721, -3237, -912, 1243, -2020, 545, -465, -1031, 2545, 12, 1111, 2136, -1240, 3459, 3269, -369, 2102, -36, 807, 2582, -185, 1758, -640, -1887, 2006, -1944, -2355, 891, -2748, -1095, 381, -2919, -1839, -2673, -508, 148, -3046, 1954, 1919, -2615, 1042, -237, -748, 3838, 2011, 982, 941, 769, 3047, -401, 33, 2846, -1518, 1564, 3892, -2466, -2076, -1392, -1235, 1114, -1975, -1145, -1453, -3599, 433, -1379, -2787, 1627, -1738, -1737, 2401, -589, -968, -848, 1096, 4601, 516, 278, 1872, -1470, 2302, 2175, -239]
503b39L854k208l016K146j573O21j248J12M323m086j088K799m427J216K672q40
519i82K731j660k279J646l31K823j724k663O368l75m342K399j307L56J195j593
535B62K218k085r00K692l932N43L051l903J389L21k137J817l96R71p72l951N251
552D39R72m166K751q91J32L583j514o69j667Q74M833m434p51M393m786L55M252
569C706k837j991q55K695J289l879K500j428m133O252m45n525K796K245n02o34
585g46o0J572m032K118O314n935m88N745l861j040J802r83k9P62K565l010m027
602c333O729j324o829N584P56m113K259R92k235j978K381L618n780P64M576m934
618b867K096L926n007J54L567m36j195p57L362j878k763O008k143m458M745j243
$$ y = [-239, 3615, 1407, -1609, 537, -1036, -415, -1663, -1551, 2772, -1314, -2402, 397, -4030, -2814, -142, -982, 1749, 89, -2190, -544, -875, 1948, 224, -2439, 3929, 3554, -788, 1611, 304, 660, 1855, 262, 2480, 395, -505, 2187, -1745, -1202, 1849, -2054, -665, -344, -2481, -664, -1060, -89, -861, -4812, 439, 1411, -2755, -4, -895, -763, 2820, 1306, 637, -1030, -156, 4677, 243, -508, 3885, -901, -546, 3706, 869, -1122, -1977, 718, 2007, -1872, 628, -800, -4933, 1319, 874, -4651, -1855, 390, -112, -746, -806, 766, -3266, -1148, 5166, -769, -1257, 4488, 627, -413, 1389, 406, 377, 1139, 3704, 694, -3333, 3396, 2072, -4757, 827, 1583, -2530, -271, 721, -1514, -3492, -1111, 2507, -3273, -2509, 2067, -2867, -771, 3155, -1852, -1698, 1869, 1433, 238, -519, 2843, 965, -1798, 4210, 2067, -2391, 2354, 1111]
634A111k342K650j176r92l64J767M76n328L160K700n473L013K517l769Q30J101
650a19o54k64J34L300j961j205M083l542j000M602k999p23K732p93n48k037R42
667e2R50k736K856L70m205L344p6l453J931K83j34M6m24J955k616m9L878k953
685a085M72L384l279N64R90n03Q90j083J749k95l074L062k43l188K841m32j272
702e02J119j817O75q30k06K655k730l45L159l052L06J656j260J643o36L19R28
719A082k088K044L96k339L077m15k200K335j089l46K06q99K016k224l94K642l321
736a517r1K444k631Q85L62n48J058j999J346Q07k300K611J98k011K357p94l88
753b11J556j372J430m43m60J555k125K45K516l395J202P37k240J373m39p39P41
$$ y = [1111, -1231, 1419, 243, -749, -1113, 654, 1130, -4198, -1038, 1662, -3811, -798, 1719, -2050, -1220, -119, -773, -1037, -903, 2397, 436, -769, 3314, -228, -1228, 3374, 375, -348, 2384, 1591, 1043, -994, -52, 898, -1838, 1018, 1388, -2817, 527, 451, -3002, -1071, -788, -922, -876, -1300, 655, -1961, -2010, 1868, -1085, -613, 2771, -508, 56, 1046, 543, 1433, 350, 2099, 1804, -1270, 1792, 1549, -1639, 1202, 770, -502, 617, -1200, -525, -1355, -1561, 1094, -1636, -1981, 1178, -1874, -1568, 88, -1172, 471, -165, 154, 1082, -1006, 1038, 1434, -905, 2172, 1757, -443, 1892, 803, 457, 663, -236, 1780, -444, -838, 1804, -1517, -1608, 836, -1795, -910, -548, -1096, -38, -2037, -691, 116, -2184, 427, 625, -1386, 971, 177, -211, 1345, -27, 1403, 960, 500, 2055, -70, 175, 2691, -704, 498, 1235, -1005, 368, -71, -810, -69]
770f9j703J821l58k329L180j398j221K591j330n6J478j371J291m70k58J900j968
787b70J074J144k386K069l25j907K059j044l21R04j706J104q99p67K117k090R
804a235J563k021Q55Q17j553J649j348N45J449j888J450N19j707K271j039k81
820D6J920j753M85Q69j729J199m49o27J418k135P57O73k474J901j0j809J747j391
838a362M66N33j464J823m13j142K202j582N03J602j786J500L08j745K109r66j69
855D17J107j612J495m80j392K119j547q51J893k313P18L04j140J490j038n91J800
872C79k053J096O61j589J839p16p22K450j376q3J506j455J568n75q48J533j476
889A39M87J262k641J625J13j905J728j290m19J165j670J330l42j292J896j594
$$ y = [-69, -1772, 49, -309, -2638, 542, -856, -2077, 514, -816, -872, 606, -765, 526, 56, -202, 1698, -270, 804, 1948, -438, 1631, 1306, -601, 1458, 414, 93, 997, -709, 395, -504, -1271, 846, -1244, -1235, 328, -1693, -838, -21, -1574, 75, -1273, -728, 721, -1167, 283, 802, -905, 1366, 327, 46, 1966, 213, 698, 1567, -162, 1037, 588, -39, 1379, -756, 1, 674, -1800, 101, 91, -1718, 29, -1362, -896, -363, -1827, -4, -417, -1559, 643, -939, -436, 1166, -620, 880, 1188, -557, 1552, 586, 417, 1524, -88, 1407, 927, -465, 1654, 107, -744, 1149, -1164, -446, -142, -1282, 208, -830, -1421, 379, -1674, -578, 83, -1506, 333, -383, -1105, 1345, -31, -114, 1392, -63, 1505, 930, 82, 1615, 139, 626, 1888, -753, 872, 985, -920, 808, -482, -901, 264, -1406, -76, -418, -1710, 186, -1408]
905a408K80J730k324J285Q71j417J199mM2J020j754J429K70j546J988j033p78
922a50J887j487J96J20j326J374r01l59J453k169O48P34j974J806q6j339J873
939C00j100j21Q15o86J714o75n75J978j861jJ694j824J336O25j431J044j169k34
957a71O37j112J616n34j578J743j351r99J772q93M58L85o73L50j065L04J671j335
975g75J497O53k629J620N2o06P90j71J048K23j937J471j307l71K041j477J11J164
993A397k432K81J47k12J045j189J035L45k530J430J62j042J976l25k76Q48j264
1010f04J108m26r0K165j706n59J654j790K70O25n00J490j376n16J045k085O54
1027f41P67j170J877p52j550J404j738P44Q89l61J212q64j007J592j286M48J518
$$ y = [-1408, -1128, 602, -1722, -437, 434, -983, 216, 212, 254, 1274, -480, 949, 1219, -327, 1661, 628, -150, 1737, 250, 446, 566, -760, 614, -287, -646, 807, -1362, -714, 20, -1954, -148, -234, -1573, 300, -800, -921, -106, -792, 922, 247, -328, 1650, -211, -212, 1482, -342, 994, 1619, 188, 1232, 63, -171, 466, -646, 970, 436, -1142, 601, -750, -1749, 23, -870, -412, -27, -700, -350, -1415, -1111, 560, -775, 722, 1375, -1254, 366, 418, -188, 602, 431, 1479, 1702, -235, 1236, -71, -442, 1599, 122, 233, 1397, -1035, -754, -607, -819, 226, -963, 72, 417, -2113, -683, -521, -1563, 413, 88, -188, 660, -604, 504, 78, -12, 2153, 447, -112, 1542, -248, 22, 647, 147, 1637, 261, -255, 790, -1295, -641, 126, -1044, 833, 81, -1469, -65, -1803, -1059, -170, -531, 681, -183, -1190, 402, -884, -436, 1082]
1044A082r84J002m41n16R09j297J80J479j791J653L0k066J035r91J34R55j430
1061a057J682l30j627J189r32p6J583j434J285J07j910J608l42l34J343l20Q31
1078A266k6j791J397q72j43K256j383j73P64k289O30r1L2J377j230O60j51k433
1096b200J530J81r86K421n72j311O48p34O21m48O10K655k194l03J809k479q4K166
1114A330p76N20m5l34l93j564J787j64j771L035j167k052J483o53p39R03M04N20
1132C24j396O83J277l124J766K285k790J126J336j706r0L91J171p74p05K164j216
1149G22k180K762j159j002K104j040o98O7n1K95j491J386J261k573J723N30k652
1166a996J451Q35p07K33N04Q04j528o07K670j707n10K625j389p24J080r81P1k1
$$ y = [1082, 98, 1100, 659, 143, 1052, -245, -65, 1414, -377, 1276, 1306, -760, 275, -716, -582, 373, -1057, 625, 295, -1332, -143, -1075, -1151, 432, -1002, 283, 390, -1520, 88, -254, -588, 755, 435, 1266, 1240, -551, 846, -26, -169, 2087, 704, 531, 1295, -994, -364, -455, -423, 954, -276, 384, 233, -2200, -670, -489, -1475, 946, 374, -937, -289, -1023, -402, -850, -240, 2415, 221, -82, 1727, -752, -836, 1330, 554, 1074, 1029, 695, 302, -1262, 525, 361, -1410, 1625, 458, -1594, -111, -764, -1503, -600, -196, 324, -1072, -389, 888, -2236, -470, 1815, -975, 151, 1487, -219, -309, 82, 1253, 479, -226, 1938, 722, -1458, 1304, 145, -857, 1247, 207, -491, -424, -475, -180, -1671, -285, 976, -1597, 126, 656, -1996, -545, 290, -417, -184, 320, 1124, -404, -1011, 1659, -48, -558, 2067, 678, -46, 1034, 53, 124, 103]
1184A03N13K22j616J028qj816J467K90j700J508j53p96M51j07P84p93RJ733j642
1203e23M0J794k112P50J169q68Q20r13N42L31j746J673j26j718J617m73j145J376
1221D88j257M89K12r48J087r33qJ254j590R19P33j700J390r6k93O72n98R72N1
1240H44j332J504l43r86J486o61l17N06p86Q45p47p61J578j242j36R75j531N72
1258e32K30m85R23o26k41Q34r27J059k10p83J675j034j49J298j064O09J06n14
1276A69R09q52l31J039j311N04O12j310R32l78n78P29j026N74K05j121J205k65
1294b94o21J278j064J84J092j122O87K3k21Q86j000O42O01j100N27L82j069J195
1312A006p93m32P41j140Q28l0j127J266o72l19Q83j241O72J35o74N55k73n6R80
$$ y = [103, 616, 838, -778, 250, 242, -1574, -107, 183, -1517, -9, -162, -958, -507, -614, 170, -623, -614, 1119, -523, -483, 1311, -801, -51, 1118, 250, 1070, 157, 699, 1030, -716, 957, 831, -887, 730, 257, -888, 488, -769, -280, -68, -1016, 71, -862, -870, 384, -1206, -287, 446, -1254, 136, 40, -253, 419, -179, 793, 844, -488, 1016, 673, -313, 1173, 512, 195, 701, -85, 760, 13, -748, 830, -412, -548, 427, -1104, -532, -302, -787, 136, -490, -731, 103, -824, 235, 25, -758, 917, -117, -266, 1032, -32, 577, 683, 169, 1078, 226, -105, 934, -377, 127, 739, -571, 361, -17, -595, 134, -892, -318, -113, -1234, -29, -294, -915, 363, -701, -517, 575, -547, 140, 163, -58, 828, -172, 470, 1071, -29, 498, 880, -189, 1006, 213, -219, 522, -618, 210, 180, -947, 319, -353, -672, 211, -1030, -358, -223, -897, -342, -615, -671, 309]
1331C09p28N08J85n98J185m36o20J262q45J19O56j172Q88j40p57J098q80k16P20
1350E38j023O21j49q85Q55l40l80P94n86N29M8j021J469q33l5J283j394P87N15
1369G93r88J134m62j43N69j248Q72j2q49Q52k47o15J010j112J31M75q18O45o9
1388h2o61R59r79L90M36j042J197k02l21J016o16J2P11r02Q25o7p30R99o32k8
1408B83M29j033N69N4r52R63p06k93R65q58K11J51p10J028o52k73J169j034N68
1427a21L12p07Q25J5n18R79p28P01k28r73J154j36q32J130j215J74J094j126L43
1446A43Kj22J27j010P82J55j510J368K95j113Q37J57m86N27o87O65j41j37J152
1465A004r22j01J118j192K68P59p33M99l93j46K03p12M23J53r70J072m22o50O59
$$ y = [309, -419, 89, 274, -324, 861, 425, -195, 1067, 222, 341, 997, -175, 713, 573, -184, 914, 34, -182, 538, -485, 136, -13, -898, -43, -383, -763, 31, -555, -26, 22, -999, 470, -363, -398, 885, -509, 278, 793, -195, 939, 477, 334, 903, -345, 527, 515, -334, 518, 271, -344, 666, -446, -315, 160, -658, -13, -82, -743, 216, -763, -373, 63, -979, 218, 16, -305, 711, 95, 107, 818, -84, 741, 674, -56, 943, 311, 283, 712, -321, 248, 302, -650, 313, -393, -686, 279, -579, -368, -217, -927, 101, -551, -824, 345, -689, -121, 191, -516, 309, 324, -194, 785, 57, 758, 530, -443, 711, 575, -257, 873, -342, -168, 926, -200, 143, 145, 23, 150, -860, -78, 77, -1433, -65, 230, -883, -46, 111, -375, 152, -535, 130, -11, -148, 1004, 82, -19, 1099, -93, 175, 934, 201, 700, 307, 161, 364, -348, 75, 228, -742, 330, -92, -742, -83]
1484h3l73r8L41m64O50n56K47Q62j102M56P04j016R79J9o95Q90l33l1J1m73Q09
1505G44m54n05Q94o87j76P28j317O73J88o17P34r59L08L99q46Q05O0r68R34J67
1525A05m01Q96n09J00K01m98P19k38m49J212r24J73N15j409M46J84j51N96r33
1544c65K07L61j188R83l22o42R72p51N6P18m77N48k16l60J068m25m02J085j176
1563c26J062k45o22N25m31J64P08o24L56l20o91R79p60p00J218p06L54K12r65
1582h12O11o47J02P94m53J80P63j317P49P8l10Q38k69O1K73o78P92n72l93J331
1602A121j053m20J145j291J84N28l39O28j138M50K15j117Q42M56j161J129k96
1619a17p04N35l09O12K4n7R35r53p7Q65r50J8J067o50M83k51l08q0p22Q64K85
$$ y = [-83, -456, -554, -213, -677, -27, -583, -336, 526, -576, -120, 584, -432, 547, 566, -129, 761, 428, 397, 408, -65, 744, 290, -215, 679, -8, -184, 544, -773, -100, 88, -529, 205, -754, -446, -47, -893, -88, -28, -996, -62, 105, -296, 600, 91, 191, 392, -106, 613, 375, -74, 1138, 214, 387, 902, -507, -61, 123, -28, 568, -365, -158, 203, -985, -2, -324, -966, 6, -745, -689, 29, -448, 100, -116, -476, 592, 167, -235, 850, -326, 736, 491, -131, 394, -37, 127, 835, 211, 567, 247, -444, 535, -225, -925, 293, -413, -59, 153, -812, -201, -848, -746, 48, -405, -225, 538, -779, -30, 48, -262, 576, 307, 368, 641, -37, 755, 183, -210, 1121, 68, -352, 793, -498, -314, 214, -125, 503, -635, -185, 30, -1087, -245, 211, -950, 179, -117, -821, -286, -595, 17, 41, -16, 919, -34, -111, 754, -196, -178, 889, 239, 722, 471, 163, 83, -639, 225, 510]
1640E10j061J006m7j470Q32k52j37L81n0L77p28J23R13j039L8J175p09J56M15
1659D33n63O76n02N38j86m04Q76k21r77J020m95r10J305m98k57j93m08P57p35
1678g44M27P50j282N56M7n01L77J92%N83n58L86r4n72R67l63j85R83p24q8O97
1699H54j199M44K70k59K66l62L1J89j209R06o9p73J223p24j99O57n36M15r3j27
1719b95N44m82o2R12q46K73N24l66K75k15k26O71o17N46op86O10k38n20N96m52
1740a60M8O5o18O75p26K22N00o31J67Q94j156O34K0k95Q75o66L29L97n02L24M2
1761D38n48Q78m23l68P42j116L87L19o73N65l40j61N71j024Q56r7q17P70k25N0
1781b16R8j55K03P4n21J118l30j12O68j022N47L12p14O73j23n11P13q36K15K46
$$ y = [510, -551, 455, 408, -1062, -230, -482, -619, -238, -288, 89, -639, -516, 397, -642, -604, 571, -138, 18, 433, -130, 546, 44, 582, 396, -8, 868, 647, -330, 690, 195, -715, 590, 92, -165, -358, -766, -9, -744, -317, 433, -849, -293, -246, -747, -370, -178, -178, 405, -153, 233, 139, -433, 534, 171, -14, 969, 245, 157, 854, -345, 99, 369, 110, 376, 14, 45, 234, -975, -69, -138, -911, 312, -412, -611, 46, -490, -75, -168, -295, 249, -233, -295, 617, -229, 44, 568, 202, 477, 262, 36, 707, 90, 636, 630, -156, 454, 216, -304, 292, -160, -112, -47, -665, 10, -716, -494, 6, -625, -458, 436, -720, -86, -66, -361, 514, -152, 177, 574, 72, 396, 438, -110, 768, 345, -23, 719, -397, -10, 309, -364, 201, -139, -300, 271, -753, 103, 6, -811, -41, -266, -216, -118, -273, -70, 4, -517, 601, 271, 159, 827, -195, 352, 664, -50, 623, 500, -11, 702, -134, 81, 327]
1801C27o83N25l87l65Q37p46K3M03n94M82oo62J162n69k93P24l57K53J3l60Q56
1822E83l81j21M35m12L63J08q11P30k38k47M45p05oL88n67N43k36m04N92r60N73
1843c28K71n50L84Q0l78P95n91J31O21p10P60j68m67P37l23j12M84o19L73j41
1863B49m65N50k15m02N72r69N10J25p92J013l22k02J24m64N33L5m52P21l21j37
1883c09P41o28L62L05o30O17j22l51N22n28J1O30q91P15m34l36L63p5l15L29n67
1904e91N17l4n57P34m77k22N70n28N16J24m79J035p44K13M33o32J91M25n65N42
1924D71k35l36O87l83j20L68j040Q62l27n80O01l35J04K90o61M69p4n1N75r27
1944f42M75J35k62O35m6o54P69l78L46M11o71M46K3q96N12o8r2K91l93L85k16
$$ y = [327, -356, 169, -218, -583, 254, -492, -469, -66, -660, -178, -184, -846, 316, -253, -546, 178, -179, 74, 87, -273, 583, 202, 81, 516, 104, 467, 575, -236, 494, 256, 9, 454, -251, -257, 131, -436, 107, -129, -533, 59, -901, -328, -57, -607, -223, -143, -521, 274, -317, -186, 435, -275, 485, 317, -150, 587, 264, 152, 636, 17, 390, 249, -216, 334, 119, -283, 289, -680, -170, -45, -837, 176, -146, -348, -224, -688, -155, -120, -572, 149, -172, -309, 432, -196, 166, 471, -159, 458, 336, -15, 507, -21, -10, 620, -271, 444, 10, -326, 37, -38, -353, -24, -591, -74, -108, -665, 69, -408, -630, -60, -588, -72, 52, -427, 608, -136, 77, 510, -122, 69, 494, -71, 471, 236, -100, 587, 204, 84, 452, -588, 274, -53, -633, -32, -367, -263, 27, -634, -165, -239, -290, 285, -642, -167, -32, -294, 341, 295, -359, 410, 32, 378, 789, 118, 564, 587, -309, 203, 135, 43, 334, -59, 326, 110]
1965A10p42N40r6k44N26m96K79p6n67Q34m28j1Q39n26j9K55p88R67j77N3L95l17
1987C11j5J46l44L23k72k4M05m46j56P3m46K18J27m82O09m41l47M12l41O00K73
2008A83n08M77l74K4qj08P62J93p81P88n47l00N03o5J56K40j74j11o52j07K37
2029a72k31L69N21r96N78l45n16O74l16N47J29m83K91m82m4R41l68O4P34p80K4
2050A39M2j53O69n55L37J59p74K71l15k74J056o45q9J21o62L47Rk94R31l77J32
2071G5R6p95N71M9n30P38J53j89K65q46M07J48k71R04l09r0O66j414K42K68j86
2092d8K85n5j22O0m93k0L00q03R80J80q27M91l9k90N12j95K06k6j82N65o53J12
2114f2O28p28K93N08o95J79q5L53J08p07P75m26j014Q24j75k59P89m30m0J83n28
$$ y = [110, -632, -92, -188, -432, 94, -402, -123, -199, -766, 68, -360, -371, 468, -58, -77, 178, -610, 357, 180, 233, 628, 311, 296, 442, 98, 421, 149, 125, 530, 84, -72, 1, -445, -227, -100, -582, 27, -414, -761, -349, -690, -90, 183, -325, 152, -222, -198, -206, -314, 448, 641, -140, 648, 101, -199, 304, 239, 395, 635, 461, 350, -302, -409, -172, -403, -34, 487, -509, 69, -276, -792, -118, -434, 113, 242, -241, 50, -432, -476, 465, 97, 161, 895, 115, 139, 181, 28, 697, 142, 479, 638, -136, 135, -180, -454, 602, -43, -132, -11, -673, -326, -317, -611, 320, -57, 75, 171, -624, -53, -4, -534, 204, 357, 168, 433, -413, -6, 142, -129, 775, 466, 376, 1042, -372, -130, 138, -48, 237, 182, 60, 120, -373, -393, -93, -896, 84, 264, -563, -72, -111, -401, 111, -84, 122, 96, -86, 479, -174, -62, 566, -162, 131, 639, -56, 123, 38, 391, 499, -208, 567, 141, -873, -49, -224, -483, 306, -124, -164, 19, -509]
2135e09N24n03K37O62n42P8L93o68P6O40k44M65m20RL71o44L11k78K4O05n40l04
2157b57M47l29N8j2k78K46l94J09L43m27L99J32l14L33k12l00O00l96M48R0m31
2178a45L73k0k66P05m54J28L37p09L39j37k94N00n90M83j84l84K46j31j6R9j95
2199c15R0L57o14Q40m79l26P84m74Q0M16l55Q7N35n87K83k4n5J62l40K01j14l56
2221b04M39l07l36N99k34n3l2k05N30m92k39O21o19N05L83p59N02n1k7L23l10
2242C4K43j61j85O88m84l92P65l78M0L01l59J24k62P9J28n25J71K88n68L37o6
2263a82l54L81j59K50L75p32P66j55l41M03l32OK72k20J20J94k08M21j47k01M4
2284B01k51R4J57o31P53m26l65N69m08O1K00l38L98j00l52P82l66J20K97o72N63
$$ y = [-509, 15, -488, -251, 411, -131, -53, 340, -328, -252, 388, 144, 609, 189, 198, 569, -75, 236, -42, -18, 587, 47, -257, 190, -139, -81, -93, -371, -125, -519, -410, -67, -494, -95, 37, -277, 56, -156, -456, 144, -252, 196, 286, -145, 228, 208, -58, 647, 193, 321, 658, -51, 288, 151, -143, 357, -233, 250, 66, -318, -72, -203, -219, -120, -315, -225, 132, -482, 358, -121, -447, 337, -137, -57, 359, 4, 91, 626, 39, 322, 298, 243, 405, 65, 266, 152, -204, 235, -72, -408, 191, -43, -96, -128, -333, 197, -295, -534, 87, -532, -27, 356, -403, 99, 48, 21, 344, 34, 277, 116, -69, 619, 135, -257, 508, 130, 170, 471, 112, 236, -26, 53, 181, -344, -173, 115, -453, -116, -182, -536, -155, -314, -64, 311, -421, 345, 190, -151, 252, -80, -74, 198, -22, 98, 292, 84, 505, 358, 157, 201, -50, 44, 201, -430, 323, -103, -468, 101, -307, -246, -46, -384, 14, -86, -438, 344, -22, 98, 395, -277, 286]
2305B86Jn50P60m78J09J07l03N73l29n13Q70o51r4M97m83K71J39q84Q74m55j99
2326d52M87n98M44Q3j55N62l81j91O97q90M69O0r4M27k86l37M72l45M7M47n83
2347a17L63m4k55O60o14r5K9m78N83p5o0K98m40j71L99m76P08l27l13O79l83k7
2369a56N47o67N12J15k60L55m76o8O97n72R7J89m22K68k28kL03k58J98k15l66
2390d09K40l56J10M36p6j25p3J89O7p7K48K20p17N11J08l11K52J70k49J42j43
2411A57J10K63o97L20j25l53M25l64j25M16m28J07J78m37L18j44K49J29m09L84
2431b6J94m33M02L6m45P41m49J73j85O1M38l44l6M19p54K56K11n12M97k41m33
2452d30N01k11P4o8k9L68n6o82P26l91J0M52l28n6L87m7m5l75K09M70l01J43O9
$$ y = [286, 287, -263, 497, 19, 128, 235, -68, 505, 176, -337, 533, -118, -212, 285, -198, 73, 212, -672, 202, -253, -452, 35, -563, -119, -36, -191, 371, -10, -201, 496, -394, 75, 135, 41, 468, 182, -155, 317, -28, 19, 466, -117, 246, 202, -53, 607, -7, -102, -73, -551, 32, -43, -103, 195, -245, -416, -17, -493, 215, -112, -425, 254, -129, -156, 391, -276, 236, 351, 91, 446, -30, -98, 599, 27, 124, 313, -109, 159, -69, -71, 232, -26, 172, -43, -409, -169, -525, -415, 21, -55, -180, -253, -64, 3, -74, 174, 394, -323, 188, 296, -15, 237, 407, 158, 300, 157, 267, 530, -167, 153, 28, -325, 100, -264, -389, 27, -401, -294, -116, -553, -235, -379, -130, -1, -410, -26, 168, -265, 137, 173, -272, 469, 20, 193, 8, 69, 507, 163, 127, 546, -208, 48, 259, -253, 244, 3, -430, 71, -140, -66, -134, -163, 205, 149, -533, 193, -198, -188, 264, -64, -120, 267, 220, 175, -200, 9, 479, 178, 321, 390]
2475C90m23L89j36m28L77k25j8j6n28O06k44J08N15o24M6l3k86K97P6N2J40j10
2497g5J90K26p07N85l5j1M17n23J71P2m75K91o5k63P60n75o8J4m45L15K26j75
2519a50J90j49j86K53m92L29L53n04O19m85K6O07p13L11O22o45J56k2j71K41m45
2540b55O86j24m52N86m73k32L29j35L9K11j96M2m50J1M28m59J43M47k84L38o2
2561A38l69M9j2K10K84k00L65k20k86M00k68k3L38k70J19m03n4K09l20K02M20
2582C09o85K70L61n57j27N89m17K69j84J97l9n11O54J0j88P30n60k98L78n9K73
2603D15k05K32q4o02L42M6o87O65M8m42J71j36J94k23k48Q80m26l66P59p03k16
2624e86O90k79jL60j87K99m24Q9N52o57M95K08n75N18k15m13P5J24N1k38k47M56
$$ y = [390, -33, 356, 220, -208, 169, -56, -74, -90, -618, -12, -256, -148, 367, -257, -211, -244, -530, -233, -157, -105, 35, -75, 115, 341, -366, 219, 184, 173, 590, 67, 238, 310, -165, 126, 61, -202, 558, -17, -85, -71, -516, -201, 25, -150, 40, -109, -295, -42, -534, -205, 148, -356, 263, -222, -196, 411, -302, 9, 631, -14, 142, 120, -51, 190, -255, 431, 307, -145, 441, -32, -264, 65, -70, -31, 180, -16, 26, -424, -413, 15, -444, -301, 146, -138, 200, 138, -231, -182, -194, 16, 300, 100, 465, 245, -41, 359, 91, 68, 406, 136, 255, -148, -202, 7, -313, -111, 309, -376, -106, 255, -302, -429, 160, -257, 12, -172, 25, -14, -525, 129, 139, -49, 681, 121, -177, 201, 142, 415, 210, 442, 358, -244, 98, 144, -543, 122, 170, -272, -101, -237, -43, -266, -514, 366, -60, -426, 333, -370, -586, 104, -175, -176, 184, -3, 296, -128, -39, 513, -144, 351, 559, -16, 502, 287, -126, -51, 73, 124, -114, -361, 95]
2646I5j85k19K80n4k75L95l09J93k08R1K08l00L52K87o29M32p1m60R20k01n5J53
2668D40m54J70k55l96Q85m88j14P69p26k76L35j38M15r3k83K2l41K29K33k96M41
2689G9r8k81O94j34l93J41mN1J49j79M82o02K22J28l99L58l12j3K18p0o7N0l05
2712b85L16l05%L47k51j12M04m46K06L10k25J44j80J57J09j28K22N7m39L39j79
2733F1j42L73J4l12J51l07K66j38j57L69l37L9J05l77L19j56l6L70n51L95J01
2754E0m43N30q0j76M55j13j83J29j41R7n8N7L37m54L0J48m21L36J36n97L21KJ52
2777A14k61k11J42K75m36L45j23l9K66l94M41M4l19K83k8j07L14k76J77M5l2l1
2799A89%j60K49l08j7L08m75K21J5k99K10k55R1K31l67L40p1j45L73k48R9L92
$$ y = [95, -90, -309, -29, -83, -358, 37, -272, -79, -287, -196, 12, -288, 64, 351, -278, 154, 83, -377, 543, 342, 287, 440, -14, 156, -99, -495, 390, -98, -212, 557, -169, -445, -110, -248, 167, 74, -209, -187, -528, -299, -66, -362, 79, -19, -300, 394, 260, -133, 8, 4, 55, 204, 25, 507, -95, 127, 255, -144, 214, -98, -111, 107, 37, -30, 20, -285, 31, -274, -274, 73, -178, -290, 114, -332, -126, 184, -41, 103, -77, 80, 189, 61, 283, 340, -99, 240, 61, -81, 292, 306, -6, 145, -162, 104, -34, -191, 178, -159, -120, -15, -392, -73, -229, -265, 105, -446, -51, 50, -393, 137, 57, -119, 336, 223, 40, 169, 28, 125, 67, 124, 461, 7, 37, 185, -236, 100, 236, -361, -40, -38, 114, -147, -358, -216, 59, -377, -32, -155, -194, 72, -322, 119, 163, -156, 127, 99, -8, 306, 30, 207, 252, 220, 189, 189, 29, 278, -30, -47, 261, -214, 7, 22, -277, -67, -322, -231, 0, -367, -27, -98, -243, 130, -118, -19, 373]
2821C73p09K95K36m12N86J4l25oN6Ll1oL9j33J32k9m64O41j91n81M09m6M7K53
2845A51k85JJ55k11J78j98J61J97p7k44K27k17L44R3j91K03l76N0M28n40L73j44
2867G8k05Q8J28j00qr3J85k07k48K13m2j10K00J8L13j94j27K12j77pL02j09kJ84
2891B92k98P5L1k1M20m38l07M02j13J62j49j77N49p40L07M1j99K08j07l19M01
2912B0J1r6J95j55Q8J69k18N7j94N77k24n31P45l19l00M58j45J1j18J1k1k25J81
2935b3j5j88J98J86k38k5Q2Q5j97k2q6J07M7K29M3m91K63Q8k63L48%J87Jj94k36
2960a14L12j63M99n55j24M45o78O60m41j52K04q5p0K64o8K0j27K04J97j14k55
2981a41L76o51O51k09J9J0KL60q8m69K61K38o18M61K04o41L96l0k17J99q6j39
$$ y = [373, -336, -41, 195, -217, 369, 383, 58, 52, 108, 111, 80, 74, 113, -20, 112, 83, -381, 260, 69, -512, -103, -149, -102, 151, -134, -133, 22, -189, -11, -209, -48, 149, 72, -172, 55, -162, 182, 275, 84, 287, -89, -39, 389, -151, 222, 78, -127, -39, 89, -11, -19, -112, 73, -134, -382, -169, -211, -321, -121, -103, 210, 16, -111, 101, -76, -83, 219, 110, 108, 292, -6, 69, 100, 79, 499, 61, -246, 156, 43, 205, 56, -121, 428, -312, -5, 36, -163, 45, -62, -381, 20, 31, -65, 130, -25, 63, 232, 14, 71, -123, 454, 230, -301, 444, 125, -175, 283, 138, 149, 31, 42, 21, -204, -23, -38, -226, -28, 158, -80, -105, -23, 62, -135, -157, -243, -136, -89, 140, 183, -308, -45, 43, -220, 128, 128, 315, 316, 122, -114, 198, 35, 534, -21, -145, 300, -378, 282, -159, -311, -107, -192, -262, 2, -66, -46, -173, 31, 228, 114, -141, 235, -416, 235, 26, 45, 55, 57, 417, 329, -140, 121, 359, -259, 202, 406, -235, 161, 131, -86, 113, 27, -112]
3003a12J99k35K35m50J89J20k34K20j2k8J7m8J89j9j1L05j42m36P07l05k48J88
3025H9K7m9J6K0N6l99J66K33n07J69J62k76J29N8k68L24q0J27j52k61M40k15J37
3048e4L92k82J28k01J19j25l8l0M40k70q0K77l33L52l17r2J18L28l05Q6k80l6
3070b03K60k85M44l44k5M9J22q4j86M83k01l8J09L92q03M84o0k43M72l53O1j6
3092C5k3O7k06K65J75m13l5L69n27J94K03k03K91k03N9j23k70K40K50m63L76K65
3114C23j29K49l59j47K49N5N2m81L11n0l70J50K47l02L92j22o29N24k01O3K52
3135G7m40N26k41j40K81k44j48O80k18N0J22l21J26m66L64K56l86K92J88m99J67
3156B6P5j98J17k09J37J60m84L98j59k54N71n24L0K75j61J79j55J2J17k93L42
$$ y = [-112, 87, -148, 87, -363, -174, -54, -288, -68, -80, -108, -91, -139, 50, 31, 20, 325, 183, -253, 454, 149, -99, 89, 116, 67, 83, 103, 159, -240, -74, 159, -348, -179, -17, -293, -164, -106, -374, -50, -130, -3, -155, -416, 24, -191, -54, 338, 56, 184, -17, 102, -23, -61, -91, 349, 79, -1, 276, -57, 295, -22, -114, 4, 332, 27, 113, -167, -203, 57, -228, 216, -128, -153, -104, 18, -66, -252, 231, 30, -8, 101, 493, -310, 174, 114, -129, 343, -10, 51, 35, 12, 79, -127, 138, 313, -100, -135, 234, -293, -99, 104, -99, 192, -11, 48, -75, -345, -105, 145, -318, 58, 323, 194, 443, 84, -63, 186, 241, 293, -188, 123, 73, -297, -147, 100, -202, 190, 68, -561, -37, -238, -175, 77, -363, 163, -78, -218, 63, -181, -329, 351, 133, 183, 305, -16, 110, -356, 8, 264, -122, 170, 358, -141, 26, 101, -97, 20, -189, -52, 108, -376, 22, -137, -391, 180, -344, -314, -39, -200, -21, -176, -164, -47, -340, 2]
3177BJ8k04L74L54o46K20n8q1K30k53K61m19J12J68m9j29M16m26J20k19K4K32
3199D7r7l51N36l99R3K92n14L47K78k30K46n0j34J38m32N83m55J22L51n07L27
3220A91j42p5N1P3k13N3j1r8L58m91J29K6k48M63n8k59L69j29J10K85p85L91J87
3243A77j41J53k44K55Q2k47L41j46o12L77P7J99j69j97Qj11Q1J58N9p6Jl20L3
3266b62J66j65K30pj71M92l12K53J9k55J16j24K21m1q2j24K80l39Q1O8j86M12
3288B70l46j05J97l11L46k04J2Q2k12J02L06k64L44k36j04n9J75L8j89q3L28l
3310H4j70M85l25l1Q5m75N00Q5j58J86l36M7o1k32L66j49PQ4j27K2K16k52J55
3333Fl68K38K07k58M9N46n42L77p2k38M34n71P7L16k36L04k27l5K82k60Q9J32
$$ y = [2, 20, -184, 190, 544, -102, 118, 60, -21, 209, -44, 217, -202, -90, 78, 29, -100, 316, -110, 10, -209, -185, 47, -50, -401, 135, -264, -171, 121, -393, -46, 232, 2, 248, 198, 64, 202, -230, 353, -102, 20, 371, -136, 191, 49, -26, 25, 98, -115, -62, -73, -171, 187, -304, -175, -149, -397, 66, 8, -251, 118, -11, 99, 384, -401, -10, 177, 36, 189, -55, 200, 282, 35, 376, 230, -382, -5, 72, 271, 102, -95, -87, -198, -117, 41, 100, 24, 25, -295, -262, -96, -261, -31, -38, -209, 283, -29, 224, 243, -12, 104, -20, 201, 160, 78, -46, 234, -105, -24, 44, -142, 270, -76, -181, 16, -295, 51, -153, -141, -59, -271, -169, 137, -127, 217, -19, -123, -182, -7, 31, -158, -241, 87, 84, -86, 399, 74, 43, 128, -347, 153, 238, 80, 266, -70, -23, -84, -316, 50, -99, -92, -8, -135, -113, 103, -149, 6, -362, -124, 83, -175, -126, 420, -122, 255, 183, -55, 379, -192, -115, 201, -35, 269, 42, 7, 289, 29, 118, 250]
3355B50l13L7j02j95N58k64p6J44J16k08L59o60K35O8k37K76L1J27p5k78K53j06
3377f0p4N71n09N7K51m81K43R5m04M38n00L28j42n9K54k39k1L57J9k20Q0j92J47
3400f1K0j68K92M8N4j13r8k73K34K37N6N2r4M7j96O6J27l99J1j23j64Q39m78m8
3424a32J78l68K44o6p4NP7J79J04k99K56J7m90L82J4mL48m89N39k38mO5J54k65
3448A33N3k94K16k0n36L13n9J42j31m1R6K18m49L43K5m13rJ81J15J25m8J12J5
3471H7j22K06p0R3J07l12N5L10j73J05j67j83K2lj20J79M6J03k60j52J61j54J09
3494a33K22k53J48o9M6j01k7N45qk32J08Q8n46J25K26p5N5q5N3n5j18J64j66n9
3518a47J24k0O1j02j9J64o8n4K95m35L13j05k23J74L4J10M8o0Q0q8l12O05m51
$$ y = [250, -63, -26, -128, -323, 235, -29, -105, 39, 155, -53, 306, -354, -119, -51, -288, -12, 19, 146, 71, -207, 46, -60, -134, 437, -72, -15, 236, -245, -2, 93, -311, 127, -373, -45, -187, -246, 8, -231, -252, 105, 124, -96, -16, -208, -61, -41, -209, 83, 131, 185, 72, -26, -299, -65, 172, 228, 280, 186, 233, 37, 103, 230, -169, -158, -281, -445, 394, -84, -132, 46, -322, -78, -144, -218, -213, -136, 43, 147, -152, 104, 121, -369, 13, 27, 23, 371, -118, 421, 183, 179, 244, 398, 133, 186, -108, 108, 88, -448, -135, -194, -52, -183, -224, -128, 90, -359, -16, 9, -404, -413, -232, -117, 8, -40, 72, 87, -35, 171, 101, 194, 301, -11, 44, 354, 181, 286, 119, -64, -42, -45, -165, 14, 60, 163, -97, -249, -88, -242, -133, 89, -164, -16, -85, -39, -140, -167, 378, 370, 138, 246, 334, -212, -87, 139, 64, 119, 34, 87, 32, -86, 78, -88, -147, -23, -43, 18, -84, -103, 61, -7, -61, 234, -201, 112, 7, -216, -42, -8, 102, 150, 90, 170, 82, -230, 375, -76]
3541g6K54p0k42J60J32k10k19K33L0K84n03L86j7o41M36R0k51M48j25k11j63J88
$$ y = [-76, 178, 108, -134, 26, 158, -52, -271, -38, -8, 276, -227, 159, 142, -499, -63, 27, -224, 224, 99, -112, -275, -87]
$$ [...]
8191A07
##END NTUPLES=NMR FID
##END=
