##TITLE=1H_Pr 243-MeJ
 200.13MHz, CDCl3,
 8 sc
 
 24.3.2025
##JCAMPDX= 6.0         $$ Bruker NMR JCAMP-DX V2.0
##DATA TYPE= NMR FID
##DATA CLASS= NTUPLES
##ORIGIN= UXNMR, Bruker Analytische Messtechnik GmbH
##OWNER= pz
$$ XWIN-NMR		Version 3.5
$$ Mon Mar 24 16:10:25 2025 Russian Standard Time (UT+4h)  she@DPX200
##.OBSERVE FREQUENCY= 200.1313
##.OBSERVE NUCLEUS= ^1H
##.DELAY= (6, 6)
##.ACQUISITION MODE= SIMULTANEOUS
##.ACQUISITION SCHEME= undefined
##.AVERAGES= 8
##.DIGITISER RES= 18
##SPECTROMETER/DATA SYSTEM= spect
##.PULSE SEQUENCE= zg30
##.SOLVENT NAME= CDCl3
##.SHIFT REFERENCE= (INTERNAL, CDCl3, 0, 14.3821)
##AUDIT TRAIL= $$ (NUMBER, WHEN, WHO, WHERE, WHAT)
$$ ##TITLE= Audit trail, XWIN-NMR		Version 3.5
$$ ##JCAMPDX= 5.01
$$ ##ORIGIN= Bruker BioSpin GmbH
$$ ##OWNER= she
$$ F:/spectra/data/she/nmr/H-C/1/audita.txt
$$ ##AUDIT TRAIL=  $$ (NUMBER, WHEN, WHO, WHERE, WHAT)
(   1,<2025-03-24 16:09:02.12 +0400>,<she>,<DPX200>,
      <created by zg, POWCHK disabled, PULCHK disabled
       configuration hash MD5:
       00 E9 B6 7A A2 85 ED C7 34 08 36 98 17 FE 4E 26
       data hash MD5: 16K
       B9 35 7A 80 EE A8 D2 54 2D 32 76 A2 A3 71 79 75>)
$$ ##END=
$$ 
$$ hash MD5
$$ 98 D2 0D 32 5C D8 2C 6B C3 7A 7E D8 40 36 CB 70
##$RELAX= 
##$RELAX= 
##$RELAX= 
##$RELAX= 
##$RELAX= 
##$RELAX= 
$$ Bruker specific parameters
$$ --------------------------
##$DU= <F:/spectra>
##$EXPNO= 1
##$NAME= <H-C>
##$PROCNO= 1
##$TYPE= <nmr>
##$USER= <she>
##$AMP= (0..31)
100 100 100 100 100 100 100 100 100 100 100 100 100 100 100 100 100 100 
100 100 100 100 100 100 100 100 100 100 100 100 100 100 
##$AQSEQ= 0
##$AQ_mod= 1
##$AUNM= <au_zg>
##$AUTOPOS= <>
##$BF1= 200.13
##$BF2= 200.13
##$BF3= 200.13
##$BF4= 200.13
##$BF5= 200.13
##$BF6= 200.13
##$BF7= 200.13
##$BF8= 200.13
##$BYTORDA= 1
##$CFDGTYP= 0
##$CFRGTYP= 5
##$CHEMSTR= <none>
##$CNST= (0..31)
1 1 145 1 1 1 1 1 1 1 1 1 1 1 1 1 1 1 1 1 1 1 1 1 1 1 1 1 1 1 1 1 
##$CPDPRG= <>
##$CPDPRG1= <>
##$CPDPRG2= <>
##$CPDPRG3= <>
##$CPDPRG4= <mlev>
##$CPDPRG5= <mlev>
##$CPDPRG6= <mlev>
##$CPDPRG7= <mlev>
##$CPDPRG8= <mlev>
##$CPDPRGB= <>
##$CPDPRGT= <>
##$D= (0..31)
0 0.7 0 0 0 0 0 0 0 0 0 0.03 0 0 0 0 0 0 0 0 0 0 0 0 0 0 0 0 0 0 0 0 
##$DATE= 1742818141
##$DBL= (0..7)
120 120 120 120 120 120 120 120 
##$DBP= (0..7)
150 150 150 150 150 150 150 150 
##$DBP07= 0
##$DBPNAM0= <>
##$DBPNAM1= <>
##$DBPNAM2= <>
##$DBPNAM3= <>
##$DBPNAM4= <>
##$DBPNAM5= <>
##$DBPNAM6= <>
##$DBPNAM7= <>
##$DBPOAL= (0..7)
0.5 0.5 0.5 0.5 0.5 0.5 0.5 0.5 
##$DBPOFFS= (0..7)
0 0 0 0 0 0 0 0 
##$DE= 6
##$DECBNUC= <off>
##$DECIM= 32
##$DECNUC= <off>
##$DECSTAT= 4
##$DIGMOD= 1
##$DIGTYP= 9
##$DL= (0..7)
0 120 120 120 120 120 120 120 
##$DP= (0..7)
150 150 150 150 150 150 150 150 
##$DP07= 0
##$DPNAME0= <>
##$DPNAME1= <>
##$DPNAME2= <>
##$DPNAME3= <>
##$DPNAME4= <>
##$DPNAME5= <>
##$DPNAME6= <>
##$DPNAME7= <>
##$DPOAL= (0..7)
0.5 0.5 0.5 0.5 0.5 0.5 0.5 0.5 
##$DPOFFS= (0..7)
0 0 0 0 0 0 0 0 
##$DQDMODE= 0
##$DR= 18
##$DS= 0
##$DSLIST= <SSSSSSSSSSSSSSS>
$$ [...]
##$SUBNAM0= <"">
##$SUBNAM1= <"">
##$SUBNAM2= <"">
##$SUBNAM3= <"">
##$SUBNAM4= <"">
##$SUBNAM5= <"">
##$SUBNAM6= <"">
##$SUBNAM7= <"">
##$SUBNAM8= <"">
##$SUBNAM9= <"">
##$SW= 18.0517328524113
##$SWIBOX= (0..15)
0 0 2 0 0 0 0 0 0 0 0 0 0 0 0 0 
##$SW_h= 3612.71676300578
##$TD= 16384
##$TD0= 1
##$TE= 0
##$TE2= 300
##$TE3= 300
##$TEG= 300
##$TL= (0..7)
0 120 120 120 120 120 120 120 
##$TP= (0..7)
150 150 150 150 150 150 150 150 
##$TP07= 0
##$TPNAME0= <>
##$TPNAME1= <>
##$TPNAME2= <>
##$TPNAME3= <>
##$TPNAME4= <>
##$TPNAME5= <>
##$TPNAME6= <>
##$TPNAME7= <>
##$TPOAL= (0..7)
0.5 0.5 0.5 0.5 0.5 0.5 0.5 0.5 
##$TPOFFS= (0..7)
0 0 0 0 0 0 0 0 
##$TUNHIN= 0
##$TUNHOUT= 0
##$TUNXOUT= 0
##$USERA1= <user>
##$USERA2= <user>
##$USERA3= <user>
##$USERA4= <user>
##$USERA5= <user>
##$V9= 5
##$VALIST= <valist>
##$VCLIST= <CCCCCCCCCCCCCCC>
##$VD= 0
##$VDLIST= <DDDDDDDDDDDDDDD>
##$VPLIST= <PPPPPPPPPPPPPPP>
##$VTLIST= <TTTTTTTTTTTTTTT>
##$WBST= 1024
##$WBSW= 4
##$XGAIN= (0..3)
0 0 0 0 
##$XL= 0
##$YL= 0
##$YMAX_a= 108378
##$YMIN_a= -142824
##$ZGOPTNS= <>
##$ZL1= 120
##$ZL2= 120
##$ZL3= 120
##$ZL4= 120
##$ABSF1= 10
##$ABSF2= 0
##$ABSG= 5
##$ABSL= 3
##$ALPHA= 0
##$AQORDER= 0
##$ASSFAC= 0
##$ASSFACI= 0
##$ASSFACX= 0
##$ASSWID= 0
##$AUNMP= <proc_1d>
##$AZFE= 0.1
##$AZFW= 0.1
##$BCFW= 1
##$BC_mod= 2
##$BYTORDP= 1
##$COROFFS= 0
##$CY= -3
##$DATMOD= 1
##$DC= 2
##$DFILT= <>
##$DTYPP= 0
##$F1P= 0
##$F2P= 0
##$FCOR= 0.5
##$FTSIZE= 0
##$FT_mod= 4
##$GAMMA= 1
##$GB= 0.15
##$INTBC= 1
##$INTSCL= 1
##$ISEN= 128
##$LB= 0.25
##$LEV0= 0
##$LPBIN= 0
##$MAXI= 10000
##$MC2= 0
##$MEAN= 0
##$ME_mod= 0
##$MI= 1.114404
##$NCOEF= 0
##$NC_proc= 0
##$NLEV= 6
##$NOISF1= 3.799351
##$NOISF2= 2.8
##$NSP= 1
##$NTH_PI= 0
##$NZP= 0
##$OFFSET= 14.38212
##$PC= 1
##$PHC0= -466.3046
##$PHC1= 9.192208
##$PH_mod= 1
##$PKNL= yes
##$PPARMOD= 0
##$PSCAL= 0
##$PSIGN= 0
##$REVERSE= no
##$SF= 200.129724274929
##$SI= 16384
##$SIGF1= 3
##$SIGF2= 2
##$SINO= 400
##$SIOLD= 16384
##$SREGLST= <1H.CDCl3>
##$SSB= 0
##$STSI= 0
##$STSR= 0
##$SW_p= 3205.1282051282
##$SYMM= 0
##$S_DEV= 0
##$TDeff= 0
##$TDoff= 0
##$TI= <>
##$TILT= no
##$TM1= 0
##$TM2= 0
##$TOPLEV= 0
##$USERP1= <user>
##$USERP2= <user>
##$USERP3= <user>
##$USERP4= <user>
##$USERP5= <user>
##$WDW= 1
##$XDIM= 8192
##$YMAX_p= 0
##$YMIN_p= 0
$$ End of Bruker specific parameters
$$ ---------------------------------
##NTUPLES= NMR FID
##VAR_NAME=  TIME,          FID/REAL,        FID/IMAG
##SYMBOL=    X,             R,               I
##VAR_TYPE=  INDEPENDENT,   DEPENDENT,       DEPENDENT
##VAR_FORM=  AFFN,          ASDF,            ASDF
##VAR_DIM=   8192,          8192,            8192
##UNITS=     SECONDS,       ARBITRARY UNITS, ARBITRARY UNITS
##FACTOR=    0.0002768,     1,               1
##FIRST=     0,             0,               0
##LAST=      2.2672688,     0,               0
##MIN=       0,             -142824,         0
##MAX=       2.2672688,     108378,          0
$$ Real data points
##PAGE= N=1
##DATA TABLE= (X++(R..R)), XYDATA
$$ [...]
1630a99m8L73O7ok4k55J19J5p8o1m4p3J1P2k80L81m6M1J52k29Q1K42j68J09J78
1655C30l45M97K5m04K71q8j81j32q1k59J29k3J38Q1L8j25O5p8K00m3k69M12j92
1678c4o4M1j15K22r2k00K41R8J4J99J08q7K43l26j96J32j80j51P7k61K08J16k6
1701c3r9j1j42pP6k81P45l25M2J12k21K25J09j91N9J40k31L09j80l8K66n49L84
1724A59J09q5J7j86k51L83P0k23K35k32m8j9l52K65j08j45O4J09K8K73N3j62J89
1747A43k51J35J06n4K42N6p2J12J21j20J32m58j33J62m49K76o4j64m0M6j28o0
1769d62L17J5o7J41P7K01m14K32O8%O3r9k44K89K84j34K27k57k34M1l19L83O1
1792A69j89L1j39q1J93k7q1K37k80q5K39k71J80M5n10N47k91J14K84l01RK67L7
$$ y = [-199, -247, 126, 193, 187, 163, -92, 27, 42, -36, -97, -141, -214, -203, -131, -411, -30, -76, -35, 117, -112, -31, 211, 43, 152, 330, -15, 482, 507, 103, 374, 286, 105, -27, -108, -367, -238, -261, -123, -42, -4, -129, -64, -142, 58, 15, -254, 158, -34, -98, -57, -172, 50, -42, -242, -1, 97, 111, 310, 418, 331, 574, 248, 52, 184, 4, -147, -70, -331, -123, -7, -33, -132, -143, -285, -292, -216, -497, 248, -77, -35, 77, -144, 81, 190, -1, 58, 198, -33, 276, 96, 58, 324, -225, 159, 268, 183, 200, 14, -237, 146, 216, -7, 228, -4, -52, -71, -423, -158, -266, -411, -347, -238, -210, 63, 116, -46, 143, -108, 27, 133, 79, 321, 377, 305, 417, 538, 418, 550, 92, -41, 121, -328, -52, -116, -280, -320, -274, -402, -462, -145, -130, -197, -56, 21, 222, -192, 40, 108, 108, 171, 72, -172, 117, 401, 267, 494, 237, 3, 44, -275, 108, 169, -20, 11, -128, -209, -16, -43, -124, 113, -167, -252, -13, -284, -104, -59, -569, -22, -313, -199, 85, -216, -207, 60, 97]
1815I7pK02k21L36j52N6q0J92l4j55j81NL4l37J35m0m53J25M05m94N54P7j79M03
1839B88j2j02M8j73J12P5j86N7j19KPJ31q0Q6k54j22L36j64J26P5jp4J95l9R5
1864C07l58J61j7k95J69j26L3K9j80j42K62J38r2J36J52k9K00N7k14K17m51n1
1886i4L01l2r1k7l26J34Q7o6Q1n5J04K2j60n3Q1j08J86k28J43K86M5j1L8k47O
1911A6j49L24j23m1l38K79k96K19L31k38k34L92j76l9J66k01L68k54j59N28m49
1932g4J85J60j76m3k82j3J41r6j95Q4K4j06K05K28M4K34J46l03O3k24j8j54J23
1955d7L09k95k06Q8j96O7J31q8K00j9k9K40J65m54N55l37r1P6j03J09j51K09k00
1978f7q9j15J78k42K10O1k89K78J02J3k18O92n35J26J4n1M1j12N8j3o8j14J25
$$ y = [97, 90, 292, 71, 407, 255, 311, 231, 423, 389, 234, 53, 58, 92, -245, -110, -150, -603, -478, -73, -567, -13, 64, -115, 288, 276, 174, 222, 49, 161, 236, 50, 107, -12, -10, -3, 128, 48, 134, -120, -242, 94, -70, 56, 131, 130, 56, 251, 212, 307, -51, 110, 93, -202, -33, -159, -126, -97, -277, -419, -157, -19, -111, 25, 177, 148, 348, 405, 191, 408, -43, -94, 207, 175, 84, 57, -269, -135, -48, -114, -33, -88, 16, 38, -122, -175, -94, -202, -16, -244, -101, 185, 230, 219, 257, 10, 16, -133, 191, 68, 27, -311, -32, -328, -109, 222, -16, -250, 142, -34, -73, 93, -108, 260, 6, -153, 375, -74, 111, 271, 95, 52, -230, -243, -102, -198, -393, -309, -285, -391, -186, 42, 86, 320, 466, 163, 226, 2, -16, -170, -47, 262, -33, -239, -151, -347, -280, -149, -237, -37, -56, -85, 155, 320, -134, 421, 84, -7, 69, -34, 75, -76, 133, -67, -156, -271, -93, -335, -125, -64, -353, -75, 27, 40, -178, 514, -21, 105, 119, 68, 109, -3, 55, 42, -26, -140, -15]
2001a5j17J01K93l00R3j35jN2J0Q1J43j99k18J98K73q9K31k17M36l80j60K4r5
2024Io2L9k96O8P0j80L42M2j83K52J15j59K32j10J6R9k00L1j40j58j13L46j64
2047a04J18m2k58L35J37k42L94j73MJ60j73r9K80l21MR4k88J17k07j22J10K19
2069e7j15K27j13J73M7j26j49L23j61J14j24k12M03j68k28Q2O6j38L88l14O3P4
2091E5j96K38Lk41J17J66J59j11m18L15m6k89J81r8J91n3k28J23L36j19J11j43
2113E3J67O0J11l44O7j04o1J06K3j3l5m9N0k15n0L83k11m9J89J03j70Q6l48O8
2137a83J17j95j42M88k69L13L1k28K74k60M5J72Nj71l1J57j22n3J3QJ14m27J89
2160a55mM8K1K0J18L5k00J49p5L7j55J19j61K75k46J23Q7k91L44O2k09K23p2O3
$$ y = [-15, -132, -31, 262, -38, 55, -80, -81, -29, -19, 62, 205, 6, -212, -14, 259, 170, 401, 184, 620, 240, 80, 104, 9, -53, -14, -310, -242, -172, -352, -10, 32, -151, 101, 216, 57, 289, 179, 195, 294, 94, 125, -15, -173, -286, 60, -104, 14, -28, -286, 49, 186, -56, 338, 165, 169, 329, 156, 57, 337, 16, 20, 114, -174, -57, -264, -386, -276, -57, -172, 55, -58, 115, 162, 36, -113, 210, 49, 163, 39, -173, 230, 62, -166, -84, -18, -156, 232, -82, -19, 55, -141, 97, 100, -141, -24, 142, 301, 190, -228, 87, 41, -248, -67, -165, 26, -27, -255, -132, 204, 85, 196, 53, 220, 280, 391, 47, 114, 10, -51, 55, 78, 65, 30, -19, 31, -184, -234, 149, -62, -111, 78, 181, 11, 97, -251, -183, -66, -261, -403, 85, -184, 129, 160, -68, 206, -54, -9, 163, 168, -3, -34, 123, 1, -52, -39, -31, 83, -344, -155, -159, -111, -90, -70, 48, 83, -117, 32, -43, -6, -161, -42, -203, 72, -174, -51, 36, -255, 89, 151, -58, 165, 93, 156]
2184A56J08r8lp9j33PK60n84J57J85k56J17R9j65M64k80l55K87J36J24J67k91
2206B3R1M4k81J40J1k8r0J08j56L0M4J88r7J15J5j18k16K87pk84L48l81J68J60
2230A14l41Qn0k0jK38J5Q3j9N9P7P1Jm8j85K45r9j18O2J38j31K8Q6m7k08J41p6
2257B3P3l09r9K49k42N18l28J46o2k38K78o4M1j8J49k60K69o8o5J26K1J65l18
2280a3j02N8J29j76J0J84j13K30k5k26N5J85j70l2N4M3l5l0k9Q4j11j49K5qJ04
2305e8m0J54K85k76j15L26k35%J36m79K56J06j16P3r6K2k3k88K36q1L9J83j10
2328a01K7P6P3j27K09l6l12K06J28j68k6j35n7M69l13q8K56k4Mj53J19J28j55
2351@RK36m69L08O8k21J63J0P0r4j66K4k9J31j08q1n7M6K72j56m0K93l36M59k09
$$ y = [156, 264, 166, 163, 84, -49, -42, 218, -366, -209, -24, -280, -163, -64, -229, 235, -45, -400, -113, 23, 147, 314, 23, 114, 158, -123, 17, 28, 0, -90, 18, -138, -108, -64, 124, 27, 142, 157, 39, -177, 110, 103, -181, 167, -214, -46, 114, -227, -219, -269, -289, -290, -52, -37, 46, 27, 86, 163, 234, 235, 187, 2, 247, 148, 30, 92, 230, 99, 127, 213, 166, -42, 99, 23, 96, -213, -312, -63, -305, 213, -115, 31, -31, -269, 9, -55, -14, -32, 117, -143, 126, 58, -7, 119, 140, 305, -13, -115, -57, 72, -104, -94, 90, -23, 207, 182, -44, 11, 196, 26, -6, 48, 91, 56, 26, -3, 81, -30, -179, -154, -162, -58, -98, 56, 341, 65, -50, 276, 41, 41, 177, -302, -46, 60, -56, 17, -79, -57, -80, -368, -132, -213, -174, 9, -101, -74, 2, 75, -52, 157, 121, -191, 15, 143, -25, -51, -186, -243, 226, -87, -175, 81, 57, 61, -92, 27, 155, 0, 9, 245, -224, 84, 152, -69, 94, 104, 174, 80, -86, -62, -91, 40, -68, -149, -206, -160, 112, -44, -84, 209, -127, 332, 123]
2376A23k82K05j74P2Q5j42M3M7j05J41j30R6O2k45J24J57j54R2J37k56m1L09m8
2399A16K8k50O5J16J06j88J86l00j1j05k6K37rN7j76J53j03K84n2m1J30j27J67
2422B57m4k37K15j95j09J53p6J82m8j8j78N3K6L4k20R5J60r8J08N3k16J25K12
2445B34k11j02J31J9n3r6j1R8L8m0l8r5J06O8j89J19K05l73K79Kj36L4P0j92Q2
2470e1j35L97l7j94q2M2j21J73P0n0N8k33J49K2P1L2j1P9l76J60mKJ77l33L63
2495A68j57j01J77J6k89K55j22P2Mn5J03J47q7K2k69R0L00k73m5K23o6j26m2K0
2519c5Q4j31R8j98j2J60J04j57K58j10K13l28N6J07j45O7j30M4R6J27j23Jo9O2
2543C9j73J67k06K66J24k35R3j10J91k18J92L9k26J36j88l5o7l1J82J35j14O4
$$ y = [123, -159, 46, -128, -56, 29, -113, -70, -23, -128, 13, -117, -21, 41, -204, -80, 77, -77, 15, 152, -104, -145, 164, 116, 144, -106, -41, 75, 181, -7, 179, -121, -132, -237, -263, -26, -35, 22, -154, -1, -104, 180, 128, 87, 217, 90, 257, 213, -24, 191, -4, -113, 40, -36, 146, 98, 80, -98, -45, -19, 15, -205, -110, 50, -48, 60, 113, -103, 22, 234, 23, -79, 52, 71, 18, -78, -89, 9, 47, 7, -31, -126, -20, 48, -141, -22, 183, -190, 89, 91, -45, -11, 59, -133, -51, -186, 211, 174, -20, -102, -60, -181, -8, 62, 12, 70, -163, -14, 8, 79, 111, 100, 179, -197, -37, -41, -39, 138, -195, 168, 11, -90, 87, 103, -186, 69, -53, 19, 23, -32, 71, 218, 131, 153, -116, -26, 274, 1, -44, 179, 113, -13, -55, -35, 49, -82, 16, -182, -194, -34, 70, -87, 171, 61, 274, -54, 2, 109, -36, 31, -99, -55, 41, 168, 45, 46, -23, 39, -134, 33, -173, 93, 217, -18, 75, -35, 156, -62, 130, 169, -57, 79, -109, -144, -211, -242, -60, 75, -39, 25]
2565B5o1J2j22J93J67j07R0k19R4L7K0k16j2K02m20L09J9r2M4Nj6j36Mo9k5J71
2591a03K13j51N4Q6P6k67K53l28K91J28k25j73J81j69J29K4j70J30P2m5q7K54
2613A73k58k01J24J63m5N2PJ30j93m9q0J27M2KJ22k12O0j4k5j97K8K69m00M06
2637C1p1K14k13K66k03R5oj46R4k73J49m5K36k82j0K51k4r0r0J34J44j73J50L3
2661A71k87J28O9j72J14j7J6J1k4j54L34j16j47O1J38l00J33k26M20j54o2K52
2683A88j47j53L4j01K77j35oJ05l18L85J08n21M82k86J15k3k9k3K1J2P3J49l13
2706a06K09j11j31J89k16L5M74n53J07L40k58K05k54J3J37p4k21K55K8j73K19
2727A14j45L4J20oj96m9L53K1m56J89K01j81J20M4n6o6j74J16K00j54k12m6J88
$$ y = [25, -36, -24, -146, 47, 214, 107, 197, -22, 72, 109, 129, -87, -99, 103, -317, -8, 11, -81, -37, -32, -48, -184, -180, -249, -274, -103, 110, -41, 13, 99, 175, -92, 161, -167, 124, 252, 27, -146, 35, -134, -5, 19, -151, -21, 51, 6, -81, 173, -85, -286, -162, 1, -44, 8, 15, 145, -48, -97, -177, -50, -8, -6, 116, -96, -36, -50, -75, -272, -244, 25, -375, 31, -40, 174, -39, 227, 24, 119, 113, -33, 61, -212, -63, -108, 128, -154, -164, 87, 63, -27, -117, 17, 161, -12, 138, 171, -116, 12, 81, -91, 23, 6, 22, 33, 9, -145, 189, 73, -74, -13, 125, -175, -42, -268, 152, -2, -64, 188, 41, -112, -78, -179, 98, -37, -43, 62, -256, 129, 237, -284, 198, -88, 27, 4, -25, -48, -27, -15, 58, 207, -106, 103, -8, -139, 50, -166, -131, 343, -210, -103, 237, -21, 184, -70, -57, 80, 6, -215, 40, 68, -105, 114, -31, 3, 123, 117, -79, -128, 225, 246, -210, -21, 180, -1, 119, 163, 107, 41, -133, -17, 183, 29, -183, -229, -41]
2750d1k5n6m5j0L26m9k31J38Q3poj02L6lK4R1l33J47j64n9L17m6j46J98j13j3
2776h9j8j2j7K0J21J08r8O6Kj00j3m2l00L86K47l23q7K3K03j01M9p4J60m6n3O2
2802G4r6j87J74O4QQ7k68J54k8k1K49m42J47L4r6K54l2j26M7J55j59J1m4p8K33
2827A14j23R2j47K2mQ2L6j69r1K58n8m2l5K44K4k26o4J35m4r7O3lJ9j64J14J69
2853A05k13j3Q3q4J57J61j80K7N5j16R5k0l8J0pJ01k7j83K02l0k00R3k60K43P2
2878C3j94k20L01r5k4J51j44L60k10Q2j11J36o9K78k14l2qp7O4k8J3p3l4J14o8
2903f9J77k21K5J69k7L41l44K43l18j09K78k40K9J9r2r4J35J02J07j42j9J15j37
2926g2O9J8J38m0J05l14K20j74J75j45O7R8r5j44K75j50m6p7L5j06J81m0J47k61
$$ y = [-41, -66, -122, -167, -177, 149, 100, -131, 7, 90, 83, 77, -25, 11, 8, 32, 123, -210, -63, -227, -286, 31, -15, -161, 37, -76, -89, -107, -119, -136, -116, 5, 113, 15, 81, 83, -17, -30, -72, -372, 14, 261, -62, -149, -126, 77, -24, 25, -49, 111, 65, 12, 74, -22, -209, -35, 29, 37, 124, -144, 10, -18, -39, 210, -232, -85, -51, -147, 107, 75, -51, -4, 151, -8, 3, -41, -119, 114, -9, 83, -64, -42, -46, 36, 72, -97, -188, 70, 12, -30, -65, 179, 203, -23, -87, 48, 4, -93, -30, -33, -14, -178, -64, 105, -108, -121, -38, -122, 35, 196, 16, 43, 98, -18, 77, 57, 19, 29, 22, 123, 96, -87, 115, 85, -115, -22, -282, -39, 33, -161, -381, -80, -175, -199, -48, -192, 168, -42, 40, -71, 65, -4, 274, 60, 28, 20, -57, 7, -21, -8, -81, -115, -1, -69, 108, -113, -88, 81, 54, 395, 51, 294, -24, -133, 145, -95, -66, -47, -139, -233, -98, 4, 111, -31, -50, 65, -72, -3, 15, 153, 113, 218, -96, 124, -50, 125, -20, 47, 145, 50, -94, 181, 31, -15, -92, -57, -163, 18, -22, 125, -136]
2950a36K94m09K52r3mJ34j23n6L11l51L43l8p6l2j00o0J62k28J63J70k38K64k21
2973g2K37j68M5Ppj17O7J18k08jJ71j28J19j19j36K49k57j5J66J91j34M6k38K51
2997F7l8j3P5mj7QQ5J5Lj96p0R3k05J09k1J42Q6j51K0R7j29J69N0k72J18J32j58
3024ej75K33k5n7O5Q0Q0j80j84J36j21J20R5qj12J20n5q2J55j82K43k04Q0n8j6
3049e7q1J77k23O4L39p0L0k85J25l9J39k63O3m9J99k28J65j03l0J74Q7l59L00
3072G5j48j60K25P5j07r2K46j84R2j09J94k0Ml33J29R0J21o0j62K43j35pL3Ll
3097A0J48l78J13J23k77K87Kj49K86p2m2L0J00j82j98M38k36Lo1M2k3L41j01k87
3121h3q4J75J4k40J39j16L13m8j09m8mJ04J30R5l77J45j25o5J16Q0O4QO4O4o9
$$ y = [-136, 158, -251, 1, -92, -96, 38, -85, -141, 170, -181, 162, 124, 48, 16, -84, -144, 18, -210, -47, 123, -115, 149, -72, 165, -3, 42, 49, 42, -75, -8, 110, -98, -99, 72, -56, 63, -56, -192, 57, -200, -215, -49, 142, 8, 54, -184, 67, 29, 16, 91, 87, 70, 78, 163, 178, 181, -15, -85, 8, -197, -88, -109, 33, 119, -32, -12, 85, -44, 125, 175, -97, 21, 153, -5, -180, 53, 28, -29, 36, 116, 196, 16, -168, -32, -153, -33, 62, 54, -58, 62, 7, -75, 80, -102, 141, -63, 17, -41, -57, -138, 39, -184, -120, 219, 149, 179, -106, 19, -20, 119, -144, -81, -130, 69, -159, 6, -97, -127, 47, 134, -225, 75, -73, -233, -8, 67, -40, -132, 114, -70, 22, -87, 107, 87, 91, -242, -113, -23, 98, 38, -124, 119, -16, -23, 10, 13, 10, 158, -220, -107, 16, -261, 26, 28, -121, 165, 93, 51, 81, 181, -1, -199, 239, 3, 6, -55, -13, -36, 305, 204, -83, -167, 8, 22, -218, -79, -195, 118, 70, -39, -87, -91, 13, 143, 238, -139, 6, -119, -184, -68, 12, 76, 84, 148, 212, 143]
3146A43k48K50j17p7M1p1NR6j06L7J66m20K91K83j85M5j12q1J30j82J65j53M7
3169e3L4K5q0lJ9j36K93k40K12K3k43J93J71k73J06j4k09J36R5j02J17j41J33
3192F3L1j95O4J62p6n4o2k25K31j12K14J69q5K1j22J14j31L7k34P9K9K09l35J47
3216f1N4l44M73j65Q7k2j1m1P0q5M7J7m5J00Q1l5q4k6O8j37k64M12p0j22R8j11
3242a16K22l12N3Q5j31K10m1m7J47J32j42j28m0K47j73l0J53k0P5k44J02M0k8
3265A4o1K8L20m71K10n4j51J3K06m0j03J22j52m3L13k12j79L85j42j97J08P6J89
3288A79k52M5p6J68Q4j63k5J61k16J61j58l1L43p0l3j88K49j78k62L49n5j65o1
3311a94p7L28k51L02J0k64J99q5M2p3r9L21j93j44J38K31k71L7J28j65L2J07j85
$$ y = [143, -105, 145, 28, -49, -8, -79, -74, 22, -84, -47, 119, -301, -10, 273, 88, 133, 21, -60, 70, -112, 53, -100, -53, -19, 6, -74, -77, -58, -194, 99, -141, 71, 94, -149, 44, 215, -58, 48, 34, -175, -39, 56, -46, 71, -70, 63, 94, -101, -37, 125, 49, -5, -67, -292, -61, -173, 41, 210, 125, 146, 24, 138, 7, 44, -190, -111, -82, 127, -208, -61, -7, -351, 122, -43, 44, 22, 11, -30, 40, -45, 2, 19, -26, 74, 155, 120, 36, 10, 78, -59, -323, 89, 19, -103, -5, -116, 106, -206, -153, -68, -199, 11, -30, -77, 70, 202, 60, -68, -108, 139, -34, -64, 89, 69, 144, -100, 2, 42, 14, -47, -19, 301, -170, 40, -14, -165, -152, 54, 14, -89, 33, -119, -162, 151, -61, -240, 145, 3, -194, -86, -10, 179, -73, -28, -104, 64, 148, -15, -40, 121, -95, 66, -92, -123, 220, 150, 117, -71, 178, 0, -262, 87, 32, -133, -194, -271, 57, -194, 108, 118, -146, 53, -32, 10, -63, -162, 159, -34, -178, -40, 191, -80, -43, 85, -80, -48, 59, -126]
3334a26L13j57j05Q4K5k60K66m6k4K05l34K82n7q4j3mk48L70l02L13j83J17P8
3357A10J06j53n6J16j70J51j69l0J8K5o0l4L4J10J65m03J73J13k7N1j42K05m0
3380I3j17p7J31j83K34j36M2j18J82O1J23k30K6k9k6l2J89j74J37N2o9K3j16J93
3404A79l56J42j05J92j23j84J32J56j61LR4j58L27k8k32m8K84R3j20j66K96k05
3426A2J87j09M3k59j14K79m2J56j56O5j73J82K7k37mK60l7k70J75k51N32k78j33
3449a45J06j43J93j5j1j66J86q2J97k09m4J37N8j1k8P8r1J80j22J07p1L3Q0k35
3473a8L8P4k23Oj4J94J35j36j4r6q4O0J88j71j89J92O4J21O6l23O7n2J43QP2j44
3499c6Q4o8l3J8q0j01Q3rj62K58q1J64l2qJ49n3j11J37j11k13M6J3P9J52q9J07
$$ y = [-126, 187, 30, -75, 9, 34, -226, 40, -6, -30, 175, -159, 123, 66, -18, -31, -35, -283, 87, -215, 98, -85, 32, 110, 216, 63, 7, 123, -47, 104, -65, -95, -77, -52, -112, -146, -112, -2, 163, -240, -67, 46, 19, 70, -72, 133, 93, -24, -101, 30, -153, 81, -55, -13, -131, 51, 112, 235, 5, 31, 2, -24, -56, 133, -41, 96, 148, 79, 102, -14, 179, -177, -35, -140, 52, -71, -255, -123, 33, -128, -125, -31, -189, 138, 110, -122, -170, 114, 207, 87, -79, 217, 12, 199, 90, 133, -126, -240, 39, -3, 153, -3, 62, -111, 71, 98, -139, -143, 117, 80, -190, -15, -266, 266, -12, -145, -39, -182, 11, -4, -15, -181, 5, -77, 120, -89, -133, 4, 62, 51, 23, 101, 10, 190, 68, 175, 104, 137, 217, -18, 20, 94, -129, -123, -137, 57, 192, 56, 42, -54, -138, -78, 110, -61, -250, -58, 6, 127, 193, -130, -63, -115, 28, 36, 108, -36, 48, -20, -53, -35, -115, -216, -133, -142, -304, -46, -127, 37, 5, -3, 146, 93, -18, 119, 8, -205, -159, -146, -67, 85, -4, 103]
3525A03j85L27l10n9J97j73J46p8Q6j70M6K24q6J29l16l4K40j28o0J06j37K51
3547A19j48R5q8J49j3j78J29R2o7J9r3R4k0k54J82j90J75nn5n8K6J49O5k61J19
3572a7j5j06j08L93J0l03K37k58L14j32k21L35j2J84l67J33r7q2l24M65j1l9J29
3595A08p6j51J38L0k8P6q9j19L2J17j2j18K3K73p8j10J70k90J2J58K9r4j66M88
3619C23m14J91ln6j03j7J74j28OJ01j18P7l1l4J23k58j00L06j8K9k3j23K66o8
3643A02j29J1j60J72R3R7k2j23L2J9j46J6k41L70j60Q3kl1J66l37o9M07M2j58
3667C2rp1R3lj3J9K91m06J13l6L0N1k12J58r7J23k2Q4L5l09K34p6J07p5o5J75
3693A51l24L41l36J86J5o5p0Q2P6j79K70r5k37K65J48l16j06J15J67j11J6ON0
$$ y = [103, -82, 245, -65, -124, 73, -100, 46, -32, 54, -116, -70, 154, 68, 197, -119, -153, 87, -41, -101, 5, -132, 119, -29, 66, -22, 127, 114, -64, 65, 157, 90, 109, 16, 110, 90, -164, 18, -172, 3, -2, -57, -115, -89, 60, 125, -136, -17, -32, -138, -246, 147, 157, -146, 91, -167, 147, 15, -206, 129, 117, 301, -66, 67, -30, -112, -436, 29, 18, -21, 108, 32, -119, 19, 49, 21, 97, 8, -111, -79, 38, 26, -92, -69, 204, 126, 16, 186, -104, -92, 66, 95, 1, -165, 323, -91, 100, 97, 41, -62, -79, 95, -33, -27, 74, -44, 33, 2, -32, 91, -167, -267, 39, 21, 50, 27, -96, 170, 102, -27, -16, -176, -4, 89, 186, 164, 41, 73, 92, -54, -38, -279, 91, -69, 14, 12, -19, 147, -190, -259, 148, 190, 32, 23, -48, 45, 42, 29, 48, 339, -67, 46, 10, 40, 91, -121, 37, -60, 63, 41, 125, 160, -149, 85, 9, 116, 41, -24, 151, -173, 168, -168, 18, 33, -32, -102, -20, 56, -123, 147, 52, -185, 80, 228, -88, -194, -79, 88, -23, -7, -1, 49]
3716D9q1k8J03Q6o6L4l11K18K2J31J0O1k07O0j12O9j0l44M63k29J83j6Q8j41k1
3741A1J74k67J26k04K09k57K6J00K4Q3j66J08j37J58QNJ92r0j72J05M6j5ro0J47
3766A45l60L41j94L43l30k7Q8j01J47j26J45m02K82j68K46m3lJ3J37k10O4k82
3788b95L47j01J61r8j98n9J27J55j28L2J10j26p1M49m15N0K34k66J2O0j31OM9
3811i6N8j70J75M2J59r6j28m4K92p7j89J52J0p3j62K23j76q8K76L6k09J7l0M6
3835e2Ll9O9m6o7J51n5m4J14j10J56L7j84J51j33Q1kJn3q6K42m1k23K21l39J17
3861a31J01M8O0j64J66m3oJ84j21k2k08p6J94J15J67l38m5Q8J87j14J29k62j5
3884a06K29k41K15R3j41J05j13l2J00j08K07j18L2k04J71j25j7j13L56l53J55
$$ y = [49, -32, -60, 43, 129, 63, 97, -214, 4, 26, 157, 167, 228, 21, 81, -31, 38, 28, -316, 147, -82, 101, 85, 173, 32, 11, 185, -82, 44, -160, 49, -208, -182, -82, -58, 25, -141, -33, -170, -12, -4, 1, 193, 103, -69, 36, 82, 67, 58, -2, 145, -215, 126, -68, 275, -55, -82, 6, -95, 52, -74, 71, -331, -49, -217, 29, -14, -17, -4, 133, -77, -13, -295, 52, -49, 112, 14, -184, -243, -116, 39, -89, -57, 53, -73, -144, 305, -110, -60, 174, -92, -80, -20, -151, -145, -96, -38, -208, -33, 9, 168, 72, -56, -100, 192, 115, -74, 78, 88, 15, -147, 76, -100, -188, 88, 124, -85, -68, -98, -52, -49, -88, -19, -65, -132, 19, -36, -80, 34, -76, 80, 117, -67, 84, -49, 32, 30, 31, -22, -108, 134, 93, -130, 91, -248, -131, -30, 18, 78, -86, 80, 37, 31, 215, 94, 72, -136, -212, -18, 97, 264, -74, -119, -31, 156, 42, 171, -91, -106, 123, -118, 97, 190, 49, 154, 41, 9, 109, 1, 208, 90, 122, -82, 89, -36, -53, -166, 190, -163, -8]
3905hM3k8J25n2O4j58m5K04k36JR7%q0j28K12J89j04j25q2J99q7m5J09k43K78
3930A00l20L01j01N8K0l9o0O7m2k61L42K2l30J49J18r6K32k04pl5k4K73j18q8
3954d3j52L20j0p8l9j4J25o4j17J94j44j15J99j93P3j49L07q0m0J85j16J44k35
3977d2qK00k16q3J40L8M2j49m0L46j9k44J46Q7p9j6q3K5q6J7J55k7j09Q2j22Q5
4003D0P8k67K55j30L55j97r9j07%J08j74K5J89j44Oj02L48l01J25J22o2j35M1
4026b6K46k47m3J60j4o6r5j27L03j27J08L3j89J97j07Ok2N9q1M5j74R8J26k10
4050a47K05m03L98l30L00r6j91K89q3K5j10K47j65K9J51r2j59K09K0j55OK2j68
4073a98J62j8Q2l0j3l9J30r0r9l5r7J59Q4k88K21J41q1l6nJ2j3K24k14%L8L3j45
$$ y = [-8, 35, 7, 132, 80, 144, -14, -59, 145, -91, -90, 7, 7, -73, -201, 11, 200, 96, -29, -111, 88, 1, -44, 65, -178, 100, -220, 81, -20, 38, 58, 19, -41, 26, -16, -277, 65, 87, -243, -94, 24, -72, 160, -44, -51, -86, -110, 163, 45, -43, -195, 125, 115, 37, -2, -16, 109, 45, -72, 122, -22, -137, 62, -131, -58, -207, 100, 20, -20, 165, 49, 193, -42, -50, 150, -66, -149, -9, 29, 71, -78, -118, 228, 209, -35, 111, 198, 119, 103, 20, 45, -41, -24, 131, 104, -5, 77, -45, 40, 118, -149, 106, -24, 331, 134, 35, -72, -72, 36, -138, -113, 76, -68, -62, -164, 184, -117, 8, 130, 68, -67, -26, 220, -27, -70, 90, 76, 10, -85, -212, 91, -36, 72, 105, -84, 113, 6, 12, -10, 49, -32, 13, -161, -63, 63, -147, 58, -345, 53, -277, 23, -73, -264, 25, -58, -33, -143, 104, -61, -32, 119, 27, -132, 77, 97, -58, -52, -30, -198, -36, -54, 28, -2, -15, -54, 76, -14, -113, -148, -245, -86, -2, -290, -69, 72, -9, -45, -50, -38, -51, 173, -41, -41, -3, 30, -115]
4100a15P9j40J54J01O5k31J3Q5L3Q2n6P5l08J04O1J55j66Oo0P7K7k06M4J63k83
4125b41J15j67L47j00J32j62J89k8k09N3J09Q0j40m4L0rj79L24l2m6j58P7J15
4148E6k37K17q6L1O3j84J37j34L08j51M3J02j62o4K31J7j56n8k2r1K08j4p3K15
4172A96j72k06J52J80j51k1j68Q2K10q6k24K63N4r9R4Qk81K91j36L4k3J90k37
4195e0N8N7n6o7J82j41Q6j51J22l40R8J98p6J24k96P8n9J30k3J12J4j75K26j53
4219a02Q9L0j24R8q%P7j09N9J6k30J44J02P0j90L5JJ87k36J18r2R2L4j04J9R0
4245F6rp4p5J17j53J74l9J79l92M49m22J80m3O5J28k40P0R8P1k37Q3k0j5l3L35
4270B63j40p7j27J99mk69R2J21J44j62j56K93l58K98j94j8QJ48P5j59mQ7m1l0
$$ y = [-115, -36, -176, -22, 79, 144, -87, -74, 11, 44, 126, 70, 145, -163, -59, 2, 157, -9, -3, -63, 14, 41, -165, -121, 42, -241, -126, -293, 54, -46, 86, -76, 113, 85, -124, -71, 38, 118, -22, -66, -36, -45, -224, 100, 68, 22, -136, -59, 56, -181, 36, -50, -19, 44, -140, -3, -137, 171, 20, 63, 165, 3, -61, 170, 187, 31, -27, -49, -140, 68, 54, -19, 196, 24, -182, -30, 150, -1, -22, -190, -108, 102, 16, -208, 55, 109, 10, 104, 112, -169, 122, -14, 20, -3, 187, -50, 8, 65, 9, -58, 124, -17, 69, -82, 40, -300, -202, -4, -80, 44, -252, -174, -233, -103, -126, -14, 0, -175, 51, -102, -13, 17, -107, -9, -17, -17, 60, -49, 10, 26, -204, -60, 42, 112, -78, -43, -42, 145, -91, 27, -65, 27, 61, -43, -24, 66, 57, -17, -92, 25, -128, 46, 7, 186, -206, 243, -179, 1, -42, 23, 151, -89, -19, 79, 150, -87, -4, -24, -39, -72, 263, 123, 46, -81, 118, 114, -155, -63, 58, 202, 40, -116, 177, -181, 117, -77, -95, -87, 61, 136, -23, -27, 60, 19, -11]
4294a1J91k31J11NR5J8j72J3K8P5J32l12Q3K8J2j09J26k21Q5k0J31k0q1L1N9k1
4320B5OJ34j94q3K60j19k17J74n1J14j49K02j32o4K19L1l18R8L14k58K52k86N4
4343A2k36j6M68j66j29K0N8j9P4j35J71j1r0m3L21k97K14p2J4r7j83K4J33n3m3
4368h1J39j45j7J5o8J64O3j3J71k93M9q6nJ83J9j05R1p3P0l21R3K9o0L61k25J69
4394A24k65J99j27J79m9Kl59N38n18K33L11m20J08L7K90n24K62j94J33j62J59
4415d3J24j09J4K52l38J56j15K13j38k7q3O5J73j78J95j62o0K22j41j8N3j47J25
4438C3r6J65j30J05ORlj52J08N2q2k5nj4Q6j66K52j19%L4M7k4n3j8k58J46n9P3
4466h8K2K68k7j51j8L0m5O1J5r5J8J87k10L7J60j92J77l93J9J79Q4M3k34p6L58
$$ y = [-11, 180, -51, 60, 65, 160, 178, 6, 19, 47, 122, 254, -58, 25, 53, 65, -44, 82, -139, -54, -74, 57, 37, -44, -13, 46, 25, 31, 165, -29, -112, 148, 29, -188, -14, -65, 49, -100, 102, -30, -94, 125, 156, -162, -64, 250, -8, 244, -42, 12, -224, -240, 228, 62, -67, -47, 11, -8, 66, -69, 102, 91, 1, -42, 279, -18, 196, 124, 138, 41, -142, -118, 15, -38, -81, 58, -87, -104, -89, -157, 7, 70, 57, 228, -65, -16, -102, -107, 76, 95, -10, 81, 8, 78, -243, -150, -121, -181, 180, -45, 124, -141, 58, -69, 110, 61, 63, -296, 242, -276, -43, 268, -152, -44, -7, 283, -241, 21, -173, -40, -202, -43, 81, -28, -14, 238, -100, 56, -59, 154, 16, -11, -94, -29, 144, -34, 161, -1, -61, 161, 20, 2, 55, -92, 33, -63, 102, -28, 77, 83, 92, 89, -63, 45, 97, 15, -10, -15, -29, 57, -109, 143, 24, 24, 58, 105, 81, 28, 10, -248, -102, -161, -88, -66, 202, 175, 24, 6, 36, -9, 52, 67, -28, -10, 177, -33, 4, 164, -28, 149, -244, -225, -46, 38, 81, -153, -229, 129]
4491A29j16J7j70J98k9j26J83M3l17J74J78l51O2J75j7P1l5l3j13R9p5J36j76
4514i3J8L52k42R6l1j96j43L65jj45J48j99M27n20J26J70J8j26k6J27n5N1j73
4537e2J50j74O9q9j19J52J26j71L36r3j67r4K58k31m9J19O8q6p3L17k40O0j19
4560a02J55l4q7J78q8j9M9Q9k79J26L3P5r6n5O8J92j50j43P2m0J4J57j30K8N5
4585F8j47J13N3N9k78Q9l6N9k0m3q6J32R6j36J78j35J51j3j82N4K92k16o1L0j69
4610a48K40p3j78MK46j64M4o3R0OL4k45l3J87R2k15J54j77K83n9J52l26J54J77
4634A82k05J51j58N2kP6q9n4L8O4M5j59n0K45o1j22L2L12k43K0j6M9k17R1K15
4659A96j94n0Q2j0m4NL3J32o2L4j63P4Oj69J39N9k33K35K4m5q5o0Q5r6R7k04l4
$$ y = [129, 13, 30, -140, 58, 29, -97, 86, 129, -188, -14, 164, -187, -125, 50, 33, 104, 69, 36, -77, 22, -53, 83, -93, -75, 277, 35, 131, 100, -96, -239, 126, 125, -20, 128, -71, 356, -164, -38, 132, 150, 24, -2, 125, 70, 121, -52, 98, -76, -7, -96, -215, -63, 63, -108, 228, 135, -32, -126, 132, -99, -148, -29, 39, -47, -120, 197, -43, 17, -102, 53, 19, -68, 110, 22, 3, 52, 141, -138, -12, 21, 96, 0, -55, 13, 205, 55, -88, -16, -56, -42, 115, -15, 13, 68, -79, 34, 87, 146, -132, -43, -79, -20, -40, -83, -169, -37, 59, -77, 101, -34, 117, 104, -78, -24, 268, 52, -9, 21, -148, 92, 19, -159, -155, 91, -73, -29, -92, -2, 4, 38, -207, -240, -53, 39, -176, -22, -199, 84, 25, 177, -149, 5, 182, -23, 128, -30, 22, 20, 96, 7, -47, -9, 55, 100, -59, -109, 136, 75, -47, -15, 297, 54, 74, 58, 107, -110, -19, 196, 2, -48, 34, 24, -20, -15, 18, 150, 88, 122, -41, 33, 39, -130, 9, 68, -165, 70, 94, 49, -36, -96, -11, -107, -10, -214, -248]
4686b48K78p1q6J80J39j17j18P2J34l08o1L66j35q7J13L5j64J45O3q4m0k35J55
4709g4P3j6j29J29j25O1R7J50k51l4J30LQ5j65n2M19l79J78j60J8J41k93L49j94
4733c9J12j75R1J67J1j12l2J62r2j34J51p3r0L03k88K32l62J70K0r4J66j90J29
4756C3j11j8J66j14O8j10M3O2n7L5J32L7j58j68K51l9M6l5M9k3j5P1k58R7l4j2
4782f2M8q8J18m2J77j96l0K1JJ03n3J12k7n7R0j48J15p7l7n9M5L01j62j88R1J0
4808Fm5L7q1l0Q8O0n6o6Q1J60q8n3n5m8K12l8J10k21k3k48J24K1J92M8j5O0j0
4835A22k03J31k15K20j22P6K28L4l64Q9q2k1K84j78j84J47m1j42K74k6J33J0k32
4858f2Q2Rj07J48J2j34O3J41j29l7L3p8K03m26K80J55o5pq9l1j3K02k42Q8M9j81
$$ y = [-248, 30, -41, -127, 53, 192, 75, -43, 29, 163, -145, -206, 160, 25, -62, 51, 86, -78, 67, 130, 46, 6, -229, -74, -1, -17, -146, -17, -142, -81, 16, 166, -85, -119, 11, 14, 99, -66, -118, 301, -78, 100, -60, -42, 99, -194, 155, -39, 73, -102, -11, 156, 167, 55, 23, 185, 93, -41, 110, 37, -53, 250, -38, 194, -168, 2, 22, -72, 94, -96, 33, -78, -96, 70, -44, 24, -86, -43, 19, -38, -3, 129, 166, 8, -160, 91, 52, 98, 63, 112, 89, 74, 145, -113, -16, -50, -62, -14, -102, 16, -26, 151, -45, -75, -54, -53, 50, -3, 109, 82, 25, 115, -33, 82, 5, -32, -91, -46, 255, 93, -95, -4, 6, -39, -2, -83, -113, -25, 35, -21, -87, -6, 154, 66, 13, -42, -90, 122, 84, 194, -27, -50, -298, -174, -153, 39, 87, 72, 132, 122, -81, 50, -165, 55, -67, 9, 237, 271, -93, -4, -86, -107, 177, -1, -185, -38, -79, -221, 53, 27, 160, 170, -62, 20, 29, -78, 70, 82, -52, 11, 152, 23, -14, 19, -59, 144, -282, -2, 153, 88, 81, -8, -39, -52, 150, -92, -4, 45, -136]
4884a36K12k76jJ34J06N7q9k0j0j4J89k07K68j92n8O5o7o7M3o5Q5p8J68k6jL5
4910E5L6j71K8q4K17pj01M2j80k9m1K73j50K13j14O6j52Q2J33j97J34O0J13k08
4934A8j38J16p1K42j36j24J76m1l3m4P7j47r1Q7K15J54k09j59J13K44k84rk95
4957c39L09O7j11K71j74j96J53l7Mn5j01L67j51j30j2J42j80O4J18K12j60k43
4979a82J85K55l35J4J26q1q4R8L8Q6j32j72K10j76j36K36M9J50m11K31m9k4L2
5002g2J98j49n3J50N0o4J8k5J39o9o3p9j40RJ40L9r5J91k78K11r7K40j46l70M75
5027A60r3j39J37L0rl6q1O1j89J15J54k15J13j33NK10M6k43M5J07p9j3N9J27j73
5052c4o0K00K7j95J63k9q9P3Q5q2K2j07p4q6J02K64m7J2r3M0N9j31j56N9p8L74
$$ y = [-136, 76, -200, -201, -67, 39, 96, 7, -13, -23, -37, 152, -55, 213, 21, -37, 28, -39, -106, -63, -128, -43, -121, 47, 21, 20, 55, 91, -80, -52, -136, 81, 74, -27, 15, -165, -194, -235, 38, -112, 101, -13, 53, -99, -17, 116, -81, 53, 113, 226, 18, -120, -4, -75, 167, 31, -93, 83, 42, 9, -35, 42, -105, -196, -109, 106, 260, 51, -108, 5, 249, -35, -44, -339, -30, 37, -74, 197, 23, -173, -20, -57, -53, -108, -209, 158, 7, -123, -135, 7, -173, -109, 9, 221, 61, -182, 3, 258, -77, -63, 63, -18, -102, -4, 34, 120, -12, -184, 26, -150, -286, -50, -1, 149, -262, -31, -80, -104, -72, 126, -23, -76, 74, 124, 60, 78, 53, 192, 123, 60, -19, -159, -150, -10, 29, -66, 125, -153, 58, -39, 201, 55, -315, 160, 67, -72, 65, 95, 86, 50, -31, 30, -159, -44, 110, -105, 8, -125, -120, 90, 136, -107, -62, 45, -34, -47, 12, 139, -34, -94, 106, 133, -62, 101, 72, -17, 56, 141, 59, 81, -26, -100, -186, -84, 180, 133, 145, 52, 92, 151, 20, -136, -77, -155, 219]
5078B19l86K65N8l5j72K2J19j55q2l5K61j39J21k07j0m3K74J71l4m0j33J04k50
5101a07J82J35k66O2L6J4j15KJ80q8K0k13KL07o8M2m7J9k02K2J00K4R8j80J22
5126H1J2j97L3K43k52j12K40j61n5K51j0j51Q7k11K45j3k67L12k8n6J23o9j02
5149e7J88j79K0k67K30m2N3k7j30J41Q0J65k60K04j50l2oJ95k1j63l2J50j17m5
5173a02K32j85L7p8O3K10j38m4J04K9N4j61J35J76m51J88j00l5K02k69J77p2J8
5196a0o1j88L85o9nk8k9k1j4M4j10K0K18j01R9m9lq0p5K2J92k26j00L60l2JO8
5223B08j47k33J23r5n0K84k24R9J68Q9k06K7O9k31L05j04rJ89k64J11p0Jj68J37
5247IR8r7K3no0k1R4j09J11o7j6K8J42m2n6q6K10k21o3J52Kn0K4rj07K26q8P0
$$ y = [219, -167, 98, 156, 121, -51, -29, 90, -65, -147, -182, 79, -60, 61, -146, -156, -199, 75, 246, 212, 172, 39, 143, -107, 75, 210, -56, 6, 42, 56, -59, -57, 123, 35, 55, -158, -156, 151, 83, 125, 78, 97, -105, -83, 17, 41, 139, -41, 81, 93, -104, -71, 172, -80, -192, 48, -113, -168, 83, 73, -78, 9, -202, 43, 30, -237, 75, 47, -9, 114, 45, -57, 131, -48, -28, -295, -65, -107, -54, -81, -211, -70, 10, 175, -85, 119, -31, -63, -69, 126, 105, -58, -90, 60, -57, -102, 130, -55, -18, -96, -33, 177, 39, -5, 99, 128, 182, 21, 156, 332, -119, 69, -31, -66, 136, -133, 44, -28, -10, -71, -259, 126, 57, 52, 24, -5, -26, -40, 4, -106, -86, 132, 31, 130, 81, 78, -2, -77, -55, 137, -89, -189, 171, 139, 140, 208, 61, -172, -49, -144, -194, 90, -134, -35, 133, 222, 16, 43, 112, -119, 186, 82, 73, 262, -2, 109, 39, 40, -128, 9, 107, 10, 33, 28, -32, -53, 41, -68, 43, -24, -40, -12, 130, 88, 32, -54, 156, -65, -128, 24, 26, -24, 0, -9, -116, 110, 22, 92]
5275I2M0k18j9M33j86l37K80r7k6K6on2J51k23N4P7m7j15J43j08K20j43J52K8
5299A19k39L72k01m5m6P5o0P3l4j10J57m5M0q2J61Kk65J52j32K29k59%P7P1j78
5324a68K03r0R8q8J5J06j41J17j47J07K9m8J0q9J06O8o0r4L6L26n73M35q8j79
5348a09N6Q0J41m6j16J14j6k67J34L28j15j52J27l13J52p8R6k43K57j22K23q3
5370D8J42n4k56kK4R8l7N7O4j66r0O9K48k11P2J46k47J60o9J52k73L7K21j27J57
5395A63r6p5Q4k66J89L6l0r7K3P5m7j25l7K91j15N7p9k18L22r2j75K04K22k87
5419g3l8o4P4j23R0L18j71j19J95J2j37O1J97k85K45j81J34l10K62k51K27M7O9
5442A79Q0k21j09J60j61L8L23k21k5N5j25j22K37J21n4k35J37j18O6K52k50p3
$$ y = [92, 132, -86, -105, 328, 142, -195, 85, -12, -38, -12, -18, -70, 81, -142, -88, -11, -58, -173, -30, -138, 82, -61, 91, 119, -120, 252, 51, 6, -40, 35, -25, 48, 14, -96, 61, 16, 56, -26, 135, 137, -128, 24, -108, 121, -138, -138, -61, 10, -168, 35, -55, 43, -45, -30, 76, -65, 52, -95, 12, 41, -7, 3, -86, 20, 88, 28, -66, -30, 296, -277, 158, 70, -109, -53, 27, 168, 122, 6, 120, 104, -163, -29, 299, 184, 32, 159, -154, -2, -80, 16, -227, 30, -92, 131, 48, 190, 136, -120, -122, -98, 0, -37, 20, 84, -82, -172, -103, 145, -66, 6, 152, -95, 65, -4, 148, -125, -88, 133, 6, 163, 67, -8, 76, -190, -1, 35, 5, -92, -69, 6, -41, -166, -203, 88, -27, 30, -49, -267, 55, -37, -212, -8, 214, -73, -111, -175, -101, -224, -134, 184, 13, -106, 89, 101, -36, 25, 222, -63, 182, 1, 135, -175, 87, -164, 63, 110, 179, 259, 38, -71, 89, -72, -34, 289, 68, 43, 98, -27, -149, 88, 209, 155, -80, 57, -61, 5, 257, 7, -66]
5464f6J30j48J77K2j37N6L3k25M8L50l15M2n6J2K40n0k0r4L0J40%j45j64L2o6
5489a74J29K37k25L8J16k8L0p1q3M9j12O6L8p0k01kJ51R9q7O8L6P8kj65N0K54
5515B19l72M0P0N9P5o4nM9j56J48J8k82J12l8L5j09K43N5j25q2L26k68J62M8k18
5540f0j38J22O8J34q5j20l4P4J52m2P6j20L8K7j28J38j05j6L7j85P2J28L6k36
5564a67L65k04L9J22j80K6L56m54K26j98k8J1M9J32o6m2N7j68J77k26K07R3k29
5587a02P6j32J94Q0j89J00J1P1j36J47o2j13o9K15j08k07M14j77j49K7k0R2l5
5610g2n2R6k9J92k98J94mkJ76l3r5O2j51o5m3j52J91n8L12p1Jj61j46K33J92m47
5636b30J86l1j26K83Q0k29k1K19r6J52k23k7j28J22J55k64K46j07K10k64J32o3
$$ y = [-66, 64, -84, 93, 115, -22, 34, 67, -158, -110, 240, -75, -33, -89, -77, 163, 113, 93, -1, 29, 169, 169, 24, -140, -108, -174, -45, 192, -33, 5, 121, 93, 123, 52, -31, 18, -94, -28, 10, -60, -261, -263, -112, -13, -100, -32, 4, 82, 80, -85, -35, 219, -153, -113, -43, 16, 91, 27, 22, 71, -85, 63, 81, -201, -89, -127, -92, -201, 42, 97, -28, -110, 216, -52, 110, 158, -60, -198, -76, -8, 126, 41, -79, -113, -39, 113, 71, 147, 27, 65, 92, -36, 102, -3, -19, 18, -167, -95, 33, 69, -167, 198, -6, 33, 155, -25, 1, 357, -97, 129, -69, -97, -86, -37, 95, 29, -13, 44, -124, 53, -173, 34, 127, -102, -26, -158, 36, 116, -73, 27, 38, 109, -27, 120, 58, -55, -124, 91, -17, -224, 190, 13, -136, -109, -129, -37, -72, -124, -28, -57, 135, -163, 31, 27, 25, 201, 168, 73, 135, -16, -81, -124, -276, -85, -143, 169, 98, 99, -62, -208, 25, 217, -230, -44, -75, -201, 82, 162, -67, -88, 131, 35, 187, -36, -63, -191, -69, 86, -178, 68, -39, 171, -93, 39, -24]
5658b4q2o2J05L55k54n7j09J56J43j16p7P3N0pJ18j19j73j0L2j62J93M3J17m1
5682I2Lj10q1O0J55J04j29k01n9J89L8k00J45p9L6L8Lk2K28k12n5P2j4P6j0n9
5708Hp3P8k47J64O1J63J2j10k0o6j22m7J03J40l9j53K21k71N5mJ66j14O9M1N5
5733G0J2RL9l9j86K14K0q5j97R3q8O5J59J43k24nM7j7j8P7J19m00nL26l56J20
5759a07J05j25L6O7NRM9r3L5J2jJ8l0P8j50J11n2L9M4j45K11p4j17PR8k52J39
5786h3K09l93M00k33J28j2J63J24k92N6p2j11J65L5L8m8j25J14J64k05K5m5K67
5809B69j75kl9l9j81N5J37R5K8n0k23J31j59J41m1R2k12kK66K3k66J05K9j4J29
5834I7j25j90l7J41P4j43n2K57m2l6j2J85j81M3R2k25R8K46k31R3k5j03M8L8L5
$$ y = [-24, -106, -168, -63, 292, 38, -19, -128, 28, 171, 55, -22, 51, 101, 94, 212, 93, -80, -90, -58, -220, -27, 16, 133, 92, 95, -15, -96, -36, 119, 223, 94, -107, -166, 23, 61, -139, 6, -73, -37, 1, 4, -18, 210, -2, -57, 15, 1, 77, 67, 8, -65, 13, -234, -70, -9, 154, 166, 56, 36, -30, -152, -199, -96, 44, 5, -148, 73, -198, -143, -147, 19, -95, -26, 15, 70, 82, 91, 130, 91, -95, 119, 139, 54, -143, -50, -138, -73, 86, 229, 5, 0, 47, 30, 12, 89, 208, -192, -197, 129, -227, -107, -2, -127, -91, -24, -19, -10, 39, -54, -19, -7, -8, 10, -20, 58, -92, 19, -33, 6, 50, -95, 116, 42, -75, -68, 30, -222, -83, 126, -267, 133, -100, 28, 16, 179, 303, 11, 67, -5, -116, 49, 84, 122, 74, -51, 63, 227, 22, 47, 2, 269, 94, 92, 53, 14, -167, -112, 25, 120, 148, 98, -125, 6, -153, -12, -53, 39, -173, -175, 91, 114, -152, -47, -18, -32, 97, -28, -218, -255, -114, -40, -183, -235, 22, -20, -56, -68, 117, -64, -21, 71, -154, -56, 190, -41, 52, 27, -76, -28, 10, 45]
5859D5K4j09J08k26M82k70j50J04j59K10J63p6m01M30l78mR5qK22J10j62k16J94
5882B8K9k54L27k85n7J48M0J61j50j00K52l32K51J31j81m7o9P0q3mK60N2j39j6
5906C2N2k74L7J2J25N8rK0p8l5l5J87Kk8k09J45p6j2J64q4J7N9j28q9J87m3n0
5933e3P9Q6j37nJ6Op0J14O9j44K98k81J3j99L10j90PJ74j36k5k7N9P8j63J7J76
5959G2N6Rj46k7J53j62M8kLj98L16j39k7lN8O0j7k59J89j2j36K47j45j24R7J58
5985F9Lj67P7K15j83J40j77K0j6K1J91j00j58J10j70J33k3J59l1k00K20P2n03
6008b98J84K4j56K13P9Q9k78J08J48p1j35J57k06l1J00P8K04j46K7j57P0j70L41
6031A74l36L51k27P0mq1R9koK6o9n7J8J62p6r9k01J56K7K25k41Q6N0j18j21L34
$$ y = [45, 69, -40, 68, -158, 324, 54, -96, 8, -151, 59, 222, 146, -255, 175, -203, -207, -112, -120, 102, 212, 50, -166, 28, 57, -197, 130, -155, -212, -64, -24, 137, -13, -113, 139, -193, 58, 189, 8, -39, -108, -38, -121, -125, 135, 187, 48, 32, 84, -190, -153, -141, -16, 42, 33, 53, -25, -60, -95, 92, 94, 66, -143, 2, -74, -86, 78, -6, 11, 70, -58, -147, 40, -3, -53, 26, 112, -25, -30, -14, -8, -78, 36, 105, -39, 259, -22, -9, -208, 102, -88, -81, 93, -43, -68, -95, -36, 42, -121, -104, 72, 128, 137, -9, -36, 117, -45, 3, 1, 4, -194, 122, -17, -44, -47, 11, 71, 54, -205, -16, -28, -164, 83, -62, -186, -89, 69, 72, -95, -18, 197, 14, 154, -23, -3, -19, 2, 193, 93, -65, 45, -125, 8, -15, 144, 113, -87, 133, 205, -298, -114, -90, -246, -33, 46, 135, -143, -35, 113, 42, -93, 64, -142, -173, -73, 5, 209, 63, 90, -67, 3, -167, 174, -162, 189, -38, 32, 28, -53, 46, 44, 38, 64, -5, -62, -44, 118, 42, -57, -258, -102, -75, 150, -91, -5, 45, -73, -194, 140]
6057A40j87J9o8l1K34k7l5q0j93L48j33R5k31M05n8k31R1p1r0K5J15j71K11K7
6081A04m8j67J32K1N8q9j25J30M3j46M6J17p7o7K09k85K98m08J49MM87k04j45
6104C7j10N7Lj81K24M3j49RQ5p9R6N9j72q9K59k03K09q5M9j23J57j58p8M16k92
6129a6L5l4j61Q8M8P0L27m03K89k75M4m7K0J4q3M11k68K0o5j52J64J67p0o6j00
6154d3mK1J70m1j53J13O1l22J62O2p7m4n5J04j3o1R8O0j04K9j52R1K06P1j01k6
6180E2k67J78J66k42j01L47j80K23j22Q2j29J56l50J08J13j9J37l07K82J39n32
6201b66K87j11J22qo6L1nQ7n8l4J25l1ql3K4N2r0l03O02k82r9J04j3J9r3O7L2
6228E2k9n0p4j1K83l0n7k22J53J19L2m8j91O1J85Jj37j94P5Q5J70k17m2J2L0J59
$$ y = [140, -47, -28, -96, -127, 107, 80, 45, -35, -228, 120, -13, 82, -149, 256, 198, -33, 58, -13, -103, -78, 37, -134, 77, 104, 56, -111, 21, 42, 100, 11, -114, 16, 59, -87, -41, 76, -1, -68, 141, -144, 154, -254, -105, -101, 386, 182, 37, -73, -16, -13, -194, 30, 73, -76, -67, 18, -61, 35, 94, -78, -167, 92, -111, 98, 13, 62, -61, 96, -62, -140, 276, -16, 19, -15, -176, -88, -40, 30, 357, -46, 243, -32, 12, -35, -15, -1, -84, 327, 59, 79, 14, -138, 26, 193, 123, 57, -43, -47, -26, 144, 103, -50, 63, 124, -198, -36, 26, -51, -95, -150, -46, -59, -120, -22, 38, -66, -37, -189, -98, 108, 179, 78, 52, -215, -37, 129, -113, -214, 133, -47, 176, 54, 136, 7, 163, -187, -79, 34, 15, 152, -155, 127, 266, -266, 21, -90, 32, 24, -42, -11, -16, 71, 13, -21, 104, 73, 65, 32, 56, 108, 18, -285, 317, 35, -64, 40, 27, 46, -47, 20, 52, 23, -27, -101, -112, 171, 141, 84, -138, 15, 134, 166, 118, -73, -12, 173, 174, 37, -157, -82, 3, 173, -44, -86, -74, -44, 115]
6254A15j00K9j46J99j08J27k22J03j55J08J92k45K90k16P1J26j45Nj96J43J00
6275G5p8J10L8p3r4J24LL2o6K5j23p0K34j53M1kJ6l7l3l8QJ3R7Q3p2j51q1J48
6303b4j20J12j6J83n1j31K52m1r3k26O0K08j68m0q3M27k28o5N9k8J05k40J14K77
6327B43l43J16Q9j73j2k63K42J64m9jj16J35j93J98j1k07J55O7n6Q6j59L59k52
6350A9o0k74M53j26k5M4j78PJ00P7j20J53N1q7P0p0Q5m0M8O0n3j93Q1J13p8r9
6376d2n2K22j91J25k47K42q5j5qN6j79J75j78j1J20O0P2j93J7MM0N8M5K6l6Q7
6402A12J0P5l19J42k37L95l10J13J11j83R2M1J14j67J60j81Q9Q2k94L21r5J8J80
6425B69j44O6j71J9mj64L79k11M4j31J79k10J04N9K86l64k61L1J74J44j7j22q8
$$ y = [115, 15, 44, -102, 97, -11, 116, -106, -3, -158, -50, 142, -103, 187, -29, 42, 168, 23, 28, -168, -25, 75, -3, 107, 145, 72, -22, 102, 105, 137, 71, 96, -27, -97, 137, -16, 25, 23, 39, 2, -31, -69, -61, -48, 49, 132, 60, -91, -172, -24, -144, -32, -48, 135, 84, -47, 205, 164, 71, -155, -95, 113, -55, -95, -178, 249, 21, -44, 15, -13, 92, -148, -34, 243, -100, 16, 105, -68, -80, -343, -101, 63, 14, 13, -103, 32, -161, 37, 26, -181, -26, 41, -15, 71, -88, 271, 19, -41, -315, 138, 12, -13, 31, -147, -140, -40, 37, -83, 70, 121, 34, 104, 34, 119, 79, 127, 187, 134, -59, 22, 135, 57, -42, -94, 128, -63, 62, -185, 57, -28, -43, -51, 5, -174, 1, -177, -188, -68, -8, 64, -129, -112, -108, -68, -10, 35, 61, 25, 112, 122, 197, -122, 20, -217, 178, -132, -19, 92, -91, 1, 42, 156, -11, 149, -32, 57, 139, -155, 166, 71, 89, 269, 125, 191, 20, 39, 35, -129, 250, 39, 83, -48, 131, -79, 25, 84, 370, 6, -255, -224, -50, 94, 77, -45, -133]
6448a33L94l17O0J34k19J50KM1l13O8J25J79j88R7j14r6K26n2k5M1j4J18l04L67
6472B27k45J2j47q0J86O3rJ42N5k10q7O5l8j6J80k03M5M0KM3J8m0j33l9L14l06
6498a61R1k1o3K56n6k7l4M0K05j31j28J14k03J3J43J09k24l6K98j65r3J07m4n1
6522f1J9Q7jR6j91J40o3J08O0j54p5J48qr2J86k63K1J7Q0k02J44o6K15j85J20
6547H0M3Kn7j84K00o7k9q4p9J35Q1J41j90k79K64J59k44jj58L47q6l5Km7K0j92
6573b58J52r3K66N6j61j36K15J35l78K0N5L07j46K14q0j20R5j41J45j44qN3J8
6596F6j65J5J64k7j8J49p0k07J39j42M5L47l96K60l18J28j3J05l85K77J50l29
6618b25K15Q9j70J02%o5J32Rj6P9p3j65J00J2k22K06j53L02m8rk12J83j43K27
$$ y = [-133, 261, -56, 4, 138, -81, 69, 71, 112, -201, -133, -8, 171, -17, 80, -34, -130, 96, 44, 19, 60, 46, 164, -140, 227, -18, -6, -153, -233, -47, 16, 7, 149, 204, -6, -93, -28, -66, -82, 98, -105, -60, -20, -18, 25, 43, 3, -130, -169, 145, -161, -70, -91, -154, 102, 46, 19, -15, 25, 230, 99, -29, 85, -118, -105, 38, 147, -77, -113, 185, 20, -73, 34, -10, -61, -42, 45, 44, 140, -51, 89, 26, 134, 194, 40, -35, 113, 105, 13, 199, -64, -43, -26, 54, -148, -4, -70, 145, -40, 80, 123, 125, 68, -116, 84, 17, -12, -96, -175, -40, 41, 182, -8, -287, -23, 136, -108, -109, -267, 80, -6, -41, -39, -86, -66, -258, -106, -199, 67, 123, -38, -174, 41, 176, -202, -182, -127, 180, 34, 248, 168, 48, 143, 2, 147, 3, -5, 48, 66, -99, -84, 80, 53, 35, 184, 114, -93, 46, -96, -51, 296, -100, 160, -158, -30, -43, 62, -323, -46, 104, -225, -10, 79, -91, 11, 11, -54, 78, 87, 71, 150, 77, -88, 12, 24, -198, 8, -145, 157, 109, 100, -112, 71, -72, 155]
6642A55k53l8Q5J17k48L9K17K0j75j02K98k7j10Qk2J94j33r7J04O0K00j37k09
6665e4j1r8J42R2%o3j53O8QJ40j0l3m0K13J22k55o8j87J53o9J01QJ57p2j00O6
6691E7n2J57j99j11J49j91l3J59L29j58j31k52L32r4m9J00K20k22k00J20k6Q7
6713hK13k21j19K68o3N7nq3n3o6J45q4j93J43J08K00j36q7P2n1j11RJ06j34M5
6738d8J36j73P3q0J82l7j73n0J92j85J74q4J81l3o2r7J79j8j20M9k3j10J23j11
6762a15J20j73K8l4M32j59n1Q0k08J23j97K7J01J46j16J14k17R6o9P9j63J60J01
6785A05j36M9Q2P0q6j11P4q3J20o0J9j72J66k50K43m9L5k3q8Q0K96k85r3K02j81
6810g6J43j47n6M1P2l4K3j96J28R9P1J21k42j76M08o5j45J29j97K20k71L09K3
$$ y = [155, -98, -136, -51, 66, -182, -143, 74, 94, -81, -183, 115, 88, -22, -14, -36, 158, 25, -72, 32, 92, 292, 155, -54, -65, -163, -21, 71, 71, 8, -145, -77, -69, 71, 61, 28, -12, 201, 323, 68, 0, -187, -34, -103, -2, 6, 163, 91, -9, 57, 5, 162, -37, -148, 1, -190, -223, -64, 265, 107, -24, -276, 56, -38, -87, 13, 233, 11, -189, -69, -95, -8, 205, -16, -135, 133, 70, 127, 122, 39, -14, -80, 65, -19, -212, -69, 39, 239, 103, 16, 88, 37, -74, -65, 41, -93, -48, 88, -85, -12, -92, 90, 53, -120, -170, 22, -163, 11, -73, 108, 75, 13, -84, 95, 77, -43, 6, -17, -127, -4, -115, 5, -168, -140, -174, 258, 99, 48, 128, -80, 43, -154, -127, -26, 120, 4, 118, -99, -3, -72, 7, -156, 4, 105, -31, 18, 100, 170, 84, -27, 47, -36, 84, 24, 43, -129, 37, -213, 30, -19, 16, -7, -95, -15, 281, -4, -97, 105, -76, 67, -80, -136, -95, -23, -57, -34, -230, -102, -3, 68, 189, -53, -229, 179, 114, -31, 98, -99, 121, -150, 159, 182]
6833A82k87P8N0m8p3N0n6J06R9J70k12k4r5O1M9P3k07R3J65m10J14J99p5k19L08
6858I1j01J23k82P3Q4j38K66J6j29J82l07J12J05j14J42j40K38l33J82j17j53
6879b00K43N2L6k39K68l13O6P9J6K11j04j48M4j07P1l2J16j36oK35j60J27k4N8
6903A53lj96q0K76j94J14j97K23j25j5j4J28l0n4p2O1O0n7o2O9j27J98O2j77J9
6928d0j31P2r4L24k61M9J20j77n3K1K87j0K4p6o1K5J52k05K29j34j25M4J62j31
6952A1J1k0p2K62l43Q2K30l92J50J85L0j47O7jj20J39K4m6l3j11M2j2J13k12P0
6977i3J17J19j13M1n3L0j00J84j79J12M2j64Q9rj2N5k01K09k1K9k00K22K11j53
7001A62m37K61R5o1J4p8M9k61J91J95k8k7J62q7j92j0L06k43j90J48k8J27o1o7
$$ y = [182, -105, -27, 23, -25, -98, -48, -104, 2, 101, 271, 59, 35, -60, 1, 50, 123, -84, 9, 174, -236, -122, 77, 2, -217, 91, -10, 113, -169, -96, -12, -150, 116, 132, 3, 185, -122, -10, 95, -19, 123, -17, 221, -112, 70, -47, -200, 43, 95, 131, -108, 160, -153, -87, -8, 8, 219, 115, -33, 11, -96, -25, -57, 59, -77, -83, 152, -8, 119, 95, 153, 150, -46, -126, 150, -44, 70, -127, 96, -29, -44, -58, 70, 40, -14, -86, -25, 35, -22, -84, -15, -142, 56, 118, -59, -40, -171, -99, -193, 131, -130, -81, 39, -138, -191, -170, 117, 107, 131, 55, -6, 19, 171, -34, 195, 61, -64, -20, 142, 11, 22, 2, -70, 192, -151, -69, 161, -231, -81, 104, 134, -13, 54, 53, -67, 72, 96, 50, 17, -94, -52, -64, 49, -163, -93, 24, 143, 30, 71, 18, 48, -52, 132, -47, 65, 107, -57, 32, 23, 11, 66, -135, 74, 53, 82, -118, 104, 315, 162, -275, -14, 81, 20, 34, -44, 5, -256, -65, 130, 102, 75, 237, 150, -42, -52, 254, 11, -179, -31, -59, 68, 7, -60]
7025f0Q2J04k15L4jl5O5M9J35n4M7n8l31K66j69JL53j90p4P2K74r8k62J48j62
7050g9L6O1K4J34n2k27k8J71k22K46jj28p9q0J66r3P5m4J17M0J72k66J8Rj63L41
7076A48k4k04R6J0l1J60j37N5R4k24K5p4j59L84P6j95JO0j3j25k8J76l62L61P
7101G7l78L93k1k1K6n5L3j68J32q9ko7J97j1j1J73k65Nj63L39o4j08J09j06M7
7126Bm6P1Q0J6j98J80J0j23j23j1J37kJ4j34Q5J58j7K4j86O5k2k75K05K36j08
7151C8k03J43K5J11M8k89J19N5J56j94J19k1o8j50J47J00k20j61K03p9K09o2K24
7174B50k66J7M5l4J70k09ll2K10j74K9Mk1l2QK3j3j38J44NP0j62j04J03L10p6
7200A24k16J03j65R8j04R1J64J7p8R3N2k62R2K38k42J72l14L04k91q6J76K6l1
$$ y = [-60, 22, 126, -89, -55, -56, -91, -26, 23, 158, 104, 151, 93, -238, 28, -141, -140, 213, 23, -51, 21, 295, 197, -65, 83, -79, -43, 18, 42, 176, 124, -103, -131, 40, -182, 64, 63, -65, -144, -224, -58, -151, -76, -120, -3, 37, 209, -57, -39, -30, -193, 148, 124, -80, 16, 26, -5, 155, 18, 73, 167, -57, -32, -106, -265, 119, 195, 0, 1, 61, 48, -77, -105, 71, -291, 70, 77, -301, 92, 71, 50, 76, 21, 54, -114, 18, -71, -73, -140, 57, 46, 35, 208, -57, -52, -215, 124, 60, -48, 61, -45, 2, -44, 27, 107, 123, -75, 105, 115, -8, -131, -142, -5, -7, 7, -127, -42, 116, 99, 123, -63, 2, -20, -295, -90, 146, 38, -165, -22, 3, 114, 162, -127, -8, 47, 203, 9, 128, 107, 39, -111, 36, 136, -84, -245, -42, -121, 88, 26, 250, -16, 1, 46, 12, 182, -27, -30, -62, 148, -26, 3, 7, -14, -46, -38, -15, -28, -166, -22, -17, 53, -109, -213, -110, 200, 124, -92, 11, -154, -56, -160, -69, 95, 112, 34, 127, 179, -83, 9, 247, 5, 177, -137, 167, -124, -210, -34, -8, -39]
7223c9j43K03k20K29n0J12k60J92K2j87R7Q6j45l7K37j34O1j02MR2j71L96k38
7246EK26j72J64j86p6Q9J42j66M5m6q1Q6j63L18k10K1r0J29j1J41j28Lkj65N1
7271g6p2R0J73j21J7JPj71L32k90J21m8M7P9p3k1r4L68m29J64O0J00l07J71l5
7296gR5p3j21Mmj3J64j45j18K38j22o2J40k1KN2R9l15J20J2J05j12Q5K4kq1N9
7323CJ12j15Q7k37K26m1m1L7m2n4K31k3r3k4j51K4J77j37kO7k5q6O3M0J22j05
7349A3J21r4j38K67l03J13O0n2j23J79q2J56k01j19N4J01K5J64p4k9M5r6K1J03
7373A11M8k02J29J5j17M8L2j52K31m8p2J22k27J24M2j46J34k10L34k31Q1j00M1
7396a3K0o4J29j18K15j10p8O7k00K34m7n5K16o7p4q9k1Q8j21O8J19j47J61j32
$$ y = [-39, -182, 21, -199, 30, -20, 92, -168, 24, 46, -141, -44, 42, -103, -140, 97, -37, 24, -78, -74, 18, -153, 243, 5, 231, 59, 223, 37, -39, 50, 192, 26, 71, 25, -56, 30, -133, 185, -25, -4, -94, 35, 24, 165, 37, 40, 38, -127, -76, -148, -58, 115, -6, 11, 12, 19, -152, 180, -110, 11, -37, 10, 89, 16, -5, -99, 269, -160, 4, 64, 164, -143, 28, -7, 88, 15, -106, -102, -106, -119, 45, -100, -218, 20, -102, -164, -24, -45, -43, 9, 108, -207, -87, -75, 30, -82, 3, 27, 25, -56, 3, 115, 0, 87, -150, 76, 35, -6, 31, -11, -65, 166, 143, 50, 26, -125, -101, 76, -61, -63, 4, -21, -107, -44, -4, 118, 13, 134, 40, -98, 169, -134, -21, 39, -13, -136, 43, -39, 117, -84, -203, -149, -48, -23, 141, 67, 38, 83, -13, 8, 111, 159, -43, 86, 101, -16, 32, 64, -88, 143, 95, 23, 145, -82, 42, 84, -62, 72, -138, 196, -35, 46, -54, -13, 7, -57, 72, -46, 169, 59, -19, 48, -152, 82, 35, -20, 196, 129, 55, -34, -55, 33, -88, -20, 99, -48, 113, -19]
7420a9J34o0R4k24N5N5p4N5P1k04J44j19L12j56Lk89J73J57p6l14K12K8J97O0
7444B15j98N9j42Q3Mm4j55Q1J22j12L27k33j48J11RK66k52L8O2rn8M9j19J06q2
7469b0N9j63m7K02p9M8J13p6r9q4K08P9j6J60l58K20j12j0l8R6k68J70j04K03
7493H4j45J36Q1n3j3n4Q2k33K54j70OM7J0P9j94K14l84K48k4k8K17k86K37j80
7517f9M6k43J62L17j73J49O8q6k25J5K2m7L9J58j34J29N1m51J39K13K0o1o1j0
7541c2j03J22L3J76j06k09J47O8k43K25k94J58r7K18j55n9L37j17j13o1n5P1j55
7564b44K07j15L59j32j30J94k48q0J38K24j68K5J05O9m46L35j21j40J88nm9Q7
7586E3L3P4k6j67K48k87K8L8n7K0KL02l46P8J44j99LK01j89j05J17n6m8K92k94
$$ y = [-19, 115, 55, 149, -75, -20, 35, -39, 16, 87, -117, 27, -92, 220, 64, 67, -222, -49, 108, 32, -282, -70, -42, 155, 215, 17, 76, -66, 17, 21, -23, -178, -97, 25, -87, 240, 7, -141, -30, -21, 245, -7, 31, 93, 84, 26, 75, -44, 62, -20, 39, -124, -171, 31, -48, 0, 113, 37, -62, -146, 62, 141, 125, 285, -73, 147, 35, 25, -13, 83, -185, -15, -119, 84, -61, 75, 156, 103, 90, 36, 118, -115, 139, -31, -25, 22, 32, 111, -83, 131, -253, -5, -29, -57, 160, -126, 111, -69, -23, -266, -104, 213, 40, 189, 257, 171, -54, -39, -17, -64, -25, 133, -1, 128, 179, -272, -133, 80, 100, 39, -22, -32, -135, -13, 20, 196, 90, -119, 28, 96, -147, 78, -216, -58, -155, 63, -92, -151, 186, 69, -44, -105, -160, -89, -244, -37, -152, 207, 75, -55, 139, -109, -189, -51, 173, 5, 30, 135, 204, -242, 93, -28, -168, 20, 15, -34, 53, 86, 160, 134, -33, 215, -72, -44, -6, -63, -43, -41, 261, -85, -7, 137, -62, -59, 142, -47, -152, -35, -91, -139, 153, -141]
7611a41L9%L6J07N5j02n6j13j7J56j62J63q0J6J62n8J02j48J03L9j95K0k52K21
7635a05N2m5lJ96j28J72N8k52M6l5n8J03j41K03lO3j90J58p4r0J32j35J49k07
7659a34N3j49K19K01k44O8p9k0M5q9P1n8J06J18j53J01l8Q5L6p1k37J54J3J60
7683A58k82K69k5m7k9p5J56j86L1J79k40J14j85K37o2K79m63J25n1K53j90j03
7705a37K67m4j58k0J82j1P2j65k65J88j0q4L51j27q7J17k3K8L5r9q5j0K14R3p5
7730A47j91Pq8K17k79J08J32J5j15J22j97q6J57N5L53l62k2Q4o1J7m1o9J2k7N5
7755e7p6K36P1k37j23K25R9L6k13K98l78L3J51J15o6J18j81m08M06M1j00M2q7
7778e5K23k18p4K49j4j65K5o5O8n7R9p3J07J83k38N5J7J37j23p4j55N7OL20m07
$$ y = [-141, -102, -102, -66, 41, 96, -6, -62, -175, -192, -36, -198, -35, -115, -99, 63, 5, 107, -41, 62, 101, -94, -74, -326, -105, -53, -98, -101, 95, -33, 139, 197, -55, -9, -44, -102, 1, -140, 63, 60, 123, -67, 91, 17, -73, 59, -76, 73, -134, -81, -230, -11, 190, -54, 14, -65, -85, -40, -129, -58, -116, -10, 108, -45, 56, 18, 103, 139, 68, -169, -15, -2, 158, -124, 145, 120, 73, 44, -31, 125, -61, -30, 149, -91, 23, -162, 75, 13, 292, -171, -46, -97, 156, -34, -137, 130, 86, -72, -92, 90, 79, 151, -14, -279, -91, -101, -185, 166, 39, -48, 69, 46, 74, 109, 10, -75, -85, 129, 222, 147, -44, -37, -125, 92, -187, -79, 53, 68, -47, 75, -122, -208, -51, 4, 357, -5, -27, 57, -4, 13, -28, -97, -85, -112, -57, -133, 103, 174, -63, -186, 39, 138, 174, -39, 259, -119, -86, 65, 180, 114, 232, 51, -357, 49, 90, -10, 32, -55, 168, -50, -124, 125, 111, -54, -29, -94, -26, -83, 16, -57, 50, 233, -5, 50, 67, 204, 81, 7, -148, -91, -85, 235, -172]
7803a72K94j19j6ML1jjr6J84j20k05K63K3Q4k25K30k7j11j49J14r2M4K2J18j05
7828b8j68K23r8K45n6l99K02J62q3k27J67O7j84J54j01J98J23j33J4k02J51N2
7850G9K8k11J57k51K03j51K21K0J91l14q8K04q3k3P3k1J95j98K0j47P7K30k75
7873f4K89r3j61J16J40k87J10j75Q8K04k01J80n4l2o6N2J41j28J58j71j84L35
7895A97l93J78M6K1k5j21L5K31l49Q1k5j9J15j00K76l94L79j29J0p4l4M3N6J70
7919A75j31l5p9r2L5L0n3M1J58Q1j37k04J69n4J79j64K56l38J77o1j57R5L9J62
7943I2pm5j0j31J85k72J90R6p0j61K28k43O6K4K09j69J04J2o3N5j57J57J15j24
7967H1m4j24K32k11j23R3M6k0K59j46j33J10R0j17l0k60J6K60J21qk51J15m5N9
$$ y = [-172, 122, 3, -13, -9, 22, 21, 20, -76, 108, -12, -217, 46, 69, 153, -72, 158, 131, 20, -129, -15, -107, -63, -41, 77, -28, -196, 27, -71, 174, 118, -281, -79, 83, 0, -227, -60, 7, -177, -23, -124, 74, 197, 64, 78, -124, 27, 79, 107, -104, 53, -198, 5, -146, 75, 95, 286, -28, -116, 88, 5, -18, 55, 34, 229, 31, 51, -96, -19, 211, -64, 225, 132, -29, 87, 227, -60, 50, -125, -37, 167, -34, 146, 92, 60, -6, 46, 187, 59, 217, 46, -138, 197, -196, -18, 28, 49, 24, -97, -62, 169, -180, -99, -124, -143, -28, -128, 148, -246, 133, 4, 14, -60, -94, -51, 5, 175, 44, 9, -70, -162, -127, -97, -150, -109, 49, 130, -7, -211, -42, -96, 83, -81, 175, -163, 14, -47, -204, -109, -70, 92, 85, 40, 30, -101, 84, -188, 2, 98, 28, -133, 95, -148, -82, -58, 151, -18, 86, 98, 35, 90, -67, 90, 205, 81, 37, -87, 145, -66, -189, -96, -50, -70, 189, 43, -90, 20, 110, -7, -37, -297, -281, -21, 100, 92, -159, -44, -89, -30]
7991c0M7Q5j79J32j40J88k38J19j31J21j60M40o50M55kl76K18J47J6O6M6j29J31
8014A76P2k35q5J14P0l4%j74K71j92J4P2j43R7N8j94l9L00l05J99Q5k38M3K95
8038B27k11J17j34M7P3k29p6L10k88K58jk75J72J05p2pj53K13q1k2j0l4J37O6
8062A32j84o5R2j48K24j39l2K51k79P9j66K19q4j8Q4p1K00q6P5j01j9q4J07P3
8086F0j8j4J08j50r5K94k11P6q6M8j11j6L9J20n4L6j54K54R8k04j58P2R2l8J16
8111A04m9j36J75J6j64K69k68P5J56k03J05l8Lk08L53k79L34k6j99J41mj06O6
8134A17J2J0p1k62K30K0K0r4kJ36l2p5M2J49k06l6j37O8J15J10R2j49j63K41k55
8159a20R7J61l45QK58j9J5J1N8k68M9J22n4j94R4K25k10m2K37p6rL2l2L9j24J24
$$ y = [-30, 17, 102, -77, 55, -85, 103, -135, -16, -147, -26, -186, 254, -396, 59, 57, -319, -101, 46, 62, 128, 174, 45, 176, 248, 13, -72, 42, 112, 78, 78, -96, 175, -17, -3, 69, -74, 23, 81, -113, -152, 148, -157, 42, 127, -111, -68, 227, 16, 133, -1, 46, 119, -110, -186, 124, -164, 94, 93, -182, -10, 95, 23, 16, -137, 76, -5, -27, -37, -71, 66, 132, -52, -117, -25, -173, 51, -88, -120, 131, -148, -69, -235, -16, -100, -118, -34, -105, 95, 9, 84, -17, -36, -120, -13, 60, 42, 28, 136, -14, -109, 185, -26, 50, -36, 12, -99, -115, -76, 44, -10, 26, -128, 126, 224, 20, -138, -66, 26, -12, 104, 55, -81, 94, 110, -54, 215, -53, 22, 178, -25, 80, 42, 45, -163, 190, -89, 245, 219, 20, 161, 157, 51, 117, 129, 139, 68, -194, 36, 56, 76, -18, -20, 116, 84, 9, 51, 200, -6, -42, -179, -111, 4, 114, 206, 57, -106, 135, -120, -23, 138, -207, -199, 59, 40, 55, 66, 124, -144, -95, 27, -27, -221, -127, 98, -112, -154, 83, 7, -2, 30, -2, 37, -87, 37]
8185C7k0Q2l79K20Q0j22
$$ y = [37, 17, 99, -280, -60, 20, -102]
8191a02
$$ Imaginary data points
##PAGE= N=2
##DATA TABLE= (X++(I..I)), XYDATA
0@%%%%%%%%%%%%%%Qj6J6j6J6k4L2l2M0m8N6p2Q2r0J04j20J39j63J85k09K39k69
36a42L01l37L77m21M68n21N80o42P12p86Q67r59J056j162J280j409J556j717J893
55I94k096K324k583K885l240L662m174M812n636O746q326J0776j5143K5353r9338
70h2984n9840Q7029K5999M2493J514J3028L195L707K245P366q703J1169o862j5958
84B3398j559K043j3413k3298m0630o491K3599K1730K0614J1107q807l084q854
97c645m301J4256J3044J3152N638k6630k1253Q83J572l678j9098k1780L974N867
111d1999R288K3687J3750J2256J5686k063r2P493M398K777k2911l8852j4321K62
125c0641J0530K0890R037R051N732j5239j1586n193p681M873k151j2259J230O255
$$ y = [0, 0, 0, 0, 0, 0, 0, 0, 0, 0, 0, 0, 0, 0, 0, 8, -8, 8, -8, 8, -16, 16, -16, 24, -24, 32, -40, 42, -48, 56, -64, 75, -88, 97, -112, 127, -142, 159, -178, 199, -222, 246, -275, 305, -337, 375, -411, 456, -503, 553, -609, 671, -738, 818, -899, 994, -1102, 1222, -1361, 1524, -1716, 1946, -2228, 2584, -3052, 3694, -4632, 6144, -8999, 16354, -82984, -142824, -55795, -29796, 12697, 14211, 27239, 30434, 34141, 36386, 43752, 35049, 46218, 39356, 23398, 21839, 23882, 10469, -12829, -53459, -59950, -36351, -14621, 5993, 17100, 8293, 5209, -3645, -7946, 6310, 19354, 32506, 38144, 11514, -9739, -8856, -7284, -10962, -30060, -51840, -47866, -41999, -32711, -9024, 4726, 16982, 32668, 30605, 30513, 38006, 42404, 45181, 22270, -16582, -30903, -30641, -20111, 779, 9816, 18867, 24599, 9360, -2226, -7419, -15100, -10227, -12378, -24637, -23407, -17152]
139a7152J1966R370j4852r944N818M311J4408J8293J1089J0966q160k3209j6357
152c453j4336J696J6675K031o30M950r33J495p414j6194k333k968k377J2714J2825
167A748J7417J6128o665j2513j2648j3142L505J528r832k429l867m950J954j079
181b4845J0994K0356Q024R166P690j728M828k271j4823j2453j4388o290M525m094
195a5309l57N511l839q18J062M68J3564R162m02J285p151n388M029k365J256N444
211F152P12O242l16j0197j964n542j0308k098k766N422J4331P385O691K815p149
226I410k8j037p325O98m90k888N54q090l950L673j743M056O770K101Q525M351
242A4587l941j294q602q404K25m256K0Q014L780O371L116m134J637j299n370J744
$$ y = [-17152, -5186, 4184, -10668, -20612, -14794, -10483, 3925, 22218, 33307, 44273, 36113, 12904, -3453, -17789, -16093, 582, 2613, 1983, 6933, 6000, 7495, 81, -16113, -18446, -21414, -23791, -11077, 1748, 19165, 35293, 28628, 16115, 3467, -9675, -6170, -4642, -14474, -16903, -20770, -25720, -23766, -24845, -13851, 6505, 14529, 23695, 31385, 29657, 34485, 32214, 17391, 4938, -9450, -15740, -11215, -15309, -15666, -10155, -13994, -14812, -13750, -13282, 282, 9444, 9042, 10327, 3176, -2212, 1817, -548, 708, 6152, 6864, 13106, 12790, 2593, 629, -4913, -15221, -17319, -20085, -14663, -332, 7053, 13744, 16559, 9410, 9382, 8345, 1020, 1718, 1228, -1660, -1106, -9196, -13146, -9473, -11216, -7160, -390, 1711, 10236, 14587, 10646, 9352, 750, -7654, -7429, -11685, -11665, -3651, 129, 6500, 9616, 5482, 7119, 5820, 450, 2194]
258B194k808l120K618l230k203J173k410N249M924r85N869J818l417k29o184n573
274f314J084k642K321O178K33N039K575m028n49l831m364J990l213j621M713j025
290c454J053L246j136M082L002o77L476k105n035p32o806n321N89j732L833O004
306a713J407N681L014k279J643l325m288O47l487j125K101k507K299K519k652
321b065K659J811m46L344k195k650L39n076j887K134j388L218M029L1L085O33
337E576k048J887l639m200o11l806p36L004k80L602L547n22L687R85q43K200l250
354D553m520j466n016K79L367l78L790K031j824J931o59j316J626l214k661J01
370c376l140J186M036p70K313N49j537L348J273J104L055l292l578j831m418R20
$$ y = [2194, -614, -3734, -1116, -4346, -6549, -5376, -7786, -2537, 2387, 1402, 7271, 9089, 5672, 5443, -741, -6314, -5230, -7872, -5551, 627, 860, 5899, 8474, 4446, 3897, 66, -4298, -2308, -5521, -7142, -2429, -3454, -2401, 845, -291, 3791, 6793, 6116, 9592, 7487, 2452, 1720, -5086, -10407, -9818, -11550, -7717, -1713, -306, 5375, 8389, 6110, 7753, 4428, 140, 787, -2700, -3825, -1724, -4231, -1932, 587, -2065, 594, 2405, 1959, 5303, 3108, 458, 797, -4279, -6166, -4032, -5420, -2202, 1827, 1858, 4943, 5576, 3528, 5415, 1776, -2424, -3035, -6841, -7577, -4573, -4853, -1251, 2296, 1774, 5461, 6446, 5603, 7803, 4553, 33, -1433, -6449, -6170, -2803, -3181, 609, 2640, 816, 2747, 2088, 772, 2398, -816, -3477, -3376, -6516, -5330, -1294, -2064, 249, 798, -739, 2609, 3882, 4986, 8041, 4749, 1171, -660, -5078, -4158]
386d158K818m2K889Q46r16L494L45j290r5n984m740k048k339L972N207J257L637
403B853M28k136K311op29K43n042k203R98p83M434L186j359L70k033j797M112
420B847K134J600J270m340l406j254l219R57M75k119J334k59N34N239J031p76
436B048j788o684k858Q27J684P043M561P45K576r42j325J917j881k653k646n653
452e029l11J692J250M389N87k604l30j671L28L766J30o0j228m580j440M95J25
469d491L131o87k631J355P95K874N780N55q68k004n147q06O44N32L716M89r59
486B278J854K72R17J403l817m187m110m623J226L273K847M487l9k760m89j849
502c317Q50K882j794n07n6p57L455K846M6O89k372k079J835J205K980L214k939
$$ y = [-4158, -1340, -1382, 1507, 2353, 1437, 4931, 5276, 3986, 3891, -2093, -6833, -8881, -11220, -7248, -2041, -784, 2853, 3281, 1145, 3456, 3450, 2721, 2964, -2078, -4281, -3283, -4066, 368, 3554, 2195, 2565, 532, -1265, 2847, 4981, 6581, 7851, 3511, 105, -1149, -4368, -3411, -2936, -5055, -3721, -3980, -3446, 1793, 2824, 2048, 260, -6424, -9282, -8455, -6771, 272, 4833, 5578, 8154, 7212, 5887, 7804, 5923, 3270, 624, -5029, -5340, -3648, -2398, 1991, 2578, -26, -356, -2027, -1699, 2067, 2197, 2137, 909, -3671, -5111, -4616, -4491, -1360, -2047, -4678, -3323, -2528, 346, 6126, 6681, 5813, 3809, -1338, -2144, -1500, -968, 2748, 3237, 2278, 4132, 4404, 5321, 6724, 2907, -1280, -5390, -10013, -8787, -5514, -2667, 1820, 1781, -979, -1468, -3317, -2467, 415, -1379, -1886, -1942, -2699, 756, 3602, 3648, 4337, 1965, -114, 1721, 2926, 5906, 9120, 6181]
519F181l526m157m661j11L80M78K586L61P03L352Q42J673N89l791l272k080j157
536e610L480K443K27O40j610r55J700j9J130J037k812k45k17j8L133K126m08O75
554D697k042r55J073j537l56o93l670j332j022j005K224Q30l78J401j25K167M269
571C546J563J397m86l267j263j631k086J388L20M84J695n44J69Q76j512j068j163
588a582k599R35J072J117K953J56l63L49k041J67J122r47M92n65k526nn88r80
606c833J352m61J096K627Q17J592J115q02J68j150k810K73l91o34J532m82l52
623c43O87j134J20O20j340N14k29j780Q57k17J30J891M7J023K224j29P76K17k494
642A440k32j157k366J51m48R7J995j20M05R55o54M89O99j016P14j74j066P57q82
$$ y = [6181, 2655, -1502, -6163, -6274, -5894, -5416, -2830, -2469, -1766, 1586, 2428, 4101, 4690, 899, -2373, -4453, -5610, -2130, 313, 540, 1180, -430, -1385, 315, 296, 1426, 2463, -349, -594, -811, -829, 2304, 4430, 4022, 4697, 2655, 1700, 2773, 1236, 880, 187, -3483, -4815, -5837, -6842, -4618, -3788, -4166, -2765, -2890, -723, 3546, 5109, 6506, 6020, 2753, 1490, -141, -2227, -839, -519, -35, 1660, 1116, 1285, 2161, 649, -419, -1582, -4181, -3246, -2174, -1057, 1896, 2052, 1689, 2038, -3, 164, 1286, 339, 831, 266, -2260, -2265, -2853, -3833, -2481, -2942, -1846, 781, 1598, 3190, 4305, 3503, 3671, 2521, -289, -16, -407, -1041, 491, 9, -343, 344, -790, -670, -50, -1390, -876, -1105, -2885, -2028, -2245, -2115, -224, -177, 846, 3070, 2941, 3717, 3934, 1440, 1208, 51, -2315, -2164, -2612, -2515, -520, -640, -235, 720, 66, 555, 1254, 238, 952, 778, -288, 469, -413]
661d13p02J399p52O98R48p23P71k12j930l83o51r48R42l03O53K304L60J086Q94
680C038j408N19j39j401L53p10j239M49j518o90J263k15J507J497p74Q39K3j307
698H7O8j120o01R90J38O55J636k11L86j01j984j75k34j158Q31l21m67P24q12M34
718a235J266J4R67J172n41M23k00j263K61j733r79N20m85R91J325p9N77K91j440
737a48K22n99o05Q57m63k14Q77k77N43J232p77J025J75j259N81r46q96J98j339
756a813n06O29j40J091J223j63J122N81r85M21r66j035R40r45j07N00p98J42R59
775A50l34Q43J88r04P40p22n39P61o35P5Q95m92N45P45n35O24n84j361k2j274
795a836o93J149m38N78J093n60R97R60j13J332o7r14J02j223j078K82j162k10
$$ y = [-413, -1115, 284, -468, 230, 1178, 455, 1226, 1014, -916, -1299, -1950, -2898, -1956, -2259, -1606, 698, 1058, 2144, 3038, 1630, 2149, 2010, 609, 962, 252, -987, -538, -2056, -2746, -1483, -1698, -191, 1306, 532, 1371, 1394, 87, 155, -965, -1566, -576, -438, 217, 1853, 1642, 2028, 1927, -57, -232, -466, -1624, -793, -1114, -1581, -857, -1669, -1235, 31, 45, 1012, 2184, 1643, 2066, 1866, 603, 864, -869, -1848, -1328, -1813, -822, 503, 424, 1001, 1292, -148, 74, -525, -1130, -273, -736, -950, -73, -350, 193, 1425, 648, 1673, 1848, 589, 1170, 224, -672, -474, -1813, -2319, -1690, -1830, -739, 484, 321, 1443, 2024, 1039, 1460, 494, -541, 399, -546, -653, -153, -951, -809, 150, -184, 659, 847, -57, 683, -39, -578, 183, -452, -377, 518, 26, 571, 1316, 781, 1405, 821, -540, -562, -1836, -2529, -1380, -1818, -1240, -147, -707, 290, 1250, 1137, 2469, 2402, 1488, 1590, 367, -711, -429, -1591, -1801]
813a801O33m72J353J156nJ132n60j293P8j130Q3J017l45K72K60j321K85j49m95
832a302Q90j88m03P79j95J61J433q86M37J86o61J155N42o7O25r51j611n58j569
851b183n4O80l24N47O18l05J908N26J29O54j430j429J99r56Q9Q34m33M76L2m56
871h78J286N68k7O80p37q02N66j49M06O97j132j09n01r45R91K09l08N36j073l46
891a068N74q78L09L49p20K67N48J05J563P69k74K09j861q36K78m06O05J162n80
910A15P46N84j24J106o02j099j94j562n20P32n17P44Q8j143K78o2J6J620L36j90
930C52M98q54J00P05p46J28j58j096Q71J94L02J514k89l49r7j274k52P65p14N50
950A50O2j035Q62M70m58P28p08p42l46j154M15O44j75J158K65n60P62M13O2J093
$$ y = [-1801, -1168, -1640, -287, 869, 864, 1996, 1436, 143, 221, -909, -826, 191, -154, 118, 378, -943, -658, -807, -1302, -412, -600, -1003, -224, -419, -258, 1175, 289, 726, 912, 251, 1406, 1948, 1881, 2506, 1555, -56, -614, -2183, -2237, -1557, -1881, -1334, -716, -1021, 887, 1413, 1542, 2196, 766, -663, -464, -1420, -1331, -497, -930, -454, -422, -878, 408, 976, 949, 1629, 892, 90, 656, 507, 913, 1610, 478, 369, -132, -1077, -86, 123, -185, 351, -722, -1068, -494, -1372, -1063, -714, -1434, -1167, -619, -514, 1049, 1818, 1544, 1753, -108, -944, -666, -1072, -467, 695, 115, 861, 1445, 1321, 2427, 1825, 726, 532, -1030, -1550, -818, -1335, -591, -503, -1646, -1368, -1430, -1414, 206, 542, 352, 850, -4, 96, 801, 55, 183, 25, -1071, -200, -6, 296, 1810, 1521, 1172, 1075, -199, -451, 314, -400, 150, 212, -823, 39, 509, 51, 779, 71, -671, -1017, -2171, -1756, -1112, -1287, -129, 136, -424, 338, 751, 813, 1906]
970A906n94q29J25o80K66L55q46K26N6r35J082K62O2Q62n88k43l45q93J78L6q49
991a386N09M1l57R61L32j00Q64m35l65K19r29P94L37n06O63j44l63Q18J2l64J85
1012G86q44l25J04p14L27l6n09Q71k7K12P73N7k37N30p98m9K68j109K27J27o69
1033a035O43j00L1R71l92J17O22o96L24J24r29L74j29k24P30k52j58N27o16j49
1053b17L28p79L60k33o31J14L06n12J459K54P3Q61n74k0L48j049K25j36j037J72
1073f88L21l19Q00j53o2J47p49N70M38m62L73L07r67N51k00q9P70n57pP17n56
1094A85K44J37q36J11k41p11L71kJ28Q93J00k5N22o45L27J86n80N9l12p19N30
1115b78R1J95N81m73k7m2l82K9K65m00K92r5m82O14J60J18P31o12O7L99m06K63
$$ y = [1906, 1312, 483, 608, -72, 194, 549, -297, -71, -15, -950, 132, 394, 456, 1318, 730, 487, 142, -751, -573, -537, -1386, -877, -836, -1193, -232, 100, 0, 864, 429, 64, 283, -646, 148, 485, -21, 642, 498, 135, 953, 965, 601, 786, -58, -383, -279, -993, -666, -702, -1211, -340, -367, -155, 618, 675, 438, 968, 170, 121, 389, -720, -493, -366, -1035, -392, -492, -461, 510, 118, 235, 857, 161, 485, 609, -320, 54, -75, -299, 431, 179, 21, 548, -68, -217, 111, -668, -308, -541, -1172, -1058, -752, -1264, 195, 449, 522, 1383, 809, 789, 1137, 88, 313, 177, -860, -688, -367, -686, 114, -39, -101, 46, -703, -133, 305, -157, 216, 523, -444, 107, -93, -182, 588, 31, 24, 741, 185, 429, 566, -270, -159, -400, -1111, -740, -742, -614, 279, 379, 354, 876, 231, 558, 744, 164, 223, -89, -808, -278, -187, 8, 589, 116, 89, 47, -335, -306, -41, -441, -149, -244, -726, -112, 48, 166, 897, 285, 352, 751, 345, 608]
1137F08o8m65l0l10r40O76j86J51L82j09L58O53m33N61o2o92j36j63l15M57M5
1158a8K16M33n27j59p7o35K94L4l09M27qq5P77J52j45N46o12K46K51n09K18j89
1180C21p66J18o29j86O68P3m9P35l57K47M64p20L41j24m12N7l58R2O68j40L06
1201C49K91o08M66K83n70L36k19n86L06l73j29L47j33K18L13o84L53Mm42N24l50
1222c04L3K36k81o1O46l26K58K28n09J38P2m87N08k41j64J21m77M44Q30k42M81
1243I03L64o42J36l43o89L50m67k98J28l55l56O44j08L27L07l89O38J2k4M33J3
1264E84p14O65o10N0L73l30M77K06m20p5Q4n42M17n53k08N08m55N07K82k17J72
1285B01k66o17L59j42k06M67k32r6K75j93M32M83p4L91m5n13L51R1l53L27m20
$$ y = [608, 540, 75, 45, -265, -1205, -529, -715, -564, -182, -291, 67, 720, 287, 848, 786, 94, -42, -205, -520, -63, -18, 198, 631, 104, -55, -132, -767, -473, -439, -748, -321, -329, -414, 363, 515, 370, 916, 304, 550, 801, 292, 510, 321, -445, -327, -956, -1142, -474, -401, -450, 285, -72, 175, 639, -81, 260, 136, -276, -219, -577, -485, 183, 43, 349, 640, 32, 498, 781, 211, 547, 328, -258, 48, -325, -454, -107, -240, -22, 291, -393, -40, -36, -478, 46, -304, -271, -35, -316, -377, 269, -57, 201, 429, -80, 58, 130, -357, 151, -90, -254, -133, -610, -166, 664, 422, 903, 1267, 625, 761, 418, -271, 79, -388, -686, -558, -913, -1269, -625, -733, -406, -99, -488, 150, 162, 138, 571, 584, -130, 535, -75, -25, 348, 18, 495, 701, 281, 206, 290, -252, 165, -388, -596, -88, -543, -36, 246, 29, 201, -65, -682, -323, -465, -671, -204, -436, -532, -257, -450, -18, 465, 391, 782, 737, 224, 575, 666, 313, 640, 220]
1306B20m41J90l48J49N24l31K59O4l45M02m61r2K10n68o6p3k35M73K17k52P26
1327B22k10n07N38k27J63N37k72R0O26k72M73q2m84N3m44o28K57n32NJ14j86k17
1349i83K71K0N41K03N2K92J90m28K40Nj80J34q20j4M7k66N25K46l7J72j8j25M93
1372E60q0N2L13n32L74k24j83L31n48l03n4k91l62M86m08J31K48l30N83L66j44
1393a5Q40n33J21K24K01m37L34m23l05J26m33J14Oj69L52K04l64L94j86P1K54
1414C76o89r6L92m97L16K59j53K66K3k25K52l01K08k1l62J81M6k06M40K88n61
1435f4L65l37p6M92n21N2Q1m84N63l5q9L04J26n54K85j92k56K15j5j86J63j71
1457c34r2J25J88J99R9j0K42N3j90M75k49j49j48o47L9J36k88L12K71l77M15J39
$$ y = [220, -221, -31, -379, -230, 294, -37, 222, 286, -59, 343, -118, -210, 0, -568, -634, -707, -942, -469, -252, -504, 222, 12, -495, 43, -184, -21, 516, 244, 334, 960, 688, 1161, 1079, 595, 648, 204, -424, -167, -699, -694, -580, -766, -983, -712, -692, -151, 52, 104, 396, 586, 158, 398, 403, 223, 357, -463, -477, -430, -696, -171, 75, 38, 210, 192, 67, 560, 480, 532, 845, 313, 687, 463, 280, 611, 63, -240, -294, -585, -947, -461, -869, -738, -490, -820, -237, 129, -15, 825, 292, 413, 637, 838, 401, 735, 312, 7, 133, -300, -186, -180, -349, 3, 207, -157, 237, 51, 122, 376, -313, -409, -17, -514, -198, 61, -92, 174, 197, -28, 224, -77, 131, 110, -252, -71, -25, -231, 209, 497, -64, 301, -36, -112, 380, -141, -89, -8, -492, 71, 36, -53, 251, 377, -177, 108, -84, -340, -125, -140, -326, -163, -334, -426, -301, -113, 86, 185, 175, 417, 470, 280, 755, 506, 357, 209, -438, -399, -263, -551, -239, 32, -345, 70, 209]
1479B09k27L74k34K8%k09K09M1R8J91k42l84M16l60j24J27n2n4J12k14N03j68
1501D0j85L39m3l42L25J1k5O91q56m5ql93J88J60j56J52K27j41L45j33P6l5j98
1524fj83J37k61L82K72j61k4N9k24L15k84J45k53j39j68K67k96M26Ol38L70j6
1546B6N4P9j25R3j8j73K59o4k90O8j24J97j2j02J05K43k01J01n6k51J65q5k17
1569c28N38K8k06K44j66J20K35n24l6J5l52K27J03l83N82j66m5J61j51L0L00j26
1591A00k2J86k66J08j46k81L94j56k0M57l11J33K16r1o1l21j16p8K6OJ43J42k63
1614b21M33l18N4L37k97q2J58k46J22J67q4N25n41M7J12m8j27N1k3m1L68l32J37
1637A51l17J46o1K34m06L34k17L47n6l55J52k01k06P0L9q2N47k08R8O3J07K75
$$ y = [209, -18, 356, 122, 150, 150, -59, 150, 191, 289, 480, 238, -146, 270, -90, -214, -87, -139, -193, -81, -295, 208, 40, -145, 194, 151, -191, 134, 145, 120, 811, -45, -90, -98, -491, -303, -143, -299, -147, 80, -61, 284, 151, 227, 192, -6, -189, -52, -313, 69, 341, 180, 156, 215, -9, 306, 22, 167, -86, -225, -393, -126, -422, 4, 10, -328, 42, 26, 80, 159, 34, 127, 109, -64, 195, 131, -159, -91, -215, -18, -30, -132, -27, 216, 15, 116, 60, -191, -26, -111, -328, 210, 238, 32, 276, 110, 230, 465, -59, -95, -80, -432, -205, -102, -485, 97, -69, -114, 47, -104, -74, 226, 100, 78, 264, -2, 106, -40, -321, 73, -83, -103, 354, 43, 176, 392, 301, 240, -81, -197, -275, -249, -243, -100, 42, -221, 212, -106, -52, 285, -12, -94, 64, -182, -60, 107, 23, 548, 7, 54, 166, 118, -9, 42, 19, -22, 346, 14, 151, -166, -20, -81, 153, -253, 81, -136, 211, 155, -200, -48, -249, -455, -385, -346, -428, 119, -89, 9, 72, 179, 454]
1659D54r6k62L2J59m81M44k40K45J10k39j35l0m4m2K26k58J96j28m8K61j63j8
1681e7n5l6%q1J30o3J82k59K59j52k7J99K51k12M22q3m6J28j67M6k69k25P0l5
1705h0l56N19k64j17K00p7n7K06k85K17o3J70k54K40j39K67k37j5M11l38J22P9
1727A49oJ48o4j79J36j45j29L80l01J22J25k49K08k2k18K5j07j60j39Oj45L37
1749b28nK77r7k09K55K77j93K36q2k12J89K81l41J64J09q0M9l55J99j44k20J5
1771a15J55k27O7k18j2L61l86M52k42L6K26pl84K08Q7j25K52j91k60M12k33L23
1793A79J68l09K92k43O4l0j64J58J33k25J86k4j08L4M5l66M1K04l65K99l97Q5
1815c43J41l44M00PJ72J52J03k35L15J42l20J2J02j99K37j20l45J47l69P8q9L07
$$ y = [454, 358, 96, 128, 287, -194, 250, 10, 255, 365, 126, -9, -39, -83, -125, 101, -157, 39, -89, -137, 124, -39, -57, -112, -148, -148, -229, -99, -162, 20, -239, 20, -132, -159, 40, 291, 79, 501, 418, 372, 500, 333, 379, 110, -115, -45, -80, -436, 83, -181, -298, -98, -175, -232, -26, -311, -94, -157, 13, -241, -1, -140, 127, -110, -125, 286, -52, 70, 149, 143, 291, 227, 48, 184, 39, -90, 290, -11, 111, 236, -13, 195, 173, -45, -20, -127, -287, -426, -420, -565, -228, -233, 44, -53, -262, -7, 270, 77, 313, 231, 19, 208, 489, 148, 312, 421, 341, 390, 35, 234, 90, -130, -115, 40, -187, -120, -338, -350, 11, -375, 77, -165, -129, 97, 90, -294, -86, 1, -124, 128, -63, -323, 89, -144, 179, 347, 38, 330, 87, 151, 121, -43, 115, 248, 23, 209, 185, 77, 111, 156, -210, -169, 35, -330, -31, -428, -343, -202, -546, -146, -139, 33, 185, 288, 53, 368, 510, 190, 202, 304, 105, 342, 222, -123, 24, -345, -267, -356, -49]
1837d9J55l55j71K86q5kL91l86L32J74k73J22L56m72Q9k01nN2j80p3J80j75M68
1860A78k28j66M69K0j00R3J78l26J70j12o3P0l02J90l16P8K22j40k67N5m7K94
1882e0Q2j77J39J12K8Q1N3j56K10j59j37N1j05m1j5L2P8J52l73J14l9m4K47J50
1906B33l88K41k22kM40l73R7J8j01K15p3K0R2jm31J92k23K4J65q7J52n6q4J89
1930C7mj10L38k23J89Q4k35m3J3r0mJ10j36kM5k23P1J98J49j38j05L4L04j39K72
1955C92M0k06n6j02j10J71j38l1j87n7J88m5r9K65k87j64L33L17j11K41q5l28
1977e9K81k43K66k65m30M17L1m2K8J5r0K14k52Q1L5j40K65K8l6r7j65R2L32j85
2001H1j20J86p3O0J3l09J01J43l09J40m1J8J70j7j14J89j91J9K16k7J3Q6j24K76
$$ y = [-49, 106, -249, -420, -134, -219, -221, 170, -216, 116, 290, 17, 139, 495, 23, 112, -89, -94, -42, -222, -295, -115, -290, 178, -50, -216, 253, 273, 173, 266, 444, 118, 288, 176, 113, 183, -119, 71, -245, -167, 55, -85, -352, -297, -344, -50, 32, -145, -6, 106, 134, 215, 268, 112, 322, 163, 26, 77, -28, -69, -84, -52, 26, 178, -195, -81, -120, -164, 83, 233, -155, 86, -136, -138, 302, -71, 26, 44, -57, 158, 85, 105, 197, 196, -235, -43, -266, -242, -77, -164, -12, -68, -152, 37, 33, -77, 261, 38, 227, 311, 76, 33, 46, -44, -48, 62, -74, -76, -31, -254, -183, 15, 164, 26, -79, -45, 259, 120, 392, 432, 226, 170, 68, -42, 129, -9, -40, -227, -284, -96, -141, -240, 25, -262, -426, -93, 224, 113, 354, 269, -59, 222, -21, 245, -20, -450, -33, -2, -44, -16, -1, -91, 123, -129, -48, -13, -153, 112, 140, 104, 7, -158, -66, 266, 81, -39, 147, 74, 134, 147, -162, -61, 82, -227, -87, -128, -110, 60, 43, -71, 118, -73, -54, 162, 135, 148, 234, 110, 386]
2025C86l7m16N7J78k19R3j07j13o0J33JL1j2N7L82l14N7J03o5K6k20r0L18k19
2049e0pMk28J26n9P6R8j0K27n2J09k9O9m8o3o9k12J90p4j67J6K53l73J25o1l4
2075b43kQ3K32q0k0J36k13R3p5J28j7j3M0k34Qr2K07J53j38o6K35k51M76j85m4
2100A18N1l33K04J40m05J25N7k34J79k5k91L06l0K45J0q3k40M94j88mK41l51M91
2123D77k70k38K50j23q3J9j46J93k44J34N0j00M2J84k17j56L45j75j11k02R0K90
2145Ij82L44j00j14m8L94l85J80K00k51J64o6j35j59p4J53J13K27l69K14j37O0
2167C8k2j58J22L2J83j51J63r2j23m1QK20l37O2J8K28m5l3m3L33k92j35K87l27
2191a05J33J66k17P8l1o3k4j6l81L82o3q1K87n4k59L27j65M04l47l9K82l09L2
$$ y = [386, 349, -67, -10, 168, -51, 42, -65, -178, -238, -105, -104, -73, -85, -28, 354, 40, 97, 200, 135, 161, -59, -149, 169, -50, -57, -53, -281, -155, -214, -138, -40, -50, 177, 125, 234, 205, 274, 226, 163, 94, -118, 72, -2, -169, -153, 100, -273, -148, -209, -243, -245, -162, 70, -10, -30, 106, -107, -14, -89, 39, 22, 9, 49, -185, -177, -269, -62, 91, -47, -113, 122, -129, 347, 162, 118, 169, -164, 40, 180, -225, -100, -43, -277, -98, -123, -414, -108, -138, 107, 117, 34, -206, 288, 100, 96, 337, -14, 477, 207, -31, 219, 96, 13, 32, -114, 79, -165, -31, 19, -81, -39, 145, -72, -228, 117, -58, -169, -371, -281, 9, -173, 171, 71, -43, -91, 303, -82, 98, 298, 47, 211, 145, 10, -149, -223, -70, 43, 270, -99, 115, -22, 38, 16, -142, -20, 12, 195, 44, 207, 115, -8, -49, -41, 179, -158, -96, -78, 150, 105, 72, 29, 362, 70, -65, 222, -105, 28, 194, -23, 55, 24, -39, -63, -79, -460, -78, -141, -222, 65, 11, -248, 79, -86, 318, -29, -68, 214, -95, -63]
2214f3n0l2J75k68J26O0mr9K54k07Q9J30J22j64J23q1M4j28m69L11J94k68k7K15
2238a7j75K02j13j12J48J78l45O54k89J38k24qoK12m09L51j37j93K05k56K30J57
2260A91k81O6J14l28O5Q0Q1k22K0K0K65j94J1J17n5r4K57j89O1Q5p5q0nJ89N2
2285A51j13j02K41p7n4Q1j1L0j15k69K19R3k0Q4j76MJ13j63K7J28k63K37j01r9
2309a55J16q8j32J00K18lJ60q4r0J51j41L8R5j52j28M2L8K7q6n3L8m1K60Mj01
2334C3l8K5J86Ml19L33o8j05k09K32j57MJ55k69K84Q4k53L18l11K37k13J69o5
2357E7r5J58l2j42J00J58l01P1J37j36L7Nq3J88k01P2M6pM4Ol08J16L17j64l7
2382FJ15j96J65p1J20q0l1l43K78j50O5J16Qj95K42j81Q5j11J63%P6p7K54j99
$$ y = [-63, -113, -145, 30, -238, -112, -52, -56, -155, 99, -108, -19, 111, 233, 69, 192, 111, 155, 27, -442, -131, 63, -205, -232, -17, -192, 10, -103, -215, -67, 111, -234, 420, 131, 269, 45, 37, 31, 243, -166, 185, 48, -145, 60, -196, 34, 191, -90, -24, 90, -238, -173, -93, -12, -234, -214, -194, 71, -123, -112, 5, -50, -144, 113, -76, -15, 70, -5, -85, -90, 99, 151, 38, -64, 177, 100, 46, 127, 116, 146, 31, -238, -19, 74, 54, 138, -38, -34, 79, -84, -57, 71, -192, 45, -56, -155, -39, -127, -259, -159, 59, 56, 216, 132, 42, 193, 52, 90, 185, 33, -95, -53, -15, 12, -74, -127, -89, -130, 130, 134, 33, -5, 20, 206, 210, -109, 224, 156, 51, -158, 74, -83, -79, 76, -193, 91, 175, -78, 240, -71, 166, -47, 122, 57, -38, 120, 88, -54, 46, 204, -97, -26, 111, -25, 12, 17, -66, 122, -79, -7, 39, 32, 76, 82, -226, -110, 207, 43, 6, 121, -75, 90, 19, 139, 59, 28, -315, -37, -187, -122, -6, 2, -193, 49, -132, -47, -158, 5, 5, 81, 4, 258, 59]
2406E9K2oj49Q6K28k37M6j8j44J72k45qK37j27K1J94j35J86k23Q2J30J17j59k00
2430g1N7jrj51K58l6k48J37m0N4j9K57j22j00k1l4J97p0L6q1Qo9K39k25N2q6M5
2457d3J64l08J2J08L7R2l2j57J4p6K74n8N3j58J62p2k23R9K7K17k53L78ok17p9
2482d5k5P4J31k15M8R3M4k51J33O9J02q6J10k49Q2L5j8J9k24L06k55M3J65j62
2506g6q8L09m19K06Q8No0K52j31n7K33l3j9j67j5l5Pn3l1N5m4j35M5M2k8M21j48
2533A24L3j72q0K53l2Q1k38O8nJ41r3o0Om2k9k70K27J58n4J08m0P7j29j76K73
2558A29L8k69n9L07j09k1p0N0q4Q9j52k6K55j38J11k22J30N2k4j33J75o9R0j49
2582i9J31Q9l2k46m4K43j04O3p0j8P8O6l3Pk05K6K48m7O5j05K9j84L60o4j67j39
$$ y = [59, 81, 75, -74, 12, 240, 3, 49, 31, -113, 59, -186, -194, 43, -84, -63, 131, -4, 182, -41, 41, 171, 288, 129, -71, -14, -15, -24, -175, 83, 47, -201, -64, -104, -50, -69, 188, 66, -34, -55, -89, 108, 38, 74, -7, 1, -68, 171, -54, -2, -88, -43, 121, -187, -175, -67, -30, 62, 30, -127, -113, -189, 85, 27, 80, -78, 84, 12, -211, -112, -85, 132, -121, 257, 251, 34, -45, -70, 4, 135, -80, -32, 61, 105, -146, -13, 56, 158, 72, 182, -67, 15, 50, 32, 51, -173, 133, -122, -79, 86, -76, -164, 145, -274, -68, 20, 25, -35, 217, 86, 29, 262, 229, 210, 43, 28, -7, 0, -53, -84, -29, -73, -208, -163, -121, -149, 272, 124, 157, -15, -95, 158, 126, 207, -31, 37, 32, 173, 80, 20, 26, -16, -45, -315, -88, 70, 16, 124, 84, 161, 32, -144, 129, 167, -102, -161, 146, 37, 16, -54, -4, -88, 1, -151, -177, 78, -60, 51, -171, -41, 11, -13, -146, 29, -40, 50, -99, 32, 121, 89, -157, -201, 42, -62, 1, -69, -87, -9, 57, 24, 31, -174, -148, 100, 53, 118, 13, 42, -142, 218, 154, -13, -152]
2608a52L13J09l81K84j88k5J9m6K85k27R7J37k77l1K09L4o6o3k52L41j40r7K31
2631A14k79J59J04j67j44L80k21K49n4l44M27j92j82L36j49l7lj10K70j29Ol5
2653aR2l99L55n6N3j38k6J99JK1j57L02l09K6j60K68j67j44J97N2N0j25P9m2p1
2678a00J57j29J40P8j24K0l4N9O5nk20l1K39k60K64j44j3J06j33O6n1PM9K5k7
2703Dr7n9J93j17J08J55K8k35r8K35k18N8K54j51O4l29R4R1j1L19k03j19M1K5
2727C2ll2J5J0k1J5K7M8J26k13j6L8O0j14J65k1m18M37j69Q5K7r7p9l0NK19j74
2754g8J0n0J06j68K19l4o7J52J34k35K16k37n4L49Ml37J43p8NRlK5j03J52k01
2779a21k6J23r7M1o8L5K26J22L3q2n4p0j38J25j87m4J19O9r1p0J11L5N2r3R6O4
$$ y = [-152, 161, 270, -111, 173, -15, -40, -21, -67, 218, -9, 88, 225, -52, -83, 126, 160, 94, 31, -221, 120, -20, -117, 114, -165, -6, 98, -69, -213, 167, -54, 195, 141, -203, 224, 32, -150, 186, 37, 0, -3, -113, 157, 28, 34, -1, 91, -308, 47, -9, 44, -94, -120, 79, 80, 101, -56, 246, -63, -37, -197, 71, -96, -240, -43, 9, 59, -66, 13, -29, -100, 57, -72, 68, 146, 22, 42, 8, 67, 132, 127, -93, -124, 115, -145, 119, -25, -38, 68, -65, 1, -50, -43, 6, 31, 4, -93, -152, 41, -76, 32, 187, 215, -20, -118, 117, -101, -43, 211, 60, 124, -205, -111, -20, -31, 288, 85, -34, 7, 32, 29, -3, 12, 22, 1, 16, 43, 91, 217, 4, -12, 26, 86, -28, 137, 116, -302, 135, -34, 51, 78, -19, -98, -128, -123, 96, -78, -68, -118, -12, -180, 39, 5, -62, 90, 224, -11, 205, -32, -86, 263, 267, -70, 73, -5, 0, 9, 6, 31, -72, 80, -121, -147, -24, -121, -80, -148, -113, 113, 235, 268, 186, 132, 62, -76, 49, -138, -182, -63, 6, -85, -155, -44, -9, 43, -50, 46, 110]
2805A10JQj02J91k82o7K59k10M1k8L6r3Q9k3J58k28K1N5O2KQ0j41J42j66L4M2
2831iJ51j29j35r3L25k19L4j1K6qO7j33K52m5k54J69q8K09j30M4o6O8M8J7j1P4
2857A53j78n9J42l32L44o7J5n7j75L34Q4l12j17K66j62k4J98r6L33j36j32N4j31
2880e5KJ55l03J38N2l8k13L3Q7J37k25K30L5J4J68j82J10J7j10L1o8L8j72L9J25
2905D5j76K48j70o9J70j10p3N5J53j26R5k5K71k11o8j73J49jj02N7L0J52k43L68
2929B46j70j23L24k08k39K34j51K49j34j1O8j27P1N6n6j14q9K38j39J75L8j48
2951a0K00j22j83N0O2p0J17q5j03J38k9k4k5P1j24l9K71M5k43O5J35k10J06L3
2975B6M1o1k02K81q0j09L6J48k46j7K23K66k16j07j57K02k0j16J64j63P4J41k90
$$ y = [110, 111, 119, 17, 208, -74, -141, 118, -92, -51, -79, -43, -136, -47, -70, 88, -140, -119, -64, -2, 0, 80, -61, 81, -85, -51, -9, 142, 13, -122, -215, 110, -109, -75, -86, -60, -68, -1, -134, 118, 73, -181, -12, -100, 109, -21, 23, -43, 25, 73, 90, 79, 153, -25, -84, 58, -274, 70, 3, 18, -39, -214, 120, 204, -108, -225, 41, -121, -145, 53, -43, 290, 154, 22, 76, -55, -53, 102, -201, -63, -11, -49, -262, -229, -142, -5, -230, 0, 35, 49, 217, 35, 145, 162, 52, 83, 15, 53, -119, -80, 45, -131, 117, -53, -122, 48, -62, -135, -80, 73, -53, 42, 17, 288, 77, 9, -164, -15, -16, -118, -61, -31, 121, -122, 246, 76, -47, 277, 69, -170, 64, -87, 162, 28, 17, 85, -42, 29, 85, 29, -85, -174, 64, -75, 100, 138, -10, 190, 68, -115, -65, -3, -73, 44, -41, -144, -6, -35, -59, -84, -13, -137, -176, 95, 140, -103, -38, 97, -113, -7, 26, 67, 6, -196, 85, 5, -104, -68, 80, -166, -183, 40, 306, 90, -17, -174, 28, 8, -108, 56, -107, -33, 108, -182]
2998a82K67J42l93L99k83J15r4o5K09L0K1r0L5k3k04K02j77j71K33J06j2j81J12
3021dj07o2J97J0o9L54j79k99O0K10p9j2O3k47L29l04r0M5J54J20m13K54K2j73
3045b20J47K6o2K41J27m04J35j84j13L40J41j83J30j75N3K8j19K04o9j8J93k91
3067g3K78k71PJ68j38M1N1N7jn8o2k94L63k7o3q5L7J60R8k60K1J09j57P9kp1J00
3094GQ4j08n3J90j61k7R1m1K70j52k89J92%J05n4k48J74J48k21L43k53K9M1k34
3118a67o0K61p8j30K90j87P8j02J90k36J28j26K33k30L7K52j67n3J97R7l20J13
3140B0k32K62l6J5J24k44J2J2j86O22l84J61K9n9pq2J33N8J4j77J10k06k93L16
3164a8l4j6r2K93r6O1j85J85p9j61K67M1j17o9L8j15L8M9k3k8R2k32J93M7J84
$$ y = [-182, 85, 227, -166, 233, -50, 65, -29, -94, 115, 145, 166, 76, 111, 88, -116, 86, -91, -262, -29, 77, 65, -116, -4, -111, -173, 24, 34, -35, 319, 140, -159, -99, 111, 32, 20, 83, -164, 165, -139, -229, -184, -30, 90, -323, -69, -47, -220, -73, -47, -109, 132, 259, -145, -10, -194, -307, 33, 174, -9, 121, -54, -1, 27, -92, 112, 43, 25, 218, -73, 205, -66, -59, 109, -29, 12, 63, 120, 119, 61, -1, -295, 68, 41, -22, -107, -70, 90, 188, -72, -51, 58, -99, -20, -22, -93, 7, 91, -17, -70, 120, -41, -68, 23, -18, 252, 100, -189, 3, 3, 108, 54, -194, -20, 128, -93, 250, -3, 26, 67, -167, -227, 34, -44, -174, 116, -71, 7, -95, 95, -141, -13, -139, 94, -136, -99, 153, -14, -67, 130, 227, -93, 20, -212, 50, 14, 29, 153, -91, -79, -67, -253, 369, -15, 146, 175, 116, 109, 27, 160, 218, 232, 55, 165, -41, -334, -18, -52, -68, -160, 133, 37, 98, -87, 98, 19, -142, 125, 166, 49, -20, 18, -97, -59, -10, -33, -61, 31, -201, -8, 39, 223]
3189B23k43q0O3M3K1p8J4J13o2j69M39m08K79j95K07k06J43Qr4J26k61M7M4J1
3213a5k17K85q5j44J20J91j73kJ07j18J15j29Q2j78J75j8M2L3j57P7n6K18o6j15
3237b8j69K30K6j72M7R7j21Q8n9j55J80k4n7L29k78J00k5j26R7KN7j7q2j48K50
3262D2M2pj40qj0J00o2J39k5j33J57m4j05K03k33J34K4J2J3j19O2K4K51l03j78
3287a64L55k53K9J36n6L2j68K50o3m2N7p9M6r8k3n2r4K21o5Lk58K30j23K02jN1
3313G3j74J94n2M0j50N7J3r7J02J00pk76J41J51q3j64J17K3J03m10K46J74j40
3336a9K1J98q1j22R4k0j29K78j86l19J81O6L3m8M4k7KJ44M4n4j43R9j03J49p5
3361B7J66p9R7J7m04L11J05j73j74m6K36j10J80o5j8r1j22o7K20O4K8k8k49M8
$$ y = [223, -20, -100, -37, 6, 27, -51, -37, 76, 14, -155, 284, -124, 155, -40, 167, -39, 104, 112, 18, 144, -117, -70, -26, -15, -232, 53, -32, -176, -56, 135, -38, -40, 67, -51, 64, -65, 17, -161, 14, -4, 38, 71, -86, -9, -65, 153, 87, -28, -197, 33, 59, -113, -66, 31, -90, -2, -61, -216, -36, -60, -117, 212, -66, 34, 9, -117, -20, -18, 39, 22, -60, -208, 42, 84, 77, -63, -71, -81, 19, -43, 96, 71, -62, 95, 51, -54, 149, -84, 50, 74, 86, 99, -20, 42, 66, 317, 14, -164, 191, -62, -33, 103, 47, 79, -89, 161, 98, 56, 113, 34, 80, -18, -41, -93, -187, 34, -31, -28, -286, -56, -179, 23, 22, 73, -101, 93, 41, 81, -69, -12, 1, -96, 6, 106, 99, -177, -36, 115, 32, -132, -15, 8, 111, -299, -53, 121, -19, 2, 200, 119, -3, 91, 71, -58, 220, 34, -285, -104, -38, -5, -53, -9, -36, -34, 110, 154, 100, -43, 56, -47, 102, 27, 193, 114, 211, 228, -176, 135, 240, 67, -107, -153, 83, -27, 153, 88, 70, -21, -143, -210, 10, 74, 102, 74, -175, -127]
3385a27J67j64R4Q0N5J43k61J81j04j2O7j83m7J47k14J94N6l3L1J48k41J26l5
3408F8n5k10m3J58R5j90K69k29J36J06q2m0j51J25J60k76L27m2r6K89l91J83J6
3431A27N9m8l24L18j86K13P1k02j55J60j12K4J47k14K03M7n9P8j08q3Q1r6L9M9
3455B9N7k42K47J11k39K82k10J5J2j01K4lj21O9J60k83L54j88k6p6M7R9jl2n8
3480g4Q7q3L5o3P5k42L5K05j3P9n9J04q4m7j02N5J76L8o3m2j62J69J53r8Q8k19
3506e2K96l82n9J37J15K0j06j18J73l9r0J48j8K5m1P6J90k82j77j3L10p5j59J97
3530G6j96K26j69J88k88J84k5J53l87L26p2J19j13J26j46q4K15k09j68K63j10
3551i1P3O0j33K20j81m8J57j31K66k10J02J16j11j8j84M11m20k7J35L5l1Q6j41
$$ y = [-127, 40, -124, -30, 50, 105, 248, -13, 168, 64, 52, 119, -64, -111, 36, -178, 16, 72, 39, 70, 218, -23, 103, 68, 13, -197, -240, -82, 13, -177, 92, -137, -1, 105, 23, -17, -168, -43, 117, -159, 168, 126, 30, 319, -72, 111, 127, 186, 138, -186, 132, -54, 159, 230, 28, -127, 33, -79, -55, 92, -122, 81, 128, 69, 147, 39, -44, 37, -59, -20, 29, 86, -156, 91, 202, -37, 245, 35, 50, 62, -39, -15, -18, -139, -70, 90, -193, 161, -27, -53, -129, -82, 17, 16, -16, -74, 13, -70, -35, -98, -23, -265, -230, -25, -38, 41, -18, 86, 2, -45, -147, -92, 84, 122, 59, 17, -145, 24, 177, 79, 167, -52, 244, -138, -197, -60, 55, 75, -31, -149, 24, -15, -105, 43, 25, 50, 9, 85, 275, -7, -184, -197, 113, 38, -121, 76, -120, 106, -63, 125, -163, 21, -4, 149, -238, 88, 16, 135, 22, 148, 2, -82, 133, -76, -244, 19, -91, -18, 42, -91, 129, -52, -100, 57, -74, 192, -18, 84, 200, 89, 71, -113, 298, -122, -149, -14, 21, -10, 76, -65]
3574f5p6K23k49K70j38N0k9J54j87q8l9J37K57k10J0k47K00K28l99J02J01J57
3596A62j61j32N7J65k90K18R5j16L3o1l6L78k64L9j30k0L9J95l69J35J18q1J63
3619A37l50J4L80l61K25N5n8l0J54m6p4k11L06l11J66o5M0M3k2N3l9k53K63K5
3643D1r3m7L4O9k73K18L1j66J42k3L60j75j58J20j76O9J94j58q4J45k23K80j52
3666b5Q1R7q9Kl83K09j04J68J22j77K02J30j56l82O7K79j86J07K29r7j27M8k3
3689hK18p9J01l12L2K35j1j34O7M0j06k04L9l8J76j51K26j11K9P2k79J66J24p6
3713A6J09k71j1M18l59J00K35l25L1K73j05q2k49K38J60j55M1r0O1k77L18j75
3735i9j1K85k15M1lN8O4R1j49l8L11k79k17o7L31j01p2J27j23Q4k0j39O8J97k1
$$ y = [-65, -141, 82, -167, 103, -35, 15, -14, 140, -47, -135, -174, -37, 220, 10, 20, -227, -27, 201, -198, -96, 5, 162, 1, -131, -74, 91, -199, 19, 114, -2, 31, -30, -66, 312, 48, 87, -43, -63, -24, 171, -198, -63, 55, -26, 137, -213, -199, 181, -180, 45, 100, 42, 12, 166, 120, 46, -165, 141, -170, -4, -69, -29, 14, -8, 45, 6, -247, 16, 41, -52, -99, -65, 4, -269, -51, -20, -186, -44, -67, 293, 118, -40, 80, -96, -27, 167, 9, -75, 70, -153, 127, -25, 56, 153, 64, 66, -317, -108, -212, -44, 78, -99, 103, 233, 77, -305, -238, 41, -145, -38, 191, 94, -33, 15, -8, 210, 131, 232, -80, -48, 187, 176, 42, 109, 149, 43, -161, -122, -160, 16, -135, 91, -20, 9, 81, -198, -32, 92, 16, 125, -146, -157, 261, -98, 2, 237, -88, -57, 216, 111, 29, -220, 18, 178, 23, 64, -26, 35, -242, 76, -99, -110, 175, -40, 1, -2, 56, 120, 211, 62, 24, 335, 56, -161, -228, 103, 2, -70, 57, -66, 18, -2, -141, -73, 124, 103]
3760A03q4K9n7q9J88j26J17j93j3P6N9N0j65K73k51M00m43O9J30j3Q3k90J5K80
3784A48k98Q3l0j1J29k6J42k01m9K2K04j7p2l2j8N7J03J07k78N1K83k05k13L11
3808A90oj04K0m3J43j95J19k54O6j38L72j61k6N5P8K3k83lJ10J24k1M0n3n9k2
3833b8J74l09N0J81p1m7J42K2q6j10K2J5j06J73J05k47%J46j0M1j9J03n6K7q5
3858B7J62n0j86M3R1L5j66J06J1j6k21K80k35O6p3M1K53k21J61k12J05NK36k60
3882a8J88k68K53l30K86j27j24J55r0K35j69J35N0j81j48J37P2K5J2j13K0j58
3904a58Q6J72m8j55R7j01j16L56n3q2J8r8J7J67M2j74O4N0K0K55j13l30J87j49
3928d6N1K10l45J23j32K34J7j75K66j35n1q0J73P1q6k35J88j21K6j06m6L23o5
$$ y = [103, 19, 48, -9, -98, 90, -36, 81, -112, -125, -49, 10, 60, -105, 168, -83, 317, -126, -57, 73, 60, 143, -147, -132, 148, -150, -67, -97, -108, 21, -5, 137, -64, -113, -91, 113, 96, 24, -8, -26, 31, 134, 241, -37, 14, 297, 92, -121, 190, 184, 80, 100, 57, 200, 5, 124, -130, -64, -202, 170, 9, -17, 38, 116, 139, -144, -147, -37, 87, 66, 106, 53, -6, -28, 146, -163, -113, 68, -3, -50, 92, 114, 28, -82, -60, -45, -151, 22, 127, -120, -120, 26, 16, 57, 38, 141, 85, 112, 27, 189, 139, -47, -4, 87, 122, -44, 62, 73, 57, -164, 116, -119, -53, -126, -85, 168, -53, 108, -104, 1, 6, 242, -18, 170, -98, 155, -175, 111, -16, -140, 15, -75, 160, -9, 126, 176, -5, -153, -16, 56, 81, 93, -20, 0, -158, -72, 100, 52, -103, -6, -107, -223, 133, 80, -2, 16, -82, -65, 102, 144, -30, 34, 84, 104, 359, 246, -84, 103, -46, 5, 215, -130, -7, -139, 95, 112, -63, 203, 68, 17, -63, 110, 181, 95, -140, 48, -73, -47, -153, -199, 124, 59]
3951E9L2O9k32R8M3m8L4J22r2p7o4J78m0k01K11n9p5J99l63J52K90k98J10p1J01
3976G8L9q1l3J8j72R5J47m1j57K36j73J88k32J33k25M14j29p6J8K5k58M08k12
3999A0p7J87k28%K50K6k33K68k55O1J5k7k83L31j01L2K33qPk93J23Mk6l8j06M6
4025h2N5M4J2jk60K50K7j19j4Q8R6k7O1j78O2N3k1k37J58j61K92J31k62MP8j70
4051a21J63O3n4j82J01%k0J14n6j32L19j02l8oR1j62K2r2L39k83q9K19k3o9n5
4076e3o0K53M5j84kj17J36j66J95J60k84J01l4r0J71k4M0r5J14m3J87l49P1J38
4100A10j93K56j41PJ38k06J11j76K44k56m4Q8n1K24j28L4L9k03P4K27k64J11J57
4123A58q7o9Q7j30J4N3j87M12j47l7j81k7M2P9J8J3mj20J64J47l62J07R5n6R6
$$ y = [59, 91, 160, -72, 26, 69, 21, 55, 177, 85, 8, -56, 122, 82, -119, 92, 33, -42, 157, -206, -54, 236, -62, 48, -23, 78, 117, 36, 3, 21, -151, -56, 91, 50, -107, 129, -44, 144, -88, 45, -180, 234, 105, 29, 47, 72, -186, 222, 10, -67, 120, -108, -108, 142, 168, -65, 203, -52, 9, 24, -3, -286, 45, -56, -24, 209, 201, 208, -85, 38, 42, 16, -22, -128, -82, -27, 17, 29, 28, -232, 18, 45, -74, -88, 0, 96, 69, 130, -48, 14, 67, 46, -191, -33, -194, 98, 229, -33, -29, 49, -121, 42, 105, 51, -131, -30, -30, -50, 64, 8, -124, 195, 93, 55, 49, 140, -22, 0, -92, 247, -36, -125, 94, 71, 2, -53, -113, 140, 185, 1, -1, -118, 18, -148, 47, 207, -77, 24, -10, -100, 71, 47, 87, -8, 106, 63, 250, -99, -28, 110, -83, 173, 32, 39, 177, -29, 82, -94, 150, -106, -150, -62, -113, 111, -17, 17, 56, -147, -73, 154, -110, 1, 158, 71, 2, 89, -41, -27, 26, -161, 251, 104, 67, -114, -141, -99, -20, -2, 11, 7, -113, 51, 198, -164, -57, 38, -18, 78]
4148G8k04J27j34J33K5Q0m7q3Q4P2l16J66r8O6k3J3J60J9k26j53J94R3p6j0p8
4173a38J10R4R7k75J19J08m14J91p5L19O7j82Q4m9j08J50m7k78K30o2J50J6j70
4196f3j56j3J34K13J63j30j75J73o3k17K29r4l6M7j97K59j6j28j15K76J36l00
4218g3R1J48j45j09q6J84L0j6p3m3J73k06K42m15K47K6J65q3j19K04q0%O2M3q6
4243H1j05J4O8K16j42K6k28k23L58l3j6J05r8J14k25J22n3M4J66l56J21R6j50
4266i8J57K51m28J04K1K3K6J47j33q5j2J32k7r0N4j6j7n7M0j87J45R8l8j66L25
4291A69j98j8j82l0L16m9R0j37J44j93j37K85Rr1R5q8q3N6O4m1k19L18j33O5l1
4316a9R4N0k64K42L5J28k31nP1k26K15N0j95J1J0j90K49j03J0J07m1k8R7P1%l37
$$ y = [78, -126, 1, -133, 0, 25, 105, 58, -25, 59, 131, -185, -19, -117, -51, -74, -61, 99, 118, -108, -261, -67, 26, -50, -60, -138, -28, 66, 163, -112, 7, 115, -299, -108, -183, 136, 203, 21, 105, 56, -52, 98, 51, -227, 3, -59, 91, 107, -63, -219, -232, -98, 115, 278, 148, -27, 146, 83, -134, 95, 1, -35, 12, -185, 74, 58, -70, -185, 91, 227, -73, 18, 166, 21, -88, -174, 10, 40, 24, -49, -92, 81, -125, 117, -298, -51, -25, 140, 57, -62, 142, 62, 62, 124, 167, 81, -24, -10, 58, 274, 132, 158, -70, -293, 65, 32, 16, 121, 23, 137, -88, 34, -19, 25, 191, -165, -44, 52, -98, 59, 310, -118, -14, 7, 30, 56, 203, 70, -15, -27, 105, 78, -12, 42, 26, 9, -48, -8, -195, -50, 48, 10, -156, 169, -29, -47, -229, -259, 57, 8, 98, -39, 105, -88, -225, 60, 69, -22, 73, -15, -98, -42, 22, -19, -238, 80, -53, 12, -19, 75, 125, -139, 103, 138, 266, 35, 30, 101, -125, 90, 140, -55, -44, -34, -224, 25, -78, -68, 39, -2, -30, 67, 138, 138, -199]
4342a99L47j70L0Oj54L64j44k13m0K00j37lM1J32N3j35J24Q2J52j53n6k49J13
4365iK75j32J02k59J1%J51j7q3k85M24l37J26r2J89K4p2J36j7k43j08M39k06n8
4389d1P9j14m3J17J26p9q6O2q0j9J52j12J00Pk13Q6J2J58j15O3J96k54J11l7j6
4414F0q4l1J1o9K57p2j07j43N1j39K43N0p9J44J57k36P7j30Q2j49N1P0o0M5J47
4439A46j38m8QN6j9m4n5J11R1j84J13k0N5j96R5j01Q3K9L0K7p3J02M0k7Lo9Ol5
4467a4J31j99j6K20k25l2O7o6J04Q5r4OO1j15M33m73Q2rr3J08j33J19Q8K8P2k24
4493h9R8OP0l43MK77l8r9N2L7L0r0OJ93j50j0Q9K6k82L36mk18K08l5P6r7k0J53
4521A86k20J31k14%km5J82j23M6m5J91j26LK79j62k57J35qK80k33J3Q4k13J97
$$ y = [-199, 148, -22, 8, 14, -140, 224, 80, -133, -173, 27, -110, -113, -72, 60, 113, -22, 102, 184, 336, 183, 127, -122, -9, 266, 134, 236, -23, -12, -12, 139, 122, 39, -246, 178, -159, -33, -125, 64, 88, 16, 152, 135, -108, -216, 223, 17, -41, 38, -76, -119, -2, 124, 45, -41, 21, -59, -78, 74, -38, 62, 69, -144, -58, -46, 112, -3, 60, 256, 2, 113, 76, 60, -24, -55, -44, -113, 144, 72, -35, -178, -127, -266, -23, 27, -52, 92, 249, 13, 90, -40, 42, -107, -56, 14, -46, -1, 146, 8, -40, -32, 24, 5, -39, -94, 17, 108, -76, 37, 17, 72, -124, -29, -130, -47, -18, 12, 39, -34, 68, 108, 81, 84, 15, 21, -14, 117, -82, -98, 122, -103, -135, -68, -134, -30, 55, -39, -33, 28, -87, 346, -127, -45, -54, -147, -39, -172, -53, 35, 63, 135, -89, 9, 15, 85, -258, -254, 23, -15, -114, -62, -25, 5, -85, -79, 114, -36, -46, 43, 69, -213, 123, 119, -99, 109, 74, 150, 53, 33, 186, -34, 97, -117, -117, -119, -164, 18, -105, -59, -104, 87, -39, -36, 243, 81, -176, -41, -49, 231, -2, 11, 95, -118, 79]
4545G9k98K80m2J34l02J51k0J00j55J56j66O7J84k26L6J17l2Q5l04J05M8O4M4
4568A05n8m7J14m4JQ9j6m4q3K00l33K5L7J06J50n4l7j36oPL9J1p2lJ67j39j08
4595a29L17o6k57L10k06R9n9M7J45l4P8j49l64K36m5J96j40j16J75j63J25L8J3
4618E1k51P0L43j94j34L51l36L7J43m0O1p6J16L8j11k5o3l6J67l39K16r3M1N4
4642a0K1j02Q7q4j34M46k10R4m9L9o7j46L32k19Q0p6j07J83P9J50k74k62J67J01
4666C9o1J05p7o4J71j62N0O5K09k51r2R1n9K9Q7j58Q5MOj99LL05j16L7j4j78p3
4693b18L02k28N0J01Jj87N1O7J94l0R6k29L2l6j12J50k23O1K6J9J13l03K8J46
4717a29K13n5j17J17K9J4p7N3j89K08J20j54P5r5j7J4o9k9J88j3j44J09Ln0Q0
$$ y = [79, -219, 61, 19, 153, -149, 2, -18, 82, -73, 83, -83, -16, 168, -58, -22, 95, 63, 148, -156, -51, -3, 61, 105, 47, 0, 114, 70, 71, 160, 144, 100, 17, 217, -116, -91, -54, 52, 202, 148, 111, -25, -31, -24, 15, 26, -46, -49, 118, -21, -129, 188, 122, -135, 175, -31, 68, 9, 56, 201, 167, 245, 96, -268, -32, -77, 119, -21, -137, 38, -125, 0, 38, 51, -200, -130, 213, 19, -115, 236, -100, -63, 80, 40, 101, 25, 141, 179, 68, 43, -20, -56, 111, -228, -12, -105, -64, -10, 11, -91, -4, -88, -222, 224, 14, 108, 59, 98, 31, -115, 217, -2, 78, 2, -105, 78, 157, 307, 33, -229, -62, 39, -22, 83, 6, -58, 113, -49, 1, 66, 275, 24, -68, 23, -36, -7, 80, -78, 7, 11, 17, -182, -179, 126, 10, 47, 33, -145, -218, 84, -144, -94, 7, 8, -179, -128, -61, 133, 103, 199, -30, 2, -34, -146, 4, -219, -158, -132, -113, 0, -303, -275, -129, 84, 29, -88, 29, 58, 72, -5, 48, -141, 67, 187, 33, 108, 13, -4, 10, -59, -88, 100, 87, -57, 52, 55, 5, 85]
4742H5j49p5K93k26J32r3j62Q2L0k1j8p8P6l9K31kO9o6j14R1k56J66K68l27L5
4767f8k8J52L0n3J2Q8K8j58j51j00O9J91k59K28p6J81k2J18j46J07J03l32J66
4790H0j54J39nj11J72k14J15J70j42j26J9K55m5o2J35k94p8R3j64J94R6r2J6N9
4814E6l3p7j72K88K2j78j43RK49R9j54L3r8J54k60Q6J31kj91M43o9j96J15j68
4838e6J3J25r8J65L4k35M6kk55K76j29lK27Lp5r8L2Q5n7r4oQ3p6J06K78l50N7
4865dQ8j57M3j19J55J07j66P4R9Q7j72j07N2j49J93P1r7o1R0K5j08K15m3j1r2
4890A3Oq1O8l7P3K6m0Nj22J19n6J49l44J46kJ50q2JJ33N2r3j21j3k9kJ82q2Q3
4918A02Q9j47L9j10J27N1o0N2J23m21J93Rj46Q4M1J6j41J05q7P8j22R8J32J6j24
$$ y = [85, -64, -139, 154, -72, 60, -33, -195, -113, -83, -104, -122, -200, -124, -163, 68, 66, 135, 69, -45, 46, -210, -44, 224, -103, -68, -96, 56, 86, 33, 45, 133, 161, 3, -148, -248, -179, 12, -247, -19, -95, 86, 64, 182, 36, 143, 246, -86, 80, -74, 65, 60, -51, 121, -93, 22, 192, 50, -76, -57, 198, 153, 91, 226, -68, -146, -53, -217, -23, 73, -19, -3, 56, 23, -54, -226, 62, 84, -94, -237, -228, 21, 120, -34, -1, -99, 55, -205, -119, 12, 10, -181, 262, 193, -3, 112, -56, -43, 82, -16, 149, 183, -52, -6, -8, -263, 13, -116, -119, 108, 111, 36, -62, -30, 55, -2, -96, -102, -19, -95, 11, 289, -61, -4, 84, -73, -30, -149, 6, 113, -53, 21, 120, 207, 35, -72, -20, -169, 24, 95, -2, -63, 27, 52, -56, 159, 116, 105, 13, 19, -62, 6, -31, 42, 68, 28, 33, -89, 30, -26, 123, -221, -75, -77, 73, -9, -8, 125, 177, 84, -37, -50, -79, -81, 101, 19, 102, 191, 44, 83, -27, 100, 151, 91, 143, 266, -155, 38, 47, -99, -15, 26, 42, -99, 6, -81, -3, -125, -27, 105, 121, -3]
4943cr1R5P8q0J8j30j63P0K53l5k17L34j86J42l01J66N8Q2L9q6l3J35l06K17k
4968E4qQ1k51J50J15r3K2j34l1j0j52L73j51K20k98J52L1K0m1k5j0p5M6n9j9K91
4994A98j48o8J1kj69K80l40J3J02J18P3p7N3r4j3q7L44j78K49k34K79k51j15J08
5018E2K0P9p3k93K56n0j0K0J5J42k79J04l2j33K12j00k6K7J11M8j28K22j78R0
5042I6j47J75k83p7K75j09l1N7j14J1J88n9L6Rrl1L0k06K30P9n0j15P5J28Q5k85
5068d2j69J48J70Lj15%M0P4k55K63k17L11l09l7L19j64J4p2J20o0r8K68K2m28
5092b14J04R6J26P9j44k23J59m5m8K46j16j3p9n7J72n7p0K42k83O2J56m2k40M7
5116a42K03j27o2kL11k50K71k85J72j14j54J82J41k45K16j81P9N2j44J75j44R
$$ y = [-3, -94, 1, 79, -1, 17, -113, -276, -206, 47, 12, -205, 129, -57, 85, -216, -50, 8, 90, 129, 43, 10, 145, -161, 56, 54, 46, 127, -124, 26, 141, 48, 70, -64, -95, -105, -257, 116, -35, 185, -113, 39, 70, 90, 49, 24, 14, -61, -15, -74, -93, 198, 50, -18, -7, -9, -178, 102, -238, -225, -123, -5, 68, -9, 44, -50, -63, -150, 194, 16, 265, 31, 310, 59, -56, 52, 72, 151, 78, -215, 41, -9, -19, 1, 16, 158, -121, -17, -49, -182, 30, -70, -96, -69, 42, 90, -38, 184, 6, 96, -51, 124, -159, -236, 39, -70, -101, -44, -158, -147, 41, -18, 18, 27, 18, -13, 17, -189, 41, 120, 70, -45, 30, 158, 243, -42, -211, -63, 107, 110, -5, -5, 35, 109, -146, 117, -100, 211, -98, -135, 184, 20, 34, -38, 82, 22, -76, 192, 214, -214, -110, -14, 112, 191, 47, -176, -17, -62, -110, 136, 20, 7, -72, -129, 43, -14, -84, 158, -125, -63, 93, 51, -189, -142, 61, -66, -128, -130, 181, -69, 202, -83, 89, -25, -179, 3, 144, -101, 115, -66, 13, 65, -79, 96, -48, -39]
5138c9PJ17j23Q9k3k6l4J16n6q4J90p8J11l40K40j46Q2J8m9k8J51j42J67o3kl64
5164c09K20J17n5m7K49k98P1m1J0o1J5k00L21O5j01R5J23l19L50l29N7J02J0j15
5188g0L4K17k06M0j3R6j80Q9K07m20J37J70k03K22j82n5K02q6j43J35m8j76Q5
5211a48j3q4K17j16K47Kk53J49J14k7j48JRj11J55J53j80m2J33Q9k57Q0L26k07
5235H9j50J28j9O5j35L2q0L0K67k80J78k24K02j09M8j1k4J01r8J82qN4j03k93
5259a58K18l09J44r4L48j6j46K4J80j90P9J48k98J12j78K50j15L9m6j54K51k4
5281F5mk8j4m3P7q8j21R8j9J52j20K20j85J06p8K8k45L34n0Mj48J14k0K19O9l77
5307e4J33k3j88J49Jq4L9J57k59K24o0K8Kn9l41L69O9O6m5N5l43J61j76J71J06
$$ y = [-39, -32, 85, -38, 51, 28, 2, -32, 84, 28, -56, 134, 56, 167, -173, 67, -79, 3, 21, -28, -56, 95, -47, 120, 57, 55, -309, -89, 28, -27, -74, 175, -123, -52, -93, -83, -144, -129, -329, -8, 57, -44, 51, 174, -145, 205, -124, -67, 35, 45, -70, -36, 181, -25, 15, 2, 98, -82, 7, 214, -206, -69, 101, -102, 120, -62, -117, 85, -1, -144, -9, -57, -233, -148, -161, -245, -28, -144, 103, 105, -148, 1, 115, 88, -60, -59, -50, -161, -6, 147, -33, -75, 58, 147, -110, -30, 296, 89, -61, 67, 48, 113, -22, 10, -70, -40, 227, -53, 125, -99, 103, -6, 42, 31, 7, 108, 10, 192, 184, 238, 135, -158, 60, -249, -105, -199, 149, 133, -13, 11, 191, 1, 80, 228, -70, 42, -136, 114, -1, 38, -8, -162, 89, 65, 61, 33, 19, -24, 53, -35, -156, -58, -77, 75, -45, 175, -10, 96, 18, 46, -199, 135, 85, 89, -59, 55, 35, 254, 323, -54, 79, 56, -132, 17, 18, -66, -27, 130, -129, 95, 35, 63, 65, 6, -335, 34, 103, 169, 124, 179, -164, -3, -179, -8, 98]
5332I8j82j68M91k79k4J08J06r9O1k91K31N5j9K3k65J41Rl9J63j85J13j44J33
5355C7J23m8l5k32J32j84O2r8N56l44k5N8j8L3k0J02j34j38K17J6n5K1j95J00
5379f9o7J05j79N06l89j5P7k3J58j70J51k60P1R3K48k33M2J99k94m5J07L0j10
5402f7LJ39j57J18K6o7j2l39P4L60k36M2K62k65J01R7O2k46K2kK43j47Rk37K20
5427CQ9q5J20j93L80l44K56n5j54K6p9q4J71m7L3L0j7k5M0O9k20K83l82Q5J98
5452I8K5k6j75%K7l19M88j44L5K81l05j27J01L1m2P1J4j24J1J23k58L55l04lL11
5477A44m3l5j24M4J1O5j8k04m2J97l6K0L6J09K8l26K99L9Lk36p6J93K3k1j39K35
5503A46N7j93K4J02k80J85jP0q5O1j21O9N5o8P1j60M0L33l16KJ76l34J20O4J41
$$ y = [98, -84, -252, 239, -40, -64, 44, 150, 51, 112, -179, 52, 107, 88, 111, -154, -13, -4, -43, 120, -65, 48, -96, 37, 160, 112, 77, -155, -23, -207, -145, -243, 313, -31, -56, 2, -16, 17, -3, 99, -35, -173, 44, 60, 5, 26, -169, -69, -136, -31, -210, 296, -93, -108, -31, -54, 104, -66, 85, -175, -104, -11, 237, 4, 46, 245, -49, -94, 13, 43, -67, -64, 75, -82, 36, 62, -5, -17, -356, -282, 78, -158, -116, 146, -119, -18, 79, 141, -105, -83, -85, 158, 11, 20, -217, 3, 92, 7, 127, -66, 314, -30, 226, 171, 17, 43, -36, -120, 51, 4, 37, 67, 50, 25, 65, 134, -86, 197, -185, -100, 98, 123, 97, -78, -78, -51, -370, 118, -26, 9, 290, -15, -142, -41, -10, -52, 19, 33, -91, -80, 43, -215, 140, -164, -167, 144, 101, 66, -58, -14, -3, 62, 44, -160, -202, -5, -41, -21, 15, 124, 152, -174, 125, 164, 167, -69, -145, 48, 71, 50, -89, 146, 203, 10, 34, 136, -144, 41, 40, 110, 25, 86, -35, 34, 89, 21, 92, -68, -28, 305, -11, -9, 167, -167, -47, 17, 158]
5528A58m3k13J14Qj55K46j70J70l30J55NN5j4n5K2n1Q9L5J0j49L9j1K27j0j13
5553A9j64O0N1l1N1R4K5j31n3J81n8K6k18K30O3j84o5K73m2kM5j65J63k3l16J35
5579c6O8p4O6l5m8n3O5L44l00j42J55K6N4m8p0J43k17L9J43J4k66J6L19k06J35
5604I2l0J47q4k14m6m2L17k54J09O3k2r6J12J01lj74J72l01J57q0J07j17j52L94
5628A56l07J68Ok7j04J10j74K6K54j4j22j10K42j09n0R8pJ6k9jL1j71j2NJ24j74
5654a75J35J43k55J97rPQ6j03j17J64q1p3j20J55K9k5j17K89r3J39j94M3o6J24
5678H3kj49M1R8l8M1lJ18j67Q3o2M8J14j50N7o9J38j87kO0j83Q9J66q5pJ9r0K0
5706a9LJ5J36j13j24m0j32J38L2j5J47J15k59J25qK79j25j71P0J27M1j46q5q0
$$ y = [158, 115, -98, 16, 24, -131, 115, -55, 115, -215, -60, -55, 0, -14, -69, -47, -98, -9, 26, 36, -113, -74, -85, 142, 132, 19, -145, -85, -34, -65, -14, 80, 105, -26, -79, 102, 44, 70, -148, 82, 145, -39, -104, 169, 127, 125, 170, 5, 168, 145, -171, -36, 32, -42, 24, -11, -59, -112, -47, 297, -3, -145, 10, 36, 90, 42, -28, 115, -102, -63, 80, 94, -172, -156, 163, -43, 92, 62, 209, 125, -89, -135, -177, 140, -114, -5, 58, 36, -60, 52, 153, 150, -24, 148, -153, 4, -76, 31, -86, -238, 156, -151, 17, 23, -4, -108, 2, -172, -146, 108, 94, -28, -138, 104, -5, -55, 43, 36, 52, 23, 22, 53, -118, -130, -125, -1, -175, -40, 103, -152, 45, 36, 43, 129, 26, -91, 73, -8, -81, -201, -46, -17, -42, -159, 130, 37, 176, -18, 25, -41, 83, 81, -68, -27, 71, 33, 74, 71, 189, 22, 105, 43, 91, 205, 55, 112, 43, 181, -6, -8, 52, -131, -42, 124, 39, 32, 51, -39, -19, -16, -1, 135, 22, -102, -142, -274, -136, -104, -119, 28, 143, -116, 9, 1, 280, 155, -16, 54, 181, 222, 76, -9, -89]
5730h9O9O9o1N1m5o0J63k07K96q2J12k54O9J31k62J54R9j83J61n2L0j34K00j62
5754A3P9k05Q4J58j18P5j15j22J27L04j66j32r1O1K71j33Pj05j77K38j08J0mN8
5778Ij4K99m50R4J84j01j82J72j20N8P9L9k03J76j82K66j77J00j62J52o7q2O7
5801d5L5J50k88J10M0Lr0K04j64K5N0j2m3M2qJ5j86kJ25K5o7K75k26J02k20J16
5827c4n3O9j32K36j53Mj80J51K11J4p8m9nJ43J4o2K65m17j2K0m5J12j00L20j67
5852G2j27j9L7l9r0K57k9k7j39J77r2j35K35m0Qp5LJ39L6J77k43K2j29L8lm6M
5879b8J76r7o6J1j1o8K71k84J08l21L79R6j20Q1k35K47p4j84pL5R4m5J15P7n7
5904I3j95L1Q2pL8k7m5P3J57l49J83j70qO9r9J73R2p4rQj92J06k6L7M3j52J30
$$ y = [-89, -20, 49, -12, 39, -6, -66, 97, -110, 186, 104, 216, -38, 31, 162, -100, 54, 153, -30, 131, 79, 109, -25, 175, 13, 92, -113, -29, 129, 11, 86, -29, -151, -24, 280, 114, -18, -109, -48, 223, 90, 97, -8, -185, 53, -55, -45, -49, 9, -5, 294, -156, -62, 122, 21, -161, 11, -109, -51, 28, 67, -136, 40, -142, 124, -53, 47, -115, 37, -30, -112, -45, -10, 140, -148, -38, 2, 5, -85, 119, -45, -20, 30, 18, -25, 17, 9, 24, -162, -164, -39, -14, -81, 194, -32, 70, -150, -34, -87, -18, -150, 86, -67, -63, -243, -92, 119, 133, 55, 6, 1, 144, 158, 96, 361, -56, -68, -48, -93, 19, -81, 239, 72, -55, -74, -37, -76, -166, 91, 62, 35, -104, 73, -19, -154, 81, 41, 49, -26, -23, 116, 152, 329, 86, 108, -21, 17, 14, -32, -28, 148, 51, -15, -4, -15, -83, 188, -96, 12, -309, 70, 166, 46, 127, -108, 139, 65, -119, -126, -91, 3, -42, 73, 150, 93, -102, -71, 11, 4, 42, 15, -30, 43, 200, -149, 34, -136, -144, -75, -174, -1, 91, 17, 8, 16, -176, -70, -96, -59, -16, -168, -38]
5931c8J16j02J41k3j74QR9m3j67J26J74k90K01J26j7Q1j96J21k99K95l6jJ49k14
5955C7q2j28J34O1m7P8r1j51P8K64r9j12Q7k13K83k23J92J8k05J73kR3k74K3N5
5980e1r8J76R0L7l21J83k20K35R3r7J01k40J71J2j87k19K10NK8N4p2P0L4r0J7
6005g9J23j66K75k99K90k25J02or7J29j82J85j85P0J0r6P4J17p9R2o4k39K21J1
6029a8r8M4Q4nNkj41R8J76j60J64l6k87J77N4p0J11l3k44L09j43j8J42k6k9q5
6055c1L29l24o3J94N6l02Q4J12Q9NJ74k48o7n3Q4j26J09L8J4J0o9l7m2m9K85j82
6081a0k3J70m17L98o6p6m9l1K42r2m9j25J41p7k8J04NM8k35J77Q6p5j5k36K20
6106a3K03j25J19j43k40L47r3j49J55J12r4j6l3l35K11J63j09P4N5j60R1O7R0
$$ y = [-38, 78, -24, 117, 94, -80, -72, 27, -16, -183, -57, 117, -173, 28, 154, 137, 218, 22, 143, -156, 139, 103, 102, 251, 37, -45, -173, -39, 22, -25, 53, -38, -189, -111, 153, 54, -58, 29, -184, 99, -124, 68, 86, -119, 54, 52, 145, -129, -106, -51, -149, 27, 117, 154, -167, 16, -204, 31, 124, 27, 128, -112, 59, 71, -116, -335, -125, -120, -92, -38, -110, -40, -6, -96, -79, 44, -122, 153, -146, 144, -81, 21, 15, -82, 47, -135, 50, -135, -65, -55, -151, -77, 40, -39, 53, -11, -250, -29, -18, -116, -72, 12, 7, 12, 10, -131, -33, 143, -17, 147, 111, -176, 1, 55, -15, 96, 63, -181, 128, -15, -33, 109, 83, 54, -31, 298, -26, -89, 105, 161, -141, -57, 55, 144, 149, 323, 75, 8, -45, 39, -87, 22, 60, 74, 84, 15, -22, -64, -113, 172, -10, -33, 137, -280, 118, 52, -24, -73, -104, 138, 46, -3, -128, 13, -64, -92, 12, 17, 65, -170, 7, 93, 18, 3, -233, -13, 190, 65, 184, 41, -199, 148, 55, -94, 61, 173, 79, 63, 30, -305, -94, 69, -40, 34, 89, -71, 20, 87, 177]
6129A77l26L96n62K30O1R9J24k71J56%j93J89k31K52j46k0R0P4n7j56L1J6j05
6152a72J52K16j70J58j55J14n3p3q5J10J99l17p1L3O3j49J78O7k6j27L07j39j52
6175i2N5N5j25M4K45j73l2K55n7k85m1O9P7k3K58j36j45J57k06K18r7j12k3M6
6199f8J59L9k79K30j72J34j26J29k01N0P1K3J06j01J51j50p3J23j47P6N2J33n
6222A54j7o1j81K4K01k3j49n4l6m0MM1K44n4Mk12J51j07j34L22l8qk36M4J49o0
6248g2o2Q4m3J09ok12J59m4N5J13J0j8M9k90J80M8j05j8N0Q7q1J11l10K82n1n5
6274c0L0JL0j88M17j23k75p8L28q1N6K1k29J16l2P5j47Q6n5j15J95j21J21L0j19
6299h7n0Pm6K79Pj96N6l8j1R2k0N6r3J24k62J40P4j90L42k04j8R5j81N5l6j83
$$ y = [177, -149, 247, -315, -85, -24, 75, 199, -72, 84, 84, -109, 80, -151, 101, -45, -65, 25, 99, 42, -114, -83, -67, -172, -20, 196, 26, 184, 29, 143, 90, 17, -68, 42, 241, -76, -147, -114, -51, -200, -22, 45, 19, -108, 199, 60, -92, -37, 18, -107, -63, 182, 9, -23, 232, 175, -110, -151, -82, -5, -28, 230, 94, -51, 106, -100, 118, 21, -91, -114, -68, 91, 130, -149, 81, -91, 43, -83, 46, -155, -105, -34, -11, 95, -6, 145, -5, -78, 45, -102, -26, 26, 159, 154, 137, 76, -105, -81, 120, 97, -52, -106, -142, -182, -178, -137, 107, 53, 57, -155, -4, -111, -245, 77, 39, 31, -205, -161, -12, -72, -134, -50, -93, 16, 10, -202, -43, -87, -32, 81, 91, 73, 122, -168, 12, 60, -45, -63, -13, 74, -7, 104, -206, 76, 25, -30, 0, 1, 31, -157, 260, 137, -138, -216, 112, 31, 87, 108, -121, -5, -37, 38, -109, -23, -78, -193, 2, -119, 2, 32, -87, -137, -130, -176, 103, 110, -86, -30, -68, -79, 13, -7, 49, -44, 80, -182, -42, 32, -158, 184, -20, -38, 57, -124, -69, -105, -288]
6325b88K53J76r6k48j0R5O6O8k23J90j06J01N5n2m5J00O5k70K42J27j87P1P5l0
6349A29Mj63M4o9M0n2K06j69L86m82M4N6P5p4j68K31j19K51l53K22p5M4o6m9K5
6374h2L4k25K25Pj23Q6j47L74j89rq7K32j14N3L7o4n7pm1J59r8J43k47K15o8L8
6400D5J98l29m4l1LK70R3J4l63n9L37j64J8J49j55j29J98K7k21K31J38k22r8J80
$$ y = [-288, -35, 141, 45, -203, -213, -118, -52, 16, -207, -17, -123, -22, 33, -19, -64, 36, 101, -169, 73, 200, 13, 84, 159, 129, 133, -30, 14, -55, -15, -67, 139, -30, 356, -126, -82, -26, 49, -25, -193, 38, -81, 170, -183, 39, -36, 8, -58, -107, -82, -48, -273, -48, -41, -164, -78, -225, 149, -40, -49, -136, 96, -18, 35, 72, 8, -49, -56, -97, 62, -36, 107, -140, 75, 7, 45, 243, -86, -130, -161, -158, 112, 205, 219, -144, -203, 134, -30, -12, 137, -18, -147, 51, 78, -143, 88, 226, 4, -94, 86]
$$ [...]
8191H7
##END NTUPLES=NMR FID
##END=
