##TITLE=1H_Pr 2298
 CDCl3,8 sc, 
 4.03.2021
##JCAMPDX= 6.0         $$ Bruker NMR JCAMP-DX V2.0
##DATA TYPE= NMR FID
##DATA CLASS= NTUPLES
##ORIGIN= UXNMR, Bruker Analytische Messtechnik GmbH
##OWNER= root
$$ XWIN-NMR		Version 3.5
$$ Thu Mar  4 10:14:16 2021 Russian Standard Time (UT+4h)  she@DPX200
##.OBSERVE FREQUENCY= 200.1315066352
##.OBSERVE NUCLEUS= ^1H
##.DELAY= (6, 6)
##.ACQUISITION MODE= SIMULTANEOUS
##.ACQUISITION SCHEME= undefined
##.AVERAGES= 8
##.DIGITISER RES= 18
##SPECTROMETER/DATA SYSTEM= spect
##.PULSE SEQUENCE= zg30
##.SOLVENT NAME= CDCl3
##.SHIFT REFERENCE= (INTERNAL, CDCl3, 0, 15.7039)
##AUDIT TRAIL= $$ (NUMBER, WHEN, WHO, WHERE, WHAT)
$$ ##TITLE= Audit trail, XWIN-NMR		Version 3.5
$$ ##JCAMPDX= 5.01
$$ ##ORIGIN= Bruker BioSpin GmbH
$$ ##OWNER= she
$$ F:/spectra/data/she/nmr/H-F/1/audita.txt
$$ ##AUDIT TRAIL=  $$ (NUMBER, WHEN, WHO, WHERE, WHAT)
(   1,<2021-03-04 10:13:15.67 +0400>,<she>,<DPX200>,
      <created by zg, POWCHK disabled, PULCHK disabled
       configuration hash MD5:
       00 E9 B6 7A A2 85 ED C7 34 08 36 98 17 FE 4E 26
       data hash MD5: 16K
       82 18 B0 BB 01 9B 60 D8 97 55 E1 93 BA B1 0F 81>)
$$ ##END=
$$ 
$$ hash MD5
$$ 0C F6 8F 2A 8A 79 D0 5B DC 08 60 5C 26 2D CA 02
##$RELAX= 
##$RELAX= 
##$RELAX= 
##$RELAX= 
##$RELAX= 
##$RELAX= 
$$ Bruker specific parameters
$$ --------------------------
##$DU= <F:/spectra>
##$EXPNO= 1
##$NAME= <H-F>
##$PROCNO= 1
##$TYPE= <nmr>
##$USER= <she>
##$AMP= (0..31)
100 100 100 100 100 100 100 100 100 100 100 100 100 100 100 100 100 100 
100 100 100 100 100 100 100 100 100 100 100 100 100 100 
##$AQSEQ= 0
##$AQ_mod= 1
##$AUNM= <au_zg>
##$AUTOPOS= <>
##$BF1= 200.13
##$BF2= 200.13
##$BF3= 200.13
##$BF4= 200.13
##$BF5= 200.13
##$BF6= 200.13
##$BF7= 200.13
##$BF8= 200.13
##$BYTORDA= 1
##$CFDGTYP= 0
##$CFRGTYP= 5
##$CHEMSTR= <none>
##$CNST= (0..31)
1 1 145 1 1 1 1 1 1 1 1 1 1 1 1 1 1 1 1 1 1 1 1 1 1 1 1 1 1 1 1 1 
##$CPDPRG= <>
##$CPDPRG1= <>
##$CPDPRG2= <>
##$CPDPRG3= <>
##$CPDPRG4= <mlev>
##$CPDPRG5= <mlev>
##$CPDPRG6= <mlev>
##$CPDPRG7= <mlev>
##$CPDPRG8= <mlev>
##$CPDPRGB= <>
##$CPDPRGT= <>
##$D= (0..31)
0 1.2 0 0 0 0 0 0 0 0.06 0 0.03 0 0 0 0 0.0002 0 0 0 0 0 0 0 0 0 0 0 0 
0 0 0 
##$DATE= 1614838395
##$DBL= (0..7)
120 120 120 120 120 120 120 120 
##$DBP= (0..7)
150 150 150 150 150 150 150 150 
##$DBP07= 0
##$DBPNAM0= <>
##$DBPNAM1= <>
##$DBPNAM2= <>
##$DBPNAM3= <>
##$DBPNAM4= <>
##$DBPNAM5= <>
##$DBPNAM6= <>
##$DBPNAM7= <>
##$DBPOAL= (0..7)
0.5 0.5 0.5 0.5 0.5 0.5 0.5 0.5 
##$DBPOFFS= (0..7)
0 0 0 0 0 0 0 0 
##$DE= 6
##$DECBNUC= <off>
##$DECIM= 32
##$DECNUC= <off>
##$DECSTAT= 4
##$DIGMOD= 1
##$DIGTYP= 9
##$DL= (0..7)
0 120 120 120 120 120 120 120 
##$DP= (0..7)
150 150 150 150 150 150 150 150 
##$DP07= 0
##$DPNAME0= <>
##$DPNAME1= <>
##$DPNAME2= <>
##$DPNAME3= <>
##$DPNAME4= <>
##$DPNAME5= <>
##$DPNAME6= <>
##$DPNAME7= <>
##$DPOAL= (0..7)
0.5 0.5 0.5 0.5 0.5 0.5 0.5 0.5 
##$DPOFFS= (0..7)
0 0 0 0 0 0 0 0 
##$DQDMODE= 0
##$DR= 18
##$DS= 0
##$DSLIST= <SSSSSSSSSSSSSSS>
$$ [...]
##$SUBNAM2= <"">
##$SUBNAM3= <"">
##$SUBNAM4= <"">
##$SUBNAM5= <"">
##$SUBNAM6= <"">
##$SUBNAM7= <"">
##$SUBNAM8= <"">
##$SUBNAM9= <"">
##$SW= 16.9725356469052
##$SWIBOX= (0..15)
0 0 2 0 0 0 0 0 0 0 0 0 0 0 0 0 
##$SW_h= 3396.73913043478
##$TD= 16384
##$TD0= 1
##$TE= 0
##$TE2= 300
##$TE3= 300
##$TEG= 300
##$TL= (0..7)
0 120 120 120 120 120 120 120 
##$TP= (0..7)
150 150 150 150 150 150 150 150 
##$TP07= 0
##$TPNAME0= <>
##$TPNAME1= <>
##$TPNAME2= <>
##$TPNAME3= <>
##$TPNAME4= <>
##$TPNAME5= <>
##$TPNAME6= <>
##$TPNAME7= <>
##$TPOAL= (0..7)
0.5 0.5 0.5 0.5 0.5 0.5 0.5 0.5 
##$TPOFFS= (0..7)
0 0 0 0 0 0 0 0 
##$TUNHIN= 0
##$TUNHOUT= 0
##$TUNXOUT= 0
##$USERA1= <user>
##$USERA2= <user>
##$USERA3= <user>
##$USERA4= <user>
##$USERA5= <user>
##$V9= 5
##$VALIST= <valist>
##$VCLIST= <CCCCCCCCCCCCCCC>
##$VD= 0
##$VDLIST= <DDDDDDDDDDDDDDD>
##$VPLIST= <PPPPPPPPPPPPPPP>
##$VTLIST= <TTTTTTTTTTTTTTT>
##$WBST= 1024
##$WBSW= 4
##$XGAIN= (0..3)
0 0 0 0 
##$XL= 0
##$YL= 0
##$YMAX_a= 281416
##$YMIN_a= -134404
##$ZGOPTNS= <>
##$ZL1= 120
##$ZL2= 120
##$ZL3= 120
##$ZL4= 120
##$ABSF1= 10
##$ABSF2= 0
##$ABSG= 5
##$ABSL= 3
##$ALPHA= 0
##$AQORDER= 0
##$ASSFAC= 0
##$ASSFACI= 0
##$ASSFACX= 0
##$ASSWID= 0
##$AUNMP= <proc_1d>
##$AZFE= 0.1
##$AZFW= 0.1
##$BCFW= 1
##$BC_mod= 2
##$BYTORDP= 1
##$COROFFS= 0
##$CY= 11.3945322036743
##$DATMOD= 1
##$DC= 2
##$DFILT= <>
##$DTYPP= 0
##$F1P= 15.9154993809931
##$F2P= -4.1035820241983
##$FCOR= 0.5
##$FTSIZE= 0
##$FT_mod= 4
##$GAMMA= 1
##$GB= 0.15
##$INTBC= 1
##$INTSCL= 1
##$ISEN= 128
##$LB= 0.24
##$LEV0= 0
##$LPBIN= 0
##$MAXI= 10000
##$MC2= 0
##$MEAN= 0
##$ME_mod= 0
##$MI= 1.114404
##$NCOEF= 0
##$NC_proc= 0
##$NLEV= 6
##$NOISF1= 3.799351
##$NOISF2= 2.8
##$NSP= 1
##$NTH_PI= 0
##$NZP= 0
##$OFFSET= 15.70392
##$PC= 1
##$PHC0= -10759.23
##$PHC1= 8.800938
##$PH_mod= 1
##$PKNL= yes
##$PPARMOD= 0
##$PSCAL= 0
##$PSIGN= 0
##$REVERSE= no
##$SF= 200.130013532006
##$SI= 16384
##$SIGF1= 3
##$SIGF2= 2
##$SINO= 400
##$SIOLD= 16384
##$SREGLST= <1H.CDCl3>
##$SSB= 0
##$STSI= 0
##$STSR= 0
##$SW_p= 3612.71676300578
##$SYMM= 0
##$S_DEV= 0
##$TDeff= 0
##$TDoff= 0
##$TI= <>
##$TILT= no
##$TM1= 0
##$TM2= 0
##$TOPLEV= 0
##$USERP1= <user>
##$USERP2= <user>
##$USERP3= <user>
##$USERP4= <user>
##$USERP5= <user>
##$WDW= 1
##$XDIM= 8192
##$YMAX_p= 0
##$YMIN_p= 0
$$ End of Bruker specific parameters
$$ ---------------------------------
##NTUPLES= NMR FID
##VAR_NAME=  TIME,          FID/REAL,        FID/IMAG
##SYMBOL=    X,             R,               I
##VAR_TYPE=  INDEPENDENT,   DEPENDENT,       DEPENDENT
##VAR_FORM=  AFFN,          ASDF,            ASDF
##VAR_DIM=   8192,          8192,            8192
##UNITS=     SECONDS,       ARBITRARY UNITS, ARBITRARY UNITS
##FACTOR=    0.0002944,     1,               1
##FIRST=     0,             0,               0
##LAST=      2.4114304,     0,               0
##MIN=       0,             -134404,         0
##MAX=       2.4114304,     281416,          0
$$ Real data points
##PAGE= N=1
##DATA TABLE= (X++(R..R)), XYDATA
$$ [...]
$$ plain form
1704 -333 -72 126 459 -325 -339 -57 312 17 -144 -540 144 519 -193 -310 -395 265 295 -214 -539 -232 515
1725 515 95 -276 -701 66 333 14 -357 -544 271 263 -109 -541 90 338 205 -386 -648 5 578 58 -447
1746 -447 -251 395 362 -27 -576 -134 160 411 -17 -433 -129 493 294 -305 -37 199 432 -227 -513 -12
1766 -12 273 224 -273 -576 -216 440 76 31 -227 300 293 -215 -350 -318 60 420 -55 -375 -86 419 211 -26
1788 -26 -378 82 198 186 -142 -312 335 310 200 -316 29 476 169 -44 -260 368 358 330 -226 -164 54 76
1810 76 277 -606 126 163 375 -63 -179 322 170 362 -70 32 221 186 3 104 -135 275 281 -60 195 108
1832 108 266 500 38 -114 157 32 141 71 -8 153 125 70 122 116 305 229 239 165 -45 -137 57 -72 -181 100
1856 100 226 -57 75 -102 170 110 212 -105 -73 -279 -348 -235 -145 -215 -265 -188 -115 161 -127 19 -27 -286 -266
$$ packed form
1704c33K61J98L33p84j4K82L69k95j61l96O84L75p12j17q5O60L0n09l25L07P47
1725E15m20l71m25P67K67l19l71j87Q15ql72m32O31K48j33n91k62O53N73n20n05
1746d47J96O46l3l89n49M42K94K51m28m16L04O22j99n99K68K36K33o59k86N01
1766a2K85m9m97l03L60O56l64m5k58N27pn08j35L2L78L60m75l20K89N05k08k37
1788b6l52M60J16j2l28j70O47k5j10n16L45M47l07k13k16O28j0k8n56O2K18K2
1810G6K01q83P32L7K12m38j16N01j52J92m32J02J89l5j83J01k39M10Ol41K55q7
1832A08J58K34m62j52K71j25J09p0p9J61k8n5N2oJ89p6J0p4k10r2J94j29j09K81
1856A00J26k83J32j77K72o0J02l17L2k06o9J13R0p0n0P7P3K76k88J46m6k59K0
$$ plain form
1879 -266 -522 -267 -304 -183 -442 -271 -79 -102 11 -415 -1 23 -37 -136 -398 -167 -186 47 -439 -122 -78 230
1901 230 68 -138 -205 -243 283 -120 -50 -300 116 -164 -147 -39 -48 295 35 215 -17 337 98 -18 -148 -124
1923 -124 166 3 -275 -346 127 385 81 -85 330 535 469 106 -434 -184 151 25 -80 -435 94 481 181
1944 181 -33 -149 273 418 260 -38 -143 64 71 49 -521 17 316 374 -211 -27 314 617 -47 -143 -293 42
1966 42 258 -306 -338 -268 299 305 96 -153 207 388 248 -313 -361 -72 11 -82 -263 -319 268 78 39 -136 348
1989 348 176 -23 -136 -166 -86 288 -34 -267 9 2 203 146 -262 119 312 28 -36 -13 -7 -115 10 -253 -50
2012 -50 33 230 -209 -84 207 235 36 -114 -40 -115 -131 -77 -164 33 -247 120 -90 -14 161 48 111 -97 -187 -140
2036 -140 -17 -69 -73 -160 -78 122 157 47 -30 157 55 64 -260 -36 260 -100 203 -320 -50 16 46 -48 238 356
$$ packed form
1879b66k56K55l7J21k59J71J92k3J13m26M14K4o0r9k62K31j9K33m86L17M4L08
1901B30j62k06o7l8N26m03P0k50M16k80J7J08rL43k60J80k32L54k39j16j30K4
1923a24K90j63k78p1M73K58l04j66M15K05o6l63n40K50L35j26j05l55N29L87l00
1944A81k14j16M22J45j58k98j05K07Pk2n70N38K99N8n85J84L41L03o64r6j50L35
1966D2K16n64l2P0N67Ok09k49L60J81j40n61m8K89Q3r3j81n6N87j90l9j75M84
1989C48j72j99j13l0Q0L74l22k33K76pK01n7m08L81J93k84o4K3Oj08J25k63K03
2012e0Q3J97m39J25K91K8j99j50P4p5j6N4q7J97k80L67k10P6J75j13O3k08r0M7
2036a40J23n2mq7Q2K00L5j10p7J87j02Rl24K24K96l60L03n23K70O6L0r4K86J18
$$ plain form
2060 356 -54 285 -158 24 -4 -77 51 -118 119 -201 160 118 147 59 297 33 64 -41 -8 120 3 61 -69
2083 -69 -26 21 -97 219 172 21 122 38 -101 -41 111 -110 -29 -249 35 115 271 -97 31 69 9 327 -38
2106 -38 -77 -1 -150 148 -100 87 291 70 -2 124 244 -23 55 190 36 -435 -156 195 -18 -6 143 -29
2128 -29 161 -91 -69 -77 200 192 -61 -10 87 -82 -89 88 16 1 -38 66 -237 202 -99 80 -150 -6 169 -138
2152 -138 -138 -144 11 -36 -18 18 229 -122 218 30 -91 -8 -15 10 115 -4 -117 168 107 -10 -93 -150 158 14 -27
2177 -27 -239 98 125 59 -176 -178 -100 -173 78 103 -91 202 149 34 -9 -15 -59 -260 -188 -68 140 111 -61 7 -59 -126
2203 -126 251 92 -73 33 -101 -153 -30 -157 -68 -133 -262 63 100 197 56 -22 -185 214 -74 73 -193 -56
2225 -56 -85 68 -94 -247 -97 94 175 -66 -110 -2 161 -25 92 -241 -61 -91 -97 -140 -29 59 -47 -10 -140
$$ packed form
2060C56m10L39m43J82k8p3J28j69K37l20L61m2K9q8K38k64L1j05L3J28j17N8j30
2083f9M3M7j18L16m7j51J01q4j39O0J52k21Q1k20K84Q0J56l68J28L8o0L18l65
2106c8l9P6j49K98k48J87K04k21p2J26J20k67P8J35j54m71K79L51k13J2J49j72
2128b9J90k52K2qK77qk53N1R7j69pJ77p2j5l9J04l03M39l01J79k30J44J75l07
2152a38%oJ55m7J8L6K11l51L40j88j21Q3pK5J05j19j13K85o1j17q3n7L08j44m1
2177b7k12L37K7o6k35kP8p3K51K5j94K93n3j15m3om4k01P2J20K08k9j72O8o6o7
2203a26L77j59j65J06j34n2J23j27Q9o5j29L25L7R7j41p8j63L99k88J47k66J37
2225e6k9J53j62j53J50J91Q1k41m4J08J63j86J17l33J80l0om3J11Q8j06L7j30
$$ plain form
2248 -140 51 2 182 4 -187 141 148 25 -100 69 138 -63 -24 -112 -81 -110 -74 -136 112 146 -74 -143 -47 -27 274
2273 274 23 0 -146 -95 -188 -13 -24 -67 -71 216 188 54 121 166 -122 -95 35 -43 -171 -90 111 -87 3 83 88 -39
2299 -39 78 -40 180 -3 135 -94 19 236 46 -191 -93 -160 83 -47 25 4 133 -142 60 54 8 260 5
2322 5 52 -8 28 -132 -139 -21 277 -31 108 3 -135 29 15 42 -114 -57 46 249 -275 -252 27 -25 -158 104
2346 104 -8 -193 91 163 -52 107 7 -74 121 -27 27 4 87 -102 88 132 -91 57 -288 -14 10 -52 146
2369 146 311 244 -57 -61 -93 -87 -89 84 84 -14 244 -104 109 272 -49 -133 415 -70 -49 141 -40 47 -168 194 73
2394 73 -87 31 62 -154 86 111 -77 164 191 23 22 -14 60 79 27 -84 136 -86 -39 59 -235 -25 -39 -93 -125
2419 -125 205 -79 -201 -78 -65 247 -24 -95 -157 59 -404 -94 -87 -95 -89 185 -91 -40 128 56 -87 -141 136 -117
$$ packed form
2248a40J91m9J80j78j91L28Pj23j25J69O9k01L9q8L1k9L6o2K48L4k20o9R6K0L01
2273B74k51k3j46N1r3J75j1m3mK87k8j34O7M5k88K7J30p8j28Q1K01j98R0Q0Nj27
2299c9J17j18K20j83J38k29J13K17j90k37R8o7K43j30P2k1J29k75K02om6K52k55
2322EM7o0L6j60pJ18K98l08J39j05j38J64j4K7j56N7J03K03n24K3K79n2j33K62
2346A04j12j85K84P2k15J59j00q1J95j48N4k3Q3j89J90M4k23J48l45K74K4o2J98
2369A46J65o7l01ml2OkJ73%r8K58l48K13J63l21q4N48m85K1J90j81Q7k15L62j21
2394G3j60J18L1k16K40K5j88K41K7j68jl6P4J9n2j11K20k22M7R8k94K10j4n4l2
2419a25L30k84j22J23J3L12k71p1o2K16m63L10PqOK74k76N1J68p2j43n4K77k53
$$ plain form
2443 -117 -68 118 -2 22 106 -27 28 -75 95 -185 -108 58 152 31 -113 8 10 254 -65 4 -165 114 347
2466 347 103 -236 -193 28 -137 144 -40 233 -80 26 20 -4 72 42 -61 23 6 3 -19 55 268 -33 32 1 -134
2491 -134 -79 -288 -21 -7 -36 -35 17 -73 -48 117 14 -29 -33 166 -106 148 15 51 111 -190 -334 142 96 -198 -119
2516 -119 -56 232 -140 -64 85 -58 21 79 -92 -67 -14 -159 -52 -3 115 -158 -118 241 -164 171 -273 -228 79
2539 79 -40 -96 -29 -60 61 13 257 285 -133 96 33 55 76 -81 28 -187 56 79 -96 194 -15 -64 33 131
2563 131 41 -168 50 -70 -59 -137 -44 344 51 121 182 -105 36 103 28 -20 36 157 298 -8 -49 -4 301 -106
2587 -106 55 -191 76 -73 -115 -32 -167 12 -30 50 -165 217 87 -70 -302 298 -157 -162 -34 -112 -17 -131 -197
2610 -197 -18 203 -100 -3 -38 -171 -51 123 149 -2 132 94 -160 25 -28 75 -109 -39 -163 -165 113 29 123
$$ packed form
2443a17M9J86j20K4Q4j33N5j03J70k80P7J66R4j21j44J21KK44l19O9j69K79K33
2466C47k44l39M3K21j65K81j84K73l13J06ok4P6l0j03Q4j7lk2P4K13l01O5l1j35
2491a34N5k09K67J4k9JN2r0K5J65j03m3mJ99k72K54j33L6O0l01j44M76m6k94P9
2516a19O3K88l72P6J49j43P9N8j71K5N3j45J07M9J18k73M0L59m05L35m44M5L07
2539G9j19n6O7l1J21m8K44K8m18K29o3K2K1j57J09k15K43K3j75K90k09m9R7R8
2563A31r0k09K18j20J1p8R3L88k93P0O1k87J41O7p5m8N6J21J41l06m1M5L05m07
2587a06J61k46K67j49m2Q3j35J79m2Q0k15L82j30j57k32O00m55nJ28p8R5j14o6
2610a97J79K21l03R7l5j33J20J74K6j51J34l8k54J85n3J03j84P0j24kK78q4R4
$$ plain form
2633 123 -20 164 189 134 74 -89 131 -2 38 -51 97 100 213 39 81 95 17 9 96 -10 -91 42 -79 -82 22
2658 22 -120 127 186 -109 -9 17 -121 -120 169 -63 -72 56 106 -80 192 22 66 -107 188 -20 168 207 98
2681 98 96 125 131 38 58 29 -102 58 87 123 -32 -28 201 -138 -2 43 276 17 -198 46 117 -99 51 120 75 57
2707 57 -66 -61 117 2 -41 -13 -107 -157 -18 -19 -68 -11 66 375 -136 -277 -219 -35 187 -309 109 82 25 200 115
2732 115 -63 -79 96 153 289 0 130 -89 -233 -256 -136 55 -35 173 -71 92 58 158 -8 262 46 -68
2754 -68 -33 -126 60 151 15 -57 120 142 161 80 -66 -316 -255 -152 -176 8 -51 103 -85 34 -138 -20 34 -134
2778 -134 -128 142 82 145 -160 137 -30 -278 181 -53 116 223 27 -121 76 -111 -45 99 -13 158 -155 34
2800 34 -69 105 142 -162 37 -112 181 164 100 -65 -1 16 -24 -186 95 -126 47 52 -102 63 -29 112 101 -69
$$ packed form
2633A23j43J84K5n5o0j63K20j33M0q9J48LJ13j74M2J4p8qQ7j06q1J33j21lJ04
2658B2j42K47N9k95J00K6j38JK89k32rJ28N0j86K72j70M4j73K95k08J88L9j09
2681I8kK9Or3K0k9j31J60K9L6j55MK29l39J36M5K33k59k15K44P1k16J50O9m5j8
2707E7j23NJ78j15m3K8r4n0J39jm9N7P7L09n11j41N8J84K22m96M18k7n7J75q5
2732A15j78j6J75N7J36k89J30k19j44k3J20J91r0K08k44J63l4J00j66K70k16j14
2754f8L5r3J86R1j36p2J77K2J9q1j46k50O1J03k4J84n9J54j88J19j72J18N4j68
2778a34OK70o0O3l05K97j67k48M59k34J69J07j96j48J97j87O6J44j12J71l13J89
2800C4j03J74L7l04J99j49K93j7o4j65O4J7m0j62K81k21J73Nj54J65r2J41j1j70
$$ plain form
2824 -69 -113 147 -226 -58 -102 87 211 42 -219 125 -86 117 -20 4 57 3 -10 22 77 108 -53 -127 -19 63
2848 63 36 73 -203 47 234 -120 0 -495 -203 -104 117 -74 1 104 -57 -232 74 -42 20 -200 179 70
2870 70 -34 -129 -32 -96 -112 -46 57 153 92 -184 39 34 76 0 -189 27 -126 -11 32 -14 169 25 -164 14 -91
2895 -91 4 146 -84 38 162 -25 -13 149 -28 220 -5 22 -3 -108 69 186 96 -98 -204 193 -40 -220
2917 -220 58 -13 184 -106 -179 -399 -17 59 -232 -152 72 -98 -25 211 -49 110 -179 -228 -94 61 126 -136
2939 -136 33 -104 -113 212 -104 31 -135 68 5 230 4 -89 -175 59 2 -100 0 -25 -18 -60 71 51 -128 74
2963 74 92 147 59 103 74 -214 217 -164 -62 -52 125 189 39 -64 63 45 80 -13 -53 45 -65 -116 -94 165 194
2988 194 -18 114 -142 79 -54 182 -7 199 -29 7 0 12 6 -190 224 74 -133 -42 107 -37 -20 68 -151
$$ packed form
2824f9m4K60l73J68m4J89J24j69k61L44k11K03j37K4N3n4j3L2N5L1j61p4J08Q2
2848F3k7L7k76K50J87l54J20m95K92R9K21j91P5J03j61j75L06j16O2k20L79j09
2870G0j04r5R7o4j6O6J03R6o1k76K23nM2p6j89K16j53J15M3m6J83j44j89J78j05
2895i1R5J42k30J22J24j87J2J62j77K48k25K7k5j05J77J17r0j94j06L97k33j80
2917b20K78p1J97k90p3k20L82P6k91Q0K24j70P3K36k60J59k89m9J34J55O5k62
2939a36J69j37rL25l16J35j66K03o3K25k26r3q6K34n7j02J00k5Pm2J31k0j79K02
2963G4J8N5q8M4k9k88M31l81J02J0J77O4j50j03J27j8L5r3m0R8j10n1K2K59K9
2988A94k12J32k56K21j33K36j89K06k28L6pJ2oj96M14j50k07R1J49j44J7Q8k19
$$ plain form
3011 -151 28 -81 62 61 46 -12 13 -183 9 140 151 -331 80 -30 -18 111 23 63 -49 99 99 -147 -135 137
3035 137 96 -36 -190 -89 76 -69 -11 -75 106 -177 -189 120 38 -85 -84 -173 -77 72 -18 125 -51 -11 114 -12
3059 -12 -105 -112 104 172 23 -128 -88 93 7 -113 -21 240 0 -7 128 -3 63 -175 -101 71 39 27 -57 63 -37
3084 -37 -9 -61 -54 -13 22 -72 159 -98 27 -204 69 102 -39 136 -16 -14 -235 20 -28 9 36 143 55 126 52 64
3110 64 -152 -103 -17 199 53 -245 166 31 221 2 10 62 -100 -72 -325 74 38 -102 -59 81 134 197 -438 11
3134 11 -46 -77 88 -59 156 171 215 11 289 -244 -97 135 13 -160 -107 81 -96 -4 148 -79 181 -153
3156 -153 -28 -169 160 -70 11 -221 -22 -221 50 -127 -151 30 -74 -44 -136 137 18 -120 -127 35 88 161 218
3179 218 31 -218 -27 -219 236 -99 -89 -125 57 8 -120 -42 128 112 -20 307 -249 -117 -5 -74 -51 35 -46
$$ packed form
3011a51J79j09J43jj5n8K5j96J92J31J1m82M11j10J2J29q8M0j12J48%k46J2K72
3035A37m1j32j54J01J65j45N8o4J81k83j2L09q2j23Jq9R6J49r0J43j76M0J25j26
3059a2r3pK16O8j49j51M0J81q6j20R2K61k40pJ35j31O6k38P4J72l2j2q4J20j00
3084c7K8n2PM1L5r4K31k57J25k31K73L3j41J75j52Kk21K55m8L7K7J07q8P1p4J2
3110F4k16M9Q6K16j46k98M11j35J90k19QN2j62K8k53L99l6j40M3J40N3O3o35M49
3134A1n7l1J65j47K15J5M4k04K78n33J47K32j22j73N3J88j77R2J52k27K60l34
3156a53J25j41L29k30Q1k32J99j99K71j77k4J81j04L0r2K73j19j38pJ62N3P3N7
3179B18j87k49J91j92M55l35J0l6J82m9j28P8J70j6j32L27n56J32J12o9K3Q6q1
$$ plain form
3202 -46 -395 163 138 -44 7 115 278 79 -29 -110 -124 -12 22 31 -147 -200 -50 -38 232 228 113 -35 119 105
3226 105 -44 32 65 131 68 39 67 315 -32 -140 163 39 -131 -184 43 -138 16 15 38 -52 -95 41 22 -61 148
3251 148 107 6 56 58 59 58 54 41 -115 101 -124 -1 64 -6 -96 -27 -27 -32 129 249 21 -144 -48 -76 -56 -19 -96 41
3279 41 -3 69 176 -45 156 -122 -187 48 33 -142 -154 -99 -105 -118 -131 315 -195 -44 -83 123 -68 224 -222 -23
3303 -23 33 -84 9 -154 115 253 -60 87 -31 -227 136 -56 177 0 113 62 42 -52 -234 8 -170 -31
3325 -31 194 -42 44 64 106 90 237 7 -21 -7 78 35 -23 102 153 23 -114 65 -3 131 -172 50 9 70 -101
3350 -101 101 -2 75 209 5 -151 -23 110 56 -68 -208 -73 39 -55 23 -230 103 24 -95 -37 213 -235
3372 -235 -9 74 -40 17 159 -161 206 -24 69 -52 36 19 -137 -165 104 174 -106 107 -89 150 11 -106
$$ packed form
3202d6l49N58k5j82N1J08J63j99j08q1j4J12L4Rj78n3J50J2K70mj15j48J54j4
3226A05j49P6L3O6o3k9K8K48l47j08L03j24j70n3K27j81J54jK3r0m3J36j9q3K09
3251A48m1j01N0KJjmj3j56K16k25J23O5p0r0O9%nJ61J20k28j65R6k8K0L7p7J37
3279D1m4P2J07k21K01k78o5K35j5j75j2N5oj3j3M46n10J51l9K06j91K92m46J99
3303b3N6j17R3j63K69J38l13J47j18j96L63j92K33j77J13n1k0r4j82K42j78J39
3325c1K25k36Q6K0M2j6J47k30k8J4Q5m3n8J25N1j30j37J79o8J34l03K22m1O1j71
3350a01K02j03P7J34k04j56J28J33n4j24j40J35J12r4P8k53L33p9j19N8K50m48
3372b35K26Q3j14N7J42l20L67k30R3j21Q8j7j56k8K69P0k80K13j96K39j39j17
$$ plain form
3394 -106 -227 -34 -106 -289 90 -20 112 135 -279 77 162 157 -13 140 -11 159 218 14 -186 -247 -165 -62 -4
3417 -4 17 119 -76 73 102 -46 44 197 68 -81 -78 1 204 69 134 -34 -151 137 -66 77 137 -38 77
3440 77 18 8 -110 71 -230 116 25 -41 107 168 -7 -18 142 84 -67 -14 29 30 -218 42 -163 -114 26 -100
3464 -100 -32 50 -38 73 -211 -24 88 193 166 -65 148 232 -227 83 -40 -247 -166 -29 -59 -38 0 -8 -43 28
3488 28 96 -51 0 29 137 -75 52 -133 -26 -47 -14 -229 -20 -68 112 65 130 170 192 -75 237 -84 -18 126
3512 126 65 140 -36 -188 7 -142 37 -136 226 -37 61 11 23 -261 236 1 195 -61 -69 73 -222 134
3534 134 -62 -17 -37 165 48 161 54 -54 291 85 -79 213 -8 102 87 413 3 213 213 17 -2 160
3556 160 291 -38 129 -70 38 -81 -22 51 44 154 193 92 -13 -68 84 134 66 -197 -35 -97 131 -56 32
$$ packed form
3394a06j21J93p2j83L79j10J32K3m14L56Q5nj70J53j51J70N9k04k00o1Q2J03N8
3417dK1J02j95J49K9j48R0J53j29j49LP9K03j35O5j68j17K88k03J43O0j75J15
3440G7n9j0j18J81l01L46r1o6J48O1j75j1J60n8j51N3M3Jk48K60k05M9J40j26
3464a00O8Q2q8J11k84J87J12J05k7k31K13Q4m59L10j23k07Q1J37l0K1L8ql5P1
3488B8O8j47N1K9J08k12J27j85J07k1L3k15K09m8J80m7O5M0K2k67L12l21O6J44
3512A26o1P5j76j52J95j49J79j73L62k63R8n0J2k84M97k35J94k56qJ42k95L56
3534A34j96M5k0K02j17J13j07j08L45k06j64K92k21J10j5L26m10K10%j96j9J62
3556A60J31l29J67j99J08j19N9P3pJ10L9j01j05n5J52N0o8k63J62o2K28j87Q8
$$ plain form
3579 32 -112 -99 -163 -28 -172 -190 -92 -260 -238 -152 -156 -97 -165 -106 86 -290 -301 -308 133 -233 -193 -116 -100 -77 31 -49 -16
3606 -16 -22 -108 -71 -130 -21 -108 -6 -268 -167 -242 -10 -21 106 7 319 15 -144 94 137 -94 45 -121 91 118
3630 118 -63 72 -108 155 -85 121 70 227 152 -13 191 98 29 171 274 120 111 160 130 198 -45 -202 109
3653 109 -31 -28 16 23 136 237 -1 69 225 273 297 170 52 216 316 177 163 271 39 26 -32 145 -54 186
3677 186 33 -45 6 193 -31 129 66 -140 -21 54 104 26 16 -68 142 -83 170 100 43 -20 -217 -137 -202 -15
3701 -15 30 -110 -109 -17 112 -118 26 -158 -45 -194 -310 -237 -191 -110 88 16 -35 -281 122 -346 38 22 -104 122
3725 122 -213 -241 -24 30 -275 83 -87 96 -118 -63 77 26 -191 -310 -45 -112 59 -290 -85 102 168 292
3747 292 212 0 13 -177 -89 -320 -60 -139 -51 -23 77 40 -42 336 -6 88 -120 139 66 71 -21 160 -54 -8 324
$$ packed form
3579C2j44J3o4J35j44j8R8j68K2Q6mN9o8N9J92l76j1pM41l66M0P7J6K3J08q0L3
3606a6oq6L7n9J09q7J02k62J01p5K32j1J27r9L12l04j59K38M3k31J39j66K12K7
3630A18j81J35j80K63k40K06n1J57p5j65K04r3o9J42J03j54rM9l0O8k43j57L11
3653A09j40LM4PJ13J01k38P0J56M8K4j27j18J64J00j39j4J08k32j3n8J77j99K40
3677A86j53p8N1J87k24J60o3k06J19P5N0p8j0q4K10k25K53p0n7o3j97Q0o5J87
3701a5M5j40JR2J29k30J44j84J13j49j16P3M6Q1J98p2n1k46M03m68L84j6j26K26
3725A22l35k8K17N4l05L58j70J83k14N5J40n1k17j19K65o7J71l49K05J87O6J24
3747B92q0k12J3j90Q8k31K60p9Q8K8J00l7q2L78l42R4k08K59p3Nr2J81k14M6L32
$$ plain form
3772 324 160 70 123 275 147 182 261 137 37 142 23 100 147 92 123 -11 83 146 -92 115 22 -40 100 -144
3796 -144 178 181 83 -87 52 0 18 -49 138 167 74 -2 -22 -52 -199 -10 -6 -188 16 162 -88 -194 -28 32 -110
3821 -110 -80 -286 -123 115 67 -81 -4 62 -80 -100 -112 -91 136 -117 -322 11 -111 180 196 -70 222 -39 -3
3844 -3 -4 63 -316 31 200 -15 21 125 -47 -166 -258 160 -12 55 44 31 101 -54 -124 -67 175 184 252 90 239
3869 239 -149 121 -231 217 96 -24 132 116 -76 47 99 -72 -51 19 -67 345 33 11 -170 100 37 54 382
3892 382 117 156 107 -8 -56 82 -24 11 375 12 -354 -57 8 111 36 -45 23 156 127 -173 99 -109 -107 125
3916 125 43 85 124 -56 -166 -36 148 -6 230 88 -100 -120 114 17 59 -95 -20 152 33 4 -143 85 73
3939 73 -100 -68 -154 56 27 143 -55 -195 56 13 115 30 -119 9 51 -192 -167 51 11 -147 -62 39 -191
$$ packed form
3772C24j64r0N3J52j28L5P9j24j00J05j19P7M7n5L1j34R4O3k38K07r3o2J40k44
3796a44L22Lr8j70J39n2J8o7J87K9r3p6k0l0j47J89Mj82K04J46k50j06J66O0j42
3821a10L0k06J63K38m8j48P7O6j42k0j2K1K27k53k05L33j22K91J6k66K92k61L6
3844cjO7l79L47J69k15L6J04j72j19r2M18j72O7j1j3P0j55p0N7K42RO8j62J49
3869B39l88K70l52M48j21j20J56j6j92J23N2j71K1P0q6M12l12k2j81K70o3J7L28
3892C82k65L9m9j15m8J38j06L5L64l63l66K97O5J03p5q1O8J33k9l00K72k08KK32
3916A25q2M2L9j80j10J30J84j54K36j42j88k0K34r7M2j54P5J72j19k9j47K28j2
3939G3j73L2q6K10k9J16j98j40K51m3J02q5j49J28M2k43K5K18m0j58Q5J01k30
$$ plain form
3962 -191 -6 91 -388 -219 -115 77 -162 161 -226 79 145 -23 8 -16 87 47 3 -102 -59 -97 -83 214 -182
3985 -182 237 17 94 -39 33 73 -164 160 -24 -8 102 166 35 -228 67 21 34 -97 232 -151 156 50
4007 50 -40 -11 -175 26 -118 377 -49 12 198 -150 -33 137 48 212 86 184 131 62 -261 14 -68 56 23
4030 23 -47 84 79 35 -31 -110 -64 30 8 211 145 -142 110 181 -41 -190 -97 94 -22 -113 58 -127 -256 89 156
4055 156 55 39 25 86 -10 154 -78 147 -20 73 63 266 0 -133 90 75 36 -194 100 63 -149 139 43
4078 43 170 -33 -46 -156 -13 -29 -73 -179 -84 -4 79 -18 -102 -9 20 -152 -5 -135 -168 -25 248 -67 58 66 104
4103 104 -109 24 -1 -214 104 -83 47 152 163 68 -193 180 83 -102 203 -106 20 31 -68 -147 243 -239
4125 -239 109 163 103 85 -60 309 96 -193 129 -70 -8 30 86 53 287 -38 -43 -62 -57 -65 251 104 84 79 63 -150
$$ packed form
3962a91J85R7m79J69J04J92k39L23l87L05O6j68L1k4J03m0m4j05M3l8J4K97l96
3985a82M19k20P7j33P2M0k37L24j84J6J10O4j31k63K95m6J3j31L29l83L07j06
4007E0r0K9j64K01j44M95m26O1J86l48J17J70q9J64j26R8n3o9l23K75q2J24l3
4030B3p0J31nm4o6p9M6R4k2K03o6k87K52P1k22j49R3J91j16r1J71j85j29L45O7
4055A56j01j6j4O1r6J64k32K25j67R3j0K03k66j33K23j5l9k30K94l7k12K88r6
4078D3J27k03j3j10J43j6m4j06R5Q0Q3r7q4R3K9j72J47j30l3J43K73l15J25QL8
4103A04k13J33k5k13L18j87J30J05J1r5k61L73r7j85L05l09J26J1r9p9L90m82
4125b39L48N4o0j8j45L69k13k89L22j99O2L8N6l3K34l25nj9NqL16j47k0nj6k13
$$ plain form
4151 -150 -84 98 25 124 -142 29 118 -110 14 114 48 -3 148 -57 -95 120 -97 60 -140 119 109 88 -174
4174 -174 -265 -4 -176 -98 32 -214 71 -215 -5 -54 71 249 -187 118 14 -143 -90 17 4 -146 -144 44
4196 44 120 230 -108 234 -6 83 14 -27 -215 -65 39 2 -97 251 -11 -78 -20 34 115 -382 19 120 -116 -13
4220 -13 81 -115 3 62 59 42 31 -118 43 2 52 50 -131 -56 -84 -139 134 73 -56 1 44 228 63 -100 -5 98
4246 98 -58 122 137 38 13 -141 168 -21 115 143 -98 148 95 -92 -24 -100 -3 110 2 -132 -189 92 35 -115
4270 -115 40 218 -154 18 -1 155 -70 -93 173 -155 21 -45 161 40 -85 -51 12 -97 -128 56 -123 -169
4292 -169 107 -95 206 26 -162 -35 -122 100 -226 102 -200 -135 54 -214 6 52 -79 158 -36 6 97 127
4314 127 -8 207 -126 -57 -62 -135 135 -57 -23 100 75 173 -185 154 -7 -128 -54 -30 -58 140 -55 -20 -30 46
$$ packed form
4151a50O6J82p3R9k66J71Q9k28J24J00o6n1J51k05l8K15k17J57k00K59j0k1k62
4174a74r1K61j72P8J30k46K85k86K10m9J25J78m36L05j04j57N3J07j3j50KJ88
4196D4P6J10l38L42k40Q9o9m1j88J50J04l7r9L48k62o7N8N4Q1m97M01J01k36J03
4220a3R4j96J18N9lj7j1j49J61m1N0kj81P5k8n5K73o1j29N7M3J84j65j63R5J03
4246I8j56J80J5r9k5j54L09j89J36K8k41K46n3j87O8p6R7J13j08j34n7K81n7j50
4270a15J55J78l72J72j9J56k25k3K66l28J76o6K06j21j25L4O3j09l1J84j79m6
4292a69K76k02L01j80j88J27q7K22l26L28l02O5J89k68K20M6j31K37j94M2R1L0
4314A27j35K15l33O9np3K70j92L4J23k5R8l58L39j61j21P4K4k8J98j95L5j0P6
$$ plain form
4338 46 -183 75 -57 -25 142 130 -45 16 -57 -78 -13 103 181 -69 26 -51 60 -87 107 212 90 83 21 24 216
4363 216 -11 -73 58 168 106 -10 -155 227 181 141 -15 155 35 -31 54 -250 -7 158 166 39 -88 -150 284
4386 284 -167 -161 160 287 33 -74 -134 -43 -135 -47 -80 -133 -91 -45 139 -95 -60 90 50 298 -187 -166 164 -217
4410 -217 -47 -38 169 -288 -88 46 -59 -172 -177 -52 13 -10 140 -55 -71 77 -46 43 86 95 1 28 -133 -184 -173
4435 -173 -160 -33 21 -33 -99 -255 -17 -134 -125 50 5 -154 193 -17 -75 67 69 -182 -29 266 42 29 44 9
4459 9 96 -76 -188 -34 -30 89 -101 -48 -30 56 -79 -9 -25 -51 119 54 173 -131 -182 -105 -95 27 114 35 148 -75
4485 -75 -126 2 35 -159 -151 -296 -95 70 243 103 -30 100 99 -57 4 4 -136 -85 -25 16 -151 -40 -256 -116
4509 -116 -15 3 67 9 -35 73 16 -266 -55 61 88 -153 155 14 -35 210 64 121 -96 108 -134 -66 -25
$$ packed form
4338D6k29K58j32L2J67j2j75O1p3k1O5J16P8k50R5p7J11j47J94J05j22po2LJ92
4363B16k27o2J31J10o2j16j45L82m6m0j56J70j20o6Q5l04K43J65Qj27j27o2M34
4386B84m51OL21J27k54j07o0R1r2Q8l3n3M2M6J84k34L5J50m0K48m85K1L30l81
4410b17J70RK07m57K00J34j05j13nJ25O5k3J50j95j6J48j23Q9M3Rr4K7j61n1J1
4435a73J3J27N4n4o6j56K38j17RJ75m5j59L47k10n8J42Kk51J53K95k24j3J5l5
4459IQ7j72j12J54MJ19j90N3J8Q6j35P0j6k6J70o5J19l04n1P7J0J22Q7p9J13k23
4485g5n1J28L3j94Qj45K01J65J73j40j33J30jj56O1%j40N1O0M1j67J11k16J40
4509a16J01J8O4n8m4J08n7k82K11J16K7k41L08j41m9K45j46N7k17K04k42O8M1
$$ plain form
4532 -25 -92 133 -134 159 115 35 83 187 -193 -14 295 -28 -4 -50 119 74 -256 112 -81 100 -47 271 -114
4555 -114 65 209 -57 169 -93 201 -121 104 -39 5 -46 200 63 52 -134 11 28 16 -82 259 -44 -9
4577 -9 13 9 -1 -73 -69 30 53 -179 -32 28 -111 -128 135 254 139 -167 -181 -176 -68 -37 -48 89 4 22 -113 -90 -100
4604 -100 156 -41 -126 -117 -15 -44 -62 5 138 -53 -64 54 93 -54 151 -153 -37 -116 -9 124 -245 96 -83
4627 -83 50 -221 -34 -39 125 -87 -163 -30 89 156 -48 290 -46 -28 -53 -73 -182 -31 -3 -45 1 68 100 109 -70
4652 -70 218 -164 150 -77 178 -118 98 128 -42 19 -14 -14 -118 57 183 72 -65 -128 95 -15 51 -217 141
4675 141 186 -233 150 44 -34 -49 -138 -155 84 -145 119 15 -14 -71 -61 -12 33 317 -115 -254 -210 80 81 41 -2
4700 -2 -2 3 -180 -51 -89 101 135 -78 -139 -111 -74 -82 -83 122 164 -11 51 1 40 -112 6 16 -132 72 -57 -57 28 223
$$ packed form
4532b5o7K25k67K93m4q0M8J04l80J79L09l23K4m6J69m5l30L68j93J81j47L18l85
4555a14J79J44k66K26k62K94l22K25j43M4n1K46j37j1j86J45J7j2r8L41l03L5
4577iK2mj0p2MR9K3k32J47O0j39j7K63J19j15l06j4NJ08L1j1J37q5J8j35K3j0
4604a00K56j97q5RJ02k9j8O7J33j91j1J18L9j47K05l04J16p9J07J33l69L41j79
4627h3J33k71J87nJ64k12p6J33J19O7k04L38l36J8k5k0j09J51K8m2M6O7L2Rj79
4652g0K88l82L14k27K55k96K16L0j70O1l3%j04J75J26j11j37o3K23j10O6k68L58
4675A41M5m19L83j06p8j5q9j7K39k29K64j04k9n7J0M9M5K84m32j39M4K90Jm0m3
4700b%Nj83J29l8J90L4k13o1K8L7qjK05M2j75O2n0L9j52J18J0j48K04j29%Q5J95
$$ plain form
4728 223 265 -309 308 -41 -95 -43 188 -83 33 -9 98 -16 21 57 -76 144 96 257 -51 56 -3 -177 -84
4751 -84 19 170 -102 13 157 20 -20 -38 -104 4 134 215 11 -52 2 -205 -124 212 -174 131 30 -283 236
4774 236 93 -85 -53 -86 60 3 -47 -9 -141 164 235 119 -164 -123 6 19 -90 10 -213 -126 -137 157 226 9
4798 9 185 57 -231 -38 11 -22 -209 85 -309 -107 188 1 15 -135 -44 34 210 21 -43 42 8 79 206 166
4822 166 -129 202 -4 -48 -166 8 232 60 -118 144 -162 -109 -25 -16 -87 19 217 -143 -154 40 3 -110 171
4845 171 -13 135 55 -25 -43 64 -77 106 -153 36 83 63 91 290 -43 9 101 43 97 -206 247 -120 -138 71
4869 71 -249 38 45 -194 -41 -155 -259 44 30 -208 386 40 -42 22 86 -203 -68 -125 77 59 66 147 182 -18
4893 -18 -133 -10 162 51 87 32 42 24 142 98 -108 -10 -12 -129 -171 -46 256 75 -4 -157 -113 -91 -125 -59 -12
$$ packed form
4728B23M2n74O17l49n4N2K31k71J16m2J07j14L7L6j33K20m8J61l08J07n9j74R3
4751h4J03J51k72J15J44j37m0j8o6J08J30Q1k04o3N4k07Q1L36l86L05j01l13N19
4774B36j43j78L2l3J46n7n0L8j32L05P1j16k83M1J29J3j09J00k23Q7j1K94O9k17
4798IJ76j28k88J93M9l3j87K94l94K02K95j87J4j50R1P8J76j89o4Q5l4P1J27m0
4822A66k95L31k06m4j18J74K24j72j78K62l06N3Q4Rp1J06J98l60j1J94l7j13K81
4845A71j84J48q0q0j8J07j41J83k59J89M7k0K8J99l33N2R2n8N4l03M53l67j8K09
4869G1l20K87Pk39J53j14j04L03j4k38N94l46q2O4O4k89J35n7K02j8PQ1L5k00
4893a8j15J23J72j11L6n5J0j8J18m4k06R8kj17m2J25L02j81p9j53M4K2l4O6M7
$$ plain form
4918 -12 -53 -25 146 92 186 0 -45 79 -12 79 -3 49 -42 7 -297 57 -47 229 78 0 13 101 17 67 68 -1 -263
4945 -263 -4 -14 -177 5 14 48 125 -28 -46 227 71 125 140 -11 274 110 16 62 53 -42 24 21 245 -266 -8
4970 -8 188 -143 -228 66 98 211 -216 80 153 40 183 0 -147 -87 -97 -57 36 -36 4 -184 211 -84 8 -46
4994 -46 -58 -274 -93 -23 -59 70 172 -24 -57 100 -80 150 201 72 29 114 -134 137 15 78 123 -170 96
5017 96 -53 180 80 6 -90 -49 138 183 209 -7 -67 -208 23 -107 -12 64 -186 -48 234 -123 -75 96 87 -67
5041 -67 -61 80 16 149 211 -135 134 105 0 -92 -248 -216 72 80 -177 37 31 -161 -141 -334 -93 -56 -78 -182 -44
5066 -44 13 -32 -74 -30 27 46 18 -168 82 63 -130 214 125 -122 236 -102 -4 -3 59 49 -143 144 95 -36 251
5091 251 1 -62 40 115 -132 -71 253 -107 -170 -302 -89 -92 58 80 -24 90 113 89 41 -62 -55 102 -203 131
$$ packed form
4918a2m1K8J71n4R4j86m5J24r1R1q2N2r1M9l04L54j04K76j51p8J3Q8q4N0Jo9k62
4945b63K59j0j63J82RL4P7j53j8K73j56N4J5j51K85j64r4M6rr5O6lK24n11K58
4970hJ96l31q5K94L2J13m27K96P3j13J43j83j47O0j0M0R3p2M0j88L95k95R2n4
4994d6j2k16J81P0l6J29J02j96l3J57j80K30N1j29m3Q5k48K71j22O3M5k93K66
5017I6j49K33j00p4r6M1J87M5K6k16o0j41K31j30R5P6k50J38K82l57M8J71rj54
5041f7OJ41o4J33O2l46K69k9j05r2j56L2K88Qk57K14oj92K0j93K41L7k2j04J38
5066d4N7m5m2M4N7J9k8j86K50j9j93L44q9k47L58l38R8JO2j0j92K87m9j31K87
5091B51k50o3J02P5k47O1L24l60o3j32K13lJ50K2j04J14K3k4m8j03PJ57l05L34
$$ plain form
5115 131 161 -12 -140 210 -86 -98 23 31 -91 2 257 -13 12 17 105 0 -101 153 35 27 58 -11 -105 -132 208
5140 208 31 162 54 -87 -85 125 -51 49 -187 73 21 65 -152 133 -76 34 33 173 124 -10 -146 70
5162 70 -39 48 59 -152 27 8 259 -99 -26 240 -26 19 -50 158 -135 -150 55 -68 34 -66 -17 -28 -24 -98
5186 -98 31 218 24 -78 -115 -159 -62 101 85 -87 241 295 -215 -21 18 126 -54 281 278 86 -305 130 -107
5209 -107 -93 -58 11 59 -60 11 196 40 106 39 34 212 -42 -75 -67 104 -14 -159 129 -225 -2 40 -9 88 172
5234 172 234 108 -56 -36 -35 138 -100 -192 65 -131 125 193 -40 263 139 -31 -178 40 -27 118 100 141 17
5257 17 -270 -24 2 -83 19 76 80 104 124 -44 147 90 4 151 -38 -58 24 216 -62 25 21 21 89 -14 36 -143
5283 -143 128 -67 -71 -329 35 157 -144 51 -174 84 204 -238 18 -54 -127 8 -27 -63 -27 -203 -175 198 -234
$$ packed form
5115A31L0j73j28L50k96j2J21Qj22R3K55k70K5NQ8j05j01K54j18qL1o9r4k7L40
5140B08j77J31j08j41KK10j76J00k36K60n2M4k17K85k09J10jJ40m9j34j36K16
5162G0j09Q7J1k11J79j9K51l58P3K66k66M5o9K08k93j5K05j23J02j00M9j1Mp4
5186i8J29J87j94j02l7m4R7J63j6j72L28N4n10J94L9J08j80L35lj92l91M35k37
5209a07J4L5O9M8j19P1J85j56O6o7nJ78k54l3QJ71j18j45K88l54K23M2m9R7Q4
5234A72O2j26j64K0JJ73k38r2K57j96K56O8k33L03j24j70j47K18o7J45j8M1j24
5257A7k87K46K6q5J02N7MK4K0j68J91n7q6J47j89k0Q2J92k78Q7m%O8j03N0j79
5283a43K71j95mk58L64J22l01J95k25K58J20m42K56p2p3J35l5l6L6j76K8L73m32
$$ plain form
5306 -234 210 202 -46 -118 -19 -271 186 226 -61 -44 -50 114 88 261 151 -102 -15 65 7 142 8 -312 -252 17
5330 17 108 -130 -50 57 -27 214 79 -76 -136 -28 -136 24 -84 -75 -55 36 -105 77 -39 88 -231 -31 -6
5353 -6 18 -44 134 -87 105 -198 -38 75 -18 185 31 -54 -114 -101 24 33 -3 37 -270 -139 202 194 128 198 -51
5378 -51 105 72 -15 155 0 -121 113 104 26 38 -173 -8 -15 -241 -280 193 -239 -151 64 -60 1 -162 -55 -185
5402 -185 -71 9 43 -154 -8 114 103 -11 -21 50 218 -84 -69 57 285 -140 -5 -125 25 177 -70 -78 -82
5425 -82 20 25 177 -140 -96 61 -75 -101 -33 -108 -43 -115 145 -209 -45 110 -22 -57 49 151 -198 131 -20
5448 -20 -70 75 -64 136 -89 6 -148 -102 33 -89 8 7 74 111 -18 137 79 143 -37 -81 -44 -9 34 -137 176
5473 176 102 -170 0 -107 -47 -238 19 167 82 -208 -246 31 -58 -112 288 253 -44 -99 1 15 -202 -5 -106
$$ packed form
5306b34M44qk48p2R9k52M57M0k87J7oJ64k6J73j10k53Q7Q0n8J35j34l20O0K69
5330A7R1k38Q0J07q4K41j35j55o0J08j08J60j08RK0R1j41J82j16J27l19K00K5
5353fK4o2J78k21J92l03J60J13r3K03j54q5o0J3J25Rl6M0l07J31L41qo6P0k49
5378e1J56l3q7J70j55j21K34rp8J2k11J65pk26l9M73m32Q8K15j24O1j63J07j30
5402a85J14Q0L4j97J46J22j1j14j0P1J68l02J5J26K28m25J35j20J50J52k47qm
5425h2J02NJ52l17M4J57j36k6O8p5O5p2K60l54J64J55j32l5J06J02l49L29j51
5448b0n0J45j39K00k25R5j54M6J35j22R7jO7L7j29J55n8O4j80m4L7L5M3j71L13
5473A76p4k72J70j07O0j91K57J48q5k90l8K77q9n4M00l5k97n5J00J4k17J97j01
$$ plain form
5496 -106 -221 -52 -76 -50 -139 28 223 -161 -8 -173 293 8 112 230 118 -54 170 -202 11 -122 -142
5517 -142 137 -27 58 188 -167 138 -105 -210 -44 24 133 -65 -50 -182 209 -33 52 -140 9 -149 -141 187
5539 187 -96 27 80 -199 -5 108 16 -77 236 135 -190 25 99 38 109 -13 -90 35 45 -151 -18 -237 -38
5562 -38 1 -118 110 25 14 161 -12 63 163 7 -114 102 -36 101 155 44 196 93 120 -80 212 -183
5584 -183 343 89 49 -59 88 -124 79 98 -101 -3 -5 67 -293 221 38 50 63 -164 -81 -77 69 151 77 -44
5608 -44 36 -125 -100 -176 -99 -137 128 -213 -137 62 -103 -206 114 10 37 -231 -76 -200 -94 11 62 -29 -54 -31
5632 -31 -79 210 -60 -20 -7 -60 59 284 -24 -64 47 231 97 61 -154 109 53 -63 -137 -70 158 15 101 27
5656 27 -62 -138 -111 19 -23 -490 260 -158 -212 110 -92 -32 59 -78 102 -30 69 -200 64 -138 -4 81 -199
$$ packed form
5496a06j15J69k4K6q9J67J95l84J53j65M66k85J04J18j12j72K24l72K13j33k0
5517a42K79j64Q5J30l55L05k43j05J66O8J09j98J5j32L91k42Q5j92J49j58QL28
5539A87k83J23N3k79J94J13r2r3L13j01l25K15P4o1P1j22p7J25J0j96J33k19J99
5562c8L9j19K28q5j1J47j73P5J00j56j21K16j38J37N4j11J52j03K7k00K92l95
5584a83N26k54m0j08J47k12K03J9j99R8kP2l60N14j83J2J3k27Q3MJ46Q2p4j21
5608d4Q0j61K5p6P7l8K65l41P6J99j65j03L20j04K7k68J55j24J06J05N1r1k5K3
5632c1m8K89k70M0J3n3J19K25l08m0J11J84j34l6k15K63n6j16p4O7K28j43Q6p4
5656B7q9p6K7J30m2m67P50m18n4L22k02O0R1j37J80j32R9k69K64k02J34Q5k80
$$ plain form
5679 -199 -131 -56 143 238 -76 -89 80 69 -20 -174 -178 163 20 -5 -53 -23 69 -31 321 -136 70 199 110 301
5703 301 320 122 119 -206 -113 -182 26 61 55 -16 11 44 153 0 140 -198 -17 63 117 179 -126 67 151 -87 69
5728 69 176 95 -28 15 174 126 141 -259 248 -114 205 35 178 -99 74 -58 124 -100 -146 -21 -55 94
5750 94 237 -167 52 177 -221 10 54 -6 -79 118 9 -79 -79 -196 -174 -118 64 -74 -142 -37 -50 139 -109 -132
5774 -132 -39 -189 112 11 33 -7 19 -53 113 167 -154 -11 -14 306 99 63 44 -273 86 205 -198 7 -67 -160
5798 -160 10 192 75 -175 -1 -126 -98 -144 162 -112 149 -30 40 -24 -267 -32 -200 107 -209 179 -54
5819 -54 -114 -46 147 -174 -181 -176 261 -50 -14 230 60 1 301 -71 -34 -134 -178 161 -41 -193 -10 -90 78 23
5843 23 -119 107 -31 -47 -82 187 -102 142 61 -98 170 -54 -135 77 -53 36 15 22 -7 71 82 -175 13 176
$$ packed form
5679a99O8P5J99R5l14j3J69j1q9j54mL41j43k5m8L0R2j00L52m57K06J29q9J91
5703C01J9j98ll25R3o9K08L5op1K7L3J09j53J40l38J81Q0N4O2l05J93Q4k38J56
5728F9J07q1j23M3J59m8J5m00N07l62L19j70J43k77J73j32J82k24m6J25l4J49
5750I4J43m04K19J25l98K31M4o0p3J97j09q8%j17K2N6J82j38o8J05j3J89k48k3
5774a32R3j50L01j01K2m0K6p2J66N4l21J43lL20k07l6j9l17L59J19m03K05p4r3
5798a60J70J82j17k50J74j25K8m6L06k74K61j79P0o4k43K35j68L07l16L88k33
5819e4o0O8J93l21pNM37l11L6K44j70n9L00l72L7j00m4L39k02j52J83q0J68n5
5843B3j42K26j38j6l5K69k89K44q1j59K68k24q1K12j30Q9k1Pk9P8J1k57J88J63
$$ plain form
5867 176 51 -28 -68 30 54 -146 -260 192 77 213 5 -73 43 -264 78 -95 -110 30 -11 159 -200 163
5889 163 -21 -94 56 99 2 -18 107 49 -43 -61 -145 -55 93 33 -23 -63 271 -99 151 298 -65 15 -165 -32
5913 -32 87 178 151 132 48 -31 45 -27 -26 13 31 37 -105 60 175 46 70 -141 -67 46 13 49 37 130 115 136 115 78
5941 78 -222 133 83 -23 92 -93 -214 161 -71 -194 -161 25 -219 22 -107 93 80 -16 -131 255 -203 -28
5963 -28 -119 -76 -38 161 0 123 147 -17 -238 -214 249 -5 -36 -69 279 1 13 -129 -44 -205 69 239 67
5986 67 -45 -139 20 -220 -68 -89 231 -91 -155 -85 114 221 46 -75 129 156 163 9 -46 -123 172 126 -47 -122
6010 -122 -120 258 129 50 -48 257 -23 -61 94 -61 226 12 79 125 -27 -65 -7 -240 68 47 -111 23 205
6033 205 49 39 -139 -69 -136 105 147 -30 -185 -119 -149 -61 -26 -41 -182 199 38 80 166 -103 331 24 51 141
$$ packed form
5867A76j25p9m0R8K4k00j14M52j15J36k08p8J16l07L42j73j5J40m1J70l59L63
5889A63j84p3J50M3r7k0J25n8r2j8q4R0J48o0n6m0L34l70K50J47l63Q0j80J33
5913c2J19R1k7j9q4p9P6p2JL9J8Oj42J65J15j29K4k11P4J13l3L6j2R3j5K1k1l7
5941G8l00L55n0j06J15j85j21L75k32j23L3J86k44K41j29K00j3r6j15L86m58J75
5963b8r1M3L8J99j61J23K4j64k21K4M63k54l1l3L48k78J2j42Q5j61K74J70j72
5986F7j12r4J59k40J52k1L20l22o4P0J99J07j75j21K04K7Pj54n5p7K95m6j73p5
6010a22KL78j29p9r8L05k80l8J55j55K87k14O7M6j52l8N8k33L08k1j58J34J82
6033B05j56j0j78P0o7K41M2j77j55O6l0Q8L5j5j41L81j61M2Q6k69M34l07K7R0
$$ plain form
6057 141 -89 -15 108 -99 66 141 -5 318 -108 137 168 68 -243 -139 30 -219 -4 -105 197 294 210 -1
6079 -1 183 162 -162 64 47 16 -40 -100 92 21 26 -28 -132 -114 -132 -346 -213 -112 131 -18 -118 18 102 117 129
6104 129 88 69 21 31 -116 -99 2 -67 65 -94 -173 119 134 -47 -265 4 0 22 17 113 -12 116 139 -57 -113
6129 -113 70 -108 -20 121 184 184 -15 38 0 86 -182 39 -10 136 -127 105 -177 106 -114 8 -91 58 -202
6152 -202 -67 -139 -131 -6 -122 -26 124 43 -9 29 19 -33 -115 -8 -227 87 15 85 4 52 -55 -85 10 1 208 -180
6178 -180 -254 236 80 -67 83 -43 -60 -53 14 -84 -94 135 -108 -182 -34 159 37 -23 -14 126 10 39 60 -57
6202 -57 89 -108 -140 -69 23 43 54 -64 172 15 176 -41 22 -116 32 42 -3 114 142 -21 189 118 -104 118
6226 118 -295 27 -208 -14 -175 -23 119 -88 37 -149 -173 23 -14 -240 -51 110 116 95 4 162 64 -188
$$ packed form
6057A41k30P4J23k07J65P5j46L23m26K45L1j00l11J04J69k49K15j01L02R7q4k11
6079aJ84k1l24K26j7l1n6o0J92p1Nn4j04J8j8k14J33J01K43j49j00J36Q4J5J2
6104A29m1j9m8J0j47J7J01o9J32j59p9K92J5j81k18K69mK2nR6j25J28K3j96n6
6129a13J83j78Q8J41O3%j99N3l8Q6k68K21m9J46k63K32k82K83k20J22r9J49k60
6152b02J35p2QJ25j16R6J50q1n2L8j0n2q2J07k19L14p2P0q1M8j07l0R5rK07l88
6178a80p4M90j56j47J50j26j7PO7r8j0K29k43p4J48J93j22o0RJ40j16K9K1j17
6202e7J46j97l2P1R2K0J1j18K36j57J61k17O3j38J48J0m5J17K8j63K10p1k22K22
6226A18m13L22k35J94j61J52J42k07J25j86k4J96l7k26J89J61Ok1r1J58r8k52
$$ plain form
6248 -188 105 121 156 42 14 -164 -6 32 55 183 195 -20 163 81 -114 -72 -204 253 78 -182 -86 -76 179
6271 179 -219 -228 -119 77 183 -100 18 19 -59 -83 -139 55 -56 74 90 132 -51 17 -151 121 -25 20 96 -66
6295 -66 -29 -50 12 -103 -279 28 213 -135 -173 23 -49 250 41 -48 66 114 -374 225 -94 -9 209 -19 0
6318 0 -127 -70 -375 206 161 -59 -3 12 -69 -50 68 7 -295 -43 12 19 297 96 50 -181 11 -118 -100 323 -29
6343 -29 -33 -132 4 130 -133 61 -165 164 53 -102 31 -146 -65 -51 -82 143 -197 44 -107 11 -157 -136 80
6366 80 173 95 -364 54 -78 -68 -65 9 84 -71 74 19 181 193 79 18 -171 -38 -120 -85 -8 186 115 24 -23 244
6392 244 -200 -95 -92 88 -85 -30 28 -229 -38 -16 76 -68 -1 3 -153 191 -65 -40 15 -268 -89 -82 24 150
6416 150 155 -170 -29 112 156 200 71 25 -53 -180 -43 53 -122 -46 77 89 -105 -195 40 93 172 80 162 17 -3
$$ packed form
6248a88K93J6L5j14k8j78J58L8K3J28J2k15J83q2j95M2j32M57j75k60R6J0K55
6271A79l98rJ09J96J06k83J18Jp8k4n6J94j11J30J6M2j83O8j68K72j46M5P6j62
6295f6L7k1O2j15j76L07J85l48l8J96p2K99k09q9J14M8m88N99l19Q5K18k28J9
6318@j27N7l05N81m5k20N6J5q1J9J18o1l02K52N5PK78k01m6k31J92j29J8M23l52
6343b9mr9J36J26k63J94k26L29j11j55J33j77Q1J4l1K25l40K41j51J18j68K1K16
6366H0R3p8m59M18j32J0LP4P5j55J45n5J62J2j14o1j89J33q2L5P7J94p1r1m7K67
6392B44m44J05LJ80j73N5N8k57J91K2R2j44O7Mj56L44k56K5N5k83J79PJ06J26
6416A50Nl25J41J41M4M4j29m6p8j27J37R6j75P6J23J2j94r0K35N3P9r2Q2j45k0
$$ plain form
6441 -3 -57 59 130 -134 127 113 80 -47 112 110 187 -85 -132 241 -110 -69 -124 -144 90 -111 74 21 -45 24 18 61
6467 61 -226 -50 24 77 -28 76 90 -157 185 -290 -45 112 -60 45 4 -77 -75 107 -104 -73 70 -137 38
6490 38 -50 -76 154 11 -19 9 105 73 -138 116 -57 -154 31 -59 -171 -65 -3 81 64 42 215 140 78 142 -9
6515 -9 -5 204 5 124 4 128 57 151 163 -30 -58 -37 -7 167 -90 -49 -17 6 287 68 90 111 -90 -325 162
6540 162 167 388 -183 -20 27 263 150 148 29 16 -99 -12 20 57 161 -13 103 -84 -22 -76 104 -104 -16 75
6564 75 -86 136 -43 -349 23 -268 -28 -214 96 321 98 -80 138 -10 8 11 -20 -68 -48 232 -63 -23 20
6587 20 -18 26 92 -171 -18 -36 -95 47 -32 25 140 144 61 163 156 123 -33 37 -114 207 -6 135 -2 121 155
6612 155 -9 33 -25 -22 -24 -118 -9 -60 43 82 -39 -60 -140 -297 -23 63 -5 221 127 40 93 -299 -13 65 -54 9
$$ packed form
6441cn4J16P1k64K61j4l3j27J59kP7k72m7L73l51M1n5k0K34k01J85n3o6O9oM3
6467F1k87J76P4N3j05J04J4k47L42m75K45J57j72J05m1q1KJ82k11L1J43k07J75
6490C8q8k6K30j43l0K8R6l2k11K54j73r7J85r0j12J06O2Q4j7k2J73p5o2O4j51
6515iMK09j99J19j20J24p1R4J2j93k8K1L0J74k57M1L2K3K81k19K2K1k01k35M87
6540A62NK21n71J63M7K36j13kj19j3j15Q7L2L7J04j74J16j87O2n4J80k08Q8R1
6564G5j61K22j79l06L72k91K40j86L10K25k23j78K18j48J8Ll1m8K0K80k95M0M3
6587B0l8M4O6k63J53j8n9J42p9N7J15Mq3J02pl3j56P0j51L21k13J41j37J23L4
6612A55j64M2n8Lkr4J09n1J03L9j21k1q0j57K74Q6o8K26r4q7N3l92K86P8j19O3
$$ plain form
6638 9 97 200 184 120 -47 123 -50 -75 134 69 86 -8 -1 359 22 -88 77 -161 61 -67 191 144 333 -58
6662 -58 46 -67 35 -58 8 -86 105 77 -174 -10 -135 161 -153 36 70 -7 7 5 58 121 96 -34 -38 84 145
6687 145 -58 57 2 -115 -243 61 52 134 189 -172 -61 -208 -75 -108 92 -293 -1 107 -38 -121 -282 21
6709 21 -274 -59 -171 0 119 -86 51 -135 371 4 -29 143 -62 -101 -92 40 -78 -57 68 24 -264 -50
6731 -50 200 -26 256 77 156 58 88 2 195 100 -86 86 72 -16 65 -81 90 -380 -236 -20 91 -16 3
6754 3 80 168 -162 150 13 -51 164 -68 -28 -43 253 -115 -56 1 67 146 3 -11 122 -88 -152 -75 118 61 16
6779 16 -43 101 -143 -11 13 -44 23 167 151 0 93 -60 -76 10 21 56 -15 208 39 -100 -100 -105 -86 137 159 -103
6805 -103 80 110 76 101 96 -50 73 40 86 129 161 -5 134 226 116 -73 36 -107 141 -277 147 115 -2 54
$$ packed form
6638IQ8J03j6o4j67J70j73k5K09o5J7r4PL60l37j10J65k38K22j28K58m7J89l91
6662e8J04j13J02r3O6r4J91k8k51J64j25K96l14J89L4p7J4kN3O3k5j30mJ22O1
6687A45k03J15n5j17j28L04rQ2N5l61J11j47J33l3K00l85K92J08j45q3j61L03
6709B1k95K15j12J71J19k05J37j86N06l67l3J72k05l9RJ32j18K1J25m4k88K14
6731e0K50k26K82j79P9r8L0q6J93r5j86J72j4q8Q1j46J71m70J44K16J11j07J9
6754CP7Q8l30L12j37o4K15k32M0j5K96l68N9N7O6P9j43j4J33k10o4P7J93n7m5
6779A6n9J44k44J32K4n7O7J44j6j51R3j53j6Q6J1L5p1K23j69j39%nJ9K23K2k62
6805a03J83L0l4K5nj46J23l3M6M3L2j66J39R2j10j89J09j43K48m18M24l2j17N6
$$ plain form
6829 54 208 -94 90 -183 -10 115 57 -35 17 82 2 272 -85 12 -114 152 -1 -215 169 -147 -93 -107 20
6852 20 -327 -206 24 26 -61 -159 -85 179 52 63 -337 154 39 -65 72 51 241 -2 8 16 147 68 25 -123
6876 -123 77 -50 -47 132 31 -15 70 -145 123 -73 -125 256 54 27 171 -96 -127 -96 -151 -63 176 -48 -44 37
6900 37 118 110 -264 -254 49 41 29 85 200 152 -42 154 -47 -229 73 -59 -200 -69 108 54 99 -19 -4 127
6924 127 157 29 -109 14 -3 -85 149 119 19 -57 -115 -108 174 -244 -231 -45 232 89 148 41 -76 36 -15 39
6948 39 -286 -48 -83 -89 -236 343 118 159 61 270 -54 -30 118 96 -97 -292 -3 -43 -41 19 33 -37 121 -48 266
6973 266 54 -162 -139 -105 11 4 19 26 167 16 -77 -265 -234 15 -147 61 12 41 91 130 154 -101 -64 172 -50
6998 -50 -30 178 57 110 -132 45 95 -21 38 196 154 -53 25 54 -18 123 346 77 -113 16 -203 -63 70
$$ packed form
6829E4J54l02J84k73J73J25n8r2N2O5q0K70l57R7j26K66j53k14L84l16N4j4J27
6852B0l47J21K30Kq7r8P4K64j27J1m00M91j15j04J37k1J90k43J0QJ31p9m3j48
6876a23K00j27LJ79j01m6Q5k15K68j96n2L81k02k7J44k67l1L1n5Q8K39k24MQ1
6900C7Q1ql74J0L03qj2N6J15m8j94J96k01j82L02j32j41J31J77n4M5j18J5J31
6924A27L0j28j38J23j7q2K34l0j00p6n8PK82m18J3J86K77j43N9j07j17J12n1N4
6948C9l25K38l5oj47N79k25M1r8K09l24K4J48k2j93j95K89m0KO0J4p0J58j69L14
6973B66k12k16K3L4J16pJ5PJ41j51r3j88L1K49j62K08m9K9N0L9K4k55L7K36k22
6998e0K0K08j21N3k42J77N0j16N9J58m2k07P8K9p2J41K23k69j90J29k19J40J33
$$ plain form
7021 70 15 -257 -116 8 75 157 -32 -29 -167 -145 -218 -7 42 66 173 42 95 119 41 -33 -111 178 152 140 -168 104
7047 104 99 -120 70 -72 -40 -48 46 -80 -85 -48 135 -40 -169 183 -67 277 -135 -107 -92 -103 59 -76 66 90
7071 90 246 -14 17 116 10 14 -71 54 -95 178 -51 105 -54 159 -146 -68 69 3 105 62 190 -76 232
7094 232 -68 211 -127 27 108 220 30 221 -157 181 18 -51 -135 236 260 -215 92 51 92 -42 80 230
7116 230 66 68 -71 59 1 -62 -43 59 -57 167 -45 30 90 -148 84 9 60 -53 -117 -104 50 -217 -155 -70
7140 -70 -13 114 -94 110 0 -71 53 -68 54 25 -60 -156 -60 -200 -53 108 22 156 23 172 -315 46 111
7163 111 -195 102 -112 -40 189 -57 -48 -236 85 123 -104 208 46 89 -160 -29 -158 101 381 175 -93 157
7185 157 82 265 35 0 262 31 140 -98 66 -101 -101 -332 221 -96 147 14 -65 -70 172 66 -163 -45
$$ packed form
7021G0n5k72J41J24O7Q2j89Lj38K2p3K11M9K4J07j31N3K4p8p4p8K89k6j2l08K72
7047A04nk19J90j42L2qR4j26nL7J83j75j29L52k50L44m12K8J5j1J62j35J42K4
7071I0J56k60L1R9j06Mq5J25j49K73k29J56j59K13l05P8J37o6J02m3J28k66L08
7094B32l00K79l38J54Q1J12j90J91l78L38j63o9q4L71K4m75L07m1M1j34J22J50
7116B30j64Kj39J30n8o3J9J02j16K24k12P5O0k38K32p5N1j13o4J3J54k67O2Q5
7140g0N7J27k08K04j10p1J24j21J22k9q5r6R6j40J47J61q6J34j33J49m87L61O5
7163A11l06K97k14P2K29k46Rj88L21L8k27L12j62M3k49J31j29K59K80k06k68K50
7185A57p5J83k30l5K62k31J09k38J64j67%k31N53l17K43j33p9nK42j06k29J18
$$ plain form
7207 -45 78 -194 -14 89 64 -141 -23 220 76 36 -128 -51 -280 -88 195 270 19 -135 -146 -105 245 -52
7229 -52 -83 -73 -304 -55 -96 -21 -109 167 239 28 48 61 102 -156 1 0 62 -59 154 133 -28 -61 91 -28 127
7254 127 -153 83 171 70 268 -170 -192 -61 69 81 -146 -43 -105 -43 85 14 -11 63 124 -176 79 54 123 20
7278 20 -60 -52 -223 -61 -88 18 -24 -64 -40 -61 38 127 2 -96 82 42 -134 23 -115 -313 -59 78 -103 -43 -70
7303 -70 -74 10 -85 247 57 183 53 -104 68 -127 -28 74 -57 -14 -61 19 87 45 -53 -39 -45 -190 72 165 50
7328 50 -98 168 42 -94 121 180 -37 98 -53 -119 160 -131 208 43 -116 239 50 -81 -142 42 139 -44
7350 -44 -60 -248 -165 114 48 1 -51 77 -25 217 171 38 -131 -189 -92 134 -197 47 -151 256 52 -366 85
7373 85 -205 -69 -20 87 -5 -61 50 -216 -160 104 -157 -94 8 24 -134 -13 101 -69 -181 285 -35 128
$$ packed form
7207d5J23k72J80J03k5k05J18K43j44m0j64P7k29J92K83P5k51j54j1M1L50k97
7229e2l1J0k31K49m1P5q8K76P2k11K0J3M1k58J57jO2j21K13k1j61l3J52j19J55
7254A27k80K36Q8j01J98m38k2J31J30J2k27J03o2O2J28p1k5P4O1l00K55k5O9j03
7278B0q0Qj71J62k7J06m2m0K4k1R9Q9j25r8J78m0j76J57j38j98K54J37j81O0k7
7303g0mQ4r5L32j90J26j30j57J72j95R9J02j31M3m7Q0O8m2r8J4oj45K62R3j15
7328E0j48K66j26j36K15N9k17J35j51o6K79k91L39j65j59L55j89j31o1J84R7j83
7350d4j6j88Q3K79o6m7n2J28j02K42m6j33j69n8R7K26l31K44j98M07k04m18M51
7373H5k90J36M9J07r2n6J11k66N6K64k61O3J02J6j58J21J14j70j12M66l20J63
$$ plain form
7395 128 171 45 83 -25 32 63 -175 53 185 -239 125 -300 74 48 151 202 -103 33 28 3 -96 -247 12
7418 12 -217 -54 41 -44 -44 54 -52 213 -40 192 69 7 -222 11 57 -24 -27 -168 118 -40 -22 93 47 8 118
7443 118 -86 62 -183 45 54 103 -38 108 93 150 107 -56 -9 150 210 218 -2 -123 21 -67 96 -4 91 67
7467 67 153 -75 23 -222 13 31 -58 166 92 255 -92 130 242 -221 -3 30 -47 51 15 7 -267 -189 -40 165
7491 165 128 -59 -159 90 -14 0 -139 58 -139 -139 -238 29 -81 35 -152 -92 -165 -49 256 260 -10 4 -76 220
7515 220 -193 -11 251 -142 -57 -287 -23 -61 85 -44 -131 21 19 170 85 -36 -118 32 37 143 93 -87 101
7538 101 -62 12 48 -146 116 49 -90 -126 10 -118 -28 -155 114 77 66 -46 -172 158 88 -6 -37 46 -70 15
7562 15 30 -9 -22 -260 72 13 -158 45 59 96 6 -159 -52 -157 -23 38 269 -207 -148 193 -13 -24 256 -165
$$ packed form
7395A28M3j26L8j08N7L1k38K28J32m24L64m25L74k6J03N1l05J36nk5r9j51K59
7418A2k29J63R5q5%R8j06K65k53K32j23o2k29K33M6q1lj41K86j58J8J15m6l9J10
7443A18k04J48k45K28RM9j41J46j5N7m3j63M7J59O0Qk20j21J44q8J63j00R5k4
7467F7Q6k28R8k45K35J8q9K24p4J63l47K22J12m63K18L3p7R8l6qk74P8J49K05
7491A65l7j87j00K49j04J4j39J97j97%r9K67j10J16j87O0p3J16L05Mk70J4q0K96
7515B20m13J82K62l93Q5k30K64l8J46j29q7J52kJ51q5j21q2J50NJ06n0j80J88
7538A01j63P4L6j94K62o7j39l6J36j28R0j27K69l7j1j12j26L30p0r4l1Q3j16Q5
7562A5J5l9j3k38L32n9j71K03J4L7r0j65J07j05J34O1K31m76N9L41k06j1K80m21
$$ plain form
7586 -165 -250 68 -55 -20 -170 120 -60 33 -78 -117 61 -121 -71 -117 -108 -105 88 -74 109 -213 -120 -334 103 -206
7610 -206 -6 13 -179 57 75 -198 -103 -147 203 134 -92 213 -44 82 -175 6 -128 -13 -223 58 44 -237
7632 -237 -45 -41 -153 -250 114 111 -7 12 -280 68 -198 -76 117 -9 119 -74 -25 124 -108 19 111 84 51
7655 51 103 -72 58 45 296 80 28 -33 389 24 -341 -28 -215 -11 -154 -83 -14 -59 121 175 146 25 -2 244
7679 244 -20 88 -31 386 -107 -92 102 20 94 -98 95 -266 -33 -131 -70 121 -77 -25 143 -50 161 8
7701 8 235 121 130 151 -104 -41 40 -2 -39 125 162 182 98 -124 198 100 89 -76 -120 -257 98 -17 -68 121 120 -143
7727 -143 -88 88 -113 201 -128 -9 -129 -41 -212 100 177 -8 132 -268 148 118 48 71 -94 38 59 -22 -255
7750 -255 -132 -6 31 162 58 -63 -5 111 -122 80 -12 148 46 -24 33 82 21 66 -1 -142 -17 -170 -164 58
$$ packed form
7586a65q5L18j23L5j50K90j80R3j11l9J78j82N0m6RLJ93j62J83l22R3k14M37l09
7610b06K00J9j92K36J8k73R5m4L50o9k26L05k57J26k57J81j34J15k10K81j4k81
7632b37J92Mj12r7L64lj18J9k92L48k66J22J93j26J28j93M9J49k32J27R2k7l3
7655E1N2j75J30j3K51k16n2o1M22l65l65L13j87K04j43P1O9m5J80N4k9j21k7K46
7679B44k64J08j19M17m93J5J94q2P4j92J93l61K33r8O1J91j98N2J68j93K11j53
7701HK27j14RK1k55O3Q1m2l7J64L7K0q4k22L22r8j1j65m4j37L55j15n1J89jk63
7727a43N5J76k01L14l29J19j20Q8j71L12P7j85J40m00M16l0p0K3j65J32K1q1k33
7750b55J23J26L7J31j04j21N8J16k33K02r2J60j02p0N7M9o1M5o7j41J25j53OK22
$$ plain form
7774 58 179 116 -9 -95 -13 101 -171 -97 -198 80 -235 -107 12 -17 77 220 128 -169 -33 -202 163 219 -86
7797 -86 -258 184 94 51 69 -92 -13 28 -105 76 -44 -36 62 -124 -61 40 -127 53 200 6 -29 169 84 134
7821 134 -42 -23 37 57 -64 51 122 121 74 119 428 -19 67 28 -279 65 -90 21 111 88 154 -24 -14 -86 205
7846 205 -62 29 -67 108 -63 48 11 -9 -144 -101 26 -124 -102 -104 48 140 60 -3 -68 -114 61 144 7 -200 51
7871 51 24 -101 106 -213 29 69 -149 303 9 160 237 -29 -198 -126 -161 24 -158 -65 175 -230 -116 21
7893 21 -174 131 -74 145 142 -155 12 92 28 -8 -190 168 145 -157 -132 86 10 103 89 58 46 17 -61 48 18
7918 18 38 -186 -35 48 -95 29 101 69 20 124 -119 96 40 35 -121 -248 37 108 18 -147 53 23 184 -98
7942 -98 -15 76 68 -18 191 -160 62 318 -125 71 43 58 -134 59 -44 -196 107 28 58 -293 -179 -109 -81 -165
$$ packed form
7774E8J21o3j25q6Q2J14k72P4j01K78l15J28J19k9R4J43r2k97J36j69L65N6l05
7797h6j72M42r0m3J8j61P9M1j33J81j20QR8j86O3J01j67J80J47j94l5J98q5N0
7821A34j76J9O0K0j21J15P1jm7M5L09m47Q6l9l07L44j55J11R0k3O6j78J0p2K91
7846B05k67R1r6J75j71J11l7k0j35M3J27j50K2kJ52R2q0o3o5m6J75Q3j37k07K51
7871E1k7j25K07l19K42M0k18M52k94J51P7k66j69P2l5J85j82R3K40m05J14J37
7893B1j95L05k05K19lk97J67Q0o4l6j82L58k3l02K5K18p6R3j4l1j2k9p8J09l0
7918A8K0k24J51Q3j43J24P2l2m9J04k43K15n6nj56j27K85P1r0j65K00l0J61k82
7942i8Q3R1qq6K09l51K22K56m43J96k8J5j92J93j03j52L03p9L0l51J14P0K8q4
$$ plain form
7966 -165 85 90 41 248 -49 106 -23 -157 59 -62 -149 171 239 -140 117 302 -11 46 206 101 76 -19 298
7989 298 105 194 90 -133 -73 -116 -39 -7 195 -204 -143 51 -118 -34 144 56 -9 49 -31 193 247 -165 -95 -56 127
8014 127 3 -1 217 16 -47 18 86 252 -148 217 56 -23 41 -34 27 -54 10 -41 29 256 114 -46 129 140 28
8039 28 91 110 -15 61 0 55 60 -3 20 -152 -213 -24 149 -116 -68 -75 1 47 135 -9 79 -71 -9 69 29 -86 41
8066 41 149 4 -26 50 -3 -69 95 -17 111 -31 -118 113 129 -176 -128 216 46 0 174 -46 276 202 -12
8089 -12 -99 -11 116 53 -103 142 121 40 31 -9 17 31 282 33 -82 106 43 -87 -117 -200 118 -83 -30 -53 -81 189
8115 189 -37 -129 -97 72 -194 -83 -17 72 48 -86 70 232 -38 178 -63 137 -71 184 11 133 18 -134
8137 -134 134 52 -36 54 -94 88 179 135 282 71 -47 -62 238 16 20 2 68 248 -10 145 -302 -172 41
$$ packed form
7966a65K50Nm9K07k97J55j29j34K16j21q7L20O8l79K57J85l13N7J60j05k5r5L17
7989B98j93Q9j04k23O0m3P7L2K02l99O1J94j69Q4J78q8o5N8q0K24N4m12P0L9J83
8014A27j24mK18k01o3O5O8J66m00L65j61p9O4p5O1q1O4n1P0K27j42j60J75J1j12
8039B8O3J9j25P6o1N5No3K3j72o1J89J73k65M8pP6M6Q8j44Q8j50O2P8m0j15J27
8066D1J08j45l0P6n3o6J64j12J28j42q7K31J6l05M8L44j70m6J74k20L22p4k14
8089a2q7Q8J27o3j56K45k1q1rm0K6J4K51k49j15J88o3j30l0q3L18k01N3k3k8K70
8115A89k26r2L2J69k66J11O6Q9k4j34J56J62k70K16k41K00k08K55j73J22j15j52
8137a34K68q2q8R0j48J82R1m4J47k11j18j5L00k22Mj8O6J80k58J55m47J30K13
$$ plain form
8160 41 34 -130 -11 -156 197 -38 58 -48 29 -220 38 154 327 22 15 -33 18 6 -111 196 131 -137 8 -47
8184 -47 34 166 43 -80 -120 -16 -9
$$ packed form
8160D1pj64J19j45L53k35R6j06P7k49K58J16J73l05pm8N1j2j17L07o5k68J45n5
8184d7Q1J32j23j23m0J04P
8191i
$$ Imaginary data points
##PAGE= N=2
##DATA TABLE= (X++(I..I)), XYDATA
$$ plain form
0 0 0 0 0 0 0 0 0 0 0 0 0 0 -8 8 -8 8 -14 16 -16 24 -25 32 -40 48 -56 64 -73 86 -97 113 -129 147 -167 191
34 191 -215 241 -272 305 -343 380 -426 472 -525 582 -643 710 -784 866 -955 1053 -1159 1276
52 1276 -1407 1551 -1713 1895 -2101 2338 -2611 2934 -3317 3782 -4366 5120 -6138 7597 -9880
67 -9880 14019 -24011 107562 60302 -29856 106777 111728 41365 -42112 -61285 1483 122099
79 122099 41611 -60489 -15676 127288 69244 -43570 -60497 -23934 25533 5056 -76834
90 -76834 -114468 8988 75837 -17924 -84513 -37912 37190 6194 -42501 -103433 -67828 18284
102 18284 15606 -65702 -68705 38316 61736 20414 -33840 -22191 15300 21406 -31791 -102403
114 -102403 -46691 16438 2808 -56820 -33702 27296 52208 32451 -26416 -22028 12133 26640
$$ packed form
0@%%%%%%%%%%%%qJ6j6J6k2L0l2M0m9N7p2Q8j04J20j37J59j83K10k42K76l14L58
34A91m06M56n13N77o48P23q06Q98r97J107j225J353j494J650j821K008k212K435
52A276k683K958l264L608l996M439m949N545o251P099q148R486j1258J3735j7477
67i880K3899l8030J31573m7260r0158J36633M951p0363q3477j9173O2768J20616
79A22099q0488j02100M4813J42964n8044j12814j6927L6563M9467k0477q1890
90g6834l7634J23456O6849r3761o6589M6601P5102l0996m8695o0932L5605Q6112
102A8284k678q1308l003J07021K3420m1322n4254J1649L7491O106n3197p0612
114a02403N5712O3129j3630n9628K3118O0998K4912j9757n8867M388L4161J4507
$$ plain form
126 26640 -46231 -87380 -44824 -10435 -17493 -53451 -38396 -7490 34920 13959 -25186 -13601
138 -13601 18384 23173 -29975 -38715 -23876 1041 -6489 -27953 -28633 -2975 32946 8463 -1791
151 -1791 8248 37428 37292 17486 11287 9282 28595 16768 144 -14918 4852 13971 2887
164 2887 5386 6122 27258 28494 32957 21465 20177 22388 10707 1439 -13776 -10438 -23426 -15657
178 -15657 -12284 -8063 -563 2984 17251 14877 19356 3687 994 -1820 -5923 -18593 -35049 -19939
192 -19939 -11904 -316 -11088 -6127 11853 28636 25415 -1292 -957 7001 17822 -7457 -25149
205 -25149 -17248 6363 20030 -2799 -6946 8448 37726 24985 -4180 -13164 5249 21633 -5477
218 -5477 -24860 -21207 17118 24487 -1195 -16984 74 31270 14200 -18932 -37860 -7933 11125
$$ packed form
126B6640p2871m1149M2556L4389p058l5958J5055L0906M2410k0961l9145J1585
138a3601L1985M789n3148q740J4839K4917p530k1464o80K5658L5921k4483j0254
151a791J0039K9180j36j9806o199k005J9313j1827j6624j5062J9770R119j1084
164B887K499P36K1136J236M463j1492j288K211j1681r268j5215L338j2988P769
178a5657L373M221P500L547J4267k374M479j5669k693k814m103j2670j6456J5110
192a9939Q035J1588j0772M961J7980J6783l221k6707L35P958J0821k5279j7692
205b5149P901K3611J3667k2829m147J5394K9278j2741k9165q984J8413J6384k7110
218e477j9383L653L8325P369k5682j5789J7058L1196j7070l3132j8928K9927J9058
$$ plain form
231 11125 -7309 -34117 -28899 14991 24640 4009 -23206 -5272 20301 11044 -25328 -45293 -14238
244 -14238 4829 -4550 -35993 -24452 16280 31463 8852 -20724 -1640 22797 19990 -23324
256 -23324 -40455 -14558 11007 2057 -31700 -20257 14732 37194 11275 -13759 -363 26715
268 26715 25365 -16639 -29268 -8674 20032 4886 -23791 -17662 15650 36678 9111 -12289
280 -12289 -3178 29462 26672 -7086 -21476 -2471 26294 10888 -13506 -16924 14615 29300 7331
293 7331 -14299 -6226 25118 22099 -759 -17840 3518 26483 14901 -10570 -17570 11069 21273
306 21273 4595 -20176 -11064 15695 18567 -869 -18491 2049 20265 15649 -11254 -17194 4207
319 4207 14336 1580 -21598 -12378 7564 15969 -3459 -16027 -984 14465 12223 -11388 -14520
$$ packed form
231A1125j8434k6808N218M3890R649k0631k7215J7934K5573r257l6372j9965L1055
244a4238J9067r379l1443J1541M0732J5183k2611k9576J9084K4437k807m3314
256b3324j7131K5897K5565q950l3757J1443L4989K2462k5919k5034J3396K7078
268B6715j350m2004j2629K0594K8706j5146k8677O129L3312K1028k7567k1400
280a2289R111L2640k790l3758j4390J9005K8765j5406k4394l418L1539J4685k1969
293G331k1630Q073L1344l019k2858j7081K1358K2965j1582k5471p000K8639J0204
306B1273j6678k4771R112K6759K872j9436j7622K0540J8216m616k6903n940K1401
319D207J0129j2756k3178R220J9942Q405j9428j2568J5043J5449k242k3611l132
$$ plain form
332 -14520 -1666 11122 -23 -15832 -11028 4463 12732 -3183 -10215 -3999 9712 6689 -9120
345 -9120 -12224 -3877 7575 -1110 -8425 -7930 4926 9320 133 -5318 -4441 5663 1328 -5712 -10462
360 -10462 -4484 2395 -798 -3013 -3474 5699 5580 3336 -1942 -1903 1404 -2154 -4655 -8933 -3534 -2478
376 -2478 -314 -1022 159 3667 2482 3866 -674 -130 -4121 -5018 -5527 -5217 -4114 -6202 -2139 -1073
392 -1073 3470 475 -618 194 572 439 -6405 -6350 -5632 -1381 -4522 -6031 -3597 1633 5189 -840 -2524
409 -2524 -1249 4538 1688 -5787 -7236 -2631 4189 -354 -4101 -3611 6379 8878 2266 -2402 -212
424 -212 8167 4052 -2702 -6623 1845 8011 3389 -3075 -1431 10194 10883 4428 -3865 1567 10417
439 10417 7581 -1666 -6405 3515 10045 7118 -3310 -1227 9242 12544 4862 -5062 1463 9092
$$ packed form
332a4520J2854J2788j1145j5809M804J5491Q269j5915p032O216J3711l023j5809
345i120l104Q347J1452q685p315M95J2856M394r187n451Q77J0104m335p040m750
360a0462N978O879l193k215m61R173j19k244n278L9L307l558k501m278N399J056
376b478K164p08J181L508j185J384m540N44l991q97n09L10J103k088M063J066
392a073M543k995j093Q12L78j33o844N5P18M251l141j509K434N230L556o029j684
409b524J275N787k850p475j449M605O820m543l747M90R990K499o612m668K190
424b12Q379m115o754l921Q468O166m622o464J644J1625O89o455q293N432Q850
439A0417k836r247m739R920O530k927j0428K083J0469L302p682r924O525P629
$$ plain form
453 9092 8935 -2642 -6536 2924 10207 6321 -6014 -3559 5946 11318 1073 -8089 -2515 6792 7938
468 7938 -4831 -8908 -1597 8348 2762 -8569 -8514 1104 7284 -2765 -10528 -7119 4164 4573 -6077
483 -6077 -10981 -3934 6174 815 -8717 -10895 -262 5070 -3088 -10742 -8191 3872 3931 -4178 -9892
498 -9892 -2554 5979 2342 -6054 -9146 1529 5637 52 -8214 -5425 4256 5181 -1551 -7908 -1115
513 -1115 5791 4539 -4030 -5958 1903 6187 2067 -5984 -3166 3611 5740 -1166 -6055 -958 4415
528 4415 4430 -3752 -4214 1348 6018 2735 -3556 -1847 3101 6013 -438 -3725 -1496 3695 3186 -1916
544 -1916 -2510 1291 5911 2728 -760 -444 4027 4954 372 -2019 -912 3554 2103 -1098 -2758 650
560 650 3684 1642 -638 -1391 2491 2618 183 -2422 -1635 615 -396 -1618 -3442 -1006 -107 -253 -1756
$$ packed form
453I092j57j1577l894R460P283l886j2335K455R505N372j0245r162N574R307J146
468G938j2769m077P311R945n586j1331N5R618O180j0049p763L409J1283M09j0650
483f077m904P047J0108n359r532k178J0633N332q158p654K551J2063N9q109n714
498i892P338Q533l637q396l092J0675M108n585q266K789R681R25o732o357O793
513a115O906j252q569j928P861M284m120q051K818O777K129o906m889N097N373
528D415J5q182m62N562M670l283o291J709M948K912o451l287K229N191n09n102
544a916n94L801M620l183l488L16M471R27m582k391J107M466j451l201j660L408
560F50L034k042k280p53L882J27k435k605P87K250j011j222j824K436Q99j46j503
$$ plain form
577 -1756 -1948 319 365 -423 -2217 -1295 -758 -698 -1475 -2177 -999 -863 103 -1129 -312 -288 -10 263 -25 683
597 683 -574 391 -217 579 256 -277 -77 434 1233 -197 -130 -88 1073 928 -106 -196 404 1696 355
616 355 -753 -708 1182 1145 -624 -1549 -981 1314 188 -1127 -1558 317 2014 780 -1167 -1188 1610 1636
634 1636 -182 -2281 -684 1532 786 -1007 -1992 878 2351 1173 -811 -404 2254 2459 596 -2047
650 -2047 -93 1782 1540 -1338 -2025 560 2356 1422 -1386 -747 1542 2770 180 -1902 -402 1492
666 1492 1834 -1656 -2141 -66 1874 631 -1856 -1544 831 2414 -588 -1984 -1309 1562 1389 -1537
682 -1537 -2616 -201 1868 302 -1829 -1988 738 1809 -697 -2279 -1115 1640 1351 -773 -1895 185
698 185 1703 577 -1694 -1835 755 1258 -372 -2264 -866 1454 1108 -830 -1918 416 1665 776
$$ packed form
577a756j92K267M6p88j794R22N37O0p77p02J178J36R66j232Q17K4K78K73k88P08
597F83j257R65o08P96l23n33K00N11P99j430O7M2J161j45j034r0O00J292j341
616C55j108M5J890l7j769r25N68K295j126j315m31J875J697j234j947k1K798K6
634A636j818k099J597K216p46j793r85K870J473j178j984M07K658K05j863k643
650b047J954J875k42k878o87K585J796r34k808O39K289J228k590k082J500J894
666A492L42l490m85K075J940j243k487L12K375J583l002j396O75K871j73k926
682a537j079K415K069j566k131j59K726J071k506j582J164K755k89k124j122K080
698A85J518j126k271j41K590N03j630j892J398K320l46j938j088K334J249q89
$$ plain form
714 776 -1428 -1625 681 1160 -222 -2184 -763 849 1240 -924 -1325 439 1629 737 -1201 -1003 472
731 472 1250 -325 -1618 -289 1008 913 -881 -782 314 1338 749 -825 -301 553 1439 -386 -1002 -397
749 -397 965 860 -403 -765 92 1263 303 -538 -477 609 977 155 -566 35 1113 584 -168 -837 -54
768 -54 514 87 -678 -505 338 559 179 -455 130 523 458 -240 -436 -226 185 -150 -499 -260 191 155 -14
789 -14 -244 29 304 -110 -216 -385 -38 -56 -48 -443 -288 77 80 120 4 -25 -162 -95 -81 259 162 -158 204 38
813 38 470 272 38 -13 408 22 -138 -76 116 239 56 -87 -85 564 441 -129 -399 132 267 -64 -510 -592
835 -592 102 277 -85 -463 7 567 318 -165 -598 -19 389 -265 -717 -591 255 514 17 -583 62 434
855 434 421 -427 -775 335 568 79 -599 -93 445 751 52 -640 136 832 638 -655 -613 431 767 134
$$ packed form
714G76k204j97K306M79j382j962J421J612L91k164m01J764J190q92j938J98J475
731D72P78j575j293J329J297r5j794R9J096J024n89j574N24Q54Q86j825o16O05
749c97J362j05j263l62Q57J171r60q41O1J086L68q22p21O01J078n29p52o69P83
768e4N68m27p65J73Q43K21l80o34N85L93o5o98j96K10M11l35l49K39M51l6j69
789a4k30K73K75m14j06j69L47j8Ql95J55L65LM0j16k9j37O7J4L40r7l20L62j66
813C8M32j98k34n1M21l86j60O2J92J23j83j43KO49j23n70k70N31J35l31m46q2
835e92O94J75l62l78M70N60k49m83m33N79M08o54m52J26Q46K59m97o00O45L72
855D34j3q48l48J110K33m89o78N06N38L06o99o92P76O96j94j293M2J044L36o33
$$ plain form
875 134 -581 -174 644 843 -69 -672 -117 772 400 -734 -794 -157 624 -79 -746 -98 668 903 -487 -632
895 -632 -319 738 355 -735 -635 211 963 -117 -505 -357 782 644 -161 -784 72 931 307 -464 -618
914 -618 463 701 188 -533 -217 937 435 -341 -838 48 523 254 -846 -632 380 594 -160 -1050 -222
933 -222 388 370 -262 -912 -159 648 251 -578 -449 294 839 -133 -977 -322 173 574 -560 -449 -201 573
953 573 146 -374 -245 267 633 -104 -523 -58 229 222 -243 -194 106 563 52 -503 -373 294 497 18 -413
974 -413 -399 320 -24 -200 -378 70 313 91 -41 -234 283 75 -18 -387 -298 299 -77 204 -170 191 408
995 408 147 -28 164 408 61 -257 -89 133 380 151 -2 116 282 36 182 51 284 -60 -5 195 -32
1016 -32 61 -155 62 176 245 -163 184 -147 -96 -83 -123 -144 -285 299 -124 -134 -80 20 206 -289 -14 -399 20
$$ packed form
875A34p15M07Q18J99r12o03N55Q89l72j134o0O37P81p03o67O48P66K35j390j45
895f32L13J057l83j090J00Q46P52j080l88J48J139j38q05o23Q56Q59o24p71j54
914f18J081K38n13p21L16J154n02p76m97Q86M75k69j100K14J012K14p54q90Q28
933b22O10j8o32o50P53Q07l97q29J29P43N45r72q44O55M95M01j134J11K48P74
953E73m27n20J29N12L66p37m19M65K87pm65M9L00M57n11n55J30O67K03m79m31
974d13J4P19l44j76j78M48K43k22j32j93N17k08r3l69Q9N97l76K81l74L61K17
995D08k61j75J92K44l47l18J68K22K47k29j53J18J66k46J46j31K33l44N5K00k27
1016c2R3k16K17J14O9m08L47l31N1J3m0k1j41N84m23j0N4J00J86m95K75l85M19
$$ plain form
1039 20 41 -90 -291 -102 351 -120 -73 146 403 260 -230 -260 79 285 132 -235 -195 487 419 160 -263 -86
1061 -86 380 216 -175 -459 56 342 166 -275 -303 273 470 93 -260 104 366 223 -146 -793 198 289 249
1082 249 -460 -138 489 721 238 -476 -213 177 329 -919 -717 332 526 321 -430 -284 161 549 -184
1101 -184 -656 -246 390 262 -316 -593 -52 702 131 -503 -256 293 490 -524 -584 -444 263 235 -438 -609
1121 -609 145 826 194 -438 -584 533 557 -6 -859 -246 651 306 -216 -421 139 741 217 -289 -276 580
1141 580 517 -20 -764 -223 525 444 -410 -550 250 448 206 -651 -199 336 580 -20 -648 122 561 451 -416
1162 -416 -375 128 384 -11 -740 -246 181 462 -390 -612 -129 290 320 -707 -216 10 776 -157 -577 -510 193
1183 193 315 -278 -201 -154 522 -52 -324 -253 -95 322 -193 -270 -148 280 316 114 -311 -16 61 -230 -229 -557 -125
$$ packed form
1039B0K1j31k01J89M53m71M7K19K57j43m90l0L39K06j53l67M0O82o8k59m23J77
1061h6M66j64l91k84N15K86j76m41k8N76J97l77l53L64K62j43l69o47R91R1m0
1082B49p09L22O27K32m83p14K63L90J52j248K02J049J94k05p51J46M45L88p33
1101a84m72M10O36j28n78k77N41P54n71o34K47N49J97j014o0J40P07k8o73j71
1121f09P54O81o32o32j46J117K4n63q53O13Q97l45n22k05N60O02n24n06J3Q56
1141E80o3n37p44N41P48q1q54j40Q00J98k42q57M52N35K44o00o28P70M39j10q67
1162d16M1N03K56l95p29M94M27K81q52k22M83M19L0j027M91K26P66r33m20O7P03
1183A93J22n93P7M7O76n74k72P1J58M17n15p7J22M28L6k02m25K95P7k91Jl28M32
$$ plain form
1206 -125 88 -187 -98 -136 499 117 64 -162 -26 103 168 -263 -325 36 205 292 57 -6 -133 225 333 -112
1228 -112 47 -205 -63 -103 48 -54 -59 -30 95 409 30 209 113 46 135 -372 -177 -92 33 -123 -211 11 524
1251 524 271 -74 -194 22 439 66 -412 -532 149 192 -264 -342 -46 597 249 -69 -315 -119 400 -114 -444
1272 -444 -595 343 277 -295 -433 -1 535 530 99 -552 338 223 96 -816 -666 409 352 -17 -592 22 446
1293 446 374 -471 -501 188 325 -13 -938 -497 348 535 -459 -886 -200 604 302 -712 -803 49 424 5 -865
1314 -865 -496 200 740 -419 -687 -284 709 437 -598 -705 -143 703 -278 -683 -755 345 465 -450 -750
1333 -750 -344 1007 578 -341 -568 349 1112 141 -457 -506 515 729 119 -896 189 948 729 113 -549
1352 -549 601 1181 638 -598 -444 744 771 200 -848 -27 836 1108 14 -297 817 1055 754 -469
$$ packed form
1206a25K13k75Q9l8O35l82n3k26J36J29O5m31o2L61J69Q7k35o3j27L58J08m45
1228a12J59k52J42m0J51j02nK9J25L14l79J79r6o7Q9n07J95Q5J25j56q8K22N13
1251E24k53l45j20K16M17l73m78j20O81M3m56p8K96O43l48l18k46J96N19n14l30
1272d44j51R38o6n72j38M32N36nm31o51Q90j15j27r12J50J075n7l69n75O14M24
1293D46p2q45l0O89J37l38r25M41Q45J87r94m27O86Q04l02j014r1Q52L75m19q70
1314h65L69O96N40j159k68M03R93k72j035j07N62Q46r81m05p2J100J20r15l00
1333g50M06J351m29r19k27R17P63r71n98m9J021K14o10j015J085P59k19o16o62
1352e49J150N80n43j236J54J188K7n71j048Q21Q63K72j094l11J114K38l01j223
$$ plain form
1370 -469 -183 258 683 5 -579 -34 362 818 -1 -67 242 1011 399 -624 -231 114 343 -148 -353 -135
1390 -135 328 507 -206 -104 -61 354 41 -424 -513 -172 -123 -295 -421 -394 133 -83 -218 -584 14 171 -177
1411 -177 -509 -683 -275 -72 -435 -556 -412 220 -100 -67 -550 32 -163 -327 -152 -535 -119 -600 -147 -249
1431 -249 -21 214 -149 61 58 109 -189 -183 -413 -186 -344 -96 -116 177 476 98 281 60 473 -23 -288 -80
1453 -80 -7 47 -222 -382 -24 137 326 -124 -57 -24 506 242 -26 -113 348 171 -75 -355 -372 676 -5 20
1475 20 -40 320 683 194 84 -285 560 719 92 -837 -96 557 323 96 -617 321 624 533 -229 -109 509
1496 509 735 223 -622 210 628 428 -363 -535 80 610 544 -464 19 366 880 17 -480 -255 472 616
1516 616 -392 -485 -57 516 379 -530 -489 -13 496 -265 -685 -468 423 532 -428 -492 -184 667 227 -525 -665
$$ packed form
1370d69K86M41M25o78n84N45L96M56q19o6L09P69o12j023L93L45K29m91k05K18
1390a35M63J79p13J02M3M15l13m65q9L41M9j72j26K7N27k16j35l66N98J57l48
1411a77l32j74M08K03l63j21J44O32l20L3m83N82j95j64J75l83M16m81M53j02
1431b49K28K35l63K10lN1k98Ok30K27j58K48k0K93K99l78J83k21M13m96k65K08
1453h0P3N4k69j60L58J61J89m50O7L3N30k64k68q7M61j77k46k80j7J048o81K5
1475B0o0L60L63m89j10l69Q45J59o27r29P41O53k34k27p13R38L03r1p62J20O18
1496E09K26n12q45Q32M18k00p91j72O15N30o6j008M83L47N14q63m97K25P27J44
1516F16j008r3M28N73j37r09M1M76N09p61m20K17Q91J09r60o4L08Q51m40p52j40
$$ plain form
1537 -665 203 364 -402 -866 -920 429 151 -443 -567 -273 701 393 -315 -649 153 272 -212 -835 -744 237
1557 237 487 -187 -788 -16 537 404 -405 -462 239 267 -18 -795 -369 208 366 -332 -435 135 539 416 -221
1578 -221 -168 132 357 106 -472 -153 296 625 -231 107 -76 331 607 -242 -80 48 862 264 -7 -228
1598 -228 98 520 -9 -222 -69 451 450 259 -69 140 503 -33 -86 -90 149 194 43 -318 -223 355 150 -48
1620 -48 -341 -37 -14 80 -138 -192 131 66 59 -335 -109 -36 23 -11 -177 -40 -191 147 -157 -45 -175 -243 178 -223
1644 -223 -73 -338 206 -115 -166 107 -29 92 -237 54 -7 213 142 140 116 -87 -78 -209 195 -314 -91 202 70
1667 70 33 -215 -167 -146 223 -111 -11 -427 -19 200 -2 -4 -259 23 23 -38 -325 -308 200 -30 53 -306 67 99
1691 99 77 -161 -700 188 58 187 -375 -377 189 351 227 -264 -87 255 227 -301 -2 9 182 285 -338 -143
$$ packed form
1537f65Q68J61p66m64n4J349k78n94j24K94R74l08p08l34Q02J19m84o23R1R81
1557B37K50o74o01P72N53j33q09n7P01K8k85p77M26N77J58o98j03N70M04j23o37
1578b21N3L00K25k51n78L19M49L29q56L38j83M07K76q49J62J28Q14n98k71k21
1598b28L26M22n29k13J53N20jj91l28K09L63n36n3mK39M5j51l61R5N78k05j98
1620d8k93L04K3R4k18n4L23o5pl94K26P3N9l4j66J37j51L38l04J12j30o8M21m01
1644b23J50k65N44l21n1K73j36J21l29K91o1K20p1kk4k03Rj31M04n09K23K93j32
1667G0l7k48M8K1L69l34J00m16M08K19k02kk55K82%o1k87J7N08k30Q3l59L73L2
1691I9k2k38n39Q88j30J29n62kN66J62j24m91J77L42k8n28K99J1J73J03o23J95
$$ plain form
1713 -143 110 575 2 -516 223 230 303 -327 -188 87 776 118 117 -140 237 693 131 -89 21 590 381 -88
1735 -88 -220 71 401 257 -228 -45 450 434 35 -38 -122 316 210 -12 -670 17 255 269 -137 -357 270 383
1757 383 123 -420 -162 122 341 -234 -715 -236 143 108 -386 -457 185 168 98 -481 -473 20 354 -336 -590 -476
1779 -476 -77 35 -713 -378 -85 328 -112 -666 -436 -140 216 -312 -547 -670 28 -15 -398 -494 -316 408 -84
1800 -84 -347 -489 110 -77 -214 -296 -334 28 -56 174 -60 18 476 183 -204 -179 287 58 106 -15 -185 94
1822 94 215 183 -203 363 267 362 213 13 185 442 296 24 117 34 165 226 234 80 469 319 170 304 330
1845 330 352 412 131 67 -2 243 219 251 239 225 368 281 238 231 288 116 70 228 71 -67 -47 222 -135 147 -145
1870 -145 212 170 66 230 104 322 -204 -135 -287 137 -54 54 24 -78 37 279 365 -333 -302 78 -239 -278
$$ packed form
1713a43K53M65n73n18P39PP3o30J39K75O89o58jk57L77M56n62k20J10N69k09m69
1735h8j32K91L30j44m85J83M95j6l99p3q4M38j06k22o58O87K38J4m06k20O27J13
1757C83k60n43K58K84K19n75m81M79L79l5m94p1O42j7p0n79QM93L34o90k54J14
1779d76L99J12p48L35K93M13m40n54K30K96L56n28k35j23O98m3l83r6J78P24m92
1800h4k63j42N99j87j37q2l8L62q4K30k34P8M58k93l87K5M66k29M8j21j70K79
1822I4J21l2l86N66r6R5j49k00J72K57j46k72R3q3J31O1Qj54L89j50j49J34K6
1845C30K2O0k81o4o9K45k4L2j2j4J43q7m3pN7j72m6J58j57j38K0K69l57K82k92
1870a45L57m2j04J64j26K18n26O9j52M24j91J08l0j02J15K42Q6o98L1L80l17l9
$$ plain form
1892 -278 -458 53 20 -7 -187 -177 15 223 115 -420 -269 -121 60 -414 -562 -121 -191 11 -392 -203 144
1913 144 190 -108 -189 -4 6 -78 -416 -291 -310 95 -147 -268 -235 -29 138 -203 -160 -206 -51 -104 -230 -228 -489 107
1937 107 -62 -112 12 96 481 -22 -223 -265 190 -40 -113 -430 -88 121 136 100 -135 266 176 366 41 -257
1959 -257 251 210 43 -225 -124 323 345 -314 149 318 274 600 -33 -45 30 44 -31 -446 -242 56 479 109
1981 109 -259 110 310 175 -284 121 -5 227 -150 -224 -270 -16 113 -103 -80 216 155 137 25 -26 73 84 -36
2004 -36 -14 -387 93 -56 4 -12 207 264 -28 -43 -225 123 -47 168 -160 -142 -204 -190 -61 -497 -119 129 273
2027 273 123 15 105 -56 232 -148 -58 -50 19 7 -101 400 234 111 -46 66 -70 -7 74 65 4 -164 106 -199
2051 -199 -25 89 232 231 110 248 100 -61 -103 30 -215 -267 52 -268 33 75 244 -70 212 227 -116 -22
$$ packed form
1892b78j80N11l3k7j80J0J92K08j08n35J51J48J81m74j48M41p0K02m03J89L47
1913A44M6k98q1J85J0q4l38J25j9M05k42j21L3K06J67l41M3m6J55n3j26Kk61N96
1937A07j69n0J24Q4L85n03k01m2M55k30p3l17L42K09J5l6k35M01r0J90l25k98
1959b57N08m1j67k68J01M47K2o59M63J69m4L26o33j2P5J4p5m15K04K98M23l70
1981A09l68L69K00j35m59M05j26K32l77p4m6K54J29k16K3K96o1j8j12n1R9J1j20
2004c6K2l73M80j49O0j6K19N7k92j5j82L48j70K15l28J8o2J4J29m36L78K48J44
2027B73j50j08R0j61K88l80R0QO9j2j08N01j66j23j57J12j36O3Q1ro1j68K70l05
2051a99J74J14J43jj21J38j48j61m2J33k45n2L19l20L01M2J69l14K82J5l43R4
$$ plain form
2073 -22 -100 52 -51 21 -62 81 -93 -7 45 86 206 -253 99 -235 32 123 -187 79 -192 -54 -25 170 132
2096 132 19 57 -65 8 -186 153 -120 37 -203 77 -17 182 254 -74 -96 27 63 -191 24 105 -49 141
2118 141 -95 -310 -73 60 250 -39 105 144 286 -140 34 42 39 284 4 -27 72 269 -236 121 228 123
2140 123 70 -137 -63 -132 -115 79 -197 -153 -278 -183 -195 10 -75 -106 95 267 162 72 -220 38 -71 40 -133
2163 -133 152 11 -65 -176 -263 90 45 -237 -89 71 146 -34 -229 33 -70 -31 -140 -42 8 22 49 -6 -38 247
2187 247 148 178 -91 -66 -159 5 -123 -125 50 32 21 235 62 168 54 -48 -207 200 90 67 36 -193 59
2210 59 37 194 85 9 77 145 123 6 59 185 82 75 -60 -127 -99 22 157 -2 15 -68 4 93 -187 8 98
2235 98 -103 148 0 133 143 -36 -121 -124 18 -293 105 127 -61 -56 -261 -179 154 44 2 123 108 3 -32 -91
$$ packed form
2073b2p8J52j03P2q3J43j74Q6N2M1J20m59L52l34K67R1l10K66k71J38K9J95l8
2096A32j13L8j22P3j94L39k73J57k40K80r4J99P2l28k2J23L6k54K15Q1j54J90
2118A41k36k15K37J33J90k89J44L9J42m26J74QlK45k80l1R9J97n05L57J07j05
2140A23n3k07P4o9J7J94k76M4j25R5j2K05q5l1K01J72j05r0k92K58j09J11j73
2163a33K85j41p6j11q7L53m5k82J48J60P5j80j95K62j03L9j09R8N0J4K7n5l2K85
2187B47r9L0k69K5r3J64j28kJ75j8j1K14j73J06j14j02j59M07j10k3l1k29K52
2210E9k2J57j09p6O8O8k2j17N3J26j03pj35o7K8J21J35j59J7q3P2Q9k80J95R0
2235I8k01K51j48J33J0j79q5lJ42l11L98K2j88Nk05Q2L33j10m2J21j5j05l5n9
$$ plain form
2259 -91 -243 143 59 -243 -143 -107 56 217 112 -201 -143 -51 -63 -48 -60 50 132 -247 224 80 -159 14 -227
2282 -227 -169 -120 -108 -48 -86 59 172 279 30 -169 -5 133 -103 108 -42 48 100 81 26 -68 251 148 -49
2305 -49 -57 -68 -218 -32 134 0 15 146 -98 -4 108 -1 80 -88 -78 -8 -187 84 163 -128 -46 -166 -87 -146
2329 -146 -76 116 47 121 115 250 222 -205 99 -91 37 42 58 -57 -109 -5 75 93 149 -125 10 -26 30 -27 197
2354 197 112 -98 -102 22 111 212 101 -129 -149 2 38 -208 -206 -204 -57 53 -29 16 -133 -37 43 71 -5 -129 181
2379 181 46 141 -38 130 79 -108 -1 -196 -83 177 -38 83 -166 -147 70 -121 -113 -187 -121 -1 -220 -15
2401 -15 96 -48 -92 -15 -91 -163 31 91 -168 146 -164 -111 9 -25 63 -47 95 -168 -29 -124 -15 93 -118
2424 -118 21 5 -69 72 -22 -132 32 339 62 -92 -87 -244 96 2 -2 0 128 31 -21 159 -129 29 -112 11
$$ packed form
2259i1j52L86q4l02J00L6J63J61j05l13N8R2j2J5j2J10Q2l79M71j44k39J73k41
2282b27N8M9J2O0l8J45J13J07k49j99J64J38k36K11j50R0N2j9n5r4L19j03j97
2305d9qj1j50J86J66j34J5J31k44R4J12j09Q1j68J0P0j79K71P9k91Q2j20P9n9
2329a46P0J92o9P4oJ35k8m27L04j90J28NJ6j15n2J04Q0J8N6k74J35l6N6n7K24
2354A97q5k10mJ24Q9J01j11k30k0J51L6k46KKJ47J10q2M5j49R6Q0K8p6j24L10
2379A81j35R5j79J68n1j87J07j95J13K60k15J21k49J9K17j91Qp4O6J20k19K05
2401a5J11j44m4P7p6p2J94O0k59L14l10N3J20l4Q8j10J42k63J39r5J09J08k11
2424a18J39j6p4J41r4j10J64L07k77j54Nj57L40r4mKJ28r7n2J80k88J58j41J23
$$ plain form
2448 11 -110 256 72 -1 63 -26 106 109 -94 43 -13 3 48 -16 -162 -195 -110 9 82 -31 -40 123 150 259 276 -14
2474 -14 32 -57 97 117 39 -134 -121 -61 88 -126 162 -108 -107 -9 -211 63 -46 -135 -81 84 -85 46 -103 -92
2498 -92 80 -46 191 162 319 149 45 204 64 -34 -56 88 -38 98 -26 -118 -99 -99 183 -42 3 -135 -96
2521 -96 -4 -51 164 -105 135 132 114 -44 181 47 79 189 66 313 45 78 -31 55 117 -109 153 63 123 -99
2545 -99 112 -24 -25 82 108 151 -213 -3 -36 122 -51 179 84 166 119 -198 23 -80 -99 189 -104 316 -186
2568 -186 62 121 163 -115 24 80 -106 -121 83 7 -407 -152 -44 -40 14 -51 -36 1 244 -174 -27 -24 118 164 -86
2593 -86 -133 -371 -178 -97 7 -104 44 -44 113 -49 82 28 77 29 -75 -7 -204 -87 7 -165 165 -184 88
2616 88 132 -127 -16 26 21 -144 -85 -91 30 -209 -140 58 148 352 -169 -62 -44 -86 -149 171 27 -117 70 12 77
$$ packed form
2448A1j21L66j84p3O4q9J32Lk03J37n6J6M5o4j46l3Q5J19P3j13rJ63K7J09J7k90
2474a4M6q9J54K0p8j73J3O0J49k14K88k70JR8k02K74j09q9N4J65j69J31j49J1
2498i2J72j26K37k9J57j70j04J59j40r8k2J44j26J36j24r2J9%K82k25M5j38L9
2521i6R2m7K15k69K40lj8j58K25j34L2J10j23K47k68L3j09Q6O2k26K62r0O0k22
2545i9K11j36jJ07K6M3l64K10l3J58j73K30r5Q2m7l17K21j03j9K88k93M20n02
2568a86K48N9M2k78J39N6j86j5K04p6m14K55J08MN4o5J5L7K43m18J47LJ42M6k50
2593h6m7k38J93Q1J04j11J48q8J57j62J31n4M9m8j04O8j97J17R4j72L30l49K72
2616H8M4k59J11M2nj65N9oJ21k39O9J98R0K04n21J07J8m2o3L20j44j44J87n8O5
$$ plain form
2641 77 -217 6 -12 -108 107 -247 70 -92 102 -118 -182 229 83 47 -130 -176 -78 -5 -30 -223 115 -126 173
2664 173 14 -19 193 232 -95 179 63 229 209 -24 -238 -144 73 24 -4 208 -131 201 -35 179 -104 -49
2686 -49 -68 -19 -83 -22 -40 109 -47 120 49 -235 137 -29 -203 113 93 74 56 -18 161 -174 83 -305 189 41
2710 41 90 -101 -198 -132 73 -5 -153 -100 -154 194 -157 -117 107 -5 -72 42 138 -151 -211 24 -180 -72 140 106
2734 106 39 50 -47 104 80 45 -138 -135 178 -46 57 -178 220 78 -299 -69 76 170 -98 115 -182 -44 7
2757 7 47 -104 27 -4 -62 8 117 -111 -84 157 26 -116 2 -217 -46 -3 -69 38 353 -72 108 125 -34
2780 -34 -30 -13 -140 -58 160 116 -100 -125 -157 48 -249 101 -138 -52 130 27 157 -51 76 71 -56 -110 -36 -5 152
2805 152 -98 61 -119 -183 81 78 239 -142 154 61 232 106 42 81 -24 -65 57 -132 199 119 -54 -60 -160
$$ packed form
2641G7k94K23j8r6K15l54L17j62J94k20o4M11j46l6j77m6R8P3k5j93L38k41K99
2664A73j59l3K12L9l27K74j16J66k0k33k14R4K17m9k8K12l39L32k36K14k83N5
2686d9j9M9o4O1j8J49j56J67p1k84L72j66j74L16k0j9j8p4J79l35K57l88M94j48
2710D1M9j91r7O6K05p8j48N3n4L48l51M0K24j12o7J14R6k89o0K35k04J08K12l4
2734A06o7J1r7J51k4l5j83LL13k24J03k35L98j42l77K30J45R4k68K13k97J38N1
2757GM0j51J31l1n8P0J09k28K7K41j31j42J18k19J71M3o6J07L15m25J80J7j59
2780c4MJ7j27Q2K18m4k16k5l2K05k97L50k39Q6J82j03J30k08J27nj27n4P4L1J57
2805A52k50J59j80o4K64lJ61l81K96r3J71j26o4L9j05m1J22j89L31q0j73oj00
$$ plain form
2828 -160 -77 12 116 -181 15 114 -26 48 -4 -140 192 -43 -48 70 28 255 -195 -19 37 71 -22 44 37 -43 -82
2853 -82 32 43 -211 111 8 -141 12 133 -53 -14 -91 95 215 -112 -309 115 -179 -146 256 11 -53 176
2875 176 -23 36 -18 -53 -329 33 -73 -323 -203 75 91 -172 14 -158 84 29 -168 -97 47 109 -5 -167
2897 -167 -10 -60 32 16 -29 -82 151 12 -33 86 -100 180 200 102 107 141 256 -47 -53 -63 -44 76 -56 235 -39
2922 -39 53 32 -112 6 -172 -144 46 -104 -130 108 68 -305 79 42 166 48 14 -116 55 59 143 36 83 190
2946 190 -89 -198 4 275 -2 -138 5 -246 -128 -305 -206 -25 -70 257 -87 75 -97 -139 113 -102 -90
2967 -90 -117 -42 -110 180 277 95 197 56 -124 -49 -11 -176 44 -30 -93 75 -199 -87 60 196 -238 -42 10
2990 10 269 -96 -18 78 -89 38 10 -101 -145 27 -94 17 77 -111 122 -23 -172 170 132 -60 76 143 79
$$ packed form
2828a60Q3Q9J04k97J96R9j40P4n2j36L32k35nJ18m2K27m50J76N6L4r3O6pq0l9
2853h2J14J1k54L22j03j49J53J21j86L9p7J86J20l27j97M24k94L3M02k45o4K29
2875A76j99N9n4l5k76L62j06k50J20K78J6k63J86j72K42n5j97P1J44O2j14j62
2897a67J57n0R2j6m5n3K33j39m5J19j86K80K0r8NL4J15l03oj0J9J20j32K91k74
2922c9R2k1j44J18j78K8J90j50k6K38m0l73L84l7J24j18l4j30J71MQ4j07M7J07
2946A90k79j09K02K71k77j36J43k51J18j77R9J81m5L27l44J62j72m2K52k15J2
2967i0k7P5o8K90R7j82J02j41j80P5L8j65K20p4o3J68k74J12J47J36m34J96N2
2990A0K59l65P8R6j67J27k8j11m4J72j21J11O0j88K33j45j49L42l8j92J36O7o4
$$ plain form
3013 79 -14 97 -283 268 -133 24 75 -83 28 199 170 -117 44 -151 61 -13 26 -231 1 22 35 -51 141
3036 141 217 -113 218 64 -90 -229 16 102 -197 -69 64 74 -175 -13 -145 -108 298 -126 84 45 2 41
3058 41 -113 -43 266 127 -25 -182 25 -145 -17 -284 -106 -64 103 -71 70 122 -70 -137 145 -69 21 -15
3080 -15 85 -182 68 157 15 173 -38 -129 149 -54 -344 -54 97 91 1 136 -297 -29 81 411 -176 27
3102 27 111 -244 -89 -17 11 76 206 -154 -58 -81 38 72 -26 223 -2 59 -170 -18 97 -59 42 -278 16
3125 16 65 -202 -10 -16 -44 -171 -317 -237 101 -47 -184 -47 -196 -63 -168 -124 7 3 -39 -325 11 -323 77
3148 77 202 62 -83 204 -138 107 -107 -127 -159 42 26 30 -197 226 97 -130 168 -7 -27 64 20 -69 64
3171 64 75 192 248 261 115 170 -6 -131 30 196 -216 218 -384 -302 245 76 -137 -372 6 88 -24 -201
$$ packed form
3013G9r3J11l80N51m01J57N1j58J11J71k9k87J61j95K12p4L9k57K32K1J3q6J92
3036A41P6l30L31j54j54j39K45Q6k99J28J33J0k49J62j32L7M06m24K10l9m3L9
3058D1j54P0L09j39j52j57K07j70J28k67J78M2J67j74J41N2j92o7K82k14R0l6
3080a5J00k67K50Q9j42J58k11r1K78k03k90K90J51or0J35m33K68J10L30n87K03
3102B7Q4l55J55P2K8O5J30l60R6k3J19L4r8K49k25O1k29J52J15j56J01l20K94
3125A6M9k67J92ok8j27j46Q0L38j48j37J37j49J33j05M4J31mm2k86L36l34M00
3148G7J25j40j45K87l42K45k14k0l2K01j6Mk27M23j29k27K98j75k0R1m4q9J33
3171F4J1J17N6J3j46N5j76j25J61J66m12M34o02Q2N47j69k13k35L78Q2j12j77
$$ plain form
3193 -201 0 11 197 103 -109 33 204 122 -25 24 6 4 103 42 123 54 69 -93 -257 21 285 20 -73 9 143
3218 143 -137 -54 -32 152 71 135 -45 8 -252 24 45 -10 -93 -168 -30 122 -99 -155 130 0 -102 -72 -132 -169
3242 -169 29 262 -142 -11 193 -43 -5 305 31 170 -310 148 -40 -168 -152 -33 215 92 70 130 4
3263 4 21 -112 54 158 -85 -61 196 -104 75 -80 -67 -43 -233 12 19 78 54 -79 -65 150 -232 -153 -64 -259
3287 -259 -4 -163 -111 31 -39 109 33 -129 30 104 -133 15 -50 -45 199 -53 106 -110 52 119 175 86 22 64
3311 64 -101 -141 14 -91 -76 -64 33 1 111 -87 -72 216 138 151 201 266 91 179 54 2 -78 -160 -262 143 42
3336 42 -166 37 229 112 31 191 62 9 -47 195 -14 -2 -192 56 -90 -43 22 -237 132 -182 -184 38 -161
3359 -161 -52 -187 -137 187 -93 -59 -91 -48 60 -84 -218 20 70 -88 -223 -36 -31 65 90 -41 203 225 30
$$ packed form
3193b01K01J1J86r4k12J42J71q2j47M9j8kR9o1Q1o9J5j62j64K78K64k65r3Q2J34
3218A43k80Q3K2J84q1O4j80N3k60K76K1n5q3p5J38J52k21n6K85j30j02L0o0l7
3242a69J98K33m04J31K04k36L8L10k74J39m80M58j88j28J6J19K48j23k2O0j26
3263DJ7j33J66J04k43K4K57l00J79j55J3K4j90K45PN9k4j33J4K15l82P9Q9j95
3287b59K55j59N2J42p0J48p6j62J59P4k37J48o5NK44k52J59k16J62O7N6q9o4M2
3311F4j65m0J55j05J5J2R7l2J10j98J5K88p8J3N0O5j75Q8j25n2q0q2j02M05j01
3336D2k08K03J92j17q1J60j29n3n6K42k09J2j90K48j46M7O5k59L69l14kK22j99
3359a61J09j35N0L24k80L4l2M3J08j44j34K38N0j58j35J87NR6K5j31K44K2j95
$$ plain form
3382 30 109 220 -77 108 38 204 -130 145 -133 88 34 -125 94 113 -57 238 -70 -88 -115 61 132 50 64
3405 64 72 26 -105 173 143 58 -13 220 -90 125 116 -100 199 -107 -247 55 -41 134 50 21 -145 43 -132 66
3429 66 158 -234 71 -161 24 75 30 72 -177 7 -188 105 -301 105 195 66 -86 -148 -32 -63 113 -258 -120
3452 -120 -118 96 66 -273 165 5 3 -126 185 -130 -272 -91 107 -84 -190 166 -220 39 -6 6 -140 1
3474 1 -69 51 308 -124 -305 90 73 -94 -102 -155 -47 79 -64 77 -132 97 36 216 132 -109 167 -25 -86
3497 -86 145 75 133 -234 238 143 193 -238 -79 86 9 27 58 -84 -161 135 -131 44 36 -95 -147 -135 -130 -143 154
3522 154 42 130 -88 -95 93 -147 162 128 3 -84 7 -96 -58 113 446 45 217 151 119 -50 156 133 -142
3545 -142 -62 34 -158 -105 66 40 -213 -230 113 50 45 191 -82 62 -125 -50 -61 -137 100 -45 -163 -114 -72 12 76
$$ packed form
3382C0P9J11k97J85p0J66l34K75k78K21n4j59K19J9j70K95l08j8k7J76P1q2J4
3405F4Qm6j31K78l0q5p1K33l10K15rk16K99l06j40L02r6J75q4k9j66J88j75J98
3429F6R2l92L05k32J85N1m5M2k49J84j95K93m06M06R0j29j52o2J16l1J76l71J38
3452a20KK14l0l39M38j60kj29L11l15j42J81J98j91j06L56l86K59m5J2j46J41
3474Ap0J20K57m32j81L95j7j67qn3J08J26j43J41k09K29o1J80q4k41K76j92o1
3497h6K31p0N8l67M72r5N0m31J59J65p7J8L1j42p7K96k66J75qj31n2J2Nj3K97
3522A54j12Q8k18pJ88k40L09l4j25q7R1j03L8J71L33m01J72o6l2j69K06k3k75
3545a42Q0R6j92N3J71k6k53j7L43o3nJ46k73J44j87P5j1p6K37j45j18M9M2Q4O4
$$ plain form
3570 76 -157 121 -65 -160 -85 -210 -291 194 -106 -126 290 -183 178 -117 -402 90 -179 26 152 -55 147 -13
3592 -13 -233 51 -294 63 -97 -113 27 -156 140 -46 -25 45 -130 368 145 -91 111 11 -23 104 -83 77
3614 77 210 -3 55 -26 0 289 74 135 -140 203 21 192 -280 226 139 97 70 -284 202 -36 75 182 313
3637 313 203 -41 353 -132 115 132 145 91 -213 87 -256 44 -49 179 -1 103 -82 -19 -69 47 64 -53
3659 -53 211 -118 -11 -18 -239 140 24 160 -157 -17 -134 -186 210 -51 125 104 -98 -293 169 -71 76 135
3681 135 -173 3 13 33 -188 -86 -199 51 -61 4 -212 -85 386 -13 -29 -20 62 -13 -117 125 20 330 -231
3704 -231 -125 -22 -116 -27 -1 -129 -231 -31 5 -94 -24 -1 168 38 167 -26 20 40 -39 -90 50 -64 -207 -1
3728 -1 -38 258 40 174 -176 -204 115 59 183 65 50 6 67 221 -227 229 31 75 -40 74 223 98 156
$$ packed form
3570G6k33K78j86r5P5j25q1M85l00k0M16m73L61k95k85M92k69K05J26k07K02j60
3592a3k20K84l45L57j60j6J40j83K96j86K1P0j75M98k23k36K02j00l4J27j87J60
3614G7J33k13N8q1K6K89k15O1k75L43j82J71m72N06q7m2k7l54M86k38J11J07J31
3637C13j10k44L94m85K47J7J3n4l04L00l43L00r3K28j80J04j85O3n0J16J7j17
3659e3K64l29J07pk21L79j16J36l17J40j17n2L96k61J76k1k02j95M62k40J47N9
3681A35l08J76J0K0k21J02j13K50j12O5k16J27M71l99j6RQ2p5j04K42j05L10n61
3704b31J06J03r4Q9K6j28j02K00L6r9P0K3J69j30J29j93M6K0p9n1J40j14j43K06
3728al7K96k18J34l50k8L19n6J24j18j5m4O1J54m48M56j98M4j15J14J49j25N8
$$ plain form
3751 156 75 33 55 325 -161 78 89 -119 158 95 -18 156 182 166 -277 40 26 42 26 172 129 175 20 216
3775 216 -116 -69 135 247 163 -131 32 22 64 -249 -86 -289 -151 -157 -264 16 -208 -81 -245 -384 40 4
3797 4 -30 -215 14 -179 -102 -163 -281 -6 -112 -283 -240 114 -41 -58 -155 -38 137 -42 -165 -289 -86 -90 75
3820 75 -42 -109 -67 -220 206 -103 81 -160 -381 -244 -265 -57 108 81 -126 205 103 -157 -24 -85 141 120
3842 120 139 -134 -80 -63 287 202 105 120 -14 5 117 -172 101 90 133 -158 18 262 69 213 -154 160 158 271
3866 271 43 81 113 249 16 141 1 13 97 -13 -182 -95 165 257 -129 -71 -25 262 158 -201 -185 51 135
3889 135 183 157 29 -211 -62 -80 135 174 -208 -101 98 -206 5 -111 23 110 91 292 -200 5 -155 -149 -29
3912 -29 -139 -241 -153 -92 31 34 8 58 -116 142 -105 -86 -195 -242 -242 -137 -277 41 -71 57 -151 32 68 206
$$ packed form
3751A56q1m2K2K70m86K39J1k08K77o3j13J74K6j6m43L17j4J6j6J46m3M6j55J96
3775B16l32M7K04J12q4k94J63j0M2l13J63k03J38oj07K80k24J27j64j39M24l6
3797Dl4j85K29j93P7o1j18K75j06j71M3L54j55j7r7J17J75j79j23j24K03mJ65
3820G5j17o7M2j53M26l09J84k41k21J37k1K08J65k7k07L31j02k60J33o1K26k1
3842A20J9k73N4J7L50q5r7J5j34J9J12k89K73j1M3k91J76K44j93J44l67L14kJ13
3866B71k28L8L2J36k33J25j40J2Q4j10j69Q7K60R2l86N8M6K87j04l59J6K36Q4
3889A35M8k6j28k40J49j8K15L9l82J07J99l04K11j16J34Q7j9K01m92K05j60OJ20
3912b9j10j02Q8O1J23Lk6N0j74K58k47J9j09m7%J05j40L18j12J28k08J83L6J38
$$ plain form
3936 206 55 -17 -71 47 -25 -103 18 118 -163 41 23 152 -13 -111 -57 28 38 -95 -69 -99 65 37 244 -125
3960 -125 -77 -32 187 344 48 -195 -72 164 -42 29 94 347 40 30 63 269 165 -339 99 182 37 -96
3982 -96 108 -34 244 405 -111 170 -67 374 2 -13 0 -186 21 -35 -57 -119 -28 -17 -22 2 -378 154 58 -156
4006 -156 -168 58 173 -58 176 -71 -90 4 -8 11 113 -64 -41 -126 -98 -139 -220 -29 88 -18 -173 -167 92 22
4030 22 221 -61 -14 171 -79 101 21 -39 -68 -195 82 -84 117 -63 -129 87 237 -210 -52 -149 -90 159 137
4053 137 -237 207 -89 -142 127 -13 0 -53 -103 -112 154 146 252 -32 176 -214 -52 69 29 128 1 -56 -36 6
4077 6 130 81 -46 112 23 -91 136 17 -32 -109 -58 29 298 71 24 -202 -183 -97 203 306 -205 -205 222 180 -94
4102 -94 -10 18 21 -129 17 23 -31 -104 318 37 8 -126 295 115 27 1 -84 104 -191 -12 79 143 -121 143 63
$$ packed form
3936B06j51p2n4J18p2p8J21J00k81K04j8J29j65r8N4Q5J0j33K6l0J64k8K07l69
3960a25M8M5K19J57k96k43J23K36k06P1O5K53l07j0L3K06j04n04M38Q3j45j33
3982i6K04j42K78J61n16K81k37M41l72j5J3j86K07n6k2o2R1J1nK4l80N32r6k14
4006a56j2K26J15k31K34k47j9R4j2J9J02j77K3q5K8m1q1J91J17j06j55OK59p0
4030B2J99k82M7J85k50J80q0o0k9j27K77j66K01j80o6K16J50m47J58r7N9K49k2
4053A37l74M44k96n3K69j40J3n3n0rK66qJ06k84K08l90J62J21m0R9j27n7K0M2
4077FJ24m9j27J58q9j14K27j19m9p7N1Q7K69k27m7k26J9Q6L00J03n11%M27m2k74
4102i4Q4K8Lj50J46On4p3M22k81k9j34M21j80q8k6q5J88k95J79R1O4k64K64q0
$$ plain form
4127 63 -107 -26 -152 76 79 39 -83 127 -64 243 86 222 -121 -86 8 171 81 -213 178 -84 35 136 -160
4150 -160 45 -120 -1 4 268 -63 7 80 97 22 112 -188 135 -42 -94 155 -1 -172 15 -109 -35 -135 -44
4173 -44 -182 -55 -18 -127 -128 -48 225 -81 107 -24 -130 -37 59 -209 211 19 -63 -55 65 86 -133 29 -104 -156
4197 -156 148 160 -188 -30 187 107 -48 -158 -96 -51 -30 -75 -99 -24 97 -69 -23 19 -42 246 238 143 -189 11 67
4222 67 23 -46 245 -208 41 55 -113 164 139 27 -126 290 40 -122 -175 -104 100 108 -17 170 -91 183 -27
4245 -27 3 -99 -42 191 226 -273 190 75 -187 -103 42 -42 -149 71 -101 19 -204 -65 29 -113 8 -116
4267 -116 -198 -10 -56 137 -94 8 -66 -35 -23 22 127 -107 -90 -86 125 -36 55 325 -111 164 -1 -13 205 82
4291 82 -42 -29 -46 -77 105 172 139 36 42 118 -39 -114 -74 -44 -111 27 -59 272 136 -75 -65 49 -95 -69 -126 -150
$$ packed form
4127F3j70Q1j26K28Lm0j22K10j91L07j57J36l43L5R4J63r0k94L91k62J19J01k96
4150a60K05j65J19NK64l31P0P3J7p5R0l00L23j77n2K49j56j71J87j24P4j00R1
4173d4j38J27L7j09jQ0K73l06J88j31j06R3R6k68M20j92q2QJ20K1k19J62j33n2
4197a56L04J2l48J58K17q0j55j10O2M5K1m5k4P5J21j66M6M2o1K88qr5l32K00N6
4222F7m4o9K91m53K49J4j68K77k5j12j53M16k50j62n3P1K04Qj25J87k61K74k10
4245b7L0j02N7K33L5m99M63j15k62Q4J45q4j07K20j72J20k23J39R4j42J21j24
4267a16q2J88m6J93k31J02p4L1J2M5J05k34J7MK11j61R1K70m36K75j65j2K18j23
4291H2j24J3j7l1J82O7l3j03OP6j57p5M0L0o7J38q6L31j36k11J0J14j44K6n7k4
$$ plain form
4317 -150 -121 -130 96 -7 139 96 -198 -92 30 -172 -299 162 125 -227 62 133 -56 320 -57 239 27 -150
4339 -150 -221 -70 -45 3 22 139 72 -35 -55 50 -153 -13 83 99 -136 32 -27 -281 -61 -157 150 35 -65
4362 -65 29 232 -41 16 130 146 -108 11 -45 27 264 -186 -23 199 12 -10 80 7 -21 -118 190 130 23 -353
4386 -353 -174 111 11 -176 51 -165 -256 -74 100 -111 7 -58 276 -33 -117 -63 173 -180 -36 15 216 -100
4408 -100 22 114 -101 -40 69 17 -361 109 -232 -4 -76 88 -130 19 -93 -11 -159 55 132 27 -59 238
4430 238 -204 79 -33 -164 21 38 -176 76 102 56 -83 7 154 -133 40 -91 -118 43 23 108 23 -68 -153
4453 -153 77 89 66 58 0 44 12 159 -9 36 149 160 -1 -1 -44 57 145 -56 7 -132 -1 -28 -171 -2 69
4478 69 -128 160 -9 86 95 221 -140 -67 -103 125 126 42 125 145 132 -122 -29 129 23 57 128 -78 49 -68 28
$$ packed form
4317a50K9rK26j03J46m3k94J06J22k02j27M61l7l52K89P1j89L76l77K96k12j77
4339a50p1J51K5M8J9J17o7j07k0J05k03J40R6J6k35J68n9k54K20r6L07j15j00
4362f5R4K03k73N7J14J6k54J19n6P2K37m50J63K22j87k2R0p3k8r7L08o0j07l76
4386c53J79K85j00j87K27k16r1J82J74k11J18o5L34l09q4N4K36l53J44N1K01l16
4408a00J22R2k15O1J09n2l78M70l41K28p2J64k18J49j12Q2j48K14P7j05q6K97
4430B38m42K83j12j31J85J7k14K52K6m6j39R0J47k87J73j31k7J61k0Q5q5r1q5
4453a53K30J2k3qn8M4l2J47j68M5J13J1j61%m3J01Q8k01O3j39J31k7j43J69P1
4478F9j97K88j69R5RJ26l61P3l6K28Jq4Q3K0j3k54R3J58j06L4P1k06J27j17R6
$$ plain form
4503 28 -21 77 158 121 -59 201 301 -98 228 -15 -131 -29 52 -225 -142 -45 8 43 203 131 -112 107 -103 -298
4527 -298 -39 88 170 67 26 -104 349 -79 -295 -19 -44 33 -197 -350 -65 46 -47 -110 14 -105 63 149
4549 149 120 172 204 -167 -138 7 -131 -82 6 67 -161 -50 97 21 324 -50 -145 -39 -53 75 -176 176 8
4572 8 66 30 140 -170 -5 -89 -167 134 87 206 87 12 -64 61 213 83 -45 -16 -116 84 -97 -84 -9 -139
4596 -139 -94 53 -20 -90 174 -108 158 21 -52 -283 46 20 -76 45 136 284 -93 83 -26 -104 -84 91 245
4619 245 48 44 27 48 -83 31 -72 -10 58 153 82 63 -34 100 -1 -157 15 -138 -255 8 -131 -19 83
4642 83 -22 -59 81 109 -95 -213 -167 219 163 -117 -16 -16 83 -79 -15 114 -68 -57 117 -152 -15 251 82
4665 82 93 -99 -75 -134 -34 -173 -36 -89 139 177 -72 63 47 44 73 -3 97 -109 -119 128 92 61 -63 -181 126
$$ packed form
4503B8m9R8Q1l7j80K60J00l99L26k43j16J02Q1k77Q3R7N3L5J60p2k43K19k10j95
4527b98K59J27Q2j03m1j30M53m28k16K76k5P7k30j53K85J11r3o3J24j19J68Q6
4549A49k9N2L2l71K9J45j38M9Q8O1k28J11J47p6L03l74r5J06j4J28k51L52j68
4572HN8l6J10l10J65q4p8L01m7J19j19p5p6J25J52j30j28K9j00K00j81J3P5j30
4596a39M5J47p3p0K64k82K66j37p3k31L29k6r6J21R1J48l77J76j09p8K0J75J54
4619B45j97mj7K1j31J14j03O2O8R5p1j9r7J34j01j56J72j53j17K63j39J12J02
4642H3j05l7J40K8k04j18M6L86n6k80J01%R9j62O4J29j82J1J74k69J37K66j69
4665H2J1j92K4n9J00j39J37n3K28L8k49J35j6lK9p6J00k06j0K47l6l1j24j18L07
$$ plain form
4690 126 -143 39 140 -14 -113 -60 33 -17 97 -13 -308 -10 103 -31 114 11 48 -285 -45 -103 -113 -119 51
4713 51 139 135 90 62 3 -71 144 -6 71 -4 -202 -222 -50 79 -117 -138 25 -145 -83 -57 -82 4 130 8 -140
4738 -140 -267 89 -36 -137 -119 69 -258 188 -99 -25 4 -39 -49 70 47 88 10 111 -139 106 -17 -214 62
4761 62 -23 92 -15 316 -99 71 -115 -113 17 -102 -41 91 -92 -244 -86 131 -101 -149 181 -226 -152 -102 -48
4784 -48 53 99 -70 -2 -21 15 -12 4 48 91 62 19 44 110 166 -63 159 124 -80 52 253 54 -77 -135 150
4809 150 97 -167 -31 5 -46 -146 -47 -167 -156 0 -86 -108 -160 -102 21 -139 -275 -16 -72 81 -27 -216 -101
4832 -101 206 167 112 183 189 -66 -19 71 150 -85 -194 -11 60 145 -20 -47 -25 -150 16 17 52 -224 89 -170 -310
4857 -310 5 147 -87 -8 8 -104 108 18 47 8 -86 -9 8 -191 -118 -19 0 -176 17 42 59 90 166 28 67
$$ packed form
4690A26k69J82J01j54r9N3R3n0J14j10k95K98J13j34J45j03L7l33K40n8j0oJ70
4713E1Q8mm5k8n9p4K15j50P7p5j98k0J72J29j96k1J63j70O2K6k5Q6J26j22j48
4738a40j27L56j25j01J8J88l27M46k87P4K9m3j0J19k3M1p8J01k50K45j23j97K76
4761F2q5J15j07L31m15J70j86KJ30j19O1J32j83j52J58K17k32m8L30m07P4N0N4
4784d8J01M6j69O8j9L6k7J6M4M3k9m3K5O6N6k29K22l5k04J32K01j99j31n8K85
4809A50n3k64J36L6n1j00R9j20J1J56q6k2n2N8J23j60j36K59n6J53j08j89J15
4832a01L07l9n5P1Ok55M7R0P9k35j09J83P1Q5j65k7K2j25J66JL5k76L13k59j40
4857c10L15J42k34P9J6j12K12r0K9l9r4P7J7j99P3R9J9j76J93K5J7L1P6j38L9
$$ plain form
4882 67 10 43 43 142 -95 -116 -79 -48 157 -110 27 117 62 217 111 83 -36 121 195 38 45 -61 169 91 -187
4907 -187 81 41 -69 -32 -30 157 12 -38 108 86 58 -92 -237 -100 -109 91 -21 -5 -50 35 136 -56 17 33 -60
4932 -60 -123 -17 -75 372 134 68 130 92 -51 37 104 -82 41 -70 -64 45 -54 104 169 158 -142 -62 -86 66 205
4957 205 4 17 151 -70 -30 -76 -172 -119 -67 -58 31 100 -63 -51 25 -129 17 -46 -5 -131 -208 84 -72 12 -20 29
4983 29 -147 142 6 -141 19 46 -3 -82 2 141 -25 -104 -106 181 -62 -2 19 117 123 -341 20 -84 -40 173 175
5008 175 -27 192 -41 139 -69 -69 -29 63 162 10 96 119 -98 38 29 112 -61 66 -156 -42 35 64 -24 -53 45
5033 45 212 -165 238 51 6 -50 -35 -58 161 137 -143 -83 -258 67 67 -226 -102 115 328 -141 195 -64 -41
5056 -41 -70 -91 -18 120 -41 83 -94 117 -54 36 54 -34 163 17 -92 -74 112 -29 -23 -32 53 -101 115 24 16
$$ packed form
4882F7n7L3%R9k37k1L7L1K05k67J37R0n5J55j06k8j19J57P4j57Pj06K30p8k78
4907a87K68m0j10L7KJ87j45n0J46k2k8j50j45J37rK00j12J6m5Q5J01j92P3J6r3
4932f0o3J06n8M47k38o6O2l8j43Q8O7j86J23j11OJ09r9J58O5j1l00Q0k4J52J39
4957B05k01J3J34k21M0m6r6N3N2RQ9O9j63J2P6j54J46o3M1j26p7K92j56Q4l2M9
4983B9j76K89j36j47J60K7m9p9Q4J39j66p9kK87k43O0K1R8Om64L61j04M4K13K
5008A75k02K19k33J80k08%M0R2R9j52Q6K3k17J36rQ3j73J27k22J14P7K9q8k9R8
5033D5J67l77M03j87m5n6J5k3K19k4k80O0j75L25%k93J24K17K13m69L36k59K3
5056d1k9k1P3J38j61J24j77K11j71R0J8q8J97j46j09J8J86j41OrQ5j54K16r1q
$$ plain form
5081 16 116 -146 172 14 -3 -281 6 -18 -72 -197 -66 -110 189 77 -134 -174 -37 -176 104 56 3 -100 278
5104 278 24 85 104 -170 81 -29 192 -105 -54 -37 -101 80 118 -155 -95 25 66 25 35 -49 51 -48 104 21
5128 21 -101 86 196 36 -90 29 -22 38 -157 -84 -145 -31 -44 82 23 -48 -95 -54 -115 -153 292 77 -24 -226
5152 -226 -89 99 -48 97 -79 59 275 97 5 140 39 -100 114 -263 -88 187 -152 70 -101 165
5172 165 -3 -42 40 -73 -71 -308 -134 -89 99 2 -76 121 -69 -19 -22 -23 -138 63 35 106 -1 170 -65 122 -115
5197 -115 -43 89 -42 168 -160 -17 -88 -301 -3 -139 -147 -183 136 30 -7 -3 159 53 -17 110 128 57 -178 15
5221 15 190 108 50 271 174 273 98 -30 162 21 199 -323 119 13 105 68 -242 104 48 -79 -68 -217 114
5244 114 78 -20 247 -80 -131 -60 141 108 -31 -133 -112 19 91 164 -31 -2 -217 -179 -192 -26 -285 141 29 159
$$ packed form
5081A6J00k62L18j58j7k78K87k4n4j25J31m4K99j12k11m0J37j39K80m8n3j03L78
5104B78k54O1J9k74K51j10K21k97N1J7o4J81L8k73O0J20M1m1J0q4J00r9J52q3
5128B1j22J87J10j60j26J19n1O0j95P3o1J14j3J26n9p1m7M1o1l8M45k15j01k02
5152b26J37J88j47J45j76J38K16j78r2J35j01j39K14l77J75K75l39K22j71K66
5172A65j68l9Q2j13Kk37J74M5J88r7p8J97j90N0ljj15K01k8P1j07J71k35J87k37
5197a15P2J32j31K10l28J43p1k13K98j36ql6L19j06l7MJ62j06p0J27J8p1k35J93
5221A5J75q2n8K21r7R9j75j28J92j41J78n22M42j06R2l7l10L46n6j27J1j49L31
5244A14l6r8K67l27n1P1K01l3j39j02K1J31P2P3j95K9k15L8j3J66k59M26j12J30
$$ plain form
5268 159 -242 47 -55 51 100 -203 -68 -10 49 7 -111 41 106 24 -53 87 -104 173 -9 -159 -51 4 123
5291 123 -168 48 -1 201 -186 -151 -80 -87 87 -245 -172 -159 54 -75 -66 119 61 40 213 -31 -31 30 -135 22 -173
5316 -173 -143 166 -67 -83 47 14 245 50 -81 -49 17 -16 16 55 -91 2 -11 59 156 -28 6 2 175 13 31
5341 31 21 -45 -107 9 -10 -70 28 -82 135 -154 -290 13 -85 209 -104 201 -29 -12 -61 54 -160 62 13 38
5365 38 -101 203 -84 -3 -130 108 40 0 -57 36 43 -28 -158 -100 -135 -245 82 -92 107 16 -70 -79 91 -64 153
5390 153 6 103 -37 -181 133 268 50 23 59 29 -154 -119 138 -135 78 -28 -91 -129 60 -111 21 198
5412 198 -17 -118 13 -96 145 -208 -35 9 -140 96 -31 48 -52 -73 212 53 -153 43 -98 -168 -91 101
5434 101 188 50 -29 -44 186 0 -10 -189 -190 159 -121 133 200 -4 -170 -103 -180 27 -96 18 -72 -39 221 -76
$$ packed form
5268A59m01K89j02J06M9l03J35N8N9m2j18J52O5q2p7J40j91K77j82j50J08N5J19
5291A23k91K16m9K02l87L5P1pJ74l32P3J3K13j29RJ85n8k1J73k44%O1j65J57j95
5316a73L0L09k33j6J30l3K31j95j31L2O6l3L2L9j46R3j3P0R7j84L4mJ73j62J8
5341C1j0o6o2J16j9o0R8j10K17k89j36L03r8K94l13L05k30J7m9J15k14K22m9K5
5365C8j39L04k87Q1j27K38o8m0n7R3Pp1j30N8l5j10L27j74J99r1q6rJ70j55K17
5390A53j47R7j40j44L14J35k18k7L6l0j83L5K57k73K13j06o3l8J89j71J32J77
5412A98k15j01J31j09K41l53J73M4j49K36j27P9j00k1K85j59k06J96j41p0P7J92
5434A01Q7j38p9j5K30j86j0j79jL49k80K54O7k04j66O7p7K07j23J14r0L3K60k97
$$ plain form
5458 -76 -66 194 88 -127 -134 -36 122 173 98 -15 -17 -66 -69 171 113 -9 153 158 136 -110 -46 94 -89 -118 15 -55
5484 -55 -26 -42 13 -65 -11 -234 -122 -72 98 -226 37 24 -186 22 -158 -43 183 -60 105 -64 -79 -27 -233
5507 -233 -173 183 -17 63 225 26 -26 89 144 -52 -40 128 -67 168 -114 -29 -194 -84 96 -84 -101 -2 -85
5530 -85 -181 -534 -124 210 13 96 56 198 -36 288 -67 -51 -92 92 61 -71 70 247 -212 -13 -53 74 163
5553 163 -156 171 -236 -103 198 -263 42 86 84 18 163 -58 -194 -84 63 153 61 130 93 340 192 103 -1
5576 -1 117 0 -107 90 65 123 -236 16 -214 -191 -164 -405 43 -144 31 103 180 66 206 -259 133 -7 16
5599 16 40 -42 -6 -48 50 65 -13 231 -40 16 1 -19 -89 155 193 -115 -184 158 71 118 -55 -137 69 -115 263 -67
5625 -67 184 87 107 -11 -86 340 -14 -107 -240 -220 -236 -149 71 8 36 113 -147 23 -199 257 69 25 240 -70
$$ packed form
5458g6J0K60j06k15pR8J58N1p5j13km9lK40n8j22J62Nk2k46O4J40j83k9J33p0
5484e5K9j6N5p8N4k23J12N0J70l24K63j3k10K08j80J15K26k43J65j69j5N2k06
5507b33O0L56k00Q0J62j99n2J15N5j96J2J68j95K35k82Q5j65J10J80j80j7R9q3
5530h5r6l53M10L34j97Q3m0J42k34L24l55J6m1J84l1j32J41J77m59J99m0J27Q9
5553A63l19L27m07J33L01m61L05M4ko6J45k21j36J10J47R0r2O9l7K47j48q9j04
5576aJ18j17j07J97k5N8l59K52k30K3K7k41M48j87J75P2P7j14J40m65L92j40K3
5599A6K4q2L6m2R8J5p8K44k71N6j5k0p0K44L8l08o9L42q7M7j73q2K06j84L78l30
5625f7K51r7K0j18p5M26l54r3j33K0j6Q7K20o3K8P7k60J70k22M56j88m4K15l10
$$ plain form
5649 -70 63 76 -193 -152 -141 112 98 -176 172 174 -116 53 -61 -89 100 -58 177 -130 -57 27 372 71 -216
5672 -216 201 -49 -143 161 -4 -186 148 -250 -53 -10 102 137 144 106 106 103 -127 75 36 -262 -73 126 93 52
5696 52 -4 -94 81 -102 -121 -159 -274 113 72 144 -113 60 219 -44 55 224 188 44 -111 -41 34 -247 -98 68
5720 68 -40 -147 -50 236 -62 -189 -69 158 -28 -137 -102 19 101 -17 -71 119 -239 -11 -4 -56 -26 -69 174
5743 174 -51 206 -98 69 -58 -32 114 -52 215 140 -74 8 81 -191 -38 -20 60 -134 -136 -200 45 178 185 -53
5767 -53 -39 -80 -86 22 236 83 155 48 74 90 100 -223 -24 -22 -5 -78 -124 -25 -144 31 64 30 38 -17 -201 -27 106
5794 106 -56 -137 -145 -172 117 109 -34 11 -64 221 -73 41 -21 -188 -203 -178 116 -137 30 34 88 -18 -76 103 37
5819 37 -94 9 0 -203 145 -259 -209 -51 -19 -207 115 165 -83 -51 181 -14 103 -46 119 -169 14 76 50
$$ packed form
5649g0J33J3k69M1J1K53j4k74L48Kk90J69j14k8J89j58K35l07P3Q4L45l01k87
5672b16M17k50r4L04j65j82L34l98J97M3J12L5Pl8%lk30K02l9k98J89J99l3m1
5696E2n6r0J75j83j9l8j15L87m1P2k57J73J59k63R9J69l6j44j55P0P5k81J49J66
5720F8j08j07R7K86k98j27J20K27j86j09L5J21Q2j18n4J90l58K28Pn2L0m3K43
5743A74k25K57l04J67j27K6J46j66K67p5k14Q2P3k72J53J8Q0j94ko4K45J33Pk38
5767e3J4m1oJ08K14j53P2j07K6J6J0l23J99KJ7p3m6R9j19J75L3l4Qn5j84J74J33
5794A06j62q1qk7K89qj43M5p5K85k94J14o2j67j5K5K94k53J67MN4j06n8J79o6
5819C7j31J03rk03L48m04N0J58L2j88L22N0k48L2K32j95J17j49J65k88J83O2k6
$$ plain form
5842 50 -5 147 -29 -154 221 -68 37 -13 -268 27 -130 -109 -69 121 -153 177 10 -182 47 -210 98 54
5864 54 90 -91 -166 -138 27 -10 -103 127 138 -224 -91 22 157 96 304 -35 -139 -7 -132 -120 81 -70 -127
5887 -127 235 -131 -29 31 140 157 -48 179 98 -94 94 53 43 11 67 72 24 89 138 -9 -2 131 136 146 89 53
5913 53 90 -115 145 -87 -148 -61 2 134 -58 228 21 32 196 79 -153 21 144 171 57 -38 -104 89 32
5936 32 18 -49 165 48 56 159 43 147 -134 49 138 -173 51 -50 -14 41 -90 90 86 -144 45 -106 35
5959 35 -72 166 14 12 -223 -91 201 12 100 -32 -105 -13 -132 -96 208 36 67 -184 -203 -166 -40 -197 -71
5982 -71 28 49 -150 -118 7 100 -88 33 31 13 -97 41 -217 79 -48 116 65 49 1 -63 58 59 81 -220 152
6007 152 195 48 140 152 -267 48 11 21 2 -102 -84 -27 108 48 -258 54 30 136 -301 -145 75 -178 4
$$ packed form
5842E0n5J52j76j25L75k89J05n0k55K95j57K1M0J90k74L30j67j92K29k57L08m4
5864E4L6j81p5K8J65l7r3K30J1l62J33J13J35o1K08l39j04J32j25J2K01j51n7
5887a27L62l66J02O0J09J7k05K27q1j92J88m1j0l2N6Nm8O5M9j47PJ33NJ0n7l6
5913E3L7k05K60k32o1Q7O3J32j92K86k07J1J64j17k32J74J23K7j14r5o6J93n7
5936C2j4o7K14j17QJ03j16J04k81J83Q9l11K24j01L6N5j31J80mk30J89j51J41
5959C5j07K38j52kk35J32K92j89Q8j32p3R2j19L6L04j72L1k51j9L7J26j57J26
5982g1R9K1j99L2J25R3j88J21kj8j10J38k58K96j27J64n1j6m8o4J21JK2l01L72
6007A52M3j47R2J2m19L15l7J0j9j04J8N7J35o0l06L12k4J06m37J56K20k53J82
$$ plain form
6030 4 -70 -42 -47 92 -171 -190 -114 -89 -149 117 -93 78 -39 109 -167 -19 29 79 -110 13 244 -39 242 -81
6054 -81 -72 137 200 106 -102 -135 137 2 131 -19 -62 -134 83 16 0 10 47 -58 -21 -125 -53 107 -20 33 75
6079 75 68 -93 51 -211 -165 10 58 51 146 60 -55 -81 122 29 60 -150 -73 -221 -54 94 -23 49 -16 341 230
6104 230 59 -180 9 -117 -44 -74 -2 194 -47 124 -153 135 143 94 -26 -31 -61 166 66 21 -47 -11 -222 -53
6128 -53 65 119 -8 9 -100 135 109 50 -137 64 129 18 -133 -217 8 103 50 183 -96 -239 78 3 -146
6151 -146 232 349 -117 79 -33 -114 26 -1 -143 58 -124 46 17 93 -280 -39 -6 -64 32 -54 -1 333 -74
6174 -74 -184 7 -86 -145 201 18 225 -66 49 -22 -7 -140 -18 24 -84 -45 66 -44 -80 148 -14 110 75
$$ packed form
6030Dp4K8nJ39k63j9P6K5o0K66k10J71j17J48k76J48M8N0j89J23K31k83K81l23
6054h1RK09O3r4k08l3K72j35J29j50m3p2K17o7j6J0L7j05L7j04P2J60j27N3M2
6079G5pj61J44k62M6J75M8pR5q6j15k6K03r3L1k10P7j48J67J48j17P2o5L57j11
6104B30j71k39J89j26P3l0P2J96k41J71k77K88Qm9j20nl0K27j00m5o8L6k11J69
6128e3J18N4j27J7j09K35k6n9j87K01O5j11j51q4K25R5n3J33k79j43L17p5j49
6151a46L78J17m66J96j12q1J40k7j42K01j82J70k9P6l73K41L3n8R6q6N3L34m07
6174g4j10J91r3n9L46j83K07k91J15p1J5j33J22M2j08L9J11j10l6K28j62J24l5
$$ [...]
8191b09
##END NTUPLES=NMR FID
##END=
