##TITLE=1H_Pr 2297
 CDCl3,8 sc, 
 4.03.2021
##JCAMPDX= 6.0         $$ Bruker NMR JCAMP-DX V2.0
##DATA TYPE= NMR FID
##DATA CLASS= NTUPLES
##ORIGIN= UXNMR, Bruker Analytische Messtechnik GmbH
##OWNER= root
$$ XWIN-NMR		Version 3.5
$$ Thu Mar  4 10:21:26 2021 Russian Standard Time (UT+4h)  she@DPX200
##.OBSERVE FREQUENCY= 200.1315066352
##.OBSERVE NUCLEUS= ^1H
##.DELAY= (6, 6)
##.ACQUISITION MODE= SIMULTANEOUS
##.ACQUISITION SCHEME= undefined
##.AVERAGES= 8
##.DIGITISER RES= 18
##SPECTROMETER/DATA SYSTEM= spect
##.PULSE SEQUENCE= zg30
##.SOLVENT NAME= CDCl3
##.SHIFT REFERENCE= (INTERNAL, CDCl3, 0, 15.7039)
##AUDIT TRAIL= $$ (NUMBER, WHEN, WHO, WHERE, WHAT)
$$ ##TITLE= Audit trail, XWIN-NMR		Version 3.5
$$ ##JCAMPDX= 5.01
$$ ##ORIGIN= Bruker BioSpin GmbH
$$ ##OWNER= she
$$ F:/spectra/data/she/nmr/H-F/1/audita.txt
$$ ##AUDIT TRAIL=  $$ (NUMBER, WHEN, WHO, WHERE, WHAT)
(   1,<2021-03-04 10:20:27.48 +0400>,<she>,<DPX200>,
      <created by zg, POWCHK disabled, PULCHK disabled
       configuration hash MD5:
       00 E9 B6 7A A2 85 ED C7 34 08 36 98 17 FE 4E 26
       data hash MD5: 16K
       E3 9E F4 A4 AD E1 A8 7E F3 D3 16 0C 4C B5 F1 50>)
$$ ##END=
$$ 
$$ hash MD5
$$ EE CB DD 87 FB 33 78 18 D7 07 C1 00 F7 CD 1C 88
##$RELAX= 
##$RELAX= 
##$RELAX= 
##$RELAX= 
##$RELAX= 
##$RELAX= 
$$ Bruker specific parameters
$$ --------------------------
##$DU= <F:/spectra>
##$EXPNO= 1
##$NAME= <H-F>
##$PROCNO= 1
##$TYPE= <nmr>
##$USER= <she>
##$AMP= (0..31)
100 100 100 100 100 100 100 100 100 100 100 100 100 100 100 100 100 100 
100 100 100 100 100 100 100 100 100 100 100 100 100 100 
##$AQSEQ= 0
##$AQ_mod= 1
##$AUNM= <au_zg>
##$AUTOPOS= <>
##$BF1= 200.13
##$BF2= 200.13
##$BF3= 200.13
##$BF4= 200.13
##$BF5= 200.13
##$BF6= 200.13
##$BF7= 200.13
##$BF8= 200.13
##$BYTORDA= 1
##$CFDGTYP= 0
##$CFRGTYP= 5
##$CHEMSTR= <none>
##$CNST= (0..31)
1 1 145 1 1 1 1 1 1 1 1 1 1 1 1 1 1 1 1 1 1 1 1 1 1 1 1 1 1 1 1 1 
##$CPDPRG= <>
##$CPDPRG1= <>
##$CPDPRG2= <>
##$CPDPRG3= <>
##$CPDPRG4= <mlev>
##$CPDPRG5= <mlev>
##$CPDPRG6= <mlev>
##$CPDPRG7= <mlev>
##$CPDPRG8= <mlev>
##$CPDPRGB= <>
##$CPDPRGT= <>
##$D= (0..31)
0 1.2 0 0 0 0 0 0 0 0.06 0 0.03 0 0 0 0 0.0002 0 0 0 0 0 0 0 0 0 0 0 0 
0 0 0 
##$DATE= 1614838827
##$DBL= (0..7)
120 120 120 120 120 120 120 120 
##$DBP= (0..7)
150 150 150 150 150 150 150 150 
##$DBP07= 0
##$DBPNAM0= <>
##$DBPNAM1= <>
##$DBPNAM2= <>
##$DBPNAM3= <>
##$DBPNAM4= <>
##$DBPNAM5= <>
##$DBPNAM6= <>
##$DBPNAM7= <>
##$DBPOAL= (0..7)
0.5 0.5 0.5 0.5 0.5 0.5 0.5 0.5 
##$DBPOFFS= (0..7)
0 0 0 0 0 0 0 0 
##$DE= 6
##$DECBNUC= <off>
##$DECIM= 32
##$DECNUC= <off>
##$DECSTAT= 4
##$DIGMOD= 1
##$DIGTYP= 9
##$DL= (0..7)
0 120 120 120 120 120 120 120 
##$DP= (0..7)
150 150 150 150 150 150 150 150 
##$DP07= 0
##$DPNAME0= <>
##$DPNAME1= <>
##$DPNAME2= <>
##$DPNAME3= <>
##$DPNAME4= <>
##$DPNAME5= <>
##$DPNAME6= <>
##$DPNAME7= <>
##$DPOAL= (0..7)
0.5 0.5 0.5 0.5 0.5 0.5 0.5 0.5 
##$DPOFFS= (0..7)
0 0 0 0 0 0 0 0 
##$DQDMODE= 0
##$DR= 18
##$DS= 0
##$DSLIST= <SSSSSSSSSSSSSSS>
$$ [...]
##$SUBNAM2= <"">
##$SUBNAM3= <"">
##$SUBNAM4= <"">
##$SUBNAM5= <"">
##$SUBNAM6= <"">
##$SUBNAM7= <"">
##$SUBNAM8= <"">
##$SUBNAM9= <"">
##$SW= 16.9725356469052
##$SWIBOX= (0..15)
0 0 2 0 0 0 0 0 0 0 0 0 0 0 0 0 
##$SW_h= 3396.73913043478
##$TD= 16384
##$TD0= 1
##$TE= 0
##$TE2= 300
##$TE3= 300
##$TEG= 300
##$TL= (0..7)
0 120 120 120 120 120 120 120 
##$TP= (0..7)
150 150 150 150 150 150 150 150 
##$TP07= 0
##$TPNAME0= <>
##$TPNAME1= <>
##$TPNAME2= <>
##$TPNAME3= <>
##$TPNAME4= <>
##$TPNAME5= <>
##$TPNAME6= <>
##$TPNAME7= <>
##$TPOAL= (0..7)
0.5 0.5 0.5 0.5 0.5 0.5 0.5 0.5 
##$TPOFFS= (0..7)
0 0 0 0 0 0 0 0 
##$TUNHIN= 0
##$TUNHOUT= 0
##$TUNXOUT= 0
##$USERA1= <user>
##$USERA2= <user>
##$USERA3= <user>
##$USERA4= <user>
##$USERA5= <user>
##$V9= 5
##$VALIST= <valist>
##$VCLIST= <CCCCCCCCCCCCCCC>
##$VD= 0
##$VDLIST= <DDDDDDDDDDDDDDD>
##$VPLIST= <PPPPPPPPPPPPPPP>
##$VTLIST= <TTTTTTTTTTTTTTT>
##$WBST= 1024
##$WBSW= 4
##$XGAIN= (0..3)
0 0 0 0 
##$XL= 0
##$YL= 0
##$YMAX_a= 400779
##$YMIN_a= -231314
##$ZGOPTNS= <>
##$ZL1= 120
##$ZL2= 120
##$ZL3= 120
##$ZL4= 120
##$ABSF1= 10
##$ABSF2= 0
##$ABSG= 5
##$ABSL= 3
##$ALPHA= 0
##$AQORDER= 0
##$ASSFAC= 0
##$ASSFACI= 0
##$ASSFACX= 0
##$ASSWID= 0
##$AUNMP= <proc_1d>
##$AZFE= 0.1
##$AZFW= 0.1
##$BCFW= 1
##$BC_mod= 2
##$BYTORDP= 1
##$COROFFS= 0
##$CY= 11.3945322036743
##$DATMOD= 1
##$DC= 2
##$DFILT= <>
##$DTYPP= 0
##$F1P= 15.9154993809931
##$F2P= -4.1035820241983
##$FCOR= 0.5
##$FTSIZE= 0
##$FT_mod= 4
##$GAMMA= 1
##$GB= 0.15
##$INTBC= 1
##$INTSCL= 1
##$ISEN= 128
##$LB= 0.24
##$LEV0= 0
##$LPBIN= 0
##$MAXI= 10000
##$MC2= 0
##$MEAN= 0
##$ME_mod= 0
##$MI= 1.114404
##$NCOEF= 0
##$NC_proc= 0
##$NLEV= 6
##$NOISF1= 3.799351
##$NOISF2= 2.8
##$NSP= 1
##$NTH_PI= 0
##$NZP= 0
##$OFFSET= 15.70392
##$PC= 1
##$PHC0= -10759.91
##$PHC1= 9.600938
##$PH_mod= 1
##$PKNL= yes
##$PPARMOD= 0
##$PSCAL= 0
##$PSIGN= 0
##$REVERSE= no
##$SF= 200.130013532006
##$SI= 16384
##$SIGF1= 3
##$SIGF2= 2
##$SINO= 400
##$SIOLD= 16384
##$SREGLST= <1H.CDCl3>
##$SSB= 0
##$STSI= 0
##$STSR= 0
##$SW_p= 3612.71676300578
##$SYMM= 0
##$S_DEV= 0
##$TDeff= 0
##$TDoff= 0
##$TI= <>
##$TILT= no
##$TM1= 0
##$TM2= 0
##$TOPLEV= 0
##$USERP1= <user>
##$USERP2= <user>
##$USERP3= <user>
##$USERP4= <user>
##$USERP5= <user>
##$WDW= 1
##$XDIM= 8192
##$YMAX_p= 0
##$YMIN_p= 0
$$ End of Bruker specific parameters
$$ ---------------------------------
##NTUPLES= NMR FID
##VAR_NAME=  TIME,          FID/REAL,        FID/IMAG
##SYMBOL=    X,             R,               I
##VAR_TYPE=  INDEPENDENT,   DEPENDENT,       DEPENDENT
##VAR_FORM=  AFFN,          ASDF,            ASDF
##VAR_DIM=   8192,          8192,            8192
##UNITS=     SECONDS,       ARBITRARY UNITS, ARBITRARY UNITS
##FACTOR=    0.0002944,     1,               1
##FIRST=     0,             0,               0
##LAST=      2.4114304,     0,               0
##MIN=       0,             -231314,         0
##MAX=       2.4114304,     400779,          0
$$ Real data points
##PAGE= N=1
##DATA TABLE= (X++(R..R)), XYDATA
$$ [...]
1744Cj31N7K96k79K02o20M74j03N7K41j98mJ17J79n3n70J98K39J32j63j63k6n0
1767a65K38J54m46P0J26J26k3m09L51j00M8m7j07J14k5J85j8j54Q2k11N09l78
1789h0R4q7K62m03K77mlj40k19J31q0J82M3j52k5K03o4J33k67K16k55O7K22k32
1813a81P2P6L08l69J8K1j57L3M9j09Q3K20l4k73J47O8J2K13k86LJ16j34M39l44
1837iq1K27j07k05J24J28q9J80k92O0K13N8j93j04J62J42k54K55j41R7k07K61
1859B25l19M9K1K45J14l21K0K46J1k15o6rK82j08j57P3j59L74m9l95O8J72L45
1882D47p3j85k65K31P2j99J83k3r5K56k24j17j6K34j24R2m39J61J82o4P9p1K83
1905C25j89q5k65K27j63%R0j46M9Q6K33m03M44n69M35K82o51K97J65j4k11K20
$$ y = [3, -128, -71, 225, -54, 148, -472, 2, -101, -44, 197, -1, -5, 112, 291, 238, -332, -134, 105, 237, 74, -89, -115, -165, 73, 227, -219, -149, -23, 103, 80, -329, 22, -78, -30, -77, -184, -70, -95, 90, 72, -82, 0, -211, 298, -80, 14, -73, 189, -214, 63, 59, 56, -84, -303, -172, -252, -70, -27, -179, -204, -1, -65, 68, -199, 17, -238, -171, 51, -181, -109, -33, 275, -94, -76, -55, -212, -179, -130, -239, -156, 64, 30, -243, -96, -28, -16, 197, -89, -86, 30, -104, 335, -9, -90, 137, 30, -175, -51, 77, -12, 168, -124, -64, 149, 207, 14, -90, 72, 214, -40, 215, 74, 171, -36, 225, -94, -45, -24, 221, 335, 14, 34, 280, 291, 76, 10, 1, 283, 175, 18, 91, -68, 306, 257, -138, -70, 102, 447, 374, 189, -76, 155, 227, 28, 211, 188, 93, 349, 125, 8, -8, 226, 102, 194, -245, -84, 98, 34, 113, 42, 325, 136, 51, -214, 13, -150, -150, -60, -206, -157, -71, 162, -241, 203, -366, 69, 351, -300, -3, 162, 148, -63, 157]
1927A57l12R4J55r9k10R8L38l49L9j33J92M8j67K35l02Q2J28L1l23q5K63J35l31
1950c16Q9L88l72J44L00l65j32M08j08j88l3J61k01K82k54M03j50j60J84nk26
1971a51J70J53p6m49K83K43k90l2J46K26k25q7K23m28L56jP1m43J89N34l02l98
1993b88J42K60k56J61k4j30J58K01l78q7J85J73L22p06K42K48j87L1j41k06K43
2014c7M26j75m98L06J64mj31j44J60J40j60K55m01j22N39l18l73P6N78l53O6r
2036a5K6j77K80k28j66K75k5P0k61J4L36p7P0k92K42j71j48K74L31l07j37J78
2058I2j07O0q7j17J53j0r8k18J80K70J59m58k8L97J01l66l83M75j01M87k40m52
2080b91L46J85k17j74j15K32M72k83l87J48J89J12q2j65k35L40k6m75lN85M86
$$ y = [157, -155, -61, 94, -5, -215, -117, 221, -128, -89, -222, -30, 18, -149, 86, -216, -134, -6, 25, -298, -383, -120, 15, -316, -227, 161, -211, -67, 233, -132, -264, 144, 36, -152, -185, -24, -225, 57, -197, 206, 56, -104, 80, 75, -151, 19, 172, 96, -353, -70, 173, -117, -149, -3, 223, -2, -89, 134, -294, 62, 61, 132, -311, -122, 412, 110, -288, -146, 114, -142, 19, -5, -135, 23, 224, -154, -241, -56, 117, 439, -267, -25, 223, 36, 67, -74, -280, -37, 389, 214, -284, 22, 186, 182, 51, -93, 67, 207, 47, 302, -99, -221, 318, 0, -373, -297, 281, -72, -6, -15, 11, -166, 114, -114, -280, -5, -30, 40, -221, -207, 129, 52, 122, -170, 72, -99, -247, 27, 358, 51, -86, 92, -15, 45, -42, -159, -6, -16, -114, -332, -152, 118, 277, -181, -209, 188, 289, -77, -460, 15, -86, 401, 161, -291, 55, 240, 23, -151, -266, -34, 438, 155, -232, -84, 105, 217, 135, -30, -265, 75, 49, -426, -429, 156, 642]
2101F42n78l32l01R17L5k71k03k74O43l37P5l67L43L38m98J29l28M44k59L61l50
2122a71J79K16j8l76j24M42K0M3m99P0L36J54m5k90L06j11p0J29l52K19K7L2j94
2145g7K82j85K00k39j59K08R1j31Q4M3l71L94N0j25pJ19J14n25K64m03K82L61
2167B70j64k57K30K9J16k93j42M95L0k94q6K49l12K77J50l65K42m6j48J74j54
2188Aj06L22o1k35K43k0k49j00q4L05k80L94l13P4K82o7j58R0k2j84J86k48M23
2211A93l40J95j77J59j04k59K70J44j86P0J22k89J21O0P2n9k11J07J99j14J13
2232H6l36J76l86J73K3J0J27J50m35J27K12q5R8j32n5K02J91m94ML67k20K77m74
2255c94L20J61j39l09m9N07k35N8nl73N23J97l75q7K22p3j0pj61K27K67j40l30
$$ y = [642, 64, -268, -569, 348, 383, 112, -91, -365, 278, -59, 16, -351, -8, 330, -168, -39, -367, 77, -182, 179, -171, 8, 224, 206, -170, -294, 148, 168, 211, -288, -218, 118, 272, 227, -63, 243, 132, 62, 191, -161, 58, 85, 117, -77, 205, 20, 220, -19, -178, 30, 121, -10, 74, 117, -254, 140, 190, 65, 58, 177, 291, -234, 30, -373, -91, 270, 106, -151, 79, 108, 224, -69, -211, 284, 314, 20, -66, 183, -129, 148, 298, -67, 175, 129, -19, 155, 1, -105, 217, 156, -79, 164, 144, -105, -205, -289, 16, -264, 130, -183, -109, 173, 106, -52, 38, 16, -168, 18, -230, 193, -147, 48, -129, 30, -74, -333, -63, 81, -105, -35, 87, -202, -81, -21, 51, -8, -219, -112, 87, -27, 86, -250, -74, -460, -287, -264, -254, -127, 23, -412, -285, -73, -158, -60, -192, -247, -45, 146, -348, -344, 23, -197, 80, -394, -74, 87, -52, -361, -410, 97, -138, -80, -85, -458, 65, 262, -113, -200, 22, -51, -61, -68, -229, -2, 265, 125, -205]
2278b05K08l42K58K63n64K83L86M5m17L21m33K55L19nn38R4K60j83N5k02J65N92
2300F15n14j09L50j89p9J78P7l09L21n9l00n8L36j02J04k64K07J6k58K21Jk01
2322a6n9M40k06l79J17K73j51k03M16m80K04K07j87j94k0M38J39l88k01O49j94
2343B05m57L09r3k30L76J38n70M06K69k49m2k65L64pj97j08K31j76J58K45m48
2364a41j41K98L18n85J78J36Qj4k15N28n48Q0J50m8l69M61Qj47K0l92N40k89J48
2387a6Nk14J37L71k94m37O13j68L6k27J88J12k87R2J48Q8l65J81J13k61J74R8
2409H7q5k76J59o9J49l9K06j89j46L14p8n14J77J58K78J2j70p9P7j70M75k65k00
2432a88K76J93n20m6L02q5N0P4j87R4n8K30l30k5J26K32r0k06K71J12l04p8K59
$$ y = [-205, 3, -339, -81, 182, -382, -99, 287, 332, -85, 236, -197, 58, 377, 372, -166, -72, 188, 5, 60, -142, 23, 615, 101, -8, 342, 153, 74, 252, 329, 20, 341, 282, -18, -76, 260, 158, 262, -2, 205, 221, -37, 184, 185, -16, -75, 365, 159, -220, -103, 170, 19, -184, 232, -248, -44, 163, -24, -218, -238, 200, 339, -49, -250, 399, 205, -252, 57, -36, -266, 110, 248, -322, 84, 353, 104, 62, -203, 161, 154, -43, -151, 80, -96, 62, 307, -141, -282, 16, 334, -251, -73, 63, 71, 57, -158, 370, -178, -98, 52, 4, -365, 96, 104, -43, -23, -415, 125, -164, -16, -11, -225, -88, 283, -11, -448, 165, -3, 33, -194, -6, 106, -181, -89, 59, 147, -218, -37, 76, -185, -11, 87, 2, -274, -115, -184, -35, -74, 132, -57, -203, 111, 33, -481, -304, -146, 132, 144, -26, -105, -28, -198, 277, 12, -188, 88, 281, -239, -285, 17, -68, -18, 56, -131, -37, -95, 135, -195, -220, -94, 138, 48, -158, 113, 225, -79, -157, 102]
2455A02j23P8M17l46m81J20N44m69LL4L49m37L22l8k66N46m16J58r7P3l8J33n62
2478c94M12K89m32Q0N1J31m37M32J4k29J26L39m69o6K07L20k43k27j59L55q7j55
2500a42K26j2l54M08Ok83K97k43lK07k8k50j70K86J36j57k8J60J56m7l3q1k3p6
2524d8L35l41r4K22L52m04k00L92%p9k12J81k88K21M3j81J96l12M70j76j02k46
2546b71L77k93r2M12l53J77J65l36M1L24K9l14j63J21O22m85j04N0r7qJ91J41
2568A34n48N58N5r6m11L39P9j67q7J70O8n3p5k6o1P5M4J08m01L88r3P4l66L66
2592G4K03l51K72j55j30J22K87l30J91j54J53k79k14P62l25l11J81K48m61J38
2612g9L32r2k39M4L54l07mJ31P0k57rK90k79K0J80J11n07J35M67j88k54L00q5
$$ y = [102, -21, 57, 474, 128, -353, -233, 311, -158, -155, -121, 228, -209, 113, 75, -191, 355, -61, 97, 0, 73, 35, 168, -394, 18, 307, -125, -45, 6, 137, -300, 132, 146, -83, 43, 382, -87, -153, 54, 374, 131, -96, -255, 100, 13, -142, 84, 72, -282, 126, 132, -151, 146, -97, -100, 107, 79, -171, -341, -55, 81, -76, -104, 56, 212, 165, 132, 51, 28, -48, 287, -54, -148, 74, 426, 22, -178, 214, 214, 135, -77, 104, -184, 37, 80, -101, 95, -217, 253, 77, -25, -271, 106, -187, -279, 133, -220, -43, 122, -214, -173, 151, 180, -134, -297, -176, 446, -39, -143, -93, -190, -198, -7, 134, -414, 144, 199, 103, -308, 31, 110, -57, -144, 26, 94, 41, -34, -60, -121, -46, -2, 106, -295, 93, 0, 74, -292, 74, 277, -74, 198, 43, -87, 35, 322, -8, 183, 29, 182, -97, -311, 451, 126, -185, -4, 244, -217, -79, 253, 161, -78, -34, 320, 13, 9, 140, 210, -47, -56, 234, -45, -25, 155, 266, -241, -106, 361, 173, -81, 219, 134]
2635A34l19K19J01j12j66J47J02m72K78J74l17J86l3K69n06J23J45q8K07j08K48
2656B12m00J97K0n8k46N22j38k66j19L77k25k80M54m0j5j14n7J45k48J80J20p0
2678d9k30K96L09m43K9J84j63l82P00j00j85K6L43k87k58N66m60K22j58J25k11
2699a26J5L00k06j28n7N71m88k25N16j71k56Q5K41j52N8J7l8J74j78J40n5k47
2721b10J75L10l21j9K91j89k32M51j19j52OM4N2k06m2J68j95J63J41m7k78M41
2743B32j1j93k5j63M4J42OK10k90M5J47J46l32J57o3P5k16k4L87k54MJ37m0l89
2767b68L44J39j64j29K89m4m45M01J57j38m21K45q8K13j85j03K77J9R8k20l05
2788c28M56n8j87n1L34j24n7J91j86l2k9L37k78N1L9K99k31m11M74j34p0J84k0
$$ y = [134, -185, 34, 135, 23, -143, 4, 106, -366, -88, 86, -231, -45, -78, 191, -315, -192, -47, -135, 72, -36, 212, -188, 9, 29, -29, -275, 247, 109, -157, -276, 101, -124, -404, 50, 10, -5, -119, -176, -31, -279, -99, 21, -49, -279, 17, 326, -117, -88, 96, -67, -449, 251, 151, -34, -8, 335, 48, -210, 356, -104, 118, -40, 85, -126, -111, 189, -17, -145, -202, 369, -119, -344, 172, 1, -255, -170, 71, -81, -23, -6, -44, 130, -48, 92, 37, -210, -35, 275, -46, -65, 226, 37, -195, 256, 137, -15, -9, 35, 87, -119, -161, 7, -188, -25, 116, 69, -209, 232, 221, 28, 3, -160, -116, 26, 32, 242, -48, -3, 144, 290, -42, 115, 52, 127, -89, -113, 274, 20, 24, 161, 121, -268, 76, 215, 51, -78, 211, 167, -278, 123, 280, 142, -279, -34, -122, 91, -94, -197, 80, 99, 197, -23, -328, 128, 70, -117, -168, 166, 42, -15, 176, -10, -42, -71, 266, -12, 39, 78, 377, 146, -265, 209, 75, 5, 189, 169]
2811A69l80K83J53l53j8N1J91m26L98j00J12k00o3K48j96j4J9N52m00k5J21l44
2833b22J86J13R7m03J89J57J36j41k17L90j96J64k16J65k29rK25k72n8J69J12
2854A40n02K59J74km2l97L14j33K05k9j26o1K56J23m40J81K14k55k24M47j3k89
2876b00J39j17L1K66J51j10l45R1K67p5k45J03L39j30o2k18K06k79K12j4K33l3
2898B10J14k36J06rp4n3k00K97j43O5n2K57j58n20O02p7n09L6N50k69j28L96j89
2921A6k47J42K31l22K38j66P7k69K83L48k81k19K32L3j31N7P0j86k4P2J33l33
2943b46M93j78k80O6P5K38n6j73k1Rk30K49J98k51J70J70k20j89J74k6J07m3k
2966C4n7M7K01n9k34j46M26R1m31J17P1J0j82K85l3j76K20j35r7j39N02l63J94
$$ y = [169, -211, 72, 225, -128, -146, -95, 96, -330, 68, -32, 80, -120, -183, 65, -131, -145, -126, 426, 26, 1, 122, -222, -36, 77, 174, -229, -40, 117, 253, 112, -105, 285, 89, 253, 37, 202, -27, -36, 189, -83, -141, 28, 140, -362, -103, 71, 69, 27, -370, -56, -189, 16, -13, -139, -200, 56, 179, -261, -80, 134, -121, -345, 102, 89, -200, -61, -178, -147, 119, 270, 160, -185, -94, 173, 98, -147, -44, 295, 165, 103, -115, 91, -188, 24, 10, 243, 210, 324, 88, 194, 185, 111, 58, -142, 155, 12, 77, 25, 282, 124, -396, 206, 129, -380, -344, 206, -63, -191, 205, 16, -231, -89, 142, -180, 58, -108, -31, -300, -17, 331, 50, -169, 63, 96, -35, 22, 92, -94, -118, -46, 87, -246, 247, 69, -211, -145, -70, 168, 112, -61, -82, -73, -303, -54, 144, -107, 63, 233, 13, -176, -2, -28, 79, 36, 34, -23, 24, 225, 166, -68, -214, 212, 303, -128, -11, 60, 70, -112, 173, 140, -36, 184, 49, -48, -187, 315, -48, 146]
2989A46J3j12J7J3j4l40K80j92K33N2k15M93j18l67N3R3j65J73J30j0m7k17J33
3012C2j3L0nj43J15j40K12l95K84J68l2l13R6L01L0j35k89L23k84J45J02n5J74
3035B08k96J4r7J85P4j37M1L42j36j20P4j20J50l21K96j28j01k0P8p4M6K27k68
3058h3J59m1m9J67j73j80K81p8M0j16L2k93M60j44p9m1J70J%k8mj30K22l72K40
3083c9K32j41L38l61K12p5l10J57r1J55k96L03K72o07Q9L49K1m22J88j4q7M0P0
3106a7p7l9pN2O9j33L28j34j85K83l32M20k05J85k92J01N5oQ5j86J26l35M01J16
3130B73l22j27Q2K19k85M63k45J67j58r2J97j66K40k59J91l7j97J39K85l01j17
3151e0p9K33L7j77N1j76l2L74j00k49j59M21P1j82M3J5J53j55o4j15j69K89K93
$$ y = [146, 159, 47, 64, 77, 63, -277, 3, -189, 44, 96, -119, 374, 256, -111, -58, 35, -130, 43, 173, 163, 116, -101, 32, 19, 49, 44, -99, 16, -124, 88, -307, -23, 145, 113, -200, -104, 197, 227, 92, -197, 126, -158, -13, 89, 34, 208, -88, -74, -171, 14, 88, -49, -8, 334, 198, 78, 152, 32, 182, -139, 157, 29, -72, -92, -14, -88, -42, 185, -83, 76, 35, -14, 153, -20, -200, 81, 3, 43, -73, -41, -334, 126, -18, -97, -138, 32, 33, 33, 5, 1, -129, 93, -279, -39, 193, 52, 390, 29, 241, 166, -144, 13, -78, 77, -219, 84, 356, -251, -162, 187, 208, -214, -26, -40, -127, -87, -17, -94, -133, -140, -88, -19, -152, 176, 42, -143, 140, -192, 228, 23, 208, -84, 17, 72, 66, 151, -35, 91, -244, 157, 273, -49, -176, -94, 125, -160, 303, 58, 225, 67, -25, 172, 6, 246, -13, 178, 141, -56, 83, 368, 67, -50, -129, 104, 141, -36, 15, -161, -193, 181, 81, -168, -327, 94, 165, -17, 26, 41, 194, 39, -25, -140, -309, -20, 273]
3174B73j95k75K54k29K3k3K43p6n7j48K48m9r6K8J16K1RJ2j04p5J16p9J10Pk41
3199a87K08J05jk34K68J67q4m65K83K72k81m8q4J70k70J93J48j74J58J04j75k26
3221a53K83n3K5p1P3r0k96L78q8o5p4K44k37J24J90l00M4j6J1J46j46J96l8k02
3245a15o8J81O2R5j62J58j04j84K40R3k5k98L33k83q4o2K57o9j12Q9jJ23j61K59
3269A62j12j05J0K62j18k36K54m5K2O4j8m18R5O2j3J53R8J01l11L37j93j31J79
3292I9j44K74k26rj29O9J56j06K3j96K98n25N79l11K50j48J05n2k63J47J2k7K01
3315G7j45p8JP3J38j24J20q5K83k69r4N7n5L2k2N7o9J97k08Pl3K96J9j46l14K66
3341a9J3p1J33p3J70k58J86l23L19jj34J13K43l20o4J25k6M8r3J81k17K24P1m68
$$ y = [273, 78, -197, 57, -172, -149, -172, 71, -5, -62, -210, 38, -11, -107, -79, 37, 58, 67, 79, -25, -100, 16, -63, 47, 54, -187, 21, 126, 125, -109, 159, 326, 242, -223, 60, 332, 51, 3, -81, 89, -181, 12, 160, -14, 144, 248, 73, -153, 130, 77, 102, 31, 104, 14, -282, 96, 8, -57, -131, 113, -124, 0, 190, -110, -66, -82, -71, 75, -71, 125, 87, -115, -183, -2, 60, 155, -7, 151, 47, -137, 103, 196, 171, -127, 206, -77, -161, -223, 34, -35, -147, -58, -59, 64, -97, 162, 50, -55, -45, 217, 99, -137, 117, 72, 94, 158, 140, -278, -183, -121, -134, 19, 117, 218, -93, 244, 51, -80, 99, -45, 229, 3, -6, -135, -66, 90, -16, 7, -189, 109, -416, 163, -148, 102, -46, 59, 7, -256, -109, -97, -124, 77, -68, -146, -145, -72, 66, -58, 62, -23, 260, -9, -103, -46, -101, -69, -91, -34, -103, 94, -114, -107, -140, 156, 175, 29, -285, -19, -6, -77, 56, -17, 153, -105, 81, -242, 77, 76, -58, 55, 298, -22, -86, 39, 13, 61, -32, 149, -68, 156, 227, -241]
3365b41%J45K97n1l90L64j79J86l01L07j92J09k8k21L08j54Q2j76Q5p1J56k3P3
3388H5L4n19L98k78M43k53k8J13L7k04m9K74j76J89j25L3K7O7J72r3j52n3n2Q1
3412b9K42j32k17J00J87K21m71J10J28j19l73O17k99J7N9Qk4rJ5o3n1l59L97J13
3436F8l18J54L83l19J2J7N7k16J80p2k64L23m5J33J1k53K50k46L5N6O1k8k36J76
3460h1J16q8Q9p3j19K22L3j38k14L23J6P3m30K18q8J29J04j44p1oM9p8n0L09r6
3485EJ26k26J45OO4j11k05K03R5o7k02K22l20L38M2j22o4K92l7j54J37o7k31j79
3509c10M48n3Kj05p6j21K85q7j51J15k54J97L09k38J56j83k60J96L11j31q0J22
3531I2J68k24k73M93k99O1j3p1L5j88K79j2k2j49q0J7j21K05K51l01J42p1P1j4
$$ y = [-241, -241, -96, 201, 150, -240, 124, -55, 131, -170, 137, -55, 54, 26, -195, 113, -41, 41, -135, -50, -121, 35, 12, 85, 119, -400, -2, -280, 163, -90, -118, -5, 32, -172, -221, 53, -123, 66, -59, -26, 1, 68, 240, 147, -5, -58, -110, -29, 213, 81, -136, -36, 151, 372, -99, 11, 139, 20, -353, 264, -35, -18, 41, 49, 25, 16, 31, -32, -83, -442, -45, 68, -250, -96, 287, -32, -20, -3, 54, -162, 18, -54, -318, 5, -40, 93, 104, -149, 101, -145, -110, -54, 7, -21, -257, -81, 35, -53, 36, -37, -156, 66, 99, -39, -253, 70, 86, 159, -271, -53, -141, -12, 92, -52, -123, -129, -80, -158, -208, 101, 5, 131, -95, 50, 56, 120, 9, -196, 7, 102, 35, -167, 55, -265, 73, 115, -7, -71, 221, 184, 30, 167, 100, -131, -310, 138, 85, 87, -18, -94, -215, 70, -17, -168, -53, -307, -110, 199, -39, 117, -66, -326, -130, 181, 50, -30, 92, 260, 36, -237, 256, -43, 18, 5, -66, -31, -219, 60, 48, 26, -123, -203, -186, -307, -102, 149, -152, -10, -81, -10, -24]
3555b4Q1m9O1r4M5on7K30k35N7j48J57n5J03k05L37j35r3N5K4N9l42N03m07M2
3580i6R9j70L29J7n9k13L87p7k11J00j56or5K77l08J30p1n9K19j44J26P6J02l43
3604a46N26k02k32J74j63J11k65K66j74K06n4k3N5l21J99K6R4R8M4j83q9L2J35
3627A14o4j27K62J2k54J88j59k75J63L30Q7l33P9L1k21K10j31j11M49m89J83J73
3649A17k77O7L23k53q0O1O8m2o8J37j64K2R8j64pK89n1j61N6J7k7q2P6R0j12n5
3675a22K10p6k09L64j98j49K67k86J25J1K4O7K0l5n2L12m38K85k01L0K1J13r3
3698a0J12l34L72j86K7J5J10j74j93N28m06L76l9j73P4j50J64j67j17l4K21o5
3720d9J56j49J68k00P7r8n0K52J58j59j2k56J22J0J01r2k38M31o7Ll94M18j46
$$ y = [-24, 57, 8, 69, -25, 20, 14, -43, 187, -48, 9, -139, 18, -37, 66, -139, 198, 63, -30, 25, 49, 108, -234, 269, -138, -96, 3, -167, 162, 179, 120, -93, 294, 217, 6, 106, -50, -56, -151, 126, -182, -52, -123, -182, 37, -107, 19, 95, 197, -146, 380, 178, -54, 120, -43, 68, -197, 69, -105, 101, 47, 24, 79, -242, -43, -17, 77, 175, 219, 36, -53, -21, 114, 50, -77, 185, 197, -57, 131, -28, -303, -140, 190, 277, -56, 23, 54, -167, 43, -88, -199, 250, -239, -56, 117, -160, -93, 230, -23, -103, -42, 26, -16, -84, 53, -111, -89, 9, -155, -162, 127, 76, -85, -29, -12, -39, -121, -45, 45, -67, -122, 88, 12, -197, 167, -31, -180, 87, -199, -74, -63, -39, 28, 48, 13, -39, 273, -165, 120, -81, -51, -30, 83, -10, 102, -232, 140, -46, -19, -4, 106, -68, -261, 267, -139, 237, 198, 25, 99, -51, 113, -54, -171, -205, 16, -49, 107, -42, 126, -74, 3, -95, -145, 107, 265, 106, 94, -162, -40, -30, 71, -21, -259, 172, 105, 108, -286, 132, -14]
3743a4j25K95j96J5J4k10K24k8K90k25qj23Nl9K03q4J31K5r0r2M6Q3K52k70j33
3768e4N3J9l8j07J23j58J38L6p8q2J48J9r0o5K03j31J36l7Q2jj51J17P8k09j16
3793a65J14j6k0J01p8J71l75N22l73K52J62l32J12j75M78n28K60j96j25K63j62
3814a10L18m83L88mr0p4j02J04k1J15L5q4J32k34l2L46j15j01oj04J88k0k21K24
3838D9J65j72l13L12K6J2n3Kj1p1L5j14j7J21L27m5k15k7o5Q6n1J72j98J1lJ01
3864F4j85K25j33L03k91n0L9q4O6m3n3K77k09K65j72Q4R4k08NJ9k26R5J18o6P4
3889HJ3L8p9j08J10l53L13m4K16l51K38k6p5J86p1K39k79m1k77M86k82j01R5P1
3913g4r4L16J8j61j17J36k01K17o9Q2j89K08l6p7j61K80j29j05K87j57J73L4O0
$$ y = [-14, -139, 156, -40, -25, -11, -221, 3, -25, 265, 40, 32, -91, -86, -125, 78, -6, 125, 150, 60, -32, 14, 97, 349, 79, -54, -1, 18, -20, -127, -4, -162, -24, 12, -66, -148, 0, 19, -71, -136, 67, -64, 72, 35, 117, 116, -35, 82, 160, -49, -165, -51, -67, -87, 14, -64, 107, -268, 254, -119, 133, 295, -37, 75, -100, 378, -150, 110, -86, -211, 52, -110, 208, -275, 113, 109, 19, -55, -157, -53, -74, 41, 76, -8, 124, -110, -142, 204, 89, -12, -18, -122, 66, 46, -175, 49, 214, 42, -271, 41, 67, 79, 26, 28, 17, -54, -19, -133, -150, -29, 298, 253, 38, 11, -54, 32, -19, 153, -45, -34, -37, 64, -121, 104, -29, 274, -17, -67, -28, -112, -46, -89, -142, 135, -74, 191, 19, 103, 197, -11, -6, 13, -213, -118, 0, -66, 8, 21, 59, -20, -128, -18, -371, -58, -102, 114, -237, 1, -25, -100, 86, 15, 254, -25, -66, -343, 143, -139, -240, -145, -74, -168, 148, 166, 5, -112, 24, -177, 40, -29, 53, -136, 72, 36, -41, -202, 78, -51, -156, 131, -26, 147, 181, 241]
3936B41l47Q8q5P2J12o5J85m46K50L3j52J92k92K42J32j49O3N4j30L3p1R4R9k07
3960e4K90m4P5j29m9J1j45q6K8J44j00J93m9k33m2K48j98J81J00j54N7K07k03
3983D8N0l26L99j55O2r4m5J54j00K35k72J24k96J89K88j05j52l64M94k53K14q4
4005A1k35L19j12K23j3j7j5m14J20J93l74M45K48o39L59Nj90J47n3LJ23Nj72J9
4029a4k48L88J55ol99P9L03j67r8K6J21k88L31j49j36J92K92k45l22J93J66j69
4051Em6k6p9N7J90j31P7j87M28k08r1r8J37J2J23o6j67R4j39n7o0J60K84k82%
4076g0O1j04Q1j8N95l87k37K56j06J75k57j61J50J88k07L79j98r5j49M8L3K6K20
4099B23l31K00p2j14j82J20J57j0l5P5n0p4Q2kn7n6J3L60l65J76q1R1j01J74k78
$$ y = [241, -106, -18, -103, -31, 81, 16, 201, -245, 5, 38, -114, 78, -214, 28, 160, 11, 74, 128, -2, 31, -40, 54, 153, -54, 236, 192, 267, 138, 89, 100, -45, -131, -103, 41, -59, 134, 85, -148, -190, 58, -140, 41, 141, -13, 44, 251, 48, 98, -228, 171, 16, 78, -16, -61, 93, -7, 228, -44, 80, -216, -27, 261, 156, 4, -360, 134, -119, 95, 11, -224, 95, -17, 206, 193, 176, 161, -253, -133, 60, -314, 131, 379, -260, 99, 104, -86, 61, 8, 11, 134, 139, -33, -14, -262, 126, 281, 275, -124, -45, 258, 91, -7, 19, 140, -148, 183, 34, -102, 90, 382, 137, -185, 8, 174, 5, -41, -67, -146, -89, 101, -30, 47, -140, 288, 80, -11, -109, 28, 40, 163, 97, -70, 24, -115, -172, -232, -72, 212, -70, -70, -9, -113, -32, -50, 545, 158, -79, 177, 71, 246, -11, -172, -22, 166, -41, 338, 140, 45, -104, -56, -23, 3, 223, -108, 92, 20, -94, -276, -156, 1, -9, -44, 31, -19, -93, -11, -13, -70, -126, -113, 247, -118, 58, -23, 68, -33, 141, -137]
4124a37K06k3J62k5k06n6m7J35Q7j64K91j08Q4k09J02k13L07mj82O6j20k1j44
4147b19M33m83K99j08N2j7K2j17K95j05N9j70K60k04J78k19Q8r4J53k02n8Q6J26
4170E5j77R6P1K1J5j49J64l66K25R6r7J51K5n8K1j46j11q8L50r2L94o03J65J20
4194H2j06J30k93J01L8j53K13N6mk2j03M6j27Q9n6J98k01P9j4J11r7j77N9K77
4218A26N6j15O6o7J28n09L93L1p1J41k38J81n9j17q5K03l50J81J74J7j33N9Q4
4241I6j55J03m3j59K33J27p3j87q3rJ96n8N8O1j19n0MJ56k47j33K58J3O5O4k27
4266a09Q2j82K77j43J31m8Q4j40J03k6j88J20q1K57Lj78o6J76j51k5p3K11J24
4289A58m6r4n2J32r9J71j92J07l7k9N9j82K84k69j5J00q%k5j46N2K57l61K88j16
$$ y = [-137, 69, 46, 208, 183, -23, -79, -126, 9, 96, -68, 223, 115, 199, -10, 92, -121, 186, 182, 0, 66, -54, -75, -219, 214, -269, 30, -78, -26, -43, -21, -138, 157, 52, 111, -59, 201, -3, 175, -44, 44, -50, 103, -99, -157, -71, 55, -122, -26, 45, 66, 81, -68, 96, -270, -45, 51, -46, 105, 130, 72, 93, -53, -164, -252, 98, 6, 400, -203, -38, 82, -24, 106, -187, -86, -48, -201, 12, 68, 64, 42, -61, -15, -142, -53, -109, 89, -112, -33, -47, 64, -33, -210, -151, 126, 182, 67, 133, 66, 194, -315, 78, 109, 38, 179, -59, 122, 63, -54, -139, 64, -286, -105, 69, 86, -47, 12, 96, -59, 44, 1, -158, 75, 202, 129, -58, -141, -150, 46, -12, 46, 107, -12, -62, -58, 98, -149, -282, -24, -11, 54, 118, -109, -27, -209, 68, -75, 56, 8, 92, -48, 55, 29, -159, -39, -120, 137, 140, -38, -104, 72, -79, -104, -177, 34, 158, 112, 18, -34, 98, -1, 170, -22, 85, 48, 19, 78, -104, 180, -89, -104, -4, -12, -12, -37, -183, -131, 126, -235, 53, -63]
4314f3Q0L7j3k14K79n1j49J49n1j1m0l1R6J69J21l72m0l7O0J72j94K51q1j25J89
4339A31j28M5j33R6J38l37P3L66k23K32l14K5R9p9k15K43o8p7K20l19M76r3j74
4362a6M2k28N2K31J8k15K17R7j22k20j65L43J20m3j98P0O2k15M0K36K3mjJ79n61
4387b58J52K54q3k42K32m8j01J49k82N1J81j53J10j10L55j99L5M6k22J73l3o8
4409f1K56l99K60L2l4Q9j52K2M5j71Q2q9J07Q5o1P3m3K5l01K44q0J06p3J10j68
4434i6L3n3J56k13J77M6L8j15J79k2k35r3n2K67qo8O3r6O3k07P6J35J4j01KJ04
4460fM0j0mj44J51n8m4JK41J7j43P0q8J08K43k35J45j05j52j3j3J38j3m0k31J90
4486D5j64J31L80l29M1j56J34l18J45J75m31L66J73j26j2Q1p8O9k0l58J83J75
$$ y = [-63, 17, 54, 41, -173, 106, 55, -94, 55, 4, -7, -47, -78, 18, 187, 308, -64, -104, -141, -81, 91, -103, 148, 67, -58, 131, 3, 48, -85, 11, 149, -188, -115, 251, 28, 260, -54, -29, 70, -9, -224, 19, -49, -126, 94, -225, 251, 158, -16, 26, -202, -150, 81, 99, -116, 101, 198, 76, -144, -309, 34, 154, 111, -87, -17, 45, -170, -130, 106, 129, 125, 124, 303, -258, -106, 148, 65, -177, 55, 7, -94, 55, -227, -176, 5, -148, -38, -148, 207, 8, 43, 89, -133, 40, 7, -61, 195, -204, 56, 88, 54, 143, -9, 13, 58, -113, -31, -120, -13, 72, 11, 84, 41, 66, -235, 9, -71, 35, -38, 72, -96, -63, -116, 40, -173, 4, 50, 88, -27, 152, 130, -105, -198, -250, 17, 9, -59, 4, -92, -29, -236, -160, -25, -11, -112, -110, -6, 34, 24, 20, -124, 27, -31, -75, -74, 167, 184, 41, 111, 23, 131, 374, 139, 284, 179, 27, 14, 1, 139, 126, 86, -145, 45, -119, 12, 392, 63, 104, -52, 82, -236, -91, 84, -347, 19, 192, 66, 54, 135, 57, 126, 106, -252, -69, 106]
4508A06j7k67L40j2j02l1K47l68J16j77J39k6L5k02M06k9j77j29J17K7j76K33
4530E3l63N65j29m69L42j3J31J4j28K3Q4k6M7k6j94j12J65J30q1k8N6R2p2N1j66
4555e4J93k62J16P8J75l27L17j19k68N4l2rK11K9o6M6j06K7OL57o53J96o7K05
4579D7k2J1p2q2J01pl1J95n0j69Q4N3k96M32l49L2J03L38l70P2P0m1nJ12k06R0
4605D0o1J05r8K1l2k18K35J69K0k63K55k42n4R4J10J22r3j66j00L2j26L75N8l13
4629a30J87n3r4J9k1O0M8p6Q7O7k3o2J35L3l10K82k20J34m3K5j2k43J77J59o4
4654F2p8n1J42j77l8R4Q8p1j37J53M6J65l88O4K38k02M9K7L0RM7j94J03R2j28
4679e5J03M1o9l0K4k43K96m2l10M96j48O4j72Kk9Jj48K57j06J61j9k18J30m8K77
$$ y = [106, 89, -178, 162, 150, 48, 17, 264, -104, 12, -165, -26, -52, -17, -219, 187, 158, -19, -148, -31, -4, -180, 53, -310, 255, 126, -343, -1, -14, 117, 131, 3, 26, 110, 84, 131, 105, -89, -201, -36, 94, 13, -15, 41, 133, 61, 112, -54, 139, -123, -7, 71, 246, -81, 236, 117, -151, -97, -129, -138, 73, 102, 36, 82, -24, 3, 9, 366, -287, -91, -158, 47, 25, 36, -36, -118, -17, -24, -55, 140, 90, -79, 5, 58, -238, 194, -155, -123, -20, 318, -52, 20, 90, 49, 44, 156, -50, 40, -21, 84, -14, 7, -25, -243, -8, 161, 181, -82, 173, -69, -123, -29, 81, 203, 110, -56, -156, -124, -250, 125, 183, -130, 57, 4, -90, -71, -92, -32, 16, -60, 27, 94, 71, 9, 144, 177, -133, 149, -71, 63, 20, 45, 33, -210, -33, 126, 62, -16, -67, 75, -102, -140, -46, 42, -29, -166, -13, 33, 198, -190, -126, 112, -90, -41, -14, 16, 25, 72, -122, -19, 73, -55, 48, 89, 20, -10, 14, -229, 67, 25, -285, 211, 63, 127, -45, -43, -72, -71, -219, 38, -68, 93, 74, -144, -14, -62, 215]
4704B15j60j07J18j95K12M8p4P8k33j0M7L5Q6k46K93j46R9J54m11L98k99K84l11
4727a25J60j44J24j0j91M92o01M00k85K6L27m71J73p3J69J45k44ok2m9J06J35
4749C6O6j49J55J49k29k06O6K41K46j34j94P1l56N58j21mk33J78k24R3l3K9n9
4772e4J8kop9R6Q5k64J45O2noJ23j92Rj53K28J17n0Lm9m5J74j12j89J09j74L45
4799A34J89l98J53k13L1L7N2J03M9j26L2Lk09l6K98k53J64j12P2J04n0Rm9l1o1
4824a08P6k09J35o5K33n9L6O2q1j15J45Mo2R9m2o6j43L25m18J85J43m0j52j18
4848b35n7K60K5L5N0p0j85L58k19P2k18K20L84m81J45p2j4j49J38PJ52k87K75
4871A34j16q2J92k28J43j85K53j87RK6M9p2J30j35J18J4j53l1kK34j91M6oJ58
$$ y = [215, 55, -52, 66, -129, 83, 131, 57, 135, -98, -108, -61, -26, 60, -186, 107, -39, 60, 214, -197, 201, -98, 186, -125, 35, -109, 15, 5, -186, 306, -295, 105, -180, -154, 173, -298, -125, -198, -29, 116, -128, -134, -156, -205, -99, 36, 102, -47, 108, 257, 28, -178, -112, 129, 375, 241, 47, 118, -238, 320, 199, 195, -38, 140, -84, 9, -24, 5, -54, -36, -38, -44, -123, -27, 58, -206, -61, 1, -4, -10, 113, -79, -70, -223, 5, 122, 72, 75, 26, -19, 155, 43, -146, -37, -211, 134, 323, -75, 78, -135, -104, -67, -15, 88, 137, 11, 43, 46, -163, -199, 99, -154, 10, -102, -30, 74, 24, 33, -16, -47, -108, -32, -241, -106, -171, 62, 3, 39, 101, 20, -95, 50, 54, -8, 91, 49, -17, -160, 165, -253, -68, 75, 35, -117, -235, -292, -32, -7, 28, 78, 8, -177, 181, -38, 34, -184, 36, 420, -61, 84, 12, -2, -151, -13, -6, 146, -141, 134, 18, -64, 128, -100, 43, -142, 111, -76, -67, -41, 8, -64, 66, -69, 49, 63, -90, -121, -123, 111, -80, -34, -40, 118]
4895A18j71K73m09M9J53n4M7O1J64k72J5k6N6l4K6Q2j94J84k08K07k14J51J43
4918A47Kq2K5j46o4O0K45m06%K46l4qj74Q3J63k20J20K23J7l89K25k1mr5K9J5
4944d3J82K2j0j8k41K59o8j1M7J28k88J50j66J42p3pJ36o4J19k42k61L96k98L51
4968A42j20j53J68j38K72R3m21L1K44j48K51l48J24j18J00K82k81J49j60K86j88
4989F7m8l18J09J12J3j5j22K40l5o8K20j06r0p3N7J15j04k99J57K48p5p9K67J9
5013A92k74m1J00j12J36R5j44O1r7L9J85j88R7J38k87J06k35K28j33K04J25j45
5035E0j14K5L5k8l3k55L36ll1P2k65J39R2k50O3J51n8R9J6q3j39L40k11m9r7J45
5061e3l8J38N1nj09o5oK69j41q5M3k2N1J6j05Q6o0J11o5j73J45r3J16J59o2j88
$$ y = [118, -53, 220, -189, -140, 13, -41, 6, 67, 231, -41, -26, -52, 4, -30, -4, 78, -116, 68, -140, 67, -147, 4, 147, 149, 67, 92, -54, -118, -58, 187, -219, -219, 27, -7, -15, -189, -106, 57, -163, -43, 180, 197, -192, 33, 12, 8, -87, -58, -43, 139, 161, 151, 133, -108, 151, 83, 72, 119, 247, -41, 109, -57, 85, 12, 5, 141, 77, 196, -46, -307, 89, -209, 142, 22, -131, 37, -101, 171, 264, -157, -126, 118, -30, 221, -127, -3, -121, -21, 261, -20, 129, -31, 255, 67, 19, -299, -190, -78, -65, -80, -202, 38, 3, -65, 155, 49, -41, -114, -57, 58, -46, -345, -188, 60, -15, -94, 173, 192, -82, -123, -23, -135, 1, 96, -48, 13, -84, -45, 140, -48, 49, 187, -100, 6, -229, -1, -134, 70, 195, 50, -64, -39, -4, -32, -65, -320, 16, 13, -18, 54, -211, -72, 20, -230, -167, -16, -74, 25, 41, -42, -181, 159, -52, -101, -198, -53, -91, 47, 98, 93, -16, -81, -87, 182, 41, -44, -1, -23, 28, 44, -61, 25, -35, 76, 11, -162, -17, -110, 6, 165, 103, -85]
5087h5k8K65l90M46r0M7l97N8M40k69p4N1Q7j2J14l08K65k04K37M0k66J83l30
5110b20J19K04k07J24m9j18P5R9k22K17o8k84J98J67k23K49k17N3R8K24l71P3
5132g9j9R3P2k13J24Q1k57J61j5K37k87o5OJ49K87k8l21Q6K75k54l9J6K4J1M2
5157H7k07J37o4J27k11K92k91n5L09j59r6Q1kJ61l05K13q6J00J0q2J83k16P3K2
5181B1NJ74J9k31J49k16L7j03J6K27p0k15R9J72Ol06L20j93J34j52J73r4P5qM4
5206H3j90OK51l39K75k78L70j97m0K00l15m2K56j56J04o0PJ06k7J71l93J99K44
5229B35m2j24mk60L13J31m92L87j20j44J63O6n00L82l3J47R9k61%K7N7J9j95J8
5253a31l6N6J05j19Q5k38L14n8L5j78N1J56K19k56J94j69p1QK81j51l9j76p5L28
$$ y = [-85, -113, 152, -238, 208, 118, 165, -232, -174, 266, -3, -77, -26, 61, 49, 163, -145, 120, -84, 153, 193, -73, 110, -220, -101, 103, -104, 20, -29, -147, -72, 27, -195, 22, -46, -330, -132, 35, -188, 61, -156, -103, -5, 219, -152, -79, -98, -5, 67, -146, -22, 59, -198, -37, -52, 185, -102, -167, -161, -12, 275, 247, -74, 12, 287, 33, -6, 10, 34, 45, 87, -120, 17, -47, 80, -131, 161, -130, -185, 124, -35, -131, -50, -52, 109, -196, 17, -69, 31, 41, -41, 142, -74, -1, 21, 26, 200, 219, -12, 137, -79, -42, -145, -129, 98, 28, -187, -88, 84, 90, -216, 104, -89, 45, -107, 66, -28, 47, 39, 83, -107, -101, 150, -189, 86, -192, 178, -19, -59, 141, -174, -216, 40, -116, -12, -72, -65, 41, 14, 185, -208, -9, 235, 193, 69, 65, -195, 118, 249, -243, 144, 24, -120, 43, 109, -391, -9, -42, 105, 204, -57, -57, -30, 27, 46, -149, -131, -167, -111, -6, -125, -40, -278, 36, -22, 13, -165, -114, 42, 261, 5, 199, 30, -41, -33, 248, 97, 58, -118, -193, 135]
5277A35j36j55P3P0N1k9j22J28Lj43L15k82o3K94k4o2Np9Q9k6rp9J10q3j9j7O1
5304Fk28K48j55J24J8l5Q3p6J10o8J62q6j27K00k00K1o7L9o4J52m5Kn8K23k57
5329g8J53j12j24K56m2p0o5J42q8j00%K42J66l53Q7K21l57K57K5o5j6k0N0j11
5353bL8j5m9q4N0P2K74k49P9p6r2K12m35J76Q5J07M5k57n1K9M83k78R8r3J66k10
5379B3J60L4j32l9nj99M3m2N0K39j29K11k83L33j44l9q0M0mn1J60j39k85J06K40
5404F8k10j33M51l94L71k32q2L84k47j58K37l3o9J10k64L38j27m0Rk24K42J37
5426A34o8j00l8J52j40O4M9j87K22j92J88j61R0k6m6J64K7l45K71N4k52K71l63
5449b32K40L47k94j05M7J15k13NJ52L9j45l1L35l71O7J53M9m25J57K07oq2J33
$$ y = [135, -1, -156, -83, -13, 38, 9, -113, 15, 18, -125, 190, -92, -155, 139, 115, 53, 58, -21, 68, 42, 33, -46, 64, -19, -38, -55, 6, -222, 26, -129, -5, 13, -22, 61, -15, 95, 27, 189, 103, -24, 176, -24, -3, -70, -31, -95, 57, 12, 14, -44, 179, -78, 75, -37, -161, 95, 53, -17, -82, 60, -28, -128, -128, 114, 280, -73, 14, 235, -122, 135, 160, 95, 79, 59, 109, -2, 36, 21, -28, -112, -62, 10, 284, 35, 114, 38, -54, 158, -277, -101, -16, 91, 136, -121, -172, -143, 340, 62, 160, 67, 233, 23, 183, 217, 85, 46, 41, -158, -115, -157, -107, 132, 3, 214, -69, 264, 120, 81, 1, 41, 37, -14, 146, 7, -278, -172, 68, -142, -275, 176, -218, 153, -79, -161, 223, -24, -182, 55, 22, -47, 63, -201, 137, 10, -30, -21, -245, -3, 134, 66, -34, -72, 80, -60, 4, 53, -134, 88, -104, 84, -77, 13, -13, -59, 105, 132, -213, 58, 112, -140, 131, -232, 8, 355, 61, -44, 3, 118, -95, -90, 62, 101, -44, -75, 260, -111, -44, 109, 158, -267, -110, 97, 91, 9, 142]
5472A42r1j72L23k17J53k59JJ61LJ61j17j73J08L8J89k64J51j87J14J20J0l54
5494a60J94L8j20K20j82o2P1J03j10Q2j92j1J36K16j43J83m06M28k69l02K06J62
5516H2K8M6q5L5J39k53R2j82N3R7k51K27l9o9L10k93K59l52K46J02k10Q6n8J90
5540B00j73j19R3J80k43J73N0k02Q6j74K23O0n41K28o7J79n7KK26l8j43j54L37
5563A26N4Q4k76J25o1p5nm6L80l15j01J70M1L3k0L8j36J85j7J9l46J61O3k75K47
5588E3J87j76r3J77j18j61J72j9Q4j59%Q3J25J1k35J0M2K7P5j70L32m30J99j29
5612a13J74o0Q5l96L38J63k29oj35M09l22m6O5L28j43j85J11k17J59j1Pj12K88
5635A52J4j22J6k77P6N7J77j11L02l18R0J42l29O7L36k03l11K65J18k53Q6J96
$$ y = [142, 51, -121, 202, -15, 138, -121, -120, 41, 44, 205, 88, -85, 23, 61, 250, -14, 137, -50, 64, 184, 194, -160, 34, 72, -48, 172, -10, -72, -1, 102, -8, 74, -118, -129, 7, 223, 80, 263, -143, 285, 16, -286, -80, 82, 110, 156, 71, 106, 245, -8, 84, -98, -45, 52, -199, 28, -11, -80, 230, -63, 196, -156, 90, 192, -18, 68, 10, 200, 27, -92, 1, 181, -62, 111, 161, -41, 45, -129, 94, 154, -387, -159, -226, -47, -104, -102, 124, 86, -57, -211, 126, 180, 264, -12, 113, 52, -23, -28, -74, 306, -9, -110, 60, 101, 134, 114, 152, 16, 201, 184, 203, -143, 18, 81, -194, 53, 240, 64, -29, 148, 30, -131, 41, 22, 106, -53, -53, 30, 155, 166, -69, -59, -17, 10, 85, -85, 247, -183, 16, -113, 61, 1, 86, -310, 28, 191, -38, -44, -179, 230, -92, -138, -73, 255, 112, -73, 38, -179, -20, -31, -24, -136, 152, 166, 44, 60, -217, -141, -84, 93, -18, 284, -34, 56, 198, -131, -64, 272, 69, -242, 23, 141, -112, -26, 170]
5657A70L7k02M01m05n0K39k0j5k05J70Oo8j22m3K46l32K69o4l49M75L9q2p7L8
5681E6k19K45j57M92m61k44L51J34k24P9l6j5j04n7J69j10k9J2m1P7J23J70k65
5704e4J51p8K7m6N0L2k21L85l30K62l0m6Q7k42j93M66j89P5k49K53k7r6k0K15
5728A82k08J1J82j01J5p0n2K41q5k51kK07o0j06N5%lRo6j7J61r7O8l9N9R8J7j33
5756A5j34O8K21rj14P4k58J02j64J22J63q5o5O6N5M8L4k07N4k8L4J8k46L01n9
5781Fo0j38K70L8P7k47k05L29K07k97k3L2N7N7j03j3j5j09l0K25mj25r7K08j14
5806g4J66M0j15P1k1j97J42J08N1k78K75j14%k9r4P2k46J01J80j58K29j2q6P7
5830H8o5J84l16N5q8K93j45L2nP6j78k4K66Jn4k66L42l79J71J11k56K82j26K24
$$ y = [170, 207, 5, 406, 1, -49, 190, 170, 155, -50, 120, 126, 58, -64, -107, 139, -193, 76, 12, -337, 138, 177, 95, 18, 56, -163, 82, -75, 417, -44, -288, 63, 197, -27, 52, 16, 1, -103, -160, 9, -101, -130, -118, -159, -82, 41, 211, -54, 97, 19, 46, 0, 50, 82, -139, 246, -84, 178, 148, 102, 189, -53, -246, 220, 31, 106, -143, 110, 83, -13, -33, 182, -26, -15, 167, 66, 81, 11, -41, 200, 115, -136, -138, 69, 9, -97, -42, -42, -45, -36, -102, -119, 42, -55, 13, -26, 33, 131, 148, 15, -119, -51, 170, 161, 47, 121, -137, -35, -199, -77, 86, 1, -64, 2, 57, 105, 139, -68, -14, -42, -8, 10, -236, 65, 6, -54, -192, 78, 116, 193, -54, -259, 70, 277, -20, -43, -11, 46, 103, 0, -13, -28, -137, -167, 58, 54, -71, -168, 40, -74, 92, 132, 17, 88, 67, -130, 12, 120, 171, -107, 168, 54, 54, 25, -69, 3, -243, -142, 38, -120, 109, 97, 11, 88, 23, 207, -109, -54, -142, 151, 6, 38, 33, 109, -69, -93, 173, 174, 120, -146, 196, -183, -12, 99, -157, 125, -1, 223]
5854B23l55R7k1K7k9J92j02J9R3o8M7j97q7M27k41J54l65K17J15lk90M13q9m41
5878b64L82k1j96J01q8J34j43j99M59k34K20L5k27j4J50r4m3J8L9q5K67j58m%
5902C5J50k7k57J48j91J10j54J25Q2j78J08J05q1k0MJ53l03m0L16m9j7j24n1J55
5926ak12M80j64q8J15k19J52J49j57k36Q1n6J78j38K83j85q3J19P3Q4QN2k78L8
5950enk69M6M58k92l0J1R4o4J1j23Q7J25pM7j94J24j31L42m12K27k32N8J64j85
5975a55J44p5O2r9J44Nn4J17l4Q6j28O2J1k42L73k83J79J20l59J10j0K14k90Q3
5999a9j33L24k17O8K0R9j25O0k0k9J60j54Oj90J16K2j59L86j05m0P3k03J38j32
6023e4L46j79j31J99k20r8J8J32N0J64k26M2J6k04O4L27k00M2j78J05M9k18L20
$$ y = [223, -132, -35, -56, -29, -58, 134, 32, 51, 144, 76, 123, -74, -161, 266, 25, 179, -186, 31, 146, 143, -147, 266, 177, -264, 118, 97, -99, 2, -86, 48, -95, -294, 165, -69, 151, 186, -41, -55, 95, 1, -42, -24, 15, -70, 197, 39, 35, 35, 185, 158, -99, 49, -142, -32, -186, -61, 21, -157, -49, 56, -25, -45, -41, 112, -191, -231, 85, 36, 19, -105, -156, -1, -213, 267, 103, 15, 130, -89, 63, 212, 55, -181, -100, -156, 22, -116, 167, -18, -101, 18, 91, 175, 183, 235, -43, -5, -10, -279, -233, 225, -67, -97, -86, 8, -56, -45, -168, -81, 44, 37, 84, -110, 14, -117, 225, -187, 40, -192, -134, 30, -155, -11, -86, -24, -123, 21, 26, -28, 89, 55, 141, 13, 75, 86, -156, 217, -66, 113, 233, -126, -16, -26, 188, -102, -19, -152, 172, -45, 23, 43, 142, 17, 77, 57, 28, 188, 34, 40, -150, -34, -12, -171, 215, 110, 70, 143, -60, 78, -54, 292, 113, -18, 181, -39, -137, -119, 13, 63, 227, 1, 43, 59, -145, -81, 246, 46, 88, -90, 15, 64, -154, 166]
6046A66k36O6j9R3rP1j85J48j73j22J09p4J20Q1L0L6M0k23M0N0O2j7pJ14j11J71
6072B21j3o3K0j47j96K90k03J71j01N7k56J73J37q5j0O0M2j66R4j47O1J57j9r
6096F8k27J94m4P1j72J25m0k9j06J75n8j66J62J6P2k26K25l31K49J78l57J52L4
6119c5ljj20K51m27L94R5j96j31L29%p4j34N6j3J20j21k36J97p4L65l00Q3k2K4
6144B7J36k15j73L7K99M3k08M0K52l16P0P5j15Q2Q4j24PJ65l0j13k29J74kR0j19
6169f3n8J1J32k14J3N3N2R3j48K47j24P6k55J45R4j00jj7J08k34M51l44N5k5j26
6194a79R5J23j27K7J72m9N2k25L2M2Nj39K51L6N2J30l85%J0j54L13r7M2K6k05
6219a52J91o0J34q9j45L9j48L96j42k56M6J37K50mm3m3p0N9j74J51n5j20J47P4
$$ y = [166, -70, -4, -23, 70, 61, 132, -53, 95, -78, -200, -91, -165, -45, 36, 66, 102, 142, -81, -41, 9, 71, 54, 47, 161, 50, 221, 208, 145, 165, 18, -178, 112, -91, 80, -21, 36, -220, -47, 90, 5, -5, 55, 97, -69, 25, -122, -61, 96, 77, 68, -159, 35, -9, 62, -110, 15, -25, -54, -160, 15, -43, -209, -47, -31, 41, -185, 40, -291, -42, 136, -221, -69, -35, -38, -39, -159, 92, -335, 59, 154, -42, -173, 156, 156, 82, -52, 4, -9, 111, -10, -246, -49, -123, 242, -58, 25, 3, 27, 163, -52, -225, -188, 111, 154, -54, -14, 238, -78, -8, 67, -48, 34, 118, -6, 1, 166, 136, 23, -206, -32, -34, 56, -63, -121, -110, 22, -192, -179, -126, -74, 19, -129, 118, -6, 70, -185, -40, 54, -46, -47, -64, 44, -190, 261, -83, -28, -53, -179, -84, 39, -88, -61, 111, 62, 114, -111, -79, -37, -32, -171, 80, 116, 168, 298, -87, -87, -77, -231, 82, -15, 27, 53, -152, 39, -21, 113, 24, -121, -82, -230, 166, 24, -232, -186, -49, 201, 197, 154, 111, 41, 100, -74, 77, 22, -98, 49, 123]
6243A23j66k56N11k95k3R6J47M4N2k81R8L0n4k26J77J6NK21j59j46Q4J84l28J97
6267E1q7J78ok40JJ5J26k54K70M1Jj67K4K09j51J61k45J0nR1J52j89j26J27Rk03
6293b07K01n0j45n1J26J71K8%Q7j75K6J57j96j5k2J81k5r3J08l1J4j55n5M9J6
6318e6J13j76k25M59m1LK4k14p6K48j49J68m0J51j26m4k6L9k41L32r7J18k96J78
6342B6K28j61M4j57j91M65l76P0O0n5J10j18L8R6J10n6J96l82Q9K4m9q3M9M1n7
6367c9R9l17K55J1J48k04o0J94K6o0kk00K4J16j79K36L9k04J79k03m5K03J61p0
6391A08l15N6J20L0j85L82k13q6j04M81k65q3K05j57K19k16l32K73P4k05J87J23
6413I7J71k61j40L5j2R4R8K52l41O1M1j33j90M63l99J29P4m4j33J82Q8o6J30l70
$$ y = [123, -43, -299, 212, -83, -106, -10, 137, 181, 233, -48, 50, 80, 26, -200, -23, -7, -2, 219, 60, -86, -2, 182, -146, 51, -36, 142, 136, -104, -103, -88, 38, -216, 54, 95, 96, -71, -47, 162, 11, 172, -73, -63, -68, 23, 175, -14, -140, -13, -4, -207, -6, -56, -201, -252, -126, 45, 73, 73, 160, -15, 11, 168, -28, -43, -65, 116, 91, -2, 106, 75, 89, -66, -121, -72, -56, 57, -119, -344, 115, 74, 77, 101, -113, -189, 59, -90, 78, 38, 189, 63, 19, -7, 32, -209, 123, 26, 144, -152, 26, 254, 93, 137, -20, -211, 254, -122, -52, 8, -47, 63, -55, -17, 79, 189, 133, 329, -53, 36, 60, 11, -72, -23, 18, -39, 60, -257, -2, 9, 157, -47, -107, 87, 113, 53, 51, -149, -125, -9, -188, 48, 87, -117, 62, -141, -186, 17, 178, 108, -207, -151, -31, -1, -186, 196, -17, -103, -207, 274, 9, -74, 131, -26, 193, -23, -355, -82, -8, -213, -26, 97, 268, 7, -133, -98, -110, -16, 82, 334, -7, 54, 95, -38, -228, 235, -164, -35, 39, -5, -138, 44, 132, 66, 196, -174]
6437a74M49k52J00j8O5j85k3J1J61p4j55kK5J21p0K14K4j67k4J74k90o1K62j10
6461AJ76k30J28p4o5n6J23l9M9J08k75K85j58L36l93O4q0R0l5k8M6P6k7j05K69
6486A86l55M44o7m8j38K9K4ql8j28J52q5Q0j35K69j30j82R9K36j57j88L20k86
6509a06J72j5J17k47L3P9R0Jp8%N0k84K49r6m2j94K66J38j50q3R5r4j22L36k60
6534a45N7jL04l15K26Om2j98K30j89K16j81L05j25j11O3j73R5J20l11J93k1o1
6557e8k4R1j60J77N6Q5j61j13J16J88j91J8l06M62j32k44J32K34J25k70j47o3
6579a85L27om56K24J12k3k06K45N3k56Q2O7J56O6m1k78J03j63K72k27J50K92n48
6602b40M21k59N3n2K43o9l61K93P3n4n3K65j39n0m6K47m25K45n6r5K60M7k8J00
$$ y = [-174, 275, 23, 123, 105, 170, -15, -38, -27, 134, 60, -95, -97, -72, 49, -21, 193, 217, 50, 26, 200, -90, -151, 111, 1, 177, -53, 75, 1, -64, -120, 3, -36, 13, 121, -154, 131, -27, 309, -84, -20, -100, -10, -45, -73, -27, 49, 22, -83, 186, -169, 275, 208, 160, 22, 51, 75, 67, 29, -99, 53, -32, 48, -87, 182, 52, -130, -31, 205, 48, -140, 180, -106, 66, 51, 168, -79, -46, 33, 123, 124, 46, 46, 96, -188, 61, -35, -77, -271, -5, 133, -17, -100, -5, -99, -221, 115, -145, -88, -89, 215, -100, 126, 132, 90, -108, 122, -67, 149, -32, 273, 148, 37, 100, -73, 22, 142, -169, 24, 3, -58, -82, 9, -151, 26, 82, 167, 6, -107, 9, 197, 6, 24, -282, 180, 48, -196, -64, 170, 295, 25, -122, -185, 142, 136, -320, -96, 16, -7, -213, 32, 85, -171, -89, -22, 134, 200, 159, -119, -16, -179, 93, -134, 16, 308, -240, 181, -78, -25, -77, 166, 97, -264, 29, 102, 48, -5, 260, 121, 71, 25, 272, -153, 92, 36, -59, 201, 248, 220, 320]
6626C20k29K07l53N8M4M8R5m71N26k21j35J04m5J21j44J00p0j6M1j89L89j87Q9
6649H2j05N1r8j2K30k76J11L19n33K45m5J66j89l6L2J86J22l26J04Q6j00O7j12
6672c1J32L5j46p9l4J17R1J4j49r8Q1M9J50n5n9P4M8k96J21n1JJ10r5J27n3p3
6698f9q3K09j38k7K02q0J37k0j35n1K12j68O4k0K47l08J42Q1k24k22N0J27mj6
6722i4k85J19K93pk7M4J08j57k0Q7j61Q2J19j16rk4j25K72j49M1P1k55K78j35
6746e0K51j78k45K99j51J94j17M5j65J76M3q5J75m30k7M22L8j92JJ00j44J89j30
6769A9R0l6k04m8J64m0K57j58m0J4p4r8M0J9J21J01j92J9r9O7K58p1k05l7J90
6794E7Pj27J23L0k64K17k44M9J36M3L6k13K61j73Q1j34K41k97J74J0J32k88J63
$$ y = [320, 91, 298, -55, 3, 47, 95, 190, -281, 245, 24, -111, -7, -52, 69, -75, 25, -45, -61, -20, -209, 180, -7, 82, -23, 28, -70, -82, 148, -128, -17, 302, -231, 14, -31, 135, -54, -90, -58, 128, 250, -76, 28, 114, 14, 81, -31, 101, 136, -10, -89, -123, -6, 85, 99, -50, -148, -67, -18, 132, 77, 18, 92, 140, -156, -35, -86, -85, 25, -70, 57, 4, -69, -152, 57, -81, -108, 94, 14, 151, 131, -4, -55, 157, -11, 53, 33, 280, -28, 114, 195, -29, -251, -201, -74, -78, -94, -379, -260, 33, 26, -1, 43, 151, -6, -26, 61, -100, -18, 101, -15, -24, -48, -173, 99, -50, -9, 62, -193, 85, -50, 201, 23, -222, 77, -74, 120, 3, 48, -117, 59, 102, 17, 192, -238, -265, 157, 195, 3, 4, 104, -40, 149, 19, 109, 73, -131, -179, -15, -55, 202, 44, 4, 18, -56, -154, -114, -95, 26, 127, -65, -46, -145, -78, 180, 109, -96, -133, 57, 64, -63, 60, 90, -174, 43, -201, -152, -16, 27, 63, -150, 111, -62, 19, -115, 126, -171, 3, 13, 145, -143, 20]
6817B0k2J22j20j12O5K21j49k65K14n5J40M8k24J90k22J76k44J32L0l0r9j25K42
6840f7JJ17j54J57j25K3N3P8j40kL9k3K1j3J57m3l14L22j29p5J20O2Qj44k45M00
6866H4K3j48O4k17L7N02m41L10j56l0j41J61j88N1P0L29j57k5o1n3N5j64R4j1
6890a2J70k05PM6J41kj21l3J05K04k13K6j31l1J60k37L61l84P9k52J67J23n9J79
6914H8l60K74q3K31p3k7k1J77j21pk03K19j49j77K24nR0k96K34p0m3K09k52K00
6938E9k97L48n9K8j86K15p0k8M6l25K19J27N8l26K73J5j48pK3O5k61L99k6m4j05
6963gq1q4O1J89m8l4K04j89n8LJ97j84Q1Q3k38L3J14j46K09j33M07l99K7j48n6
6988a97L33k69J54lN0m8J76k33j6j74j69L82O9l2o5m6J30J03k71mN7J16q6j04
$$ y = [20, -2, 120, 0, -112, -47, 174, 25, -240, -26, -81, 59, 107, -117, 73, -149, 27, -217, -85, -55, -85, -184, -309, -67, -66, 51, -103, 54, -71, -48, 5, 83, -57, -59, -20, -43, -22, -35, 122, 79, -235, 87, -42, -117, 3, 65, 73, -71, -316, 84, 107, -41, 23, -194, -157, 345, -96, 214, 58, 28, -113, 48, -140, -89, -19, 310, 153, 128, 67, 14, 69, -95, -1, -12, 158, -47, -40, 6, 147, 145, 24, -9, 96, 300, 87, 113, -18, -49, 111, -126, 235, -149, -70, -322, -155, -32, -91, 88, -272, 2, -81, 150, 77, 50, 29, 206, 85, 78, -125, 94, -55, -232, -8, -13, 77, -219, 15, -55, -98, 111, -141, 59, -238, 110, 51, 79, -107, 108, 38, 10, 56, -269, -50, 77, 135, -191, 82, 97, -51, -58, -35, 30, -231, 168, 142, 98, -7, -88, -172, -111, 78, 30, -4, 200, 11, -47, -44, 153, -31, 50, 133, -105, -72, 42, -104, 105, -28, 379, -20, 7, -141, -197, 136, -133, 21, 18, 68, 20, 196, -37, -53, -227, -396, -14, 55, 23, -42, -88, 42, 145, -126, -130, -73, 43, -43, -147]
7012a47J28k61K10J0J57k23L9J92k29J77l54K24P2j79K97k04L19l25O1N8k38J08
7034a08P1l9l1l9%K06L8j19j6J16Q0N0l44K8M4k2N6J00l35J52K3O4N0O5k82K86
7060I4j7k53L74k22R3qj19K48j73k60R6J00OK51j13j66r9J68j22J59m7J3j14J10
7084aJ05j38K7j3j12J49M9q8J70k35l0J27r4J92k58J54j5N9q1j22O1K55r8j42
7108g9k9J43o4L0J6j08J86O9j24k81L15j29J71j10j12P0N9K1m3P0NK88l88K89
7132B65k90n2J24J31Rj97J56k89K26J93j11k58J20j39J78J21o3K9K6j50O1k63
7154a73K37N3j97J53n5M3k24K40j57K63k69L3K34j90o6J06r5R4J9O2j58k2J27
7177E8Jj18N0J04k74OK44K6j09q0O4P4k34J34j29K88P3K22n62L33O5j91Nn5J87
$$ y = [-147, -19, -280, -70, -60, 97, -126, -87, 105, -124, 53, -301, -77, -5, -184, 113, -91, 228, -97, -36, 22, -216, -108, -37, -76, -107, -146, -146, 60, 98, -21, -37, 79, 159, 209, -135, -107, -63, -85, -29, 71, -264, -112, -89, -25, 25, 90, -192, 94, 77, -176, 198, -24, 69, 61, -58, 190, 17, -243, -147, -47, -41, 210, 97, -69, -168, 0, -122, 37, -10, 3, -111, -1, 104, -34, -7, -20, -132, 17, 66, -22, 148, -87, -117, 10, -84, 108, -150, 4, -11, 48, -33, -155, -94, 161, 63, -79, -108, 35, -29, 1, 17, -91, 95, 164, 40, -241, 74, -55, 116, 6, -106, -36, 23, 44, 1, 71, 76, 364, -24, 265, -25, -77, 47, 178, 187, -10, 146, -143, 83, 276, 165, -93, 27, -112, 66, 187, 124, 153, 179, 29, 90, -173, 64, 117, -80, 73, 18, 61, -163, 77, -80, 183, -86, -53, 181, -9, -75, 31, -64, 30, 49, 111, -47, -69, 58, 59, -59, -9, 95, -179, -173, 71, 97, -12, -92, -28, 46, -188, -54, -183, 105, 178, 400, -162, 171, 236, 45, 50, -5, 182]
7202A82j04j87K24O0j72N7o8j5j01L20j26N3Lo6l0j32K12j97J96o6o3J24M9k07
7226e4q9L6M2P3j30J48k07J98J01l67K4L32l15K18O7k44N5j4n2N5L7nJ82n4k96
7251b59M67j22k54N8M7P1K33k31k07K95j03ln9J06N4P2j48k15K97l70K48J20k65
7274a68J71K20k95l7J25N1k06L0j4J02j18L18lr5j58P2L02m17J58K7j03n4J08
7297A6M4m2M3k2n8j62Q5J93k87K68j51J66j37R4l00K38J04k86K42q7K27j79K6
7320C5P1j73P8P0j53P8o9n1J53j12J12J35k89O3j01J95J49k53J67m7P7l2j35J27
7344I5J25k25M7P7J7l09L12j63J02K19k81Q1l9l4j73K32j06K26k93J53J15l17
7366a39J90o8J30q8p6J15j21j70K01j39M60l01L02j48p2J2j14r2J49n3O2J0j22
$$ y = [182, 78, -109, 115, 175, 3, 60, -8, -23, -124, 196, 70, 123, 126, 60, 30, -102, 110, -87, 109, 43, -20, 104, 153, -54, -143, -107, -65, 8, -122, 26, -181, 17, 118, -249, -225, 107, -208, 10, 77, -167, -112, -126, -178, -123, -86, -91, 91, 37, -259, 208, 86, -168, -110, -63, 8, 241, 10, -197, 98, -5, -8, -67, 39, 93, 165, 17, -198, 99, -271, -23, 97, -168, 3, 223, -72, -109, 16, 67, -139, -109, -123, -21, -139, 179, 176, 81, -77, -5, 297, -120, 38, 65, -38, -92, 16, 60, 18, 61, 39, -19, -181, -96, 97, -190, 78, -73, 93, -44, 50, -250, -12, 92, -194, 48, -39, 188, 9, 35, 106, -67, 11, 81, -72, 6, -63, -114, 39, -73, 39, 174, -115, -52, -153, 42, 191, -62, 105, 58, 135, 103, -32, 95, 220, -5, 42, 119, 136, -173, 139, -24, 78, 297, 16, 97, 58, 24, -149, 83, -23, 203, -90, 63, 178, -139, 51, -17, 113, 25, -51, 64, -57, -227, -26, -165, 295, -6, 296, 148, 76, 88, -26, -118, 31, -22, 40, 50, -72]
7389g2l2O0j52K00P3K82l69k7j36L56l05J66j31K02p5l0o7K05J4p2J87k78J52
7412A51r7N6o5J81l08P8q8J46J24l57L1K93j42J74O8j52K12p7k64Q3k4J5J35k44
7436g1j12J95oJ28K3j05n7PJ00J3q5K4J35O9l60K14l04K38M0O3O3j52J60j88j29
7461i7N4j24K47q4j9p4Q3j0J9k8kj0L3n5K07k24J43j34j42J75J3O1j42O0J54j86
7487h2M0k5J53j68l2R1j73J48K34k99R3P8p7R2j67J85mk30K61Jl9mj51J23o7J41
7513A22j86J28R5j41j82J87J21j54r8K26L6m7J13l46J78p7J26j99lJ2J63m1J06
7536A39p6j52r8L90r9k2j33m1L75l55L02j16k75J74k01J54p2K27o4M2j50j20K1
7559a50J65R8k10M4Q9k45J44K98p1Rj84q0J61j24J74J28l48pj7K91q2j45m8L11
$$ y = [-72, -104, -44, -196, 4, 77, 359, -10, -37, -173, 183, -122, 44, -87, 115, 40, 10, -57, 148, 162, 90, 277, -1, 151, 54, 110, 45, 226, -82, -4, -92, 54, 178, -179, -148, 145, 3, 177, 245, 93, 305, 228, -36, 47, 23, 38, 173, -71, -183, 12, 6, 134, 157, 52, -5, 2, 102, 115, 30, 54, 189, 258, -102, 112, -192, 46, 86, 149, 212, 60, 220, 32, -97, -43, -167, 80, -4, -23, -97, -14, -24, -5, -33, -35, -45, -12, -67, 140, -84, 59, -75, -217, -42, -29, 32, -110, -50, 104, -82, -42, -67, 86, -82, -114, -23, -196, -48, 186, -113, -20, 58, -19, 73, -94, 91, 87, -143, 118, 119, 80, 76, -75, 48, -19, 122, -64, 64, 159, 18, -164, 23, 144, -10, -108, 118, 154, 107, 220, -126, 52, -25, 101, -98, -101, -89, 74, 33, 139, 63, -89, -187, 203, 104, 82, -51, -92, 283, -72, 230, 114, -161, 13, -188, -34, -106, 121, 57, 99, -51, -171, -150, 15, 113, -97, -53, 36, -209, -65, 233, 162, 171, -13, -93, 68, -56, 118, 246, -102, -109, -126, 165, 83, -62, -110, 201]
7583B01j4J4k98M0J76j13k2Kp1k3K08m7j28K18k15n8K37j97P4M6K57j78l22K59
7607D6J44q0k73J61N9J27l21J73j42L8%n3K76j53r4K49r2j03K0n3J01q2j47KL07
7632A10qk6QJ33K4k73m8kJ23j02L58m59K00L2l7N6J25n5J83l82M4J83j61P0j31
7657c5K9J42j44O6k30K02l3l8J32P8j36j27L35m16K10M9k91J96j91K10q6O0J71
7680A53j79J80j44J01j29K2r5l3JK70k67K10Qj97j63L86j44m0k7K38k95j49K13
7703h0K38k44J99o8n0O1J45Kj35k4q0J34pj33J92q9J36n7j21j35K0K13J73l09
7727a9r2J86k63O6j54K13R6j3j35J88j76J35K1k6N3k38J75Q0k12L02k75O9nj28
7751a52J24Q4j97QJ59o0j42J42j54J43K64j0k25j20J63j65J20K43k51J10P6n4
$$ y = [201, 187, 201, -97, -57, 119, 6, -16, -14, -85, -108, 100, 53, -75, 143, -72, -130, 107, -90, -16, 30, 287, 109, -213, 46, 190, 110, -163, -2, 57, 184, -137, 36, -106, -68, -68, -121, 155, 2, -92, 157, 65, -38, -18, -71, 30, -52, -199, -197, 110, 102, 76, 84, 217, 241, -32, -80, -82, 41, -61, 297, -162, 38, 70, 33, 89, 214, 159, 342, -40, 4, 187, 26, 96, -35, -6, 136, -8, 58, -172, 30, -3, -41, 91, 169, 33, -94, 241, -175, 35, 84, -207, -11, -202, 8, -78, -18, 153, -26, 154, 10, 111, -18, 4, -91, -124, -123, 147, -120, 90, 98, -99, -262, 124, -20, -60, -87, 151, -144, -293, -80, 158, -86, 113, 45, -5, 56, 201, 203, 68, 44, -36, 98, 91, -42, 150, 61, 197, 140, 19, -116, -96, 117, 290, -19, -111, 75, -188, -122, -276, -63, 33, 20, -115, 73, -103, 32, 53, 27, 80, -158, 17, 97, -115, 187, -88, -19, -24, -152, -28, 56, -141, -133, 26, -34, -176, -34, -188, -45, 219, 209, -16, -136, 27, -138, -18, 225, -26, 84, 160, 106]
7773A06j12L8L0kq9L7L7n9k5K37k73J34j99K29J6j27j61P5R7N7Kj24J87j33p3
7798i5r2J81j91J15K3m9K64k23J05Q9j26j3P2r3K85m11K57k24K05r1q8M12m80
7821a68l3R8M9J37k28J64Pk6J3rk20K81j97J27%j66L82p7k31P1jK31j60j34O5
7846b5j89J36R5J0O5R4l68L57p4j24L1p0j8J97k78O4L6J60J3j07J36j23L24o08
7870b66J78L24k77k8kK9J65j22j0J55p7j15o2nR4k2K22j84K64j36o2j51J15j34
7894a07k9J52J80k60J74o4j87K09K9J08l10L15l13K32l88J14K59L5j12o4L4oj82
7917a81K35K9k38L49l64K95j1o2j01l6lJ64J05j08j56J72j35R1J82k44m8M00k28
7940A07j06pP6M8k02J1O3n0K00j37j31K07l58K63r5L34l31K32k63q1N9K89j88
$$ y = [106, -6, 32, 62, 60, -29, 8, 45, -14, -39, 198, -75, 59, -140, 89, 105, -22, -183, -108, -11, 46, 48, -76, 111, -22, -95, -187, -6, -197, -82, -59, -108, 156, -67, 38, 127, 1, -12, 60, -33, 252, -159, 98, -126, 79, -12, -100, 312, -168, -201, -103, -54, 83, -145, 19, 26, 0, 13, 4, -216, 65, -132, -5, -5, -171, 211, 134, -97, -26, -27, 204, 44, -90, -25, -214, -78, 17, 27, 92, 186, -182, 175, 101, -23, 8, -62, -80, 117, -161, -97, -61, 99, 112, 5, 141, 18, 342, -266, -88, 236, -41, -69, -71, -42, 123, 1, -9, 146, 69, -46, -108, -113, -19, -41, 181, -3, 261, 125, 63, -88, 27, -107, -136, 16, 196, -64, 110, 46, -141, 68, 97, 205, -105, 210, -103, 129, -259, -145, 114, 149, 37, -27, 7, 1, -181, 54, 83, -155, 194, -170, 125, 114, 52, -49, -85, -88, 76, 181, 73, -83, 89, -46, 45, 227, -17, -65, 335, 107, 1, -6, 70, 118, -84, -73, -10, -60, 140, 3, -128, 79, -279, -16, -111, 223, -108, 124, -139, -220, -161, 128, -60]
7963f0M3K91n05P3K54k61K95k06k5O6P7K38k39P5n7j08k8M2J10k84K60J5j2j93
7987a39Q1J50n7j7j77J39N3L5P3j75P7n2K3ol6J07j22J50j79R4o2M3R7Oj28K9
8013GK0l9N5K0j84J81J70j01j36k04J75K68k88J24j41L03j25K8k37m7l5K66J23
8036B03Jj53m34N89j90n3J25j01J66l08K30k71K43j12L90m35N9O4O0M4j99m1j11
8059b34J35k11K99j5Q8J42j22j49q3q5K44N0k47K77l45P8r0J68M8L0K15j79J6
8082C0m9j71J23j98K31N1L2P4r3m3P2J4j70M5l2N7q8P3kJ33j32O7j9J35l87J87
8108f0N3N5p3J87l34K24k48K71j62L03l39J81K4O5j2Mj32j25J38j08N1Q4kQ5l74
8133b44L51j55J42r5J31j14M4J77k99mJ7K31o2r4o6O7j38n1J46j9k0m8J93k78
$$ y = [-60, -17, 274, -231, -158, 96, -165, 130, -76, -101, -35, 42, 280, 41, 116, 59, -49, -77, -35, 75, -209, 51, 66, 54, -139, -58, 92, 35, 18, -159, -20, 33, 68, 141, -34, 43, -9, 14, 8, -28, 79, -43, 107, -72, 22, -40, 3, 100, 106, -22, 7, 27, -12, 43, 63, -121, 60, 230, 129, -7, -211, -36, 232, -56, 68, -73, 230, 105, 133, -104, -151, -186, 80, 203, 204, 51, -383, 206, 16, -37, 88, -13, 153, -155, 75, -196, 47, -65, 325, -110, -51, 13, 73, 117, -82, -123, -234, -99, -310, -11, -26, 62, 204, 82, -67, -150, -235, 9, 59, -188, 89, -256, -178, -268, -100, -52, -22, 193, 14, 30, -19, -190, -67, -265, -34, 17, 49, 123, 30, -13, 59, 73, -97, -52, -84, -27, -115, -42, -44, 89, -43, 24, 5, 140, -247, -60, -7, 48, -25, 162, -172, 52, -196, 75, -87, 216, -123, 58, 82, 147, 135, 139, 7, -118, 20, -88, -37, 47, 45, 130, -244, 107, -48, 94, -1, 130, 16, 60, 237, -62, -66, -49, 182, 120, 26, -40, 27, -111, -162, -16, -35, -55, -103, 90, -188]
8157a88N1J10P0j32Q5R5o8q5J81j78L4j6j57K63kj26P3n5m7J44n2j29J21J38n49
8182d19M52j09J61R9j26j95K2J26J7
$$ y = [-188, -137, -27, 43, -89, -4, 91, 23, -62, 119, -59, -25, -41, -198, 65, 63, -63, 10, -45, -92, 52, 0, -129, -8, 130, -419, 33, -76, 85, 184, 58, -137, -115, 11, 28]
8191B8
$$ Imaginary data points
##PAGE= N=2
##DATA TABLE= (X++(I..I)), XYDATA
0@%%%%%%%%%%qJ6j6J7k5L2m0N6o5P3r1J15j37J61j92K25k60L02l50M04m65N32
32B84o08O88p76Q77r89J110j243J390j552J727j917K129k358K608k879L177l506
49a838L863m255M685n162N693o281O941p685Q530r504J0634j1966J3568j5536
63h313J8021k1275K5750l2346M3203o5351J93386l03813L6518M40173k45494J3704
75I4163k5232k36690J87652K22199l02081o8176O0820Q8967J34145j41565k34380
86b20178K50540J84540k33004n6489Q5487m0657L8533O5688j60203q5578K14425
97D3104M1020j48253l0620J12464M3636j5323m6838J1766M5011m7211M2759Q087
109E9602j35973L2001J48179j24176q3036J47198m6224l4629Q4249l6978l6409
$$ y = [0, 0, 0, 0, 0, 0, 0, 0, 0, 0, 0, -8, 8, -8, 9, -16, 16, -24, 32, -33, 40, -51, 64, -73, 88, -104, 121, -139, 163, -187, 217, -248, 284, -324, 364, -412, 465, -524, 586, -657, 733, -819, 908, -1009, 1120, -1238, 1370, -1509, 1668, -1838, 2025, -2230, 2455, -2707, 2986, -3295, 3646, -4039, 4491, -5013, 5621, -6345, 7223, -8313, 9708, -11567, 14183, -18163, 25040, -40311, 153075, -150738, -114220, 325953, 80459, 94163, 68931, -167759, 19893, 242092, -59989, -128165, -67345, 21622, 155767, 14202, -220178, 30362, 214902, -18102, -74591, 10896, -29761, 8772, 74460, -85743, -171321, 43104, 84124, -64129, -94749, 17715, 61351, 46028, -810, 10956, 55967, 8756, 51515, 59602, -76371, -44370, 103809, -20367, -103403, 43795, -2429, -37058, 47191, 10213, -26196]
120b6196N3951j6854J9438q659j17201J03542M9513j56956L4340R4143j06900
131g7839K4397J12374j16902j1189J25226j1550p7430J8223M2689p58k0523l6398
143b9680K5823O802r019J0358n566k4588L6251O8537o7042m2337Q2712L6555q3756
156E050j2067M8626k9732p566R562k6669l0277M7121K8266n3071l1426N5156N2241
169E5214o7295k0755M1139k857j6300R663k6709l1081M4786J2119k9346l5926
181f7348K8764N8516k0799m5227K8114M0086l0579J6149J820m7672J7298N6086
193C5208l3159o7838M1841M1463j5555k4253Q034R492J4924K0818k4689k3087
205a6801O628M4852o247n9630j2526N2755J5238n2546k489J5804R741J7304N449
$$ y = [-26196, 27755, 10901, 30339, 21680, -95521, 8021, 57534, -99422, -65082, 29061, -77839, -53442, 58932, -57970, -69159, 56067, 44517, -32913, -14690, 27999, 27241, 6718, -29680, -3857, 2945, -6074, 4284, -1282, -25870, 10381, 78918, 11876, -30461, 52251, 88806, 5050, -7017, 41609, 11877, 4311, 13873, -12796, -43073, 4048, 32314, -20757, -52183, 2973, 55214, -12081, -32836, 8303, 5446, -10854, -1191, -27900, -58981, -14195, -2076, -31422, -67348, -38584, 19932, -867, -46094, -17980, 22106, -8473, 7676, 9496, -38176, -20878, 35208, 2049, -65789, -23948, 17515, 1960, -22293, -14259, -4767, 10157, 30975, 6286, -16801, -10173, 34679, 28432, -31198, -43724, 9031, 24269, -28277, -30766, -14962, -5221, 12083, 17532]
218A7532m2918m855P1227k21o1002j6512N1048R219k7524j6887m645K1640J9196
231A5298N53l8043j17M5927K5462m1637l6133M4120K5282k3411k7370M254J844
244c971J7657R031l8615j2624L5637L5502l5793l0893K5588L2267j1817k5311
256c342P80n307J8994Q466k7185k8696K7978L6228k5105k6647Q383L3643J410
269A9600j4416j3242L325J6752O133j0019l5092J0426L7474m441m2097L436L4076
282A1915j209k929j0313o184J1913K6089j5164l3253Q759K4338P206l2258j1836
295b2926J6916K0617q643j5382m91M758K5129j695k6610j2052L2650J3951l0149
308c927j5975R387J8962k971r110j7730Q340K5573Q34k0732j5940K5289J8652
$$ y = [17532, -25386, -30241, 40986, 40765, -20237, -36749, 14299, 23518, -4006, -20893, -25538, -3898, 15298, 15851, -22192, -22309, 23618, 49080, 7443, -28690, 15430, 40712, 17301, -10069, -5815, -3971, 13686, 22717, -15898, -28522, 7115, 42617, 6824, -24069, 1519, 33786, 21969, -3342, -2562, -7869, 11125, 19591, -7594, -36290, -8312, 27916, 2811, -23836, -15453, 18190, 19600, 5184, -8058, -4733, 12019, 18152, 8133, -26959, -16533, 20941, 16500, -25597, -22161, 11915, 10706, 7777, -2536, -8720, 3193, 29282, 14118, -19135, -10376, 13962, 21168, -11090, -22926, -6010, 14607, 5964, -9418, -9909, -5151, 19978, 18283, -8327, -20379, 12271, 26222, -3927, -19902, -10515, 8447, 5476, -3634, -21364, -13024, 12549, 13383, -7349, -23289, 2000, 20652]
321B0652j2452k8680N559K0248J934q994k0432M217J9008J1980k1153j6044J5158
334h999K3055l44k9277LJ7415J2509j1440j5313l466J4116J8899j7951j7805O080
348a2518K6011K040j8536j0169J2591K1590r423j4705p212J4973J2316o143j8769
361g954n721K4968R023j5027j9565J4466J7962j523j3206j1346J1736J3240J612
374A8665k2209n518J4795J4094p444k3482N699J8774P139j8286o281M972J1214
387A2132P559j6256j1890P473K0723o345j8533n079J6865J1003j5213o800q79
400e240J0116P924m964j9341K015K1284J74j4869j4503J5453J2759p096j3030
413i318j497O972P899M766k1622n635J8615J3442j6562j7852J1695J4438L87j5110
$$ y = [20652, 8200, -20480, -14921, 5327, 7261, -1733, -22165, -17948, 1060, 13040, -8113, -24157, -8999, 14056, 13712, -15565, -15562, 1853, 14362, 2922, -12391, -15857, -1741, 17158, -793, -18598, -12518, 13493, 15533, -3003, -13172, -581, 21009, 11586, -3119, -10331, 4642, 16958, 10815, -7954, -13675, 11293, 20316, 5289, -14276, 190, 18152, 16629, 3423, -7923, 3813, 17053, 18665, -3544, -9062, 5733, 19827, 12383, -11099, -5400, 13374, 20513, 2227, -4054, 918, 12132, 19691, 3435, -8455, -982, 19741, 13396, -5137, -10216, 6649, 17652, 2439, -4361, -5240, 4876, 12800, 7836, -11505, -9490, 11794, 11968, -2901, -17404, -1951, 10808, 3712, -9318, -10815, -3843, 4056, 8822, -12800, -18435, 180, 13622, -2940, -20792, -9097, 5341, 5728, -9382]
427i382k908J405J3407O915j9412j1306J4460J9696j2704j8097P33K1617L367
440G791j6175j551j488J0563J1709j1202k3142J6063K1203j0433j3992o198J8836
453A984Q411j2190q530O169K181J0786L490k8521O196K6056m183j9620M16Q155
467H00N941J217j4293Q68L935P611L939j2669j1494J7652J6080k2835q145J1151
481b42L708l550L058r769j0172K0863O641j7184j0476J3568J1736j097j6115o148
495a5179K1660j249o917p96j0915L625K9077j5006l4093K5804J9162j0770j0253
508e850l614N812J9526o419k1678N526N612J3682k419l1399J372L9958n625l5111
522b0627R678J3872M445J117j3958j2844K1367J7794k1433j6423K994K5340O028
$$ y = [-9382, -12290, -10885, 2522, 9437, -9975, -21281, -6821, 12875, 171, -17926, -17193, 4424, 7791, -8384, -9935, -11423, -860, 10849, -353, -23495, -7432, 13771, 3338, -10654, -16852, 1984, 10395, -1795, -10325, -4156, -1975, 8811, 12301, -16220, -10024, 16032, 11849, -7771, -7355, 800, 6741, 7958, -6335, -5467, -1532, 6079, 10018, -2651, -14145, 3507, 19587, -3248, -11393, -242, 3466, -84, 2974, -6795, -16967, 3896, 10537, -6647, -17123, -3555, 8181, 7084, -9031, -15179, 6481, 5232, -1685, -2481, -13396, -9771, 19306, 4300, -29793, -3989, 15173, 4403, -5850, -9464, -3652, 15874, 9455, -12223, -6697, -1085, 12597, 10178, -21221, -19849, 20109, 14484, -20627, -10949, 2923, 7368, 8485, -5473, -18317, 3050, 20844, -589, -17012, -14018, 11322, 17350]
535A7350k9734j1226L0395J0224j9788K377n307M460K4470p628l2271J1977K8328
548B3627r122j4202r757J3689J7076j2467j2658Q716K023M148J3811k5386q963
561i465L0661J577k4518JR252k115M635q345m786K580L834P005m813j5219N979
576c737K3098j5534j3033J2433j430p285J2939l548k3016J5579J4733j0148q868
589g817L52Q526J1177r000j3927J4028k556L22J1587k1951j2217L4443K347l4487
603a9173R691J1227k602P480r839j1833J5529Q771j0658k760j3302J0877K2831
616A6239k4108k0069K4293Q428j5525P531o241o298K0949L939k0955l818J8161
629B526L299n323j3532J908J6611k451j0700K746L911l226J5862n493j9832J4918
$$ y = [17350, -12384, -23610, 6785, 17009, -2779, -402, -5709, -1249, 23221, 15593, -16678, -4701, 23627, 14505, 303, -9454, 4235, 21311, 8844, -3814, 4902, 6925, 11073, 24884, -502, -9465, 21196, 22773, -1745, -1744, 7508, 5393, 10028, 1683, -3103, -523, 3311, 10316, 5503, -9716, -3737, 19361, 3827, -9206, 3227, 1797, -5488, 7451, 3903, -19113, -3534, 11199, 1051, -7817, -7465, 1061, 12238, 3238, -10689, 3339, 783, 1105, 12692, -9259, -21476, 12967, 15314, -19173, -9482, 1745, -857, 6623, -3216, -15049, 480, 9251, -1407, -4167, -17469, -6592, 16239, -7869, -27938, -3645, 4783, -10742, -3211, -9452, -15750, 5199, 9138, -11817, -15635, 2526, 5825, 502, -13030, -11122, 5489, 3038, -7662, -4916, -1005, -4231, 11631, 6138, -13694, 1224]
643A224J8415j6330j0413J2101k201K246p5r307J194P036J103j406n256n689J9059
658A1701O27k0211N646J1397p368k628M801j1828M508J0736o841q858K622J0108
672D412J576p051o583J1508L740p365L21j244k192N932N449j5833k414J5159K193
687G608j1089k341P691K230J797n271k968J560N320J870r028o574P285J1789j1650
702a771q849P988N877j817j373k088m235J0432L696j0016o912P210Q644n478r020
717g712p63J0976K85m341j311j327M165P956k917j4664P457J1230m358r429Q0
732d673M818K304P76o826q08L426O490J04r877j736J1336M598j3517n74N158N46
748A545N33j523n868o70J1213p32q040l287Q194O164n916n725J739O306k115n12
$$ y = [1224, 19639, 3309, -7104, 4997, 2796, 5042, 4967, -4340, -3146, 3890, 4993, 3587, -1669, -7358, 11701, 12328, -7883, -2237, 9160, 1792, -836, 3965, -7863, -3355, 7381, 540, -8318, -5696, 4412, 5988, -1063, -7646, 3862, 7602, 237, 558, -686, -2878, 3054, 8503, -7330, -9744, 5415, 7608, -3481, -5822, 1869, 4099, 5896, 625, -2343, -783, 4537, 6407, -2621, -9195, -1910, 9879, -1771, -10620, -2632, 3245, 1428, 55, -2033, -6268, 4164, 7860, -2156, -9068, -1858, 6786, 1308, -7712, -8475, 2501, 2786, -1555, -2866, -4193, -28, 7928, 5011, -9653, -2196, 9034, 4676, -4753, -4673, 145, 2449, 3225, -3601, -4409, -983, 5507, 5611, -4266, -6002, 5334, 9932, -3585, -4159, 999, 1545, 2078, 555, -5313, -5983, 5230, 4498, -3542, -6829, 1365, 7529, 1613, -4112, -2373, 3933, 1818, 1306]
764A306l931l495O439O575q021r841J0993N925m144n350R56L203L158K39p675
779c663p10L854O497m237r936L238J1094j545r840L712K187K160K407l847n921
794d550M731Q494n185o862j320R321J748p894j825M115K736O5M26p206J383Q790
810F967o96r163k799Q958J396m958m150K648J392K379R7o949M69O444M413q598
826b150m706O509N485m711n741L667l99L155J162n523l578P746N275o781m242
841d832K262Q320k556n936P92J657J615J637k408p754O406O896m258p215J719
856c655P893j075l924k648K898N94K890j793p541L331O890j13r202N34O844K508
872D431m916k186K769m07M599j001o371n39Q826R73p897j634M811N226n228k085
$$ y = [1306, -2625, -6120, 319, 6894, -1127, -10968, 25, 5950, 1806, -3544, -2588, 615, 3773, 4012, -3663, -4373, -519, 5978, 1741, -8195, -4957, 6137, 4592, -5248, -1536, 651, 2811, 5218, 1371, -4550, 181, 8675, 3490, -3372, -4692, 4629, 6377, -1517, -3342, 773, 3509, 3574, 4000, -3206, -1823, 6967, 6271, -2892, -5691, 3267, 4663, -295, -4445, -1797, -405, 1974, 2071, -4878, -4409, 2035, 6448, -2150, -6856, -347, 5138, 427, -5314, -1647, -2046, 1109, 2271, -3252, -6830, 916, 6191, -590, -4832, -2570, 5750, 3194, -2742, -1950, -293, 1322, 2959, 551, -7203, -797, 6099, 1841, -5374, -3655, 4238, 3163, -761, -3409, -511, 83, 2973, 1180, -6361, -3030, 3860, 3747, -5455, -4921, 1923, 4431, -485, -2671, 98, -309, 4290, 3289, -3082, -3621, 5205, 6178, -1719, -3353, 1458, 6684, 1456, -629]
888f29J595L17K337K200n651m688R523J955o738m391M488M339l318k455m94J533
904g7J03L771m663n661O037N169m736p074M758L857j482l279R78m35Q3N577m101
921a175n425L853O534l128n666J540M685J228n385K705j399j367N539O84q353
936e130R28R468l392m468j45L307J765j956j462l10j02J956M375q067k853R131
952C045J450p188j637N327k72L84n62k366j033M836L226p717k494N908M943n290
968E60m840L708M624j386l035J606m091M596O202p769o672Q946M799o751j749
983a252p01M435K020m271k032R75J156M020j082j0427N649R065p183n137L840
998i25J933o18J523m303q88L165K630j463n362R11O146M35p478J403M445j798
$$ y = [-629, 966, 1283, 3620, 5820, 169, -4519, 5004, 6959, 221, -4170, 318, 4657, 1339, -1116, -1610, -77, 26, 3797, -866, -6527, -490, 4679, -57, -7131, -2373, 1484, 2, -3277, -2299, -2734, -2651, 2926, -1175, -6600, -2747, 3787, 659, -5007, -3467, 1218, 2446, -2939, -234, -1633, -3000, 2539, 3223, -5130, -4202, 5266, 1874, -2594, -2739, 568, 2333, 377, -1085, -1395, -1497, 459, 4834, -3233, -6086, 3045, 4495, -2693, -4330, 997, 725, 1109, 547, -1819, -2852, 1984, 5210, -2507, -5001, 907, 5850, 560, -4280, -572, 4052, 2666, -369, 1237, -2854, 1742, 7944, 175, -6497, 2449, 7248, 497, -1252, -1953, 2482, 4502, 231, -1801, -826, 330, 4350, 3268, -7159, -1510, 7555, 372, -4765, -925, 1008, 390, 1913, -2390, -3278, -113, 2517, 1054, -4308, -3397, 2749, 3184, -4294, -2891, 1554, -244]
1014b44k55J241k380k018P218j313o021J545M183m13k122n77l43K937j421J49
1030A66O52l897K693N387n468m558P521q40l024K370j878j648M202Q55m234L99
1046a302L7L865L40o631J550N445j925l121L021l152R08N222l236n423L589N157
1062D344l748j854m58K493K228k908j930J096J567L83J449n442p92Q028j260p092
1078c896J914M455k073R43j807k116L529J616j946k655J99L003L069n953k379
1093d097N867K95k446j18K16j046L840o50m447N75L989Q71m425m59J493K857j728
1110E87k042J023M51Q02P59j922l107M890J896m880m13K513O22j048J03j674J327
1127a13R32l2o80k230J657K902j613l773L405J60j062J370j281j190J384J970
$$ y = [-244, -499, 742, -1638, -3656, 3562, 2249, -3772, -2227, 1956, 1543, -579, -1156, -1499, 1438, 17, 166, 818, -3079, -386, 5001, -467, -5025, 2496, 1656, -1368, 1002, -876, -2524, 1678, 2533, -1701, -1302, -1265, 2600, 2940, -3691, -2141, 3304, 1379, -1742, 1279, -1873, -965, 4257, 1021, -4402, -813, 4344, 596, -1258, -1716, 777, 3005, 97, -1833, -737, 830, 1213, 2662, -2780, -3572, 4456, 3196, -3896, -1982, 2473, 400, 1343, -464, -2580, 949, 2565, 619, -2036, -1837, 1166, 4235, -1718, -4097, 1770, 2065, -381, -499, -283, -1329, 2511, 1861, -2586, -2011, 1978, 2849, -1576, -2035, -542, 2315, 587, -1455, -432, 19, 821, 1580, -342, -3449, 1441, 3337, -1543, -1956, 557, 1179, 131, 234, -1440, -113, 819, 787, 107, -2123, -466, 2436, 823, -2950, 455, 615, -447, 923, -358, -1548, -164, 1806]
1143A806j805j288o4K261O98k991L50J085N8R9O63k371j57L356o95k498l86K619
1161G40M32j409q64O2J526L51l7k174K75J772J311k335k029K844J317j480j208
1178i06P18j39J801Jl108P06J993R71k347r84O74K602p09k386O66O10J000o5j504
1197d06j470K594J178j997r64M73J754l86o96j234P24J568l27r56j632J776J331
1214A330l38k213J55J658K36o79j087k2J407J350j948j393J493R48J93j959l38
1231a207Q62J714r41j311j13R40J474j076j654J23K508k23j833m40N12J686p5
1248I46j513j283K482O70j076r79j69J869M46j277j744J404J045r1r33j397J410
1265a90J358l00k351P70J272K42p9j369J68R42P37j599p84P18Q85K15j190l28
$$ y = [1806, 1, -1287, -1351, 910, 1608, -1383, -1033, 52, 110, 209, 872, -1499, -1656, 1700, 1005, -1493, -1879, 740, 1172, -237, -1101, -1039, 487, 838, 801, -1373, -1098, 674, 1985, -350, -2379, 465, 1782, 302, -906, -188, -327, 1474, 1475, -1633, -927, 1066, 2037, -310, -1294, -620, 1982, 1273, -1113, -447, 163, 1163, 1098, -406, -1876, 718, 1896, -101, -1065, -592, 1162, 776, 80, -1154, -430, 1138, 811, -145, -1777, -1, 1330, 992, -1221, -1066, 592, 828, 149, -938, -960, 447, 1797, -151, -1544, -51, 897, 1090, -869, -1207, -345, 1369, 428, -883, -996, -56, 1418, 342, -1312, -1189, 1319, 1096, -737, -1177, -665, 1021, 946, -567, -1850, 632, 1302, 226, -753, -922, 947, 1393, 116, -1628, -224, 821, 730, -203, -1600, -190, 1168, 868, -1483, -713, 559, 801, 722, -647, -479, 463, 1200, -399, -1183, -465, 420, 635, -555, -883]
1283h83N28J122q41k17p03N55J654r26j216j2J864r38l57l44j06R59K77o31q62
1302a077P65P89J48j250l30J495R1n91p43K52L18N22m1j679M43J334M56j511j22
1321g31Q22L46R0q71m8J97R39n85o24m66J277J232j918k93P49P92o62o5l14K70
1341A37P62j22p11n91Q13P83p83j112O32J064o95J75k24k33L11P44n23j087P27
1360F7J099p10j335J039M57k57k01m0l23N51O65n09q26k20J665k21j423M32M82
1379C92j14p7kp12L94J041j50q78l84J266K34j143l33Q65l44J15J79p14l0Q30
1399D35L55r68o79J443J72j052l12P10j87J88K48o71l05Q23M25j224k84P37J294
1418A148j298m56Q67k33k52P08l04j079R61N06p59r96Q65Q63p35m32L55M85o09
$$ y = [-883, -355, 767, -74, -291, -994, -439, 1215, 289, -927, -939, 925, -13, -370, -714, -820, 139, 416, -215, -1077, -312, 477, 625, -625, -955, 540, 631, 40, -703, -451, -133, 389, 348, -1331, -888, 446, 902, -609, -731, 91, 437, 527, -344, -392, -195, 744, 159, -465, -931, 346, 1578, -340, -633, 116, 908, 246, 181, -133, 137, 899, 777, 66, -525, 288, 1071, 288, -824, -192, 872, 177, 352, 128, -105, 206, 950, 427, -660, 67, 1166, 456, -879, 160, 617, 360, 159, 119, -204, 347, 1012, 503, -323, -543, 1122, 901, -522, -90, 392, 278, 201, 199, -513, -119, 922, 772, -106, -490, 776, 1010, -133, -466, 399, 55, 170, 349, -365, -395, 435, 790, -178, -857, 586, 758, -294, -606, 104, -83, 105, 353, -318, -623, 200, 625, -599, -883, -146, 1148, -150, -606, 261, 28, -224, 484, 180, -899, 62, 568, -191, -1187, -322, 541, -194, -626, -271, 214, -395]
1437c95N98r5j207P61O97p8j298O94N18k47p04L42L58p19J052k69o79K84Q23j34
1457C02j238M37O34l7q31N25N2l91P75j40p50pJ061k05o87kO90Q1p72O45o2j55
1479g5m2O82r81k04J251j78q65j39J014J7l30m35M23k09k52R67n44p87R73M79
1499G65q05o17R71J54n29J08J86n22M10O19p40m25L96P50n36m22J16L37m2j14
1519F0Rj06l5N79Q2j270L83R84n52m41J6N10j13J23l60K11p9K44M44j181K40O57
1541D05L41j261J16N36j91L69j55o10m6R19J3p21K8N58M7m62m4L35k5l06L93j04
1563A35n90O72K17m61n45J017l48k45L25k43M6L38j61K8l21J14L86k47o06L71
1583a18N58o25q0O05m14k08N44l72k61J67M45L3k44k3j61M1Q1K78k00m67N47K75
$$ y = [-395, 203, 108, -1099, -338, 359, 281, -1017, -323, 195, -52, -756, -414, -56, -775, 277, 8, -671, -387, 436, 302, -936, -499, 135, 98, -733, -208, -156, -547, 228, 88, -662, -669, 392, 187, -500, -502, 188, 269, -503, 142, 80, -75, -117, 565, -416, -620, 631, 453, -412, -551, 463, 480, 150, -285, 138, -71, -323, 644, 100, -687, 286, 765, -40, -657, 314, 468, -61, 47, 233, -289, 121, 740, 0, -425, -29, 721, 185, -237, -121, 216, 174, 60, 69, -37, -72, 507, 589, -681, -298, 686, 134, -307, -291, 219, 106, 229, -131, 80, 1, 245, 689, -492, -252, 405, 746, -515, -399, 137, -54, 315, 160, -450, -496, 423, 436, -285, -257, 301, 348, -114, -158, 177, 152, -154, 239, 135, -455, 217, 434, -27, -572, 445, 97, -148, 177, -66, -20, 318, 157, 185, -136, -22, 364, 117, -489, -118, 440, -185, -265, 340, -74, -282, 262, -110, -371, -204, 241, 274, 30, 7, -154, -113, -32, 246, 46, -421, 126, 401]
1605D01o80j26M86L5l07K29omj03P6j96j63K46K67j51j85J69L93k31l66M21m09
1627b04M0L72J01n89K74K58k71k60N38j84J44k51rk3J82k41K53j56p2K71M1l99
1649a85K93J53k42P2j75L98k94J16p4j77J90l7K5m3K2j29K61k08n2J42n3J50o9
1672H4r8K24j67Q8m91J87K84j62J56k61k7K92j05l7r8j37K11J22n7j37K02J31
1694B04l21K5m3J13R5J45j30k70m1L59n6j91jJ75J6r0j36K21J48j05k56J60l05
1717b84J73J64k93J45l2J56J4l97L09n1J70k72J91R5r2K33r1m50J63J58j2J4m1
1740c0K52k16J9j14q1K29p7J22o2j88K49r8N2m5J91k54J08J24l34Q1K56K8o2k25
1764g5J55j09o6L21j04k64K50j6o9l44K78L8P4j59l0J63o3j07j26J18J64J13j11
$$ y = [401, -279, -405, 81, 116, -191, 38, 32, 28, -75, 1, -195, -358, -112, 155, 4, -181, -12, 381, 150, -216, 205, -204, -164, 208, 309, -280, -6, 252, -19, -279, 259, 75, 219, -32, -41, -64, 118, -123, 130, -26, -98, 173, 214, -185, 108, 261, 19, 91, -84, 314, 20, 136, 62, -115, 75, 38, 63, 20, 42, -87, 174, -34, -86, 56, 3, 153, 84, -14, 210, 43, 131, -360, -173, 111, -51, 105, -156, -183, 109, 4, -33, -131, -268, -57, 65, 8, -129, 73, 204, -117, -92, -135, -22, 73, 218, 88, -182, -223, 136, 80, -111, -112, 63, 79, -11, -147, 74, 222, 117, -139, 21, -284, -111, 53, -240, -95, -127, 29, 43, -354, -45, -96, 74, -198, -7, 88, -4, 229, 138, -312, -149, 9, -3, 11, -30, 222, 6, 25, -89, -170, 59, -18, 104, 42, -146, 103, 5, 57, 12, 203, -51, 57, 181, -153, -72, 184, 212, 150, -75, 80, -29, -95, 226, 122, -142, 108, 92, 23, -321, -43, -5, 69, -90, -120, 43, -20, -127, -253, -135, 29, 142, 31]
1787C1l02L93J10j93n1j87J08J42j48R5J59j98J79q4J30l56K38p7j9k2Q8J67k03
1810@o5J37k01K06j65J7l8m7J50N2j72j36L23j50J07j73M8q9L03l75o0K97p3L18
1834B14m58N0J3N0k0j16J22M5K56k74l28L39p9J46j19j6j54M84l59Q9j32j29J96
1857a80N9K07m48L63q6K17l75K56J84j65O5j52ML03K9m29K54k33M50m31K14j02
1879DL33j24k2r9J00j71L60k76j3m8Kl2j04M0n6K41qO9k51Q1K92j76j3k17K87
1904A99R2j4q4j76J88r4J19l1j93O5K33k50O9o6K35p7k49J11J69j72K1J18k39
1927b6p3M63l67k42l7M75K33n62JK54j65k3r9j12N8K00k67M01m25K2N46m47J24
1950f8J56l2l11L25m96L12J93J60l49J46K77j15k88j27K45R6N8l13J58j22M9L60
$$ y = [31, -271, 122, 232, 39, -12, -199, -91, 51, -97, -2, 157, -41, 138, 54, 184, -172, 66, -11, -30, -52, 36, 203, 0, -65, 72, -129, 77, -88, -71, -109, -156, -6, 46, -126, -262, 61, -89, 18, -155, -107, -196, 107, -268, -328, -31, -104, 214, -244, -194, -181, -131, -151, -267, -145, -100, 156, -118, -446, -107, -186, -40, -159, -175, -329, 155, -204, -115, -247, -376, -180, -121, 86, -362, 1, -85, 132, -243, 13, 197, 32, 97, -55, -51, 252, 281, -148, 106, -127, 323, -108, 106, 4, 337, 213, 191, 92, 192, 21, 381, 105, 92, 44, 46, 14, -90, -50, -106, 135, 127, 196, -55, 26, 318, 142, 129, -88, 199, 291, 277, 193, 17, 205, 111, 230, 199, 6, 71, 304, 54, 123, 57, 292, 215, -34, 77, 246, 74, 95, 213, -26, -99, 364, -3, -245, -282, 193, 426, -136, -135, 119, -46, -69, -168, -280, -222, -22, -289, 112, -313, -291, 255, -192, -68, 88, 56, -255, 70, -426, -114, 79, 239, -110, 36, 313, 198, -90, -217, 28, 124, 182, -131, 27, -95, -46, 314]
1972C14k87r2n6L01l36K4K23P7j1l44j0n4L14j79K00l61K49L27l13j05k08L18
1994ij24R0N4l56J66K51k90k5M07r3N8k02k38M33j01j78K36q9k31N30k67n99M16
2017a61K35m8n05J91K31K08j73j91P9j37O24l53R1j76M20j65n36K83j4P9K4L5
2039D1q9r8L04q8J72n01L19O1l10J74o7k3J17J64j56J5oK22k38O0m0j07J16K41
2063B83l20j34K41j04K55j63o00Q19l03j37%J1L49O6k80m77N70J88k27j49k99
2084d11N32J29l75n18M73K87j30j11j44J62M89j48n30J6M68L9l62l64L59J25K66
2105B52j83k81K32J87k2l59o9J33M00n67Q8J14L81k94o5N6k53P41o57j02L02l
2127C1o0K18k19r6M47j78k41j22K63o3p5p4n3L67n1k13q5Q9K00J27m44n7L69l67
$$ y = [314, 27, -65, -121, 180, -156, -132, 91, 168, 157, -187, -197, -251, 63, -116, 84, -277, -28, 299, -14, -119, -327, -9, -133, -43, 11, -345, -179, 72, -218, -243, 164, 71, 129, -73, -311, 122, 21, -157, 79, -10, -241, 289, 22, -577, -161, 74, 26, -479, -288, -57, 151, -22, -213, -134, -271, 353, 0, 91, -85, 335, 170, -366, -83, -97, -18, 6, 41, -48, -146, 158, 70, 242, -259, 60, 121, -189, -15, -82, -105, 12, 176, 20, 35, 29, 251, 13, 73, 33, -74, 42, 283, -37, -171, 70, -34, 221, 58, -542, 277, -26, -163, -163, -152, 197, 263, -17, -494, 76, 264, 37, -112, -411, 121, 250, -125, -643, -170, 117, -13, -124, -268, -106, 383, 235, -295, -279, 189, 228, -134, -498, -139, -14, 252, 69, -212, 20, 207, 185, -174, -243, -110, 290, -277, -189, -75, 306, 12, -53, 3, -250, 491, -166, -268, 34, 31, -29, 189, -30, -126, 321, 143, -98, -220, 43, -20, -95, -169, -222, 145, 94, -119, -204, -115, 85, 212, -232, -289, 80, -287]
2151b87M10k94K06j19K52j32m15N12j64K12R4l13j09N8J5l42N04p6K4O2j43q1
2173a26J26K18l23L4J23K66l46R4m3k36K45j34k7N6Q7J88J10m14J43J91l49K64
2195A47R7l09j07M99l98M3O6k06M62l14L19L7j35j13o8M38l74N9J53j31k03J07
2217F9J91k96J69j58M5L27j27l81K81j6k42K90j77K6k42K73k66J65j14j19N10
2238B08l74j56j0N08m69J26N87m82M5Q7j47j66K91k30O3J24j64N83o89K31l31
2259c65M18K5j80J44l72M56pk45k64K59K15j62K40n30M96k62P0j44L9n2j13N94
2281B60o43KM08J84p30M15L85n20K07J14k64N0K80k39kLl76P30m36j54M32k3k33
2304a50L35k57k93O92l14q4k79L91k06K08m31K4L14k69K45l6r7J26K06J43o15
$$ y = [-287, 123, -171, 35, -84, 168, 36, -379, 133, -31, 181, 275, -38, -147, -89, -74, -416, 88, 12, 36, 98, -45, -126, 0, 218, -105, -71, 52, 318, -28, 66, 23, -213, 32, -102, -129, -73, 14, 202, 312, -102, 41, 232, -117, 147, 244, -65, -172, 327, -71, -28, 38, -168, 294, -20, 299, 336, 201, 88, 20, 458, 84, 143, 296, 165, -38, 69, 260, -36, 133, -25, 20, 347, 220, -161, 120, 104, -138, 152, -25, 1, -241, 32, -234, -69, -183, -302, 208, -166, -322, -332, 176, -293, -167, 420, -62, -17, 70, -77, -243, 48, -182, -119, 5, -159, 424, -265, -34, -365, 53, 78, -102, 42, -330, 126, 119, -126, -390, -131, 84, -78, 162, -368, 128, -134, -64, -208, -169, -221, -334, 260, -383, -381, 27, 211, -519, -104, 281, -239, -32, 82, -182, -132, 148, -91, -93, -90, -466, 264, -172, -326, 106, 83, -150, 185, -72, -365, 327, 13, -71, -350, 41, -165, 43, -388, -364, -50, -319, -74, -110, -207, -81, 125, 268, -347]
2325c47M9K12J35n32O05j51j48M40m05%J54J47rj00J99J36p5m79M94O2k10K95
2347D72j21m88Q0L25j03p7k09M30j23j03LJ63R2m57L83l83J37J40K2k25j48K53
2369F3k69M65m11O11n53J02J90j55l67L13L44m75L00k63K95j87K3L17j45k04J30
2390A24R8m46K28L19n73R9j1K83l08K16r6j12jJ56M01j005O69p6K35l89J06K81
2412A98l23K80j81p7k22N68l93q8J43J77r3k17M42k19J58k73K24J81n92L43K50
2433B86m80l2M06q9j75O1l1Q9j35P4j62J21K20R8k53l18M48k27q4m4J75n4j27
2456b33L00k47l3K74K11k04l74L20Pn5k64L83l40L19K6j33J10J2M18n82l4J45
2478B6J52k20k16J26J90j81K94p8m13L19J7p0k36K13L86m12L6k6J29m4J68q4j38
$$ y = [-347, -298, -86, 49, -483, 122, -29, -177, 263, -142, -142, 12, 159, 150, 50, 249, 385, 310, -169, 325, 387, 177, 472, 351, -137, -57, 268, 165, 88, -121, 309, 186, 83, 86, 249, 341, -116, 267, -116, 21, 161, 183, -42, -190, 63, -206, 259, -152, 459, -94, 8, 198, 43, -324, -11, 333, -142, 158, -105, 190, 3, 26, 343, 198, -6, 124, 222, -224, 4, 323, -250, -151, -162, 121, -187, 29, -67, -179, -180, -24, 377, -628, 41, -35, 200, -189, -83, 198, -125, 155, -26, -103, -325, 243, -150, -238, -95, 82, -11, -228, 214, -5, 153, -120, 104, 285, -307, 36, 286, -194, -226, 180, 91, -84, -23, -54, 35, -100, -26, -188, -67, 153, 251, -2, -320, 128, -99, -183, -227, -52, -106, -233, 67, -180, -213, 61, 272, 68, -306, 14, 21, -34, -298, 85, -255, 64, 90, -43, 67, 79, 497, -85, -119, 26, 178, -42, -258, -132, 58, -123, 171, 93, -320, -1, 16, -54, -290, -77, 309, -103, -67, -93, 36, -8, 160, 76, -62]
2501f2K45k55L04l72J30J53j32j48K30M4n95P76l4l30J20j45K21r6J24k93K55
2522A40j68K70l25R8j29L88j13l61N14k82jm1k40j73M42Ok23K18l53N97j55n56
2544d47M47K01j86l78M43j20n6l8J77k18K03Q1j92j60m4L65L1k41K28j62O0J48
2566A42k05r8J08L89m85k24O35J50m70j9q2K83M8j64P8j53J21K68k05l60K70J88
2588B15n83J87J92K96n44J71R7l22L07R2k41K8K75J2k50rkP2j92M5J56J50j59
2611gJ32k0k53R2J47m6l60L30j24o0k6M44p8m25K82m6k5j02O9N0j37j31L41k5
2635B2k25L62l19J99m7J89k28k91P40m33J66J08p8l35R8J21m6q1nO72o63n2L6
2658i0L77n90J66L21k13M4K8J83m53L81J87m42J56J16k1m1K79k76k47n1K89J32
$$ y = [-62, 183, -72, 232, -140, -10, 143, 11, -137, 93, 137, -458, 318, 284, -46, 74, -71, 150, 54, 178, -115, 140, -28, 242, -83, 15, -114, 274, 161, -200, 314, 32, 31, -10, -250, -423, 19, 25, -198, 20, -333, 264, 109, -447, 0, 201, 15, -363, 80, -40, -96, -134, 43, -175, 28, 109, -83, -243, -287, 78, 109, -132, 96, -66, -6, 142, -63, -161, -53, 336, -149, -373, 262, 412, -58, -77, -159, 124, 172, 8, 86, -67, 54, 322, 117, -243, 27, 215, -368, -181, 11, 307, -237, -66, 31, -291, 16, 108, -133, -105, 170, 182, -68, -77, -79, -7, -199, -154, 2, 152, -7, 125, 105, -148, -56, 91, 45, -315, 15, -109, -169, -195, 249, 171, -254, 28, -18, -43, -145, -76, -26, -163, -294, 47, 22, -203, 159, -160, 39, -8, 181, -47, -338, 402, -31, 135, 243, 165, -170, -72, 49, 3, -78, -83, 589, -74, -126, -90, 287, -303, -137, 184, -29, 15, 43, 226, -227, 154, 341, -101, 55, 171, 150, 109, 388, 112, -135, -186, 103, 235]
2680B35m07J11L01l00m1M9J85j37J44j3j51k00M27O6m59J4R4J71l02K08M3L3o3
2703HJ61L2n58K39J38k43K76l3K4j33M2P4j12K10k9k89q7K17L98m94j01J99k8
2726h9j72K8J01M21m57J46J45k98j52L67M9k12P6P8qo4K08k29m3L74k56q1L01
2749B33J02m19mN2M03n87J79k7j13J11k4K73k44r2L03n0j62J03K1l05J89J77k32
2772a13K08Ppl93L70j06L12k65j2J18k43J25K21k44j93L80K01n09o1K88J76k06
2794E4N0j30L11j38O7j92j86J30Q7j35k14M30m8j79J9J47j44kL44m35J6L4O5M5
2818dj28J37n4O5J32j77j41r6K44J80j30j83M38l76O0L53k16p9q5L09m37L53j30
2841C5P4p3k35K03K11m20J16L50k44oJ01q3k26J83K66o63Q2L97r8k78K02J3j57
$$ y = [235, -172, -61, 240, -60, -101, -52, 133, -4, 140, 127, -24, -224, 203, 269, -190, -176, -82, 89, -213, -5, 38, 71, 8, 169, 201, -357, -118, 20, -223, 53, 20, 44, -89, -47, 27, -85, 125, 96, -193, -280, -63, 335, -159, -260, -61, -89, -261, -233, -132, 289, -168, -22, 123, -175, -327, 40, 89, -123, -47, 31, 23, -41, 167, -62, -105, 269, 13, -68, 233, 335, -84, -88, -36, 367, -220, -41, -68, -181, -70, -94, 179, -65, -157, 146, 96, -66, 37, 58, -247, -58, 119, -113, 95, 102, 95, -298, 72, -34, 278, 13, 1, 119, -124, 1, 222, -22, -215, 165, 366, -143, -204, 84, 260, 54, 104, -26, 285, 147, 214, 22, -164, -34, 53, -82, -296, 134, 86, -93, -74, 73, -71, -73, 271, -164, -148, -114, -49, -4, -132, 5, -49, 16, 148, -29, -170, -266, -22, 158, 28, -155, 283, -93, -33, 320, 104, 25, -60, 249, -188, 165, 35, 109, 36, -199, 4, 215, -205, -89, 261, 17, 11, 112, 29, -197, -14, 252, -411, -329, 68, -30, -308, -106, -93, -250]
2864b50L72j03mk04J67J41k47K7K73K39o05K26m9k48L08N1J7j79M2J14J30m62
2886b44K45J86k07l4K37R3m59L80k81K53n0P2k26k29K32K20j52j29M2j55J72J45
2908A11J4o9j94J68N9k95K26J85j37l05J33m5r9J65J67q1r9J04r3j59K77R4k10
2931h3m5J23R6k33O3N9N0j25K90J31m33N7K33k86P8j01K2P9OJ42p1J01o9q2N7
2956E9l07K26K71m39J74l0J90j43j43L06k68p6L62l85K38rJ7o0j30K49p9l5J30
2979A18R5k33PJ67l06J4K09j71L8K54k95J65j02R3K4j26k45L2L00m41M51j1M4
3002H1p7j46n3N5K82k66J48j25J65j33K1O7Kj56K90l0l08K85O5j79mr1R3J30l3
3027H3K11k57k20J69R8j90Q1M3j79J4L49j96n3K37k05J53j84L7L6k15J01K20k61
$$ y = [-250, 122, 19, 15, -189, -22, 119, -128, -101, 172, 411, -194, 32, -17, -265, 43, 94, 111, -68, -26, 88, 218, -244, 1, 187, -20, -54, 183, 276, -183, 197, -84, 169, 119, 191, -35, -264, -32, 188, 36, -93, -51, -206, -34, 111, 125, 56, -138, 30, 89, -206, 20, 205, 68, -237, -104, -149, -248, -83, 84, 3, -96, 8, -85, -244, 33, 127, -83, -128, -5, 91, -142, -79, -20, 30, -95, 195, 326, -107, -50, 183, -103, -25, -126, -104, -25, -19, 123, 52, 153, 84, 2, 59, -248, -22, 249, -190, -16, -46, 144, 1, -142, 164, -104, -180, 182, -203, 35, 26, 43, -17, -147, 102, 23, -12, 118, 213, -20, -13, 154, -152, -138, 71, -100, -62, 192, -103, 62, -40, 53, 77, -49, -294, -262, 38, -403, 48, 37, 81, 4, -142, -195, -140, 142, -124, 24, -101, 64, -69, -48, 19, 21, -135, 155, 125, -183, 102, 167, -12, -16, -107, -14, 116, 83, 294, 37, -183, -14, 84, -106, -25, 18, -161, -147, 202, 6, -47, 190, -15, 138, -46, -9, 27, -188, -87, 133, -128]
3050a28J34N8l08J69o7L13k3k33n0J04l1j0K63m45L84PQm67K48J54q6J08j92K36
3074A46k21K9P6j09rK58k56j36J71K00k32K18j82J12j19K2k8j8K6nO3j01J49j54
3098a00K50l21J78J13m68M27j99J52j3J10l0J44l32j17L88k59N2J85k49L5P8J89
3120B13l64pL1J18P1j70K26kj57QQ8q2O6O9j29Jq6J42j91J43N7j67p8J09J86k06
3146a11J43k44K42l43J52J44m0R3pJ39k99J62R5j34j9L0l4L9j04J47j14j39M35
3169B33j34n39N83j2k27o2K74K3j15P2j66j0J30J53j45l5l1Q0j40N3Q9n2J96j02
3193A16l0L29l85p3J22k56J96Q9k10Q0K8J98k13n9K19j45J57k11q2K48l54J44
3215i2J25j8J62j45k44j42N19j09k79K16k0r0K12p7j58R9k98K79J73k32L16M8
$$ y = [-128, 6, 64, -244, -75, -142, 171, 148, -85, -135, -31, -62, -72, 191, -254, 130, 137, 145, -322, -74, 80, -6, 102, -90, 146, -75, -46, 30, -79, -88, 170, -86, -222, -51, 149, -83, 135, -47, 65, -54, -32, -60, -78, -52, -57, 6, -95, 54, -100, 150, -171, 7, 120, -348, 79, -120, 32, 19, 129, 99, 243, -89, -206, 182, -77, -25, 160, -89, -54, 24, 213, -151, -158, -127, -9, 62, -108, 118, 116, -41, -33, 55, -27, 39, 108, -21, -20, -106, 36, -155, -12, 45, -122, -200, -91, 95, -111, 32, -212, 30, -313, -161, -17, -57, 36, 29, 168, -131, 31, 126, -8, -27, 3, -31, 8, -96, 51, -63, -202, 233, 99, -440, 143, 131, -96, -158, 116, 139, 24, 96, -70, -80, 50, 203, 58, 23, -8, 72, -68, -15, 74, 22, 218, 116, 86, 415, 30, -43, 79, -177, 19, 108, -102, -22, 6, 204, -9, -68, 151, 6, 163, -48, -130, 118, -236, -92, 33, 15, 177, 32, -212, -354, 165, 56, -223, -7, -27, -117, 95, 18, -140, -41, -339, -60, 113, -119, 197, 245]
3237B45n26J58L58k21r1L0Kn0J06R0j79q6K45j07L0J85j08q4j29J49N6j77L03
3260A99j04n4m8K48k47K9j91J74j3k88L11j18Kl4K69l13K04J31m53n6M87j97M6
3283a6j78K20M7j75j28K59l57M61j52J74k33n3R4j8K87k22K9J7j20L5j02L35l65
3306a61K65J6qj60j53J72mL9M5j3j01J50j78L14j98J2p5K12q7r4J37O7Jk05p3
3331h0N17n90J7J16l8k0R7j08J36J40j80k3P5j8O9m29J8J77J14q5J96j81L16j98
3355C8J1Jj77K90j60j12j07L58m97L98J37r3p5l13L28j1n3j48n5L11k51L00k4
3378I6q4k35K97N2k83J72k12L65k61K67q4j40P8K02k75L23L7l55l5J19J80k33
3400iJ62j80J46n1O3O9k12J69k8l1J95l38J23k7q4j80N0K86ro0j05J72k2J20j37
$$ y = [245, -281, -123, 235, 14, -77, -47, -45, -95, 11, 101, -78, -164, 81, -26, 4, 189, 81, -3, -132, 17, 73, -104, 199, 95, 41, -7, 241, -6, 23, -168, 6, -7, -295, 16, -102, -100, -134, 135, -178, 26, 157, -296, -352, 135, -62, -16, -194, 26, 73, -102, -230, 29, -328, 133, -19, 155, -78, -131, -37, -55, 232, 10, 39, 56, -64, -29, -131, 204, -161, 104, 120, 112, -48, -201, -29, -33, 6, 51, 38, -63, 87, -91, 223, 25, 37, -38, 174, 87, -7, 130, 197, 198, -7, -80, 437, -153, -136, -20, -58, -78, 19, -89, 47, 187, 7, -16, 59, 41, 110, -319, -301, -124, -10, -95, 101, -80, 236, 38, 49, 50, -127, 163, 3, -109, -216, 142, -355, 43, 180, 87, 12, -301, 27, 16, -37, -185, -240, 71, -180, 120, 96, 12, -223, 74, 126, -157, 15, -197, 168, -93, 174, 90, -50, 28, 230, -45, 278, 315, -40, -75, 44, 224, -9, 153, -27, 119, 68, 131, 200, -12, 157, 129, 98, 293, -45, 78, 51, -33, -213, -163, 123, 114, 54, -51, 121, 99, 219, 82]
3425H2M2j93L45m42J17P1m4m3m6P5P8m0K9j44k8K02J4j87K25k0k32K2r1K13r4
3450h9J68j26P5k7j90K20Q8j76J70j36O4j67j95K32K08k49L77k32J37j97J36j9
3472G2J02j1l56K09oJ35l40L02K6l79J89o6M00p75N48J25j19N7Q5M0j39J3m9J35
3496A98l05K78k21l28K76K04n0L1k4J63j88L5J45n1j26j24j94L49L7j07J93l84
3518a93M39k65r8P3j98J30m7J55J49j31k18J49P4R2l14M7J74k84L10l0j01j25
3540b12K19J03R4O0l42J77l49M48k51k00L7J28J59k42m0L39k62p9K32j0J72k89
3562a08J38K2k06M53l71m22P44j58m7k7J15o3J46j08L9j68O0o0j04J21j02K88
3584A82k73Q8M22m36J92j85l5P7P8j58J27j63J36M4m38M16k00L75m56PK22l5j3
$$ y = [82, 124, -69, 276, -166, -49, 22, -22, -65, -111, -36, 42, 2, 31, -113, -141, 61, 75, -112, 113, 93, -139, -117, -208, 5, -89, 79, -47, 28, 1, -189, 31, 119, -57, 113, -23, 41, -126, -321, -89, 119, -130, 247, 15, 152, -45, 91, 72, 174, 163, -193, 16, 10, 145, -195, 107, 133, -246, -57, -123, 277, -498, 50, 175, 56, 113, 198, 238, 99, 112, 63, 198, -107, 171, -50, -378, -102, 102, 52, 83, 59, 222, 34, 69, 214, 163, 37, -87, -281, 68, 105, -2, 191, -193, 246, -19, -117, -44, -242, -112, -159, -4, 145, 14, -204, -55, 19, 111, -203, -156, 18, -266, 44, 14, -87, -212, 7, 110, 204, 264, -78, 99, -250, 198, -53, -253, -216, -88, 71, -171, -211, 128, -134, -213, 19, 9, 181, -108, 30, 52, -154, 299, -72, -494, 250, 92, 45, 18, 133, 70, 216, 108, 147, -21, 39, -21, -125, -4, -106, 182, -91, -3, 419, -17, 175, -10, -45, 32, 110, -48, 79, -84, 52, 96, -342, 74, -126, 249, -207, -200, 22, -13, -26]
3607b6l5N2l81L71Q3k90K57j23R5m8J46r9k00R3J77J36j15j26J49q3j97K62N4
3630A52j45J90n06K59j35J94j07j4o0K33K32l13O5n6m5k80K90N6L0j26R7j02j92
3653b83K22J35k32J82J17r6j50m1J65l8j5l4K71k56K05p0J65k94P5k48J82P5j69
3676a32L03j93K13j94J0l88M21k20K58k13k0M3j48K66j30m7K84k01M8J68j67k87
3698c26L20q8r6M45k99R7r0j93J44K3j2J77j47Pj38J43J7j61L22k61J24L9p5J36
3722A08k88K60q4J17qk23Q0n7J53R5nk69K63p7O1j95O7L3pP7j38K5j30K50k81
3747a73J72K9j24r6K95k01K02j39j35J19j3%K3Q1k94R1J39m7K5j70K16l0j24L08
3771A54j35O5J1k04K31J79l89R8j3J88j74J63k27K1j70J29J93J03l17J54K5k67
$$ y = [-26, -61, -9, -390, -19, 64, -226, 31, -92, 3, -45, 101, 2, -198, -105, 72, 208, 93, -33, 116, 33, -164, 98, 152, 7, 197, -309, -50, -185, 9, -98, -112, -172, 61, 293, -20, 45, -11, -56, -336, -46, 10, 40, -86, 11, -91, -283, -61, 74, -158, 24, 141, 45, -105, -146, 19, -19, -34, -68, 203, -53, 152, 82, 247, -47, 28, -220, -38, 37, -132, 171, -22, 191, -3, 7, -381, 40, -180, 78, -135, -155, -112, -260, 6, -124, -171, 113, -88, -40, 128, -39, -326, -6, -94, -190, 255, -44, 53, -37, -230, -86, -63, -75, 102, -45, -38, -176, -33, -16, -177, 145, -116, 8, 47, -28, 108, -180, 80, -4, 113, 105, -118, -38, -95, 58, 153, 148, -121, 142, 65, 126, -69, -2, 31, 24, 101, -37, -12, -142, 108, -173, -1, 28, -96, -192, 103, -98, 104, -35, -170, -51, -64, -64, -41, 40, -254, -163, -24, -71, -46, -216, 0, -30, -154, 154, 19, 84, 95, -109, 122, 301, -88, 10, -3, 185, 11, 174, -53, -32, -202, -73, 120, 223, -94, 60, 85, -182]
3793a82J10J33J23l05P4o2q3J5K13J6kj77R7k9K56j22J26j00j17QJN5Kk75K42
3818A7mJ59n0k38L58j72o4O8RR2k43P3J38r0L7k7J50j48j61J71L2l38M76k65O9
3843D9j21k8Q9J28j93K3J68p4J20q6j8J22k74QJ63r5L9R6n8K92j19l05J94j44
3867b4J71nn2j65L0r0J62N7k0k63J23J21j3k94L76oJ4j31j24J06P5q4k6J59j78
3892h1qQ8N2K59r4j97l01K27j06J72k39M05m1l46K61k44P4J2J57Mk09M8L4m4M2
3917g5J58k44M29j36k14j23J60K42j53j7J24J39n11K45J95j26o9O2j67Pk8K1k0
3940a01L0J0K37k49Q0J48J0k79J53p0J13j24p1r0q3L56R1k45J00K32j32j79r9
3963a62J18j14k1Q0R0n3L61j98j85m7L68k37j9r0O5O0j06K15P6k69Q1O1p4j01
$$ y = [-182, -72, 61, 184, -121, -47, -109, -192, -177, 36, 52, 50, -127, -30, -59, 197, 75, 201, 101, -16, -8, -7, 48, 50, -225, 17, 13, 172, 122, -116, 242, 70, 6, 74, 83, 175, -68, 5, 143, 53, 90, 63, 213, 65, -96, 75, 107, -231, 245, -20, 49, -72, -100, -11, 117, -76, -53, 115, 41, 161, 75, 57, 179, -95, -87, 76, -19, 20, 116, 58, 350, 231, -74, 120, -24, 147, 142, 90, -75, -45, -135, 27, 84, 64, -199, -76, 45, 32, -262, 114, 108, 122, -9, -133, -27, 48, -36, -62, 97, -81, -89, -1, 51, 310, 216, 19, -282, -55, -161, 11, -228, 177, 136, -210, 51, -193, -119, -107, 50, 54, -155, -107, -73, -117, -75, 83, -161, 268, 132, -82, -205, -45, 197, 44, 27, 151, 290, -221, 24, 219, 93, 24, 86, -81, -74, -102, -81, -101, -71, -61, 176, -73, 7, 155, 165, -114, 39, -31, 82, -42, -113, -203, -286, 70, 161, -84, 16, 248, 116, -63, -162, -44, -158, -179, -99, -9, -62, 299, 101, -84, -131, 237, 0, -19, -109, -44, 16, -90, 125, 201, -68, 13, 74, 0, -101]
3987a01K60k95L35j09j31K31k53J53K9j77L3K11ml07J47J33k57o2K25j3l69L28
4009Gj02K15J27k57J32j65J38J14k58M1O8P4k49k1P4J72J2n5j28k9O8j43Q2M5
4033c8P1N0j75P2M9k09O3N3K49n78L59O8p9LJ00P8j84P4j17j3m3L21J4k04Q6l1
4059C9J49j81l3J43l10J79Or2R5q3J51j11m8j3L57l18j26K56L1l56rM1L82j33
4083A6Q6k20O6J43J30o9j46j01J12o4P9o9O2J84j73J87m11K49L8L8j86rR4J61
4107A97m44L69L3m6n2M2k24O7J44k34J23p0j0o9K73p4J0k73K44PK31m16K98n4
4131G2j25J64k39j57Q3L28r5k66J85J39j66K72k33Q8l21K59o6j02J72%R2p0O1
4154G5M2l36L00J2r4lO3n1l61N25j00j13n7L2J35j22N7K7K12k44m2K30j61M7M
$$ y = [-101, 159, -136, 199, 90, -41, 190, -63, 90, 119, -58, -25, 186, 182, -125, 22, 155, -102, -164, 61, 48, -321, 7, -95, 120, 247, -10, 122, -43, 95, 209, -49, -8, 60, 134, -115, -136, -62, 110, 122, 67, -61, -90, -22, -165, -83, -38, 33, 83, -92, -20, 29, -180, -117, -64, 185, -393, -34, 34, -45, -42, 58, 136, -48, 26, -91, -104, -147, 174, 188, -16, 70, 39, 188, 7, -26, 117, -193, -14, -8, -100, -5, -88, 63, -48, -96, -109, 248, -70, -196, 60, 91, -265, -274, -233, 149, 16, 102, -118, -52, 91, 221, 152, 6, -95, 17, -47, 32, -37, 25, 209, 36, 223, -188, 61, 99, 137, -49, -58, 36, 197, -247, 122, 155, 109, 57, 99, -125, -58, 86, -148, -25, -95, -105, -174, 99, 25, 35, -238, 6, 13, 244, -172, 126, 72, -53, 111, -128, -285, -202, 126, 31, -235, -50, 89, -77, 195, -38, 50, -271, -12, -78, -180, -8, -8, 84, 14, 75, 117, -219, 81, 93, -1, -4, 59, 8, -353, 172, 72, -41, -98, -66, 69, -53, 4, 31, 243, -1, -43, 187, 26, 73, 77]
4179G7p4p5JJ55j6l09J11K90k67J76m6j69QJ22R6PO5j44O0q1O4pj05j05K50j9
4205F5j5R4l3l3k12K13M5j31l9K7J54j00o5Q3r4P9N1m7k43L77l0m6m22J53J76
4230GK39l90J29J43k61K51j07j69N4K46j87q3K41j67j63K29M0j89k76M30l4j1
4252b8J28Mk74P0J04j9j65K37j77r5J97J2L22m01K8j0Qj1l9r7K18K63k06j05n4
4277i0J43m5k55K39J28k73N4R3j45J10j01k7M03k53J26q3M2qj90J16N4q1L25k77
4301Ek3O4o9r5J59k4j42J51M8Rj22L4L8q2j50K18K22k73K31m61K58Qnj6L4p5K48
4328A90J79n40o3M8L21p4k89J02K38q1jO3l29L22j88J07P3j90K92j20K3K10l33
4351d0J19J12j35j68K23o8L1p3K9k66N5J90MK06j47j43K48p3j96MJ18j23N2O8
$$ y = [77, 3, -72, -71, 84, 68, -241, -130, 160, -107, 69, 23, -146, -138, -16, 80, 87, 152, 8, 68, -13, 51, 44, -61, -166, 84, 65, 50, 144, 111, 78, -134, 79, 124, -7, -46, -19, 135, 35, -30, 53, -41, 38, 89, 42, -201, 176, 146, 100, -322, -169, 7, 246, -144, -15, 128, -133, 118, 11, -158, -104, 142, -45, -128, 113, -54, -217, 12, 52, -137, -413, 17, -17, -28, 100, 104, -170, -100, 4, -15, -180, 57, -120, -215, -18, -6, 316, -85, -57, -67, -59, -70, -109, -206, 12, 275, 69, -36, -90, 53, 8, -247, -8, 120, -153, -99, -6, -151, -41, -142, -169, 234, -19, 107, 24, 66, 58, -132, -16, 38, -43, 282, 5, -18, 46, -23, -118, 41, 17, -125, 26, 74, 83, -39, -5, 33, -49, -199, 19, 241, -32, 199, -262, -4, 4, -1, -17, 17, -58, 190, 369, -171, -234, -186, 135, 61, -228, -126, 112, 31, 30, 93, -236, 86, -102, 5, 78, -112, 180, 60, 83, 293, -40, 79, 191, 56, -112, 111, 43, 74, 1, 30, -236, -181, 9, 13, 219, 72, -71, 177, 104, -92, -88, 30, -93, -41, 27]
4375B7Q4K3J56l87J83l6j2j31n1J42q0kJ91L3M6p5J06j83N0J42k90j4K15o1j75
4400i9L1R8l9rMl3j22J43qj57N6R2Q9p6K4MM7o0J12p2k04J27J58k02O0PJ55k9
4428I7Q6k72j30J03O8J25j65K44p7k17J84j74K68m5k7J23L0k87j7l4J35r5QK0
4452d9J47l39N18k12p2j28j4K23n5P1k6J19l42L22j38o4J75J37j53m0j46qj32
4475b06K37q3m2m1K71k58M3n3J87o9j72J27R0M3q7ll15L69p6J67k57O5k58L13
4499hN6j72L70j08l37K04N9j40P8l6M4N4k36J09K74m75J60o4N19k21l8P1n5q6
4523B2J8q9m2J93O5k73R5N7P5r3K7n7j10K9J93j66m5J97M4k77J48J2JJ17j06q4
4549d9k4J26M9qj57OK20r3k88L11pj91L3Q8k51M02l74K91LL4l3r1q6J14K01n3
$$ y = [27, 111, 134, 290, -97, 86, 50, 38, -93, -144, -2, -82, -84, 107, 140, 186, 111, 217, 34, 84, 226, -64, -78, 137, 76, -99, -68, 30, -9, -18, -14, -47, -169, -26, -34, -191, -135, -43, 46, -30, -6, -2, 45, -15, 97, 25, -179, -52, 106, -96, -36, -29, 126, 97, 183, -89, -219, -116, -48, 77, -88, 156, 79, -138, 46, -128, 140, 95, 68, 191, 221, -66, -83, -117, 18, -77, -69, -49, 98, -241, 277, 65, -7, -135, -149, 74, 19, 90, 64, 183, -159, 163, 25, -39, 136, 273, 120, 80, -66, -74, -206, 31, -52, -94, -135, 136, -122, -79, -132, 55, -14, -186, -59, 31, 74, -13, -16, -331, 38, -38, 129, -128, -63, -321, -8, 48, -124, 246, 138, -199, 5, 64, -76, 2, -34, 10, 64, -172, -63, 211, -264, -104, -168, 351, 130, 92, 163, 108, 22, 40, -49, -91, 102, 167, -106, -11, 46, 121, 28, 55, -2, -112, -83, 110, -56, -101, 96, 140, -137, 11, 23, 24, 141, 35, -49, -73, 53, 102, 94, -63, -57, 163, 70, -218, 93, 86, -105, -72, 16, -235, 167, -207, 84, 87, 121, 88, -3, -89, 25, 226, 173]
4575A73k86m7k1k19J84%L96l79M66l19L8JO6r3j58J10N9M2j08N7j41J53k15K11
4599c0m7m6M37l15n1K12J08l31J11n0k00L25r5p6j32M52k12n9l3L7lJ10j78j4
4623h0n2K41L3j38J06J55k74K2K51j15j24lj76j16L11j95K84j10L2N4k18J06k53
4646b59M72k36M7Q5j57N3j59P0Q6J15j10k0N0R5k55P1N9J68k53J6L5J02L0k51
4670a46K33o6l9j17K32o1O0l45J34j6K32m5k07L7K93q1j41n9K3N8K34k06M00l91
4694A6Q4k02O2R8O2j60j53J22r2J67p8J3l8J47J21l64N9J68k74K52m0k77J38K17
4718D8j70J07M1J51%j20j8J76l76L63k04J03j60k51M60p7k62J44K6Q4j35k2kJ36
4742D2j54K4Q0K7j38L27k12n2j10J57L5p4r8N0J42j63L20j73J17k51j05K06k26
$$ y = [173, -113, -160, -181, -400, -216, -216, 180, -199, 267, -52, -14, -13, 53, -40, -198, -88, -29, 13, -95, -38, -179, -26, -241, -30, -77, -123, 314, -1, -52, 160, 268, -63, 48, -2, -202, 123, 28, -48, -180, 272, 60, 1, -32, 5, 2, 112, -66, -80, -132, 109, 142, 4, 110, 265, -9, 13, 264, 149, 25, 22, -154, -270, 41, -154, 130, 20, 52, 106, -112, -6, -259, 213, -23, 24, 109, -48, 5, -154, -84, 2, 117, 7, -13, 37, 132, -123, -52, 7, 175, -78, -62, -27, 75, 105, -146, 87, 21, -18, -135, 97, 36, 96, -249, -115, -131, 101, 56, -151, -114, 179, 98, -43, -102, -79, -21, 213, 7, 407, 16, 100, -102, -40, 58, 120, -40, -193, -71, -163, 4, -74, -61, -99, 48, 169, -195, -136, 32, -242, 10, -30, -307, -169, 48, -122, -15, 26, 177, 177, 57, 39, 215, -161, 202, -2, 101, -59, -310, 150, 73, -189, -45, -19, 65, -70, -92, -94, 42, -112, -88, -8, 19, -119, 208, -4, -56, -166, -9, 26, -48, -146, -96, 46, -117, 203, 30, 147, -104, -209, -3, -229]
4765b29M34k03OK5R8j53R5k68K36J06j23k05K02J49N0k24L69k40l1j10J36k37
4787a17K75o2n0p4P7R9j48J37j35P7N6j94J71j14l4L8k49L05k12J05J59M2j08
4810D4J15j54K1J20P2j06j76J29Qj67K57l12J26l9R1j18J01J8k6J09j66J6j23
4833a60P0R1Rr4L6M6k1J39j59J34l9j12m3o8m5K09K35m12J40PQ6j8k19OL57k32
4859e7p0J28%o6J50k11J33J64k73P1r7K29J37j0k08J10l56K26o7L0K58L0j56r8
4883cN4p3j01L67k12j19l9k4O4N3J37J13q8k03Q5Kn9O2m9N0K2j37M3L2j25m0J0
4910a78K63m4n0k0K25j56j4O8m1N5o2O8k1j15p3Q1p9j11K68j16M3n8L0K65r4j77
4936d3L22m78K56j75R9j42J76l02K28oJ79j00j64K12j70K00k48M6o0K53n6k65
$$ y = [-229, 205, 2, 8, 33, 131, -22, 73, -195, 41, 147, 24, -181, 21, 170, 220, -4, 365, 125, 94, -16, 120, -117, 158, 96, 46, -28, 49, 148, 0, 137, 2, 79, 135, -59, 112, -2, -36, 2, -247, 58, -154, -49, 110, 152, 44, 159, 5, 26, 146, 218, 112, -64, 65, 73, -94, 163, -149, -23, -62, 29, -89, 12, 30, 4, 113, -53, -37, -160, -90, 1, 10, -84, -48, -2, -23, 116, -43, 91, 52, -60, -103, -171, -216, -7, 228, -184, -44, -37, 49, 31, -188, -182, 175, -57, -127, 1, 1, -65, 85, -126, 7, 171, -102, -31, -128, 101, 238, 228, 20, 130, -226, 0, -67, -37, 221, 251, 95, -3, 51, -22, -123, 244, 32, -87, -126, -150, -86, -33, 104, 217, 129, -74, 11, 13, -46, 16, -33, 17, 39, -98, -55, -23, -148, -188, -178, 85, 41, -9, -29, 196, 40, 26, 94, 53, 108, 46, 114, 93, -22, -95, -14, -93, -204, 64, -52, -9, -67, -37, 228, 134, -43, 279, -199, 57, -118, -19, -161, 15, -287, -59, -65, 114, 14, -150, 62, -108, 92, -156, -110, -170, 83, 27, -238]
4958b38J52P7K10r9k56O4j5P5j30J40Q9J97k43K1j0J35j77K9j12k6J49j28J47
4981E1j79J68j31KL7j0m5L14l53O1M3r2R7N4q9J56l86L61P9q8l10L70J62r7K5
5006B00j23Q9j23K9J85k51J1R9j89P7Q7M9j58J64k33L09k80J30m28K50J11M3J62
5029B10l47L2J43qj03R7j29M9L3J00k08J7J42k81K61l7l2N7J91l50L32k33K3k34
5053b75L21J40j67p3p1J1J21k14J83M4k11L57j28k01L44j29P5j79k1M57m27Q8
5075D5l09K52J6N3J62k35J3N3j41K21r2j06M28n02K41j7k6j88K66j76J47k99L08
5098A14k31n9K26M1K5J05k35l4K3K0P6r7K11j35J45j19l0R2j48K85l65K10j69
5121d9J13k67L5J22pp4J05K14j50M0j38J20%R6j22n7M2j58JJ55k66L33l3p1o1
$$ y = [-238, -86, -9, 201, 102, -154, -90, -105, -30, -160, -20, 69, 266, 23, 44, 34, 169, -8, 21, -91, -117, 32, -96, 51, -128, 40, -91, -89, -52, -62, -107, 207, -146, -85, -42, -134, -37, 17, -72, 84, -302, 59, 138, 50, -260, 110, 272, 175, 200, 77, 166, 43, 72, 257, 6, 17, 116, -73, 4, 91, 140, -18, 146, -87, 222, -58, 72, -356, -106, 5, 48, 210, -137, -105, 38, 30, -73, 24, -105, -56, -23, 77, -131, -114, 28, -253, 8, -29, -61, -4, 187, -163, 169, -64, -41, -275, 46, 186, 19, -54, -125, -114, 7, -207, -24, 20, -191, 166, 38, -163, 181, 52, 127, -52, -73, 384, -43, 45, -264, -12, 4, 57, 219, -16, -3, 50, -91, 130, 38, -68, 360, -142, 99, 82, 56, -132, 134, -42, 105, -194, 114, -117, -176, 50, 91, 116, 221, -14, -48, -25, -5, 71, -26, 185, 50, 195, 76, 46, 138, -10, 275, -90, 120, -49, 64, -203, -168, -46, -53, -127, -22, 192, 42, 82, -56, 64, 64, 160, 38, -19, 23, -135, -134, 21, -245, 88, 55, -16, -77]
5146g7J08Q4j49P3J64j32j49K29r0J97j72o3n8k0J30N8mk17K37l2Q7m30L10p1
5170A3o5k4J12N0j42L50k80j16J68M3j26J9P4P6j44q4RL7K26k49R4m7J6N2j88
5195a26K68o9j2Q3j98P4ok95K12J43p1M8m9M6O2M4n06M34l82L89j44J84r6MJ28
5220A65m48M76l20K24q8L0O3j95K28j70Q7p4lK71l06J64k26J79p5P3j50J5j05
5243a85K72j02J81r1j88K67j69L7k95J01P8r7J25n4L62j54m6j22r5K30j41R4N6
5266F4m7J6j90q5K73j98L36q2n2m9n0N8k3l7K8K8J17j63O8j54m0P9J55k5j61K92
5292A58k29L4j07K0J3j08K08p2J67L3k33R9r4k11L99j08R7m9j03J08Q3j82J61
5315H4j23k8N9n9J24p1l5p1K07j6j65K59k11o8J57J57k02l7LPo9J50j87M6J21
$$ y = [-77, 31, 115, -34, 39, 203, 71, -78, 151, 61, 258, 86, 23, -35, -55, 75, 133, 129, -88, 149, 117, 204, -226, 84, 13, -52, -76, 36, 86, -56, 294, 14, -102, 66, 109, -17, 2, 76, 152, 8, -76, -67, -30, 196, -53, 41, -6, 10, 62, -126, 142, 73, 61, 144, -54, 20, 14, -281, -69, 74, 3, 51, 2, 48, 110, 154, -352, 82, -300, 89, -55, 129, 33, 37, 165, -283, 193, -127, 97, 9, 39, 102, -93, 135, -35, 52, -22, -25, 246, -60, 104, -122, 57, -18, 55, -95, -80, -185, 87, -15, 166, 75, -113, 154, -15, 22, -273, -172, -94, -191, -66, -120, 242, 88, 42, -80, -175, 55, -86, 8, 64, 17, 33, -157, -242, 31, -167, 169, 87, 35, -14, -64, -6, -29, -66, -38, -10, 107, -56, 12, -142, -182, -103, 52, 27, -134, 158, -71, -37, -144, -124, -111, -219, -11, -83, 84, 117, -116, -17, -111, -322, 77, -31, 66, 17, -86, 22, 105, -77, 84, -39, -67, -8, -67, 57, -14, -49, -120, 87, 71, -94, 165, -46, -114, 43, 200, -2, -39, -36, -29, -98, 52, -135, -89, 32]
5340C2M0l08J35O5O2j95O4J98o3l1j5RJ69j98M3R2k42kK3K08n6k11K23k23J90
5365IJ22j47k2J92j7l9k71L98n0k37L02n35J86J33J6k99M55Lj88p6kN2J43j92
5389f4j13J89k37L39j70j68K40R0j26J06l7j50J34J17l94K89K5kJ93l20J45M1
5411A27o8J25j27q9nr1O3J72j75kj8n6J60%P8k33K57k46N7J89m33J95J60p3m1
5436g4q2m0J06J94l27L21m5jJ65l04j16J79n8j10L95m3k26J5J1K31p9n0j87j27
5460b52K88k07L84k62R7j60j14K67l08L43p6J61k08J1J69j35k1j39K33j84K17
5481A04k68K5K95k99K8J23J11J41k66J03j93J56j62k65J72J89J79k27J85k25K05
5502A11R3n23K17p5J50k2j20l6L45j27P1k1j81K75k6j15N5J5j8k3l0r5Q7K42k72
$$ y = [32, 72, -236, -101, -36, 26, -169, -105, 93, 30, -1, -16, -7, 162, -36, 7, 99, -143, -145, -122, 86, 30, -181, 42, -181, 9, 131, -16, -38, 154, 137, 98, -173, 225, 175, -62, 240, -295, -109, 24, 40, -259, 196, 199, 11, -65, -67, -15, 128, -64, -177, 12, -225, 114, -56, -224, 16, 106, -20, 86, 49, -101, 33, 150, -244, 45, 70, 68, 261, -59, 86, 127, 59, 184, 57, -32, -37, -128, -65, 107, -68, -70, -88, -144, 16, 16, 94, -139, 118, -128, -71, 118, -315, -120, 40, -33, -74, -156, -196, -90, 104, -223, 98, 53, 52, 217, -87, -203, -24, -82, -192, 203, 160, -66, -51, -40, 191, 112, 62, -125, -252, 36, -171, 213, -49, 48, -112, -226, 41, -267, 76, 0, 161, -47, -36, 133, -2, -23, -162, 71, -113, 104, -164, -139, 156, -143, -115, 8, 119, 260, -6, 97, -96, 60, -102, -367, -195, -6, 173, -54, 131, -94, 111, 204, -319, -102, -177, -27, -49, -169, -205, 140, 13, 84, 63, -118, 157, 131, 16, 71, 86, 68, 45, 15, -80, 7, 249, -23]
5527b3P9k13O9J44J33j39k35L5K57p5K65q8k70J28R8j37J2j02RJ04O6j79J16k19
5551a65K31k96K97j79O2q5K78j19j00J59Q2k37OJ29j51J15N0j33K25j64j94J90
5573Anj25r1J82r3l1L33k57J6K09k56J10R3j5op0K3o8J56Rk03J47k9Rk68K61K52
5600B84k61j58N4M5n3M66j36k34j95J10P2j3J45k61K81k09J09J03p3j84P3K1k84
5623b98L67k7j33Q4j83J02J12K0n7R4r2J38q8j19K0mJ1n3J00O8j32m9L01j28r9
5648d5m7k5J13l2J14l5o5j36J70R1q2J22r1O8j86J04J31l34R2O5Pk20J55j50L17
5673A01j68n2J87j43M1j64L82m6j69L5r5P2m0K11j93j43J40K15j03Q8L1k72m1
5696a26P1L08k42nK9j7j00L47k64Ml9K54k00N3K0j67L2QK17q9o6k8k4J9J67l45
$$ y = [-23, 56, -157, -88, 56, 189, 50, -185, -150, 107, 32, 297, 209, -61, 67, 165, 28, 40, -62, -53, 51, 117, -62, 54, -165, 66, -230, 67, -112, -50, -135, 143, 24, -76, 83, 165, -72, -66, 63, -88, 27, 77, -56, 169, 5, -189, 1, -4, -129, -220, -38, -131, -162, 171, -86, -70, 139, -117, -7, 86, 71, 65, -5, 18, -50, 106, 115, -88, 59, 30, 39, -229, 32, 284, 23, -135, -81, -36, -89, 377, 241, 7, -188, -78, -6, -19, 126, -135, 146, -63, 46, 149, 76, -108, -35, -14, -298, 69, 42, -91, -7, -190, -88, 24, 44, -13, 81, -11, 127, 39, -80, -60, -64, -53, -106, -6, 62, -70, -119, 182, 54, -45, -92, -117, -4, -36, 78, 43, -22, -158, 12, 103, 21, 143, 52, 120, -66, 38, 169, -165, -73, -8, -1, -221, -66, -216, 101, -67, -119, 68, -75, -34, -198, 184, 138, -31, 4, -91, -19, -59, 152, -41, -184, -44, 171, 68, 156, 187, -85, -126, -55, 253, 11, 6, 35, 18, -82, 265, 1, 5, -34, 220, 20, 73, 93, -74, -42, -34, 183, 94, 28, 0, -24, -5, 162, -183]
5722a83J37j03Q4L31k48j24J82k28R3J84l68L87l60L61j87o3Q2J04p4j05n1K49
5744A00k02j1l6J76K6m61L69K23K08o00n2N73l12q7q4J45L3r1J84l3l6l8l2PR1
5769F0k44O4J94j93R8K6p4L0j03L32q7k55J00J2Jj0J97j42j53J52J67r0k0j29
5793f7k39M16p3l13M38o5k01J84m4j2q8R5l1k60L41r4J9l3R7J37k63K57r3k83
5817a75P5J97k14j20P3R3R5J04j14l0j44l8K08L1j66K23r3Q7l01J05L9j23J63
5840b5J27j46R0n4K3j33J15K33j89M8j22j32K24L1j94K32k45J94J28j28j55J76
5862I8j80J99j8j75l2K93k51K33m0q1o6K8J14p1k44M10j74J4m2j9k16R6K28m7
5886E7k90K48j0j24P1J13j09J01j86L22j35J0m9J82j13J73j07L9l27j26J29J62
$$ y = [-183, -46, -149, -65, 266, 18, -106, 76, -152, -59, 125, -243, 144, -216, 145, -42, -105, -23, 81, 7, -98, -149, 100, -102, -113, -149, 27, 53, -408, -39, 184, 392, -208, -260, 313, 1, -86, -170, -25, 8, -83, 101, 68, 32, -6, -38, -31, 60, -184, -120, 74, -119, -21, 5, -69, -39, -142, 190, 103, -152, -52, -40, -39, -49, 148, 6, -147, 5, 172, 82, 62, -67, -306, 110, 37, -276, 162, 97, -104, 80, 36, 24, -64, 31, 0, -260, 81, -13, 6, -27, 70, 207, -56, 201, 108, -175, -100, 97, -117, -237, -164, -71, 24, 128, 14, -16, -160, -198, 10, 41, -125, 98, 5, 92, -209, -104, -65, -188, -25, 102, -44, 46, -8, 15, -118, -3, 230, 41, 89, -33, -165, 59, 90, -104, 128, -117, 77, 205, 77, -78, 98, -82, 117, 99, -76, -108, 185, -66, 167, 127, 46, -20, 8, 122, 51, -193, 217, 43, 57, 15, -4, -220, -124, 104, 57, -233, 15, 5, -119, -48, 65, -44, 57, -129, 193, 58, 68, 19, 201, 88, 261, 154, 193, -134, -260, -131, 31]
5908C1j21L4J5j11K02L4M8j81j9J21k5LN0k64K19n9O9k67J58O1k6q3J35j9J06
5933A11K22l22lK37k14J8Q0l7j22J88l76J02J96k29J14l9j72N52l05R0j85K3J2
$$ y = [31, -90, -56, -41, -152, 50, 84, 132, -49, -68, 53, 28, 31, 81, -183, 36, -23, 46, -221, -63, -2, -28, -111, 24, 5, 111, 333, 11, 8, 245, 31, 49, 129, 92, -30, 158, -218, -116, 80, -149, -35, -74, -246, 306, 1, 91, -94, -71, -59]
$$ [...]
8191a51
##END NTUPLES=NMR FID
##END=
